##TITLE=1H_DE-80H_X3
 200.13MHz, d2o
 8 sc
 
 19ns.26.2.2025
##JCAMPDX= 6.0         $$ Bruker NMR JCAMP-DX V2.0
##DATA TYPE= NMR FID
##DATA CLASS= NTUPLES
##ORIGIN= UXNMR, Bruker Analytische Messtechnik GmbH
##OWNER= pz
$$ XWIN-NMR		Version 3.5
$$ Mon Mar 24 10:15:50 2025 Russian Standard Time (UT+4h)  Yarkov@DPX200
##.OBSERVE FREQUENCY= 200.1313
##.OBSERVE NUCLEUS= ^1H
##.DELAY= (6, 6)
##.ACQUISITION MODE= SIMULTANEOUS
##.ACQUISITION SCHEME= undefined
##.AVERAGES= 8
##.DIGITISER RES= 18
##SPECTROMETER/DATA SYSTEM= spect
##.PULSE SEQUENCE= zg30
##.SOLVENT NAME= CDCl3
##.SHIFT REFERENCE= (INTERNAL, CDCl3, 0, 14.3821)
##AUDIT TRAIL= $$ (NUMBER, WHEN, WHO, WHERE, WHAT)
$$ ##TITLE= Audit trail, XWIN-NMR		Version 3.5
$$ ##JCAMPDX= 5.01
$$ ##ORIGIN= Bruker BioSpin GmbH
$$ ##OWNER= Yarkov
$$ C:/Bruker/XWIN-NMR/data/yarkov2/nmr/H-C/1/audita.txt
$$ ##AUDIT TRAIL=  $$ (NUMBER, WHEN, WHO, WHERE, WHAT)
(   1,<2025-03-24 10:14:32.18 +0400>,<Yarkov>,<DPX200>,
      <created by zg, POWCHK disabled, PULCHK disabled
       configuration hash MD5:
       00 E9 B6 7A A2 85 ED C7 34 08 36 98 17 FE 4E 26
       data hash MD5: 16K
       E2 7D 30 1F D4 93 3D BD 89 AC 9B 0D 97 9F 78 31>)
$$ ##END=
$$ 
$$ hash MD5
$$ FB F5 D5 59 F5 20 E3 8C 4B 9A 23 37 78 03 D5 85
##$RELAX= 
##$RELAX= 
##$RELAX= 
##$RELAX= 
##$RELAX= 
##$RELAX= 
$$ Bruker specific parameters
$$ --------------------------
##$DU= <C:/Bruker/XWIN-NMR>
##$EXPNO= 1
##$NAME= <H-C>
##$PROCNO= 1
##$TYPE= <nmr>
##$USER= <yarkov2>
##$AMP= (0..31)
100 100 100 100 100 100 100 100 100 100 100 100 100 100 100 100 100 100 
100 100 100 100 100 100 100 100 100 100 100 100 100 100 
##$AQSEQ= 0
##$AQ_mod= 1
##$AUNM= <au_zg>
##$AUTOPOS= <>
##$BF1= 200.13
##$BF2= 200.13
##$BF3= 200.13
##$BF4= 200.13
##$BF5= 200.13
##$BF6= 200.13
##$BF7= 200.13
##$BF8= 200.13
##$BYTORDA= 1
##$CFDGTYP= 0
##$CFRGTYP= 5
##$CHEMSTR= <none>
##$CNST= (0..31)
1 1 145 1 1 1 1 1 1 1 1 1 1 1 1 1 1 1 1 1 1 1 1 1 1 1 1 1 1 1 1 1 
##$CPDPRG= <>
##$CPDPRG1= <>
##$CPDPRG2= <>
##$CPDPRG3= <>
##$CPDPRG4= <mlev>
##$CPDPRG5= <mlev>
##$CPDPRG6= <mlev>
##$CPDPRG7= <mlev>
##$CPDPRG8= <mlev>
##$CPDPRGB= <>
##$CPDPRGT= <>
##$D= (0..31)
0 0.7 0 0 0 0 0 0 0 0 0 0.03 0 0 0 0 0 0 0 0 0 0 0 0 0 0 0 0 0 0 0 0 
##$DATE= 1742796871
##$DBL= (0..7)
120 120 120 120 120 120 120 120 
##$DBP= (0..7)
150 150 150 150 150 150 150 150 
##$DBP07= 0
##$DBPNAM0= <>
##$DBPNAM1= <>
##$DBPNAM2= <>
##$DBPNAM3= <>
##$DBPNAM4= <>
##$DBPNAM5= <>
##$DBPNAM6= <>
##$DBPNAM7= <>
##$DBPOAL= (0..7)
0.5 0.5 0.5 0.5 0.5 0.5 0.5 0.5 
##$DBPOFFS= (0..7)
0 0 0 0 0 0 0 0 
##$DE= 6
##$DECBNUC= <off>
##$DECIM= 32
##$DECNUC= <off>
##$DECSTAT= 4
##$DIGMOD= 1
##$DIGTYP= 9
##$DL= (0..7)
0 120 120 120 120 120 120 120 
##$DP= (0..7)
150 150 150 150 150 150 150 150 
##$DP07= 0
##$DPNAME0= <>
##$DPNAME1= <>
##$DPNAME2= <>
##$DPNAME3= <>
##$DPNAME4= <>
##$DPNAME5= <>
##$DPNAME6= <>
##$DPNAME7= <>
##$DPOAL= (0..7)
0.5 0.5 0.5 0.5 0.5 0.5 0.5 0.5 
##$DPOFFS= (0..7)
0 0 0 0 0 0 0 0 
##$DQDMODE= 0
##$DR= 18
##$DS= 0
$$ [...]
##$SUBNAM2= <"">
##$SUBNAM3= <"">
##$SUBNAM4= <"">
##$SUBNAM5= <"">
##$SUBNAM6= <"">
##$SUBNAM7= <"">
##$SUBNAM8= <"">
##$SUBNAM9= <"">
##$SW= 18.0517328524113
##$SWIBOX= (0..15)
0 0 2 0 0 0 0 0 0 0 0 0 0 0 0 0 
##$SW_h= 3612.71676300578
##$TD= 16384
##$TD0= 1
##$TE= 0
##$TE2= 300
##$TE3= 300
##$TEG= 300
##$TL= (0..7)
0 120 120 120 120 120 120 120 
##$TP= (0..7)
150 150 150 150 150 150 150 150 
##$TP07= 0
##$TPNAME0= <>
##$TPNAME1= <>
##$TPNAME2= <>
##$TPNAME3= <>
##$TPNAME4= <>
##$TPNAME5= <>
##$TPNAME6= <>
##$TPNAME7= <>
##$TPOAL= (0..7)
0.5 0.5 0.5 0.5 0.5 0.5 0.5 0.5 
##$TPOFFS= (0..7)
0 0 0 0 0 0 0 0 
##$TUNHIN= 0
##$TUNHOUT= 0
##$TUNXOUT= 0
##$USERA1= <user>
##$USERA2= <user>
##$USERA3= <user>
##$USERA4= <user>
##$USERA5= <user>
##$V9= 5
##$VALIST= <valist>
##$VCLIST= <CCCCCCCCCCCCCCC>
##$VD= 0
##$VDLIST= <DDDDDDDDDDDDDDD>
##$VPLIST= <PPPPPPPPPPPPPPP>
##$VTLIST= <TTTTTTTTTTTTTTT>
##$WBST= 1024
##$WBSW= 4
##$XGAIN= (0..3)
0 0 0 0 
##$XL= 0
##$YL= 0
##$YMAX_a= 110685
##$YMIN_a= -164847
##$ZGOPTNS= <>
##$ZL1= 120
##$ZL2= 120
##$ZL3= 120
##$ZL4= 120
##$ABSF1= 10
##$ABSF2= 0
##$ABSG= 5
##$ABSL= 3
##$ALPHA= 0
##$AQORDER= 0
##$ASSFAC= 0
##$ASSFACI= 0
##$ASSFACX= 0
##$ASSWID= 0
##$AUNMP= <proc_1d>
##$AZFE= 0.1
##$AZFW= 0.1
##$BCFW= 1
##$BC_mod= 2
##$BYTORDP= 1
##$COROFFS= 0
##$CY= 83.5205535888672
##$DATMOD= 1
##$DC= 2
##$DFILT= <>
##$DTYPP= 0
##$F1P= 10.8118882576601
##$F2P= -7.23987719738617
##$FCOR= 0.5
##$FTSIZE= 0
##$FT_mod= 4
##$GAMMA= 1
##$GB= 0.15
##$INTBC= 1
##$INTSCL= 1
##$ISEN= 128
##$LB= 0.25
##$LEV0= 0
##$LPBIN= 0
##$MAXI= 10000
##$MC2= 0
##$MEAN= 0
##$ME_mod= 0
##$MI= 1.114404
##$NCOEF= 0
##$NC_proc= 0
##$NLEV= 6
##$NOISF1= 3.799351
##$NOISF2= 2.8
##$NSP= 1
##$NTH_PI= 0
##$NZP= 0
##$OFFSET= 14.38212
##$PC= 1
##$PHC0= -1181.821
##$PHC1= 9.792248
##$PH_mod= 1
##$PKNL= yes
##$PPARMOD= 0
##$PSCAL= 0
##$PSIGN= 0
##$REVERSE= no
##$SF= 200.129724274929
##$SI= 16384
##$SIGF1= 3
##$SIGF2= 2
##$SINO= 400
##$SIOLD= 16384
##$SREGLST= <1H.CDCl3>
##$SSB= 0
##$STSI= 0
##$STSR= 0
##$SW_p= 3205.1282051282
##$SYMM= 0
##$S_DEV= 0
##$TDeff= 0
##$TDoff= 0
##$TI= <>
##$TILT= no
##$TM1= 0
##$TM2= 0
##$TOPLEV= 0
##$USERP1= <user>
##$USERP2= <user>
##$USERP3= <user>
##$USERP4= <user>
##$USERP5= <user>
##$WDW= 1
##$XDIM= 8192
##$YMAX_p= 0
##$YMIN_p= 0
$$ End of Bruker specific parameters
$$ ---------------------------------
##NTUPLES= NMR FID
##VAR_NAME=  TIME,          FID/REAL,        FID/IMAG
##SYMBOL=    X,             R,               I
##VAR_TYPE=  INDEPENDENT,   DEPENDENT,       DEPENDENT
##VAR_FORM=  AFFN,          ASDF,            ASDF
##VAR_DIM=   8192,          8192,            8192
##UNITS=     SECONDS,       ARBITRARY UNITS, ARBITRARY UNITS
##FACTOR=    0.0002768,     1,               1
##FIRST=     0,             0,               0
##LAST=      2.2672688,     0,               0
##MIN=       0,             -164847,         0
##MAX=       2.2672688,     110685,          0
$$ Real data points
##PAGE= N=1
##DATA TABLE= (X++(R..R)), XYDATA
$$ [...]
1665B01r3j09j00o5J55J21m1k55L26j76R1o7q1N7o8J12%k49J1kK12J28K1k52K6
1690i7K62j99L05j77L1p8j78J91p5L43k31l07J84m9M6j45K52j56q3j21L83j81
1712h0J75l5j54O7j50j55J86L19k06j01J04QJ23k49m5K21j31L2J24j82M45L5m19
1735f8J51k5O6k29K47q5j84R4j02K90k87K25k9j64J66j41Q3k8k7K72k91L71l15
1758a0K17k3l15K48j12J01k71J14K27k56J39p2o8L8j09N5J97m7k08J37k6Pj2k0
1782f9Oo9J79j23P0k48J3M20k47M8m3K31k58K01k17LK74j18n2J50j66L30k75j17
1806g7j2J37l3R6k28j69K26N9l1J54K5j12n5J49j40K64k65L24k09j88O8J70o3
1829I0qj31Ok22L94k2o7q0O0k05L54k51O7J60o1J4k53M33m09J11L1n6J22k8j21
$$ plain form
1665 201 108 -1 -101 -166 -11 110 69 -186 140 -36 55 -12 -93 -36 -104 8 8 -241 -230 -232 -20 108 129 -123 -97
1690 -97 165 -34 271 94 125 47 -131 60 -15 328 97 -210 -26 -75 -29 -174 78 -78 -161 -282 101 -80
1712 -80 95 60 -94 -27 -177 -332 -146 173 -33 -134 -30 -22 101 -148 -193 28 -103 -71 53 -129 316 351 -68
1735 -68 83 58 124 -105 142 57 -127 -33 -135 155 -132 93 64 -100 66 -75 8 -20 -47 225 -66 305 -10
1758 -10 207 184 -131 117 5 106 -165 -51 176 -80 59 -13 -81 -43 -152 -97 100 53 -155 -18 -44 -37 -49 -69
1782 -69 -63 -132 47 -76 -6 -254 -241 179 -68 -20 -63 168 -90 111 -106 -103 171 53 1 151 -15 315 40 -77
1806 -77 -89 48 15 111 -117 -286 -60 -1 -32 122 147 35 -20 129 -11 253 -12 312 103 -85 -17 153 90
1829 90 82 -49 -43 -265 129 107 40 -40 20 -185 169 -82 -15 145 84 98 -155 278 -131 -20 11 -45 77 49 -72
1854g2RR8k8j54N3O4R0K1j65J15O8jQ0j11q3K7k8o1J76k48J42p2Q8K2o3j0J2J20
1882H9j25J7j66J94K06j41j54O1Q5j12P0j86R7N8O3j0r1q0J59p8n4j1J95L6K8
1907A50q6J41p3l8L5k05q2J56QK2J45k47N8M7k18K66j01l4K48q9k28J47k24L25
1931A23k66J0Q7J68j42J85j27q8J12j05NJ00M1j16J17Q6k56J44J76l68P8k36K67
1954ek49K12N6Q2q3j82K50k24J58J39j20k07K03M0l66K42o3Q3J29k37P6R0m0q1
1978i7j37K10Kr2J86j32k1M7j43K15Q1r1k8R3k58J53J19P0n5j89K21k4k27J94
2002I7j63K01O8r4j06K51j98N4l14N0J56M9m4P0j02J43o1m0j63Q7K84j92l1M2
2026D4l8P2l6o0R7q4m0J33%J82n28K10J11j32K27j61LJ88o0k02N0Rj67J70J2j68
$$ plain form
1854 -72 -63 35 7 -147 -94 -30 60 81 -84 31 99 98 178 67 -16 11 -17 -78 98 -150 -8 -80 8 30 -33 -43 -31 89
1882 89 -36 -19 -185 9 215 74 -80 -19 66 -46 24 -162 -65 -7 56 46 -45 -125 34 -44 -98 -109 86 122 150
1907 150 64 205 132 94 129 -76 -158 -2 6 28 173 -74 -16 31 -187 79 -22 -56 192 103 -125 22 -202 123
1931 123 -143 -133 -46 122 -20 165 38 -50 62 -43 -38 62 103 -13 104 190 -66 78 254 -114 -36 -272 -5
1954 -5 -254 -42 14 96 13 -169 81 -143 15 154 34 -173 30 70 -296 -54 -117 -34 95 -142 -66 24 -16 -97
1978 -97 -234 -24 -22 -114 72 -60 -81 -34 -177 38 119 28 0 93 -165 -12 107 177 122 -67 154 130 -97 97
2002 97 -66 135 203 109 3 254 56 110 -204 -154 2 51 7 77 -25 118 57 17 -146 -59 225 33 2 44
2026 44 6 78 42 -18 79 -5 -45 88 88 270 -258 -48 63 -69 158 -3 0 188 128 -74 -24 -15 -182 -12 0 -168
2052a68k0O5N3J35j82p5K2O2J19N2%N6J80k91lN8K1K18M2n27O5J88R1j00l7o3
2078c9Q1j92k4M03j34p7j73K08M7l5k2q7N2n2J79k74J75N3k44J30pN6L4k8K9j54
2104i5l9J0N1K89j78m7m5J24j55M4K06j55o2P3K7J81l67K67k35J18q6K8M04l80
2128b2J37j19N8L7l2p2r2J64P7Mp5k21J75N3j65K22k23Q7o2Km2L6J27k54K09o4
2154e5K00q1K7j43K6p6qJ11J9N2N8J6M3k0j83M0J27l10Q4mJ63k55K28j62J66m6
2180A7k54K6N1L60l32K47N5l33P1J74K5k29m5L26m68L57l5jj59K32p0pK0J06K61
2205C95m90J58j48M8n1K2R1L1p6Q5k41J74J2Q9rP8k49l8J73j57J89q1Q9r9J08
2230A03J5j53j33K47l9j60j46K73l7j27L19k66m4J54KL6k14J61J19k71L87k04
$$ plain form
2052 -168 -188 -123 -70 65 -117 -192 -170 -108 11 63 63 119 299 8 5 63 84 302 344 -183 -118 70 161 61 24 -39
2078 -39 42 -150 -174 229 95 18 -155 53 100 65 43 -44 8 -44 135 -139 36 89 -155 -25 -32 24 58 30 59 -95
2104 -95 -134 -124 -73 216 38 -9 -54 70 -85 -41 165 10 -52 21 48 229 -138 129 -106 12 -74 -46 358 -22
2128 -22 115 -4 54 91 59 -13 -105 59 136 140 65 -156 19 72 -93 129 -94 -7 -69 -67 -109 -73 54 -200 9 -55
2154 -55 145 64 91 -52 -26 -102 -110 1 20 72 130 146 189 169 -14 26 153 -157 -73 -77 86 -169 59 -103 63 17
2180 17 -237 -211 -160 200 -132 115 170 -163 -92 82 107 -122 -167 159 -309 48 13 12 -147 85 15 8 28 134 395
2205 395 -95 63 -85 -37 -88 -66 25 56 -20 65 -176 -2 10 99 90 168 -81 -119 54 -103 86 5 94 -5 103
2230 103 118 -35 -168 79 40 -120 -266 7 -30 -157 162 -104 -148 6 8 44 -170 -9 110 -161 226 22
2252B2M8op4mN0j18j3R5J24Mj4k77J21M0j43L58k47J52k53L49q8k23J17k5j66
2277a71K30J65k34n8M5l2J42k42j38k0J33J44m7J2j62L16j90j3J02J77j36L3j67
2300a11K33j72J40J5j84J17m2j24L4K04j08nj64N7J42L6K4K2k40J35k4O8n4J21
2324A20j94J02P0j07L76m58J17r8P8R6R3j46L7k4j8j03k6j10K3J33j05M3R0mp3
2349h8j78N2L03j19j20K02o9L3p4j4J11L8j86J06n6PJ07J3O6l63R9K14j49J6l9
2374h8Q7j22Q3k43M07j77K83k78K06k79J06R6j27N0j19P1J48J9k34J95j31J19
2396G2j66J28k1j1Kj7jj78L9K14ro1L46k38L7k72J30J05o5M5q4J77k14j38O5K1
2422i4K11l88K36J30k47J23k6J34j29n8J49M1k14K40j01j3J74j35oJ91l61J41
$$ plain form
2252 22 70 64 -10 -14 36 -82 -95 0 124 128 114 -163 -42 -2 -145 213 -34 118 -135 214 126 -97 20 -5 -171
2277 -171 59 224 -10 -68 -23 -55 87 -155 -293 -313 -180 -36 -83 -71 -233 83 -107 -120 -18 159 23 56 -111
2300 -111 122 -50 90 105 -79 38 -4 -128 -94 110 2 -3 -167 -110 32 68 92 114 -126 9 -15 53 -1 120
2324 120 -74 28 98 -9 367 -91 26 -72 6 102 195 49 86 62 44 -59 -85 -195 -172 -39 -144 -101 -11 -15 -88
2349 -88 -266 -214 89 -30 -150 52 -17 16 -58 -72 39 77 -109 -3 -59 -52 55 68 134 -229 -130 84 -65 -49 -88
2374 -88 -1 -123 -40 -283 124 -53 230 -48 158 -121 -15 81 -46 4 -115 -44 104 123 -111 84 -47 72
2396 72 -94 34 13 2 4 -13 -14 -192 -153 61 52 -9 337 99 136 -136 -6 99 34 79 -5 172 -42 -180 -115 -94
2422 -94 117 -271 -35 95 -152 -29 -55 79 -50 -108 41 82 -132 108 7 -6 168 33 27 218 -143 -2
2444bj51r7L42j1rq1K4o5N0O9j25j33J50Q9p4J26j77O6K7O9k27J53j26J76j17
2469e4K7j18J35p0J23o8j57L45l31K4K17L8j58J71k40M3J58k15K88l21L0J71r4
2492e6K39j29n0k30J50J06J77l89Q7P1q0L13k75P5J43k45O8K9O7j65J70l43J68
2515i9J93l5j76K23k38J38o0N3O8o9L5j88J55R9N2o7l0j80K04j09J97k99n9L03
2539A11J38l13pL04l49L68l07R2J17r6Q6J6k91p2K21P1N4K7l19Q8J54p6J6j77
2563a44J87j52m4l5M1P1K48k81J6Q8k2q9J28r0n7O7o6r2L13m7L3J06j17j31K12
2588A43R7j89l2r1J45k00O9jK24k40lp0n0L33k77L9K57j12J30j62M5N4l54K42
2612cK2j70J62J11r5R9j80o4p2K17j19J66m5p8M6N4J22j21j15J14K1j54J38Qr0
$$ plain form
2444 -2 -153 -250 92 81 72 -9 15 -50 0 69 -56 -189 -39 50 -24 102 -75 -9 18 87 -140 13 -113 63 -54
2469 -54 -27 -145 -10 -80 43 -25 -182 163 -168 -144 73 111 -47 124 -116 -73 85 -130 158 -163 -133 38 -56
2492 -56 183 54 4 -226 -76 30 207 -182 -95 -24 -104 209 -66 9 152 -93 -25 4 71 -94 76 -267 -99
2515 -99 94 59 -117 106 -132 6 -54 -1 67 -2 33 -155 0 99 151 84 54 -126 78 -31 166 -133 -192 111
2539 111 249 -64 -71 233 -116 252 -55 37 154 58 144 160 -131 -203 18 89 143 170 -149 -61 93 17 33 -144
2563 -144 43 -109 -153 -188 -147 -76 172 -109 -93 -5 -27 -116 12 -78 -135 -68 -134 -226 87 40 73 179 62 -69 143
2588 143 240 51 19 -72 73 -127 -58 -59 165 -75 -78 -148 -198 135 -142 -103 154 42 172 10 55 109 -245 -3
2612 -3 19 -151 11 122 27 126 -54 -118 -190 27 -92 74 29 -49 -3 51 173 52 -63 51 72 -82 56 64 -26
2637b6J85j74K22k21K4j46l3N1J20j88J02K87k48rj21L28j52J13j81r2J65j87
2659a81J32K21l01J08k28J87R3p4J10k64J79Q0K45k63J8o7j38J32j11K72l00J54
2681Dn2N3m7M2j41J15J63j70J98k44R0j03J9J73k89p3L18r4P2l05L89j26m7p3
2705a28L2j00L99k72O5q1J39l24M76j98K2p3l3j35J3J70N7J10k00J09J8j76Q5
2728b5lJ91n0k21J09k1J13N4j96J5m4L8K07mr1k06J06L1j10l7p7K42R0q0l3j31
2754a33J79n5K04j93j07J1K33q8K4l21K92nj05J00q3%o1J95lM9j98L73k22k39
2778a53K51Pm7k88L11j86o2J68p7k29J07K29q1K77j88O7j0j08J81l8k0l4p7J2
2802A2Q0m5L6k7J9K4j10j3K55l02L51m88N7J26k95L98j6m8Ql9L5k9r8K09j80n7
$$ plain form
2637 -26 159 -15 207 -14 10 -136 -169 -118 2 -186 -84 203 -45 -54 -175 153 1 114 -67 -159 6 -181
2659 -181 -49 172 -129 -21 -249 -62 31 -43 67 -197 -18 62 307 44 62 -5 -143 -11 -122 150 -150 4
2681 4 -48 5 -42 0 -141 -26 137 -33 165 -79 11 -92 -73 100 -189 -262 56 -38 34 -271 118 -8 -55 -128
2705 -128 -96 -196 203 -69 -4 -85 54 -270 206 8 30 -43 -76 -211 -198 -28 29 139 -61 48 66 -110 -25
2728 -25 -28 163 113 -108 1 -20 93 147 -49 -34 -78 -40 167 163 72 -134 -28 3 -107 -144 -221 21 111 31 -2 -133
2754 -133 46 -9 195 2 -105 -94 139 51 75 -246 46 41 -64 36 -47 -47 -108 87 84 133 -65 308 86 -153
2778 -153 98 105 58 -230 81 -105 -167 1 -76 -305 -198 31 -50 227 39 106 96 -12 169 131 111 77 0 12
2802 12 92 47 83 56 75 99 -11 -24 231 -71 280 -208 -151 -25 -320 78 62 14 22 -17 18 -11 -109 100 -80 -137
2828a37l7QK29n7j20O5J57o7J66j45j8J4j49R3L49m57l9J09Mj25K40k13P2N4K3
2853A9M6j33p7J58k3J53l0j01p9R6j49j7K22K55k43j17j63L49j87R0j6j12J30
2876G1j35K03J84n07J98m8J53o7o1p5J59K2n4m1j83P8J61M0Q9k31J54k19J67p0
2900a2P2Pj06j26J54R4r7J30k70K60j47J28q7O3J6P2j24j68k1O6L2K74j40O3j84
2925e1pR9J36o0l8o6k09J34J49j35N8j21k63O23k11pJ47l30J08L2l2J17o0Q0k76
2950a83M04l40P0J92j16J4L6j03j30K71k38J55m3O7k55L08K5k60J91p0lJ30k99
2973a77J85R0J95q4k21L56k43k4p7j29R7Q4l3K48q6j83J09n8j69K01p3O6j03L7
2997Ho9J69q4r1O9L8J5j62m0M07j54l1pj22J61j69n8l4J30rj84J49n8K33r5k7
$$ plain form
2828 -137 -174 -166 63 6 -114 -49 108 41 207 62 44 58 -91 2 351 -106 -145 -36 -32 -157 83 -130 -58 -4 19
2853 19 65 -68 -145 13 -10 143 113 12 -67 29 -120 -137 85 340 97 -20 -183 166 -21 69 53 -59 71
2876 71 -64 139 323 -184 14 -34 119 52 -9 -84 75 97 43 2 -181 -103 58 98 187 -44 110 -109 58 -12
2900 -12 60 67 -39 -165 -11 83 -14 116 -154 106 -41 87 0 63 79 151 27 -141 -162 -96 -64 210 70 133 -51
2925 -51 -58 41 177 117 79 13 -196 -62 87 -48 10 -111 -374 249 38 31 178 -152 -44 -12 -44 73 13 93 -183
2950 -183 221 -119 -49 143 27 41 77 -26 -156 115 -123 32 -11 56 -199 109 134 -126 65 -5 -8 122 -177
2973 -177 8 98 293 209 -12 344 101 77 0 -129 -32 52 19 267 181 -2 107 49 -120 81 8 74 -29 8
2997 8 -61 108 24 -67 2 40 55 -107 -147 260 106 75 68 -54 107 -62 -120 -154 -24 -33 -217 -68 -126 107 12 -15
3023a5J72r8k33O7J92j57K7m4p0M9J35K8j26K7J17k3J30k7p3J48k67N7k90J76
3047i8M9R0R9j95K4j58J43J72M0k03o7n8J60q5L76k88Lj73J00L51k24J17j32Q2
3071A25j55L24l20J17r4N7K0j88K92k09J05q4P6j07K01j12j59O2J82j84n1J56
3093E4j44J01ML4J17j18N1k5J40p1j39L03l87J85j88M5N7j84J41J46n0j25k20
3116b73N70j83j15J19j98kJ06q8M8J82n6n2k8r6R7J96k39l3m4J82J09m64L25l17
3140b54M49j30j89L08q8o0%o6O7j29j07K66k07J79L2n1J4P8j00n2J09l4L7j03
3164c1J38NJ3j10O0j05p8M7p1K78l22J79J29k06K30j02J64k62K58k18N6j17K73
3187B08j12J12j71j77J45J31r2K74k87R1O7l67K46o3j48J65j65J31K27k98O3N1
$$ plain form
3023 -15 157 59 -174 -107 85 -72 -45 -89 -159 -110 25 53 -73 -46 71 48 178 151 78 226 -41 16 -274 -98
3047 -98 -49 41 140 -55 -31 -189 -46 126 166 -37 -104 -162 -2 -87 289 1 4 -169 -69 282 58 175 43 125
3071 125 -30 294 -26 91 -3 54 74 -114 178 -31 74 -10 66 -41 160 48 -111 -49 133 -51 -102 54
3093 54 -90 11 15 49 166 48 99 74 214 143 4 307 -80 105 -83 -38 19 -165 -24 122 72 -53 -273
3116 -273 297 114 -1 118 -80 -82 24 -64 -16 166 110 58 30 -66 31 227 -12 -45 -89 93 202 -262 63 -254
3140 -254 195 65 -124 184 96 36 36 -30 37 -92 -199 67 -140 39 71 20 34 112 12 -40 69 35 72 -31
3164 -31 107 112 125 15 75 -30 -108 -61 -132 146 -176 3 132 -74 156 54 218 -44 214 -4 52 -65 208
3187 208 96 208 37 -140 5 136 44 318 31 122 189 -178 68 5 -143 22 -143 -12 215 -83 -20 31
3209C1p6J37q3mJ0k54K14lj59J94Q6j57o6k9J38MM9kM4j12J01o4J63r9j72L96
3235B87k44J43j40J01j15j37J51L4j29l8j39J09K24N0o9oo8J32N0k85O6p1R7J89
3259A92l50K14p5O3j05O6p0J79P6J4j99J56j48m8Qp8M6J70j81N3Q3l71L76k9L0
3284G2k04K4m8L38k25m8m1J87o0N7k01J54J28p7M5q0Q1K9L7j85m5J18J32k21J31
3309I8k80L36r9l1J76L8l54k5R8j4J78k87K12k8J80j42j13qO8l8J66m7R3j77K28
3334B28j90P6qr7j83J28QJ44j63J14n0K0Q2m92L22j62J55P2m5L9k16J98R9k04
3358a25L8J6L04k22J82k99P6K7l7J14n0n9N0P1j90L22m39J10K02lP6j42p3J84
3382A33r0j4P8L5k72K41K0j84O6m7J3k02K02R9j44J13J20l08J22Q6l24L90k41
$$ plain form
3209 31 -45 92 9 5 15 -239 -25 -28 -187 7 93 -64 -130 -159 -21 -17 32 30 74 -38 63 -1 162 63 -109 287
3235 287 43 186 46 147 32 -105 46 80 -49 -87 -226 -117 107 157 88 82 14 146 196 -89 -23 -94 3 192
3259 192 -158 56 -19 44 -61 5 -65 114 190 204 5 161 13 -35 -27 -105 -59 111 -70 -17 66 -305 71 42 72
3284 72 -132 -108 -156 182 -43 -91 -132 55 -5 52 -149 5 133 56 101 21 102 131 168 -17 -62 56 188 -33 98
3309 98 -182 154 55 24 200 238 -116 -141 -43 -57 121 -166 46 18 198 56 -57 -65 3 -35 131 84 177 0 228
3334 228 38 114 106 9 -174 -46 -38 106 -57 57 7 27 109 -383 -61 -223 -68 4 -41 -2 -218 -20 79 -125
3358 -125 -87 -71 233 11 193 -106 -30 -3 -40 74 24 -35 15 86 -104 218 -221 -111 91 88 164 22 -51 133
3382 133 43 29 107 142 -130 111 131 -53 13 -34 -21 -223 -21 78 -66 47 167 -141 -19 67 -257 133 -108
3405a08J49P4j47J39n8l7j75J05J53L4k97K36j79O9P2r4J16r5J5l1P7j05O1J28
3429A02n5k6j62P6N5R4o4j17r2K3p3O6M06l93P2J4J93r6p5j38M20k28l5J79k39
3454i3O3k80M58k70L1J00OJ66j56J63k13M2J31j53n3J51R4j68M7j47j18K18M5
3477F4k49J19L7j9K41q8j40L9O6j7k94J63J00p7n1J81N7p9p8J13K5K4j71j46L37
3502A57j41j30J09N2k3%q6P3m3K7J56o2j59J60J3K9j65J54m9j24j57J93L8p6K4
3527c0p9J59m1J84p4j53LN1rj29M7k0J9J65k94L10j93j06O6J66P4k68L68j14j39
3552c7m7Q5Q2m33M77o9NO7j96K4J32j58n5L29k80K73l20mM58l86N9J0K2J7j26
3577g1K67k94R4j20J50k7j77J17J43j82L3K70j40M1j61O5N6m1lJ77j76k47L82
$$ plain form
3405 -108 41 115 -32 107 49 12 -163 -58 95 129 -168 68 -111 -42 30 -64 52 -43 -28 -59 18 -87 -26 102
3429 102 47 21 -141 -65 -10 84 20 -97 -189 -166 -239 -173 233 -160 -88 -74 119 23 -52 -190 230 2 -33 146 -93
3454 -93 -30 -310 148 -122 -91 9 15 181 25 188 -25 17 148 -5 -58 93 187 19 66 -81 -199 19 64
3477 64 -185 -66 -29 -48 193 105 -35 4 70 53 -241 -78 22 -55 -106 75 132 53 -25 88 113 137 -34 -180 157
3502 157 16 -114 -5 47 24 24 -62 11 -32 -5 151 89 -70 90 103 132 -33 121 72 -52 -209 -16 22 -54 -30
3527 -30 -109 50 9 193 119 -34 -31 20 11 -118 -71 -91 -72 93 -201 109 -84 -190 -124 42 116 -152 216 102 -37
3552 -37 -84 1 83 -350 127 58 63 130 -66 -42 90 -68 -123 206 -74 199 -121 -125 333 -53 6 16 38 55 -71
3577 -71 196 -98 -4 -124 26 -1 -178 -61 82 -100 -67 203 63 104 -57 8 64 23 20 197 21 -226 156
3600A56l9L7j64j76J51j18K37n6K0k4J19j94N7K0k49J48R8P5l38J60J4m7N5K75
3624B17m59K71j78K09j15R6j88M2J1M0r3L3K02j90J91j05N5Q0mj51j2ro7L0J09
3649A5L2k71L47P7o4k06O5K5p0k3J5J1R9k09J85l5j17rkK52M2j48r1L66j26k17
3675e7J23m4J45J28l60M4J74j77l8K96o4j28j03j01N1K36l48O8K38k19J32j98
3697b02J3J32J89j93J87k36L0J67p6L7p6J4N1O6j31R7L9j65j25K99k8R1j53j22
3721i5P1j23K79j27o0O4j20J58J58n1l0J8j43p3J06J88j90j58L50j73j20K37k19
3744e3J72J6J1j70J61j02l9q9q7M09j62N0pp8k8o1O6J99k62J15j94J65P3k03K26
3769A28k80J10J8J8K45k11NJ26o0j35J19j78K82j87j18J93%M0k22j22L09k2J27
$$ plain form
3600 156 117 154 -10 -186 -35 -153 84 28 48 24 143 -51 6 26 -223 -75 23 98 -240 -80 -66 -113 -58 217
3624 217 -242 29 -149 60 -55 41 -147 -105 -94 -54 -147 -114 88 -102 89 -16 39 119 115 -36 -48 -57 -124 -94 15
3649 15 47 -224 123 200 136 -70 -5 20 -50 -73 -58 -47 52 -157 28 -7 -124 -133 -135 117 159 11 -80 286 160 -57
3675 -57 66 22 167 295 -65 -21 153 -24 -62 234 170 42 -61 -162 -111 125 -223 -155 83 -136 -4 -202
3697 -202 -189 -57 132 -61 126 -110 -80 87 11 48 -28 -14 37 103 -28 69 108 -57 -182 117 89 180 27 -95
3721 -95 -24 -147 132 5 -55 9 -111 47 205 154 124 142 -1 -74 32 220 30 -128 222 49 -71 166 -53
3744 -53 119 135 146 -24 137 35 -4 -93 -180 229 67 117 110 32 4 -57 9 208 -54 61 -133 32 105 -98 128
3769 128 -152 -42 -24 -6 239 28 33 159 99 -36 83 -95 187 0 -118 75 75 115 -107 -229 80 58 185
3792A85j66n2L6Q2l2k34R0M8K6J47k67M87m12P9J6L2pjo5Rql1L7j13l3R4K53j88
3820A2M3k84N0L35o3ok42J34n8J68l07LO7J50J1r4J97r7k41L18j45rJ24j42Q8
3845A2l2J00l69K54O8l6r2o9J44L15k89j6j34M0J66o0m1J9j16J7O2J36Qj7j51
3870h1L1J5j32L23j66M8q9J29MJ04k38m8L4J12j5j45J28Q6l67L51Lj20K35j94
3894HP4K7k44nK49k4j4j24O0k25K12n4K12l08M09j60l36K74p3N4j43L69r9k65
3918a26K12l4o1N2k4J65n0j60RK14n8o3m8k84K72j00K01k76K06q9j78K73m3j1
3942ar6N0K00R4j18J6o9q9R3k22L46l60J25n5K1J08KK20j59j14J7J75j48r4j19
3967a77K51j1j62J98j15R4q2r5o2J97r6p5P2l6J10Ro7N5M5M7M1k07k31K68j04
$$ plain form
3792 185 19 -33 3 85 53 -181 -91 -43 -17 130 -137 350 -62 17 33 65 58 57 -8 1 -7 -38 -1 -114 -147 -53 200 12
3820 12 55 -229 -179 156 93 87 -155 -21 -79 89 -218 -215 -148 2 13 -81 116 19 -222 96 -49 -58 66 -76 12
3845 12 -20 80 -289 -35 33 -3 -95 -164 -20 295 6 -10 -144 -104 62 2 -39 -20 -136 -119 -57 79 87 70 -81
3870 -81 -50 -35 -167 156 -10 38 -51 78 82 186 -52 -100 -66 46 31 -114 14 100 -267 84 87 -33 202 8
3894 8 82 109 -135 -140 109 85 71 -53 7 -218 -6 -60 152 -156 253 93 -243 31 -42 12 -131 238 139 -126
3918 -126 86 52 -9 43 19 184 134 -26 -17 197 139 76 28 -256 16 -84 117 -159 47 -42 -220 53 10 -1
3942 -1 -97 -47 153 247 129 145 76 -13 80 -142 204 -156 -31 -86 -65 43 45 265 106 -8 9 184 36 -58 -177
3967 -177 74 63 -99 99 -16 78 -4 -99 -161 36 -60 -135 -63 -99 11 20 -47 8 53 100 141 -66 -297 -29 -133
3992a33L74j92n8R8N1j99J32Qk87K17J07l40K67J90l48k8P6J23n5j23O5J48n8
4015C5j22J40j51J17J20j22k8o9r4J88L1R0j81k9J37j88J07N0O1j86p2j93M46
4038H7j13J9j41j7J61l7K08l12K39j61J14l4j7O3q4Q1k55j01J64J36j19M15k88
4061HO1l4j00K97j81o0j11Q0R6j13p6J64k9n5j80L98r2k66L86l54N0O1N6N0j53
4086i7K45j32k38J19p3K89o9lJ24j12j72K1K56j95KJ5n3J74j12R5k33J73p4N0
4110@Q0Lj74k06K91m6P4j0r6J36r4J5O0J5J02k51J05r4K03m2r6P8J03r5j53J0
4136h2J2k4J86j42J80q0p6Q6j08k7k0K08j02K06j74q7K19j65k55J50O6K05k39
4159f3n1K67Nj5k94J33j61M8J57l3J2q8J94k5l57K77j88L1OK28%n3j67K24j74
$$ plain form
3992 -133 241 49 -9 89 140 -59 73 81 -206 11 118 -222 45 235 -113 -141 -65 58 3 -120 -55 93 35
4015 35 -87 53 -98 19 139 17 -11 -80 -174 14 45 135 -46 -75 62 -126 -19 31 92 -94 -166 -359 87
4038 87 -26 -7 -148 -165 -4 -41 167 -145 94 -67 47 13 -4 59 -25 56 -199 -300 -136 0 -119 296 8
4061 8 69 35 -65 232 51 -9 -120 -40 56 -57 -133 31 2 -53 -233 165 73 -193 193 -161 -111 -50 6 56 -97
4086 -97 148 16 -222 -103 -176 113 44 41 165 53 -119 -98 158 -37 -35 -20 -73 101 -11 84 -149 24 -50 0
4110 0 80 83 -91 -297 -6 -52 22 12 -84 52 -42 -27 33 48 150 -101 4 -90 113 71 -25 53 156 61 -92 -82
4136 -82 -70 -94 92 -50 130 50 -26 60 -48 -75 -95 113 11 217 43 -44 175 10 -245 -95 -29 176 -63
4159 -63 -114 153 158 143 -151 -18 -179 -131 26 -7 5 -83 111 86 -271 6 -182 -151 -145 83 83 30 -137 87 -87
4184h7j47J37R3r4K4K13j10l7N3p2K4KQ7j55J41m5R3mk24J83J5P6j73L7k2J03
4210A11j80R3M2r1N7j99J40k8N2Q5l3j91K60L1j6q7j58J23L0K8p8m2QO7m1K18
4236B01k29j01K93J7p7l22R8J90k02J44j48K40j80Q1n4M7K38k97n5J66O3j98J38
4259E3Rj95o4O7J97M7l7m8q8J99k24P8k8l6j00K21o6q2J24j1K05j27Q0j35J54
4284A93l4k99K98k60L3J14P1l8j16K0j00r5L13nn2L1k52N3R7M3J37J64l88J41
4308F9m3P7k78L0J15J26k31N5K45k23P6p0J51j54Q6j10n0J87j69J89k44P8J26
4331C8K47k05k8pk09J58m1L2K9o9k10L45k33J32pm5R9J47r2p9M0k32k8K22L5k25
4357a86J62j4p1M7J11q6o0J88j09j13l5P7M6K11q5k43J83n4J11j84K50q7k24o8
$$ plain form
4184 -87 -234 -97 -4 -98 -74 139 29 -8 45 -27 -3 -1 86 -69 72 27 120 116 -108 75 90 166 -7 30 8 111
4210 111 -69 24 66 -25 32 -167 -27 -55 -3 82 49 -142 118 149 133 46 -112 11 41 69 -9 -51 -43 24 -17 201
4236 201 -28 -129 164 181 104 -218 -120 70 -132 12 -136 104 -76 5 -49 -2 236 -61 -116 50 113 -85 53
4259 53 62 -133 -197 -130 67 114 77 29 -59 140 -84 -6 -34 -70 -170 51 -15 -97 27 16 221 94 174 39 193
4284 193 159 -140 158 -102 -69 45 116 78 -38 -18 -118 -213 100 95 43 74 -178 -125 -28 15 152 316 -72 69
4308 69 26 103 -175 -145 -30 96 -135 -80 165 -58 18 -52 99 -55 31 -79 -129 58 -111 78 -166 -88 38
4331 38 285 80 52 45 -164 -6 -47 -15 14 -55 -265 80 -153 -21 -28 -73 26 173 81 2 42 -190 -218 4 39 -186
4357 -186 -24 -38 -109 -62 49 -37 -97 91 -18 -131 -166 -89 -43 168 83 -160 23 -31 80 -104 146 59 -165 -233
4381b33J20K62l22Q0J67J4J25n4kj63J12O6j34lk2Jn4J59K2K1j96K13k0j65O3
4406E7o8j88J06N7q5J60L0r9J77j02o1JR0j28r5K15o9k30K40q6r4JJL60N1k81
4432d0Q7m6k36K07pJ3j00J39j02J90J54k86R2j14J44j7j23p4P5J50j47k92M84
4455A51J7k30l3K18M9j00Mj53J02O4q6J65j60l5K4k19K90q8n9L0J29j09N2l2P8
4480F9j43J00J53l09L73j93J9k20N8L20J09l38j35R1K93k72q8O0j15K86q6j03
4502g1J45l48K16K29j37k9J0Q6k09J73m1O7j07k9Q3Qr2O4r8K11j63j9K0j20K44
4527I3M3m08J78j10K58j32J36r5Q0j24J08k6J86J8k26j10J97q7j36L53j47K3r2
4550b0po4L3J7R9k4m9q0J58L22k92Q6j75K3O9j91J74k16lO3J87j41Lo3J73j5N5
$$ plain form
4381 -233 -113 149 -173 -93 74 88 213 159 157 -6 106 172 38 35 13 14 -40 119 141 162 -34 179 159 -6 57
4406 57 -11 -199 -93 -36 -121 39 69 -30 147 45 -16 -15 75 -53 -148 67 -2 -232 8 -78 -172 -171 -170 190 241 -40
4432 -40 47 1 -235 -28 -35 -22 -122 17 -85 105 259 -27 65 -49 95 78 -45 -119 -44 106 -41 -333 151
4455 151 168 -62 -95 123 172 72 76 -77 25 89 3 168 8 -27 -3 -222 68 -20 -79 -49 80 -29 23 -9 69
4480 69 -74 26 179 -130 243 50 69 -151 -93 227 336 -2 -137 -46 247 -25 -113 -53 -168 118 32 -71
4502 -71 74 -274 -58 171 34 5 15 101 -108 65 24 91 -16 -45 38 46 -46 18 -80 131 -32 -51 -31 -151 93
4527 93 136 -272 -94 -204 54 -78 58 -37 43 -81 27 1 187 205 -21 -131 66 -21 -157 196 49 72 -20
4550 -20 -27 -91 -58 -41 58 34 -15 -95 63 385 93 179 4 27 96 -95 79 -137 -140 -77 110 -31 -28 -91 82 67 122
4577A22r6K27j63j2J77j82j12R3mJ72k90j04J5K64j73n3J46L3j17o1L61k73J13
4600H3p9j3K16O8k12j51K75l25K50l42M59k35K7p4K26k88k39N64j44M8R8k59l0
4623g7J33k4L7r9P3j79J89j0j21m7J51j43j52K67j68J53N5j00R2J56m6k61J28
4646Gj51J46l0J24l7j37J44J3j65p9J26QQ5l5l3p7J07P2L9k05J97j51J37L2K4
4671A61k76l7R8R1r3K06J8j44K9J1N5j66j29K18l8j6L5J9L2J04j90J71l92K41
4695Hnm3J5j1J80n7j04P3k79N8L42j36J55k01j14J13k7K2N7r7L04k16K4K8q8R0
4721I1j34p2K35j45J74k91J41o6j72L25k17K89nr5O6k84K31j0q5K29k70Q0j5R7
4745I7j23j09J59r1j25K03P5l85K64R1J4p9j42L12J9k39J5J48j27K34l87kJ95
$$ plain form
4577 122 26 253 90 78 255 73 -39 54 50 222 -68 -172 -157 107 -66 -119 27 60 -57 -118 243 -30 83
4600 83 4 -9 207 275 63 -88 187 -138 112 -230 229 -6 21 -53 173 -115 -354 210 66 114 212 -47 -77
4623 -77 56 32 69 -30 43 -136 53 43 -78 -125 26 -117 -269 -2 -170 -17 38 -62 30 186 140 -121 7
4646 7 -144 2 -28 96 59 -78 66 79 -86 -165 -39 -31 54 19 -14 -91 16 88 127 -78 119 -32 105 137 161
4671 161 -115 -152 -54 37 -56 150 168 24 53 64 119 -47 -176 42 4 -12 23 42 74 178 -12 159 -233 8
4695 8 3 -40 -25 -36 144 87 -17 56 -223 -165 177 41 196 -5 -119 -6 -33 -11 46 -51 253 37 61 89 1 91
4721 91 -43 -115 120 -25 149 -142 -1 -67 -239 86 -131 158 153 58 124 -160 71 61 -24 205 -65 15 0 97
4745 97 -26 -135 24 -67 -192 11 86 -299 -35 56 70 -9 -151 161 180 -59 -44 104 -23 211 -176 -178 17
4768A7J07n0j12N3k0o9K4K54k25j96J47K35k7j5l95L49l79L49K6k74O4J62m5J00
4792H0K7j16n4J62p3J7j57P1J53j79j5%J56j90K06j69n4K65r6q2J84j86Q2j94
4816a62J75j01%m2j03L59k31P3N0n1J65o9jq4j00J22OPK13k62J53j43M0J12j54
4841b8J86j16o4lj50J62J02k2j94K3J25q6j74L40j84J77k75M5L06l27J72j10J47
4864E2n5m9n7K0o1L40j44J55r5j16p6R8j01K05j04p6J14M9J7j8J15l05P3P3j37
4889h3J59Ml7j99K56p9j66J80k0p5L33j79p7N3j9p4j24K01j90J93kj43J73l07
4913b22Q4M1J4K5K23k13k62K40K04l9K22k35k03K10l12L39O0j13l4L5l33L17K24
4936B72k41Q6P2k01Q3J27j84j23k0K02l3j33R2K2q7N7J09l51J32L9MJ54q4j60
$$ plain form
4768 17 124 74 -38 15 -5 -74 -50 204 -21 -217 -70 165 138 123 -272 77 -302 47 73 -201 -137 25 -20 80
4792 80 107 -9 -63 99 26 43 -114 -43 110 -69 -84 -84 72 -118 88 -81 -135 130 34 -48 136 -50 32 -162
4816 -162 13 -88 -88 -130 -233 126 -105 -32 18 -33 132 63 62 -22 -122 0 6 13 226 -36 117 -26 14 126 -28
4841 -28 158 42 -22 -25 -175 -13 89 67 -127 -104 21 -65 -239 101 -83 94 -181 -136 170 -157 15 -95 52
4864 52 -3 -52 -109 -89 -150 190 46 201 106 -10 -86 12 -89 116 12 -64 50 99 116 98 213 -92 -19 54 -83
4889 -83 76 80 43 -156 100 21 -145 35 15 -60 273 94 17 70 51 -23 -147 54 -136 57 55 -88 85 -222
4913 -222 -138 -97 -83 -58 165 -48 -310 -70 134 95 317 82 -121 89 -223 116 176 63 29 64 -269 48 272
4936 272 31 117 189 -12 71 198 14 -109 -129 73 40 -93 -1 21 -66 -9 100 -251 -119 -80 -76 78 -6 -166
4960a66J45P2jKM4j85J2o3L03j13j09j56J29N6P1QK7o6J01O0j83j65K39j07K3
4985b2M4J8M9o5J22l50J98q1m2J07j76j08L16j30N9R9k84K43K8q3OQ4J09q2p0
5010a1j29K00nq9J06R0j27j38J06j48k3K82k29j31K29O2q5J21j39j64J61K25k8
5033A36j96o1Q6j0R9O2j22J66m09K37n9J3l3L32l20K39q5J83j84j92Q0j6O4k08
5057a98K28j42J89p7J12k52L5K68l50J21J75r0Q4r7j01MJ83rl14K15j7R7o0N4
5081E8j57K43j57N6n8k06M52j13r6R5l0k41K56j27J64m51L96j85K20Mj24K9k43
5104b15L73k72M53k91k01L82j92j91K78M4j92k2K28j04k08K13k03J8k6L43j31
5125H4n2p8P6j44L28o3j83K15l0k70p9J48j04J38N7N0j50q6K46Nk08L4m8K92m29
$$ plain form
4960 -166 -21 51 50 52 96 -89 -77 -140 163 50 -59 -215 -86 -30 41 49 76 10 111 171 -12 -177 62 -45 -22
4985 -22 22 40 89 24 146 -204 -6 -87 -129 -22 -198 -306 10 -120 -61 38 -246 -3 25 -58 -52 32 141 59 -11
5010 -11 -140 60 55 -34 72 162 35 -103 3 -145 -168 114 -115 -246 -17 45 -40 81 -58 -222 -61 164 136
5033 136 -60 -121 -35 -45 54 116 -6 160 -249 -12 -71 -58 -91 241 -79 160 75 258 74 -118 -38 -54 10 -198
5057 -198 30 -112 77 0 112 -140 -105 163 -187 -66 109 19 103 6 -95 -91 92 83 -231 -16 -33 64 4 58
5081 58 -99 144 -13 43 -15 -221 231 118 22 117 87 -154 102 -25 139 -312 84 -101 119 123 -1 28 -215
5104 -215 158 -114 339 48 -153 229 37 -154 124 168 -24 -46 182 78 -130 83 -120 -102 -128 215 84
5125 84 32 -46 30 -114 214 151 -32 183 153 -117 -196 -48 -152 -14 43 93 -57 -143 103 108 -100 -66 -114 178 -251
5150b51K88j01P3pJ6j40P9K0K09k34j12J67JJ19L3l01R2O1P8j80L27k16k15J30
5174f4J06j03J65k96K06j52J28LN6k6N4J55j37j20K4J94j0j77j41K02j6K0j90
5197a19O3j35L00j87J08J53k53J87j05P3k01J23J12k56J69r9P3N3j37J92Q0j97
5219cJ10k6j53J63j94l4J32J81k03K9L3K22l90R6Qj7K43k38K15j63j11O5j1m1
5243h7j19K27j60j34L16j29L21k78J60j77k1K32p1oj9R1l92L60j51o0M3rJ11R2
5267A40L8k06J7O8l69M54j8L7O8j30q7O9n6kO9k9K54k94O6l54K55%j49J21J09
5292G1J71q5j2r3j12N2J00l59J16P8l5J41m6j54L1K84j92M9J81l51J43M8j62K22
5316H6j64l2J01k4R3j79J09p3K10M5k92M8j59J90J16k36R2P1K24k59J30j03PP1
$$ plain form
5150 -251 37 -64 9 2 18 -122 -43 -23 186 -48 -160 7 8 127 160 -141 -49 12 90 -90 237 21 -194 -64
5174 -64 42 -61 104 -192 14 -138 -10 -7 49 23 77 232 95 -25 -1 193 183 6 -135 67 51 71 -119
5197 -119 -56 -191 109 -78 30 183 -70 117 12 85 -116 7 119 -137 32 -67 6 59 -78 114 194 -3
5219 -3 107 81 -72 91 -103 -137 -5 176 -27 2 35 257 -133 -37 -29 -46 197 -41 174 11 -100 -35 -46 -87
5243 -87 -206 21 -139 -273 43 -86 235 -43 117 -60 -81 151 80 74 55 146 -246 114 -37 -97 -54 -63 48 140
5267 140 178 -28 -11 57 -312 142 124 161 229 99 12 81 25 23 92 63 317 23 89 -265 -10 -10 -159 -38 71
5292 71 242 157 145 52 -60 -8 92 -267 -151 -73 -108 33 -13 -167 -136 148 -44 5 186 -165 -22 26 -136 86
5316 86 -78 -110 -9 -33 60 -119 -10 -83 127 172 -120 -72 -231 -41 75 -161 -69 2 226 -33 97 -6 1 72
5340G2M1j71jK48j61n0J84k19m6K56j14j28Q3R8q2J81k74O0j07K44j58K3%K36
5364B15k88j6m3K96k50J40L3J26m40J57J71j70K23k00k2J32j07K23j90j6K09j04
5386G9o7j36J83j74K60l22L32k52J27l1l0J00r7p9R7O9k11K29k17J91P6M3k64
5409i4K53j18j69K19k15L37k38Lk2P4j12r5j8K18j7q6J5J2J01L4K0O2j00k40K00
5434B4j32R9J1O8j23P9M4r0J44j58k24P6L38j87JM2r3K00j88J82k25J53k7j35
5458a21K2J94l1j54J14p1k0J42J55k93M2M28l50k30P4J15J3K18j37j44k33J47
5480a20K05n2j70Q1o3K9J17O5j59L89k80L0j81j62K78J6Q1q2m1K1k9O8q9q9L40
5505B03j00m6J42k74J45k6k35J12mJ29j64r6M1J29O5o9J17J16j01P8l52L28k02
$$ plain form
5340 72 113 -58 -59 189 28 -22 162 -57 -103 153 39 -89 -6 92 10 191 -83 -23 -130 114 -44 -21 -21 215
5364 215 -73 -89 -132 164 -86 54 87 213 -227 -70 101 -69 154 -46 -68 64 -43 180 -10 -26 183 79
5386 79 12 -124 59 -115 145 -177 155 -97 30 -1 -31 69 -28 -107 -10 59 -152 77 -140 51 127 170 -94
5409 -94 159 41 -128 91 -124 213 -25 -22 -44 30 -82 -177 -195 23 6 -80 -65 -53 48 82 102 164 64 -176 24
5434 24 -108 -9 2 70 -53 26 70 -20 124 -34 -258 -182 156 -31 -30 12 -81 119 -69 113 -112 41 14 -121
5458 -121 -99 95 64 -90 24 -47 -67 75 230 -63 -21 407 57 -173 -99 16 29 247 110 -34 -267 -120
5480 -120 85 33 -137 -56 -119 -90 27 92 -67 322 42 72 -109 -271 7 23 104 22 -19 2 -27 41 -48 -137 203
5505 203 103 57 199 -75 70 44 -191 -79 -83 46 -118 -214 -173 -44 21 -48 69 185 84 162 -190 138 -64
5528f4K8R8j33LO0l4J6n0J19j98K15P8q5q2k01K85Q0j13J87qo1j4k69J71q5J04
5554D7J33n8j49K5J19j86j7L33k12j64J12O3j47L14k09J23N6m6j4j89Qj32J44
5577d6k68K87J60o6l7j8%l5p2q0J60M4o6M05l90K11k47K20k57K12J31j33N0qq0
5602G7k00J40p8J30r8K21l61J04J46lj89rK43k62o7P4p3L44j16ln0p8L31m25J74
5627b8o3J14L4r3R9nj04R9j53P0l4j66K75R8r2J74j07j9n4p2N5j04p0K03J07j31
5653C3n2P7j97M8K4M8J09l5J53j64j4k27o9L30j66K02k26k02M40k4k8k21J86J76
5677B01j48m4o8P0k07J84p6j63P0M47k39r4J50j29k04J66R9k7O3J03O2l48p0K81
5701G9K1Rj33J17l5m5J79k99J22j3J25o0j20J61k21J40j2K69k53l2r9L0J13j1
$$ plain form
5528 -64 -36 62 -71 -68 -8 -42 -26 -76 43 -155 60 138 53 -29 -230 55 135 22 209 201 140 126 -143 28 -57 47
5554 47 180 122 -27 -2 117 -69 -86 247 35 -129 -17 46 -101 213 4 127 183 137 123 -66 -58 -190 -46
5577 -46 -314 -27 133 67 30 12 12 -23 -95 -175 -15 29 -37 368 -22 189 -58 162 -95 117 248 115 165 157 77
5602 77 -123 17 -61 69 -29 192 -169 -65 81 78 -111 -120 123 -139 -206 -132 -205 139 23 20 -30 -108 223 -202 -28
5627 -28 -91 23 57 -36 63 58 -46 53 -100 -30 -64 -230 45 143 51 225 118 99 45 -27 28 -76 -146 57 164 33
5653 33 -19 58 -139 -91 -67 -19 90 55 208 44 30 -197 -266 64 -102 100 -126 -328 112 88 60 -161 25 201
5677 201 53 9 -59 11 -196 -12 -88 -251 -181 266 27 -67 83 -46 -250 -84 15 -12 51 154 216 -132 -202 79
5701 79 100 109 -24 93 58 13 192 -107 15 2 127 67 -53 108 -113 27 15 284 31 -1 -100 -70 43 32
5725C2j82K42j7K9q1j15K05l9O1k01R3NOk26M76l76J87p2R7Mm6L7j56L6j43J42
5751bL2J15j46K51l69M3J10j8l47K63K24j00j56K79j29N8l1K57l14j23O9J43L8
5774A47k57o3P9L9N1N2q7k91J03L71j98Lk00L24r0j23K03J0j74J12j8lJ89j05
5798G4q7R3j98K29j01mM9J60l54J74j08K14q7m9K2l0J12k38J79k6J03k31Q2k24
5822b46M98l84pQQ9j29J90J5o9P4j08L4J14j67N7J7J15l45K35M7L7J35k29R4o5
5847A0P1R0j19k15R1P1J39j05r0j11K76R4k76r8K16J16k36J28J1N3j11j0pR0j81
5872a03J67P1j21N9p6p1O6k0p5M25l20j84L15k11K8k22L21q8J29j92J50k5p9R4
5896C8k33K61k3j50M1K32k21K48l74L79k95J12k6K00p2l24RL49j43n8j6k8j04
$$ plain form
5725 32 -150 92 75 104 23 -92 113 74 135 -66 27 32 38 -188 288 -88 99 27 124 128 82 119 -37 -1 -144 -2
5751 -2 30 145 -1 250 -119 -76 34 16 -331 -68 156 56 -100 179 50 108 77 334 20 -103 -34 109 147
5774 147 -110 -173 -94 -55 -4 48 -39 -330 -227 144 -54 -51 -251 73 -17 -140 63 73 -101 11 -7 -10 179 74
5798 74 -13 80 -118 111 10 6 55 215 -139 35 -73 141 54 5 27 -3 109 -129 50 24 127 -104 -22 -246
5822 -246 252 -132 -139 -131 -42 -171 19 34 -35 39 -69 -35 79 -88 -31 -14 101 -244 -9 38 75 210 -19 75 10
5847 10 81 171 52 -163 -72 -1 138 33 -57 -168 108 202 -74 -172 44 160 -76 52 63 116 5 -5 -12 78 -103
5872 -103 64 135 14 73 -3 -74 -8 -28 -103 322 2 -182 133 -78 -50 -272 49 -39 90 -102 48 23 -56 38
5896 38 -195 66 43 -107 -66 166 -55 193 -181 198 -97 15 -11 189 117 -207 -198 151 8 -50 -66 -94 -198
5919a98Q7J6K51l59K26o6K4l2J27J44j87o4j45K22j14J30j44J32k03J86r5J8Q5
5942D1p7n2L5n3K02j83j20R1m9K20j41N1l0K12m2j67J62j99J29r0J26o5mk1m6
5967g0J05j87J08J21j65J85j1k01J30q3K71l9o5k46K26q6K2j7r5m5L1l8K79m20
5991b90L64j39J51n4o0l0mJ30j32J75Nj33K16q3j51J40k36kJ47%R8k62K55k32
6015a27J32po9K0N8j19K45k00J06L4r6J7j50L74j15J2k54l9L1J57Q7j04n2p7L95
6040B59j08k32j22Q2K19l7k36J37K31j47Q8N3k47K11m3P6l6j53o1J60k01k10L15
6063bJ56l75J00M2M0J22j1M3o8j05J47l1j22J9K5O2q5m5J86j18N8K5j26p5k1R4
6089f5J20j91J31j62o4L32j60J23J28r9m3j36P0j19K21j22P2j1k07K41q4J35k61
$$ plain form
5919 -198 -111 -95 156 -203 23 -43 -19 -51 76 220 33 -31 -176 46 -68 62 -82 50 -153 33 -62 -44 41
5942 41 -36 -88 -53 -106 96 -87 -207 -116 -165 55 -86 -35 -65 147 105 -62 100 -99 30 -60 66 1 -3 -24 -70
5967 -70 35 -152 -44 77 -88 97 86 -115 15 -68 203 164 99 -147 79 -7 15 -2 -97 -142 -111 -149 130 -290
5991 -290 74 -65 86 32 -28 -58 -62 68 -64 111 116 -17 199 116 -35 105 -131 -133 14 14 112 -150 105 -127
6015 -127 5 -2 -71 -51 7 -112 133 -67 39 73 -23 -6 -156 218 103 115 -139 -178 -147 10 97 -7 -59 -136 259
6040 259 151 -81 -203 -121 98 61 -175 -38 193 46 134 187 -60 151 108 184 148 -5 -66 94 -107 -317 -2
6063 -2 154 -221 -121 -79 -39 83 72 115 47 -58 89 58 -64 -45 -20 42 -43 -88 98 -20 38 63 -63 -138 -159 -65
6089 -65 55 -136 -5 -167 -231 101 -59 64 192 93 50 -86 -16 -135 86 -36 36 25 -182 59 -25 110 -151
6112a51J64Q2k74J85o1j9R9j43p8J12J41j09n4J49n5m5k09R4J30JJ06m2lj73M6
6137a07J37o3ORN9P1l50K53k28Q0L20k84L2p2J56K0J98j29L8k00R0j15P4J10q4
6162B1j0j7k32J48kK59j70J34k02j06P3m2R7K01rL7j45j76J11J05R8k34J57R6
6186A92l13K13L1j09k05K71j49L3m8M9O2J8j30J75j30j75K74j7j29k02K22J12
6208D5k3j50L78l89N0J43j42M8L8L00m01O3J58l38L55r0j74j00L11j57O9K5P5
6231I4j52K15k02j5k07K39J31n0J06k46O4J69q8L1j10j34K64k56K88l04Q1Q6k22
6254b18L25q3K6q0m6J3p3J72k57J96J9j79K13J48m66L15P3n4k6L4j74k9Q8N1j82
6279a94L03m1Q6q7l4j74M1J67k23J97J41j76j1J87k12K7L5O0l4m0j51K85q1k7
$$ plain form
6112 -151 13 95 -179 6 -55 -74 25 -118 -196 -84 57 -52 -106 43 -12 -57 -266 -172 -42 -41 65 23 20 -153 -107
6137 -107 30 -33 -27 -18 41 112 -238 15 -213 -133 187 -97 -65 -137 19 39 237 108 146 -54 36 -79 -5 105 21
6162 21 11 -6 -238 -90 -92 167 -3 131 -71 -177 -104 -146 -49 152 143 180 35 -141 -30 75 173 -61 96 192
6186 192 -121 92 123 14 -191 80 -69 -36 -84 -35 27 45 -85 90 -40 -215 59 42 -87 -289 -67 45
6208 45 22 -128 250 -139 -89 54 -88 -40 -2 298 -103 -40 118 -220 135 45 -129 -229 82 -75 -6 19 94
6231 94 -58 157 -45 -60 -267 -28 103 53 159 -87 -23 146 58 89 -21 -155 109 -147 141 -163 -82 4 -218
6254 -218 107 24 50 -30 -76 -63 -136 36 -221 -25 -6 -185 28 176 -290 25 98 44 18 52 -122 -151 -63 -12 -194
6279 -194 109 68 154 67 33 -141 -100 67 -156 41 182 6 -5 182 -30 -3 32 92 58 18 -133 152 71 44
6303D4k21J81l8K12k22K6o6J22M7j84n9J08k7J42o5j5N1oj88J36QJ85l31P2J15
6328B7J31q3j49KK0N5l2O7j06k5R0K39m9l00J8P0N5p0J57K4r1j47ln9J30j77K32
6355B6J08l66M33k39j85O6M64j31p8j70O0p8P2J63j36J93m27K70j01J27k01j03
6377b33K72OO7m9R4k50Q8K54k95J08k05J47rk0J58j51R2j74J17j79J01K68j24
6400H3j41M7J69m4q5J15l05K6L30j93j03K22j06j60K71k28k9J53j35K6J13O1j1
6423G6m9K9l3p4j22K93k86P2K19k29j15J62K1P4p1M2J26m8k12J07P9j54K32n6
6447H3k75Q4q6K48P9k56n7J03J89j05K84l19Om8J64k4k10L2R7Q4L9q7n6NJ32k18
6473a12J4K04L7k67M1K0j13L98p4Ql88J35K29k54M2Q8j0O7j06J51k11j83K3L73
$$ plain form
6303 44 -177 4 -34 178 -44 -18 -84 38 85 -99 -158 -50 -77 65 0 -15 36 30 -158 -22 -14 171 -160 -88 27
6328 27 158 75 -74 -72 -52 3 -29 38 -68 -93 -3 236 187 -113 -95 -25 30 -40 117 141 50 -97 -100 -159 -29 -206 26
6355 26 134 -232 201 -38 -223 -157 307 176 98 -72 -12 -90 -18 145 9 202 -225 45 -56 71 -130 -233
6377 -233 39 45 112 63 157 -93 -5 249 -46 62 -143 4 -5 -25 133 -18 74 -100 17 -162 -61 207 83
6400 83 -58 -11 158 114 29 144 -161 -135 195 2 -101 121 15 -145 126 -102 -131 22 -113 -87 26 87 76
6423 76 27 56 23 -51 -173 120 -166 -94 125 -104 -219 -57 -36 38 -33 9 135 87 -125 -18 61 -93 139 83
6447 83 -192 -108 -194 54 133 -123 -180 -77 112 7 291 -28 -22 -70 94 70 -140 -108 -11 73 112 25 -31 -26 106 -112
6473 -112 -98 106 143 -124 -83 -63 -176 222 148 156 -232 -97 132 -122 -80 8 -2 65 -41 110 -101 -284 -261 112
6497A12j39l7L6p0L7k8K3J26m6j11K32k24J3K31Jj51K36l50j14J66M2J99l36K11
6521E9L9j47P3m8J3j60O9rk1Q4J34j04L05m48N6M4r1K58j64k88L52o7L3j36oL15
6547A45Pp1J6N5J75m59K15m4J0k35K65Lk51L64k12J53Q1j47Q6J4j85p6J74k15
6571a32K05j50j19J95M5mj94K28j21m2oJ08L9j48j8J73j84P5J36j54J53j2q4q8
6595i9j12M45l02L6K16j11j4J99l88K31q4n1P3k37Q1L1P4N5j4Jp7Q6l9r2K66k16
6621d2N7J00%j1l5p3Nr1Q4K04N9j03k71L98k58J4J74j37k7k7n0K8k9O1r8L6m7
6648g9L12n7j93K3J33l55K75N6j35K7rM9j41l6J76jR1k32N4L6r2j20M2J50N1j73
6674a48L25r8j71k3m6O0J2J11rKQ8l9j60K50j44ppJ12M9r4R8j77J0R5k14K84k23
$$ plain form
6497 112 -27 -64 -28 -98 -61 -89 -66 60 14 -97 135 -89 -76 155 156 5 241 -109 -223 -57 -15 184 -152 59
6521 59 98 -49 24 -24 -11 -171 -102 -111 -132 -48 86 -18 287 -161 -105 -61 -152 106 -58 -346 6 -61 -28 -164 -170 145
6547 145 152 81 97 152 327 -132 83 39 49 -186 79 82 -169 195 -17 136 217 70 156 170 -15 -91 83 -132
6571 -132 73 -77 -196 -1 44 40 -154 74 -47 -89 -95 13 52 -96 -114 59 -125 -50 86 -68 85 73 -11 -99
6595 -99 -211 234 -68 -32 184 73 59 258 -130 101 17 -34 39 -198 -117 -86 -12 43 29 30 -47 39 0 -92 174 -42
6621 -42 15 115 115 104 69 -4 1 -90 -6 198 257 154 -117 281 23 37 211 74 47 20 -30 -2 -31 30 -68 -32 -79
6648 -79 233 176 -17 6 139 -216 59 115 -20 7 -2 47 -94 -130 46 45 136 -96 -42 -6 -98 -218 -176 -26 25 -148
6674 -148 177 79 -92 -115 -161 -101 -89 22 13 15 103 64 -96 154 10 3 -4 108 157 63 161 -16 -6 89 -125 159 -64
6701f4J40K7k07L69j79M7l62L06j11K06k09j7J25k8o1l6nN3N1q8k25K87l4j82
6725a97Q7r2L71k51R1N1N7j11j96K96q0N1j70K7J02L1l4j41K38P7j08j19P7O3
6749A20l33M59j94j97K84J10l41K16o6R6j26j10J11J50k54j9K74j28k43J4j6R4
6771i9K05K0l50K47M3j17j3rJ92k0j59j84J73L2K02k16Q8N8k68J82K7J14p8J95
6795B65n66L04N1k1oO0k91K93r4m7K39l22J3O3j13K16j21l1J85m5q4L7J51K0l32
6820a76K84l2k62L87l9j75j6J70j51Q1p3j22K39k32o1K13j04R0j83R0q5Q7N5K23
6844B08k69J02l9r8J57q4O7n2m8R3J32k03K1O4j35J36J03P0l06J79j63N2j18J62
6868C1k51M9K25k2J15j42J6m1J3J10k7p2K8j42L32k54n5J39j61J08M2K9j79K77
$$ plain form
6701 -64 76 103 -104 265 86 133 -229 77 -34 172 -37 -54 71 43 -18 -54 -59 -6 45 -43 -268 19 -15 -197
6725 -197 -110 -202 169 -82 9 60 117 6 -190 106 26 77 -93 -66 36 67 33 -108 130 207 99 -20 57 120
6749 120 -213 246 52 -145 139 249 -92 124 58 154 28 -82 29 179 -75 -94 180 52 -191 -177 -193 -99
6771 -99 106 126 -224 23 66 -51 -64 -73 119 99 -60 -244 -71 -39 163 -53 35 93 -175 7 34 148 70 265
6795 265 -301 3 54 33 27 87 -204 89 -5 -52 187 -135 -122 -59 -172 44 -77 -108 77 32 -52 -15 136 156 -176
6820 -176 108 76 -186 201 162 -13 -29 141 -10 71 -2 -124 115 -117 -178 35 -69 21 -162 -72 -157 -70 -15 208
6844 208 -61 41 2 -96 61 -23 44 -8 -56 37 169 -34 -13 51 -84 52 155 225 -81 98 -65 -13 -131 31
6868 31 -220 -171 54 32 147 5 21 -20 -7 103 76 4 32 -110 222 -32 -87 52 -109 -1 41 70 -109 168
6892A68N9l90K26j67K1m7J24k35Q7J82K0k4J7J0r4n5o4J24o6m7J77j77J03M%J33
6918H9J8J21k16K2j63J06K9j74L23j88j8J5m6O7M2K6K5ok74N9J5J9J26j47K07
6943G7k21J9J41P7m2k21K13k84J60L17j81Q4j2L0k18J0P9j91K51l5J04k24J80
6966A13j76K48r4kk41J80J8k87J07K6O0j31K4NL43j68K03j47l5n1j56J57k2J11
6990H5Mj05r5k48J44K34p7KJ67Q5l22L1L11j11l31K01l7N6l4j44J67L5J26k2n9
7015F3K4j22Q6j67N0K2LrP5j04n2M9r7J22L8J05j45L00j72J7q1J12j24O9j08l0
7041g6j47M84j69k63J80J53m05K92J72k35m5n8J19m1J4M3r8m2L2j78J73K08q8
7064B5l5n9o0R0P0L4n3j54J56j73K05q4n5J30j20K21M5j64J56l93J08R8j9K1m3
$$ plain form
6892 168 227 -163 63 -104 -83 -130 -6 -241 -154 28 48 24 41 51 -43 -98 -162 -38 -104 -151 26 -151 -48 -44 -44 89
6918 89 107 228 12 34 -129 -23 6 -168 155 -33 -51 -36 -82 -15 27 53 78 72 -202 -143 -128 -109 17 -130 77
6943 77 -144 -125 16 93 51 -170 43 -241 -81 236 55 139 127 157 -61 -51 28 -163 88 53 157 -67 113
6966 113 -63 185 91 89 -152 28 46 -241 -134 -108 -48 -179 -155 -150 193 25 228 81 46 -5 -161 -4 -26 85
6990 85 89 -16 -111 -359 -215 19 -58 -56 111 196 -126 -95 216 105 -226 -25 -62 -6 -40 -184 -17 18 144 122 63
7015 63 87 -35 51 -116 -66 -44 -41 -50 25 -79 -131 -82 -179 -57 -19 86 -59 241 69 86 5 117 -7 62 -46 -76
7041 -76 -223 261 92 -171 9 162 -243 49 221 -14 -59 -117 2 -39 -25 18 -80 -122 -90 -268 -95 113 25
7064 25 -10 -69 -129 -39 31 65 12 -142 14 -159 46 -38 -93 37 -83 138 183 19 175 -218 -110 -12 -31 -10 -53
7089e3R9j03N5M0k04J62j23J06R8j79M6J4J48M8j4q0M1j61J83j70j25K09l2j99
7113a94L81k16J58k87J40N5mP2j88M9m5k8J99j52L8J44k4j44J84n9L9k65K27J34
7137B14l24N2K57j14k14R2R0o5Qk64K92k3O2k7q6J6k18K41J92k64R4O9J1J88j52
7162A27n5l0P2k31jJ09lK12k40J47k53J03M1J1J5q9J10RL4j70j5K13j59lJ33j21
7188c4l6Oj33N0J38j75J56OO7MNl7j88K52MM2j43R6Jr4J40k09J03Oj90L15k27
7215g5J84m4p5j86K80P6o3j06l39N07l5j19k47L96O4k51j55J71J44l29J75kR1
7238F2O0j47p9K98n40lL61q3JMR9j31l4J89j53J81l1r0Q7j47K3L60k25r5J44m2
7264F9M1p3q5N2M1O9j29j22M0J00j10k7K03m9O9j30j6J00M2K6k58K22pj4Jj43
$$ plain form
7089 -53 46 -57 -2 38 -166 -4 -127 -21 77 -102 -56 -42 106 154 140 60 101 -60 123 -47 -172 37 5 -194
7113 -194 187 -29 129 -158 -18 37 33 105 -83 -34 -79 -107 92 -60 -22 122 98 -46 138 79 118 -147 80 214
7137 214 -110 -58 199 85 -129 -37 53 -12 -4 -268 24 1 63 36 -50 -34 -252 -11 181 -83 11 80 91 279 127
7162 127 72 42 114 -117 -118 -9 -12 200 -40 107 -146 -43 -2 9 24 -65 45 54 88 -82 -97 116 -43 -46 87 -34
7188 -34 -70 -64 -197 -147 -9 -184 -28 -22 45 49 54 17 -171 81 85 127 -16 80 81 -13 127 -82 21 27 -163 152 -75
7215 -75 109 65 -10 -196 84 160 97 -9 -348 159 124 5 -242 154 218 -33 -188 -17 127 -202 -27 -29 62
7238 62 122 -25 -104 194 -346 -349 12 -71 -70 -66 33 -98 -132 57 -96 85 54 -36 51 -96 -73 287 62 -33 111 69
7264 69 110 37 -48 4 45 114 -15 -137 -97 3 -107 -134 69 20 89 -41 -57 43 85 111 -147 75 68 54 55 -88
7290h8O7j33K12k72L98k16j18J20J56j45L3j7J76k59J91j88k5K69r3k3Q5M2j58
7313A4r0J15o0j07K58q1k61K08j32K58k19Q9j82K16l4M6R9k42j6K34j15Q2P4k64
7337a10k5j8J29Q0j61J23Pj75K52l19K08l7pJ53j51K70l02Q4j5J09m8J43m83L54
7361F1lKJ43j51L3j15j92J69k7J39J73l02K07l04J62r6JJ04Rk4j97K19M4j23l4
7386a02J80j26K64j31M2p7L3j95n3K01O0r5r8L33k88k8J19P1k76K84n3j32qL0
7410d5k7MJ00j9m8J35k76O3L27q2q8R4K8k00J69m4j77Q5J14l56J00Q2J0L3nk6
7436d9j47L99q4P0j30NK5Nk31J9J14L0L8k14J84l37K68K9J41k23j1RP7K11j60
7461C8J56j38o1J13k54K03MO8j29j23M12l03j67O0K49k25K45J0j27q3q3J10J87
$$ plain form
7290 -88 -21 -154 58 -214 184 -32 -150 -30 126 -19 14 -3 173 -86 105 -83 -108 161 68 45 130 172 14
7313 14 -76 39 -21 -128 130 49 -212 -4 -136 122 -97 -8 -190 26 -8 38 137 -105 -121 113 -2 80 154 -110
7337 -110 -135 -153 -24 56 -105 18 25 -150 102 -217 -9 -46 -53 100 -51 219 -83 1 -14 95 47 190 -293 61
7361 61 58 60 203 52 85 -30 -222 -53 -80 59 232 -70 137 -167 -5 -101 -100 4 13 -11 -208 11 55 -68 -102
7386 -102 78 -48 216 85 127 50 83 -112 -165 36 96 1 -97 236 -52 -80 39 110 -166 118 65 -67 -75 -45
7410 -45 -72 -68 32 13 -35 100 -176 -113 214 132 44 138 166 -34 135 91 -86 -1 113 -243 -143 -61 -51 -18 -23 -49
7436 -49 -196 203 119 189 59 64 89 94 -137 -118 -4 26 64 -150 34 -303 -35 -6 135 -88 -99 -90 -13 198 38
7461 38 194 56 -5 108 -146 57 61 129 0 -123 289 -14 -181 -121 128 -97 148 158 31 -52 -135 -25 162
7484A62j35J31o7j68R8Rl3o9K15j69J00m3j97J14N0Q4j94L40o6k14J39k3J82j96
7508E0K62l85j3MR1l9K08l06R9J74k34K91l70L5Q2J65j75R5j80Q3J70o8j65J32
7532FP5J08%l33K54j17J55j59j25K19j40m2J28P4m0l7L3oj20Q8r9r4P2K7J04o9
7558c8j45M17j55m4j13Q0N6j00j13J83qqo5J32p6K23n4l2j81P3j32m6J10J12q8
7583a2Kn4J94j77r3R2m1P5k5K34m85M53j07p1j13J82j04Q4J02n2j97m9J57o1n
7608g1K50L2l57J64j29L3K27m26K96J84j97R2j01R0l5j03J47k20R4L5K3J82l84
7631a74q6J67P0r8r8K97R6k27J09j31J01N2j83q6R6O9J76j24j74P3j92L30l42
7654b79L11q6M0J9kL2l3L2K24l51P5J39L3j28l2Q5j39J76j06j63J25j16J67j05
$$ plain form
7484 162 27 158 91 -77 21 30 -3 -72 143 -26 74 31 -166 -52 -2 82 -112 228 162 -52 87 64 246 50
7508 50 312 -73 -86 -82 9 -30 178 -128 -29 145 -89 202 -168 -133 -51 114 -61 34 -146 -63 107 39 -126 6
7532 6 81 189 189 -144 110 -7 148 -11 -136 83 -57 -99 29 103 63 26 59 53 -67 21 -78 -172 -100 -73 31 -38
7558 -38 -183 234 79 35 -78 2 58 -42 -155 28 20 12 -53 79 3 226 172 140 -41 32 -100 -146 -36 76 -12
7583 -12 -10 -64 130 -47 -140 -48 -89 -14 -39 195 -290 163 56 -15 -128 54 -50 34 136 84 -113 -162 -5 -66 -71
7608 -71 179 211 -146 18 -111 -78 149 -277 19 203 6 98 -3 87 52 -51 96 -124 -30 5 28 210 -174
7631 -174 -260 -93 -23 -121 -219 78 174 -53 56 -75 26 78 -105 -191 -95 -26 150 26 -148 -75 -267 63 -279
7654 -279 32 -54 -14 5 3 35 2 34 258 -93 -18 121 154 26 -6 79 -60 116 10 -153 -28 -144 23 -82
7678h2j40K08r1J82j78R3n7j24K55J81k22R9j82K59k45q0K20n5R9j18M9l4m1o3
7702f7J27K6k8K8j71K63k32J41Q9j74o5N0j20K95j48N0m8n3P2Q6N4k67J35j10
7726f7l0J06J2L5p4J13j87m8R9rJ03n2M4j50J24j5J65j37j5j26j0J29J18j4p8
7751C6K21k22k1j18J10r5K08J67m60J54j03L6M4j47L07M8k10q4J93j11M6J14j04
7774In6J4%L0j61K48k12J00J79n6k66J3J37Q3j80j17L74k23j95L27j53P5J40q2
7798B8L6O0j21J19L5q5j7j1j63K34l46Q9K86j28o8J02k70K87o1q5P1J05k13j39
7822b55J94J18K8j36m5K60j67k07J66o2K22p6j76R5nK05j87J68j16j4J15k31P2
7845c4K62k00J11j48Q7k55J32K2K11j61j33P6K23j63j74J41n4K48j25pJ3k50K42
$$ plain form
7678 -82 -222 -14 -105 77 -101 -8 -65 -189 66 247 25 124 -58 201 -44 -124 96 41 140 22 71 37 -4 -67
7702 -67 60 86 58 86 -85 178 -54 87 176 2 -63 -13 -133 162 14 64 16 -37 35 121 175 -92 43 -67
7726 -67 -97 9 21 56 -18 95 -92 -140 -41 -50 53 1 45 -105 19 4 169 32 17 -109 -119 10 128 114 36
7751 36 257 35 14 -104 6 -89 119 286 -174 -20 -123 -87 -43 -190 117 165 -45 -129 64 -47 -1 113 9
7774 9 -47 -33 -33 -3 -164 84 -128 -28 151 95 -171 -158 -21 62 -118 -235 139 -84 -279 48 -105 -30 110 28
7798 28 64 124 3 122 157 72 55 44 -119 115 -231 -142 144 16 -52 50 -220 67 6 -79 -8 97 -116 -255
7822 -255 -61 57 85 -51 -96 164 -3 -210 -44 -106 116 40 -136 -41 -46 159 -28 140 24 10 125 -106 -34
7845 -34 228 28 139 -9 78 -177 -45 -23 188 27 -106 -30 193 30 -144 -3 -57 191 66 59 72 -178 64
7868F4K9j03m7J4j89J09Q2R9j78J95j93K86j96Q7q6j16P6J63N5j70l9L01k15k7
7892Ar1J69R8l15K46q1j86J8j9J80jm9j53K5K00Q5j10K7l1J03j36N7p7LP0j06
7918g3J28r4m6R2j34K16j20n4L9j1J31j60Rj15L39j20K26m4l03k5p0J29P3o5N2
7943@R0J5j77J01q2l0R1j69J29RK6j19L19j48lQ0J06l36Q8R6p9o8m1K36j20p7
7969f3K78k72j00N0J90M8k66n3J80q1j33J07J01k98N41k72k88L39j32J60q2J60
7991A14p6j08J22j53K49l08M5K48j93J94k04K47o4n0k01J35m9J72Pj45j78K12
8013A6k33K78j58Rj8J56NN8j61j8R5p4O9k07R6k0J35M5Q7l01J57O5k86J88n2K19
8039A50j28O5J84j18p5p8K34k86m6k4J31j16K27m5j32R7M1k19L32m73L01R1K5
$$ plain form
7868 64 93 -10 -57 -43 -232 -123 -41 58 -120 75 -118 168 -28 59 -27 -143 -67 96 151 -19 -58 243 28 1
7892 1 -90 79 177 -138 108 27 -159 -141 -160 20 19 -30 -183 -158 42 127 17 44 13 116 -20 37 -40 -37 33 -73
7918 -73 55 -39 -85 7 -127 89 -31 -85 -46 -57 74 -86 -77 -192 147 27 253 209 -94 -119 -189 -60 13 -52 0
7943 0 90 105 -72 29 -53 -83 8 -161 -32 -23 3 -116 203 55 52 132 238 -98 -10 86 7 -61 -102 134 14 -63
7969 -63 215 -57 -157 -107 83 131 -135 -188 -8 -89 -222 -115 -14 -312 229 -43 -331 8 -124 36 -46 114
7991 114 38 -70 52 -101 148 -160 -115 133 -60 134 -70 177 113 63 -138 -3 -52 120 127 -18 -196 16
8013 16 -217 61 -97 -88 -106 50 55 113 -48 -66 29 -45 24 -183 -87 -107 28 73 160 -141 16 81 -205 -17 -69 150
8039 150 22 87 271 153 78 0 234 -52 -98 -122 9 -107 120 75 -57 40 81 -138 194 -279 22 113 138
8062A38k77P2O2Q7k44P3%r5J09m5K56j19r9P2R6J70j54j27r6L14J28j84N3k90
8086a00N3J06j46J95K3j68Q5J6m6L23l84j1LJ79l01K17j04K20k50j64M13k88J28
8109an7k1J61jj06l5J66k07K5k07K62M4N6Rj70J67Mj46m4j43K42P7l2j47J2j07
8135a99K20o6K11l9L3l13L6J99N4j32J13j02n9J49j06j32L47j31k44L14Q1l42
8157a08L5m2J55K0k29L92j22j7j31p7P8J5q4K46k01p2L23j29l6r3K62k22K4J2
8181aj51J42o7L18m14J67o2j3N8j90
$$ plain form
8062 138 -139 -67 -5 82 -162 -89 -89 -184 -75 -120 136 17 -82 -10 86 256 102 -25 -121 193 321 137 190 -100
8086 -100 -47 59 -87 108 131 -37 48 64 18 341 -43 -54 -51 128 -173 44 -60 160 -90 -254 159 -129 -1
8109 -1 -58 -79 82 81 -25 -60 106 -101 -76 -283 -21 23 79 88 -82 85 89 -57 -101 -244 -2 75 43 -104 -92 -199
8135 -199 21 -45 166 127 160 -153 -117 82 136 4 117 15 -44 105 -1 -133 214 83 -161 153 234 -108
8157 -108 -73 -115 40 60 -169 223 101 84 -47 -124 -46 -31 -115 131 -70 -142 181 52 16 -77 185 -37 -13 -1
8181 -1 -152 -10 -77 241 -173 -6 -68 -81 -23 -213
8191b13
$$ Imaginary data points
##PAGE= N=2
##DATA TABLE= (X++(I..I)), XYDATA
0@%%%%%%%%%%%%%qJ6j6J6j6K0k8L2m0M8n6O4p2Q8j04J20j36J52j75K00k25K56
35A36k89L23l63M08m55N06n63O26o91P63q44R33j030J136j252J379j519J675j850
54i71K043k260K504k784L113l496L950m503N196o089P288r003J1674j6444K7632
69A7850j07372p5325R7948K8074M5145K7105J6635k4388P823K2945R555k4379
81D1616l696L904o466j8043J263j1706l8676l6458O233K4376K2401K4090K4435
94C3273p763k9226j2221J4994J2512P515J0959L320j7759j6805l29j393j8728
107b1651k0007j0110p040K262K4766L2257J5787K122M638N252L510R056R602j0344
121D0100k8213k2820j0172k278R724K0105J1188p408q126N87j76m596j12j04j1504
$$ plain form
0 0 0 0 0 0 0 0 0 0 0 0 0 0 0 -8 8 -8 8 -8 12 -16 16 -24 24 -32 32 -40 48 -56 64 -72 80 -95 105 -120 136
35 136 -153 170 -193 215 -240 266 -297 329 -362 401 -443 490 -540 596 -656 723 -796 879 -971
54 -971 1072 -1188 1316 -1468 1645 -1851 2099 -2404 2792 -3297 3991 -5012 6662 -9782 17850
69 17850 -89522 -164847 -66899 -38825 6320 33425 50060 25672 33495 56440 65995 41616
81 41616 37920 41824 35358 17315 18578 6872 -31804 -68262 -62029 -37653 -15252 8838 33273
94 33273 25510 -3716 -15937 -943 11569 19084 30043 33363 15604 -1201 -1530 -2923 -21651
107 -21651 -41658 -51768 -58808 -56546 -31780 477 16264 18386 23024 28276 31786 40842 50444 40100
121 40100 11887 -10933 -21105 -23383 -13659 6446 17634 10226 2100 2687 2511 -2085 -2197 -2301 -13805
136a3805j2874L037Q737k317o088R19O55P28J6995L1694K0592k413r604j2424
150B3832k1540j7800L563J2832K185j860N814K558j0436r441r05o435j2090L050
164b6673J9746J7654Q815Q470J779j4095j6837j166N615p26l098j385q528j7291
178b7720r665L227O286N378J2995J9705J4752R384Q209J896j1927j7318j1752
191C450o664n587j568J744k012p082l503K661M918O233P801N380j00k357m60m33
207B421j240J126K183J309J042K709q2m392o478o407n626k411L669O804M855K283
223A765K720P10r20J623M292J614k374l173l974p055p263k226J315K023L697Q566
239A340Q053K511p37j407m967q424m830R46J413K30K482L570r8j195J991L775
$$ plain form
136 -13805 -26679 -23642 -14905 -17222 -23310 -22391 -21736 -21008 -4013 27681 48273 45860 36256 23832
150 23832 2292 -15508 -11945 887 3072 1212 7026 9584 -852 -10293 -11198 -17633 -29723 -26673
164 -26673 -6927 10727 19542 28012 29791 15696 -1141 -2307 3308 2582 -516 -1901 -10429 -27720
178 -27720 -37385 -34158 -27872 -22494 -9499 10206 24958 34342 42551 44447 32520 15202 3450
191 3450 -3214 -8801 -10369 -8625 -10637 -17719 -21222 -18561 -13643 -7410 391 5771 5671 3314 2854 2421
207 2421 1181 2307 4490 5799 6841 9550 9468 5076 -1402 -7809 -13435 -15846 -12177 -5373 -518 1765
223 1765 4485 5195 4275 5898 10190 11804 9430 6257 2283 -4772 -12035 -14261 -12946 -10923 -7226 1340
239 1340 9393 11904 11167 9760 4793 -3631 -8461 -7515 -6102 -5872 -3390 180 82 -1113 878 4653
255D653J398J97J572Q2m350n202k842k453k611N87N200M993K608J831L36k953
271C046m641k930P7K65O34L259L120J002j82M12J52r05j394m19n77k325k862j987
289f255j882m59J409M536N028L888K332R54j284l836l862l087j716j295J15J525
305c889J801J578Q83J305N18J11k69L34m38j763k179j664p62m14J699L504L350
322C705J927P56j56k185l571k356j538j217k60J068K058J617R46J169O40o87p63
339A153r9J1r15j267j259j341j143K27K566L240K526J746M64o25k464j816j435
356d31k171j744k95J428J946K355K094J546j068j845j632p32n58o66m77n31r33
373c714L64J288K180J250K49J19r18o31J77N89n02j675k028l59Q19K467L180K540
$$ plain form
255 4653 6051 6248 7820 7902 3552 -1650 -4492 -6945 -9556 -8969 -3769 1224 3832 5663 5999 3046
271 3046 -1595 -4525 -4448 -4183 -3549 -290 2830 3832 3650 4062 4214 3309 1915 1496 919 -1406 -4268 -6255
289 -6255 -8137 -8596 -7187 -2651 2377 6265 8597 9551 8267 4431 569 -2518 -4234 -5529 -5414 -3889
305 -3889 -2088 -510 373 1678 2196 2307 2038 2372 1934 171 -2008 -3672 -4434 -4848 -3149 355 3705
322 3705 5632 6388 6232 4047 476 -1880 -3418 -4635 -4895 -3827 -1769 -152 794 1963 2603 1916 1153
339 1153 1054 1065 150 -1117 -2376 -3717 -4860 -4633 -2067 1173 3699 5445 5909 5284 2820 1004 -431
356 -431 -2602 -4346 -4641 -3213 -1267 1088 3182 4728 3660 1815 183 -549 -1107 -1773 -2250 -2781 -3714
373 -3714 -3350 -2062 118 1368 1617 1736 818 187 364 953 451 -1224 -3252 -3611 -2792 -325 2855 5395
391E395J173n65j284q27j415j945k852k656k251N9K325L924K744O53r59j498j635
408a614o7J164O74o91j285l60R93J572J533Q80n11j445p56J470J955R20j142k200
426A090k907j839N60K496K826N38m29q04o49m49k47j464l073l167j127J948L635
443c062M109L034Q11j697j890l78P65n8j190j147j232l45J995K537J623r08j583
460A384j385M40J595K103R11j850l700l387j727j5J185J343M67L55R28J858J708
477B213M9j542l130k213j50K555M353L562Q08r33k230j950n92o4k59q40j210n05
495b078Q12J791J377k47j498j290m81J086J863J348j097k913l173j989J70J353
511d966K173K046Q75R11J757J508J265n55j648k862k329m51J334J461O18j23n87
$$ plain form
391 5395 6568 6003 4719 3892 2477 532 -2320 -4976 -7227 -7168 -4843 -919 1825 2478 1519 21 -1614
408 -1614 -1681 -517 157 -534 -1819 -2179 -1186 386 1919 2799 2288 843 87 1557 3512 4432 3290 1090
426 1090 -1817 -3656 -3096 -600 2226 2764 2335 1531 882 433 186 -1278 -4351 -7518 -8645 -6697 -3062
443 -3062 1047 4081 4892 3195 1305 927 1692 1634 444 -703 -1935 -2280 -285 2252 3875 2967 1384
460 1384 -1 439 2034 4137 5048 3198 -502 -3889 -5616 -5631 -4446 -3103 -2636 -2281 -1353 505 2213
477 2213 2262 720 -2410 -4623 -4773 -2218 2135 5697 6505 5572 3342 1392 800 736 477 -363 -1573 -2078
495 -2078 -1266 525 1902 1655 157 -1133 -1614 -528 1335 2683 1586 -1327 -4500 -6489 -6319 -4966
511 -4966 -2793 -747 128 1039 2796 4304 5569 5014 3366 504 -1825 -2276 -942 519 1137 1014 427
528D27o05O1R02O40n71j676r23N6O65J365R98k59j565j557n21L67P01O58j92r45
548a974m46L84J295R46P94P35Q41O54J411J523K17j961k914l514k376p79M10J364
566c390J083J334M55R11N6L82K39m74o32j44L55N63K60j97j168j484l49K94J100
585h06J377R35Kj131p02p60N76N26N48N38O55N19K71M3q50j366j488j100r90M29
605b774R84M68J56J36M87M12M79J043K94o20j018l87l57j05L5M93N63L86O54O53
625A982K35k62o19p52j132p66l98L78j60m86K68K38M27Q75J021Q42J19r0m78n12
645G30p84n34P0j07K49K65M15r2l13o59l18n91Q1L83O53P82O01L32N69J28J96
666B056j05L3n92m46r38j116j132q09j89L39P01J148J090O63O44j57M48j57P8
$$ plain form
528 427 -178 -117 785 1425 854 -822 -1745 -1689 -1024 341 1339 1080 -485 -2042 -2563 -2196 -1495 -837 -1029 -1974
548 -1974 -2420 -2036 -741 205 999 1734 2575 3229 4640 6163 6380 4419 1505 -2009 -4385 -5164 -4754 -3390
566 -3390 -2307 -973 -518 393 449 831 1070 596 -36 -180 175 738 998 801 -367 -1851 -2200 -1906 -806
585 -806 571 1506 1508 377 -325 -1085 -509 17 565 1103 1758 2277 2548 2591 1741 375 -1113 -2213 -3203 -2774
605 -2774 -1790 -1322 -1166 -1030 -543 -131 348 1391 1685 1065 47 -340 -697 -802 -767 -274 289 675 1329 1982
625 1982 2217 1955 1336 584 -548 -1314 -1712 -1334 -1494 -1980 -1712 -1474 -1047 -172 849 1691 1810 1720 1242 730
645 730 -54 -588 -518 -625 -376 -111 304 212 -101 -760 -1078 -1669 -1588 -1205 -552 230 831 1163 1732 1860 2056
666 2056 1951 1984 1392 946 8 -1108 -2240 -3049 -3238 -2899 -2198 -1050 40 703 1347 1190 1638 1481 1559
685A559m85k99j78j09k37l32j65m38j67j87N43K56k87J38m80n40j47P47Q32Q50
705H74O65N56J76m82l44p03n76j060l70k81K45J14L12K1J0L33L98O84j61N37m0
726I08r2n29l84n8N8L04L07L33j95R2k93k78n35p41m41K29J15J78M06O99L62K1
748D66L23K34Q5N8j45k35n70n08m70j82o0L00K08L29N5L49o9l41N2k01k0K08J50
771A6K12L94K30k93J37j44j58l04n2k11k43m58k65M9K37L93K28N50O6N16L7j43
793G94l16K6m01l5r5l16K88N7K04k39L58j80j15m10P8j40m21l20J75J52N36O66
815C46N28O0J2j88r0r4k83J8n40j49K36%l7L43k51Q9m16L19N65N2j89pl48n82
839f06M4R4N94J12J99j77J04k80J25l98m02m60q6O9O53L62P22j23J94k30m6J29
$$ plain form
685 1559 1074 775 597 488 251 -81 -246 -684 -851 -1038 -495 -239 -526 -388 -868 -1408 -1555 -808 24 874
705 874 1539 2095 2271 1789 1445 742 166 -894 -1264 -1545 -1300 -1186 -874 -853 -843 -510 -112 572 411 948 908
726 908 816 287 -97 -155 -97 207 514 847 652 744 451 173 -362 -1103 -1544 -1315 -1200 -1022 -616 83 445 466
748 466 789 1023 1108 1166 1021 786 216 -292 -762 -944 -1004 -704 -496 -167 -112 237 168 -173 -121 -322 -342 -134 16
771 16 228 622 852 559 696 552 394 90 38 -173 -416 -874 -1139 -1090 -853 -460 -232 318 384 900 937 794
793 794 478 504 103 68 -27 -343 -55 2 206 -33 325 145 30 -380 -302 -442 -863 -1183 -1008 -856 -320 346
815 346 874 934 946 758 668 574 291 309 -231 -380 -144 -144 -181 162 -89 0 -416 -97 468 520 331 324 -24 -606
839 -606 -562 -468 126 238 437 260 364 84 209 -189 -591 -1051 -1137 -1068 -415 -53 669 546 740 510 464 593
861E93r9J95k46k00k65j76k6P8l23J98n4j4J97L00l7M1p10j42k39K03L16L17K10
884A17L67j72M32J61j74J2o62k24j22J7K54L33L20o9l67q7j01R3k98q6j47l77
906g80K37j4M80J81P2m24N5K27J65K13Q2l77k39m64k80K31J39Q3K45M76p2N65
928H01L31l5m33j47n25m9l38M48K8k9j65k89o3p0j62J95m66M32o7q8M66M25J56
951C56m6n0l2L91K2K13n3j90p04l56l3j24R6L25OJ75J6J53J18K71l40l17j67q
975b78K8l4K33O0Jo8q1J92k33l71K76j97J40K13j04J15J66J69Q0o7K72OJ35j41
999E12l11j49k79p1J66k98n8N5J99K4P6J94l0j44j67J06j78K15J23J92k25J71
1021A23K88J63k74o2J42l28k39O9p2k06K11o8J43P1J28p7L73k0j99J50k29j96
$$ plain form
861 593 494 689 443 243 -22 -198 -224 -146 -469 -271 -325 -339 -142 158 121 162 -548 -690 -929 -726 -410 -93 117
884 117 484 312 744 905 731 743 81 -143 -265 -248 6 339 659 590 223 136 35 128 -170 -256 -403 -780
906 -780 -543 -557 -77 104 176 -248 -193 34 199 412 494 117 -122 -586 -866 -635 -496 -413 -168 308 236 801
928 801 1132 1097 664 517 -8 -57 -395 53 81 52 -113 -402 -465 -535 -697 -502 -968 -536 -603 -691 -225 200 356
951 356 310 260 228 619 641 854 801 611 -93 -449 -482 -606 -510 -185 -179 -4 12 165 283 554 214 -103 -270 -278
975 -278 -250 -284 -51 9 10 -58 -139 53 -180 -551 -275 -472 -332 -119 -223 -108 58 227 307 240 512 518 653 512
999 512 201 52 -227 -298 -132 -430 -488 -433 -234 -210 -134 60 30 -114 -281 -175 -353 -138 -15 177 -48 123
1021 123 411 574 300 238 380 52 -187 -118 -190 -396 -185 -253 -110 -39 89 12 385 365 166 316 87 -109
1043a09K0K47j61Q7l95K74L2N2r0J5j13R6Jj74R9j78L13P8R8O1J25Rq7j44j00
1068E6n7l9Kk17L8n4L27r5M13j85j29R0j07J56l73K93k33o7j0L00k3J47l34K82
1092A81k63R8J23j5n0k80k3j06J81k3K08P4N4j97O6J6J70j78j70m2o3J10j14L67
1116A24kPp8k15J84L2j26r5k22J31R5K60R6k13L38l52O7K03J8n9o8j93K0j41j92
1141c81J98o5N4k5K68j27J73m0r3K43j58j28kp8K20J5l3J93l37K03k67K45M8l11
1165a85K22j49j03Q7J77J29p6nR2j57J23j28Lnp4k34K29o2q3J66P0j07K59j8j59
1190A2JP9l45J71N2j50K00o3Q7ML27L4j63MJ42l03p6r0k6j63J26L4m5O2J27k81
1216b43K68k25J22L87l36J8jj64J47L93j05j45K45n7j11p0q6O1j71j70J62K4j50
$$ plain form
1043 -109 -89 158 -3 84 -311 -37 -5 47 -43 -28 -141 -45 -44 -218 -119 -297 16 94 192 253 378 387 300 156 56
1068 56 -1 -40 -38 -255 -217 -271 56 -39 374 189 60 150 43 199 -174 119 -114 -181 -191 109 86 233 -101 181
1092 181 -82 16 139 124 74 -206 -229 -335 -154 -177 31 105 159 -38 28 44 214 36 -134 -176 -239 -129 -243 124
1116 124 122 129 51 -164 20 52 -74 -169 -391 -260 -165 95 191 -22 316 -36 31 234 252 193 125 -68 -48 -189 -381
1141 -381 -183 -248 -194 -219 49 -78 95 55 -38 205 47 -81 -83 -161 59 74 41 234 -103 100 -167 78 126 -185
1165 -185 37 -112 -215 -128 49 178 102 97 189 32 155 27 30 25 -49 -283 -54 -116 -199 -33 37 -70 189 171 12
1190 12 13 92 -253 -82 -30 -180 20 -43 44 48 375 409 246 250 392 89 13 -77 -103 -266 -140 -106 -151 -89 38 -243
1216 -243 25 -200 -78 309 -27 -9 -10 -174 -27 366 261 116 361 304 193 123 37 98 -73 -243 -81 -57 -207
1239b07K26J40J5o0L5J12J16m68j02J37k96J17q0M9J77j31L7L24n3K07l56K71
1261B10m06K83L1j79K32K14k08K7M1k90L10k32R0k75q5K6J34k01P8J87n4j29J19
1284g7J85n5K9lR3j74j25l3N6J41J35j52j35K17K5j64J88p0K56k88k94K57j53
1307a41J89p1N2j13p4K91k05K2p2j7P8m1j37N2K7J31mo1l3J10N3J68R2l50J31
1332G7O8J31j89L33n1k04P5p2k85J96k83J30k89N1m2Q2K8J65K18r4M1K1pL2l5
1357I7j51M1O1J33k85J31J2n9j6Q2j57r6K07O9j33J76j93j68J88J32j81M1n2L6
1381h5J80Kj92n6j99K01J53L8j57J80J66K05j43j88O1k25J26p1L4j48j15K10M5
1404B2j52J3R3P2p7L5J00l0J43k82N4q2J54j64R6P2j6r3M28l40Qk4j21R5J75O9
$$ plain form
1239 -207 19 159 174 114 149 261 377 -91 -193 -56 -352 -235 -315 -266 -89 -220 -183 141 88 295 -61 210
1261 210 -196 87 118 -61 171 385 177 204 245 -45 265 33 123 -152 -237 -211 -77 -278 -200 -13 -67 -196 -77
1284 -77 108 53 82 79 172 -2 -127 -160 -104 37 172 20 -115 102 127 -37 151 81 337 49 -245 12 -141
1307 -141 48 -23 29 -84 -158 133 -72 -50 -122 -139 -61 -102 -239 -187 -160 -29 -33 -94 -127 -17 36 204 296 -54 77
1332 77 145 276 87 420 369 165 240 168 -117 79 -204 -74 -363 -312 -354 -272 -244 -79 139 45 86 107 100 132 97
1357 97 -54 -13 48 181 -104 27 39 -20 -36 46 -111 -207 0 69 -64 112 -81 -249 -61 71 -110 -69 -121 -85
1381 -85 95 97 -95 -151 -350 -149 4 42 -115 65 231 436 293 105 166 -59 67 -4 30 -118 -233 -23 22
1404 22 -130 -117 -24 48 -29 6 106 76 219 -63 -9 -91 63 -101 -5 67 51 -42 386 46 54 30 -91 4 179 248
1430B48r7N2j11K4ok06J40N5k59J00j17K67j33M5k7J69q7Q2j01N7J08k60J39j20
1454c8J41k11J42n5LL2j17K13o9P6J19l22J0K66j85J89j30O6k19Q0o4R2M3j19
1478e7J24M5k38R9j72J8J13K68k86J55O8k47K23j34M8k3R0o6j13J59l1q7J04n6
1502Dq3J26n9J98k20O8J16l04J27q5J81j80J09o1K96q6k29K33j85j2J07l68K66
1525d1l9n7K07lk62K1J85n5P6k16K75M6k56K08Jj05%jj10n9K7K94L3j24J8L2n3
1552D2k54P6K22k47L61l83K84j29O9j20K43k50K3J66j36L39m22J99l8j20L8K0
1574a7kq6n4J68K0Q2j36L7J75L7o5k23o3P0Q2J4l5l1M33j78l28J46r7L2J13j74
1600h0J64n4q2P7j67K52J05Pl10K59k24J2j22Q2J69r6M2j01R0j58P6J11kj14R7
$$ plain form
1430 248 151 203 92 116 110 -96 44 99 -160 -60 -177 90 -43 2 -25 144 57 139 38 95 203 -57 82 -38
1454 -38 103 -108 34 -21 -18 14 -103 110 41 117 236 -86 -76 190 5 194 64 130 -89 -9 -73 19 62 -57
1478 -57 67 112 -126 -27 -199 -181 -68 200 -86 69 137 -110 113 -21 27 4 94 28 -85 74 43 -44 60 4
1502 4 -79 47 -12 186 -34 34 150 -154 -27 -112 69 -111 -2 -63 233 147 -82 151 -34 -46 61 -307 -41
1525 -41 -80 -137 70 67 -195 -174 11 -44 32 -184 91 137 -119 89 90 -15 -15 -16 -126 -185 -158 136 169 45 63 95 42
1552 42 -212 -136 86 -161 200 -183 101 -28 41 -79 164 -86 -63 103 -33 306 -116 83 45 -75 -37 -17
1574 -17 -19 -105 -159 9 29 111 -25 12 187 224 159 -64 -127 -57 25 39 4 -27 406 228 -100 46 -51 -19 94 -80
1600 -80 84 30 -52 25 -142 110 215 222 -88 171 -53 -41 -163 -81 88 -8 34 -67 23 -135 -59 52 50 -64 33
1625C3oMj36O3L29k33r9J19l4l0p3J15r4K16j84k63L31j36R7O2r8k13J41J25P0
1650A06k4j35J43N5l34J66M4k2J11q0j0o1l8LK20l25L10k40q8k8K93j78K82j14
1674E6kK2J40j22m7j7j23m3Q8j4lL6j1k89L34l8J07j53J69j97l9K91j07l2K15
1699B21j71N1J53k72k22k8K39p5J72j93m1K0J55j7n8j5q0J55o6J19j57j5K44k62
1723a43J24p0K17k96Q5J53j70M7J9J97k58Q6J30n0j1K53k45J37j73oq2j55M05
1746A94l32J78j6J26l01k1J52j88M4K30l01L2J14J12QL6n5R0j34L1j09K15j87
1769h2qL1J27j19mM6j27J20O5R2k12O2J55j18r5L0P8N1j71K07j32J22m4J33p7
1794A30j64k31K97k17J8K14Q4J24k19n6K42o7j88P3l0n0Q9o0jJk83L57J9k55q1
$$ plain form
1625 33 27 31 -105 -42 287 54 -45 74 40 10 -63 52 -42 174 -10 -273 58 -78 19 81 -17 -230 -89 36 106
1650 106 82 -53 90 145 -189 -23 21 -1 110 30 20 -41 -79 -76 144 -181 129 -111 -199 -227 66 -112 170 56
1674 56 54 76 216 94 47 30 -93 -136 -48 -62 -65 -29 -40 -329 5 -33 74 -79 90 -107 -146 145 38 6 221
1699 221 50 101 254 -18 -240 -268 -29 -104 68 -125 -166 -146 9 -8 -66 -81 -161 -6 -72 47 -110 -125 119 -143
1723 -143 -19 -89 128 -168 -83 70 -100 -53 -34 163 -95 -9 121 71 60 313 68 205 32 26 -56 -211 194
1746 194 -138 40 24 150 -151 -172 -20 -208 -164 66 -235 -203 -89 23 31 67 12 102 -32 -1 -110 105 -82
1769 -82 -90 -59 68 -51 -55 -9 -136 -16 49 141 -71 -9 146 28 -67 -37 41 92 -79 128 -4 118 74 207 130
1794 130 -34 -265 32 -185 -167 47 131 255 36 -20 222 155 -33 40 10 -40 49 -11 -12 -11 -294 63 82 -173 -254
1819b54R7j9J90j59k7Q6j16M12k00J72q7o6J26j56J17j51K9J28l3k88J92P0j57
1842i4Q3q6M7o1L47k84Q0o6K02l3j13P2Jj39Q9Lk33K41j31j53M2O5J21j2J25j45
1868c2j45O9O4L3K3J25n0j27J47qJ90k37n5j39K33j88N2J57k28k01Q9J65J97j48
1892a4m0M2r7nJ03J01m1R5j48J16n5l43K88k79K57J32j73J36k2l4M1K12l63M8
1916d3K0J52rj87J34k73L29k67K29M3k29l6K05q2j22J51j63L89k77J82k24K79
1938B01j74m0p1J08J16j88J48j91K07k45J46p3J7j20J04o3R2l1k4k3K68j01k30
1961a67K14K5j41j00J12J89j26K31j66J49j77k4M1K8m6Q0r8p7O4l4Lj78O7J89
1985E8ML7K23j83l04J9K43k20K33k84J27J13q0P7j00K06j47p7nM1j32M0J24J10
$$ plain form
1819 -254 -157 -176 14 -145 -172 -86 -202 210 10 182 95 29 155 -1 116 -35 -6 122 89 -199 -7 63 -94
1842 -94 -11 -97 -50 -111 236 -48 32 -34 168 135 22 94 95 -44 45 48 -185 56 -75 -228 -186 -121 0 -12 113 -32
1868 -32 -177 -108 -44 -11 12 137 87 -40 107 99 289 52 -3 -142 91 -97 -45 112 -116 -317 -228 -63 134 -14
1892 -14 -54 -12 -109 -114 -11 90 49 144 -4 112 57 -286 2 -277 -20 112 -61 75 53 19 60 272 -91 -43
1916 -43 -23 129 120 -67 67 -206 123 -144 85 128 -101 -137 68 -14 -136 15 -148 241 -36 146 -78 201
1938 201 27 -13 -84 24 140 -48 100 -91 116 -129 17 -56 -39 -159 -55 -118 -26 -57 -81 -104 164 63 -167
1961 -167 47 72 -69 -169 -57 132 6 237 71 220 43 19 60 88 42 122 24 -53 11 -23 -20 -198 -131 58
1985 58 62 99 322 139 -165 -146 97 -123 110 -174 -47 66 -14 63 -37 169 22 -55 -60 -19 -151 -111 13 123
2009A23q2j84j3J45JJ2O8q6k30M7J41p7J91j01Nk4j24j23L65j92K57j52K07k05
2033c1O3j87J99Mk08J13l3M4j34K28m4K44j31r0l1L2J9Q8k21L34j66k32oP8q0
2058a48J60J39k43R3q6J18o2J43k05J78Qj97J67r3J02k52K73k60J36K5pj36J29
2081a8J75q4j22O2o7K62j33j9j14J98j10J9p2Q3k19J08j55J95O8q9K48p8K7k07
2105d2j46K17j18K15R5j59l7o2J23j91L57m00M0K43j63j7L2k23J68K8M5J4lJ86
2129B02k23R2j41J84k91M28k46R0k8O1L5j04O1k24l9M3j5J65KJ34p7o3r2M2p8
2154h2K82j48j50J63QOk04K51j44m5L01l11R6j20P7j25J92J7j83l6K33MRj54K73
2179B10l04n0L34j20N3j75r7L5M7k11K67j07K72k13O8nm6J7k36J59J55j21J32
$$ plain form
2009 123 41 -143 -156 -11 -10 2 70 -16 -246 -199 -58 -135 56 -45 -40 -64 -188 -311 54 -138 119 -33 174 -31
2033 -31 32 -155 44 48 -160 -47 -80 -36 -170 58 14 258 127 37 6 38 57 145 -76 258 92 -140 -146 -68 -148
2058 -148 12 151 -92 1 -85 33 -29 114 -91 87 95 -102 65 -28 74 -178 95 -165 -29 -4 -11 -147 -18
2081 -18 157 73 -49 13 -54 208 75 56 -58 140 30 49 -23 60 -159 -51 -206 -11 57 -32 216 138 165 -42
2105 -42 -188 29 -89 126 221 62 25 -37 86 -105 252 -148 -108 135 -28 -45 -13 -236 -68 -40 5 19 16 202
2129 202 -21 71 -70 114 -177 251 5 95 67 128 163 59 120 -104 -143 -100 -115 50 52 186 109 46 -46 -4 -82
2154 -82 200 52 -98 65 73 79 -125 126 -18 -63 238 -73 23 -97 -20 -145 47 64 -119 -155 78 82 91 -63 210
2179 210 -94 -144 190 70 123 -52 -149 -114 -67 -278 -11 -118 154 -59 9 4 -42 -25 -261 -102 53 -68 64
2202F4m7Q8j92P8j16J17K7j14Q6J86n2r9k12M17j31k68J87k27J3K42n2J3j05K
2226i5R8r7K07j00k5j2O0Pp2J31q9l8N8q5j61K18j7P3k77M40k19OJ47m8M8J11
2252B69k44q9N3p0M9K48k74j17K31j06j4J34J0j16kk3p8L7L85l80O0j17Q5p7K45
2277I9K0j31j64L39l06K57m8k08OK5J07n9J85k41K6j8J0L0j4J67Pj97J08J51r
2302A42K5k48J4J72k0j78J16N8N5j85J29M5Nn0o1R8j58mj3N0l0m8J23l74K74R0
2328B7N1r0M9J83r9k23J18Q0j79J08L7j20j61L45l0l32J74l4N6O6K53l84LL71
2352B69l04k36K20M5j43M6l3K14l0QR9o4O6j20mJ33k12r6J81O7j66J80k66N9n7
2377a44J24q7J16l6l4J96r0N4k43J26P9L3kJ41k46J2K42l37J33j86O6j70K73Q
$$ plain form
2202 64 17 105 -87 -9 -125 -8 19 -95 -9 177 125 26 -186 231 100 -168 19 -208 -195 47 -5 8 -97 -95
2226 -95 3 -94 113 13 -12 -24 36 43 -29 102 13 -25 33 -52 -213 5 -12 61 -216 224 5 11 158 110 158 269
2252 269 25 -64 -11 -81 -32 216 -58 -175 56 -50 -64 70 80 -36 -38 -61 -139 -102 283 -97 -37 -154 -69 -146 99
2277 99 119 -12 -176 163 -143 114 66 -142 -136 -111 -4 -63 122 -119 -93 -111 -101 -71 -85 82 89 -108 0 151 142
2302 142 167 -81 -67 105 85 -93 23 81 136 -49 80 125 130 80 19 117 -41 -45 -58 -8 -38 -86 37 -337 -63 27
2328 27 78 -12 37 220 121 -102 16 96 -83 25 62 -58 -219 126 96 -236 -62 -96 -40 26 279 -105 -102 269
2352 269 -35 -271 -51 -6 -149 -103 -136 78 48 56 155 91 157 37 33 166 -46 -142 39 106 -60 120 -146 -87 -144
2377 -144 -20 -107 9 -27 -61 135 45 99 -144 -18 61 94 92 233 -13 -1 241 -96 37 -149 -83 -253 20 28
2401B8k81L02n7J47j23l17K60J70oj33J6k9j43K31Qo5o1J63J6k92L00N6l51Q7
2425g4N6K7p5P9j69R8J84j44K0l1j4j88J81K09R0k71l4J10j05J95j78R7q3Q4j27
2450f3J54m8m8m3L31k41l6J5O1k38J24j03j7K58j35J1K02l76J58K8k67L23Kk05
2474a53J13j37J92J3J53l1j62OP1P0j70%J11J43k93L1Qk1M3k32J76J16j79J21
2498a1j38K5O4o7K66k34J44o7m6K16r6Rj63J37o7j00L89k10l1J76J7k05J49k3
2522A34m3R4m8l6k60K31k02K19K3q4k03J7J93q2K3O5l0KJ33j58q6J38j13K61j32
2547E6p0q0j07J73mm9j4R2K2m6J90k12M8J51j36j2J74n8l8n9j76n3K75k03K0L88
2573B72l31Q7j46R8J84j47j02J05N1q3Q4j42K6J27j06j96K58j01Q3J24p6n0j2
$$ plain form
2401 28 -253 49 -8 139 16 -301 -41 129 123 -10 6 -23 -166 65 73 8 -53 110 126 -166 134 190 -161 -74
2425 -74 -18 9 -66 13 -156 -58 126 -18 2 -29 -43 -231 -50 159 249 -22 -56 54 -51 144 -34 63 -20 64 -63
2450 -63 91 43 -5 -48 283 42 6 21 82 -156 -32 -135 -152 106 -29 -18 184 -192 -34 -6 -273 50 52 -153
2474 -153 -40 -177 15 28 181 150 -12 -6 65 135 -35 -35 76 219 -74 -43 -35 -56 -13 -245 -69 47 -132 -11
2498 -11 -149 -124 -60 -127 139 -95 49 -18 -64 152 56 65 -98 39 -28 -128 261 51 20 196 213 8 157 134
2522 134 91 185 137 101 -159 72 -130 89 112 28 -175 -158 35 -47 -24 41 11 13 146 -12 -98 40 -73 188 56
2547 56 -14 -94 -201 -28 -32 -81 -95 -3 19 -27 163 -49 -1 150 14 2 176 118 80 21 -155 -208 67 -136 -116 272
2573 272 -59 28 -118 -20 164 17 -85 20 71 -12 72 -70 -44 83 -23 -219 39 -62 21 145 69 19 7
2596Gj76L01j34K09j58j55M88m00M0J11n0J72k33j15K11o7k4p1K92j84k6N7K0
2619A15J62j13j06j86OJ40j61K27j48p3oL05k38Q8O8j61L5K90M5n08L56j19q8
2642g0M7O2O6m6M1k2j8k7J41j71l6J85n1j10j08J65j10N0k25J71l5K82k67K4J36
2667G4l38M19j80j5R3o0J03j03k0j0K35j86j86J05K79l02j53J91j9k24L89J1K0
2690A23k31J72k30L69j29j51q6P4J61q0J98l45J98j47O9j10O6j17K90M8j67P8
2712E3q9J73j37j06J42J04l86K82j19J41j2J28k00K83j81mk91J89K42k0l6k30
2734g4J49m9K15j06j85J8K10k89K01m8j48K50j34j91K19Qk1J06j35J3j18J62J
2757E4m2q1k8K05l17M90l05m3j13KR0J75n5k26K25o7Mm0l2J04J46j95O9p0p4J38
$$ plain form
2596 7 -169 132 -2 207 49 -106 382 -18 22 133 83 255 22 -93 118 51 27 -44 248 64 38 95 115
2619 115 277 164 58 -128 -122 18 -143 84 -64 -137 -143 162 -76 12 80 -81 -46 244 289 -219 137 18 -70
2642 -70 -23 39 105 59 100 78 60 33 174 3 -33 152 101 -9 -117 48 -62 -12 -237 -66 -101 181 -86 -62 74
2667 74 -264 155 -25 -40 53 -7 96 -7 -27 -37 198 12 -174 -69 210 -92 -245 -54 -73 -297 92 103 123
2690 123 -108 64 -166 203 74 -77 -163 -89 72 -8 190 -155 43 -104 -35 -145 -79 -196 94 142 -25 53
2712 53 -36 137 0 -106 36 140 -246 36 -83 58 46 174 -26 257 76 72 -219 -30 212 192 156 -74
2734 -74 75 26 241 135 -50 -32 178 -111 90 42 -106 144 10 -181 38 46 25 131 -4 9 -109 53 54
2757 54 12 -69 -97 108 -209 281 -24 -67 -180 -178 -88 87 32 -194 31 -36 -32 -72 -104 0 146 -49 20 -50 -124 14
2783A4N0N0N3j01k6r5K6R7k1j15kP5j01J17P8M9k32n3J2L7L20j61k3J0j76j00
2809b18L84k42J23r3M6j9P3n6J58K1k17P3R0k00l4J43J44l06J21K4j6n4l9n4J57
2834Ik1J16j96n4P0K33k55K0J02k00J66Kj08K18mm7j61j34L11O9q2j25r5oJ00
2859g2J9J90q5p2Kj6m9J6MJ09q7j46M44k79M7p6k8L13k51j54K09J19j28J27j48
2884Hl18K48J46m2k04J56J7Lj14J45n3k51M64j21j25K54k78J4J33j79J54n9k79
2907b81L35ml8J90l59K94j66j0J08%j51K60l40R6J65J26l52L09k26R7J12o7k0
2930G8O8j47N3r3O8K83m81J56J60k00J39o1j03J73j47o3J05J98l17L02j37J22
2952A56p7P8l93k2L94l34K89j02jR2k53J41lK6M4o1M9k08K49j55K34k30j01K77
$$ plain form
2783 14 64 114 167 66 40 -55 -29 68 47 -68 -70 5 -96 21 99 148 -84 -137 -125 -88 232 71 48 58 -118 -218
2809 -218 166 -76 47 -46 0 -19 54 -2 156 177 -40 33 123 -77 -111 32 176 -130 -9 15 -1 -55 -94 -148 9
2834 9 -12 104 -92 -146 -76 157 -98 -78 24 -176 -10 -8 -116 102 98 51 -110 -244 67 136 54 -71 -166 -172 -72
2859 -72 -53 137 52 -20 -18 -34 -83 -67 -63 46 -41 -187 257 -22 25 -51 -79 234 -17 -171 38 157 29 156 8
2884 8 -310 -62 84 42 -162 -6 11 14 -100 45 -8 -259 205 84 -41 213 -65 -51 82 -97 57 -2 -281
2907 -281 54 50 12 202 -157 137 -29 -39 69 69 -82 178 -162 -66 99 225 -127 182 -44 53 165 98 78
2930 78 146 -1 52 -41 27 310 -171 -15 145 -55 84 23 -80 93 -54 -117 -12 186 -131 171 34 156
2952 156 79 157 -236 -258 136 -198 91 -11 -12 80 -173 -32 -35 -9 35 -26 23 -185 64 -91 143 -87 -188 89
2976H9l12M23l66L29j08j55p9K81j21r4K03j62L2j08L32k37R4O3m5p6J9l9N0j42
3000a29N6N6O3j73R2p4J79J3j72K45l23Lj2J80j84K11L1k80R7J79k64J90q7J09
3024FK06j66R6m8m0J18k28jN7M1Q8m7k8n7j19J39K2k11J75n2O0l45K93r4K03l2
3050C6j02J58k48L52l08L3K30k50J83n2J22l00J33k40K34N1j33J95k5K36k70k4
3072A1K44k85J74k64k7J57k78K59P1j27J90p0J7l02J29q8J29J58j31j21J88q1
3094d7J03K9o4R1j7J06k81P0q1J11N1k7j71RJ18M9J28j80nl3m2j5J18j81j41L18
3120A6j03N8q0R5j07J54P6j23M2Q2j9j45J89k32Q9O8m8k24J83J56k46K45j48j78
3144b00N8j4L1O0J13J6j44q1K03j01K04l9N5j54k6p8Q9O1j45K77j21pj30J66L3
$$ plain form
2976 89 -223 200 -166 163 55 -100 -179 102 -19 -113 90 -72 -40 -148 184 -53 41 104 59 -17 2 -37 13 -129
3000 -129 -73 -17 46 -127 -35 -109 70 83 -89 156 -167 -164 -176 4 -180 31 62 -218 -121 58 -206 -16 -103 6
3024 6 212 46 142 94 54 172 -56 -57 0 41 129 82 54 -3 -122 17 39 -172 3 -49 11 -334 -41 -135 68 36
3050 36 -66 92 -156 196 -112 -79 151 -99 84 32 154 -146 -13 -253 -19 32 -101 94 69 305 35 11
3072 11 255 -30 144 -120 -147 10 -268 -9 62 -65 125 55 72 -230 -101 -189 -60 98 -33 -154 34 -47
3094 -47 56 85 21 112 95 201 -80 -10 -91 20 71 44 -127 -118 0 49 177 -3 -8 -41 -83 -98 20 -161 -302 16
3120 16 -87 -29 -109 -14 -121 33 109 -14 28 110 91 -54 135 -97 -8 60 12 -212 -29 127 -119 126 -22 -200
3144 -200 -142 -156 -125 -65 48 64 -80 -161 42 -59 145 106 161 7 -19 -97 -8 53 -92 185 64 57 -73 93 126
3169A26j35J56J1k07j04K06r5R2k14K21l4J31k36P1J76j71Rl04J53K20o2J08j21
3192cj67K4P5p1K77j03l6L1nj0j59J17n3R8J9M3m42K59J16J65j04j84n9J44r5
3217a23J49L3J7j18%JK6k0lM8j8ql4J15N5n8k39Q3R4r0J15r6j11J89p0J18O0l9
3245G6jK8j24K3K44j38J5n9L8M5N3l41K6J62p8j07J32k7l43L78J33l1k00K6O7
3270cj13J42j6o2J42j26q9Q7K30j12k29K76k27J13r8L9J89k79Q5OK02r1J33l40
3294a41O9j52L11j09PK5JK6m6p3L19k89J40j16R3j71k1J27m3mJ47j00J42j50P3
3319F5J83k11R4l3r5M6L5r0k05J66r1J30p0N9R6j81N4K87k12n1r8N8%K00j6k40
3345a20J24J56J05j62o8k12Q1K23n6J2k09O4Q1j07j2L53l73L26j67j25j15K07
$$ plain form
3169 126 -9 147 158 -49 -153 53 -42 50 -164 57 23 154 -82 -11 165 -6 3 -301 -148 72 10 118 -3
3192 -3 -170 -146 -71 -142 135 32 -4 27 22 12 -147 -30 -83 15 34 77 -365 -106 10 175 71 -113 -172 -28 -123
3217 -123 26 59 76 -42 -42 -41 -15 -35 -38 10 -8 -16 -50 65 120 62 -177 -94 0 -90 25 -71 -182 7 -63 55 115 76
3245 76 75 103 -21 2 246 108 123 64 102 147 200 -141 -115 47 -31 -138 -6 -33 -376 2 135 104 -96 -70 -3
3270 -3 -116 26 10 -52 90 -36 -125 -38 192 80 -149 127 -100 13 -85 -46 143 -136 -51 -45 157 66 199 -141
3294 -141 -72 -224 87 -22 -15 10 11 37 -9 -82 237 -52 88 -28 65 -106 -127 0 -43 -47 100 0 142 -8 65
3319 65 248 37 131 98 3 49 84 -6 -211 -45 -136 -6 -76 -17 79 -102 -48 239 27 -24 -122 -64 -64 136 120 -120
3345 -120 4 160 265 103 35 -177 -96 127 71 83 -126 -62 19 -88 -100 253 -120 206 39 -86 -201 6
3367Fk9k99N10l26L05k66L93j86O4j33j77k2J65n3P4L2j09N1J03Jk88L6K04K03
3391B59j67p7j77j21K76K3r1j40J76N2o1m6K19j37q9K2n2J74k6m0lkp8j34K70
3416C0k64L40p3r9L37l05rp2k3J78qo9P1j5O2o1O1N0Q1m37K16P1k37L28l09L4
3442a22J44o1OM8j12L11j46k00R1Q5o3J81q6j66j04K12R2q5k50J86K60j30J99
3465B90k39o3L3j5n9m5N1k7K16m3j83J23n9K96j48k79m5OJ34J24l2j61J44j38
3489a19K53j49q0K18J47n7l63N3J05J04j14j7R8P5J54k45P7j61p9M3R5L3q6k2
3513c7O5J39J61n42mK03r1Q8l0n7OK91j58oMj91L7P0K52k72J69N1p9J35l42Q6
3539e2K27j49n0p0P0J36r4J26k3k7n4q7n4J81j55J17K3j5j88J43K7%P0j17J02
$$ plain form
3367 6 -23 -322 188 -138 167 -99 294 108 172 39 -138 -160 5 -48 26 58 -51 0 103 104 -184 -148 56 259
3391 259 92 15 -162 -283 -7 16 -75 -215 -39 13 -48 -94 125 -12 -101 -79 -131 43 17 -23 -26 -28 -106 -240 30
3416 30 -234 106 33 -66 271 -34 -43 -115 -138 40 32 -37 34 19 81 20 81 131 212 -225 -9 62 -175 153 -156 -122
3442 -122 22 -39 -33 15 -97 214 68 -132 -41 44 -19 162 76 -90 -194 18 110 25 -225 -39 221 91 290
3465 290 51 -12 21 6 -53 -98 -47 -74 142 99 -84 39 -20 276 128 -151 -196 -190 -56 68 36 -125 19 -119
3489 -119 134 -15 -95 123 270 213 -150 -97 8 112 -2 -19 79 154 308 63 140 -21 -100 -57 38 71 -15 -37
3513 -37 28 167 328 -214 -218 -15 -106 -18 -48 -105 -99 192 34 28 32 -159 -122 -52 200 -72 97 148 69 204 -138 -52
3539 -52 175 26 -24 -94 -24 112 18 144 121 94 40 -47 -101 80 -75 42 65 50 -138 5 32 32 102 -15 87
3564H7k18M9Q3J09j20m2l9K91j41j87L9j4J70j05k4J10j17K15rn4j62q6L9N8L09
3589B41k44r0j6j80L20j19P7J68O3j81J06j02k38J58j05K83qk19K48P7k16p8K00
3612A45NOl68L54j97p4N6J38j53nK28j35j44J22j04J33Q0j0r5N8j13l7M4J78j25
3637a3Kk1KJ57k69J73j91P9M0r9J81j34J79k70M98j04j43j06k59J97j28J77J40
3660H8m6l2o9J36Nq5R1j90M8L1q7K11m4j34lK76k48%m7L46k43j61K82l36Q5N41
3686D15o04K20O1k85J97L3j31l8J88j53Q8k2j8K68k08J0j24J61O2k05J99l34J68
3709e2J08R5r4j62J21J4q0J32j0j21K51l82J91j47J10q6L0N9M4l0r8K49k60L41
3733B23j80O7p9k48L81j2k22m1J63m8m1J51k7j61K01j68jj3J05j85M9j08L49j76
$$ plain form
3564 87 -131 -82 1 110 -10 -52 -91 200 59 -128 -89 -103 67 -38 -62 48 -69 146 137 83 -79 -165 -126 -68 241
3589 241 -3 -93 -109 -289 31 -88 -11 157 220 39 145 43 -195 -37 -142 141 133 -86 162 239 23 -55 145
3612 145 150 156 -212 142 -55 -129 -73 65 -88 -93 135 0 -144 -22 -126 7 87 77 -18 40 -73 -110 -66 112 -13
3637 -13 -11 -32 -30 127 -142 31 -160 -81 -41 -140 41 -93 86 -184 314 210 67 -39 -298 -101 -229 -52 88
3660 88 42 10 -59 77 82 -3 88 -102 -54 -23 -110 101 57 -77 -80 196 -52 -52 -99 247 4 -157 125 -211 -126 415
3686 415 -189 31 92 -193 4 37 -94 -132 56 -97 -9 -31 -49 219 11 21 -103 58 120 -85 114 -220 -52
3709 -52 56 151 57 -105 16 30 -50 82 72 -49 202 -180 11 -136 -26 -112 -82 -23 21 -9 -107 142 -118 223
3733 223 43 110 31 -217 164 152 -70 -111 52 4 -37 114 87 -74 127 -41 -42 -55 50 -135 -86 -194 155 -21
3757b1j57L2M7j2J90n4m4K48k51K05j26j81K6Jk7K17n5o9L9nm7P4j01q8K43K2
3783A06j32M2NJ61j51q4K71k46Rn5K5K78m08L79l19K94o9l22K30l8P3j14j23J85
3807cL0k34R5R3k6q3J00J41p5J82k17O5M0Lj58l5R3j72J04M1K3j38J62L6J39m13
3833b07J46K70j56k32J80N3m7j85J75l4N1nr5Q1l0J43j33l9L34l38O1N8O9j01
3857A9K2p1R6l9j8qK81j92j6L6n2O7j94l7j05K84k28P1jJ24Ok8J94k59o6K5J74
3884H5j74J57q8l5j34P9p5K97o1j19K18k88k11N67k96r1L7K52p6q6j66L66q4j67
3908i3N4m0K60p3o1l91L85n0O2j07q9O0L9K1P2Q2j34P7j78JL53l36L61k24q9N
3934c3k07J6J54P6N2M3j41J20j20k8p2M9J71k41J81j4Q3k02M9K6o9R3L2Q9j70
$$ plain form
3757 -21 -178 -146 -99 -111 79 25 -19 229 -22 183 57 -124 -98 -97 -124 93 38 -31 8 3 -44 30 -71 -159 84 106
3783 106 -26 16 21 182 31 -53 218 -28 -19 -74 -49 229 -179 200 -119 175 106 -216 14 -24 49 -65 -188 -3
3807 -3 27 -207 -112 -19 -45 -128 -28 113 38 220 3 68 108 111 -47 -82 11 -161 -57 -16 7 -131 31 67 206 -207
3833 -207 -61 209 53 -179 1 54 7 -178 -3 -37 14 9 -86 -5 -35 108 -25 -64 270 -68 -7 51 120 19
3857 19 41 -30 66 27 9 1 282 90 74 110 58 125 -69 -106 -211 73 -155 -84 -85 39 45 17 211 -48 -114 -89 85
3884 85 -89 68 -20 -55 -189 -110 -185 112 51 -68 150 -138 -349 218 -78 -169 -132 120 44 -42 -208 158 74 -93
3908 -93 -39 -79 181 108 47 -344 41 -9 53 -54 -143 -83 -44 -23 49 131 -3 74 -104 -103 250 -86 275 51 -38 -33
3934 -33 -240 -224 -70 6 58 101 -40 80 -40 -68 -140 -91 80 -161 20 6 89 -113 -64 -38 -107 -14 18 107 -63
3959f3%N2k1Jj6J67j16R9j51K37j67L9k05J76J48k83J56j90J78j46N3j83%J0Q4
3984a41J55k27R0o4J9K19p8K25j13j73j12M5J51q4J16j3j12J96J16m79K95l9k99
4007c07Q0L6K60k90J18L04j08j47L5l4O9J85j55j77J73P9q8N0J42l34J74J26j83
4030HL1o7N9k3K8R8p2j36J09j75j42J74O6j46K10j53K16P2j54J75l01n7K98j06
4054A2J05q2P8L4j81K2m7l8J48k08OJ47k8k5J94r6j22k8m6K25j14kl8J3K18k50
4080a03J66k84J34J21j81j10L52L5O4k97K08Np7p7P6k90L65R6k27oK3J19P9k14
4104b3j83K8K32k16K07q9j22J98q5j69M39j22k29K72j51K2kJ04J17j39k6J20k14
4127c1k0m3k9K81l19K96j23J3j70J0j9j5k4P7J27J80k80L3L2j06J42j7Q1l04L00
$$ plain form
3959 -63 -63 -11 -32 -31 -47 120 4 103 -48 189 22 61 -144 32 180 -103 53 -137 41 -105 -52 -235 -235 -225 -141
3984 -141 14 -213 -123 -187 -168 51 -27 198 85 -88 -200 -155 -4 -88 28 15 -97 99 215 -264 31 -8 -307
4007 -307 -227 -191 69 -221 -103 201 93 -54 -19 -53 16 201 46 -131 42 121 33 83 225 -109 65 191 8
4030 8 39 -28 31 8 36 134 62 -74 35 -140 -282 -108 -42 -188 22 -131 85 157 3 178 -123 -180 118 12
4054 12 117 35 113 147 -34 -12 -59 -97 51 -157 -151 -4 -32 -57 137 41 -81 -109 -155 70 -44 -46 -84 -71 147 -103
4080 -103 63 -221 -87 34 -147 -257 95 130 194 -103 105 110 33 -44 32 -258 107 203 -24 -30 -7 112 191 -23
4104 -23 -206 -178 54 -162 45 -44 -166 32 -53 -222 217 95 -134 138 -13 9 7 111 228 89 63 183 -31
4127 -31 -51 -94 -123 158 -161 135 12 25 -145 -135 -154 -169 -193 -116 11 191 -89 -56 -24 -130 12 -5 76 -228 72
4152G2k13J66K0J01j64K10j43Q6j10J19nr4l39J79J04r6M43k19k59K07N2j50k94
4175c27K20k8J27j15J40j68R8J84j42J79j71N1j27J8J32j72J18pn0K08n6k27L03
4198A88q0j18j31j83K56J8j00J29k2J0j03J60O4k15L20k16K30j84J83k14R6k32
4220a44N7K01J35k42j2L9n5J66k56K53q4rq9k2j30OK05l2O7k0r1oN6j7K34j79
4246C1Nk00n3M19j41M0j93J91j17qJ16r1J4r3N7O3j02J19j98K68K8j78K49k20
4270FJ00p2r0P7R3j81j54K14J7J29j62O8j10J53j01L6J36k51J03K55l12J61N7
4293A72j13r7L7n6J97l52L37q3J31l63J24J22jl3j12J12L2j3J21k25j55L03j41
4316e6O9J47k79n0N9J84j67J49m1j17k1K7j50K28j31K37q9m2m5K2n9K78K9l21
$$ plain form
4152 72 -141 25 45 146 -18 192 49 135 25 144 139 45 -294 -115 -11 -107 336 117 -142 65 117 -33 -327
4175 -327 -107 -135 -8 -123 17 -151 -53 131 -11 168 -3 48 -79 -61 71 -101 17 10 -40 168 112 -115 188
4198 188 108 -10 -141 -324 -68 -50 -150 -21 -43 -33 -136 24 88 -127 193 -23 207 23 206 -8 88 -144
4220 -144 -87 114 249 7 -5 34 -21 145 -111 142 58 49 -40 -62 -192 -186 19 -13 54 34 -57 -63 -7 -24 210 31
4246 31 36 -164 -217 202 61 101 -92 99 -18 -26 90 -1 13 -80 -23 40 -62 57 -141 127 155 -23 226 6
4270 6 106 34 -56 21 114 -67 -221 -7 10 139 -23 45 -65 88 -13 23 159 -92 11 266 -46 115 172
4293 172 59 -38 -1 -57 140 -212 125 42 173 -190 -66 56 55 22 -90 22 54 41 162 -63 -218 85 -56
4316 -56 13 160 -119 -169 -110 74 -93 56 15 -102 -123 -96 -246 -18 -149 88 -1 -43 -88 -66 -125 153 182 -139
4340a39R9K2J4j7J12k51J28O5j49Q9j1J52j10k91K35k44L83k5q6L7K7K2k6m6N4
4365D4j15M1j35J18J43j34j02K33m6O7q9j30J84j10J29J35j13m1m4J47l41K10
4387E1j40R7R7l6J73j06r9j68J64O6k81K12j10J17J50m13K18J9j70J50L8k13m0
4410b24K31Q8k51q7J65j47K76n1J39J1k22Q9m5N0J11J18l07K48J9k35J05k15Q4
4433e0rK23j46J06r0k93J83J32p7q3J86j23pmol5L3k9N6Q1n8l6j61K06J27j67
4459d1r1J78k23Q0J88k1j20ONj04M7q2J70P1j28n4q9L43k6k26OJ04j04N0L3O3
4485C5O4l17J57K41j12m3k9m7J04k00J24J07j14k2j30M6M7M0K03j96k10j43M54
4508E9j66J11K31k55k06Q3K44j25O3K00L1k12j54O5R5O2q9n0LP5k19J75J86l48
$$ plain form
4340 -139 -40 -18 -4 -21 91 -160 -32 33 -116 -27 -38 114 4 -287 -52 -296 87 62 -24 13 40 62 36 -10 44
4365 44 -71 -30 -165 -47 96 -38 -140 93 47 114 25 -105 79 -31 98 233 120 79 35 182 -159 51
4387 51 -89 8 105 69 242 136 37 -131 33 99 -182 30 -80 37 187 -226 -8 11 -159 -9 29 -184 -224
4410 -224 7 95 -156 -243 -78 -225 51 0 139 150 -72 17 -28 22 133 251 -56 192 211 -24 81 -134 -50
4433 -50 -59 164 18 124 34 -259 -76 56 -21 -104 82 -41 -48 -52 -58 -93 -60 -89 -33 48 -10 -46 -207 -1 126 -41
4459 -41 -132 46 -177 -97 91 70 -50 -44 -39 -143 -96 -178 -8 63 -65 -119 -208 135 109 -117 -111 -7 -111 -61 -28 35
4485 35 99 -218 -61 180 68 25 -4 -51 53 -147 -23 84 -30 -52 -182 -136 -89 -49 154 -42 -252 -395 59
4508 59 -107 4 235 -20 -226 -143 101 -24 39 239 270 58 -96 -31 64 126 37 -13 -10 65 -154 21 207 -141
4532a41K59j47J18j05l3j36J86Qk34J23J23J2J03k56K22k90M63l43J25q1N6j13
4554h1j27L86k28O5O7o5M5q6K6K28l47J05j58Q2R1K3l9j3n2K74j64J04j82j18
4578a64L88m34J69J54jj72l4J03O8rj2J2m2j98Q6M0n5J10O0N5j52O2j61K34K4
4603A31J3p9j15J8J7J25k86K09p7L01k48J7j0O8r2P8k4k5J59k46J05j42J51q5
4627c7K5j71J70J62k32J67o7J13k38K61M2k94j04J70RR9j36P0j29K5l5p9K21j75
4651a63K51J7o3J76k70m7J69l0J96l67M8L4m2l0K39r1LP6R5o8n1N5K7k57l4Q1
4677d6pQ6m3N0l4J29l04J00J11k6O3o2nL4J25k29R8o5n4M0m7J37N0k16K43j27
4703Aj60J92J1Q3j16k12J29J24m7j02J95J1j49L6J27k40J11N3n4Q7N4m3j05Q8
$$ plain form
4532 -141 118 -29 89 -16 -49 -185 1 9 -225 -102 21 33 136 -120 102 -188 275 -68 57 -24 32 -81
4554 -81 -208 178 -50 15 82 17 62 -24 2 230 -117 -12 -170 -88 3 26 -13 -26 -78 196 32 136 -46 -164
4578 -164 224 -210 -41 113 112 -60 -94 9 77 68 56 68 26 -172 -86 -46 -101 9 69 124 -28 34 -127 107 131
4603 131 144 65 -50 -32 -15 110 -176 33 -44 257 9 26 16 84 -8 70 46 21 180 -66 39 -103 48 -37
4627 -37 -12 -183 -13 149 -83 84 17 130 -108 153 195 -99 -203 -33 -24 75 -61 9 -120 -95 -130 -209 12 -163
4651 -163 88 105 42 218 -52 -99 70 40 236 -131 -83 -49 -91 -121 118 27 30 106 201 133 82 137 164 -93 -127 -46
4677 -46 -53 33 -10 40 6 135 -169 -69 42 16 79 17 12 46 171 -58 40 -25 -79 -39 -86 51 101 -115 128 1
4703 1 -159 33 44 127 11 -201 -72 52 5 -97 98 109 -40 -4 123 -117 -6 47 -7 80 134 91 -14 74
4727G4q3K7J9J11k97L7P5k98L22J40p5q6M3p2Q9O0q4j86J58L4k25J70m4J3j16
4752a94K24j20K14J23k54j51O4K28l8Kk77K23j50J70L6j76n0K95k84j1L2J48j8
4775C6j45R6K1p8n3J14M8N6l22K26LO3j59J53L0l2j31J29r5j5m6j74J36L31k74
4800h2L7o8pl6P8K30j51J06M7l94K46l11L12K55l16J77j14P7l7k9k34M22k70J23
4824F1j94o2R0O0J12o1qJ65Oj71Q7q3p4K6J91k8j58p3J83p1k20K36K9l34M53k97
4850a35L57l69R9m4pJ62R7p0o0J27n6j23J2J25j01j70P6J81l7J7k20J33O7j42
4874h1Q4M8J64m03L02Mk93P6p1J32J56l44K51p1l4J20m7K6j47K02j22n1j12L26
4898A15j73K52k15Mj03j01O2J52O9j83Q6J66k30K0J5o7L61j36m7k52K84n5J09
$$ plain form
4727 74 -9 18 37 148 -149 -112 -37 -335 -13 127 52 -34 9 -63 26 86 2 -184 -26 8 -217 -47 -91 -78 -194
4752 -194 30 -90 124 247 -7 -158 -94 134 96 98 -179 44 -106 64 100 -76 -126 169 -115 -126 -94 54 36
4775 36 -109 -13 8 -70 -123 -9 39 95 -227 -1 2 65 -94 59 89 57 -74 55 -40 -55 -101 -275 -139 192 -82
4800 -82 -45 -113 -120 -156 -78 152 1 107 154 -240 6 -305 7 262 -54 123 9 86 49 20 -214 208 -62 61
4824 61 -133 -195 -105 -45 67 6 -2 163 169 -2 85 2 -72 -46 145 117 -41 -114 69 -2 -222 14 43 -291 162 -135
4850 -135 222 -147 -48 -92 -99 63 160 90 30 157 101 -22 -10 115 14 -156 -80 101 64 81 -139 -6 61 -81
4874 -81 3 51 215 -188 114 118 -175 -99 -170 -38 118 -226 25 -46 -80 40 -7 19 -128 74 -48 -99 -211 115
4898 115 -58 194 -21 -17 -120 -221 -159 -7 62 -121 -35 131 -99 -79 -64 -131 230 94 47 -205 79 24 133
4921A33j27J10k47J92o3j40Q4p8K59q1J94k06op6J8j69J88N3n4M9k5J15j47K59
4945B35k66P7j14k3q5K33L5l73L60j63n0K26k45K45k73K05p1M0K22k06M0l8J5
4968B6R7j2j58O5M0j66L6J61p1j01J25j72K02j40J43j6k89M15k21K05l12P6J15
4991D8k57L22j23K9L7Q5k74m1P8K35k52N5J21K8m8j27p8N0P2m7J54k12K67J3k16
5016h1J30J88k83R6O2k8p4j10K20o5k3k7RQ4j0j86P3K9Q9p5J15k47K4K7K65j54
5042D8j54J04j16o0J52J82j17k28K3L27k30K02k60KJ66j15J22j70M11l33J66j6
5064A06j93L71m29K85m9q8p4P8L42j66j66Q1l6l6m3N3N9r9j01P7j96M32j19k10
5088a21J98o6J95q2k27o9J88m3J84L1k27P8l58L29J46o5o8nL0L7r9K67k18O6j34
$$ plain form
4921 133 6 116 -131 61 -2 -142 -58 -136 123 42 236 30 24 -52 -34 -203 -15 38 -16 33 8 123 -24 235
4945 235 -31 46 -68 -91 -176 57 92 -281 79 -84 -134 92 -153 92 -181 24 -47 -7 215 9 49 11 26
4968 26 123 111 -47 18 58 -108 -72 89 18 -83 42 -130 72 -68 75 59 -230 185 -36 169 -143 -67 48
4991 48 -209 113 -10 19 56 141 -133 -174 -96 139 -113 -58 63 91 43 -84 -162 -112 -40 -87 67 -145 122 135 -81
5016 -81 49 237 -46 50 112 84 10 -100 120 55 32 5 14 98 88 -98 -25 4 93 18 133 -114 -90 -63 202 48
5042 48 -106 -2 -118 -178 -26 156 39 -189 -166 161 -69 133 -127 -125 41 -74 48 -122 289 -44 122 106
5064 106 -87 284 -145 140 91 3 -71 7 349 183 17 98 62 26 -17 36 95 -4 -105 -28 -224 208 89 -121
5088 -121 77 11 206 124 -103 -172 16 -27 157 188 -39 39 -319 10 156 91 23 18 48 85 -14 253 35 101 -33
5113c3J05q8J51k12j66J89om6J42r4P1j06M4j0k4J34L0m8J3j54R0J06lK3r1j74
5139a57K88j80j12J39K11l59n3L47j69K5j24J19R4J64m19J00N4r7q2K39j25K50
5161A53J1K6k22J01j17M3Q2J00r2n3J11k03R7J1j00j32J13J09J37j55n4N4mj33
5185a17M1L62k66k2j80O4l0J98m4p7J2p3K3O7Q9j02l5N8j22K45n5k4K7j3r3L3
5211c4J2N7k5j07K31j70mJ15J0P8j83k81K43J51j44lJ04n5k3PMK92l11J88n0M2
5237A44M7j45k3L6m6L54m58J04M6j21J58pP0r0p9J28k3ml15L92k88J62m6J23j46
5262b7J1l7J0n3N5L01n6Pk21o0J65k57K15J3k63K76k26jK86k75MR6R2J2j44N4
5288b3j34K01k12J5M5J41k3p0j9P3l18K84j21p3K79J08j67J01j12J68q5M1rj90
$$ plain form
5113 -33 72 -16 135 -77 -243 -54 -60 -106 36 -58 13 -93 -49 -59 -83 51 81 33 46 -108 -18 88 85 108 17 -157
5139 -157 131 -49 -161 -22 189 -170 -223 124 -45 -20 -144 -25 69 233 -186 -86 -32 -129 -211 28 -97 153
5161 153 164 190 -32 69 -48 -5 77 177 85 32 143 -60 37 48 -52 -184 -71 38 175 20 -34 20 16 -117
5185 -117 -76 286 20 -2 -182 -118 -148 50 6 -71 -59 -132 -109 -42 47 -55 -90 -32 -154 91 36 12 39 26 -67 -34
5211 -34 -22 35 10 -97 134 -36 -40 75 85 163 -20 -301 -58 93 -51 -54 50 -5 -28 -21 -17 275 -36 152 102 144
5237 144 191 46 23 59 13 367 -91 13 59 -62 96 89 159 69 -10 118 95 91 -224 168 -120 42 -4 119 -27
5262 -27 -16 -53 -43 -96 -41 260 204 211 -10 -70 95 -162 53 66 -197 79 -147 -148 138 -137 -133 -37 55 67 -77 -23
5288 -23 -157 44 -168 -153 -108 33 10 -60 -79 -6 -324 -40 -161 -234 45 153 -14 87 -25 143 58 99 90 -100
5312a00M9J00O1lj09l8j13J45K5j37nj53K14l1J21J19k64K06m5J09N6k73P3L0
5336C7j06J94N7l6P9k78o7L32k67N9o7K15p6j11R2J13n0k41O4LK05o1m7j10K45
5361A78j91Pj47J58M7j23L5qj06K68Q5n2l21J59qK05j18j22Q6j1m8M4j24r3J15
5386h5r1K47N1k61N9L6K28k29J62j29j39R2rN3p2J80k57QO4O7k1L9J9j75K69Q8
5412A94l17M8Nm6n6M3K20k89J09m2K11q2j29K59j77k48K5L21Mp0Pj6R0j27K0K8
5438a5j42K66rJ70l93K61o2j03J6m5J91m0N6j3k74m6K70P9l47J12j02L24J1k58
5462i3L12k77k63L50lK69l40J25j81M3N1r4K2k20M73%j17O3mn1r8M7J34n4k68
5487a74L44k2j93%J56j09K28k17j28J27k10J30J7l7J56o6j34R2L2R4j47J85j57
$$ plain form
5312 -100 -51 49 110 107 -2 -40 -153 -8 17 -120 -125 -278 -64 -95 26 145 -119 87 42 151 207 -66 7 37
5336 37 -69 125 182 146 225 -53 -120 212 -55 4 -63 152 76 -35 57 170 120 -121 -57 -54 151 90 43 -67 178
5361 178 -13 -6 -153 5 52 -71 -36 -44 -150 118 203 151 -170 -11 -19 186 68 -54 32 21 -27 17 -107 -200 -85
5386 -85 -176 71 122 -139 -80 -44 184 -45 117 -12 -151 -59 -68 -15 -87 93 -164 -156 -92 -25 -46 -7 12 -163 106 194
5412 194 -123 -75 -70 -116 -172 -129 91 -198 -89 -131 80 -2 -131 128 -49 -297 -272 49 53 -17 -10 -26 64 -63 -43 -15
5438 -15 -157 109 100 270 -123 138 76 -27 -11 -56 135 95 151 138 -136 -182 88 167 -180 -68 -170 154 165 -93
5462 -93 219 -58 -321 29 26 295 -45 80 -101 -58 -7 -101 -79 -299 174 174 57 120 116 65 -33 14 148 94 -174
5487 -174 170 148 -45 -45 111 2 230 13 -115 12 -198 -68 -51 -88 68 2 -132 -40 -8 86 -61 124 -33
5510c3J43l26K71Mm3J35k76J12j14J94j14P3j36j9J27Q9r9l8p4J39l1J36n2j29
5534f1k3L0n2K47j81k81M20l09J57j08K04L6o1J01o6k14K2L19l00J8J09no9K2
5558d5j6K00K4k79R0j91J51K79m81K63k9M8R7j61K46j42p8J94p0m12L23j83K86
5581A14k27j84K91l3MJ66j80J30P7j95j4j01K64k41R2J53j88R0O6J46m16J55L5
5604Dn4J38K0k04J82J8o4k63K98N0n7l2l9k2lJ98q0J29j79J10q5K5l7j71m4J35
5630b7J76n5n0K09l50J15k3r9Nn4J63rm7K89k34J55l76J19qR5j34J89J10j26p8
5655d5OJ67k3%j92J68k77Q9J14j22J70m2j20J78j45Q9j45Q0L0o1R7mj38R9l1j36
5681a94J60rJ65J20m18K22j80k9K29J42l88K08p3Q2M8j73MPJ18j86K20q4l0J30
$$ plain form
5510 -33 110 -216 55 59 16 151 -125 -13 -127 67 -47 26 -110 -129 -2 87 -12 -50 -124 15 -16 120 68 -61
5534 -61 -84 -54 -106 141 -40 -321 99 -210 -53 -161 43 79 18 119 53 -161 -139 180 -120 -102 7 2 -67 -45
5558 -45 -61 139 163 -116 -26 -217 -66 213 -268 -5 -34 14 111 -50 196 54 -24 170 100 -312 11 -172 114
5581 114 -113 -297 -6 -39 -35 131 -49 81 158 -37 -51 -152 112 -129 -37 116 -72 18 84 230 -186 -31 4
5604 4 -50 88 108 -96 86 104 40 -223 75 125 68 36 -3 -25 -28 170 90 219 40 150 65 90 53 -118 -162 -27
5630 -27 149 94 44 253 -97 18 -5 -104 -99 -153 10 1 -46 243 9 164 -212 -93 -101 -6 -140 49 159 33 -45
5655 -45 -39 128 105 105 -87 81 -196 -107 7 -115 55 13 -107 71 -74 15 -130 -50 -20 -81 16 12 -126 -27 -58 -194
5681 -194 -34 -43 122 242 -176 46 -134 -163 66 208 -180 28 -45 37 85 -88 -84 -77 41 -145 75 -9 -39 91
5705I1pk41N2K36j18Mk9K06j89N0k58P5L7j2K55m27M95l24L8k1J28j02J11RO2
5730A21p6m7R6j57NQ8O0J4q0J9R4k16J62q0j0O0j6N3J37k62l6J8J28L0o0p7J14
5757H2j15k9L8MN0J47j90K45k20n9j18K14p1q1qJ28k0p6m8J65j26J61n9J97m38
5782b27K27j10N2J1j86J98l8n5lrJ83p1J02j32Q5J15k41P7M5r9K55J0j89n3J90
5807A37L6j88J23j67o6K56j56lO1k11O5o0L02j17k5j04K0Q5p9J50M0l2q4l8J13
5832E8k1j27J29m8p7K2J90k50J63L6l2%O1l55J18k7M4J71k33O4m1K82R6l36q6
5857a99L49j72j49L27P3k78J39j1o9j78J15r5J26NJ24j34k11K63l2Q4j43j20J17
5880f9J45j65MJ12p1lNK9K4j8K8j72q4J77K30m7j49J29J5kM3l19N1J43J00j08
$$ plain form
5705 91 84 -157 -105 131 13 17 -12 194 5 55 -203 -128 -91 -103 152 -275 220 -104 -66 -87 41 -61 50 59 121
5730 121 45 -2 94 -63 -58 30 90 104 24 43 137 -79 83 3 -7 53 37 90 227 -35 -71 -53 75 105 45 -32 82
5757 82 -33 -62 -24 -20 30 177 -13 232 12 -47 -165 49 -22 -103 -111 17 -3 -79 -127 38 -88 73 14 211 -227
5782 -227 0 -110 -58 -47 -233 -35 -73 -128 -131 -140 43 -28 74 -58 27 142 -99 -22 23 -76 179 189 0 -53 137
5807 137 173 -15 108 -59 -125 131 -25 -28 33 -178 -113 -173 129 12 -13 -117 -97 -12 -91 59 99 67 -17 -55 58
5832 58 37 -90 39 -9 -86 -64 126 -124 39 75 43 43 104 -251 -133 -160 -116 55 -178 -114 -155 127 223 -113 -199
5857 -199 150 -22 -171 156 229 -49 90 79 10 -168 -53 -148 -22 -17 107 -27 -238 25 -7 77 -66 -186 -69
5880 -69 76 -89 -85 27 -44 -47 -42 -13 11 -7 21 -151 -235 -58 172 125 -24 105 120 118 161 -158 -107 36 136 28
5906B8k72M48p4k30K67R2k67N4P6m3K3j34QJ50K8k70N4L18j85j24m8l4L4j07J85
5931b3J36j19j52K1J5L1l5P7Q4k2n7rK37q4j26J16j75O4M4k33m1M8M14k90J25
5956D6LJ47k67K4J07J77n8k62M7j39L28j95Rq2l6L6l4O9N2P6j50j0N3r3J4J68
5982C0PJ16j45P9J18j13j13l0R2j30J24P1j44j4L2M9K43q3k24o6K44j27j80J72
6006HJ08m3k8K4K0j23j4N2K23k26n7NM7l5J0Lk68M12Op9j74L9J10J49l07K37m12
6033c13O12l80l1K54n0j80N0K80j67l0K3%Q5o0j81j09J67q9R7j11Q0p9K00j08
6057d0P2j86L05o3OkM7P5k58J55k01pn4L40j11j28L9o1K29j18j29K01r7l05L02
6082A1K9L9j89J82J28j73j20k7K04k67J86L7J82l08K46j88P4j93J03L3l2L17l93
$$ plain form
5906 28 -244 204 130 -100 167 259 -8 46 122 79 102 -32 -24 126 154 -116 -62 256 71 -53 -101 -135 -101 -208 -23
5931 -23 113 -6 -158 -137 -122 -91 -126 -49 35 13 -44 -53 184 100 -26 90 -85 -21 23 -210 -251 -203 211 -79 46
5956 46 49 196 -71 -47 60 237 179 -83 -36 -175 153 -42 -33 -115 -151 -115 -149 -80 -28 48 -102 -112 -59 -152 -138 30
5982 30 37 153 8 87 205 92 -21 -51 41 -89 35 106 -38 -52 -20 29 272 189 -35 -101 143 16 -164 8
6006 8 116 73 45 69 89 -34 -48 4 227 1 -56 -51 -4 -39 -29 -26 -294 118 124 45 -129 -90 20 169 -138 99 -313
6033 -313 299 -81 -112 142 92 -88 -38 242 75 45 68 68 153 93 -88 -197 -30 -119 -22 -133 -53 -132 68 -40
6057 -40 32 -154 151 88 94 92 139 214 -44 111 -90 -97 -151 189 78 -50 -11 -72 157 39 -90 111 14 -291 11
6082 11 40 79 -110 72 200 27 -93 -120 84 -183 3 40 222 -86 160 -28 46 -147 -44 -11 -43 274 -119
6105a19L35j49k33K53l7p3k3J40k02J73k6j45J37J59k54J0J16l35J01K06q8j20
6127a74J93L2L7r6l5P9p5K76k39j2K17j47K6j14K8l8J20k06J6P3Q2j62J03J37
6151A21k76K94k00M21k59k00J01J23l04Q6k7J35J93k16J15J14k13K7%J09k26M16
6173C34k79K00j59j28n1K22l58K38M0j12J13j27J19Nj81O1L1O4j45P1K2oJ9p8
6197h5L4Q1J26k28K14j64Kk4J44l19L14J17l35LL95k38M5j09J35lL0j48KN9K10
6222B58k81J7K9l03K92k37K73qL11k57jl0r8q7J96l8P0J01L6j94n2J8l39K66J6
6247d2p2n1K42o7rpJ85j14l29M18k06J58j87j3J75l0lj10J40J14k29l4J50k52
6271a73J94K0Nr3m1J96j28o1l2J56r0J55j73J7j17K48k21P3J46k55K46R1kr9o5
$$ plain form
6105 -119 216 67 -166 87 50 -23 -46 94 -108 65 39 -106 31 190 -64 -54 62 -273 -172 34 -54 -174
6127 -174 19 51 88 -8 -43 36 -39 237 -2 -14 203 56 82 -32 -4 -42 78 -128 -112 -39 43 -119 -16 121
6151 121 -155 139 -61 360 101 -99 2 125 -179 -93 -120 15 208 -8 107 221 8 35 35 144 -82 334
6173 334 55 255 96 -32 -83 139 -219 19 59 -53 60 -67 52 57 -124 -63 -32 32 -113 -42 -20 -26 -7 -85
6197 -85 -51 30 156 -72 142 -22 -20 -44 100 -219 95 212 -123 -120 275 37 82 -27 108 105 135 -13 -11 48 258
6222 258 -23 -6 23 -280 12 -225 48 40 351 94 93 63 -35 -122 74 36 106 207 243 49 -3 15 -324 -58 -42
6247 -42 -114 -165 77 10 1 -6 179 65 -264 154 -52 106 -81 -94 81 51 48 -62 78 192 -37 -71 79 -173
6271 -173 21 41 46 -47 -88 108 -20 -81 -113 43 -47 108 -65 -48 -165 83 -138 -65 81 -174 72 163 161 62 -3
6296cR0R2o1r9J36j95J43k12Q4l3M3R3J19qk37J85N8l2k27P2p0P0pj10J17j10
6322a02L30r1j76J80j77k5J74k35q2L41pj49p7L09j84J1j3rJ01k74O3J85j75J14
6346C2Q3j7Qj33j66K2L59q5p9k2l8k23R1J64oq6K47l21J79J9k22J95kQ9r6K08
6372B00k51J23k67K30r4K1M1j6l7R6j51K30Lk76J35j53R0M4J99k22J50L7r3O3
6396A02j3j71N3p0J67r6L4k52K95j79J50R6K6l8j60q0NJ62jP5Rj86J22m3m4M0
6422Ck5N1K3J88j67R3k02J25r2M4j01lJ17M0r9Q6j65M9L04j91k47K01k48K86K1
6447I1j90J2J52o7n1J21O0p6p2J12K7O2k4k04M1j02J61j53K14L3j00j05L7K3J07
6472A09j81m2K53R3k65K69k26q4J77j40R1k93J02L60k48K75j33j11K44l7k80j25
$$ plain form
6296 -3 87 179 118 19 155 -40 103 -109 -25 -58 -15 78 197 189 -48 137 195 163 -64 8 -62 8 1 -109 8 -102
6322 -102 228 137 -39 141 -36 -61 113 -122 -204 137 130 -19 -96 213 29 40 27 18 119 -155 -92 93 -82 32
6346 32 115 98 106 -27 -193 -171 188 103 24 2 -36 -259 -168 -4 -10 -96 151 -170 9 28 -194 1 -1 88 -8 200
6372 200 -51 72 -195 35 -59 -38 3 -13 -50 46 -105 125 128 -148 -13 -166 -76 -32 167 -55 95 132 39 102
6396 102 89 -82 -29 -99 68 -28 6 -246 49 -130 20 116 142 104 -56 -136 -131 31 30 105 114 -72 50 7 -37 3
6422 3 -22 29 52 240 73 166 -36 89 -3 41 -60 -63 54 94 -5 81 -84 -35 269 78 -169 32 -216 70 91
6447 91 -99 -87 65 -2 -53 68 128 52 -20 92 119 181 157 -47 -6 -108 53 -100 114 147 47 -58 -21 2 109
6472 109 -72 -114 139 232 -33 236 10 -74 103 -37 54 -239 -137 223 -25 250 117 6 250 213 -67 -192
6494a92K15k60L74j71l4lKJ1J07J53j38j8k41J4J11lN7N3k48K61j27L69k61j0
6518B1m7J31jk33%j09M32l19r2J93j98J60j8Q3J53j52Kj95J35Q5j9q7J14j52L1
6543h2L9M6j63J65J86j76lnL7j58N6J73m2K6p4m8o5Q3j31J23J98k47j43L35j17
6568A3j27P5r9K13j40n8j11L25j22j77R0j0J03O6r9O2K00j61m6j50J39R1j16R
$$ plain form
6494 -192 23 -237 137 -34 -68 -71 -69 -58 49 202 64 46 -195 -181 -70 -73 -16 37 -211 50 -77 292 31 21
6518 21 -26 105 104 -129 -129 -238 194 -125 -217 -24 -222 -62 -80 3 156 4 6 -189 -54 31 12 -75 39 -113 -82
6543 -82 -43 3 -160 5 191 15 12 7 44 -114 -58 115 73 99 25 -23 -88 -5 -136 -13 185 -62 -205 130 13
6568 13 -114 -39 -138 75 -65 -123 -234 91 -31 -208 -118 -128 -25 41 -58 4 204 43 -3 -153 -14 77 -39 -30
$$ [...]
8191b60
##END NTUPLES=NMR FID
##END=
