##TITLE=1H_DE-80H_X3
 200.13MHz, d2o
 8 sc
 
 19ns.26.2.2025
##JCAMPDX= 6.0         $$ Bruker NMR JCAMP-DX V2.0
##DATA TYPE= NMR FID
##DATA CLASS= NTUPLES
##ORIGIN= UXNMR, Bruker Analytische Messtechnik GmbH
##OWNER= pz
$$ XWIN-NMR		Version 3.5
$$ Thu Apr 10 14:04:16 2025 Russian Standard Time (UT+4h)  Yarkov@DPX200
##.OBSERVE FREQUENCY= 200.1313
##.OBSERVE NUCLEUS= ^1H
##.DELAY= (6, 6)
##.ACQUISITION MODE= SIMULTANEOUS
##.ACQUISITION SCHEME= undefined
##.AVERAGES= 8
##.DIGITISER RES= 18
##SPECTROMETER/DATA SYSTEM= spect
##.PULSE SEQUENCE= zg30
##.SOLVENT NAME= CDCl3
##.SHIFT REFERENCE= (INTERNAL, CDCl3, 0, 14.3821)
##AUDIT TRAIL= $$ (NUMBER, WHEN, WHO, WHERE, WHAT)
$$ ##TITLE= Audit trail, XWIN-NMR		Version 3.5
$$ ##JCAMPDX= 5.01
$$ ##ORIGIN= Bruker BioSpin GmbH
$$ ##OWNER= Yarkov
$$ C:/Bruker/XWIN-NMR/data/yarkov2/nmr/H-C/1/audita.txt
$$ ##AUDIT TRAIL=  $$ (NUMBER, WHEN, WHO, WHERE, WHAT)
(   1,<2025-04-10 14:02:09.39 +0400>,<Yarkov>,<DPX200>,
      <created by zg, POWCHK disabled, PULCHK disabled
       configuration hash MD5:
       00 E9 B6 7A A2 85 ED C7 34 08 36 98 17 FE 4E 26
       data hash MD5: 16K
       C4 1E 00 4E 6C F9 07 6A CF 8C E8 E8 6B C0 2E E5>)
$$ ##END=
$$ 
$$ hash MD5
$$ D7 CB 48 32 10 75 46 BD 76 EC C0 ED 1B 41 79 E5
##$RELAX= 
##$RELAX= 
##$RELAX= 
##$RELAX= 
##$RELAX= 
##$RELAX= 
$$ Bruker specific parameters
$$ --------------------------
##$DU= <C:/Bruker/XWIN-NMR>
##$EXPNO= 1
##$NAME= <H-C>
##$PROCNO= 1
##$TYPE= <nmr>
##$USER= <yarkov2>
##$AMP= (0..31)
100 100 100 100 100 100 100 100 100 100 100 100 100 100 100 100 100 100 
100 100 100 100 100 100 100 100 100 100 100 100 100 100 
##$AQSEQ= 0
##$AQ_mod= 1
##$AUNM= <au_zg>
##$AUTOPOS= <>
##$BF1= 200.13
##$BF2= 200.13
##$BF3= 200.13
##$BF4= 200.13
##$BF5= 200.13
##$BF6= 200.13
##$BF7= 200.13
##$BF8= 200.13
##$BYTORDA= 1
##$CFDGTYP= 0
##$CFRGTYP= 5
##$CHEMSTR= <none>
##$CNST= (0..31)
1 1 145 1 1 1 1 1 1 1 1 1 1 1 1 1 1 1 1 1 1 1 1 1 1 1 1 1 1 1 1 1 
##$CPDPRG= <>
##$CPDPRG1= <>
##$CPDPRG2= <>
##$CPDPRG3= <>
##$CPDPRG4= <mlev>
##$CPDPRG5= <mlev>
##$CPDPRG6= <mlev>
##$CPDPRG7= <mlev>
##$CPDPRG8= <mlev>
##$CPDPRGB= <>
##$CPDPRGT= <>
##$D= (0..31)
0 0.7 0 0 0 0 0 0 0 0 0 0.03 0 0 0 0 0 0 0 0 0 0 0 0 0 0 0 0 0 0 0 0 
##$DATE= 1744279328
##$DBL= (0..7)
120 120 120 120 120 120 120 120 
##$DBP= (0..7)
150 150 150 150 150 150 150 150 
##$DBP07= 0
##$DBPNAM0= <>
##$DBPNAM1= <>
##$DBPNAM2= <>
##$DBPNAM3= <>
##$DBPNAM4= <>
##$DBPNAM5= <>
##$DBPNAM6= <>
##$DBPNAM7= <>
##$DBPOAL= (0..7)
0.5 0.5 0.5 0.5 0.5 0.5 0.5 0.5 
##$DBPOFFS= (0..7)
0 0 0 0 0 0 0 0 
##$DE= 6
##$DECBNUC= <off>
##$DECIM= 32
##$DECNUC= <off>
##$DECSTAT= 4
##$DIGMOD= 1
##$DIGTYP= 9
##$DL= (0..7)
0 120 120 120 120 120 120 120 
##$DP= (0..7)
150 150 150 150 150 150 150 150 
##$DP07= 0
##$DPNAME0= <>
##$DPNAME1= <>
##$DPNAME2= <>
##$DPNAME3= <>
##$DPNAME4= <>
##$DPNAME5= <>
##$DPNAME6= <>
##$DPNAME7= <>
##$DPOAL= (0..7)
0.5 0.5 0.5 0.5 0.5 0.5 0.5 0.5 
##$DPOFFS= (0..7)
0 0 0 0 0 0 0 0 
##$DQDMODE= 0
##$DR= 18
##$DS= 0
$$ [...]
##$SUBNAM2= <"">
##$SUBNAM3= <"">
##$SUBNAM4= <"">
##$SUBNAM5= <"">
##$SUBNAM6= <"">
##$SUBNAM7= <"">
##$SUBNAM8= <"">
##$SUBNAM9= <"">
##$SW= 18.0517328524113
##$SWIBOX= (0..15)
0 0 2 0 0 0 0 0 0 0 0 0 0 0 0 0 
##$SW_h= 3612.71676300578
##$TD= 16384
##$TD0= 1
##$TE= 0
##$TE2= 300
##$TE3= 300
##$TEG= 300
##$TL= (0..7)
0 120 120 120 120 120 120 120 
##$TP= (0..7)
150 150 150 150 150 150 150 150 
##$TP07= 0
##$TPNAME0= <>
##$TPNAME1= <>
##$TPNAME2= <>
##$TPNAME3= <>
##$TPNAME4= <>
##$TPNAME5= <>
##$TPNAME6= <>
##$TPNAME7= <>
##$TPOAL= (0..7)
0.5 0.5 0.5 0.5 0.5 0.5 0.5 0.5 
##$TPOFFS= (0..7)
0 0 0 0 0 0 0 0 
##$TUNHIN= 0
##$TUNHOUT= 0
##$TUNXOUT= 0
##$USERA1= <user>
##$USERA2= <user>
##$USERA3= <user>
##$USERA4= <user>
##$USERA5= <user>
##$V9= 5
##$VALIST= <valist>
##$VCLIST= <CCCCCCCCCCCCCCC>
##$VD= 0
##$VDLIST= <DDDDDDDDDDDDDDD>
##$VPLIST= <PPPPPPPPPPPPPPP>
##$VTLIST= <TTTTTTTTTTTTTTT>
##$WBST= 1024
##$WBSW= 4
##$XGAIN= (0..3)
0 0 0 0 
##$XL= 0
##$YL= 0
##$YMAX_a= 94946
##$YMIN_a= -111922
##$ZGOPTNS= <>
##$ZL1= 120
##$ZL2= 120
##$ZL3= 120
##$ZL4= 120
##$ABSF1= 10
##$ABSF2= 0
##$ABSG= 5
##$ABSL= 3
##$ALPHA= 0
##$AQORDER= 0
##$ASSFAC= 0
##$ASSFACI= 0
##$ASSFACX= 0
##$ASSWID= 0
##$AUNMP= <proc_1d>
##$AZFE= 0.1
##$AZFW= 0.1
##$BCFW= 1
##$BC_mod= 2
##$BYTORDP= 1
##$COROFFS= 0
##$CY= 83.5205535888672
##$DATMOD= 1
##$DC= 2
##$DFILT= <>
##$DTYPP= 0
##$F1P= 10.8118882576601
##$F2P= -7.23987719738617
##$FCOR= 0.5
##$FTSIZE= 0
##$FT_mod= 4
##$GAMMA= 1
##$GB= 0.15
##$INTBC= 1
##$INTSCL= 1
##$ISEN= 128
##$LB= 0.25
##$LEV0= 0
##$LPBIN= 0
##$MAXI= 10000
##$MC2= 0
##$MEAN= 0
##$ME_mod= 0
##$MI= 1.114404
##$NCOEF= 0
##$NC_proc= 0
##$NLEV= 6
##$NOISF1= 3.799351
##$NOISF2= 2.8
##$NSP= 1
##$NTH_PI= 0
##$NZP= 0
##$OFFSET= 14.38212
##$PC= 1
##$PHC0= -1195.336
##$PHC1= 29.33367
##$PH_mod= 1
##$PKNL= yes
##$PPARMOD= 0
##$PSCAL= 0
##$PSIGN= 0
##$REVERSE= no
##$SF= 200.129724274929
##$SI= 16384
##$SIGF1= 3
##$SIGF2= 2
##$SINO= 400
##$SIOLD= 16384
##$SREGLST= <1H.CDCl3>
##$SSB= 0
##$STSI= 0
##$STSR= 0
##$SW_p= 3205.1282051282
##$SYMM= 0
##$S_DEV= 0
##$TDeff= 0
##$TDoff= 0
##$TI= <>
##$TILT= no
##$TM1= 0
##$TM2= 0
##$TOPLEV= 0
##$USERP1= <user>
##$USERP2= <user>
##$USERP3= <user>
##$USERP4= <user>
##$USERP5= <user>
##$WDW= 1
##$XDIM= 8192
##$YMAX_p= 0
##$YMIN_p= 0
$$ End of Bruker specific parameters
$$ ---------------------------------
##NTUPLES= NMR FID
##VAR_NAME=  TIME,          FID/REAL,        FID/IMAG
##SYMBOL=    X,             R,               I
##VAR_TYPE=  INDEPENDENT,   DEPENDENT,       DEPENDENT
##VAR_FORM=  AFFN,          ASDF,            ASDF
##VAR_DIM=   8192,          8192,            8192
##UNITS=     SECONDS,       ARBITRARY UNITS, ARBITRARY UNITS
##FACTOR=    0.0002768,     1,               1
##FIRST=     0,             0,               0
##LAST=      2.2672688,     0,               0
##MIN=       0,             -111922,         0
##MAX=       2.2672688,     94946,           0
$$ Real data points
##PAGE= N=1
##DATA TABLE= (X++(R..R)), XYDATA
$$ plain form
0 0 0 0 0 0 0 0 0 0 0 0 0 0 0 0 0 0 0 0 0 0 0 -2 6 -8 8 -8 8 -8 9 -11 14 -15 17 -18 22 -23 24 -30 31 -37 39 -44 48 -52
44 -52 59 -64 71 -76 86 -95 104 -114 126 -140 157 -173 193 -217 248 -282 328 -389 465 -571 733
65 733 -991 1449 -2432 5319 -30726 -111922 26750 55366 -51694 251 71688 -11788 -43966
78 -43966 28694 15284 -43688 3306 40522 -12914 -14519 17998 -18577 -25379 18394 9917 -13809
91 -13809 -3468 9017 6932 -8083 -6428 11777 -4579 -11172 27984 23369 -23660 -16468 18277
104 18277 702 -24989 10199 25507 -21097 -13245 25777 -16793 -37331 20345 23720 -12021
116 -12021 1501 9712 -11367 -7428 14647 7293 -10234 6689 16194 -9709 -8116 8770 -9894
129 -9894 -11279 15214 7772 -15701 -10223 7306 1659 -12871 4303 15103 -9422 -3199 19989
$$ packed form
0@%%%%%%%%%%%%%%%%%%%%%kQj4J6j6J6j6J7k0K5k9L2l5M0m5M7n4O1o8P6q3R2j00
44e2J11j23J35j47J62j81J99k18K40k66K97l30L66m10M65n30O10p17Q54j036J304
65G33j724K440l881P751l6045q1196J38672K8616j07060N1945P1437q3476l2178
78d3966P2660j3410n8972M6994L7216n3436j605L2517l6575o802M3773q477k3726
91a3809J0341J2485k085j5015J655J8205j6356o593L9156m615m7029P192L4745
104A8277j7575k5691L5188J5308m6604P852L9022m2570k0538N7676L375l5741
116a2021J3522Q211k1079L939K2075p354j7527J6923R505k5903J593J6886j8664
129i894j385K6493p442k3473N478J7529n647j4530J7174J0800k4525O223K3188
$$ plain form
142 19989 -4849 -17294 11505 13389 -4601 807 6588 -7796 -10447 8649 2653 -17103 1621
155 1621 11577 -10698 -2862 8828 -10343 -6317 12666 4321 -5855 2401 8691 566 -4925 4431
169 4431 3090 -6200 2655 6187 -5272 -6741 -3912 543 3046 -5615 -1359 5228 -7346 -3332 10268
184 10268 -2097 -5121 9479 6171 -4733 -48 6386 -1827 -5578 8297 2907 -13919 2770
197 2770 8336 -13073 -4351 8557 -7586 -6099 8793 1923 -6324 1385 7324 -1415 -3070 8418
211 8418 3592 -6377 5886 4708 -7754 778 3306 -4633 -1165 -286 -2943 -1943 -2671 1025 663
226 663 -2973 2281 2509 -1979 2755 2360 65 3238 441 1430 2323 -2907 1082 1492 -5515 -276 1241
243 1241 -4620 -966 -143 -2572 -344 -428 1027 1142 -1257 4029 2380 -2527 3801 3259 -2434 2724
$$ packed form
142A9989k4838j2445K8799J884j7990N408N781j4384k651J9096n996j9756J8724
155A621R956k2275P836J1690j9171M026J8983q345j0176Q256O290q125n491R356
169D431j341r290Q855L532j1459j469K829M455K503q661M256O587j2574M014J3600
184A0268j2365l024J4600l308j0904M685O434q213l751J3875n390j6826J6689
197B770N566k1409Q722J2908j6143J487J4892o870q247P709N939q739j655J1488
211H418m826r969J2263j178j2462Q532K528p939L468Q79k657J000p28L696l62
226F63l636N254K28m488M734l95k295L173k797R89Q93n230L989M10p007N239J517
243A241n861L654Q23k429K228q4J455J15k399N286j649m907O328n42n693N158
$$ plain form
259 2724 1848 -3118 166 -488 -1186 -1145 -3299 -86 -895 -3699 2071 37 -3456 3124 2168 -1088 2458
276 2458 1205 1000 2765 84 1559 168 -1961 2700 -510 -4319 479 -1288 -3048 697 -1507
291 -1507 -1698 193 -938 1633 738 -1170 3495 1312 -824 4132 762 -1462 2921 -173 -598 439
307 439 -2069 -661 -606 -2491 337 -1854 -2711 2091 -767 -1186 2178 -115 892 2694 -184 1872
323 1872 1406 29 2712 -162 -1977 2182 -1207 -2369 740 -2569 -1882 49 -1778 -40 -240 -1027
339 -1027 1599 -628 16 3517 -232 37 3315 -188 812 1492 -1281 97 -146 -1766 -337 -2049
355 -2049 -1761 1123 -1920 -1526 1081 -1543 307 1296 -670 2228 1436 274 2870 72 60 2612 -935
372 -935 -983 1318 -1641 -1218 -61 -1854 -710 -1604 -1285 975 -2262 -94 2692 -1220 309 3468 -306
$$ packed form
259B724q76m966L284o54o98M1k154L213q09k804N770k034l493O580r56l256L546
276B458j253k05J765k681J475j391k129M661l210l809M798j767j760L745k204
291a507j91J891j131K571q95j908M665k183k136M956l370k224M383l094m25J037
307D39k508J408N5j885K828k191q57M802k858m19L364k293J007J802k878K056
323A872m66j377K683k874j815M159l389j162L109l309O87J931j827J738k00p87
339a027K626k227O44L501l749K69L278l503J000O80k773J378k43j620J429j712
355b049K88K884l043L94K607k624J850R89j966K898p92j162K596k798j2K552l547
372i35m8K301k959M23J157j793J144q94L19K260l237K168K786l912J529L159l774
$$ plain form
389 -306 270 2434 414 244 111 765 565 -2395 249 891 -4164 -564 1762 -3367 -1048 1849 -1220
406 -1220 -553 1376 661 168 2 2577 1800 -1868 2438 2095 -2601 905 752 -2954 -452 -71 -1950
423 -1950 -463 -665 -290 56 -1143 963 894 -1288 1794 1449 -302 2224 517 783 2063 -1180 159
440 159 1211 -3199 -830 1569 -2622 -1541 948 -811 -1735 -1002 1163 -154 -1781 3513 1796 -2673
456 -2673 2970 3056 -3416 1347 3299 -2669 -752 2321 -1414 -2962 134 1620 -3846 -2508 4007 -1687
472 -1687 -4302 4477 1683 -4213 2528 3626 -1983 558 3335 557 -1641 424 2142 -1747 -1195
487 -1195 2453 -2196 -3568 1474 -1140 -2600 1568 141 -846 39 -373 1371 247 -518 2893 1373
503 1373 -1215 1005 1535 -107 -1400 -622 1498 -3129 -3359 4255 -190 -5836 2381 2261 -4382 -172
$$ packed form
389c06N76K164k020j70j33O54k00k960K644O42n055L600K326n129K319K897l069
406a220O67J929p15m93j66K575p77l668M306l43m696L506j53l706K502L81j879
423a950J487k02L75L46j199K106o9k182L082l45j751K526j707K66J280l243J339
440A59J052m410K369K399m191J081K489j759r24P33K165j317j627N294j717m469
456b673N643Q6o472M763J952n968J917L073l735j548L096J486n466J338O515n694
472a687k615Q779k794n896O741J098n609K541K777k778k198K065J718l889N52
487a195L648m649j372N042k614j460M168j427r87Q85m12J744j124p65L411j520
503A373k588K220N30j642j293P78K120m627k30P614m445n646Q217j20o643M210
$$ plain form
519 -172 4470 -106 -2591 3076 3263 -3364 281 6136 -2077 -3639 5012 -714 -5930 2976 2192 -4673
535 -4673 -1474 2567 -1375 -3879 2061 3183 -3834 -278 5261 -1417 -1950 4274 403 -1589 2006
550 2006 464 -865 257 -358 -176 -1677 -1039 -333 -1009 136 79 -1704 1161 395 -1698 2094 998
567 998 -1374 2537 1673 -1455 1520 1362 -1647 -227 1003 -622 -2548 -267 936 -2994 -1077 2917
583 2917 -2425 -1756 3894 -1702 -2465 4043 976 -1897 2788 2120 -2026 -483 2740 -497 -3261 2392
599 2392 1423 -5102 463 3237 -4371 -1286 3237 -2392 -2016 2723 834 -1579 939 3082 -55 -1439
615 -1439 2895 1602 -2865 1293 1507 -2865 -311 1143 -1570 -705 -597 -664 -476 -1206 530 1031 -900
632 -900 476 987 407 707 -89 572 1220 -902 617 1650 -2348 -532 1779 -2025 -1837 681 -467
$$ packed form
519a72M642m576k485N667J87o627L645N855q213j562Q651n726n216Q906p84o865
535d673L199M041l942k504N940J122p017L556N539o678n33O224l871j992L595
550B006j542j329J122o15J82j501O38P06o76J145n7j783K865p66k093L792j096
567I98k372L911q64l128K975j58l009J420J230j625j926K281J203l930J917L994
583B917n342O69N650n596p63O508l067k873M685o68m146J543L223l237k764N653
599B392r69o525N565K774p608L085M523n629L76M739j889k413K518K143l137j384
615a439M334j293m467M158K14m372K554J454k713Q65J08o7J88p30J736N01j931
632i00J376N11n80L00p96O61O48k122J519J033l998J816K311l804J88K518j148
$$ plain form
649 -467 -1328 -103 585 -764 -1859 2421 1425 -2495 2335 2920 -2160 962 2996 -1589 -739 1730 -136
666 -136 -2181 -1239 530 -1498 -1934 1792 -467 -3093 1553 1353 -1747 1307 1315 -639 946 1752 114
683 114 -461 36 1240 -615 -1130 713 -1231 -1458 1015 -967 -2086 451 -652 -216 785 -377 105
700 105 845 322 1296 845 -270 814 423 459 163 -1167 159 -243 -1592 450 -389 -2442 694 781
718 781 -1695 146 382 -353 646 777 913 52 46 1979 23 -1045 1402 -380 -1092 889 -843 -1795
736 -1795 -62 -334 -695 -404 -497 49 -498 163 1837 -323 -160 1958 231 19 1058 1 256 319
754 319 -418 -98 -968 -948 424 -405 -1022 154 -962 128 658 -397 491 807 76 1016 396 18 1103
773 1103 -189 131 907 -859 -588 145 -1158 -414 -440 -622 566 -510 -725 864 -638 -177 1452 -70
$$ packed form
649d67q61J225O88j349j095M280r96l920M830N85n080L122K034m585Q50K469j866
666a36k045R42J769k028m36L726k259k626M646k00l100L054Qj954J585Q06j638
683A14n75M97J204j855n15J843j944k27K473j982j119K537j103M36J001j162M82
700A05P40n23R74m51j115J084l91L6k96j330J326m02j349K042q39k053L136Q7
718G81k476J841K36p35R99J31J36q61oJ933j956j068K447j782p12J981j732r52
736a795J733k72l61K91r3N46n47O61J674k160J63K118j727k12J039j057K55O3
754C19p37L20q70K0J372q29o17J176j116J090N30j055Q88L16p31R40o20l78J085
773A103j292L20P76j766K71P33j303P44k6j82J188j076k15J589j502M61J629j522
$$ plain form
791 -70 456 1228 -35 850 651 -437 644 -182 -170 151 -1355 -649 333 -1558 -560 383 -1279 149 394
810 394 -91 720 278 121 1306 -206 403 946 -615 509 462 -827 299 9 -1136 35 -778 -754
828 -754 244 -479 -280 441 -874 481 1105 -279 880 736 28 1008 6 9 416 -734 6 306 -1150
847 -1150 -744 -273 -845 224 -119 -809 98 73 98 523 -601 787 1055 -499 1069 551 -918 596
865 596 562 -791 -312 -504 -307 -232 -825 -11 -611 -1115 742 12 -1036 582 379 6 1395 400 -308
884 -308 568 59 333 579 -744 -202 -335 -366 139 -815 -1390 118 -476 -317 595 -622 289 1056 -63
903 -63 488 531 -128 934 479 -25 138 -550 748 116 -1283 266 -162 -1594 505 179 -1578 178
921 178 337 -97 283 463 406 451 345 1324 -229 -509 1381 -185 -911 678 -559 -1410 747 -47 -1049
$$ packed form
791g0N26P72j263Q85j99j088J081q26J2L21j506P06R82j891R98R43j662J428K45
810C94m85Q11m42j57J185j512O09N43j561J124m7j289J126k90j145J171q13K4
828g54R98p23J99P21j315J355O24j384J159j44p08R80j002LM07j150P40L00j456
847a150M06M71n72J069l43o90R07k5K5M25j124J388K68j554J568n18j469J514
865E96l4j353M79j92J97P5n93Q14o00n04J857p30j048J618k03l73J389r95p08
884c08Q76n09K74K46j323N42j33l1N05r54n75J508n94J59R12j217R11P67j119
903f3N51M3o59J062m55n04J63o88J298o32j399J549m28j432K099l26j757J756
921A78J59m34L80J80n7M5j06R79j553k80J890j566p26J589j237q51K157p94j002
$$ plain form
940 -1049 -239 4 66 -323 155 826 -454 63 1616 63 -88 733 -414 382 811 -901 -41 163 -1033
959 -1033 -96 -331 -960 -550 -359 163 153 -1066 723 558 -445 997 327 -400 1115 459 -843 841
977 841 75 -606 28 186 -271 -1579 -312 741 -1309 -779 1527 -921 -1101 1691 307 -478 1070
994 1070 881 55 439 476 216 -613 285 162 -1111 253 459 -1753 -306 791 -1317 -137 951 -336
1012 -336 -59 465 86 408 321 608 555 141 826 -129 -907 675 -305 -1280 855 4 -1590 308 -22
1031 -22 -1125 -333 230 217 29 395 997 -156 -55 1023 -177 -263 1185 -990 -559 809 -985 -826
1049 -826 793 -561 -927 407 -39 -275 -605 703 397 -769 1125 834 -1284 857 1245 -1138 596
1066 596 1310 -937 -425 614 -410 -1065 -440 112 -583 -680 1090 -299 -1212 1015 371 -677 1031 675
$$ packed form
940a049Q10K43O2l89M78O71j280N17J553j553j51Q21j147P96M29j712Q60K04j196
959a033R37k35o29M10J91N22j0j219J789j65j003J442o70p27J515o56j302J684
977H41p66o81O34J58m57j308J267J053k050N30K306k448j80K792j384p85J548
994A070j89q26L84L7k60q29Q98j23j273J364K06k212J447J097k108J180J088j287
1012c36K77N24l79L22q7K87n3m14O85r55p78J582r80r75K135q51j594J898l30
1031b2j103P92N63j3j88L66O02j153J01J078j200q6J448k175M31J368j794J59
1049h26J619j354l66J334m46k36l30J308l06j166J894k91k118K141L88k383J734
1066E96P14k247N12J039j024o55O25N52o95r7J770j389r13K227o44j048J708l56
$$ plain form
1084 675 -303 588 167 -53 138 -154 67 -189 -504 -32 -773 -491 515 -985 -60 759 -1006 -15 942
1103 942 -520 22 1105 73 399 448 410 -165 -557 408 157 -829 434 127 -1605 158 294 -1254
1121 -1254 385 688 -336 -49 598 315 -182 68 692 91 -422 1118 -386 -883 651 -104 -950 553
1139 553 -142 -856 -40 -306 -353 -220 136 234 -326 649 1182 -485 -78 1013 -380 143 1001 -238 -189 297
1159 297 -471 -457 -68 -317 -266 -563 -119 -228 -601 457 597 -341 838 501 -420 756 408 -442 566
1178 566 87 -44 95 -231 -83 -160 -426 45 -485 -504 362 -141 -245 752 -420 -129 1012 216 158 755
1198 755 216 -32 96 -317 271 -559 -39 124 -1004 -124 208 -722 -60 214 -630 4 103 2 227 272
1218 272 587 629 -294 274 562 -519 100 313 -614 -191 -378 -634 -173 -484 -141 166 -62 39 422 -384
$$ packed form
1084F75r78Q91m21k20J91k92K21k56l15M72p41K82J006j500R25Q19j765R91R57
1103I42j462N42J083j032L26M9l8n75l92R65k51r86J263l07j732J763J36j548
1121a254J639L03j024K87O47k83m97K50O24o01n13J540j504m97J534p55q46J503
1139E53o95p14Q16k66m7J33L56R8n60R75N33j667M07J091j393N23Q58j239M9M86
1159B97p68J4L89k49N1k97M44j09l73J058J40r38J179l37r21J176l48q50J008
1178E66m79j31J39l26J48p7k66M71n30j9Q66n03j04R97j172K91J141p96n8N97
1198G55n39k48J28m13N88q30N20J63j128Q80L32r30O62K74q44O34R9j01K25M5
1218B72L15M2r23N68K88j081O19K13r27M23j87k56M61l11L43L07k28J01L83q06
$$ plain form
1238 -384 464 330 -331 575 169 242 687 -210 -146 177 -668 -278 244 -413 -346 -206 -542 -84 -100 -163 256 23
1260 23 342 697 -140 552 781 -247 366 398 -591 125 -442 -310 188 -445 -350 -58 -647 -145 401 -288 330
1281 330 265 -166 662 339 -168 399 247 268 369 -254 292 -125 -239 75 -385 -610 -100 -514 -312 37 -386
1302 -386 -76 330 -168 160 429 -221 237 417 -34 320 -367 -32 262 -262 -183 -11 -771 -115 -77 -634 -73
1323 -73 -377 -214 394 152 -186 690 27 456 323 -46 432 202 -406 444 -379 -555 262 -394 -293 25
1343 25 -198 -413 -129 -381 225 -11 -42 627 344 108 391 -34 362 642 -323 0 412 -138 -9 -92 -528
1364 -528 139 -347 -218 53 -315 -111 -83 49 241 320 28 493 64 -112 303 244 -273 244 -234 -286 -66
1385 -66 -607 -27 -142 -678 -74 32 -318 563 29 -188 332 15 209 421 -57 286 217 -56 126 -97 -367
$$ packed form
1238c84Q48j34o61R06m06P3M45q97O4L23q45L90N22o57O7J40l36M58j6o3M19k33
1260B3L19L55q37O92K29j028O13L2r89P16n67J32M98o33R5K92n89N02N46o89O18
1281C30o5m31Q28l23n07N67j52K1J01o23N46m17j14L14m60k25N10m14K02L49m23
1302c86L10M06m98L28K69o50M58J80m51L54o87L35K94n24P9J72p60O56L8n57N61
1323g3l04J63O08k42l38Q76o63M29j33l69M78k30o08Q50q23j76Q17o56J01L18
1343B5k23k15K84k52O06k36l1O69k83k36K83m25L96K80r65L23M12n50J29q3m36
1364e28O67m86J29K71l68K04K8J32J92P9k92M65m29j76M15n9n17N17m78n2K20
1385f6n41N80j15n36O04J06l50Q81n34k17N20l17J94K12m78L43o9k73J82k23k70
$$ plain form
1406 -367 -183 -642 -196 207 -881 109 174 -465 -7 341 -200 342 362 125 412 94 233 18 -64 202 -80
1427 -80 -435 -72 -252 -531 490 -122 -602 253 3 -60 283 177 -99 559 77 450 -22 97 534 -100
1447 -100 -328 255 -205 -248 64 -471 -194 -96 -303 -210 85 -3 -2 108 146 422 -409 379 360 -361 108 477 -367
1470 -367 -67 163 -473 172 -95 -340 -199 -227 -111 -126 -282 405 -43 -168 560 323 -442 636 307 -264
1490 -264 432 146 -203 133 -82 103 -235 -345 99 -440 -518 250 -294 -170 547 -412 -79 50 15 465 529
1511 529 296 -149 -26 212 -147 -484 -271 404 -392 94 -66 -812 23 -21 -401 291 369 -140 630 214 216
1532 216 12 104 313 282 -244 533 -167 -823 304 -324 -306 279 -99 -123 -126 -102 -253 261 185 101 -149 -69 347
1555 347 160 181 590 -417 -155 563 -291 -101 -93 -432 -472 -102 -217 -18 -134 42 281 -427 169 108 -349
$$ packed form
1406c67J84m59M46M03j088R90O5o39M58L48n41N42K0k37K87l18J39k15q2K66k82
1427h0l55L63j80k79J021o12m80Q55k50o3L43j06k76O58m82L73m72J19M37o34
1447a00k28N83m60m3L12n35K77R8k07R3K95q8JJ10L8K76q31P88j9p21M69L69q44
1470c67L00K30o36O45k67k45J41k8J16j5j56O87m48j25P28k37p65J078l29n71
1490b64O96k86l49L36k15J85l38j10M44n39p8P68n44J24P17r59L33J29l5M50O4
1511E29k33m45J23K38l59l37K13O75p96M86j60p46Q35m4l80O92P8n09P70m16K
1532B16k04R2K09l1n26P77p00o56J127o28J8N85l78k4lK4j51N14p6q4k50Q0M16
1555C47j87K1M09j007K62P18q54J90Ql39m0L70j15J99j16J76K39p08N96o1m57
$$ plain form
1576 -349 532 708 -101 287 218 -36 261 113 -232 -194 -449 -187 -193 -246 324 -114 -315 159 -96 -178 723 229
1598 229 -182 338 -20 239 425 -251 320 -252 -303 53 -715 -265 65 -498 102 149 -419 272 541 -280 209
1619 209 478 -17 318 163 -78 24 -401 220 -63 -282 294 -74 -806 -171 -183 -450 -77 -169 -300 138 185
1640 185 137 269 -194 182 96 157 305 26 -141 348 -85 -312 208 -400 -403 -39 -293 -121 131 -284 -115 161
1662 161 302 300 -137 154 191 -244 291 213 -467 166 30 -301 320 -157 -141 20 -200 -53 -190 -531 262 -179
1684 -179 -220 621 219 -459 476 213 -127 421 97 27 -18 -183 240 -163 17 -151 -393 -223 202 -212 -86
1705 -86 165 11 -142 349 101 214 3 138 146 -28 -220 110 -147 -48 103 -265 -75 135 -295 -6 105
1726 105 -552 43 229 278 -50 135 102 306 308 315 69 42 19 203 -124 -94 -88 -289 86 -324 -242 -100 -270 -417
$$ packed form
1576c49Q81J76q09L88o9k54K97j48l45L8k55K62on3N70m38k01M74k55q2R01m94
1598B29m11N20l58K59J86o76N71n72n1L56p68M50L30n63O00M7n68O91K69q21M89
1619B09K69m95L35j55k41J02m25O21k83k19N76l68p32O35j2k67L73r2j31M38M7
1640A85m8J32m63L76q6O1J48k79j67M89m33k27N20o08lL64k54J72K52m15J69K76
1662A61J41km37K91L7m35N35p8o80O33j36l31O21m77J6J61k20J47j37l41P93m41
1684a79m1Q41m02o78R35k63l40N48l24p0m5j65M23m03J80j68k42J70M25m14J26
1705h6K51j54j53M91k48J13k11J35Qj74j92L30k57R9J51l68J90K10m30K89J11
1726A05o57N95J86M9l28J85l3K04KPk46k7k3J84l27L0Ok01L75m10Q2J42j70j47
$$ plain form
1750 -417 130 201 256 -51 -19 235 71 -101 340 40 -218 289 -32 -142 393 -413 -148 224 -309 47 -131
1771 -131 -379 -125 -463 75 87 -37 330 118 -194 -3 295 42 33 -110 -114 -175 -75 -162 -68 -163 153 51 -125
1794 -125 58 -316 -524 332 -42 -26 309 169 216 276 -352 110 12 -144 144 -218 -191 57 -167 67 7 -267
1816 -267 278 80 -69 226 293 -60 193 42 242 255 110 -142 208 -146 -172 109 -222 81 -180 -268 47
1837 47 -36 -7 76 -270 96 179 160 -13 247 181 361 107 -281 175 -295 -153 418 -284 -372 -126 -204 89 80 -83
1861 -83 -131 246 -106 157 -93 32 262 -176 267 297 28 287 -14 -225 -50 48 -374 -102 -43 -8 -152 -254
1883 -254 260 29 38 161 385 -132 195 160 -146 337 -8 -115 151 -147 -251 11 -119 -8 -304 -216 55
1904 55 -218 -549 11 -87 -3 182 142 136 198 17 179 10 -67 308 -102 137 -15 -233 60 309 -484 -26 236
$$ packed form
1750d17N47P1N5l07L2K54j64j72M41l00k58N07l21j10N35q06K65L72n33L56j78
1771a31k48K54l38N38J2j24L67k12l12J91K98k53rj43mo1J00q7R4r5L16j02j76
1794a25J83l74k08Q56l74J6L35j40M7O0o28M62r8j56K88l62K7K48k24K34o0k74
1816b67N45j98j49K95O7l53K53j51K00J3j45k52L50l54k6K81l31L03k61q8L15
1837D7q3K9Q3l46L66Q3j9j73K60o6J80k54l88M56m70J42N71p02q8K46p8K93rj63
1861h3m8L77l52K63k50J25K30m38M43L0k69K59l01k11J75R8m22K72N9L5j44j02
1883b54N14k31RJ23K24n17L27l5l06M83l45j07K66k98j04K62j30J11k96Q8K71
1904E5k73l31N60r8Q4J85m0oO2j81J62j69p7L75m10K39j52k18K93K49p93M58K62
$$ plain form
1927 236 -143 -7 7 -409 -62 290 -54 119 277 73 421 46 196 -209 -269 61 -243 -112 117 -241 -195
1948 -195 -58 -126 -140 -157 348 38 340 129 81 281 33 220 31 100 462 240 -62 332 -103 106 -288 -179
1970 -179 207 -246 -319 262 -173 166 482 -100 -70 436 2 139 263 304 241 136 -23 -82 -28 -272 50 -193
1992 -193 -346 28 -198 342 96 152 237 -105 3 461 68 198 567 -42 39 470 -45 -120 -98 -60 168 -290
2014 -290 -43 -83 -329 -117 226 -508 54 144 168 65 132 22 -199 44 210 288 -13 -90 281 -495 -101 85
2036 85 -309 98 65 -467 -148 -47 -171 164 129 111 524 -5 403 64 -70 400 -198 -50 -119 -466 37 94
2058 94 -247 -337 100 -44 -36 154 -102 137 29 58 170 -56 315 272 -119 167 166 -428 7 149 -205 -120 208
2081 208 -254 -2 -127 145 37 -223 299 83 -7 79 307 -29 -27 -35 -67 -33 12 285 -74 -218 21 -103 -468
$$ packed form
1927B36l79J36J4m16L47L52l44J73J58k04L48l75J50m05o0L30l04J31K29l58M6
1948a95J37o8j4j7N05l10L02k11m8K00k48J87j89O9L62k22l02L94m35K09l94J09
1970a79L86m53p3N81m35L39L16n82L0N06m34J37J24M1o3j05j59n9N4k44L22k43
1992a93j53L74k26N40k46N6Q5l42J08M58l93J30L69o09Q1M31n15p5K2L8K28m58
2014b90K47m0k46K12L43p34N62R0K4j03O7j10k21K43J66P8l01p7L71p76L94J86
2036H5l94M07l3n32L19J01j24L35l5j8M13n29M08l39j34M70n98J48o9l47N03N7
2058I4l41r0M37j44QJ90k56K39j08K9J12k26L71m3l91K86jn94M35J42l54Q5L28
2081B08m62K52j25K72j08k60N22k16r0Q6K28l36Kql2L4M5K73l59j44K39j24l65
$$ plain form
2104 -468 -67 -26 48 -32 -203 -85 -36 -177 244 313 18 171 165 -86 234 -245 104 283 -308 -125 -224 -25 235
2127 235 -349 -339 -147 138 -260 43 13 -129 -19 276 -9 77 -112 -74 -191 -39 235 -122 -88 161 64 -15
2149 -15 -24 -36 153 -62 -95 -106 -30 -8 167 163 88 -27 -172 -99 175 -350 -3 196 35 -259 224 -256 -116 -133
2173 -133 -85 195 -258 -76 225 -125 -9 -44 -5 -192 78 -115 9 244 -93 178 -204 37 -111 -185 -80
2194 -80 -137 -164 -106 69 -48 79 11 -173 263 81 -74 52 -74 -87 69 -131 -221 3 -38 -52 -118 -26 -76 13
2218 13 -103 -23 45 -88 102 92 19 70 -89 22 96 -86 138 -112 90 114 -80 -61 -51 -415 -221 -217 -304 165
2242 165 80 -19 207 380 13 22 -271 217 215 -199 358 -67 -47 33 176 -79 -46 -245 -260 119 9 67 -189 -48
2266 -48 146 -110 -166 189 -67 -67 582 -152 -57 -115 -133 -60 -103 -109 -59 158 -58 -224 -164 -138 -94 -3 -15 252 -167 354
$$ packed form
2104d68M01M1P4q0j71J18M9j41M21O9k95J53ok51L20m79L49J79n91J83r9J99K60
2127B35n84J0J92K85l98L03l0j42J10K95k85Q6j89L8j17J52K74l57L4K49r7p9
2149a5rj2J89k15l3j1P6K2J75mp5j15j45P3K74n25L47J99j61k94M83m80J40j7
2173a33M8K80m53J82L01l50J16l5L9j87K70j93J24K35l37K71l82K41j48p4J05
2194h0n7k7N8J75j17J27o8j84M36j82j55J26j26j3J56k00r0K24m1j4o6R2n0Q9
2218A3j16Q0O8j33J90j0p3N1j59J11P4j82K24k50K02K4j94J9J0l64J94Mq7M69
2242A65q5r9K26J73l67Rk93M88km14N57m25K0Q0J43k55L3j99j5L79j10N8k56J41
2266d8J94k56n6L55k56%O49p34R5n8j8P3m3oN0K17k16j66O0K6M4R1j2K67m19N21
$$ plain form
2292 354 30 -118 -27 -11 54 51 -17 -213 -139 -171 -175 -164 -61 103 8 -246 234 167 -211 86 17 4 -171 -160 214
2317 214 123 33 114 98 -174 -216 22 -318 19 -188 -55 171 19 75 -17 83 143 152 94 12 -83 247 320 250 247 21
2343 21 144 95 -244 24 -45 171 120 -149 3 -185 30 -3 -152 -158 -258 -47 104 -63 335 288 -107 172 -59
2366 -59 -77 86 -105 62 -123 -277 -176 -155 155 -64 39 170 90 300 -83 100 107 -10 111 -245 64 -105
2388 -105 -76 -21 136 -227 127 -15 -115 -158 -38 146 -29 48 221 88 -81 3 -73 -108 255 18 -54 143 -118
2411 -118 113 -51 -259 7 -15 -126 -190 -135 -359 16 -164 -42 92 -34 -88 112 -3 110 -16 -345 257
2432 257 -361 -111 158 -262 -115 20 -49 -20 -54 177 -122 -209 -241 98 -363 -49 103 83 -49 -121 111 120 -108
2455 -108 -43 27 -46 -12 38 -149 -57 -158 -70 -141 163 -240 167 -36 -149 64 342 473 -31 101 69 165 -169
$$ packed form
2292C54l24j48R1J6O5lo8j96P4l2mJ1J03J64r5k54M80o7l78K97o9j3j75J1L74
2317B14r1r0Q1j6k72m2K38l40L37k07J33K26j52N6r2J00O0Rn8q2r5L30P3p0lk26
2343B1J23m9l39K68o9K16n1k69J52j88K15l3j49oj00K11J51j67L98m7l95K79k31
2366e9j8J63j91J67j85j54J01K1L10k19J03J31q0K10l83J83Pj17J21l56L09j69
2388a05K9N5J57l63L54j42j00m3J20J84j75P7J73j33j69Q4p6l5L63k37p2J97k61
2411a18K31j64k08K66k2j11o4N5k24L75j80J22J34j26n4K00j15J13j26l29O02
2432B57o18K50K69m20J47J35o9K9l4K31k99q7l2L39m61L14J52k0j32p2K32Rk28
2455a08O5P0p3L4N0j87R2j01Q8p1L04m03M07k03j13K13K78J31n04J32l2R6l34
$$ plain form
2478 -169 10 313 -75 150 76 -274 -36 -8 -151 -75 -186 179 63 5 -148 -41 -231 328 225 -324 81
2499 81 -145 -74 51 -52 120 -213 -175 -104 -147 13 174 -112 -200 157 200 4 187 -33 156 181 35 41 70 -194
2523 -194 -138 -16 35 71 -340 -110 -149 -170 -161 -74 -260 -55 -44 85 -144 190 -72 76 256 -14 25 -138 -66 -111
2547 -111 31 -73 200 -75 260 -149 -258 169 -70 195 238 58 -6 -6 -200 119 -101 -27 283 -1 0 -55 -17
2570 -17 -81 -40 69 148 -4 -98 129 117 -68 -13 -329 -84 164 26 139 101 184 -3 -237 -167 -48 -106 -195 33
2594 33 -17 -54 115 -227 340 38 42 85 222 119 81 103 -137 263 42 -197 -128 -39 107 172 -149 -138 -28 21
2618 21 53 -106 -112 51 -108 -85 111 -300 -92 136 -1 127 170 -167 260 76 -102 -72 -341 -201 104 -142
2640 -142 -82 -88 -258 77 27 118 -315 59 206 111 59 23 444 -99 249 141 87 233 -65 -47 88 -40 33 -115
$$ packed form
2478a69J79L03l88K25p4l50K38K8j43P6j11L65j16n8j53J07j90N59j03n49M05
2499H1k26P1J25j03J72l33L8P1m3J60J61k86q8L57M3j96J83k20J89K5j46OK9k64
2523a94N6J22N1L6m11K30l9k1RQ7j86K05J1J29k29L34k62J48J80k70L9j63P2m5
2547a11J42j04K73k75L35m09j09M27k39K65M3j80o4%j94L19k20P4L10k84Jn5L8
2570a7o4M1J09P9j52r4K27j2j85N5l16K45K48j38J13l8Q3j87k34P0J19n8q9K28
2594C3n0l7J69l42N67l02MM3J37j03l8K2k40M00k21k39O9Q9J46O5l21J1J10M9
2618B1L2j59oJ63j59K3J96m11K08K28j37J28M3l37M27j84j78L0k69J40L05k46
2640a42O0oj70L35n0R1m33L74J47r5n2l6M21n43L48j08n4J46k98J8J35j28P3j48
$$ plain form
2664 -115 -133 -70 254 276 7 135 52 -14 -30 -126 -85 103 158 192 -387 16 -60 -18 103 85 -42 31 -144 -18 123
2689 123 -103 -217 164 35 38 -32 -131 109 37 -111 -6 13 122 -182 -195 -144 31 -37 -183 -15 -119 -42 -160
2712 -160 14 144 117 -78 116 42 1 -66 146 245 -80 98 218 335 -9 156 190 -79 37 132 -26 286
2734 286 -103 -170 -45 -246 5 -232 -73 316 -201 128 15 2 -62 72 9 124 -227 161 414 -141 -87 122
2756 122 -38 -210 -69 -125 -145 2 -130 226 63 151 148 170 -96 -43 105 -203 -109 -100 -59 185 -170 -47 -4 -281
2780 -281 -181 -94 -92 56 8 158 25 -220 159 128 -41 134 61 -154 114 69 -197 -401 42 -215 -159 -80 -108
2803 -108 37 -145 57 -65 178 169 -103 -59 170 309 113 40 42 -165 -81 92 -206 53 -322 98 -216 -93
2825 -93 -159 -390 134 -271 181 107 121 -151 -40 -157 0 184 -47 -12 -291 -320 -165 193 -192 241 261 59
$$ packed form
2664a15j8O3L24K2k69J28q3o6j6r6M1J88N5L4n79M03p6M2J21j8j27P3j75J26J41
2689A23k26j14L81j29Lp0r9K40p2j48J05J9J09l04j3N1J75o8j46J68j04P7j18
2712a60J74J30k7j95J94p4m1o7K12R9l25J78J20J17l44J65L4k69J16R5j58L12
2734B86l89o7J25k01K51k37J59L89n17L29j13j3o4J34o3J15l51L88K53n55N4K09
2756A22j60j72J41n6k0J47j32L56j63Q8lK2k66N3J48l08R4RM1K44l55J23M3k77
2780b81J00Q7KJ48m8J50j33k45L79l1j69J75p3k15K68m5k66k04M43k57N6P9k8
2803a08J45j82K02j22K43rk72M4K29J39j96p3Kk07Q4J73k98K59l75M20l14J23
2825i3o6k31N24m05M52p4J4k72J11j17J57J84k31L5k79k9J55L58l85M33K0k02
$$ plain form
2847 59 52 -134 -51 -196 -40 -101 20 91 219 117 -150 -67 -55 42 94 43 -105 -95 155 -11 81 -104 -221 -21
2871 -21 23 -88 -69 -38 91 -65 67 51 43 154 263 -180 88 -358 -86 -40 -15 -106 97 -193 148 120 -79 177
2895 177 -86 218 -213 73 -64 -218 233 -6 272 -21 215 48 24 75 -98 20 12 -63 -205 205 30 -60
2917 -60 -48 -221 -245 37 103 219 -150 220 -108 -183 90 122 -330 -125 -129 -102 -139 42 26 -106 127 -195 140 143
2941 143 -51 65 177 -110 443 110 172 81 -355 -209 8 -78 -18 6 -101 -187 -53 -197 -30 -92 199 120 19
2964 19 93 55 159 63 142 37 134 36 78 17 11 96 212 -311 208 -152 -259 -86 -28 201 51 105 -246 202 113
2989 113 -132 -197 33 -53 -61 -490 75 279 -191 -69 36 148 36 27 -110 164 65 37 -68 228 57 -187 -134
3012 -134 -30 193 94 -49 216 114 65 -87 -96 167 -121 77 -279 41 -219 -206 69 393 -279 183 80 -86
$$ packed form
2847E9pj86Q3j45J56o1J21P1J28j02k67Q3J2R7N2n1j48J0K50j66R2j85j17K00
2871b1M4j11J9L1J29j56J32j6qJ11J09m43K68m46K72M6K5r1K03k90L41k8j99K56
2895A77k63L04m31K86j37j54M51k39K78k93K36j67k4N1j73J18qp5j42M10j75r0
2917f0J2j73k4K82O6J16l69L70l28p5K73L2m52K05mK7l7J81j6j32K33l22L35L
2941A43j94J16J12k87N53l33O2r1m36J46K17q6O0K4j07q6J34j44J67o2K91p9j01
2964A9P4l8J04r6P9j05R7r8M2o1oQ5J16n23N19l60j07J73N8K29j50N4l51M48q9
2989A13k45o5K30q6qm29N65K04m70J22J05J12j12rj37K74r9k8j05K96j71k44N3
3012a34J04K23r9j43K65j02m9j52rK63k88J98l56L20k60J3K75L24o72M62j03j66
$$ plain form
3034 -86 50 -12 236 -134 177 99 67 -312 -346 -60 -69 21 -67 216 137 55 -195 112 205 2 69 -141 -103 13 -6
3059 -6 71 121 -126 -167 195 -59 -199 117 -183 -138 -60 -236 5 -48 59 70 -5 363 85 -5 -182 65 320 -72
3083 -72 41 85 -81 -56 -22 31 -163 -29 -150 -286 -186 -45 134 372 -84 -105 335 75 -48 -46 198 71 -50
3106 -50 -165 132 -221 147 -55 -95 -279 -414 -249 5 -99 -370 81 -206 53 95 -73 154 140 50 10 -191
3128 -191 81 217 100 69 166 -125 158 117 -105 -100 -38 36 -82 -261 -210 220 330 -108 213 -60 43 168 -95
3151 -95 -100 -94 -237 -137 56 237 73 -114 -304 -51 -158 152 117 183 68 174 -121 -101 -151 109 97 -89 9 175
3175 175 185 -97 22 -135 46 36 -254 203 -94 -154 58 194 61 257 158 -123 319 110 62 28 206 59
3197 59 16 -159 73 -272 -47 -161 -154 69 -23 -127 -137 -68 -73 204 -52 -126 -179 -107 134 263 18 -56 163 -10
$$ packed form
3034h6J36o2K48l70L11p8l2l79l4K86rR0q8K83p9q2k50L07R3k03O7k10L8J16j9
3059fP7N0k47m1L62k54j40L16l00M5P8j76K41n3J07J1p5L68k78r0j77K47K55l92
3083g2J13M4j66K5L4N3j94J34j21j36J00J41J79K38m56k1M40k60j23KK44j27j21
3106e0j15K97l53L68k02m0j84j35J65K54j04k71M51k87K59M2j68K27j4r0m0k01
3128a91K72J36j17l1R7k91K83m1k22NO2P4j18j79N1M30J10m38L21k73J03J25k63
3151i5nOj43J00J93J81j64j87j90K53j07L10l5O6j15J06k95K0n0K60j2j86R8J66
3175A75J0k82J19j57J81j0k90M57k97o0K12J36j33J96r9k81M42k09m8l4J78j47
3197E9m3j75K32l45K25j14PK23r2j04j0O9nK77k56p4n3P2K41J29k45p4K19j73
$$ plain form
3221 -10 25 -124 -289 -21 63 -205 354 295 -187 -201 80 -74 -42 -59 100 -181 -44 65 230 47 148 -157
3243 -157 11 115 -67 -65 11 -113 162 60 -56 200 197 46 100 155 249 176 -201 63 91 193 48 -26 -124 159
3267 159 -49 -24 154 109 109 226 -1 115 -211 18 259 -4 -157 -106 -77 -37 -4 -82 -155 39 -1 212 -151 122
3291 122 391 103 -157 -181 -88 -113 52 -230 255 93 356 -99 -30 -125 95 -60 125 243 -167 43 142 34
3313 34 25 191 -17 -111 164 24 -65 4 -84 52 57 -55 -198 198 -48 -188 -113 168 -148 118 -58 -292 -285 216
3337 216 -151 5 -90 -367 -120 215 -18 -119 79 119 278 -41 -65 -64 141 -171 249 211 -104 74 -205 -148
3359 -148 79 -12 -198 -48 -71 117 -216 -1 -32 198 -45 5 -4 -4 -4 -48 2 -36 -31 -211 -32 42 20 46 -198 53
3385 53 51 11 -70 -162 57 -353 -201 -325 -85 -21 128 68 161 146 116 -226 70 102 -28 121 74 29 -406 -234 212
$$ packed form
3221a0L5j49j65K68Q4k68N59n9m82j4K81j54L2j7J59k81J37J09J65j83J01l05
3243a57J68J04j82KP6j24K75j02j16K56lj51N4N5R4p3l77K64K8J02j45p4r8K83
3267A59k08K5J78m5%J17k27J16l26K29K41k63j53N1K9M0L3p8p3J94m0K13l63K73
3291A22K69k88k60k4R3k5J65k82M85j62K63m55O9r5K20j55J85J18m10K10R9j08
3313C4rJ66k08r4K75j40q9O9q8J36Nj12j43L96k46j40P5K81l16K66j76k34PN01
3337B16l67J56r5k77K47L35k33j01J98M0J59l19k4JK05l12M20l8l15J78k79N7
3359a48K27r1j86J50k3J88l33K15l1K30k43N0r%%m4N0l8Nj80J79P4k2K6k44K51
3385E3km0q1r2K19m10J52j24K40O4J49o0R3j5l0l42K96L2j30J49m7m5m35J72M46
$$ plain form
3410 212 -253 130 77 -174 200 -197 -1 -23 -65 218 -26 -23 123 -56 22 124 24 209 -201 -99 -17 102
3432 102 113 255 217 74 -25 -164 49 -89 266 207 -166 170 -284 -14 53 -343 46 -89 24 -42 -34 -45 -82
3455 -82 -28 -23 -38 -89 7 -114 -2 232 -170 -64 29 -125 204 -133 -46 31 200 -381 110 74 123 110 -232 211
3479 211 -2 33 73 197 148 10 -28 -14 40 -224 -94 -219 51 -66 244 -228 14 142 178 118 -151 -171 -171 -271
3503 -271 138 -119 -17 8 -233 43 74 -223 -94 125 212 -164 14 124 78 185 -347 -145 79 -36 271
3524 271 75 -36 103 -135 119 -105 70 40 213 -24 74 -47 -120 -52 -13 -154 -232 -169 -107 117 -346 202 -223
3547 -223 -89 -13 100 159 -122 75 -187 -306 260 54 173 -18 -326 312 122 270 313 194 -10 132 -106
3568 -106 245 -116 108 -62 245 211 32 61 -80 -84 -231 16 -413 29 -126 17 37 135 -75 -27 -345 -44
$$ packed form
3410B12m65L83n3k51L74l97J96k2m2K83k44LJ46j79P8J02j00J85m10J02Q2J19
3432A02J1J42l8j43r9j39K13j38L55n9l73L36m54K70O7l96L89j35J13o6Qj1l7
3455h2N4Nj5n1R6j21J12K34m02J06R3j54L29l37Q7P7J69n81M91l6M9j3l42M43
3479B11k13L5M0J24m9j38l8J4N4k64J30j25K70j17L10m72K42J28L6o0k69k0%j00
3503b71M09k57J02K5k41K76L1k97J29K19Q7l76J78J10m6J07n32K02K24j15L07
3524B71j96j11J39k38K54k24J75l0J73k37R8j21p3O8L9j41p8O3O2K24m63N48m25
3547b23J34P6J13N9k81J97k62j19N66k06J19j91l08O38j90J48M3j19k04J42k38
3568a06L51l61K24j70L07l4j79K9j41mj47K47m29M42j55J43K0R8k10M8l18L01
$$ plain form
3590 -44 169 -37 68 18 34 76 -109 -96 -262 -96 -273 -115 -190 -57 134 -320 -82 361 -43 -20 192 -246
3612 -246 62 185 -154 327 182 -52 163 -99 -153 -128 -81 124 -217 47 148 -89 4 -128 -35 -21 -6 14 32
3635 32 -41 -106 -13 183 -106 70 47 -34 278 160 -297 -9 114 83 -21 46 16 211 35 -109 -141 -116 184 -83
3659 -83 120 -297 -235 -119 91 -138 -253 -206 -226 -142 273 -179 -162 151 -107 133 182 -69 101 145 108 142 -24
3682 -24 29 134 -36 -59 147 -253 42 204 -93 260 39 -161 -8 427 -17 -34 120 -98 -61 -110 71 28
3704 28 175 32 -197 -195 85 -410 163 -261 -189 -22 43 134 22 -37 22 -100 168 -39 -45 168 91 -118 -44 37
3728 37 -55 -269 -233 181 100 320 -216 -120 -157 -19 -169 -27 118 334 -64 -96 175 -59 20 6 -93 -95 -67 -33 70
3753 70 -239 22 110 172 29 163 -13 102 129 -216 -26 -145 -198 -215 -39 132 98 71 -42 266 88 50 104
$$ packed form
3590d4K13k06J05n0J6M2j85J3j66J66j77J58p5J33J91m54K38M43m04K3K12m38
3612b46L08J23l39M81j45k34K15k62n4K5M7K05l41K64J01k37R3j32R3J4J5K0J8
3635C2p3o5R3J96k89J76k3q1L12j18m57K88J23l1j04O7l0J95j76j44l2K5L00k67
3659h3K03m17O2J16K10k29j15M7k0Q4M15m52J7L13k58K40M9k51J70M4l7L4j66
3682b4N3J05j70k3K06m00K95J62k97L53k21k00J53M35m44j7J54k18L7m9J81m3
3704B8J47j43k29KK80m95N73m24P2J67O5R1j12n9N9j22K68k07oK13p7k09P4Q1
3728C7r2k14L6M14q1K20n36R6l7J38j50J42J45K16l98l2K71k34P9j4r9kK8L4J03
3753G0l09K61Q8O2j43J34j76J15K7l45J90j19n3j7J76J71l4k7j13L08j78l8N4
$$ plain form
3776 104 -87 -180 134 124 174 62 7 -5 -241 -157 45 129 111 7 302 -88 -18 -40 23 124 -55 125 73 12
3800 12 132 88 82 -152 -79 53 209 -101 -138 -133 -151 52 -123 -134 -220 -34 -53 133 378 357 -133 -18 234 -227
3824 -227 -127 -40 -148 -220 -134 -139 -177 7 36 -26 186 -48 -136 -57 118 282 46 -35 127 -105 -16 94 -206 -87
3848 -87 147 134 117 -202 7 -73 168 -25 -279 -117 130 144 188 -257 99 248 251 139 -11 18 -252 -110 -38
3871 -38 -21 42 103 -54 -246 140 32 76 15 -109 102 -252 9 -315 95 350 -93 -183 -67 4 61 -134 -77
3894 -77 -126 181 -42 -234 -123 -207 8 29 2 31 -288 285 106 -231 -47 -3 -161 -115 -43 -82 -33 86 40 -133
3918 -133 -48 -221 -116 215 -27 -5 -258 -90 -193 277 321 -117 125 -99 283 -160 -401 -42 -119 85 187
3939 187 -144 -3 163 -8 233 -66 10 20 -222 -144 -233 -61 -59 -275 23 -353 -108 214 -5 109 -102 81
$$ packed form
3776A04j91r3L14j0N0j12n5j2k36Q4K02Q4j8j04K95l90P0k2O3J01j79J80n2o1
3800A2J20m4ok34P3J32J56l10l7Nj8K03j75j1q6J86j9J86K45k1m90J15K52m61
3824b27J00Q7j08p2Q6nl8J84K9o2K12k34q8P9J75J64k36q1J62k32Q9J10l00J19
3848h7K34j3j7l19K09q0K41j93k54J62K47J4M4m45L56J49Lj12j50K9k70J42P2
3871c8J7O3O1j57j92L86j08M4o1j24K11l54K61l24M10K55m43r0J16P1N7j95N7
3894g7m9L07k23j92J11q4K15K1k7K9l19N73j79l37J84M4j58M6P2l9M9J19m6j73
3918a33Q5j73J05L31k42K2k53J68j03M70M4m38K42k24L82m43k41L59p7K04J02
3939A87l31J41J66j71K41k99P6J0k42P8q9J72Kk16K98l76K45L22k19J14k11J83
$$ plain form
3961 81 -216 20 45 217 -226 -189 30 90 113 -46 -25 -20 163 -187 -83 73 49 20 54 -239 -137 152 -77 -34
3985 -34 -155 -123 75 85 252 117 -85 -83 66 85 83 -148 -137 232 -117 251 433 -278 -80 78 94 -373 -182
4008 -182 -88 -24 14 -196 57 119 -170 -46 35 -209 41 205 234 26 259 -70 -213 -227 -122 -83 25 -101 0
4031 0 0 -70 30 186 2 -137 -120 195 145 -202 -112 183 76 52 140 -36 -77 -186 -224 -144 -9 140 -184 292
4055 292 -242 7 -242 107 57 56 -118 75 159 -6 -76 -145 -38 -111 -9 71 24 -21 58 27 -4 63 -89 -153 -136
4080 -136 -194 -270 11 -145 -298 172 133 -9 -21 41 -33 56 166 -221 94 -9 -90 -132 220 -175 -143 -140 -16 30
4104 30 -223 126 60 301 -79 97 145 268 -65 185 -146 72 94 -75 208 326 20 105 61 67 242 186 20
4127 20 -139 -114 -45 98 -220 -258 47 -159 161 66 -45 -7 322 -85 203 97 132 -195 -159 218 38 123 53
$$ packed form
3961H1k97K36K5J72m43L7K19O0K3j59K1NJ83l50J04J56k4k9L4k93J02K89k29M3
3985c4j21L2J98J0J67j35k02KJ49J9kk31J1L69l49L68J82p11J98J58J6m67J91
4008a82R4O4L8k10K53O2k89J24Q1k44K50J64K9k08K33l29j43j4J05L9J08j26J01
4031@%p0J00J56j84j39J7L15n0l47R0K95j07k4Q8j76m1j09l8Q0J35J49l24M76
4055B92n34K49k49L49n0jj74J93Q4j65p0o9J07p3J02Q0m7m5P9l1l1O7j52o4J7
4080a36n8p6K81j56j53M70l9j42j2O2p4Q9J10l87L15j03q1m2L52l95L2LJ24M6
4104C0k53L49o6K41l80J76M8J23l33K50l31K18K2j69K83J18l06Q5m4OJ75n6j66
4127B0j59K5O9J43l18l8L05k06L20r5j11L8L29m07K88j06L5l27L6L77j80Q5p0
$$ plain form
4150 53 90 77 -238 -100 -41 -188 -11 -34 111 68 298 7 34 161 13 77 161 -103 162 -250 55 81 -98
4173 -98 18 201 -100 -129 108 -33 -65 46 -1 5 -106 -308 -206 -30 40 300 -26 -147 98 51 19 272 7
4196 7 116 -75 -213 197 -150 -99 -64 17 -129 140 -199 -183 10 -5 -138 92 -226 91 93 109 101 211 103 7
4220 7 -311 -156 -167 -96 124 -23 119 -134 67 -95 -122 235 79 175 217 181 56 -219 174 0 253 37 186
4243 186 37 177 -76 -15 123 -84 -73 -170 135 56 -155 -28 -84 -19 -229 1 153 -51 109 -189 21 182
4265 182 -44 -40 28 206 295 -78 176 -46 -26 -98 -8 158 -66 228 58 -83 -229 -252 -147 27 -73 -46 47
4288 47 -115 -7 35 336 53 -174 38 -1 -58 157 -18 -104 -232 -205 -146 162 -7 202 248 83 49 153 -274
4311 -274 -169 -86 -118 31 -83 377 -89 114 -353 -46 -22 54 -43 167 -92 -26 -48 128 -149 -206 -97 22 -337
$$ packed form
4150E3L7j3l15J38N9j47J77k3J45m3K30k91K7J27j48O4Q4k64K65m12L05K6j79
4173i8J16J83l01k9K37j41l2J11m7Oj11k02J02J76P0K60l26j21K45m7l2K53k65
4196GJ09j91j38M10l47N1L5Q1j46K69l39J6J93j5j33K30l18L17KJ6qJ10j08r6
4220Gl18J55j1P1K20j47J42k53K01j62k7L57j56R6M2l6j25k75L93j74K53k16J49
4243A86j49J40k53O1J38k07J1r7L05p9k11J27n6O5k10K30J52k04J60k98K10J61
4265A82k26MO8J78Q9l73K54k22K0p2R0J66k24K94j70j41j46k3J05J74j00K7R3
4288D7j62J08M2L01k83k27K12l9n7K15j75q6j28K7N9L08j69K09M6j65l4J04m27
4311b74J05Q3l2J49j14M60m66K03m67L07K4P6r7K10k59O6k2J76k77n7J09J19l59
$$ plain form
4334 -337 168 -22 -119 -80 167 118 -121 138 -15 137 -68 205 156 -265 -245 89 138 58 -197 -117 -425 203 261
4357 261 123 66 -139 -37 -15 -197 -107 172 28 11 -91 -51 -9 -280 168 63 189 -132 60 -49 27 177
4379 177 -19 -156 -61 329 -28 -66 4 -336 4 215 -179 39 40 -125 127 -1 164 23 -10 -61 162 -2
4401 -2 24 -157 82 151 -191 139 -167 43 -231 36 278 311 -12 -13 -86 22 186 -70 -21 153 89 8 38 -183
4425 -183 -14 38 95 209 80 213 260 -20 -295 -134 106 128 223 -203 -98 23 168 267 -200 -22 181 -447
4447 -447 -62 75 72 179 145 52 203 146 28 83 72 -23 141 46 -21 -167 -295 147 56 292 379 62 76 20 -177
4472 -177 165 35 -2 -33 -237 16 16 22 55 17 -158 -15 81 81 181 16 -275 148 -50 7 51 237 147 235 31
4497 31 167 -79 216 179 -74 114 -42 135 21 123 82 -12 -46 84 80 -7 -42 123 326 197 14 -66 36
$$ packed form
4334c37N05j90r7L9K47m9k39K59j53J52k05K73m9m21K0L34M9q0k55Q0l08O28N8
4357B61j38n7k05J02K2j82R0K79j44j7j02M0M2k71M48j05J26l21J92j09P6J50
4379A77j96j37R5L90l57l8P0l40L40K11l94K18Jj65K52j28J65j41l3n1K23j64
4401bK6j81K39O9l42L30l06K10k74K67K42L3l23jp3J08J64k56M9J74o4q1L0k21
4425a83J69N2N7J14j29J33M7k80k75J61K40K2R5m26J05J21J45R9m67J78K03o28
4447d47L85J37lJ07l4r3J51n7j18N5j1r5J64r5o7j46j28M42r1K36Q7l17J4n6j97
4472a77L42j30l7l1k04K53%OL3l8j75J43R6%J00j65k91M23j98N7M4J86r0Q8k04
4497C1J36k46K95l7k53J88j56J77j14J02m1r4l4J30mq7l5J65K03j29j83q0J02
$$ plain form
4520 36 -152 -48 -25 62 -72 249 83 -238 -157 -5 -58 -55 -256 -65 -82 108 -50 550 10 67 -73 -57 -62 -100
4544 -100 -135 109 80 -35 -31 -101 -46 178 -196 119 16 101 -110 -8 27 86 -91 -100 -217 -45 219 -135 -192 -86
4568 -86 328 191 67 -175 -23 -244 -2 -63 -44 -72 -337 -15 -151 -8 197 71 151 -65 26 -76 -79 20 18 67
4592 67 55 -121 -96 54 84 146 178 -67 33 170 59 -217 -79 -134 -1 -302 49 -93 -3 12 -215 -22 -434
4615 -434 25 -153 179 135 191 -50 143 22 118 -92 -87 263 243 40 -89 -197 -13 268 155 -76 147 318
4637 318 44 -80 -105 169 -26 57 11 3 -15 -107 63 -38 98 -53 -69 -173 -18 -387 -277 35 -268 -162 -21
4660 -21 127 -479 -105 68 -83 77 -51 154 -54 2 23 -5 99 -148 -165 -92 243 -47 -89 -217 29 -261
4682 -261 230 75 6 -17 -55 -105 166 -264 180 51 -126 -73 374 41 0 124 -75 12 61 25 -24 24 -162 73
$$ packed form
4520C6j88J04K3Q7j34L21j66l21Q1J52n3Lk01J91j7J90j58O00n40N7j40J6nl8
4544a00l5K44k9j15Mp0N5K24l74L15j03Q5k11J02L5N9j77rj17J72K64l54n7J06
4568h6M14j37j24k42J52k21K42o1J9k8k65L22j36J43K05j26Q0k16R1j02lR9kM9
4592F7j2j76K5J50L0O2L2k45J00J37j11k76J38n5J33l01L51j42R0J5k27J93m12
4615d34M59j78L32m4N6k41J93j21R6k10NL50k0k03j29j08J84K81j13k31K23J71
4637C18k74j24k5K74j95Q3m6qj8r2J70j01J36j51j6j04J55l69J10L12l03J06J41
4660b1J48o06L74J73j51J60j28K05k08N6K1k8J04k47j7P3L35k90m2j28K46k90
4682b61M91j55o9k3l8n0K71m30M44j29j77N3M47l33m1J24j99Q7M9l6m9M8j86K35
$$ plain form
4706 73 -105 82 -178 -264 -21 59 5 -99 120 -54 -94 -153 -83 -40 -298 141 20 -125 -56 -182 124 23 50
4729 50 92 -109 218 -38 92 118 35 -110 155 81 -199 111 -92 -292 -188 -178 86 289 175 -134 -195 82
4751 82 55 -17 187 -193 166 71 -141 127 -175 42 -92 12 185 -15 -163 62 -22 -207 181 65 13 131
4773 131 218 59 39 -42 -379 6 -26 -77 -26 147 -116 -302 -43 -129 176 82 274 -237 32 148 -124 -113 -104 -30
4797 -30 264 128 9 55 89 -34 95 -216 -244 59 -56 29 75 18 93 -118 -16 -16 185 13 -41 204 -39 -15
4821 -15 -220 -169 -237 -144 -45 17 58 -8 -160 -105 -47 -3 -16 14 7 -165 -320 -15 -24 128 -101 78 -23 -12 -162 -54
4847 -54 -14 13 -175 75 -223 -307 -147 189 -291 27 2 -264 78 -88 -56 -97 67 -88 120 -112 48 -295
4869 -295 -50 -177 38 207 243 68 -23 -234 156 -127 185 112 -200 -74 -121 111 176 198 88 -41 -39 -39 225
$$ packed form
4706G3j78J87k60q6K43Q0n4j04K19j74m0n9P0M3k58M39j21j45O9j26L06j01K7
4729E0M2k01L27k56J30K6q3j45K65p4k80L10k03k00J04J0K64K03j14l09o1K77
4751H2k7p2K04l80L59r5k12K68l02K17j34J04J73k00j48K25q4j85L88j16n2J18
4773A31Q7j59k0q1l37L85l2n1N1J73k63j86K59q6L05r4J92n11K69J16k72J1RP4
4797c0K94j36j19M6L4j23J29l11k8L03j15Q5M6n7P5k11J02%K01j72n4K45k43K4
4821a5k05N1o8R3R9O2M1o6j52N5N8M4j3L0pj72j55L05rJ52k29J79j01J1j50J08
4847e4M0K7j88K50k98q4J60L36m80L18k5k66L42j66L2m1J64j55K08k32J60l43
4869b95K45j27K15J69L6j75r1k11L90k83L12p3l12J26m7K32O5K2j10j29K%K64
$$ plain form
4892 225 -194 -52 -31 114 113 165 189 8 203 79 -117 -125 -117 -107 25 175 -44 -143 14 -92 -168 -52 -151 89
4916 89 113 133 -275 22 -90 -28 223 -165 -18 -36 -52 38 168 -376 5 112 6 56 75 -38 21 121 -14
4939 -14 -35 -16 -41 22 -202 -79 -128 -129 -8 -24 76 -82 55 -36 118 20 245 -58 96 206 183 -180 -148 -63 -104
4964 -104 63 -16 21 241 -60 -243 110 68 -240 101 -106 229 282 -106 -46 197 -73 60 169 -123 147 -165
4986 -165 88 -118 -330 162 204 -70 -127 -76 -56 48 -246 -12 -170 240 70 -99 -129 29 305 -65 -172 -160
5008 -160 170 166 63 -48 66 -267 6 257 -197 -13 191 -126 25 56 257 54 -69 -109 47 214 152 240
5030 240 -38 111 7 -29 -52 -145 -37 164 -160 171 -194 -10 36 -72 -119 191 113 316 13 170 -146 -19
5052 -19 -173 -455 228 -6 77 6 -200 -32 77 -187 -293 -112 -115 -129 -148 97 55 -147 -32 -142 479 -224 391
$$ packed form
4892B25m19J42K1J45jN2K4j81J95j24j96qQJ0J32J50k19r9J57j06p6J16r9K40
4916H9K4K0m08K97j12O2K51l88J47j8j6R0J30n44L81J07j06N0J9j13N9J00j35
4939a4k1J9k5O3k24J23m9jJ21j6J00j58J37r1J54r8K25l03J54J10k3l63L2Q5m1
4964a04J67p9L7K20l01j83L53m2l08L41k07L35N3l88O0K43k70J33J09k92K70l12
4986a65K53k06k12M92M2k74n7N1K0J04k94K34j58M10j70j69l0J58K76l70j07J2
5008a60L30mj03j11J14l33K73K51m54J84K04l17J51L1K01k03j23m0J56J67o2Q8
5030B40k78J49j04l6k3r3J08K01l24L31l65J84M6j08m7L10p8K03l03J57l16J27
5052a9j54k82O83k34Q3p1k06J68J09k64j06J81lj4j9K45m2k02J15j10O21p03O15
$$ plain form
5075 391 -96 117 -89 -86 26 -26 235 72 131 -177 -5 34 42 -274 121 125 -94 72 44 131 28 -28 -165 92
5099 92 -11 206 -216 -70 125 16 150 -29 -146 79 -15 11 -10 81 -189 40 -74 5 164 -85 77 92
5121 92 353 110 66 -104 -112 383 57 19 76 -49 95 150 139 -63 118 -175 -167 -24 148 100 -90 -77 -75 -87 96
5146 96 -160 -59 -165 -126 -78 -114 -121 -286 -114 128 -197 -109 132 -26 187 -167 -177 -54 31 86 -85 -214 -43
5169 -43 124 161 110 103 455 410 -34 125 14 234 277 -35 87 -77 -65 -94 56 -338 -197 -88 -124 -56 110 -254
5193 -254 -25 370 379 45 -18 185 -303 -193 -76 -79 68 -113 -12 124 -199 -141 -271 -15 313 63 164 60
5215 60 66 51 -26 -130 -175 48 108 204 -97 35 -42 115 -133 -35 -210 229 -82 -66 30 -167 112 -160 -74 -164 342
5240 342 -34 71 -150 158 16 180 20 190 -6 -19 -117 225 130 329 -29 61 28 -36 22 131 -4 -128
$$ packed form
5075C91m87K13k06LJ12n2K61j63N9l08J72L9Ql16L95Mk19J66k8Q7j03n6j37K57
5099I2j03K17m22J46J95j09J34j79j17K25r4K6k1R1k70K29j14P9J59k49J62J5
5121I2K61k43m4j70qM95l26l8N7j25J44N5j1k02J81k93QJ43J72m8j90J3Kj2J83
5146I6k56J01j06L9M8l6pj65J72K42l25Q8K41j58K13l54j0J23Q5N5j71j29J71
5169d3J67L7n1pL52m5m44J59j11K20M3l12J22j64J2k9J50l94J41J09l6O8J66l64
5193b54K29L95Rl34o3K03m88J10J17lJ47j81J01J36l23N8j30K56L28k50J01j04
5215F0Oj5p7j04m5K23O0R6l01J32p7J57k48R8j75M39l11J6R6j97K79k72Q6r0N06
5240C42l76J05k21L08j42J64j60J70j96j3r8L42r5J99l58R0l3o4N8J09j35j24
$$ plain form
5262 -128 84 40 151 -124 264 -6 48 95 50 -161 105 66 -70 -23 -111 -137 25 -70 61 -160 -176 -211 30 168
5286 168 -51 -109 -203 108 96 256 -99 43 -148 90 50 -147 194 176 122 -89 124 -37 118 124 -221 -168 67
5309 67 87 -29 -12 -281 34 159 80 145 -5 51 240 203 63 33 147 -127 -80 39 -74 60 -185 144 199
5332 199 22 0 42 -37 -23 -22 288 287 -4 -118 -257 73 87 45 240 -49 -147 29 -41 -18 99 -49 35 -180 52
5357 52 162 28 182 -128 8 111 -15 -14 92 -59 297 177 -24 -9 -47 98 209 15 73 -64 147 -211
5379 -211 -113 -104 44 -108 79 -34 -231 -136 144 126 0 -21 51 -17 23 136 -35 36 -80 26 -154 -40 -283
5402 -283 6 74 214 -1 -36 151 391 -165 -230 -286 109 134 -127 14 -61 254 -116 193 177 -28 61 156 11
5425 11 197 -69 8 -203 -88 54 -49 -208 -126 -95 16 100 -21 -167 -136 -78 105 -118 -148 47 60 -137 243
$$ packed form
5262a28K12m4J11k75L88k70N4M7m5k11K66l9j36M7q8k6J62r5J31k21j6l5K41J38
5286A68k19n8r4L11j2J60l55J42j91K38m0j97L41j8n4k11K13j61J55Ol45N3K35
5309F7K0j16J7k69L15J25p9O5j50N6J89l7j40l0J14k74M7J19j13J34k45L29N5
5332A99j77k2M2p9J4JL10jk91j14j39L30J4m2J95k89r8J76p0K3J17j48Q4k15K32
5357E2J10j34J54l10J36J03j26JJ06j51L56j20k01J5l8J45J11j94N8j37K11l58
5379b11R8RJ48j52J87j13j97R5K80j8j26k1P2o8M0J13j71P1j16J06j80J14k43
5402b83K89O8J40k15l5J87K40n56o5n6L95K5k61J41p5L15l70L09j6k05Q9R5j45
5425A1J86k66P7k11J15J42j03j59Q2L1J11Q4j21j46L1N8J83k23l0J95J3j97L80
$$ plain form
5448 243 -37 -99 -273 332 -6 13 -2 41 223 27 174 -207 -112 -50 164 -58 3 -46 -72 -49 -106 190 -57 51
5472 51 20 -178 -79 117 359 -35 159 -110 -75 -398 -13 54 118 -168 -45 -369 -56 -47 91 11 -149 -72 -51 -88
5496 -88 324 -73 65 -68 61 109 311 -83 -32 119 84 153 336 27 -106 -171 -66 162 -15 244 170 139 -145
5519 -145 9 10 32 88 -55 81 54 -7 5 14 -208 -95 141 -42 191 -330 -179 56 123 -138 -38 -77 85 -109
5543 -109 30 86 202 166 -114 232 -64 -135 18 347 -63 90 2 -2 222 -145 92 -299 297 -216 246 -105
5565 -105 183 132 -7 -124 -130 -231 -16 -83 -92 16 -225 282 120 175 120 -24 161 6 92 102 143 343 -217 -27
5589 -27 35 -355 -94 114 -247 247 -4 -274 -31 150 46 -149 -44 -228 162 13 -90 -107 -94 -153 -327 -161
5611 -161 30 -248 -81 -117 -135 71 138 20 -25 -560 119 -184 182 86 68 -60 70 76 33 -93 -130 -168 -155 170
$$ packed form
5448B43k80o2j74O05l38J9j5M3J82j96J47l81R5O2K14k22O1m9k6K3n7K96k47J08
5472E1l1j98R9J96K42l94J94k69L5l23L85O7O4k86J23l24L13RJ38q0j60P7K1l7
5496h8M12l97J38j33J29M8K02l94N1J51l5O9J83l09j33o5J05K28j77K59p4l1k84
5519a45J54JK2N6j43J36k7o1J2Rk22J13K36j83K33n21J51K35O7k61J00l9J62j94
5543a09J39N6J16l6k80L46k96p1J53L29m10J53q8mK24l67K37l91N96n13M62l51
5565a05K88n1j39j17oj01K15o7rJ08k41N07j62N5n5j44J85j55Q6J0M1K00n60J90
5589b7O2l90K61K08l61M94k51k70K43J81j04j95J05j84L90j49j03j7J3n9j74J66
5611a61J91k78J67l6j8K06O7j18m5n35O79l03L66r6j8j28J30Om3j26l7l8J3L25
$$ plain form
5635 170 -116 165 24 192 234 48 -155 -123 -217 -217 110 -108 197 -141 69 155 -44 -42 -174 177 8 -25 73
5658 73 142 203 -9 240 -81 44 10 400 164 -47 -31 35 -156 -27 -107 272 111 52 130 -79 115 7 20
5681 20 20 -23 -17 -10 199 -142 89 -1 -9 96 192 -238 -71 267 -22 -21 -143 -349 -163 -160 83 23 -74 97 158 72 57
5708 57 243 80 -157 47 -73 -25 77 -65 -129 -156 153 -405 75 -235 -9 319 -112 43 -24 35 6 -128
5730 -128 -371 -125 -194 22 -144 -235 79 -180 -42 6 6 -26 290 -87 184 -138 13 -250 -133 71 9 -83 338
5753 338 -94 -7 -1 -41 61 -158 -263 -35 85 42 -301 -69 105 -194 39 -176 365 -94 23 347 86 137
5775 137 28 -9 107 -202 -150 -70 -38 -159 -192 -136 -65 -103 -58 -104 -170 -59 91 95 116 -109 8 65 -101 70 19
5800 19 36 -177 -140 -74 28 69 -166 48 46 -314 -68 -94 -172 4 -223 150 92 122 38 89 152 -38 173 92 -73
$$ packed form
5635A70k86K81j41J68M2j86k03L2r4%L27k18L05l38K10Q6j99Kj32L51j69l3R8
5658G3O9O1k12K49l21J25l4L90k36k11J6O6j91J29q0L79j61n9P8k09J94j08J3
5681B0%m3OPK09l41K31r0qJ05R6m30J67L38k89Jj22k06J86LK43o0r7J71O1q6j5
5708E7J86j63k37K04j20M8J02j42o4k7L09n58M80l10K26L28m31J55o7N9k9j34
5730a28k43K46o9K16j66r1L14k59J38M8%l2L16l77K71l22J51k63J17K04o2r2M21
5753C38m32Q7Om0J02k19j05K28J20m3l43K32J74k99K33k15N41m59J17L24k61N1
5775A37j09l7J16l09N2Q0L2j21l3N6P1l8M5m6o6J11J50MK1k25J17N7j66J71n1
5800A9J7k13L7O6J02M1k35K14kl60K46k6p8J76k27L73n8L0q4N1O3j90K11q1j65
$$ plain form
5825 -73 75 57 95 -57 -75 159 -216 -295 -203 142 44 -60 44 -197 -146 -3 260 164 -108 45 -131 -36 -74 -124
5849 -124 40 -108 -241 154 83 -178 -356 16 51 85 -88 -40 -126 -93 89 -174 26 -54 -137 32 63 57 36 -13
5873 -13 -41 -94 -44 -299 232 98 215 215 212 85 -88 112 82 8 -216 -39 107 269 82 23 -337 185 77 -134
5897 -134 17 122 -122 110 -38 148 32 -83 25 -4 227 24 206 -192 52 -158 40 -325 102 303
5917 303 -4 -104 73 182 69 -5 -115 -275 -22 92 -202 -85 209 -60 -203 -152 -38 49 -110 216 -142
5938 -142 -32 -31 -57 277 -34 20 -96 -34 -183 -222 217 -175 -209 -77 96 40 16 43 38 -120 106 256 -365 -82
5962 -82 5 -104 51 173 -107 10 -101 195 153 -2 105 -200 -61 145 -180 -140 11 174 -66 109 296
5983 296 -85 208 -321 67 -267 -28 -72 -309 -116 -18 14 -143 176 41 212 -111 -90 83 24 -18 18 -11 56
$$ packed form
5825g3J48j8L8j52j8K34l75p9R2L45r8j04J04k41N1J43K63r6k72J53j76R5l8n0
5849a24J64j48j33L95p1k61j78L72L5L4j73M8q6L3J82k63K00q0q3J69L1ok1m9
5873a3k8n3N0k55N31j34J17%lj27j73K00l0p4k24J77J46J62j87n9l60N22j08k11
5897a34J51J05k44K32j48J86j16j15J08k9K31k03J82l98K44k10J98l65M27K01
5917C03l07j00J77J09j13p4j10j60K53J14k94J17K94k69j43N1J14Q7j59L26l58
5938a42J10Jk6L34l11N4j16O2j49l9M39l92l4J32J73n6k4K7nj58K26J50o21K83
5962h2Q7j09J55J22k80J17j11K96m2j55J07l05J39K06l25M0J51J63k40J75J87
5983B96l81K93n29L88l34K39m4k37J93R8L2j57L19j35J71l23K1J73n9m2L6k9O7
$$ plain form
6006 56 -108 -69 21 148 81 40 360 -12 -125 -68 230 142 -183 157 -188 26 -22 -146 153 -51 -10 85 -185
6029 -185 54 -110 102 7 324 222 194 -215 92 69 -170 198 120 46 43 -62 68 121 -55 -260 -15 -257 101
6052 101 14 -23 118 182 163 -15 65 72 126 102 3 -2 125 100 74 -45 129 -265 162 161 117 -95 -19 -291 9 258
6078 258 20 104 56 -55 -126 34 138 -103 331 -199 81 1 14 -17 -50 1 144 126 -125 125 -288 -171 142
6101 142 39 -28 314 -13 85 114 91 -92 207 211 61 -44 73 25 30 104 -119 237 -2 -126 -226 119 -146
6124 -146 150 -66 -112 15 20 146 -28 -187 20 28 -78 -8 -70 98 -165 145 97 186 194 66 -186 24 -66 54
6148 54 -13 22 -79 -174 41 -131 15 3 55 65 -277 -57 53 232 -14 74 68 -25 221 172 139 52 -181 174 48
6173 48 145 52 -48 -236 36 73 48 -61 -60 66 -8 48 -25 -161 104 357 -103 -83 129 -275 87 158 -157 121
$$ packed form
6006E6j64L9R0J27o7m1L20l72j13N7K98q8l25L40l45K14m8j24K99k04M1R5k70
6029a85K39j64K12r5L17j02k8m09L07k3k39L68p8p4lj05J30N3j76k05K45k42L58
6052A01q7l7J41O4j9j78Q0PN4k4r9nJ27k5k6j19J74l94M27jm4k12P6k72L00K49
6078B58k38Q4m8j11p1J60J04k41M34n30K80q0J3l1l3N1J43j8k51K50m13J17L13
6101A42j03o7L42l27R8K9k3j83K99Mj50j05J17m8NP4k23L56k39j24j00L45k65
6124a46K96k16m6J27NJ26j74j59K07Qj06P0o2J68k63L10m8Q9Qj28k52K10r0J20
6148E4o7L5j01r5K15j72J46j2N2J0l42K20J10J79k46Q8or3K46m9l3q7k33L55j26
6173D8R7r3j00j88K72L7k5j09JJ26p4N6p3j36K65K53m60K0K12m04L62P1l15K78
$$ plain form
6197 121 -201 237 -174 159 -51 23 -16 -222 -119 -166 12 -162 -217 -418 -346 -29 -96 -38 225 -335 210 -18
6219 -18 -53 31 113 88 -20 263 -123 5 -18 -168 -188 27 117 91 280 43 -135 79 35 74 150 -259 80 -386
6243 -386 -146 98 69 -172 -97 11 -94 -32 -241 -97 99 -387 -47 -9 71 59 47 64 84 -50 -34 -251 6
6266 6 -65 192 -82 4 -166 -109 177 -146 128 -141 -237 -123 19 -112 -23 -198 -153 -29 1 259 22 107 -51
6289 -51 348 83 77 -127 -152 235 -35 188 16 89 -77 -39 57 -277 -84 140 11 24 51 51 188 -290 106 -120
6313 -120 -49 75 276 149 -210 106 -20 137 -170 -220 -65 56 -103 97 119 77 5 109 -78 105 256 31
6335 31 -125 -112 -195 -75 228 96 9 77 123 -49 14 95 -214 -153 58 -79 -388 251 65 432 34 -102 115
6358 115 -58 -211 -62 -3 -125 -142 -216 1 -69 114 35 232 175 -73 -50 145 180 110 -268 -27 -148 188 150
$$ packed form
6197A21l22M38m11L33k10P4l9k06J03m7J78j74n5k01P2L17o7N8K63n60N45k28
6219a8l5Q4Q2k5j08K83l86J28k3j50k0K15R0k6J89k37j78K14m4L9P6m09L39m66
6243c86K40K44k9k41P5J08j05O2k09J44J96m86L40L8Q0j2j2J7K0j34J6k17K57
6266Fp1K57k74Q6j70N7K86l23K74k69r6J14J42j31Q9j75M5J24L0K58k37Q5j58
6289e1L99k65ok04k5L87k70K23j72P3j66L8R6l34J93K24j29J3K7%J37m78L96k26
6313a20P1J24K01j27l59L16j26J57l07n0J55J21j59K00K2m2p2J04j87J83J51k25
6335C1j56J3q3J20L03j32q7O8M6j72O3Q1l09O1K11j37l09O39j86L67l98j36K17
6358A15j73j53J49N9j22j7p4K17p0J83p9J97n7k48K3J95L5p0l78K41j21L36l8
$$ plain form
6381 150 86 -147 -8 204 232 -95 -243 -64 -27 172 112 -29 80 -41 44 -47 60 -261 -123 -112 -169 -60 185
6404 185 -96 238 45 -11 -259 8 -248 -120 -286 105 113 -46 -144 67 102 104 28 -70 -28 -83 -62 223 -146 -67
6428 -67 -17 -97 32 -44 98 84 -234 99 -180 -23 239 141 183 -30 -137 -6 -154 72 190 129 -19 -142 -96
6451 -96 -177 35 -22 139 -217 -246 -385 -63 -27 -317 -34 -140 -59 89 -103 -208 257 110 159 -4 -106 40
6473 40 -166 -116 223 -68 -140 154 -40 -233 -189 -81 151 -5 -111 -29 -211 19 123 104 134 -135 -95 335 -77
6496 -77 29 -258 30 89 -120 -189 -77 4 -71 -18 1 3 -88 -80 -214 77 -119 130 -249 -238 -59 162 -65 -92 -105
6521 -105 -24 140 -247 131 23 -185 13 26 210 62 22 255 135 58 -426 202 90 -34 -9 -89 75 -112
6543 -112 -63 -33 -42 -14 98 -41 -20 -15 105 -44 -27 -139 16 96 -29 197 -77 198 -108 63 -273 -111 16
$$ packed form
6381A50o4k33J39K12K8l27j48J79L7J99o0j41J09j21Q5r1J07l21J38J1n7J09K45
6404A85k81L34j93n6k48K67k56J28j66L91Qj59r8K11L5Kp6r8M2n5K1K85l69P9
6428f7N0q0J29p6J42j4l18L33k79J57K62r8M2k13j07J31j48K26J18o1j48j23M6
6451i6q1K12n7J61l56k9j39L22L6k90K83j06Q1J48j92j05M65j47M9j63j02J46
6473D0k06N0L39k91p2K94j94j93M4J08K32j56j06Q2j82K30J04j9L0k69M0M30m12
6496g7J06k87K88N9k09o9J12Q1p5N3J9Kr1Qj34K91j96K49l79J1J79K21k27k7j3
6521a05Q1J64l87L78j08k08J98J3J84j48m0K33j20p7m84O28j12j24K5q0J64j87
6543a12M9L0rK8J12j39K1NJ20j49J7j12J55Q0j25K26k74K75l06J71l36J62J27
$$ plain form
6566 16 -154 177 -34 -195 106 5 5 18 -32 146 28 66 71 0 -126 164 173 18 10 -122 -12 -35 30 125 179 99
6592 99 18 -31 -193 -150 169 101 -182 -220 -170 21 110 185 124 -42 163 -201 -9 -181 -52 -27 168 222 73 9
6616 9 -150 -63 24 30 41 -64 -68 164 -121 -16 2 69 26 -120 26 58 117 51 -115 110 -153 198 -39 47 85 -174
6642 -174 -94 -199 -125 39 -102 -24 174 286 -261 -5 320 357 38 -245 23 46 -25 159 -152 -7 90 150 32
6665 32 108 -120 145 90 58 33 302 -107 -38 -226 -316 15 -219 104 -108 -136 -146 -128 -263 -165 85 196 -76 3
6689 3 38 2 -265 124 105 -215 126 174 -68 -165 -70 206 291 -139 -41 57 114 -306 111 108 -253 19 133 162 -91
6714 -91 98 -23 144 4 -169 -1 -141 -8 -81 -62 7 -54 -232 -49 -62 -326 -227 -134 141 -350 34 36 99 -71
6738 -71 180 -13 88 -12 241 123 55 29 -51 -270 -55 87 -88 -85 -157 -256 -7 -15 -128 225 -214 -31 -89 15
$$ packed form
6566A6j70L31k11j61L01j01%J3n0J78j18L8Np1j26K90Rj55qj32J10k3O5R5N4q0
6592I9q1m9j62M3L19o8k83l8N0J91Q9P5o1j66K05l64J92j72J29K5J95N4j49o4
6616Ij59Q7Q7OJ1j05mK32k85J05J8O7m3j46J46L2N9o6j66K25k63L51k37Q6L8k59
6642a74Q0j05P4J64j41P8J98J12n47K56L25L7l19k83K68K3p1J84l11J45R7O0j18
6665C2P6k28K65n5l2k5K69m09O9j88r0L31k34L23k12k8j0J8j35R8K50J11k72P9
6689CL5l6k67L89j9l20L41M8k42r7R5K76Q5m30R8R8N7m20M17ll61K72J14K9k53
6714i1J89j21J67j40j73J68j40J33p3J9O9o1j78J83j3k64R9R3K75m91L84KO3j70
6738g1K51j93J01j00K53j18o8k6q0k19K15J42j75Lp2r9K49qj13L53m39J83n8J04
$$ plain form
6762 15 -184 -73 -93 33 91 147 -94 100 13 182 19 -17 -126 -45 89 86 -193 -108 105 34 1 -283 -79 200
6786 200 -8 7 78 -237 77 128 9 -107 -129 29 9 -82 -41 -8 -138 182 -122 160 -205 -51 153 259 -63
6809 -63 20 -43 207 -520 24 -129 42 5 0 75 104 29 115 65 -114 25 -252 151 -254 -193 90 80 181 41
6833 41 51 -164 -198 84 201 -105 -135 1 36 51 10 -211 -47 17 -62 56 180 35 111 168 -93 -247 150 -122
6857 -122 -180 392 -238 7 -49 105 -59 -221 -34 53 128 -14 219 -173 -42 -187 106 -5 -161 -80 110 32
6879 32 153 -405 -10 132 113 -13 61 32 -104 -100 85 123 104 -138 165 248 -229 122 -243 -134 85 -301 -83
6902 -83 -20 -7 -52 -12 -87 -392 184 -62 -116 160 -152 -38 -122 55 103 457 -256 -192 -58 89 38 -20 36 -15 128
6927 128 156 41 79 146 207 -49 129 63 -122 142 191 -51 -73 159 -217 -21 -130 89 -116 228 -13 -109 -48
$$ packed form
6762A5j99J11k0J26N8N6k41J94q7J69j63l6j09Q1J34lk79Q5K13p1l3k84K04K79
6786B00k08J5P1l15L14N1j19j16k2J58k0r1M1L3j30L20l04K82l65J54K04J06l22
6809f3Q3o3K50p27N44j53J71l7nP5K9p5Q6n0j79J39k77M03m05O1K83j0J01j40
6833D1J0k15l4K82J17l06l0J36L5J5m1k21J64O4p9J18J24j45P6N7k61j54L97k72
6857a22n8N72o30K45n6J54j64j62J87Q7P5j42K33l92J31j45K93j11j56Q1J90p8
6879C2J21n58L95J42j9j26P4k9j36MJ85L8j9k42L03Q3m77L51l65J09K19l86K18
6902h3O3J3m5M0p5l05N76k46n4K76l12J14q4J77M8L54p13O4J34J47n1n8N6n1J43
6927A28K8j15L8O7O1k56J78o6j85K64M9k42k2K32l76J96j09K19k05L44k41r6O1
$$ plain form
6950 -48 -89 222 210 146 82 -75 -262 199 80 -129 -64 -151 117 66 -78 -159 79 157 204 -177 -133 -247 -198 -126 -119
6975 -119 -14 -214 18 -44 196 -25 91 117 84 -149 273 -118 -29 -407 -73 33 52 224 47 15 168 105
6997 105 30 -246 -139 95 252 163 144 -308 -305 -39 147 152 -135 -149 -102 180 -53 141 -142 178 -136 0 86
7020 86 38 70 101 231 -115 116 198 33 87 257 124 -90 135 287 42 27 -22 -53 250 25 194 56 -23
7043 -23 -29 -15 -78 32 0 -35 -220 -123 -155 69 131 28 -122 294 -92 125 128 185 180 -251 152 156 -37 -131 -304 -234
7069 -234 191 107 -179 185 -224 -147 94 167 -234 -42 -108 100 286 -89 36 -31 75 -102 151 72 81 -112 2
7092 2 -274 -25 12 178 46 24 -188 24 -111 -71 -17 -347 154 39 -329 86 -58 -151 28 78 146 60 -62
7115 -62 31 -14 88 157 62 -43 -155 411 -18 -52 -120 -2 287 -262 61 360 -63 -12 215 146 68 207 163 -118
$$ packed form
6950d8m1L11j2o4o4j57j87M61j19k09O5q7K68n1j44q1K38P8M7l81M4j14M9P2P
6975a19J05k00K32o2K40k21J16K6l3k33M22l91Q9l78L34J06J9J72j77l2J53o3
6997A05p5k76J07K34J57q9j9m52LK66J86Nk87j4M7K82k33J94k83L20l14J36Q6
7020H6m8L2L1J30l46K31Q2j65N4J70j33k14K25J52k45j5m9l1L03k25J69j38p9
7043b3oJ4o3J10l2l5j85R7l2K24O2j03j50M16l86K17LN7nm31M03Mj93r4j73P0
7069b34M25q4k86L64m09P7K41P3m01J92o6K08J86l75J25o7J06j77K53p9Rj93J14
7092Bk76K49L7J66j32k2k12K12j35M0N4l30N01j15l68M15j44r3J79N0O8q6j22
7115f2R3m5J02O9r5j05j12N66m29l4o8J18K89n49L23K99m23N1K27o9p8J39m4k81
$$ plain form
7139 -118 -221 142 -18 -35 -108 55 -102 25 181 2 48 266 40 -201 -102 52 -41 -268 125 -170 -12 -45
7161 -45 10 141 39 345 215 -384 -390 21 156 -30 -113 76 -12 175 177 58 102 -8 78 52 -167 -101 -93 -40 -168
7186 -168 -91 -54 -216 -39 -54 -92 -56 -147 68 70 -88 -179 45 -50 -319 -87 65 -174 -252 -28 23 -90 99 59
7210 59 -80 -319 -135 -33 -186 -171 39 2 248 -147 44 -25 -76 146 43 -36 -56 -444 -32 -104 38 163 -119
7233 -119 -232 260 -104 -49 52 -204 206 -208 162 72 255 22 139 -316 -106 -131 178 -141 106 108 -72 141
7255 141 -23 -180 -249 4 -84 -11 -39 -31 13 -70 -69 -149 73 246 5 -138 -83 -156 -90 115 118 92 38 -47 193 -97
7281 -97 -51 -469 -23 3 -223 54 19 39 152 -74 206 103 -37 238 152 -7 -349 2 168 -289 -104 59
7303 59 -196 79 -75 37 -69 -30 190 0 -428 -45 101 3 128 -72 197 -48 -70 239 -36 16 -113 -130
$$ packed form
7139a18j03L63j60j7p3J63j57J27J56j79M6K18k26k41R9J54r3k27L93k95J58l3
7161d5N5J31j02L06j30n99oM11J35j86q3J89q8J87Kj19M4j10Q6k6k19O6QN3j28
7186a68P7L7j62J77j5l8L6r1K15Kj58r1K24r5k69K32J52k39p8K24N1j13J89m0
7210E9j39k39J84J02j53J5K10l7K46l95J91o9n1K22j03p9k0l88M12p2J42J25k82
7233a19j13M92l64N5J01k56M10m14L70r0J83k33J17m55K10k5L09l19K47Kj80K13
7255A41j64j57o9K53q8P3k8QM4q3Jq0K22J73k41j43N5p3O6K05Lk6n4q5K40k90
7281i7M6m18M46K6k26K77l5K0J13k26K80j03j40K75q6j59l42L51J66m57J85J63
7303E9k55K75j54J12j06L9K20j90m28L83J46r8J25k00K69k45k2L09k75N2j29j7
$$ plain form
7325 -130 -190 105 119 -120 71 -24 -104 6 207 -154 -71 -363 -284 -105 28 -184 301 47 52 52 -31 48 249 -173
7349 -173 110 -14 156 153 286 114 269 -19 -69 -126 4 167 -119 -256 247 142 5 -132 -209 236 -183 -37
7371 -37 40 193 -350 24 18 -153 78 36 -40 -202 118 3 -155 -37 97 -241 265 116 -65 16 -50 -54 19 34
7395 34 165 -120 -13 -93 187 -213 -147 -115 73 292 3 54 52 172 5 -145 56 11 86 6 96 9 54 172
7419 172 -40 204 -18 241 -185 -122 171 346 167 -173 10 153 141 305 -80 -116 -102 -60 4 81 -375 16
7441 16 69 -1 181 56 -109 17 -65 -73 -119 -140 5 -85 107 71 -190 -320 -54 230 -148 -145 21 -167 114 37
7465 37 288 -68 -103 -58 -73 -44 67 -163 84 -107 -96 73 -131 20 -15 244 -51 -154 14 -22 38 29 100 -5
7489 -5 -4 149 133 46 -92 40 108 108 236 -121 128 194 -34 26 -158 -63 0 100 -79 226 -134 -65 -40 -31 -143 -133
$$ packed form
7325a30o0K95J4k39J91r5q0J10K01l61Q3k92P9J79J33k12M85k54N%q3P9K01m22
7349a73K83j24J70lJ33j72J55k88n0n7J30J63k86j37N03j05j37j37p7M45m19J46
7371c7P7J53n43L74oj71K31m2p6j62L20j15j58J18J34l38N06j49j81Q1o6mP3J5
7395C4J31k85J07q0K80m00O6L2J88K19k89N1kJ20j67j50K01m5P5q0R0q7M5J18
7419A72k12K44k22K59m26O3K93J75j79l40J83J43j2J64l85l6J4M2O4P7m56L91
7441A6N3p0J82j25j65J26q2qm6k1J45r0J92l6k61j30K66K84l78LJ66j88K81p7
7465C7K51l56l5M5j5K9J11k30K47j91J1J69k04J51l5K59k95j03J68l6O0rP1j05
7489eJJ53j6q7j38J32O8%J28l57K49O6k28O0j84R5O3J00j79L05l60O9K5Rj12J0
$$ plain form
7515 -133 -235 -306 -181 256 -15 20 178 12 146 71 -503 -31 158 -114 -182 34 47 -153 38 -79 -61 -126
7537 -126 -29 -58 17 -166 -54 69 92 -193 -20 -141 246 64 80 -57 -51 270 102 -124 159 82 16 240 125
7560 125 21 -216 -146 -112 -235 110 -153 -124 15 -3 3 36 -25 1 -9 -128 -62 -121 -162 56 26 8 69 -31 68 64
7586 64 138 -221 123 247 86 -41 28 171 -120 -225 -7 288 -148 141 109 82 196 232 364 6 -149 -67
7608 -67 -120 27 -170 49 -148 -115 74 -323 -162 12 -133 -32 -111 24 184 177 -145 42 130 91 23 48 -23 -60
7632 -60 61 -61 -166 91 114 133 147 -78 138 -61 85 37 173 -149 -165 -5 154 -221 54 325 59 -266
7654 -266 -64 -114 -19 -9 -68 9 48 -214 110 -98 13 203 -168 88 69 176 57 58 299 -11 139 190 130 -51
7678 -51 310 112 232 -11 10 -13 -166 1 -131 231 114 59 -72 -164 132 85 -207 37 -195 -48 306 96
$$ packed form
7515a33j02p1J25M37k71L5J58j66J34p5n74M72J89k72o8K16J3k00J91j17J8o5
7537a26R7k9P5j83J12J23K3k85J73j21L87j82J6j37OL21j68k26K83p7o6K24j15
7560A25j04k37P0L4j23L45k63K9J39j8OL3o1K6j0j19O6n9m1K18l0j8O1j00R9m
7586F4P4l59L44J24j61j27O9J43k91j05K18K95m36K89l2k7J14L6J32l58j55Q2
7608f7n3J47j97K19j97L3J89l97J61J74j45J01p9J35J60pl22J87Q8l9o8K5p1l7
7632f0J21j22j05K57K3J9J4k25K16j99J46m8J36l22j6J60J59l75K75K71k66l25
7654b66K02n0R5J0n9P7L9k62L24k08J11J90l71K56j9J07j19JK41l10J50N1o0j81
7678e1L61j98J20k43K1k3j53J67j32L62j17n5j31r2K96m7k92K44k32J47L54k10
$$ plain form
7700 96 176 420 -86 217 38 215 -111 -4 -68 -113 30 224 9 124 8 -292 114 -171 124 75 75 270
7722 270 -42 -41 64 -113 95 116 41 59 -43 -101 -42 -125 60 63 -206 -79 30 248 180 -83 -48 -61 -85 -38 -123
7747 -123 141 267 -12 -65 -176 -80 -158 349 333 76 -162 21 -155 22 -85 15 112 152 12 -51 70 -23 -52
7770 -52 61 -64 -31 50 -171 69 -168 -69 -15 96 5 -38 -62 132 58 -75 -102 -37 -82 -29 115 294 9 -104
7794 -104 -134 -183 154 -24 -67 99 178 -138 179 54 -137 -240 382 66 157 -46 -356 111 -24 51 276 183
7816 183 -36 235 96 189 -112 -105 250 238 42 142 219 89 -76 260 105 -29 117 143 -225 80 -16 -179
7838 -179 -94 -24 168 -12 88 -118 -175 -118 -280 95 98 65 -199 -15 -54 72 -125 26 -62 11 -105 -99 232 268
7862 268 -101 90 -59 160 4 -140 -11 26 302 -142 -86 -163 3 66 -144 52 59 188 61 189 267 205 64
$$ packed form
7700I6Q0K44n06L03j79J77l26J07o4m5J43J94k15J15j16l00M06k85K95m9%J95
7722B70l12JJ05j77K08K1p5J8j02n8N9q3J85Lk69J27J09K18o8k63L5j3k4M7q5
7747a23K64J26k79n3j11R6p8N07j6k57k38J83j76J77j07J00R7M0j40o3J21r3k9
7770e2J13j25L3Q1k21K40k37R9N4J11r1m3k4J94p4j33k7O5m5N3J44J79k85j13
7794a04l0m9L37j78m3J66P9l16L17j25j91j03O22l16R1k03l10M67j35P5K25r3
7816A83k19K71j39R3l01PL55j2j96J00P7j30j65L36j55j34J46K6l68L05r6j63
7838a79Q5P0J92j80J00k06n7N7j62L75Ll3k64J84l9J26j97J51q8P3j16OL31L6
7862B68l69J91j49K19j56j44J29L7K76m44N6p7J66O3k10J96PJ29j27J28P8o2j41
$$ plain form
7885 64 -1 -67 49 -167 87 -30 200 67 -52 -70 78 27 38 -40 -106 117 -159 29 -201 -220 -78 118 -35
7908 -35 -233 -116 -181 78 152 -18 147 84 -196 -85 286 134 -128 -149 47 144 7 -72 11 18 -1 43 -82 -95
7932 -95 74 113 156 -12 -16 -136 -112 58 -204 39 244 49 18 -3 26 -33 329 -172 -147 -32 84 154 174 -76
7956 -76 -116 -74 119 -73 -21 90 -141 10 0 81 212 227 211 85 -251 -83 60 -106 -45 -8 80 -133 -475 230
7980 230 104 109 -211 -46 -45 190 -208 160 5 -22 -226 -161 0 5 -179 15 10 66 15 -217 147 31 157 -93
8004 -93 166 -134 205 126 89 201 42 161 -31 -149 52 36 390 -46 -19 -57 73 -51 -109 -101 -237 178 76
8027 76 172 165 167 60 -50 -7 -102 -116 85 89 8 -331 -64 -45 52 -15 -75 -388 108 250 12 72 -62 0 -43 -37 -59
8054 -59 146 -49 -237 113 211 153 214 -252 124 3 -25 -166 126 57 255 138 30 175 -94 363 330 51
$$ packed form
7885F4o5o6J16k16K54j17K30j33j19j8J48n1J1p8o6K23k76J88k30j9J42J96j53
7908c5j98J17o5K59P4j70J65o3k80J11L71j52k62k1J96R7j37p9Q3Pj9M4j25j3
7932i5J69L9M3j68mj20K4J70k62K43K05j95l1k1K9n9L62n01K5J15J16P0K0k50
7956g6m0M2J93j92N2J11k31J51j0Q1J31J5j6j26l36J68J43j66O1L7Q8k13l42P05
7980B30j26Nl20J65JK35l98L68j55k7k04O5J61Nj84J94nN6n1k32L64j16J26k50
8004i3K59l00L39p9l7J12j59J19j92j18K01j6L54m36K7l8J30j24n8Qj36M15j02
8027G6R6pKj07j10M3r5j4K01Mq1l39K67J9R7o7o0l13M96J42k38O0j34O2m3Ok2
8054e9K05j95j88L50R8n8O1m66L76j21k8j41K92o9J98j17j08J45k69M57l3k79
$$ plain form
8076 51 106 57 -255 -167 -41 144 44 -71 51 14 244 -36 -67 46 -208 120 14 -427 -29 43 61 -19 125
8099 125 50 65 94 364 156 -373 106 -357 -197 -1 -253 -41 194 154 -301 -142 15 -148 -260 -5 177
8120 177 -112 0 -9 -31 186 -173 110 -42 146 -45 38 -52 164 102 -4 166 -205 -206 205 11 337 43 -178
8143 -178 48 195 -61 -7 -111 11 70 49 -105 -190 150 -24 126 -56 54 71 162 59 70 -81 79 48 -34
8166 -34 242 115 12 -254 -118 -6 196 192 230 188 59 -77 119 261 -271 -159 10 31 214 -58 143 -7
8188 -7 141 133 214
$$ packed form
8076E1N5m9l12Q8J26J85j00j15J22l7K30k80l1J13k54L28j06m41L98P2J8q0J44
8099A25p5J5K9K70k08n29M79m63J60J96k52K12K35m0m55J59J57j63j12K55J82
8120A77k89J12rk2K17l59K83j52J88j91Q3r0K16o2j06J70l71jM11j94L26k94k21
8143a78K26J47k56N4j04J22N9k1j54q5L40j74J50j82J10J7R1j03J1j51J60l1q2
8166c4K76j27j03k66J36J12K02mL8m2j29j36J96J42n32J12J69K1J83k72K01j50
8188gJ48qQ1
8191B14
$$ Imaginary data points
##PAGE= N=2
##DATA TABLE= (X++(I..I)), XYDATA
$$ plain form
0 0 0 0 0 0 0 0 0 0 0 0 0 0 0 -2 8 -8 8 -8 9 -16 16 -23 24 -31 32 -40 47 -53 61 -71 80 -91 103 -117 133
35 133 -149 168 -187 210 -234 261 -289 320 -357 392 -434 479 -528 582 -644 709 -779 859 -948
54 -948 1045 -1160 1287 -1432 1602 -1802 2041 -2333 2700 -3177 3825 -4762 6237 -8908 15316
69 15316 -69171 -3545 94946 -49185 -22075 62804 -5042 -65668 23281 31455 -33027 -3073
81 -3073 52553 -5641 -27026 16777 -546 -24283 20590 18081 -17548 -10483 7479 1214 -12112
94 -12112 -12593 9340 1449 -12171 18686 20833 -27201 -19740 24467 13263 -18070 9122 30400
107 30400 -14794 -21964 23503 -3775 -35869 19428 30917 -20920 -14709 7506 -10918 -11298 13470
120 13470 9264 -11151 1137 16781 -6141 -11883 13006 2425 -8265 16004 11130 -16339 -10383
$$ packed form
0@%%%%%%%%%%%%%kJ0j6J6j6J7k5L2l9M7n5O3p2Q7j00J14j32J51j71J94k20K50
35A33k82L17l55L97m44M95n50O09o77P49q26R13j007J110j226J353j488J638j807
54i48J993k205K447k719L034l404L843m374N033n877P002q587J0999j5145K4224
69A5316q4487O5626R8491j44131K7110Q4879o7846o0626Q8949Q174o4482K9954
81c073N5626n8194k1385M3803j7323k3737M4873k509l5629P065J7962o265j3326
94a2112m81K1933p891j3620L0857K147m8034P461M4207j1204l1333K7192K1278
107C0400m5194p170M5467k7278l2094N5297J1489n1837O211K2215j8424l80K4768
120A3470m206k0415J2288J5644k2922n742K4889j0581j0690K4269m874k7469N956
$$ plain form
133 -10383 9660 4754 -12618 -2217 12262 -9514 -13306 13654 -2494 -20538 9927 18427 -6256
146 -6256 -3901 7815 -1841 -6890 10475 10183 -12093 -742 15427 -7646 -10469 8413 -7116
159 -7116 -11316 9957 3337 -11010 -2140 6182 -456 -5834 3026 6715 -2308 2543 9208 -2673
173 -2673 -5156 2493 4280 4186 -3708 -4647 3955 -5623 -8010 7269 -1436 -10050 5114 4912 -7510
188 -7510 -2511 6672 1269 -3819 7773 7431 -9044 1008 13624 -7502 -6741 11359 -3052 -9292
202 -9292 6385 1287 -10424 -2525 4886 -2219 -6388 4631 4289 -6717 2778 7995 -5086 573
216 573 8550 -1300 -808 2866 -1035 -531 -782 -339 267 -4239 -1645 990 -4518 -1476 1363 -2052 744
233 744 630 -172 3182 -370 1210 4892 -1741 722 5292 -2357 -1420 1984 -2523 -1643 -794 -1564 -742
$$ packed form
133a0383K0043m906j7372J0401J4479k1776l792K6960j6148j8044L0465Q500k4683
146f256K355J1716r656n049J7365k92k2276J1351J6169k3073k823J8882j5529
159g116m200K1273o620j4347Q870Q322o638n378Q860L689r023M851O665j1881
173b673k483P649J787r4p894r39Q602r578k387J5279q705q614J5164k02j2422
188g510M999R183n403n088J1592l42j6475J0052J2616k1126P61J8100j4411o240
202i292J5677n098j1711P899P411p105m169J1019l42j1006R495N217j3081N659
216E73P977r850M92L674l901N04k51M43O06m506K594K635n508L042K839l415K796
233G44j14q02L354l552J580L682o633K463M570p649R37L404m507Q80Q49p70Q22
$$ plain form
250 -742 -3365 -141 1417 -4484 46 3874 -2485 1354 4355 -1120 1522 3429 824 1181 -504 645
266 645 1317 -3222 87 193 -5289 -97 1207 -4061 -932 81 -1435 1545 113 835 2068 -561
282 -561 3085 2909 -2049 2127 2488 -2010 1328 30 -2788 81 -1373 -1306 -865 -3251 47 354 -2905
299 -2905 1692 1196 -2156 2890 2270 -491 2655 695 850 2136 -783 631 225 -2905 929 -435
315 -435 -3464 41 -1285 -2250 759 -1610 -686 1679 -567 1956 1535 -790 3260 1798 -1239 2443
331 2443 312 -1116 975 -1091 -1172 -107 -2290 -373 -1074 -2680 944 -1170 -2302 2344 331 -753
347 -753 2422 362 723 2563 81 1323 563 -633 1533 -610 -2354 477 -1682 -2142 -14 -2235
363 -2235 -965 757 -1169 599 355 -913 2776 637 -788 3286 972 97 1820 -43 -152 19
$$ packed form
250g42k623L224J558n901M530L828o359L839L001n475K642J907k605L57j685J149
266F45O72m539L309J06n482N192J304n268L129J013j516K980j432P22J233k629
282e61L646j76m958M176L61m498L338j298k818K869j454O7M41k386L298L07l259
299b905M597m96l352N046o20k761L146j960J55J286k919J414m06l130L834j364
315d35l029L505j326r65L009k369R24K365k246K523m21k325M050j462l037L682
331B443k131j428K091k066q1J065k183J917p01j606L624k114j132M646k013j084
347g53L175k060L61J840k482J242p60j196K166k143j744K831k159m60K128k221
363b235J270J722j926J768k44j268L689k139j425M074k314q75J723j863j09J71
$$ plain form
379 19 -1196 66 -1581 -2126 1548 -1974 -2692 1732 -1182 -1976 1736 294 92 1315 1182 1708 -70
396 -70 591 2731 -1663 -527 2937 -2252 -2182 1999 -1517 -2392 -122 -762 -1680 -1334 638 1326 -1954 1116
414 1116 3452 -1438 518 3218 -893 645 2375 -610 244 9 -1046 -125 -1875 -1016 53 -2459
430 -2459 -262 436 -1734 774 666 -464 1910 111 225 3276 -571 -6 3811 -416 -1524 1761
446 1761 -199 -1894 -1367 26 -877 -3081 532 1786 -3932 125 3272 -3337 -214 4766 -1217 -818
462 -818 4074 833 -1467 1397 2177 -2023 -2609 3392 -117 -5569 1927 2006 -5887 -476 3324 -3156
478 -3156 -1445 2939 631 -1484 702 2995 220 -749 3409 152 -2806 2320 786 -2668 1227
493 1227 240 -2212 -1172 -1173 -353 -95 -1821 1169 1075 -1968 669 2121 234 -492 701 2582 -319
$$ packed form
379A9j215J262j647n45L674l522p18M424k914p94L712j442k02J223j33N26j778
396g0O61K140m394J136L464n189P0M181l516q75K270o40r18L46J972O88l280L070
414A116K336m890J956K700m111J538J730k985Q54k35j055R21j750Q59J069k512
430b459K197O98k170K508j08j130K374j799J14L051l847N65L817m227j108L285
446A761j960j695N27J393r03k204L613J254n718M057L147o609L123M980n983L99
462h18M892l241k300K864P80m200n86O001l509n452P496P9p893N411L800o480
478c156J711M384k308k115K186K293k775r69M158l257k958N126j534l454L895
493A227r87k452J040jQ20K58j726K990r4l043K637J452j887p26J193J881k901
$$ plain form
510 -319 -2143 3955 1907 -5593 460 3292 -4573 -2211 3398 -1595 -4269 1046 3022 -3268 -1718
525 -1718 5715 -344 -4410 4945 2835 -4440 3183 4960 -3696 -1714 3537 -615 -3910 707 2477
540 2477 -4059 -2811 3844 -1402 -4107 2986 1179 -2826 1981 1968 -333 1211 1410 992 -229 -217 1000
557 1000 -368 -486 461 -1558 -470 317 -2904 -119 870 -2644 330 1795 -1928 618 2318 -610
573 -610 170 1820 620 -913 736 2058 -1206 -1390 2770 -1355 -3384 2527 -1119 -4353 2448 812
589 812 -3730 1243 2399 -1989 -702 3188 1034 -2216 2100 3326 -3215 -145 4694 -2504 -2567 3774
605 3774 -1704 -4026 1669 623 -2804 -824 1490 -579 -2331 1989 2369 -2686 819 3475 -1584
620 -1584 98 3118 -56 -662 657 -437 -539 -856 -418 453 -1889 -977 537 -781 -245 -117 -40 1484
$$ packed form
510c19j824O098k048p500O053K832p865K362N609m993k674N315J976o290J550
525a718P433o059m066R355k110p275P623J777q656J982N251m152l295M617J770
540B477o536J248O655n246k705P093j807m005M807j3k301J544J99m18j221J2J217
557A000j368j18R47k019J088P87l221K785R89l514K974J465l723K546J700k928
573f10P80J650j200j533J649J322l264j84M160m125k029N911l646l234O801j636
589H12m542M973J156m388J287L890k154l250M316J226o541L070M839p198o3O341
605C774n478k322N695j046l427J980K314k069j752M320L80n055L505K656n059
620a584J682L020l174o06J319j094j02l17M38Q71k342R12J514j318N36J28P7J524
$$ plain form
638 1484 171 66 2196 -662 -129 3169 98 -1538 1637 421 -1294 -431 77 -1028 -2034 308
654 308 957 -3203 -273 2610 -2359 -541 3213 -807 -1097 2554 1291 -893 197 1664 44 -1347
670 -1347 1123 210 -3463 115 1465 -2907 -696 1003 -1771 -402 999 140 -588 486 1762 556
686 556 -497 1277 611 -1071 1646 185 -2248 575 60 -1506 62 -1434 -1462 61 -473 -92 289
703 289 -675 670 968 188 1126 236 979 1594 -514 245 705 -1852 447 1153 -1864 -688 312 -928
721 -928 -496 -237 -363 -538 -669 1612 922 -1286 1293 1094 -767 1719 700 -1064 579 796 -774
738 -774 -324 -738 -346 -461 -655 530 -1074 -1615 993 475 -1206 1086 539 253 1401 373 555 314
756 314 -307 736 218 -926 459 -610 -1003 294 -1123 -1332 251 -759 -125 345 -285 685 495 -237
$$ packed form
638A484j313j05K130k858N33L298l071j636L175j216j715Q63N08j105j006K342
654C08O49m160K930K883m969J818L754m020k90L651j263k184J090J467j620j391
670a347K470r13l673L578J350m372K211J699k774J369J401q59p28J074J276j206
686E56j053J774o66j682K717j461k433K823n15j566J568j496k8J523n34L81L81
703B89r64J345K98p80R38q90P43O15k108P59M60k557K299P06l017J176J000j240
721i28M32K59j26j75j31K281o90k208K579j99j861K486j019j764J643K17j570
738g74M50m14L92j15j94J185j604n41K608n18j681K292n47k86J148j028J82k41
756C14o21J043n18j144J385j069l93J297j417k09J583j010O34M70o30R70j90p32
$$ plain form
774 -237 1214 458 -212 1200 452 -82 415 -369 193 -116 -1349 118 -557 -1516 494 -433 -831 678
792 678 -400 -260 588 -187 822 885 69 1301 193 46 1185 -404 -444 703 -846 -750 180 -1162
810 -1162 -307 -271 -861 271 -328 -289 1111 30 -128 1326 -23 492 1160 -224 602 430 -641 271
828 271 -253 -877 307 -868 -462 386 -1306 -361 455 -637 679 304 -814 851 440 292 1275 -21
846 -21 -397 807 -293 -148 204 -1103 -301 -663 -897 82 -874 -598 640 -445 16 882 -619 607
864 607 1388 -271 344 586 434 857 -27 -706 -338 -1196 154 124 -1575 -627 -32 -603 394 -47 -531 616
884 616 297 154 820 138 619 621 107 762 -338 -638 681 -251 -790 321 -918 -669 576 -768 -802
903 -802 131 -622 201 744 -36 294 166 579 718 -354 361 747 -935 294 677 -1788 -582 351 -830
$$ packed form
774b37J451p56o70J412p48n34M97p84N62l09j233J467o75r59K010r27l98J509
792F78j078J40Q48p75J009O3q16J232j108j47J139j589m0J147j549R6R30j342
810a162Q55L6n90J132n99L9J400j081j58J454j349N15O68j384Q26j72j071R12
828B71n24o24J184j175M06Q48j692R45Q16j092J316l75j118J665m11j48R83j296
846b1l76J204j100J45L52j307Q02l62k34R79r56K76J238j085M61Q66j501J226
864F07P81j659O15K42j52M23q84o79L68q58J350l0j699R48N95n71R97m41m84J147
884F16l19j43O66o82M81Kn14O55j100l00J319r32n39J111j239K49J245j344l4
903h02R33p53Q23N43p80L30j28M13J39j072P15L86j682J229L83k465J206R33j181
$$ plain form
922 -830 -381 -570 -349 -236 -527 580 59 -584 1152 723 -612 1008 592 -624 1534 712 -739 -64
940 -64 -23 17 -624 -708 -220 -1020 -982 606 -354 -1135 716 -70 -116 1294 59 -23 1046 -33 -101 460 -137
961 -137 -131 -141 -124 -80 -1102 -406 417 -845 350 387 -1045 685 929 -761 535 1029 -270 639 895 -39
981 -39 -651 18 915 -809 -1185 773 -739 -1900 887 -1 -1688 399 581 -765 54 506 317 231
999 231 527 1081 -319 336 1097 -815 -481 926 -1044 -604 902 -829 -1193 21 -204 -535 70 223
1017 223 380 -223 615 550 -673 951 696 -1026 932 942 -1298 49 568 -1101 -278 152 -676 -625 -129
1036 -129 182 -577 -810 1028 79 -451 1051 265 -502 1530 -144 -476 1020 251 -543 258 -60 -816
1054 -816 -554 121 8 -1101 191 735 -1340 -236 1298 -999 -22 1850 -168 -476 1317 394 -497
$$ packed form
922h30M49j89K21J13k91J107n21o43J736m29j335J620m16j216K158q22j451O75
940f4M1M0o41q4M88q00L8J588r60p81J851p86m6J410j235q2J069j079o8N61n97
961a37Oj0J7M4j022O96Q23j262J195L7j432J730K44j690J296M94j299R09K56r34
981c9o12O69Q97j724l76J958j512j161K787q88j687K087J82j346Q19M52j89q6
999B31K96N54j400O55P61j912L34J407j970M40J506j731l64J214k25l31O05J53
1017B23J57o03Q38o5j223J624k55j722J958J0k240J347N19j669Q23M30q28N1M96
1036a29L11p59k33J838r49n30J502p86p67K032j674l32J496p69p94Q01l18p56
1054h16K62O75j13j109J292N44k075J104J534k297R77J872k018l08J793r23q91
$$ plain form
1071 -497 -25 711 -144 -816 353 -66 -1763 391 597 -1366 -30 660 -831 115 530 -64 363 348
1089 348 764 643 -170 535 23 -185 380 -313 -1033 619 -873 -784 532 -350 -676 327 28 -653 216
1108 216 398 229 -75 670 1012 -195 270 963 -792 350 701 -902 -332 624 -732 -935 20 -469
1126 -469 -213 48 420 -68 -485 773 706 -808 1106 739 -549 806 472 -658 429 229 -300 -155
1144 -155 -218 -195 -534 -407 305 -584 -601 818 -248 -558 1366 -1 157 843 56 77 538 -57 -97 -77 -116
1165 -116 30 -504 -55 224 -747 53 120 -963 251 596 -186 576 459 22 506 358 359 135 -112 533
1185 533 -237 -506 317 -161 -1193 691 -191 -888 738 -257 -479 270 -45 -339 471 120 424 294 128
1204 128 664 -69 -356 637 -465 -608 290 -290 -687 163 -303 -141 -79 -223 158 -289 202 767 -220 136
$$ packed form
1071d97M72P36q55o72J169m19j697K154K06j963J336O90j491R46M15n94M27j5
1089C48M16j21q13P05n12k08N65o93p20J652j492Q9J316q82l26J003k99o81Q69
1108B16J82j69l04P45L42j207M65O93j755J142L51j603N70R56j356k03R55m89
1126d69K56K61L72m88m17J258o7j514J914l67j288J355l34j130J087k00n29J45
1144a55o3K3l39J27P12q89j7J419j066l10J924j367J58O86p87K1M61n95m0K0l9
1165a16J46n34M49K79r71Q00O7j083J214L45p82P62j17m37M84j48Jk24k47O45
1185E33p70k69Q23m78j032J884q82o97J626r95k22P49l15k94Q10l51L04j30j66
1204A28N36p33k87R93j102j43Q98n80l97Q50m66J62O2j44L81m47M91N65r87L56
$$ plain form
1224 136 863 -279 241 864 -342 277 -19 -342 -105 -227 -471 -82 -472 -275 133 -377 -34 243 -388
1243 -388 410 22 -75 862 71 278 859 -102 -122 208 -510 -70 140 -559 -160 -464 -607 126 -384 -557 330
1264 330 -91 165 692 -172 271 554 62 79 207 -89 200 -162 88 226 -547 -265 83 -434 70 117 -557
1285 -557 190 26 -94 389 -7 27 649 102 461 254 -625 469 11 -127 69 -384 -491 67 -161 -517
1305 -517 190 -424 63 232 -356 428 359 143 398 152 95 672 -46 345 427 -770 -174 -222 -513 -22 -172
1326 -172 -729 -28 -150 -344 99 -197 197 476 -6 721 13 -13 402 212 -184 114 -31 -474 -73 -412
1346 -412 -197 -289 -391 51 226 -658 400 -43 -92 601 67 -211 687 32 -157 329 -351 249 43 -264
1366 -264 -4 -170 -486 91 -320 -324 218 -582 236 267 -452 292 454 -112 294 185 111 224 -89 250 148
$$ packed form
1224A36P27j142N20O23j206O19k96l23K37j22k44L89l90J97M08n10L43K77o31
1243c88P98l88r7R37p91K07N81r61k0L30p18M40K10o99L99l04j43P33n10j73Q87
1264C30m21K56N27q64M43K83m92J7J28k96K89l62K50J38p73K82L48n17N04M7o74
1285e57P47j64j20M83l96L4O22n47L59k07q79J094m58j38J96m53j07N58k28l56
1305e17P07o14M87J69n88P84o9k16K55k46n7N77p18L91Q2j197N96m8k91M91j50
1326a72n57P01j22j94M43k96L94K79m82P27p08k6M15j90l96K98j45m43M01l39
1346d12K15r2j02M42J75q84J058m43m9O93n34k78Q98o55j89M86o80O00k06l07
1366b64K60j66l16N77m11mN42q00Q18L1p19P44J62n66M06j09p4J13l13L39j02
$$ plain form
1387 148 -108 -209 47 -486 -107 -201 -810 318 -126 -207 326 257 1 115 71 -1 219 -61 451 388 -117 354
1409 354 -78 -218 592 -633 -372 220 -421 -113 126 -498 82 119 -24 73 129 191 489 -155 468 361 -208
1430 -208 109 55 -292 119 54 -592 -52 -216 -374 13 -49 89 -78 36 509 175 -164 749 260 -268 693
1451 693 -68 -285 525 0 -403 97 -118 -35 -338 -262 327 -5 -97 366 -395 85 524 -310 -165 453 -255
1472 -255 195 607 204 127 -101 -33 -63 -603 147 -223 -573 27 8 -595 -197 350 -343 337 473 244 199 144
1494 144 255 77 -92 432 -160 -278 208 -69 -668 122 -240 -629 368 15 -280 174 -143 52 469 92
1514 92 334 -95 139 189 -232 460 425 -315 -76 452 -765 -91 207 -406 -162 -77 -240 -136 -97 557 206
1535 206 -329 472 228 -506 535 417 -348 225 219 -327 116 167 -267 38 -86 -117 -319 -420 400 -335 299
$$ packed form
1387A48k56j01K56n33L79r4o09J128m44q1N33o9k56J14m4p2K20k80N12o3n05M71
1409C54m32j40Q10j225K61N92o41L08K39o24N80L7j43R7N6O2K98o44O23j07n69
1430b08L17n4l47M11o5o46N40j64j58L87o2J38j67J14M73l34l39R13m89n28R61
1451F93p61k17Q10n25m03N00k15Q3l03P6N89l32r2M63p61M80M39q34J45O18p08
1472b55M50M12m03p7k28O8l0n40P50l70l50O00j9o03L98N47o93O80J36k29m5n5
1494A44J11j78j69N24n92j18M86k77n99P90l62l89R97l53k95M54l17J95M17l77
1514I2K42m29K34N0m21O92l5p40K39N28j217O74K98o13K44Q5j63J04L9O54l51
1535B06n35Q01k44p34J041j18p65N73on46M43N1m34L05j24l1k02j01Q20p35O34
$$ plain form
1556 299 519 -72 51 652 122 -480 645 299 46 -126 82 -213 23 -359 -262 -523 -357 170 -224 -27
1576 -27 159 -287 -94 585 251 81 387 31 34 58 266 91 -110 -4 -140 -324 -4 -67 -374 132 -51 -311
1598 -311 93 74 183 297 -7 -104 -1 56 205 -21 223 252 -386 -229 471 113 -506 -39 -461 -492 79 -9
1620 -9 -113 -49 78 288 43 -65 146 -339 -58 653 -259 -26 144 -279 -60 -65 -127 -253 164 -78 58 -61
1642 -61 -183 -58 -135 239 111 -151 64 268 -105 409 -37 113 262 23 -34 -242 -18 67 -59 -221 24
1663 24 -106 -292 248 -197 -115 395 -180 43 582 -31 -25 264 -40 1 180 -75 43 -122 -75 -162 -368 -185
1685 -185 -20 -443 30 210 -155 259 8 393 158 59 312 293 -45 64 298 -546 293 -115 -534 18 -390
1706 -390 -459 245 -222 0 186 -25 211 24 -84 252 314 -11 424 231 -173 244 -297 -25 -216 -154 -43
$$ packed form
1556B99K20n91J23O01n30o02J125l46k53j72K08k95K36l82R7k61J66N27l94J97
1576b7J86m46J93O79l34j70L06l56LK4K08j75k01J06j36j84L20o3l07N06j83k60
1598c11M04j9J09J14l04r7J03N7J49k26K44K9o38J57P00l58o19M67m22l1N71q8
1620ij04O4J27K10k45j08K11m85K81P11r12K33J70m23K19no2j26M17k42J36j19
1642f1j22J25p7L74j28k62K15K04l73N14m46J50J49k39n7k08K24Q5j26j62K45
1663B4j30j86N40m45Q2N10n75K23N39o13OK89l04M1J79k55J18j65M7q7k06J83
1685a85J65m23M73J80l65M14k51L85k35r9K53j9l38J09K34q44Q39m08m19N52m08
1706c90o9P04m67K22J86k11K36j87j08L36O2l25M35j93m04M17n41K72j91O2J11
$$ plain form
1727 -43 -27 -375 -193 47 -98 -171 -111 -60 271 335 121 417 -43 102 -143 -152 178 -12 -71 207 58 -297 -154
1750 -154 -389 -211 -55 -110 90 -80 -208 345 313 19 288 70 156 222 -116 10 86 -72 -9 -93 -266 275
1772 275 -385 -229 315 26 -275 144 8 138 -17 -72 405 170 96 126 -33 -290 7 42 -131 -59 -169 -217
1794 -217 -149 -190 -114 -174 -526 139 -523 55 42 -139 -41 308 23 169 131 51 210 142 -82 181 -137 -276 229
1817 229 -272 -153 208 -137 33 30 -141 301 47 -186 90 -221 196 -44 -80 101 292 3 19 292 -618
1838 -618 -102 75 -330 -119 31 -98 170 -327 -76 337 -189 109 200 -195 154 -43 -208 213 36 -205
1858 -205 -42 -41 -211 302 -427 31 -181 -96 344 375 59 67 -132 4 249 -117 5 -79 -192 194 -109 45
1880 45 -297 -514 -130 93 -52 51 46 -169 55 42 -459 569 519 -28 197 264 208 274 -130 -6 -49 64 40
$$ packed form
1727d3J6l48J82K40j45p3O0N1L31O4k14K96m60J45k45rL30j90n9K78j49l55J43
1750a54k35J78J56n5K00j70j28N53l2k94K69k18Q6O6l38J26P6j58O3q4j73N41
1772B75o60J56N44k89l01M19j36J30j55n5M77k35p4L0j59k57K97L5j73P2j10m8
1794b17O8m1P6o0l52O65o62N78j3j81R8L49k85J46l8q0J59o8k24K63l18j39N05
1817B29n01J19L61l45J70lj71M42k54k33K76l11M17k40l6J81J91k89J6K73r10
1838f18N16J77m05K11J50j29K68m97K51M13n26K98R1l95L49j97j65M21j77k41
1858b05J63Jj70N13p29M58k12Q5M40L1l16Qj99J36K45l66J22q4j13L86l03J54
1880D5l42k17L84K23j45J03nk15K24j3n01J028n0n47K25O7n6O6m04J24m3J13k4
$$ plain form
1903 40 -54 -68 -3 122 -301 -254 -7 -409 36 -278 -134 116 -85 -71 60 201 180 -91 -39 276 90 96 -14
1926 -14 -268 -56 3 -397 133 -119 -184 29 203 138 189 242 -101 61 -51 283 87 -147 352 -57 -105 0
1948 0 -25 -273 -154 15 -235 226 54 117 -28 -145 342 -145 -40 594 195 -58 368 -119 -238 169 11
1969 11 39 22 -88 -56 -67 -331 52 -216 -201 163 -176 278 242 -155 160 323 102 310 465 36 192 174 -249
1992 -249 101 -147 264 -185 -257 103 -32 47 353 -50 -442 277 -63 -210 219 21 188 -75 154 8 -140
2013 -140 -189 76 -232 -517 161 -372 -139 80 14 -14 126 -206 -108 -97 -97 436 -60 -5 420 -66 206 65 2
2036 2 184 72 -195 -18 127 -170 -74 -60 -248 44 59 -92 247 14 207 13 -42 -69 142 -167 -56 151
2058 151 -126 161 -193 -81 -2 -261 39 137 -222 -156 53 39 88 -206 -35 716 183 127 440 117 -57 47
$$ packed form
1903D0r4j4O5J25m23M7K47m02M45l14J44K50k01J4J31J41k1k71N2L15j86Oj10
1926a4k54K12N9m00N30k52o5K13J74o5N1N3l43J62j12L34j96k34M99m09m8J05
1948@k5k48J19J69k50M61j72O3j45j17M87m87J05O34l99k53M26m87j19M07j58
1969A1K8j7j10L2j1k64L83k68J5L64l39M54l6l97L15J63k21K08J55m29J56j8m23
1992b49L50k48M11m49p2L60j35P9L06m03l92P19l40j47M29j98J67k63K29j46j48
2013a40m9K65l08k85O78n33K33K19o6k8J40l32R8J1%N33m96N5M25m86K72j41o3
2036BJ82j12k67J77J45k97R6J4j88K92J5j51L39k33J93j94n5k7K11l09J11K07
2058A51k77K87l54J12P9k59L00R8l59O6K09j4M9k94J71P51n33n6L13l23j74J04
$$ plain form
2080 47 -127 225 -34 218 138 -183 -211 95 -69 145 227 -137 -40 218 -358 78 94 -255 186 -62 39 -2
2102 -2 12 16 144 -98 -227 -125 -320 161 -277 -246 121 -307 84 75 213 388 -22 212 -60 7 79 121 65 14
2126 14 133 -308 -12 -20 -115 -124 -15 -204 -53 12 -237 7 99 43 -360 -4 17 -186 -79 83 -1 100 29 101
2150 101 -144 -70 -138 -203 -50 -45 -102 134 -66 93 91 -134 127 -96 69 153 71 -104 121 -152 8 78 -137 -103
2174 -103 77 -370 323 -66 -150 324 -245 144 149 -30 44 38 89 109 203 57 57 -165 173 0 -139 -125 272 -264
2198 -264 -54 -396 -43 4 -67 -291 111 96 36 101 47 53 170 -170 31 45 -216 208 -95 -290 30 86 -596
2221 -596 150 -56 -146 -83 77 -101 162 57 23 -115 -84 372 -142 -238 115 -143 -153 158 -154 -34 104 -308
2243 -308 -77 101 -56 -40 -1 -99 273 78 52 90 -22 66 -137 -302 94 -80 -292 179 38 108 136 -10 -3
$$ packed form
2080D7j74L52k59K52q0l21k8L06j64K14Q2l64R7K58n76M36J6l49M41k48J01m1
2102bJ4MJ28k42j29J02j95M81m38L1L67m28L91rJ38J75m10K34k72O7P2M2n6n1
2126A4J19m41K96qr5rJ09j89J51O5k49K44R2n6m03L56K1k03J07J62q4J01p1P2
2150A01k45P4o8o5J53Nn7K36k00J59kk25K61k23J65Q4q2j75K25k73J60P0k15L4
2174a03J80m47O93l89q4M74n69L89Nj79P4oN1K0R4j46%k22L38j73j39J4L97n36
2198b64K10l42L53M7p1k24M02j5o0O5n4OJ17l40K01J4k61M24l03j95L20N6o82
2221e96P46k06r0O3J60j78K63j05l4j38L1M56n14r6L53k58j0L11l12J20J38m12
2243c08K31J78j57J6L9r8L72j95k6L8j12Q8k03j65L96j74k12M71j41P0K8j46P
$$ plain form
2266 -3 107 -124 -16 27 -75 321 -59 -79 325 -65 -24 83 36 89 -60 -398 -338 168 -9 3 -198 -375 -3
2289 -3 154 -90 -26 165 75 193 -193 119 -59 189 79 -97 -61 281 62 131 9 -80 -68 -7 210 174 -32
2312 -32 -221 -29 -200 -21 -95 -7 -335 255 22 166 396 134 170 242 -209 -17 -53 34 35 2 -281 100 107 -137
2336 -137 -36 -9 373 -184 -81 8 47 278 -32 -93 232 -73 99 220 53 -287 16 -66 -118 -44 -109 118 202
2359 202 -42 -23 85 -124 290 90 -210 21 -25 -93 -25 -122 -57 -21 54 -57 -42 -284 -148 -278 177 42 -237
2382 -237 -343 -84 -129 233 -24 -164 -71 64 -84 -267 12 -203 169 -38 29 119 -190 241 -72 -83 65 -64
2404 -64 45 168 -121 10 99 152 222 120 192 -112 153 -193 93 -51 -204 60 -73 -76 62 49 -187 7 -162
2427 -162 -85 -2 127 -39 97 115 35 -6 195 98 -190 -188 459 -28 148 -99 -121 134 -66 -178 -181 85 -2 258
$$ packed form
2266cJ10k31J08M3j02L96l80k0M04l90M1J07m7N3j49l38O0N06j77J2k01j77L72
2289cJ57k44O4J91r0J18l86L12j78K48j10j76L6L42k19O9j22q9J2O1K17l6k06
2312c2j89J92j71J79p4Q8l28N90k33J44K30k62L6P2m51J92l6Q7Jl3k83L81Pk44
2336a37J01K7L82n57J03Q9L9K31l10o1L25l05J72J21j67l40L03q2n2P4o5K27Q4
2359B02k44J9J08k09M14k00l00K31m6o8O8r7O5L6P5j11J5k42J36j30M55j35k79
2382b37j06K59m5L62k57j40R3J35j48j83K79k15L72k07O7R0l09M31l13j1J48j29
2404f4J09J23k89J31Q9N3P0j02P2l04K65l46K86j44j53K64j33lJ38j3k36J94j69
2427a62P7Q3J29j66J36J8q0m1K01r7k88KO47m87J76k47k2K55k00j12lK66q7K60
$$ plain form
2451 258 -95 -334 -52 -90 77 177 117 101 111 97 259 -108 -315 73 -211 173 238 15 -274 -116 -448 258
2473 258 -123 -89 287 58 225 77 -369 -146 159 40 -203 23 -262 135 57 -83 72 -226 -17 -155 -100
2494 -100 60 155 -69 112 390 88 -59 103 -193 -104 -181 -33 210 -107 -32 -191 -222 -79 112 -249 -96 -61
2516 -61 -225 -5 7 -11 339 15 -76 88 97 63 -145 45 -7 -81 100 429 -118 -122 -155 -234 21 203 -66 -315
2540 -315 180 -96 -106 -58 190 207 -57 7 -261 -136 29 203 -179 -128 72 -107 -156 -3 -149 -186 -78 -116 169
2563 169 13 8 118 -56 35 146 -268 68 -48 315 229 183 155 77 219 -101 -82 -208 117 -87 75 178 -7
2586 -7 164 -77 -27 -53 -174 23 -55 24 -213 118 -150 -192 -80 -13 -366 -65 -312 166 38 -195 186 9 -142
2609 -142 -204 149 5 189 38 -86 -106 -48 27 95 -115 -170 -258 9 214 -193 -228 -301 -63 328 35 171 51
$$ packed form
2451B58l53k39K82l8J67J00o0j6J0j4J62l67k07L88k84L84O5k23k89J58l32P06
2473B58l81L4L76k29J67j48m46K23L05j19k43K26k85L97p8j40J55k98K09j38N5
2494a00J60R5k24J81K78l02j47J62k96Q9p7J48K43l17P5j59l1J43J91l61J53L5
2516f1j64K20J2j8L50l24r1J64Rl4k08J90n2p4J81L29n47ml3p9K55J82k69k49
2540c15M95k76j0M8K48J7k64O4k68J25J65J74l82N1K00j79m9J53j46l7J08l8K85
2563A69j56nJ10j74R1J11m14L36j16L63q6m6k8p8J42l20J9j26L25k04J62J03j85
2586gJ71k41N0k6j21J97p8P9k37L31k68m2J12O7l53L01k47M78j28k33L81j77j51
2609a42o2L53j44J84j51j24k0N8P5O8k10n5q8K67K05m07l5p3K38L91k93J36j20
$$ plain form
2632 51 190 77 120 105 46 77 159 7 106 187 -9 280 89 23 13 -86 69 -490 -524 49 -102 -133 222 27
2656 27 -94 166 -194 205 -123 19 -56 -125 43 0 -186 -97 27 123 -109 71 244 252 50 -136 -68 -206 -133
2679 -133 144 -195 22 125 92 -67 -56 -24 63 -100 -114 -158 -60 -96 -66 -424 -247 71 -170 -107 -88 -155 -84 124
2703 124 62 165 185 -188 28 -164 60 -42 18 -53 172 -144 125 -256 -146 -11 -144 -51 408 -32 -93 309
2725 309 -204 49 -82 -13 113 -28 -54 -170 -206 78 -74 -26 -326 -12 -61 -119 203 131 101 30 51 180 -24
2748 -24 -108 -101 63 -198 9 -222 -106 -69 -267 59 -117 66 -176 -368 -184 80 -122 -26 -219 56 52 -311 -139
2771 -139 2 114 64 139 110 62 -29 -38 -179 -148 -20 -81 99 118 31 205 -35 69 -27 19 -136 133 -62 160
2795 160 -142 322 -25 103 105 319 -377 -29 -225 -60 268 -377 -249 213 -5 45 163 -141 103 -130 111
$$ packed form
2632E1J39j13M3j5n9L1Q2j52R9Q1j96K89j91o6j0r9J55n59l4N73j51l1L55j95
2656B7j21K60l60L99l28J42p5o9J68m3j86Q9J24R6k32J80J73Qk02j86O8j38P3
2679a33K77l39K17J03l3j59J1L2Q7j63j4m4R8l6L0l58J77L18k41O3J9o7P1K08
2703A24o2J03K0l73K16j92K24j02O0p1K25l16K69l81J10J35j33R3M59m40o1M02
2725C09n13K53j31O9J26j41k6j16l6K84j52M8l00L14m9n8L22p2l0p1K1J29k04
2748b4q4PJ64k61K07k31J16L7j98L26j76J83k42j92J84K64k02R6j93K75ml63J72
2771a39J41J12n0P5k9m8r1rj41L1J28o1J80J9q7J74k40J04r6M6j55K69j95K22
2795A60l02M64l47J28KK14o96L48j96J65L28o45J28M62k18N0J18l04K44k33K41
$$ plain form
2816 111 95 -33 34 13 21 -41 -55 -317 118 180 30 1 -147 18 -69 -5 -291 -427 -4 101 -118 66 -32 41
2840 41 0 14 -67 -159 -34 -157 213 -104 -116 -206 46 -69 164 -17 -180 -31 80 107 6 252 -180 -31 11
2863 11 -134 32 111 12 61 -29 -116 -65 110 -134 -101 147 -15 202 -56 -118 -209 249 82 -8 -9 -156 23 -253
2887 -253 -109 -52 -34 -35 -150 -1 -279 9 185 10 -66 166 40 29 -141 121 -273 0 114 -59 3 213
2909 213 122 94 110 91 -187 -20 -14 222 12 -177 61 -236 -153 101 105 -252 96 -10 66 471 53 -157 44
2932 44 -3 -18 -222 -152 -402 -170 -100 14 -32 46 1 141 -58 230 261 196 48 -131 -83 145 -109 -52 -8 -247
2956 -247 179 78 206 -265 5 65 -154 31 -16 110 -179 184 -43 -115 168 -13 207 -241 -226 61 -231
2977 -231 -129 197 -65 -125 -129 -322 -157 -412 -133 60 -78 -91 -35 -254 -32 173 116 94 3 -128 62 -138 -272
$$ packed form
2816A11j6j28O7k1Qo2j4k62M35O2j50k9j48J65q7O4k86j36M23J05k19J84r8P3
2840D1m1J4q1r2J25j23L70l17j2r0K52j15K33j81j63J49J11K7j01K46m32J49M2
2863A1j45J66P9r9M9r0q7N1J75k44L3K48j62K17k58o2r1M58j67r0jj47J79k76
2887b53J44N7J8jj15J49k78K88J76j75p6K32j26j1j70K62l94K73J14j73O2K10
2909B13r1k8J6j9k78J67OK36k10j89K38k97Q3K54Ml57L48j06P6M05m18k10K01
2932D4m7j5k04P0k50K32P0J14m6P8m5J40j99K88L1o5j48j79M8K28k54N7M4k39
2956b47M26j01J28m71K70O0k19J85m7J26k89L63k27p2K83j81K20m48J5K87k92
2977b31J02L26k62o0mj93J65k55K79J93j38j3N6k19K22K05n7k2r1j31J90k00j34
$$ plain form
3000 -272 39 375 -192 -117 -133 205 90 234 -36 -113 95 238 -238 191 117 55 -81 -40 -124 86 202 -149
3022 -149 84 60 -178 -69 -13 9 44 -28 107 -163 137 -271 457 18 56 135 163 145 -9 10 -67 -230 -167 -152
3046 -152 69 251 -64 -46 -140 3 -24 -323 22 59 243 -193 64 -127 -22 -19 -119 132 127 -82 -55 34 12 181
3070 181 -145 7 -244 -83 -181 -215 -91 -60 -40 -302 86 204 31 -155 -132 37 -91 -6 249 191 -138 29
3092 29 175 -82 -241 361 -100 -379 128 -179 -1 97 -232 52 -13 -199 -47 -115 -50 480 -95 -114 -52 -237
3114 -237 -128 -12 113 126 119 -228 -27 -200 -172 -153 -116 -83 106 158 -66 121 35 70 -52 -63 133 -151 26 -80
3138 -80 -168 200 -274 -103 286 2 -55 -184 -32 -62 -6 38 81 18 262 -56 133 -141 136 121 -206 24 8
3161 8 302 58 -72 -184 104 -51 43 152 -47 291 130 65 319 43 228 300 -28 69 -29 -515 -365 47
$$ packed form
3000b72L11L36n67P5j6L38j15J44k70p7K08J43m76M29p4o2j36M1q4K10J16l51
3022a49K33k4k38J09N6K2L5p2J35k70L00m08P28m39L8P9K8j8j54J9p7j63O3J5
3046a52K21J82l15J8r4J43k7k99L45L7J84m36K57j91J05Lj00K51nk09K7Q9k2J69
3070A81l26J52k51J61r8l4J24L1K0k62L88J18j73j86K3J69j28Q5K55n8l29J67
3092B9J46k57j59O02m61k79N07l07J78R8l29K84o5j86J52o8O5N30n75j9O2j85
3114b37J09J16J25J3pl47K01j73K8J9L7L3J89N2k24J87q6L5j22j1J96k84J77j06
3138h0q8L68m74J71L89k84n7j29J52l0N6M4M3o3K44l18J89k74K77j5l27K30j6
3161HK94k44j30j12K88j55R4J09j99L38j61o5K54k76J85P2l28R7r8m86J50M12
$$ plain form
3183 47 100 272 74 -386 -34 -166 -62 248 33 -22 -56 -15 -183 280 111 144 96 -86 -142 -106 5 266 -81
3206 -81 23 153 -112 -343 134 245 -180 263 -50 -118 103 -128 360 39 53 -65 175 86 -280 13 45 -61
3228 -61 -157 61 -3 -200 176 -161 117 305 187 -188 94 93 -185 -54 -51 19 -182 33 257 -313 111 139 42
3251 42 -10 35 24 34 35 -30 44 141 48 366 94 124 123 -136 9 7 49 111 7 98 -91 -241 37 -281 -151 -162 72
3278 72 -192 -117 -67 119 52 -76 58 -16 -147 -60 1 138 79 351 -170 -89 -98 -159 213 -71 -241 230 108 -117
3302 -117 -85 -63 -23 76 153 42 264 -78 30 -84 240 115 22 -275 12 111 -362 33 -113 -55 43 86 -91
3325 -91 -94 14 181 -187 134 -35 -207 -25 88 -148 6 -294 -194 -258 95 -283 4 -76 260 121 -45 -137
3347 -137 291 62 263 -52 -189 54 -132 93 -23 -8 -227 126 -380 102 -155 -30 -95 -139 -487 40 -85
$$ packed form
3183D7N3J72j98m60L52j32J04L10k15n5l4M1j68M63j69L3m8j82n6L6J11K61l47
3206h1J04J30k65k31M77J11m25M43l13o8K21k31M88l21J4j18K40q9l66K93L2j06
3228f1r6K18o4j97L76l37K78J88j18l75K82jk78J31LP0k01K15K24n70M24K8r7
3251D2n2M5j1J0Jo5P4R7r3L18k72L0jk59J45kM2O2j04R1j89j50K78l18J30j1K34
3278G2k64P5N0J86o7j28J34p4j31Q7O1J37n9K72n21Q1ro1L72k84j70M71j22k25
3302a17L2K2M0R9P7j11K22l42J08j14L24j25r3k97K87R9m73L95j46N8R8M3j77
3325i1lJ08J67l68L21j69j72J82J13k36J54l00J00o4L53l78K87q0L36j39j66r2
3347a37M28k29K01l15j37K43j86K25j16J5k19L53n06M82k57J25o5m4l48N27j25
$$ plain form
3368 -85 -231 91 -87 57 129 -144 263 -141 108 -2 -196 -85 -107 145 -20 26 -231 -67 -124 -47 -13 3 18
3391 18 20 -79 -39 -95 -57 -10 12 -205 8 236 169 99 181 -288 58 10 -86 89 -78 -125 52 -79 -173 174 46
3416 46 217 127 101 -6 83 52 15 23 229 -151 -219 67 6 -71 -15 -55 79 18 219 -92 93 -122 -99 152 -29
3441 -29 173 46 -21 -122 -22 -75 -225 -149 -48 -146 169 -115 17 -528 -1 98 -85 74 -25 134 -153 114
3463 114 136 -102 -92 224 -117 -176 -88 322 -220 198 -256 38 136 123 -159 -286 3 -117 -79 -57 15 -113 325
3486 325 151 158 356 -154 -41 -79 -67 132 140 246 -15 52 -75 -41 -193 237 -257 234 224 -38 34 145 -2
3509 -2 59 137 -149 -175 115 -100 -175 -355 -81 -167 -32 55 -141 102 -17 -67 15 234 -188 311 -143 59 28 -104
3533 -104 143 -87 76 103 -38 -70 -31 -480 51 -63 141 -177 106 -147 -23 174 322 11 189 95 38 -28
$$ packed form
3368h5j46L22j78J44P2k73M07m04K49j10j94J11k2K52j65M6k57J64n7P7L4J6J5
3391A8Kr9M0n6L8M7K2k17K13K28o7p0Q2m69L46m8r6J75j67m7J77j31r4L47j28
3416D6J71r0k6j07Q9l1l7QK06l80o8K86o1p7N6m0J34o1K01l11J85k15K3K51j81
3441b9K02j27o7j01J00n3j50P6J01r8L15k84J32n45N27R9j83J59r9J59k87K67
3463A14K2k38J0L16l41n9Q8M10n42M18m54K94R8j3k82j27K89j20L8K2P2j28M38
3486C25j74PJ98n10J13l8J2J99QJ06k61O7j27L4j52M30m94M91j0k62P2J11j47
3509bO1P8k86k6K90k15p5j80K74q6J35Q7j96K43j19n0Q2K19m22M99m54K02l1j32
3533a04K47k30J63K7j41l2L9m49N31j14K04l18K83k53J24J97J48l11J78r4n7o6
$$ plain form
3555 -28 -140 -48 -64 -17 -98 -52 227 -33 41 -46 -81 -58 172 61 323 149 -219 101 125 -141 327 172 -80 89
3579 89 130 122 30 126 -125 264 160 26 -16 -11 175 -149 -412 125 -60 -72 66 -262 -303 112 -28 157 211 22
3603 22 78 188 27 -97 107 -75 -187 80 -122 -59 -64 -87 266 160 250 -139 -39 -20 147 -157 132 -242 135
3626 135 3 -83 110 47 -402 91 98 222 -81 70 -151 36 -60 227 -120 -5 -148 274 85 410 127 -210
3648 -210 30 -158 -182 43 -78 53 230 -271 32 135 118 -158 188 151 258 -94 159 20 62 -243 274
3669 274 22 -110 -136 -131 -215 259 -35 -167 -77 -138 -15 -132 -6 -51 183 -145 142 98 239 -13 -201 151 253
3692 253 -57 90 -35 41 -41 -41 -92 45 -128 -50 -47 -41 95 225 222 76 -22 216 -43 -37 112 -87 105 -85 70
3717 70 -170 185 99 -217 20 -74 -127 -152 233 89 136 -178 -132 -196 170 -80 64 58 -38 -266 -319 -60 -110 -251
$$ packed form
3555b8j12R2j6M7q1M6K79k60P4q7l5K3K30j11K62j74l68L20K4k66M68j55k52J69
3579H9M1qr2R6k51L89j04j34m2NJ86l24k63N37j85j2J38l28m1M15j40J85N4j89
3603B2N6J10j61j24K04j82j12K67k02O3nk3L53j06R0l89J00J9J67l04K89l74L77
3626A35j32q6J93o3m49M93PJ24l03J51k21J87r6K87l47J15j43M22j89L25k83l37
3648b10K40j88k4K25j21J31J77n01L03J03j7k76L46l7J07l52K53j39M2l05N17
3669B74k52j32k6Nq4M74k94j32R0o1J23j17J26m5K34l28K87m4J41k52j88L52J02
3692B53l10J47j25P6q2%n1J37j73P8LOJ36J30lj46r8K38k59OJ49j99J92j90J55
3717G0k40L55q6l16K37r4n3k5L85j44M7l14M6o4L66k50J44or6k28n3K59n0j41
$$ plain form
3741 -251 -266 -317 -82 -37 43 -261 -84 -165 -87 -100 -13 368 -331 107 102 -281 -37 -68 -8 61 -47 -248 345 -93
3765 -93 -73 94 22 8 -288 -213 -321 274 -56 -68 119 125 -113 83 -209 215 -197 86 -103 -106 -6 -109 -99 -197
3789 -197 -120 10 78 -326 14 -147 68 -217 -173 375 139 187 -16 -85 96 184 -105 154 53 -14 -207 67
3811 67 -26 -45 -336 -193 52 -107 86 -44 -153 -42 83 -110 -62 -89 -233 4 -189 136 -20 16 9 58 79
3834 79 -101 89 -52 100 43 15 281 76 -268 42 116 33 -99 58 -2 103 31 -424 74 -163 -175 -49 121
3857 121 130 -106 -35 39 -63 -104 -6 -176 141 -193 45 -70 -36 -27 60 183 -131 -168 -223 136 -105 112 22 -214
3881 -214 139 138 256 23 147 -92 116 58 187 -252 -132 23 -111 26 -174 -10 -48 -101 213 287 -275 -30
3903 -30 -112 -38 180 285 33 -93 27 20 170 94 -1 290 -161 -295 -75 -204 -123 -53 -14 93 -188 -9 -35 93
$$ packed form
3741b51j5n1K35M5Q0l04J77q1P8j3Q7L81o99M38nl83K44l1O0O9j08k01N93m38
3765i3K0J67p2j4k96P5j08N95l30j2J87Ok38J96k92M24m12K83j89lJ00j03J0r8
3789a97P7J30O8m04L40j61K15k85M4N48k36M8k03o9J81Q8k89K59j01o7j93K74
3811F7r3j9k91J43K45j59J93j30j09J11J25j93M8k7j44K37j93L25j56L6pM9K1
3834G9j80J90j41J52n7k8K66k05l44L10P4q3j32J57o0J05p2m55M98k37j2J26J70
3857A21Rk36P1P4j02m1R8j70L17l34K38j15L4RQ7J23l14l7n5L59k41K17r0k36
3881b14L53jJ18k33J24k39K08n8J29m39J20J55j34J37k00J64l8n3L14P4n62K45
3903c0q2P4K18J05k52j26J20pJ50p6r5K91m51j34K20j29Q1P0L9J07k81J79k6J28
$$ [...]
8191a00
##END NTUPLES=NMR FID
##END=
