##TITLE=1H_DE-80H_X3
 200.13MHz, d2o
 8 sc
 
 19ns.26.2.2025
##JCAMPDX= 6.0         $$ Bruker NMR JCAMP-DX V2.0
##DATA TYPE= NMR FID
##DATA CLASS= NTUPLES
##ORIGIN= UXNMR, Bruker Analytische Messtechnik GmbH
##OWNER= pz
$$ XWIN-NMR		Version 3.5
$$ Thu Apr 10 14:16:43 2025 Russian Standard Time (UT+4h)  Yarkov@DPX200
##.OBSERVE FREQUENCY= 200.1313
##.OBSERVE NUCLEUS= ^1H
##.DELAY= (6, 6)
##.ACQUISITION MODE= SIMULTANEOUS
##.ACQUISITION SCHEME= undefined
##.AVERAGES= 8
##.DIGITISER RES= 18
##SPECTROMETER/DATA SYSTEM= spect
##.PULSE SEQUENCE= zg30
##.SOLVENT NAME= CDCl3
##.SHIFT REFERENCE= (INTERNAL, CDCl3, 0, 14.3821)
##AUDIT TRAIL= $$ (NUMBER, WHEN, WHO, WHERE, WHAT)
$$ ##TITLE= Audit trail, XWIN-NMR		Version 3.5
$$ ##JCAMPDX= 5.01
$$ ##ORIGIN= Bruker BioSpin GmbH
$$ ##OWNER= Yarkov
$$ C:/Bruker/XWIN-NMR/data/yarkov2/nmr/H-C/1/audita.txt
$$ ##AUDIT TRAIL=  $$ (NUMBER, WHEN, WHO, WHERE, WHAT)
(   1,<2025-04-10 14:15:22.84 +0400>,<Yarkov>,<DPX200>,
      <created by zg, POWCHK disabled, PULCHK disabled
       configuration hash MD5:
       00 E9 B6 7A A2 85 ED C7 34 08 36 98 17 FE 4E 26
       data hash MD5: 16K
       9B 23 E4 C9 D3 ED 57 BF 34 B4 A8 3F 91 37 F1 D9>)
$$ ##END=
$$ 
$$ hash MD5
$$ DC F3 AD FF BD 5A 6E 66 4B 79 EB DA 4B DA 2E 04
##$RELAX= 
##$RELAX= 
##$RELAX= 
##$RELAX= 
##$RELAX= 
##$RELAX= 
$$ Bruker specific parameters
$$ --------------------------
##$DU= <C:/Bruker/XWIN-NMR>
##$EXPNO= 1
##$NAME= <H-C>
##$PROCNO= 1
##$TYPE= <nmr>
##$USER= <yarkov2>
##$AMP= (0..31)
100 100 100 100 100 100 100 100 100 100 100 100 100 100 100 100 100 100 
100 100 100 100 100 100 100 100 100 100 100 100 100 100 
##$AQSEQ= 0
##$AQ_mod= 1
##$AUNM= <au_zg>
##$AUTOPOS= <>
##$BF1= 200.13
##$BF2= 200.13
##$BF3= 200.13
##$BF4= 200.13
##$BF5= 200.13
##$BF6= 200.13
##$BF7= 200.13
##$BF8= 200.13
##$BYTORDA= 1
##$CFDGTYP= 0
##$CFRGTYP= 5
##$CHEMSTR= <none>
##$CNST= (0..31)
1 1 145 1 1 1 1 1 1 1 1 1 1 1 1 1 1 1 1 1 1 1 1 1 1 1 1 1 1 1 1 1 
##$CPDPRG= <>
##$CPDPRG1= <>
##$CPDPRG2= <>
##$CPDPRG3= <>
##$CPDPRG4= <mlev>
##$CPDPRG5= <mlev>
##$CPDPRG6= <mlev>
##$CPDPRG7= <mlev>
##$CPDPRG8= <mlev>
##$CPDPRGB= <>
##$CPDPRGT= <>
##$D= (0..31)
0 0.7 0 0 0 0 0 0 0 0 0 0.03 0 0 0 0 0 0 0 0 0 0 0 0 0 0 0 0 0 0 0 0 
##$DATE= 1744280122
##$DBL= (0..7)
120 120 120 120 120 120 120 120 
##$DBP= (0..7)
150 150 150 150 150 150 150 150 
##$DBP07= 0
##$DBPNAM0= <>
##$DBPNAM1= <>
##$DBPNAM2= <>
##$DBPNAM3= <>
##$DBPNAM4= <>
##$DBPNAM5= <>
##$DBPNAM6= <>
##$DBPNAM7= <>
##$DBPOAL= (0..7)
0.5 0.5 0.5 0.5 0.5 0.5 0.5 0.5 
##$DBPOFFS= (0..7)
0 0 0 0 0 0 0 0 
##$DE= 6
##$DECBNUC= <off>
##$DECIM= 32
##$DECNUC= <off>
##$DECSTAT= 4
##$DIGMOD= 1
##$DIGTYP= 9
##$DL= (0..7)
0 120 120 120 120 120 120 120 
##$DP= (0..7)
150 150 150 150 150 150 150 150 
##$DP07= 0
##$DPNAME0= <>
##$DPNAME1= <>
##$DPNAME2= <>
##$DPNAME3= <>
##$DPNAME4= <>
##$DPNAME5= <>
##$DPNAME6= <>
##$DPNAME7= <>
##$DPOAL= (0..7)
0.5 0.5 0.5 0.5 0.5 0.5 0.5 0.5 
##$DPOFFS= (0..7)
0 0 0 0 0 0 0 0 
##$DQDMODE= 0
##$DR= 18
##$DS= 0
$$ [...]
##$SUBNAM2= <"">
##$SUBNAM3= <"">
##$SUBNAM4= <"">
##$SUBNAM5= <"">
##$SUBNAM6= <"">
##$SUBNAM7= <"">
##$SUBNAM8= <"">
##$SUBNAM9= <"">
##$SW= 18.0517328524113
##$SWIBOX= (0..15)
0 0 2 0 0 0 0 0 0 0 0 0 0 0 0 0 
##$SW_h= 3612.71676300578
##$TD= 16384
##$TD0= 1
##$TE= 0
##$TE2= 300
##$TE3= 300
##$TEG= 300
##$TL= (0..7)
0 120 120 120 120 120 120 120 
##$TP= (0..7)
150 150 150 150 150 150 150 150 
##$TP07= 0
##$TPNAME0= <>
##$TPNAME1= <>
##$TPNAME2= <>
##$TPNAME3= <>
##$TPNAME4= <>
##$TPNAME5= <>
##$TPNAME6= <>
##$TPNAME7= <>
##$TPOAL= (0..7)
0.5 0.5 0.5 0.5 0.5 0.5 0.5 0.5 
##$TPOFFS= (0..7)
0 0 0 0 0 0 0 0 
##$TUNHIN= 0
##$TUNHOUT= 0
##$TUNXOUT= 0
##$USERA1= <user>
##$USERA2= <user>
##$USERA3= <user>
##$USERA4= <user>
##$USERA5= <user>
##$V9= 5
##$VALIST= <valist>
##$VCLIST= <CCCCCCCCCCCCCCC>
##$VD= 0
##$VDLIST= <DDDDDDDDDDDDDDD>
##$VPLIST= <PPPPPPPPPPPPPPP>
##$VTLIST= <TTTTTTTTTTTTTTT>
##$WBST= 1024
##$WBSW= 4
##$XGAIN= (0..3)
0 0 0 0 
##$XL= 0
##$YL= 0
##$YMAX_a= 584309
##$YMIN_a= -687776
##$ZGOPTNS= <>
##$ZL1= 120
##$ZL2= 120
##$ZL3= 120
##$ZL4= 120
##$ABSF1= 10
##$ABSF2= 0
##$ABSG= 5
##$ABSL= 3
##$ALPHA= 0
##$AQORDER= 0
##$ASSFAC= 0
##$ASSFACI= 0
##$ASSFACX= 0
##$ASSWID= 0
##$AUNMP= <proc_1d>
##$AZFE= 0.1
##$AZFW= 0.1
##$BCFW= 1
##$BC_mod= 2
##$BYTORDP= 1
##$COROFFS= 0
##$CY= 83.5205535888672
##$DATMOD= 1
##$DC= 2
##$DFILT= <>
##$DTYPP= 0
##$F1P= 10.8118882576601
##$F2P= -7.23987719738617
##$FCOR= 0.5
##$FTSIZE= 0
##$FT_mod= 4
##$GAMMA= 1
##$GB= 0.15
##$INTBC= 1
##$INTSCL= 1
##$ISEN= 128
##$LB= 0.25
##$LEV0= 0
##$LPBIN= 0
##$MAXI= 10000
##$MC2= 0
##$MEAN= 0
##$ME_mod= 0
##$MI= 1.114404
##$NCOEF= 0
##$NC_proc= 0
##$NLEV= 6
##$NOISF1= 3.799351
##$NOISF2= 2.8
##$NSP= 1
##$NTH_PI= 0
##$NZP= 0
##$OFFSET= 14.38212
##$PC= 1
##$PHC0= -1182.281
##$PHC1= 4.133671
##$PH_mod= 1
##$PKNL= yes
##$PPARMOD= 0
##$PSCAL= 0
##$PSIGN= 0
##$REVERSE= no
##$SF= 200.129724274929
##$SI= 16384
##$SIGF1= 3
##$SIGF2= 2
##$SINO= 400
##$SIOLD= 16384
##$SREGLST= <1H.CDCl3>
##$SSB= 0
##$STSI= 0
##$STSR= 0
##$SW_p= 3205.1282051282
##$SYMM= 0
##$S_DEV= 0
##$TDeff= 0
##$TDoff= 0
##$TI= <>
##$TILT= no
##$TM1= 0
##$TM2= 0
##$TOPLEV= 0
##$USERP1= <user>
##$USERP2= <user>
##$USERP3= <user>
##$USERP4= <user>
##$USERP5= <user>
##$WDW= 1
##$XDIM= 8192
##$YMAX_p= 0
##$YMIN_p= 0
$$ End of Bruker specific parameters
$$ ---------------------------------
##NTUPLES= NMR FID
##VAR_NAME=  TIME,          FID/REAL,        FID/IMAG
##SYMBOL=    X,             R,               I
##VAR_TYPE=  INDEPENDENT,   DEPENDENT,       DEPENDENT
##VAR_FORM=  AFFN,          ASDF,            ASDF
##VAR_DIM=   8192,          8192,            8192
##UNITS=     SECONDS,       ARBITRARY UNITS, ARBITRARY UNITS
##FACTOR=    0.0002768,     1,               1
##FIRST=     0,             0,               0
##LAST=      2.2672688,     0,               0
##MIN=       0,             -687776,         0
##MAX=       2.2672688,     584309,          0
$$ Real data points
##PAGE= N=1
##DATA TABLE= (X++(R..R)), XYDATA
$$ [...]
$$ plain form
1844 180 239 -283 506 8 -143 221 -288 170 -58 -166 152 -89 -238 224 -356 -345 448 -237 -160 366 -108
1865 -108 107 624 -196 372 29 101 259 -42 -573 289 -206 -107 153 -542 6 149 -444 264 310 -435 276
1886 276 103 -87 759 198 -163 402 2 210 -1 -470 331 -251 -535 329 -216 -435 109 -375 -244 212
1906 212 -245 -86 466 -133 71 80 -307 593 -105 -25 339 -281 -202 132 -149 121 -19 -381 447 -82 -299
1927 -299 204 -240 -412 338 39 -122 278 324 462 -77 -65 87 75 -198 369 -250 -273 210 -176 -294 148
1948 148 -342 75 6 -188 178 -96 -48 18 -112 195 395 -93 48 -33 -249 330 -147 -239 259 -193 -287 -13
1970 -13 -141 -460 51 -228 235 -79 -150 61 161 164 416 147 -10 335 -224 51 -137 -251 89 137 -218 -76
1992 -76 -493 -427 234 -215 -97 284 -13 67 -105 47 211 205 338 453 -279 -215 479 -217 -290 52 220 -224
$$ packed form
1844A80N9n22P89m98j51L64n09M58k28j08L18k41j49M62n80J1P93o85P7N26m74
1865a08K15N17q20N68l43P2J58l01n31Q62m95R9K60o95N48J43n93P08M6p45P11
1886B76j73j90Q46n61l61N65m00K08k11m69Q01n82k84Q64n45k19N44m84J31M56
1906B12m57J59N52n99K04Rl87R00o98Q0L64o20P9L34k81K70j40l62Q28n29k17
1927b99N03m44j72P50k99j61M00M6J38n39J2J52j2k73N67o19k3M83l86j18M42
1948A48m90M17o9j94L66k74M8O6j30L07K00m88J41q1k16N79m77r2M98m52r4K74
1970a3j28l19N11k79M63l14p1K11J00LK52k69j57L45n59K75j88j14L40M8l55J42
1992g6m17O6O61m49J18L81k97Q0j72J52J64oJ33J15p32O4O94o96p3L42J68m44
$$ plain form
2014 -224 -350 -447 -74 -317 -34 506 334 23 536 -260 -211 120 154 424 213 175 379 -317 -244 694 -417
2035 -417 -230 561 -162 -242 -83 -231 90 -101 230 553 -233 111 419 -491 -267 293 -195 109 407 -254
2055 -254 -59 -210 25 -99 -129 295 472 -791 -343 482 -575 57 642 513 191 42 127 -84 -412 393
2075 393 269 -357 -103 50 -611 -571 115 94 182 -81 181 31 -828 -224 577 -384 277 886 -133 -68 19
2096 19 -188 -226 79 272 52 -282 -58 -121 -831 391 453 -171 267 403 -372 -173 205 337 57 66 304 216
2118 216 -619 -161 374 -355 335 338 -96 -172 -204 -280 -188 -161 250 368 -690 284 203 -692 -123 263 -172 39
2140 39 311 119 58 -519 -28 69 -401 352 -178 -764 -228 -387 -548 158 388 -123 298 -139 -42 77 -356
2161 -356 323 586 149 -94 -151 -491 26 -69 -261 82 -130 177 -122 -473 69 41 -211 80 302 -231 249
$$ packed form
2014b24j26r7L73k43K83N40j72l11N13p96M9L31L4K70k11l8K04o96P3R38j111
2035d17J87P91p23q0J59j48L21j91L31L23p86L44L08r10K24N60m88L04K98o61
2055b54J95j51K35j24l0M24J77j263M48Q25j057O32N85j29l22j49Q5k11l28Q05
2075C93j24o26K54J53o61M0O86k1Q8k63K62j50q59O04Q01r61O61O09j019O5Q7
2096A9k07l8L05J93k20l34K24o3p10J222O2o24M38J36p75J99L78J32k80RK38q8
2118B16q35M58N35p29O90Lm34p6l2p6R2K7M11J18j058R74q1q95N69L86m35K11
2140C9K72j92o1n77M91R7m70P53n30n86N36j59j61P06K30n11M21m37R7J19m33
2161c56O79K63m37k43n7l40N17r5j92L43k12L07k99l51N42k8k52K91K22n33M80
$$ plain form
2182 249 -126 -8 127 -250 300 6 -161 -35 -46 -265 -247 93 -400 352 -408 -58 106 -375 19 11 -314
2203 -314 239 155 -94 80 -29 126 -53 -46 49 149 -54 -284 -362 -235 255 -10 -289 169 -139 -88 196 -18
2225 -18 -13 -7 -165 -13 135 -315 170 -149 -6 -16 -200 -32 -61 -270 -172 150 -437 178 140 -463 74 13 -9 348
2249 348 -141 81 166 240 44 -154 -351 132 -179 -151 179 -217 -298 -1 134 -59 206 -137 308 15 -481
2270 -481 242 409 -2 123 -87 49 -73 -246 31 -143 -190 211 48 -88 215 328 -161 94 14 80 45
2291 45 -47 87 123 -183 113 196 -103 27 -233 151 171 -186 -8 162 -304 176 57 -182 375 -60 -239 238
2313 238 -101 -114 -141 -2 60 119 325 -45 -8 -172 142 -160 -276 115 -114 -218 8 -245 -301 -185 -87 151
2335 151 144 -102 12 -141 -134 191 20 11 141 -288 35 153 -489 74 -48 -196 181 -63 -248 -4 -159 120
$$ packed form
2182B49l75J18J35l77N50k94j67J26j1k19J8L40m93P52p60L50J64m81L94ql25
2203c14N53q4k49J74j09J55j79PR5J00k03k30p8J27M90k65k79M58l08N1K84k14
2225a8NOj58J52J48m50M85l19J43j0j84J68k9k09R8L22n87O15l8o03N37o1k2L57
2249C48m89K22Q5P4j96j98j97M83l11K8L30l96q1K97J35j93K65l43M45k93m96
2270d81P23J67m11J25k10J36j22j73K77j74m7M01j63j36L03J13m89K55q0O6l5
2291D5r2J34L6l06K96Q3k99J30k60L84K0l57J78J70m66M80j19k39N57m35j79M77
2313B38l39j3k7J39O2N9K06l70L7j64L14l02j16L91k29j04K26k53n6J16R8K38
2335A51pk46J14j53PL25j71rJ30m29L23J18o42N63j22j48L77k44j85K44j55K79
$$ plain form
2357 120 192 129 72 48 210 289 25 -43 98 -167 17 267 -285 -296 -7 -342 -90 251 -408 332 112 -283
2379 -283 112 51 37 223 10 172 312 -64 63 5 44 -120 -79 69 6 -147 -27 198 -480 83 128 -14
2401 -14 282 187 -52 97 388 194 297 70 -26 -73 25 -21 96 117 36 27 -88 78 -90 -102 221 50 -88 171
2425 171 -124 78 240 -143 242 -99 8 -71 -19 -176 -45 -277 -267 83 -164 -234 -189 -185 175 81 -57 69 -363
2448 -363 242 213 -186 -61 271 56 -1 -313 64 -181 -96 -58 -58 -263 -185 237 -135 -83 -44 185 333 267 4
2471 4 44 69 220 -203 -41 161 84 -197 168 218 -82 -50 28 -168 99 87 -118 -91 -245 109 16 119 -63 44
2495 44 -94 18 -88 -152 -56 -41 -28 70 -327 -108 -103 -131 -30 -62 -73 -14 69 -233 -16 103 110 -133 -65 162 179 -404
2521 -404 7 -16 98 168 197 50 -3 -356 124 -26 -204 43 215 -216 142 312 -1 39 7 -106 -229 36
$$ packed form
2357A20P2o3n7k4J62P9k64o8J41k65J84K50n52j1K89l35K52L41o59P40k20l95
2379b83L95o1j4J86k13J62J40l76J27n8L9j64M1J48o3j53J20K25o78N63M5j42
2401a4K96r5k39J49K91j94J03k27r6m7R8m6J17K1q1rj15J66j68j2L23j71j38K59
2425A71k95K02J62l83L85l41J07p9N2j57J31k32J0L50k47p0M5ML60r4j38J26m32
2448c63O05k9l99J25L32k15n7l12L77k45Q5L8%k05P8M22l72N2L9K29J48o6k63
2471DM0K5J51m23J62K02p7k81L65N0l00L2P8j96K67j2k05K7j54L54r3J03j82J07
2495D4j38J12j06o4R6J5J3R8l97K19Nk8J01l2j1N9Q3l02K17J19Pk43O8K27J7n83
2521d04M11k3J14P0K9j47n3l53M80j50j78K47J72m31L58J70l13M0l2j13j23K65
$$ plain form
2543 36 86 498 -133 -167 272 82 20 -214 -397 -117 -117 -33 52 -153 254 245 -548 142 314 -49 127 11 28 308
2567 308 -247 -121 121 -375 6 106 -215 275 -23 -397 -38 -92 -69 358 -196 -309 224 -105 176 341 -142
2588 -142 273 -99 -160 -20 -225 52 -5 -31 91 134 -171 119 172 -374 348 113 144 -49 121 -90 121 170
2610 170 351 108 -169 202 -109 -319 -12 292 -185 184 150 -237 -166 -136 -258 104 -96 78 5 -157 -57
2631 -57 -356 -12 212 -138 -193 -149 -46 24 -337 -251 -53 -61 -563 -28 -259 -332 90 74 -123 -238 21 46 135 -196
2655 -196 -11 -101 -285 372 -113 48 103 -32 -254 56 57 -78 95 267 81 37 -219 417 257 75 171 -199
2677 -199 -75 -166 -94 -54 31 -322 54 -31 82 9 233 -63 60 -159 38 16 -185 213 184 73 -43 220 134
2700 134 7 -80 -333 156 20 -223 -136 -21 90 -77 -177 49 229 103 118 -97 188 332 67 23 50 -85
$$ packed form
2543C6N0M12o31l4M39j90o2k34j83K80%Q4Q5k05M07rp93O90J72l63J76j16J7K80
2567C08n55J26K42m96L81J00l21M90k98l74L59n4K3M27n54j13N33l29K81J65m83
2588a42M15l72o1J40k05K77n7k6J22M3l05K90N3n46P22k35L1j93J70k11K11M9
2610A70J81k43k77L71l11k10L07L04m77L69l4l87P1L0j22L62k00J74p3j62J00
2631e7k99L44K24l50n5M4J03P0l61Q6J98qn02N35k31p3M22j6j97j15K59K5Q9l31
2655a96J85r0j84O57m85J61N5j35k22L10Jj35J73J72j86m4k56O36j60j82R6l70
2677a99J24r1P2M0Q5l53L76q5J13p3K24k96J23k19J97k2k01L98k9j11j16K63q6
2700A34j27q7k53M89j36k43Q7J15J11j67j00K26J80j26J5k15K85J44k65m4K7j35
$$ plain form
2722 -85 96 -10 -93 14 -110 40 -35 -154 -266 44 43 155 148 -341 78 -43 124 96 -1 -72 11 136 -100 142
2746 142 169 58 -182 49 -134 -34 -117 55 96 -142 192 4 -2 364 72 49 -226 311 324 -55 -1 63 -193
2769 -193 24 161 -59 -77 -19 8 50 -99 53 7 -118 86 -2 -200 76 251 -19 -105 476 6 88 -1 -209
2792 -209 145 -3 -102 130 25 79 -175 -352 -141 28 -114 -76 94 61 -9 -233 171 227 -47 202 182 -144
2814 -144 -21 -28 9 -33 107 -121 114 -180 -116 64 -254 -53 116 -248 -230 -58 -146 244 57 45 293 173 56
2837 56 96 19 -152 -82 -118 159 -78 -194 18 -1 -270 -84 -206 -102 -83 -216 -11 176 -180 -31 187 -52
2859 -52 -124 -50 282 97 -98 60 163 -35 -79 -25 -93 22 -123 -143 36 -75 -18 -129 21 -67 187 170 72 127
2883 127 140 262 -153 -36 153 24 221 41 -29 -175 -26 33 107 -120 27 -13 4 261 173 156 -209 -16 137
$$ packed form
2722h5J81j06q3J07j24J50p5j19j12L10jJ12pm89M19j21J67k8r7p1Q3J25k36K42
2746A42K7j11k40K31j83J00q3J72M1k38L34j88oL66k92k3k75N37J3l79N4O4k56
2769a93K17J37k20j8N8K7M2j49J52m6j25K04q8j98K76J75k70q6N81m70Q2q9k08
2792b09L54j48r9K32j05N4k54j77K11J69j42L8J70l3p0k24M04N6k74K49k0l26
2814a44J23pL7m2J40k28K35k94O4J80l18K01J69l64J8J72q8L90j87j2K48j20j17
2837E6M0p7j71P0l6K77k37j16K12j9k69J86j22J04J9j33K05J87l56J49K18k39
2859e2p2P4L32j85j95J58J03j98m4N4o8J15j45k0J79j11N7j11J50q8K54j7r8N5
2883A27J3J22m15J17J89j29J97j80p0j46J49N9P4k27J47m0J7K57q8j7l65J93J53
$$ plain form
2906 137 2 196 16 38 7 -166 194 -46 -37 -129 37 -12 3 195 37 258 60 248 59 111 115 123 24 -23 -186
2931 -186 -229 49 100 -87 -91 -103 80 78 -103 240 30 -316 61 84 113 175 -79 -287 104 -178 40 84 -137 248
2955 248 -44 58 303 83 -132 135 21 -88 -143 25 128 -50 -213 -223 -228 185 123 47 178 -80 263 71
2977 71 42 37 212 2 110 -139 -55 90 520 -47 -34 93 -45 -2 -94 0 -100 171 -39 -245 62 -157 62
3000 62 -240 -91 -38 -127 199 -58 -223 -87 -377 -48 -27 241 153 -64 9 -169 270 -202 62 132 25 155
3022 155 -40 43 -56 -69 -329 -142 3 5 -69 -289 -6 111 238 -36 4 228 54 -120 120 119 -146 76 42
3045 42 -94 55 -140 -21 241 366 -216 -364 158 -136 206 2 162 147 15 99 45 226 -61 20 383 -96
3067 -96 -231 195 -23 -177 217 97 -147 220 18 -18 28 -70 345 55 -30 59 170 -200 414 -42 -50 132 269
$$ packed form
2906A37j35J94j80K2l1j73L60k40Rr2J66m9J5J92j58K21j98J88j89N2MQr9m7j63
2931a86m3K78N1j87mj2J83kj81L43k10l46L77K3K9O2k54k08L91k82K18M4k21L85
2955B48k92J02K45k20k15K67j14j09n5J68J03j78j63j0nM13o2p6J31k58L43j92
2977G1k9nJ75k10J08k49Q4J45M30n67J3J27j38M3r2R4j00K71k10k06L07k19K19
3000F2l02J49N3q9L26k57j65J36k90L29K1K68q8k17P3j78M39m72K64P0j07J30
3022A55j95Q3r9j3k60J87J45Kp4k20K83J17J27k74M0K24j74j74K40jk65K22l4
3045D2j36J49j95J19K62J25n82j48N22k94L42k04J60j5j32Q4n4J81k87Q1L63m79
3067i6j35M26k18j54L94j20k44L67k02l6M6r8M15k90q5Q9J11l70O14m56qJ82J37
$$ plain form
3090 269 -114 108 -153 102 126 -101 59 5 -3 -93 164 -58 213 -59 314 -80 98 -99 -131 39 88 -80
3112 -80 -97 -117 128 -40 96 -258 -62 23 -40 217 126 110 -166 224 -77 144 196 5 17 61 205 -34 -123 27
3136 27 -122 106 168 170 -101 -164 -9 -177 -46 -162 -86 52 50 167 120 149 141 -337 -203 80 -70 85 -188 55
3160 55 25 -131 268 94 10 18 165 -187 185 -34 -61 -92 42 -227 -183 -206 -95 275 -227 3 -91 -74 -132 -70
3184 -70 364 -17 -100 267 -227 285 285 -87 -143 89 156 -35 -476 166 -111 144 24 -274 197 305 -113 -245
3206 -245 -165 -182 199 -73 -122 -11 292 -256 101 -32 214 270 3 89 -93 210 131 56 2 3 -134 -60 106 209
3230 209 140 -71 30 93 25 -114 84 -148 254 -293 138 321 -112 204 -9 180 -96 118 -112 -42 152
3251 152 -327 -13 78 96 -51 178 -253 -11 128 4 303 -133 63 -258 -191 169 32 -285 227 14 -9
$$ packed form
3090B69l83K22k61K55K4k27J60n4qr0K57k22K71k72L73l94J78j97l2J70M9j68
3112h0j7k0K45j68J36l54J96Q5o3K57r1j6k76L90l01K21N2j91J2M4J44k39q9J50
3136B7j49K28O2Kk71o3J55j68J31j16P6J38kJ17m7K9qm78J34K83j50J55k73K43
3160E5l0j56L99j74q4QJ47l52L72k19k7l1J34k69M4k3J11L70n02K30r4J7n8O2
3184g0M34l81q3L67m94N12%l72n6K32O7j91m41O42k77K55j20k98M71J08m18j32
3206b45Q0j7L81k72m9J11L03n48L57j33K46N6k67Q6j82L03p9p5n4Jj37P4J66J03
3230B09o9k11J01O3o8j39J98k32M02n47M31J83m33L16k13J89k76K14k30P0J94
3251A52m79L14R1J8j47K29m31K42J39j24K99m36J96l21O7L60j37l17N12k13k3
$$ plain form
3272 -9 -41 -123 76 -420 -148 -169 -56 59 335 131 182 199 -215 97 328 7 0 -104 120 40 -129 -80 -271 58
3296 58 62 -18 -246 40 -28 114 239 123 54 28 10 -119 110 37 9 80 40 -186 86 -34 -312 72 113 61 -199
3321 -199 65 -77 261 -79 -14 113 -156 -74 -285 -31 64 -53 173 -209 103 -13 -241 -15 188 -361 84
3342 84 133 178 66 -283 130 -320 -238 6 163 -167 267 -19 -202 335 53 -97 -81 246 -8 27 237 -304
3364 -304 -105 -55 -100 124 -46 44 62 -184 -74 -56 -41 124 77 133 71 86 23 154 -245 -353 -155 93 63 -3
3388 -3 -53 314 59 42 -157 79 72 154 81 -27 106 -60 211 -39 20 -56 19 -139 -60 72 23 -35 64 -81 36
3413 36 184 -134 142 -182 89 -22 -93 31 184 54 140 24 269 288 50 261 46 106 -91 -260 -357 12
3435 12 -153 -279 46 22 34 -98 -18 72 -13 37 279 -3 -100 75 -2 -191 -141 -140 -58 128 -211 -109 -64 -56 -279
$$ packed form
3272il2q2J99m96K72k1J13J15K76k04N1J7m14L12K31l21pj04K24q0j69M9j91L29
3296E8Mq0k28K86o8J42J25j16o9k6j8j29K29p3k8P1m0k26K72j20k78L84M1n2k60
3321a99K64j42L38l40O5J27k69Q2k11K54R5j17K26l82L12j16k28K26K03n49M45
3342H4M9M5j12l49M13m50Q2K44J57l30M34k86j83N37k82j50J6L27k54L5K10n41
3364c04J99N0m5K24j70R0J8k46J10J8J5J65m7N6o2J5o3J31l99j08J98K48l0o6
3388cn0L67k55j7j99K36pQ2p3j08J33j66K71k50N9p6P5j58P9J32m9n8R9j45J17
3413C6J48l18K76l24K71j11p1J24J53j30Q6j16K45J9k38K11k15O0j97j69r7L69
3435A2j65j26L25k4J2j32Q0R0q5N0K42k82r7J75p7j89N0JQ2J86l39J02M5Qk23
$$ plain form
3460 -279 -55 -161 -80 229 233 154 -179 -108 -93 -30 143 -148 48 45 44 -265 -106 101 -112 -34 35 -21 -125 102 71
3485 71 -51 -98 337 -211 -29 -3 -176 38 109 59 -436 -29 57 -252 -82 -128 14 -115 241 51 130 142 76
3508 76 -147 81 177 -212 136 -47 -175 -11 -340 -111 164 78 -69 -59 157 200 107 -80 251 -281 12 -154
3530 -154 -177 72 -88 -178 -210 43 147 129 226 21 15 -2 85 62 92 -104 45 100 138 118 -69 -27 -115 70 -52
3555 -52 -26 -67 -21 37 -419 -179 -118 77 -9 23 74 -6 214 127 -121 142 253 -66 -64 -119 47 -70 -124 101 298
3580 298 82 166 -162 -122 -72 -278 -64 -220 32 -56 84 44 105 -66 89 274 -74 -33 -35 -92 -136 75 31 -63
3604 -63 71 167 -152 111 -328 -66 306 144 14 -212 31 79 211 243 -145 128 -140 153 226 111 -197 -39
3626 -39 -153 -149 195 14 314 -102 26 69 -196 -129 -146 116 -12 117 6 90 -21 213 197 -37 -124 28 -137
$$ packed form
3460b79K24j06Q1L09Mp9l33P1J5O3J73k91J96ljl09J59K07k13P8O9n6j04K27l1
3485G1j22m7M35n48J82K6j73K14P1n0m95M07Q6l09J70m6J42j29L56j90P9J2o6
3508G6k23K28R6l89L48j83j28J64l29K29K75q6j47J0K16M3r3j87L31n32K93j66
3530a54k3K49j60r0l2K53J04j8R7k05oj7Q7k3L0j96J49N5L8k0j87M2q8J85j22
3555e2K6m1M6N8m56K40O1J95q6L2N1q0K20q7k48K63J11l19Kn5J66j17n4K25J97
3580B98k16Q4l28M0N0k06K14j56K52q8J40m0O1j71J55J85l48M1kn7m4K11m4r4
3604f3J34R6l19K63m39K62L72j62j30k26K43M8J32L2l88K73k68K93P3j15l08J58
3626c9j14ML44j81L00m16J28M3k65O7j7K62j28J29j11Q4j11K34j6k34q7J52j65
$$ plain form
3649 -137 -132 84 30 -48 -133 69 26 -233 240 122 266 -93 -239 47 42 63 -17 38 -201 -217 54 13 123 59 -80
3674 -80 -62 22 -129 -199 219 14 0 -63 19 260 94 -87 -58 66 244 -16 -132 -158 31 249 53 -27 -251
3697 -251 111 148 4 -176 72 163 -175 60 43 8 123 7 63 106 328 -20 25 -144 205 -199 146 277
3719 277 -68 -7 81 57 -133 163 -163 8 -192 -68 -178 -91 180 -17 -206 7 -88 49 -6 -23 -172 -46
3741 -46 59 -108 183 -98 115 84 101 15 -23 69 162 421 -81 -263 63 24 -68 32 113 205 73 -188 -40 -159
3765 -159 -363 130 142 72 354 -74 52 -15 -50 -266 -81 133 -37 124 -55 -160 -224 56 -296 86 -59 140
3787 140 140 0 127 -14 -115 134 -149 14 6 -415 113 166 305 -206 -348 -282 -65 -132 30 198 186 -160 -160
3810 -160 27 81 -117 -124 77 -138 3 38 -53 145 -297 -168 -55 -69 37 54 -272 -30 -21 -18 113 23 65 -62
$$ packed form
3649a37NK16n4p8q5K02m3k59M73j18J44l59j46K86nK1q0N5k39j6K71m1J10o4j39
3674h0J8Q4j51p0M18k05j4o3Q2K41j66j81K9J24J78k60j16k6J89K18j96q0k24
3697b51L62L7j44j80K48R1l38K35j7l5J15j16N6M3K22l48M5j69L49m04L45J31
3719B77l45O1Q8k4j90K96l26J71k00J24j10Q7K71j97j89K13r5J37n5j7j49J26
3741d6J05j67K91k81K13l1J7q6l8R2R3K59n02j82L26l9r2J00Q1R2j32k61J48j19
3765a59k04M93J2p0K82m28J26o7l5k16J85K14j70J61j79j05o4K80l52L82j45J99
3787A40%j40J27j41j01K49k83J63qm21N28N3J39n11j42O6K17o7J62J68j2l46%
3810a60J87N4j98pK01k15J41L5r1J98m42J29J13j4J06J7l26K42RLJ31r0M2j27
$$ plain form
3834 -62 -342 -162 58 268 247 -348 -16 -148 -136 -151 -321 -191 132 -85 -8 -6 -178 -40 -281 204 22 185
3856 185 7 -177 89 -55 53 58 -26 -140 -35 37 -194 44 -134 -333 -180 -328 -101 53 11 226 116 -154
3878 -154 16 -48 -350 -85 80 -13 267 19 -208 -302 119 -174 49 -94 -73 -92 -82 241 -22 74 -173 206
3900 206 70 134 -47 -106 -16 -60 239 214 -200 -74 122 -67 -114 -51 132 43 104 -31 57 -58 7 -115 -60 58
3924 58 250 23 -157 30 -42 -129 75 125 -86 108 62 -160 -88 41 -137 162 223 -91 26 296 -49 -72 -29
3947 -29 60 -140 -40 -14 4 95 -9 -157 -297 -101 88 58 82 -22 -91 115 -237 126 0 50 -185 66 25
3970 25 -90 177 37 7 -206 288 -94 -120 107 74 -142 -201 -115 -256 153 148 -173 -250 -68 -62 97 -122 -52 -154
3994 -154 -24 3 -394 41 141 176 26 -49 -102 165 154 -133 139 149 112 240 -75 268 167 -8 -98 130 16
$$ packed form
3834f2k80J80K20K10k1n95L32j32J2j5j70J30L23k17P7Kj72J38k41M85j82J63
3856A85j78j84K66j44J08Nq4j14J05P2k31K38j78j99J53j48K27J54m2K15j10k70
3878a54J70o4l02K65J65r3K80k48k27r4M21k93K23j43K1j9J0L23k63R6k47L79
3900B06j36O4j81n9R0m4K99k5m14J26J96j89m7O3J83q9O1j35Q8j15O5j22N5J18
3924E8J92k27j80J87p2q7K04N0k11J94m6k22P2J29j78K99O1l14J17K70l45k3M3
3947b9Q9k00J00K6J8R1j04j48j40J96J89l0K4j04o9K06l52L63j26N0k35K51m1
3970B5j15K67j40l0k13M94l82k6K27l3k16n9Q6j41M09nl21p7J82OJ59k19P0j02
3994a54J30K7l97M35J00L5j50p5n3K67j1k87K72J0l7J28l15L43j01j75r0K28j14
$$ plain form
4017 16 -101 37 -24 -44 -91 238 177 48 -56 -246 -6 -90 121 175 -100 -325 -241 153 251 5 -147 70 -111
4040 -111 -108 99 113 5 -200 48 117 -30 193 104 59 122 24 -23 59 119 26 -139 -114 -99 38 67 197 -286 -150
4065 -150 203 -3 -78 42 194 -22 -85 -85 249 -107 168 -127 -310 -178 206 -135 255 -22 -175 27 -64 -185
4087 -185 -94 255 43 -64 -79 80 43 -11 1 -7 157 -248 -249 -150 -65 201 87 187 20 202 -82 -283 20 -47
4111 -47 -57 -5 113 39 32 71 136 263 -156 -64 -76 -63 4 281 -35 -119 36 -122 -134 153 -86 144 211 -76 198
4136 198 77 0 -150 -305 98 -162 338 229 76 -109 82 148 -5 -29 -253 58 -153 159 -12 36 27 -32
4158 -32 -21 400 34 -150 -108 10 182 7 201 -42 60 -198 175 55 138 68 188 90 -254 96 -2 -14 -63
4181 -63 164 20 -84 -79 218 -47 125 -45 186 154 23 -154 -50 70 231 -116 -187 -19 -171 120 -93 163
$$ packed form
4017A6j17J38o1k0m7L29o1j29j04j90K40q4K11N4k75k25Q4L94R8k46j52K17j81
4040a11LK07J4j08k05K48O9j47K23q9m5O3r8m7Q2O0r3j65K5J5J37K9J30m83J36
4065a50L53k06p5J20J52k16o3%L34l56K75k95j83J32L84l41L90k77j53K02r1j21
4087a85R1L49k12j07j5J59l7n4J2qJ64m05jR9Q5K66j14J00j67J82k84k01L03o7
4111d7j0N2J18p4pL9O5J27m19R2j2J3O7K77l16q4J55j58j2K87k39K30O7k87K74
4136A98j21p7j50j55M03k60N00j09j53j85J91O6j53k4k24L11k11L12j71M8rn9
4158c2J1M21l66j84M2J18J72j75J94k43J02k58L73j20Q3p0J20r8l44L50r8j2m9
4181f3K27j44j04NK97k65J72j70K31l2j31j77J04J20J61l47p1J68j52K91k13K56
$$ plain form
4203 163 14 81 -321 4 60 113 -136 248 -43 220 -171 -33 -181 157 -14 157 197 99 -2 99 -112 -52
4225 -52 -249 -100 251 -81 -217 -18 359 -120 -9 22 137 182 -7 140 -154 66 208 56 -406 -223 -173
4246 -173 147 -211 -28 94 -114 60 30 -85 -33 -122 -62 -2 -11 113 62 -108 -83 188 -39 -60 -13 -58 13 466
4270 466 -19 152 75 -242 -50 -71 -9 187 -173 155 -149 47 -126 -202 11 27 -126 -33 130 -184 18 81
4292 81 -61 -201 16 -130 106 134 57 185 -31 -33 -245 4 -91 45 -294 287 64 -82 193 -225 -118 -248
4314 -248 206 272 -150 23 6 -241 -140 -25 -202 234 -36 181 -164 -162 59 -46 -85 -236 378 -59 -139 26
4336 26 3 164 89 193 8 -12 113 -171 -120 264 -49 49 1 -20 -166 233 -78 2 -52 -56 -247 -204 141 -209
4360 -209 53 119 -228 -37 -111 142 127 -80 -164 4 151 -215 -1 -147 52 273 238 -37 -23 82 77 52 -126
$$ packed form
4203A63j49O7m02L25N6N3k49L84k91K63l91J38j48L38j71J71M0r8j01J01k11O0
4225e2j97J49L51l32j36J99L77m79J11L1J15M5j89J47k94K20J42j52m62J83N0
4246a73L20l58J83J22k08J74l0j15N2q9O0O0rJ24n1j70K5K71k27k1M7m5P1M53
4270D66m85J71p7l17J92k1O2J96l60L28l04J96j73p6K13J6j53R3J63l14K02O3
4292H1j42j40K17j46K36K8p7J28k16kk12K49r5J36l39N81k23j46K75m18J07j30
4314b48M54O6m22J73j7k47J01J15j77M36k70K17l45KK21j05l9j51O14m37q0J65
4336B6k3J61p5J04j85k0J25k84N1L84l13R8m8k1j46L99l11Q0n4mj91M3L45l50
4360b09K62O6l47J91p4K53j5k07q4J68J47l66K14j46J99K21l5k75J4J05nk5j78
$$ plain form
4383 -126 -231 -362 -89 -8 125 83 123 203 -37 143 -214 -79 200 186 143 344 128 129 122 -4 174 19 -42 114
4407 114 -123 89 83 14 -28 136 32 83 -93 -44 -26 118 -118 -32 -62 74 232 -32 119 83 -34 -84 -73 -133
4431 -133 82 -122 -142 87 97 -191 62 53 199 -288 256 -281 336 19 -87 -55 153 63 34 -121 -7 254
4453 254 10 -153 -156 117 185 77 130 -133 62 240 40 32 -199 -16 56 29 -26 111 74 83 -120 56 -94 190
4477 190 46 24 186 85 -8 -50 140 -26 -152 -126 -130 66 -142 309 158 -10 -57 -62 -237 156 -111 -42 -42 355
4501 355 74 18 -42 182 7 -43 69 -9 186 -103 365 -73 106 138 -253 -318 -79 -130 235 191 -115 -118 12
4524 12 -321 221 114 34 341 -94 18 173 -94 162 302 -140 -420 253 -55 38 30 -172 23 -44 63 75
4546 75 4 -170 163 20 -57 -124 -75 -209 -65 -23 99 -26 162 193 19 106 -138 -194 -133 -81 39 15 114 -93
$$ packed form
4383a26j05j31K73Q1J33m2M0Q0k40J80l57J35K79j4m3K01k16Jpj26J78j55o1J56
4407A14k37K12oo9m2J64j04N1j76M9J8J44k36Q6l0J36J58k64J51l6j17n0J1o0
4431a33K15k04k0K29J0k88K53rJ46m87N44n37O17l17j06L2K08r0k9j55J14K61
4453B54k44j63lK73O8j08N3k63J95J78k00qk31J83P2k7n5J37l7Rk03J76j50K84
4477A90j44k2J62j01r3m2J90j66j26K6mJ96k08M51j51j68m7nj75L93k67O9%L97
4501C55k81n6o0K24j75n0J12p8J95k89M68m38J79L2l91o5K39n1L65m4l06lJ30
4524A2l33N42j07q0L07m35J12J55k67K56J40m42k80O73l08R3qk02J95o7J07J2
4546G5p1j74L33j43p7o7M9j34J44M2J22j25J88L1j74Q7k44n6O1N2J20k4R9k07
$$ plain form
4570 -93 -110 239 50 64 125 -3 152 130 -19 -238 -45 -101 139 -87 -81 338 1 -245 -136 -96 42 -37 272
4593 272 76 -72 83 -32 -73 -29 29 125 -3 139 192 236 -148 -324 -14 -288 112 293 -25 248 214 -119
4615 -119 183 -181 50 -56 48 227 -141 -113 -21 111 -251 116 -11 59 -70 -133 141 -139 -5 102 -82
4636 -82 99 31 299 9 -18 101 77 110 -100 272 131 139 181 21 -139 111 -217 -150 -94 244 -171 -211 -209 40
4660 40 146 -132 -4 -22 -17 229 -104 122 -212 12 -58 215 170 -47 11 -51 135 32 -33 -160 3 30 325
4683 325 38 139 -22 29 -34 -43 -100 -156 114 -101 11 -42 -54 18 78 -129 3 173 -129 -92 -55 -320 54 4
4707 4 -11 124 -13 -33 166 91 -33 -86 -151 115 132 230 16 225 80 7 -4 14 -141 84 -208 124 65 -132
4731 -132 -56 156 220 -294 21 -8 121 -28 -65 -41 -61 -258 62 17 -137 108 -57 -62 8 92 -211 -1 81 66
$$ packed form
4570i3j7L49j89J4O1j28J55k2j49k19J93n6K40k26OM19l37k46J09M0J38p9L09
4593B72j96j48J55j15m1M4N8R6j28J42N3M4l84j76L10k74M00J81l18K73l4l33
4615a19L02l64K31j06J04J79l68K8R2J32l62L67j27P0j29o3K74k80J34J07j84
4636h2J81o8K68k90k7J19k4L3k10L72j41QM2j60j60K50l28O7N6L38m15m0KK49
4660D0J06k78J28j8NK46l33K26l34K24p0K73m5k17N8o2J86j03o5j27J63K7K95
4683C25k87J01j61N1o3rn7n6K70k15J12n3j2P2O0k07J32J70l02L7L7k65L74n0
4707Dj5J35j37k0J99p5j24n3o5K66J7R8k14K09j45p3j1J8j55K25k92L32n9j97
4731a32P6K12O4n14L15k9J29j49l7K4k0j97L20m5j54K45j65nP0Q4l03K10Q2j5
$$ plain form
4755 66 -76 209 63 -168 -85 -38 270 -470 -2 296 -238 337 -300 492 64 246 -150 91 -49 48 -55
4776 -55 -127 38 65 28 -135 213 -402 66 46 -34 -65 87 -80 115 -8 24 -104 0 228 226 57 45 -186 -21
4800 -21 -37 110 119 -56 -152 -17 164 137 38 -39 -256 57 -4 -104 -90 -189 89 -75 -19 57 -56 82 77 203 -33
4825 -33 -2 -46 -160 -288 -134 -74 57 64 -5 80 208 179 -56 -123 210 14 -166 -160 -29 -58 -14 205 -60 -369 -226
4850 -226 271 -323 -305 -12 103 -59 -12 101 -12 269 26 106 -78 139 -119 -100 157 114 -153 -81 47 -174
4872 -174 97 -270 195 45 -92 -19 -164 -162 -42 30 -108 40 -125 150 160 180 -129 -25 -54 205 128 -282 -187
4895 -187 -127 -59 -122 -26 229 -46 171 53 34 122 -67 -138 -221 493 -2 81 -130 -67 59 163 -262 58 120 64
4919 64 -293 -63 -251 12 33 84 -118 12 122 118 -145 -120 161 62 -8 251 254 -182 -33 -40 135 162 17 -129
$$ packed form
4755F6j42K85j46k31Q3M7L08p40M68K98n34N75o37P92m28J82l96K41j40R7j03
4776e5p2J65K7l7j63L48o15M68k0q0l1J52j67J95j23L2j28J04K28kj69j2k31J65
4800b1j6J47Rj75r6J35J81k7r9p7k17L13o1j00J4r9K78j64N6P6j13J38nJ26k36
4825c3L1m4j14j28J54O0J31Po9Q5J28k9k35o7L33j96j80OJ31k9M4K19k65l09J43
4850b26M97n94J8K93J15j62M7J13j13K81k43Q0j84K17k58J9K57m3k67P2J28k21
4872a74K71l67M65j50j37P3j45KJ20P2j38J48j65K75J0K0l09J04k9K59p7m10R5
4895a87O0O8o3R6K55k75K17j18j9Q8j89p1q3P14m95Q3k11O3J26J04m25L20O2n6
4919F4l57K30j88K63K1N1k02J30J10mk63K5K81r9p0K59Lm36J49pJ75K7j45j46
$$ plain form
4943 -129 69 32 48 106 52 1 104 66 269 -158 70 101 -68 203 -54 -145 140 130 -52 97 -129 -379 166
4966 166 -25 -96 15 346 -18 -413 -129 161 -243 -221 -150 -86 142 -85 9 -168 -3 67 121 120 -87 -16 0 85
4990 85 107 194 -6 -238 -141 -126 -5 81 -44 -91 -32 293 14 44 -101 0 -13 48 127 -39 -13 177 166 470 21
5015 21 218 -33 98 -93 208 102 83 -38 91 -145 -63 148 349 40 197 -305 84 8 228 -6 -111
5036 -111 -337 104 27 -155 -89 -9 -41 -44 -37 81 -127 -184 224 5 -121 53 -25 -189 99 104 170 85 74 -16 -127
5061 -127 2 26 135 192 -22 -15 -16 138 20 5 -41 178 -395 -22 -56 121 49 27 -59 -13 -295 191 66 -139
5085 -139 20 70 52 -15 60 -192 -221 -222 -171 32 158 -112 -52 -253 57 181 127 -169 -112 -30 -151 -111 220 -34
5109 -34 -110 -39 242 -6 218 -67 227 -112 -48 29 -138 -97 119 -100 -293 22 105 181 12 165 -134 -9 223
$$ packed form
4943a29J98l7J6N8n4n1J03l8K03m27K28L1j69K71k57r1K85j0j82J49k26k50N45
4966A66j91p1J11L31l64l95K84K90m04K2P1O4K28k27R4j77J65P0N4jk07P1J6Q5
4990H5K2Q7k00k32R7J5J21Q6j25m7N9L25k79L0j45J01j3O1P9j66K6J90j1L04m49
5015B1J97k51J31j91L01j06j9j21J29k36Q2K11K01l09J57n02L89p6K20k34j05
5036a11k26M41p7j82O6Q0l2lPJ18k08n7M08k19j26J74p8j64K88NO6q5j1r0j11
5061a27J29K4J09N7k14PjJ54j18j5m6K19n73L73l4J77p2k2q6M6k82M86j25k05
5085a39J59N0j8o7P5k52k9jN1K03J26k70O0k01L10J24n4k96N7Q2j21M0L31k54
5109c4p6P1K81k48K24k85K94l39O4P7j67M1K16k19j93L15Q3P6j69J53k99J25K32
$$ plain form
5132 223 -39 -69 171 114 55 -98 104 -253 85 71 -10 -76 -36 55 205 53 70 14 -98 -231 -9 -188 -56
5155 -56 76 188 -136 -87 92 -89 32 -11 143 141 -88 -88 -96 -204 54 198 133 -37 151 130 21 -158 -66 -144
5179 -144 -36 122 -51 104 22 235 86 -30 -167 46 -206 -110 -94 33 -121 -250 -148 -277 56 -98 -47
5200 -47 -167 -310 -18 132 2 477 -88 -537 -215 392 -105 169 52 5 16 157 39 -100 90 11 -271
5221 -271 79 -230 -84 39 -1 -36 162 -40 13 42 -87 -29 -19 259 85 75 -86 -56 -52 126 -87 -37 70 232
5245 232 -29 170 90 57 -27 -44 -57 34 -46 32 66 -47 67 92 49 -43 -23 137 204 63 -97 27 44 -29 0 124
5271 124 82 -226 303 -327 -174 -260 3 -281 -210 -81 15 45 183 -79 118 -219 -16 74 -10 -86 20 -170 224
5294 224 149 58 23 -270 -145 -220 -41 -66 118 16 -2 -254 316 108 -172 43 186 -1 -35 553 -18 -50 132
$$ packed form
5132B23k62l0K40n7n9j53K02l57L38j4q1o6M0R1J50j52J7n6j12j33K22j79J32
5155e6J32J12l24M9J79j81J21m3J54kk29%qj08K58J44o5j70J88k1j09j79R2p8
5179a44J08J58j73J55q2K13j49j16j37K13k52R6J6J27j54j29J02j29L33j54N1
5200d7j20j43K92J50j30M75n65m49L22O07m97K74j17m7J1J41j18j39J90p9k82
5221b71L50l09J46J23m0l5J98k02N3K9j29N8J0K78j74j0j61L0MJ78k13N0J07J62
5245B32k61J99q0l3q4j7j3R1q0P8L4j13J14K5m3r2K0J60O7j41j60J24J7p3K9J24
5271A24m2l08N29o30J53q6K63k84P1J29R6L0J38k62J97l37K03R0q4p6J06j90L94
5294B24p5r1l5k93J25p5J79k5J84j02j8k52N70k08k80K15J43j87l4N88n71l2J82
$$ plain form
5317 132 97 108 -26 26 23 157 -29 68 66 -146 -164 95 -181 128 -105 -30 183 176 94 -11 105 119 113 -142 -55 98
5343 98 -15 -74 54 -197 10 3 115 -298 -90 -4 -264 -263 115 -120 55 197 -238 3 236 -39 -18 304 -214
5366 -214 213 -73 -167 -76 -145 -109 284 -27 -24 -267 -172 -164 -179 90 -24 -375 -102 32 -111 159 90 110 144 95 -123
5391 -123 345 -104 -72 -119 -26 -152 -25 69 37 64 -237 105 29 58 -53 21 -43 -65 -232 -188 -79 -3 -35 -313 -124
5416 -124 -146 -215 20 256 205 -1 -90 19 -78 127 -114 -128 225 -35 -6 -13 155 174 -190 213 284 -179 -60 169
5440 169 -5 -45 86 216 -29 32 -114 161 22 -12 -127 70 -46 -314 -50 -2 -12 -111 162 -6 236 -207
5462 -207 -24 -45 -251 5 33 275 389 -55 359 165 83 124 -416 -12 118 0 -388 -94 -113 -217 -153 118
5484 118 4 123 297 -155 -397 -21 -33 -253 -65 63 35 -39 -133 100 90 45 174 -112 65 -139 183 33
$$ packed form
5317A32l5J1j34N2lJ34j86R7kk12j8K59k76L09k33P5K13pq2j05J16J4ok55Q7J53
5343I8j13n9J28k51K07pJ12m13K08Q6k60JL78k35J75J42m35K41K33k75K1L22n18
5366b14M27k86r4R1o9L6L93l11Lk43R5Qj5K69j14l51K73J34j43K70o9K0L4m9k18
5391a23M68m49L2m7R3j26J27R4l2K7l01L42p6K9j11P4o4k2j67M4J09P6l2k78J89
5416a24k2o9K35K36n1k06q9J09r7K05k41j4L53k60K9pJ68J9l64M03P1m63J19K29
5440A69j74m0J31J30k45O1j46K75j39l4j15J97j16k68K64M8j0r9K73j68K42m43
5462b07J83k1k06K56K8K42J14m44M14j94q2M1n40M04J30j18l88K94j9j04O4K71
5484A18j14J19J74m52k42L76j2k20J88J28k8p4r4K33j0m5J29k86J77k04L22j50
$$ plain form
5506 33 -181 -107 33 -322 -85 -19 244 -50 -112 -15 -8 52 51 -355 61 61 195 169 -89 -50 122 -30 -25 123 -99
5531 -99 101 -29 -76 -44 -167 -216 299 22 -42 28 2 169 98 -195 140 109 -142 104 98 -58 -51 -181 169 9
5555 9 -31 -7 161 158 105 3 237 -112 126 -124 -8 5 -64 290 130 -21 153 -114 -3 -24 131 -41 -6 -77
5579 -77 -86 -39 -54 301 -257 122 2 317 20 -114 191 37 -115 22 -73 77 412 46 64 -146 155 -166
5601 -166 273 44 161 193 269 78 64 -150 282 131 -110 -88 -198 39 -15 -19 -188 -70 -159 61 -57 -98 186
5624 186 -72 -118 191 -54 -318 -222 182 113 -193 -161 46 117 -68 150 -51 -86 48 168 -171 55 -198 16
5646 16 15 -95 398 -94 -126 -127 -16 -11 149 -272 -69 164 -42 181 108 104 -1 63 -306 -74 -133 30 34 -202 30
5671 30 -90 -256 -70 -34 -80 -71 -107 -375 91 235 69 -174 136 -61 75 281 264 -78 166 10 -61 -222 266
$$ packed form
5506C3k14P4J40l55K37O6K63k94o2R7PO0jm06M16%J34k6k58L9J72j52NJ48k22
5531i9K00j30m7L2j23m9N15k77o4P0k6J67p1k93L35l1k51K46oj56Pj30L50j60
5555Im0K4J68ln3j02K34l49K38k50J16J3o9L54j60j51J74k67J11k1J55j72L5p1
5579g7rM7j5L55n58L79j20L15k97j34L05j54j52J37r5J50L35l66J8k10L01l21
5601a66M39k29J17L2P6j91j4k14M32j51k41K2j10K37n4mj69J18q9K20j18m1K84
5624A86k58m6L09k45k64R6M04o9l06L2K07P1j85K18k01l5J34J20l39K26k53K14
5646A6jj10M93m92l2jJ11NJ60m21K03K33k06K23p3mj05O4l69K32n9J63Mk36K32
5671C0j20j66J86L6m6Rl6k68M66J44j66k43L10j97J36K06j7l42K44j56p1j61M88
$$ plain form
5694 266 276 229 116 -24 215 263 -84 -234 115 -80 -93 -96 -87 -151 -45 -114 -145 -195 -44 -128 96 -86 59 -416
5718 -416 26 165 185 202 -91 -208 -52 -83 113 -156 -56 -70 58 167 77 146 257 -60 -69 -135 24 56 160
5741 160 40 -196 96 -251 -184 85 -207 -145 109 33 369 -165 -132 -4 -16 -258 -182 -3 -261 155 110 1
5763 1 112 146 -35 183 79 118 -87 33 103 182 -169 153 19 57 166 5 95 2 10 153 -112 -67 -179 -87
5787 -87 183 245 96 -464 -112 -52 133 175 -106 63 -252 -19 11 -13 169 201 -255 -150 10 129 121 28 -75
5810 -75 252 -109 135 21 -91 -34 138 75 -54 115 -15 -7 44 21 -80 -214 -129 -152 -133 4 104 35 161 131
5834 131 -172 122 -43 -75 -247 -240 -12 -81 111 187 -206 -162 7 -300 7 -95 -113 107 94 -61 -308 -192 70
5857 70 93 18 -4 -10 91 -27 222 179 131 -175 16 -41 128 -183 163 125 48 161 -131 41 65 -74 23 -29 -177
$$ packed form
5694B66J0m7j13j40K39M8l47j50L49j95j3lRo4J06o9l1n0J51q4K24j82J45m75
5718d16M42J39K0J7k93j17J56l1J96k69J00j4J28J09r0O9J11l17ro6J59L2J04
5741A60j20k36K92l47O7K69k92O2K54p6L36n34L3J28j2k42P6J79k58M16m5j09
5763AJ11L4j81K18j04L9k05J20P0P9l51L22j34L8J09j61R0r3QJ43k65M5j12R2
5787h7K70O2j49n60L52O0J85M2k81J69l15K33L0k4J82L2m56J05J60J19qr3j03
5810g5L27l61K44j14j12N7J72o3j29J69j30QN1k3j01j34Q5k3J9J37J00o9J26l0
5834A31l03K94j65l2j72PK28o9J92P6l93M4J69l07L07j02j8K20j3j55k47J16K62
5857G0K3p5k2oJ01j18K49m3m8l06J91n7J69l11L46l8p7J13k92J72K4j39R7n2j48
$$ plain form
5882 -177 73 96 21 -180 -28 -100 128 -21 276 -117 -43 -153 -145 53 -80 68 119 -33 -59 -14 -69 -28 108 -15
5906 -15 -291 -133 -220 -262 39 -118 -445 61 -150 20 189 505 133 209 158 -56 47 112 7 29 -38 18 260
5929 260 -218 43 -125 13 -37 22 -18 185 2 177 200 -248 256 -287 -118 168 -27 -31 -17 -125 -140 156 4
5952 4 -157 31 47 209 -192 140 120 11 -6 158 324 364 131 -177 45 168 96 13 -67 -106 -105 -61 12 118 4
5977 4 18 96 246 28 -56 -77 6 168 222 123 227 -10 5 -103 -93 98 -135 -194 208 160 -153 -181 -199 -72 -137
6002 -137 121 8 26 -179 60 -186 158 -8 -11 -91 -227 -23 187 -117 28 38 -147 -51 -169 205 88 -242
6024 -242 -108 27 124 -176 6 113 194 -113 -18 94 -55 -160 91 -96 -54 -23 -259 -69 14 57 69 -38 -55
6047 -55 -4 -141 -53 -95 -24 82 219 -77 -104 -29 -154 -148 138 76 120 -157 259 -53 23 165 -170 -223 -260 -220 -82
$$ packed form
5882a77K50K3p5k01J52p2K28j49K97l93P4j10QJ98j33J48N1j52k6M5n5M1J36j23
5906a5k76J58q7m2L01j57l27N06k11J70J69L16l72P6n1k14J03O5j05K2o7N6K42
5929B60m78K61j68J38n0N9m0K03j83J75K3m48N04n43J69K86j95mJ4j08j5K96j52
5952Dj61J88J6J62m01L32k0j09j7J64J66M0k33l08K22J23p2q3q0l9JM4P3J06j14
5977DJ4P8J50k18q4k1Q3J62N4r9J04k37J5j08J0J91k33n9M02m8l13k8j8J27o5
6002a37K58j13J8k05K39k46L44j66lq0j36K04K10l04J45J0j85R6j18L74j17l30
6024b42J34J35R7l00J82J07Q1l07R5J12j49j05K51j87M2L1k36J90Q3M3J2j07j7
6047e5N1j37Q8m2P1J06J37k96k7P5j25OK86o2M4k77M16l12P6J42l35n3l7M0J38
$$ plain form
6072 -82 117 -48 -37 -142 -107 -95 -326 -395 -7 -130 21 -121 -98 177 173 8 46 103 60 13 89 326 171 198 -11
6097 -11 -107 -188 -64 61 -99 215 -25 20 -61 48 142 -234 -227 179 -81 49 66 170 181 -123 51 -45 -120 33
6121 33 -1 91 -30 0 -312 48 1 13 -315 9 -62 -171 8 -203 -8 -95 51 -48 79 -160 41 -93 30
6144 30 95 -29 284 -78 -49 -27 124 139 270 -44 260 112 -143 -51 -83 315 176 -184 -131 -44 -91 -463 9
6167 9 -263 41 35 -3 219 -261 -27 -118 13 125 41 -22 -41 52 -149 -4 135 -119 128 -165 24 -136 171
6190 171 -4 311 13 102 -34 121 242 87 -35 -37 -136 145 -64 28 101 -283 82 125 -179 20 -118 -171 195
6213 195 1 108 57 -83 -327 32 135 -86 -217 -315 53 36 -58 -46 -4 -148 70 109 -55 28 56 110 69 46
6237 46 -4 -252 158 -93 142 -22 64 -183 -73 102 -126 -69 72 142 -174 31 32 11 -14 24 -103 -46 45 -108
$$ packed form
6072h2J99j65J1j05L5J2k31o9L88j23J51j42K3K75mj65L8N7m3m7P6K37j55K7k09
6097a1r6q1J24J25j60L14k40M5q1J09R4l76PM06k60J30J7J04J1l04J74r6p5J53
6121C3l4R2j21L0l12L60m7J2l28L24p1j09J79k11J95q7J46r9J27k39K01j34J23
6144C0O5j24L13l62K9K2J51J5J31l14L04j48k55R2l2L98j39l60N3Q7m7l72M72
6167Ik72L04ol8K22m80K34r1J31J12q4o3j9R3k01J45J39k54K47k93J89j60L07
6190A71j75L15k98Q9j36J55J21j55j22kr9K81k09R2P3l84L65M3l04J99j38n3L66
6213A95j94J07n1j40k44L59J03k21j31r8L68j7r4J2M2j44K18L9j64Q3K8N4m1k3
6237D6n0k48M10k51K35j64Q6k47J10J75k28N7J41P0l16K05Jk1k5L8j27N7R1j53
$$ plain form
6261 -108 26 234 -188 -111 47 74 -42 39 -169 -37 292 138 41 285 131 -3 -82 137 -196 14 -237 16
6283 16 -93 -195 86 121 74 139 -174 -50 -86 -91 104 -240 -43 -137 19 -178 -157 -4 -136 134 -58 -86 62
6306 62 64 -160 -21 -176 -351 95 -86 127 -326 -56 89 -127 -161 268 -5 -204 -67 -142 -18 131 -82 -3
6328 -3 72 -57 -167 -219 -245 104 -178 -52 -357 -126 192 -166 106 89 -131 145 -138 -194 -109 28 132 27 -76
6351 -76 -127 104 -174 -125 -175 170 -152 -151 -88 102 26 -131 181 -103 30 -158 -77 28 37 57 -140 -45 -67 -24 -90
6376 -90 52 83 -186 -113 -217 -119 -39 -111 -151 -158 375 -31 61 -112 89 197 -40 -28 137 71 94 -280 -25 113
6400 113 64 79 26 205 142 -60 -156 11 -94 -113 33 40 -121 23 152 -8 174 78 -71 152 127 28 -112 33
6424 33 147 106 238 -32 -142 24 -76 14 -219 186 -229 -365 43 116 301 -157 -58 140 2 -198 -213 -131
$$ packed form
6261a08J34K08m22P7J58K7j16Q1k08J32L29j54r7K44j54j34p9K19l33K10k51K53
6283A6j09j02K81L5m7O5l13J24l6nJ95l44J97r4J56j97K1J53j32K70j92k8J48
6306F2Kk24J39j55j75M46j81K13m53K70J45k16l4M29k73j99J37p5J24J49k13P9
6328cP5j29j10n2k6L49k82J26l05K31L18l58K72j7k20K76k83n6Q5J37J04j05j03
6351g6n1K31k78M9n0L45l22JO3J90p6j57L12k84J33j88Q1J05RK0j97R5k2M3o6
6376i0J42L1k69P3j04R8Q0p2m0pN33m06R2j73K01J08k37J2J65o6K3l74K55J38
6400A13m9J5n3J79o3k02r6J67j05j9J46Pj61J44J29j60J82r6j49K23k5r9j40J45
6424C3J14m1J32k70j10J66j00R0k33M05m15j36M08P3J85m58R9J98j38k00j5Q2
$$ plain form
6446 -131 308 125 -17 -253 -170 68 97 -24 -159 27 -40 202 66 78 188 97 -192 -179 -119 -253 202 -8
6468 -8 96 230 -151 -150 -31 -167 -327 79 279 96 79 -73 -72 169 68 44 166 14 50 -45 -201 92 -176
6491 -176 222 312 12 -68 -63 103 97 57 63 157 85 -130 -32 56 -214 -181 -44 145 -209 80 161 -34 199 194 -15 177
6517 177 111 -287 -7 -194 -20 22 67 141 -77 -118 -354 -35 -11 15 -49 -248 51 60 5 -59 -30 -300 -95 101
6541 101 105 68 -49 98 161 -94 -101 319 -154 -148 212 322 -138 -211 -48 276 14 -148 -71 197 46 -157 -114 -219
6565 -219 119 82 305 135 119 287 53 -361 -91 -95 64 -83 7 -25 -155 -84 -137 38 -161 -20 60 51 -54 -260
6589 -260 -13 5 -150 188 -188 -313 -113 155 -106 -14 -117 130 -12 -154 -18 -109 5 59 -12 232 122 57
6611 57 -55 156 45 -207 66 -106 -85 -124 -9 -172 -141 -78 35 -9 179 -171 97 80 13 97 35 219 -247
$$ packed form
6446a31M39j83j42k36Q3K38K9j21j35J86o7K42j36J2J10r1k89J3O0j34M55k10
6468hJ04J34l81JJ19j36j60M06K00j83j7j52JK41j01k4J22j52L6r5j56K93k68
6491a76L98R0l00q0NJ66om0OR4p2k15R8Q8k70L3J37J89l54K89Q1j95K33nk09J92
6517A77o6l98K80j87J74M2M5P4k18m1k36L19K4K6o4j99K99Rn5o4K9k70K05J96
6541A01Ml7j17J47O3k55pM20m73OL60J10m60p3J63L24k62j62P7K68j51k03M3j05
6565b19L38l7K23j70j6J68k34m14K70mJ59j47R0l2j30P1n3J75j99J41Q0rj05k06
6589b60K47J8j55L38l76j25K00K68k61R2j03K47j42j42J36r1J14N4p1K44j10o5
6611E7j12K11j11k52K73j72K1l9J15j63L1O3J13m4J88l50K68j7o7Q4o2J84m66
$$ plain form
6634 -247 263 66 -162 -109 -98 -295 7 -138 -120 291 203 -203 70 145 191 -204 -273 153 -211 -176 -184 297 167
6657 167 201 183 31 -241 -32 43 -39 61 -55 -100 -29 -113 103 -55 -87 28 285 113 28 -4 148 73 -25 316
6681 316 28 -22 -100 248 -192 212 26 -29 -159 -269 2 41 141 -203 -16 81 97 58 167 -91 171 62
6703 62 -175 -94 250 -222 -62 -63 -2 -66 100 44 97 139 -196 -11 -82 -237 213 25 77 -115 -81 147 -130 254
6727 254 273 -82 46 -109 52 -96 -64 6 -93 59 158 58 -124 104 259 -126 -277 133 -103 28 -35 82
6749 82 59 -69 -107 -215 -105 112 -172 -58 -31 385 85 -126 25 -119 -43 -233 94 -92 -101 -47 159 90 -59
6772 -59 180 23 55 147 -355 46 154 -18 -229 -67 -322 -33 -102 -74 8 186 209 -11 18 170 145 11 -162
6795 -162 -149 86 -245 -14 -95 -96 -130 3 11 161 -26 35 92 -305 -113 -100 -125 53 2 199 181 -133 238 16
$$ packed form
6634b47N10j97k28N3J1j97L02j45J8M11q8m06K73P5M6l95o9M26l64L5qM81j30
6657A67L4j8j52k72K09P5q2J00j16m5P1q4K16j58l2J15K57j72q5l2J52p5r8L41
6681C16k88n0p8L48m40M04j86n5j30j10K71L9J00l44J87R7J6l9J09k58K62j09
6703F2k37Q1L44m72J60jO1o4J66n6N3M2l35J85p1j55M50j88N2j92L4K28k77L84
6727B54J9l55J28j55J61j48L2P0r9J52R9j00j82K28J55l85j51M10k36J31o3J17
6749H2k3j28l8j08J10K17k84J14K7M16l00k11J51j44P6j90L27j86rN4K06o9j49
6772e9K39j57L2R2n02M01J08j72k11J62k55K89o9K8Q2J78K3k20K9J52k5j34j73
6795a62J3K35l31K31q1jl4J33QJ50j87O1N7l97J92J3k5J78n1J97j8l14L71k22
$$ plain form
6819 16 -109 -173 -70 150 -38 113 -62 -153 -4 43 -81 205 158 -53 130 52 -209 -139 -66 58 -155 17 -249
6842 -249 13 184 -97 -75 -191 51 9 52 -332 23 69 20 8 128 172 -67 58 -24 -64 -336 -111 90 128
6865 128 79 -1 -78 -263 -32 -177 105 -9 -184 -90 225 -123 153 -14 143 -12 122 -106 -39 5 -25 -134
6887 -134 51 32 -218 -203 -11 -131 38 87 -8 198 74 61 -205 -185 72 -11 -193 32 207 35 315 -14
6909 -14 -102 -67 -409 250 51 -97 -113 13 -112 -106 -342 -51 131 170 56 -11 124 -119 -96 66 44 -82 -14 25
6933 25 -204 -85 -165 -62 -42 -96 151 -169 129 14 -135 -16 0 25 -169 9 176 -21 -5 145 -209 82
6955 82 76 -173 -42 126 -135 20 -39 5 177 -9 276 206 70 -99 -95 137 -129 -124 -23 -275 261 0 -87 -200
6979 -200 311 -12 -30 -36 138 -295 311 5 42 -8 -28 207 264 162 2 95 80 90 40 -109 -51 218 215 246 -166
$$ packed form
6819A6j25o4J03K20j88J51j75r1J49M7j24K86m7k11J83p8k61P0P3J24k13J72k66
6842b49K62J71k81K2j16K42m2M3l84L55M6m9j2J20M4k39J25q2m0k72K25K01L8
6865A28m9q0p7j85K31j45K82j14j75R4L15l48K76j67J57j55J34k28O7M4l0j09
6887a34J85j9k50J5J92j20J69M9r5K06j24j3k66K0K57q3j82K25J75j72K80l29
6909a4q8L5l42O59j99j48j6J26j25Ok36K91J82L9j14o7J35k43K3J62k2j26O8L9
6933B5k29J19q0J03K0n4K47l20K98j15j49J19J6K5j94J78J67j97J6J50l54K91
6955H2ok49J31J68k61J55n9M4J72j86K85p0j36j69MK32k66NJ01k52N36k61q7j13
6979b00N11l23j8oJ74m33O06l06L7n0k0K35N7j02j60R3j5J0n0j49N8K69lL1m12
$$ plain form
7004 -166 12 -131 -222 -43 -32 146 -48 -24 246 -144 46 82 115 158 118 -171 -239 -105 -310 -65 -148 228 78
7027 78 -96 173 48 -18 -325 130 153 30 -34 13 -47 253 100 7 -93 181 29 -80 188 -55 -362 -254
7049 -254 150 -31 56 -86 -76 -135 -194 22 124 61 -84 -89 200 -294 -12 -33 118 180 2 418 140 -64 -26
7072 -26 -116 26 -119 251 143 138 -141 148 -46 210 45 9 33 159 125 200 264 -79 139 16 126 -161 199
7095 199 -73 47 22 107 0 294 -542 191 -74 6 -26 167 -53 -124 -157 52 -136 -77 -46 -292 -135 180 -124
7118 -124 -8 -173 -5 -30 -169 157 -22 201 305 36 -193 -168 -259 -250 -166 -174 -210 232 -184 -117 -69 -47 -203 -35
7142 -35 356 30 158 141 -129 275 223 167 -68 -22 112 -70 -375 -66 69 -4 -31 7 38 126 3 -235 -83
7165 -83 152 127 -209 -5 -41 267 154 -305 85 57 26 -265 58 -6 -187 -22 128 78 -93 -67 7 -100 15
$$ packed form
7004a66J78j43r1J79J1J78j94K4K70l90J90L6L3M3m0k89o8J34k05K45q3L76j50
7027G8j74K69j25o6l07M55K3j23o4M7o0L00j53r3j00K74j52j09K68k43l07J08
7049b54M04j81Q7j42J0n9n9K16J02o3j45nK89m94K82k1J51O2j78M16k78k04L8
7072b6r0J42j45L70j08nk79K89j94K56j65l6K4J26l4P5O4l43K18j23J10k87L60
7095A99k72J20k5Q5j07K94q36P33k65Q0l2J93k20p1l3K09j88N9L1k46J57L15l04
7118a24J16j65J68k5j39L26j79K23J04k69k29K5r1RQ4ql6M42m16O7M8K2j56J68
7142c5L91l26J28j7k70M04n2n6k35M6J34j82l05L09J35p3k7L8L1Q8j23k38J52
7165h3K35k5l36K04l6L08j13m59L90k8l1k91L23o4j81J65J50n0j71K6P4j07J15
$$ plain form
7188 15 -67 111 67 -116 280 -107 163 -91 251 -85 102 340 -153 1 -74 -403 -65 -11 -149 -62 -56 -126 212
7211 212 -61 -76 21 -60 -179 -118 -56 443 58 -75 -73 103 81 -141 95 -20 215 -6 152 -83 -107 -36 -6 69
7235 69 43 48 183 -30 -59 172 89 102 -49 -127 5 187 137 186 73 26 -98 146 -69 222 191 -119 -87 -84 41
7260 41 -79 46 342 131 332 187 117 244 90 136 305 86 -113 -48 -45 314 124 186 248 -71 -146 133 -201
7283 -201 -166 128 41 -31 34 -226 -125 -57 157 216 -64 -123 -78 -106 138 -13 -279 273 256 72 -307 33 50 94
7307 94 91 -38 -27 120 -131 -287 -65 -10 -53 -108 119 52 -49 -42 -186 -13 221 -141 -73 132 49 6 56 -109 57
7332 57 -81 -335 -193 19 39 120 208 -58 20 -54 190 57 2 -29 -73 28 -101 -47 35 41 55 164 2 208 -9
7357 -9 190 130 -80 -82 16 20 -152 1 54 133 206 -12 161 311 137 49 30 22 118 117 -111 6 -195 -53 136 -84
$$ packed form
7188A5q2J78m4j83L96l87K70k54L42l36J87K38m93J54p5l29L38N4j38Q7Op0L38
7211B12k73j5R7q1j19O1O2M99l85j33KJ76k2k22K36j15K35k21J58k35k4P1L0P5
7235F9k6NJ35k13k9K31q3J3j51p8J32J82n0M9j13m7j24K44k15K91l1l10L2LJ25
7260D1j20J25K96k11K01j45p0J27j54M6J69k19j99O5LL59j90O2O2l19p5K79l34
7283b01L5K94q7p2O5k60J01O8K14N9k80n9M5k8K44j51k66N52j7j84l79L40J7M4
7307I4lj29J1J47k51j56K22N5m3n5K27o7j01Pj44J73K34l62O8K05q3m3N0j65J66
7332E7j38k54J42K12K0Q1Q8k66P8p4K44j33n5l1m4J01j29N4Q2OJ4J09j62K06k17
7357iJ99o0k10kR8Mj72J53N3P9P3k18J73J50j74q8j9qR6jk28J17k01J42J89k20
$$ plain form
7383 -84 -110 -18 145 -8 -10 54 40 268 -21 -107 40 -49 -34 211 -186 -118 -125 -46 25 178 -173 -5 95 187 186 -198
7409 -198 10 -115 217 -131 -25 70 61 -214 -41 12 41 -21 8 38 -86 -92 -103 -70 -120 74 35 -192 409 11 217
7434 217 -83 -12 125 91 -40 -119 -86 -189 -22 -287 -95 57 55 -74 -320 -175 111 -26 -36 -168 257 26
7456 26 232 -23 407 -184 -26 20 -107 157 -44 -75 -201 -61 29 206 -234 -6 -150 108 -59 134 -137
7477 -137 57 -73 -66 146 67 230 114 -163 79 124 121 -180 -84 83 -123 135 -70 -36 -334 102 100 -38 -19 -99
7501 -99 -183 -143 95 40 111 254 -59 68 -39 -90 119 145 46 -470 170 247 102 -16 -17 -124 170 81 -31 89
7525 89 69 -118 49 -93 -167 74 203 30 160 -72 41 147 280 -59 -302 82 32 -126 -29 274 -150 -12
7547 -12 60 280 -54 -85 -61 1 -112 64 -15 139 138 -56 27 -47 269 62 180 54 53 96 88 -63 273 112 -219
$$ packed form
7383h4k6R2J63j53kO4j4K28k89q6J47q9J5K45l97O8pP9P1J53l51J68J00R2jl84
7409a98K08j25L32l48J06R5rk75J73N3K9o2K9L0j24oj1L3n0J94l9k27O01l98K06
7434B17l00P1J37l4j31p9L3j03J67k65J92J52kj29k46J45K86j37j0j32M25k31
7456B6K06k55M30n91J58M6j27K64k01l1j26J40R0J77m40K28j44K58j67J93k71
7477a37J94j30PK12p9J63j16k77K42M5ll01R6J67k06K58k05L4k98M36kj38J9q0
7501i9q4M0K38n5P1J43l13J27j07n1K09K6r9n16O40P7j45j18jj07K94q9j12J20
7525H9k0j87J67j42p4K41J29j73J30k32J13J06J33l39k43L84n0j58R7L03m24J38
7547a2P2K20l34l1K4O2j13J76p9J54jj94Q3p4L16k07J18j26jM3qj51L36j61l31
$$ plain form
7572 -219 -54 -320 -39 -45 -128 129 -224 -131 276 -156 -11 91 -109 -138 202 -127 -148 42 36 136 234 -242 -3
7595 -3 -20 -128 71 -147 -339 -16 44 -7 -22 352 164 255 227 -35 -13 95 -87 -35 -46 -148 170 25 29 -89
7619 -89 47 -25 317 66 -26 -48 -128 165 -64 154 344 -123 87 -172 74 48 68 -56 -220 95 61 73 -254
7642 -254 188 47 -65 -85 155 -140 -122 -12 -19 -345 92 -73 -37 145 -20 -40 -301 -237 -189 -40 -37 -275 -26
7665 -26 -164 24 267 -108 92 42 -161 -206 47 -86 -98 -218 -44 -43 -114 43 75 388 13 181 55 248 154
7688 154 -86 21 -102 28 7 41 -94 -272 -94 53 138 222 125 -214 49 380 -130 -95 132 183 -206 -224 135
7711 135 -49 33 -110 78 -48 14 14 15 -196 24 -23 34 -99 -160 75 59 163 -51 30 -140 -124 5 -179 -23
7735 -23 -189 349 -145 256 -30 59 -85 -118 8 117 139 -42 148 343 236 -4 22 -69 52 44 97 84 158 -128
$$ packed form
7572b19J65k66K81oq3K57l53R3M07m32J45J02k00k9L40l29k1J90oJ00R8m76K39
7595cj7j08J99k18j92L23O0n1j5L74j88R1k8k62K2J08j82N2j1j02L18j45Mj18
7619h9J36p2L42k51r2k2q0K93k29K18J90m67K10k59K46k6K0j24j64L15l4J2l27
7642b54M42j41j12k0K40k95J8J10pl26M37j65L6J82j65k0k61O4M8J49Lk38K49
7665b6j38J88K43l75K00n0k03m5K53j33j2j20J74Jp1J57L2L13l75J68j26J93r4
7688A54k40J07j23J30k1L4j35j78J78J47Q5Q4r7l39K63L31n10L5K27N1l89j8L59
7711A35j84Q2j43J88j26O2%Jk11K20m7N7j33o1K35j6J04k14Q1j70J6J29j84J56
7735b3j66N38m94M01k86Q9j44l3J26J09K2j81J90J95j07k40K6r1J21qN3j3P4k86
$$ plain form
7759 -128 173 23 -75 -163 -165 -110 -121 -282 -125 -60 -23 -217 10 105 78 124 -12 107 -56 72 -198 95 -31 -216
7783 -216 -221 81 222 -212 -164 -26 -176 77 -27 52 -120 -18 -34 205 -213 -95 343 -230 165 36 149 8
7805 8 48 -160 21 -152 -48 -103 43 60 -156 -11 -70 -11 -86 -96 -110 256 86 58 85 291 76 117 538 -12
7829 -12 2 -52 -75 -81 204 -94 -33 187 -372 50 140 144 -127 -132 38 -96 134 -205 -129 361 80 91 265 -159 41
7854 41 29 -235 203 36 37 127 -250 405 53 -34 -35 29 2 86 50 -182 -39 44 -195 -168 174 130 138 -66 123 126
7880 126 69 -177 -191 145 5 -39 -72 64 -28 -200 240 -60 -134 -325 83 -117 53 147 -112 176 211 305 -383
7903 -383 -164 122 -85 -168 -314 7 -119 -51 73 43 -150 19 -332 86 -98 -187 -67 254 9 -55 -148 -90
7925 -90 53 19 -115 151 -24 -64 3 -167 261 270 78 -35 -182 225 -41 201 -142 288 -96 35 -5 -26 -69
$$ packed form
7759a28L01j50r8q8kN5j1j61J57O5L7j94K27R5k7M6j36J19j63J28k70K93j26j85
7783b16nL02J41m34M8J38j50K53j04P9j72J02j6K39m18J18M38n73L95j29J13j41
7805HM0k08J81j73J04n5J46J7k16J45n9N9p5j0j4L66j70k8K7K06k15M1M21n50
7829a2J4n4k3oK85k98O1K20n59M22R0Mk71nJ70j34K30l39P6M90k81J1J74m24K00
7854D1j2k64M38j67JR0l77O55l52q7jO4k7Q4l6k32J43Q3k39K7L42m4Qk04J89L
7880A26n7k46j4L36j40m4l3J36r2j72M40l00p4j91M08k00J70R4k59K88L5R4o88
7903c83K19K86k07q3j46L21j26O8J24l0j93J69l51M18j84q9J20L21k45o4r3N8
7925i0J43l4j34K66j75m0O7j70M28Rj92j13j47M07k66K42l43M30l84J31m0k1m3
$$ plain form
7948 -69 -34 -90 45 3 219 -28 -142 174 65 236 -142 -95 -67 142 268 424 76 76 -25 -101 321 -80 -274
7971 -274 74 69 -46 -102 128 -109 -211 -73 -129 -184 153 124 3 -94 103 -76 85 -79 6 -6 121 98 -62
7994 -62 282 -20 -13 99 -274 -227 113 147 -140 -12 -188 -226 56 67 31 -108 51 28 -112 -111 -88 37 -348 37
8018 37 -39 -86 -183 -85 13 65 90 -83 -214 -175 -31 -21 337 -316 119 241 -188 79 227 -27 304 117 -368
8041 -368 -186 145 4 -100 45 275 108 165 198 -81 162 -51 -80 50 5 7 263 140 -7 -250 80 -77
8063 -77 140 -1 -239 35 75 301 197 248 200 -13 -100 49 -5 19 -149 195 -8 66 47 -99 233 -20 -269
8086 -269 232 155 56 223 196 274 95 -63 104 -207 -25 -306 -21 -280 -244 196 252 -42 -239 82 102 385
8108 385 99 -96 -76 1 57 48 38 -48 -78 230 -157 16 -23 -137 187 -154 4 -133 -253 90 248 -109 -85
$$ packed form
7948f9L5n6J35m2K16k47j14L16j09J71l78M7K8K09J26J56l48%j01p6M22m01j94
7971b74L48nj15n6K30k37j02J38n6n5L37k9j21r7J97j79J61j64Q5j2J27k3j60
7994f2L44l02PJ12l73M7L40L4k87J28j76l8K82J1l6j39J59k3j40JK3J25l85L85
8018C7p6m7r7R8R8N2K5j73j31L9J44J0L58o53M35J22m29K67J48k54L31j87m85
8041c68J82L31j41j04J45K30j67N7L3k79K43k13k9J30m5KK56j23j47k43L30j57
8063g7K17j41k38K74M0K26j04N1m8k13q7J49n4K4j68L44k03P4j9j46L32k53k49
8086b69N01p7r9J67k7P8j79j58J67l11J82k81K85k59L6M40N6k94j97L21K0K83
8108C85k86j95K0P7N6rj0q6l0L08l87J73l9j14L24l41J58j37j20L43J58l57K4
$$ plain form
8131 -85 16 -34 101 246 65 -64 -168 -121 60 -48 60 -4 -287 51 -22 -99 -70 -315 -188 15 106 -106 96
8154 96 61 355 -221 -81 263 122 227 -9 -387 -27 -17 108 77 98 69 193 218 101 -111 -19 219 340 -270
8177 -270 -141 -123 271 -293 14 427 -198 41 46 -126 -23 -270 31 104
$$ packed form
8131h5J01n0J35J45j81j29j04M7J81j08J08o4k83L38p3p7K9k45J27K03R1k12K02
8154I6l5K94n76J40L44j41J05k36l78L60J0J25l1K1k9J24K5j17k12R2K38J21o10
8177b70J29J8L94n64L07M13o25K39Nj72J03k47L01P3
8191A04
$$ Imaginary data points
##PAGE= N=2
##DATA TABLE= (X++(I..I)), XYDATA
$$ plain form
0 0 0 0 0 0 0 0 0 -8 8 -8 8 -16 16 -24 25 -32 46 -56 64 -80 96 -113 136 -161 192 -224 257 -297 345 -394
30 -394 454 -516 585 -663 751 -847 951 -1063 1189 -1328 1478 -1640 1819 -2015 2231 -2464
46 -2464 2720 -2996 3303 -3639 4008 -4415 4866 -5368 5932 -6567 7286 -8110 9069 -10199
60 -10199 11552 -13205 15281 -17974 21623 -26871 35085 -49834 84369 -334238 90720 584309
72 584309 -457554 -89276 555483 -135304 -476681 267699 103020 -315462 146287 327932
82 327932 -190677 -100507 137371 -121209 -126733 153454 39416 -7285 73254 -64204 -82442
93 -82442 21679 -84227 21944 170065 -46083 -62943 133098 -101625 -188413 168509 97232
104 97232 -171762 124868 189370 -251997 -112628 240969 -101945 -173836 284695 74317
$$ packed form
0@%%%%%%%qJ6j6J6k4L2m0M9n7P8j02J20j44J76k09K49k97L53m16M81n54O42p39
30c94Q48r70J101j248J414j598J798k014K252k517K806l118L459l834M246m695
46b464N184n716O299o942P647q423R281j0234J1300j2499J3853j5396J7179j9268
60a0199K1751k4757K8486l3255L9597m8494O1956q4919J34203m18607M24958M93589
72E84309j041863L68278O44759o90787l41377P44380j64679m18482M61749J81645
82C27932n18609R0170K37878k58580n524K80187j14038m6701Q0539j37458j8238
93h2442J04121j05906J06171J48121k16148j6860J96041k34723q6788L56922p1277
104I7232k68994K96630O4502m41367J39369L53597l42914p1891M58531k10378
$$ plain form
114 74317 -280503 88044 132344 -252028 -7448 251615 -81459 -100307 160730 -32410
124 -32410 -169569 75706 73019 -76408 53300 77411 -81769 -22512 30511 -69077 14247
135 14247 82379 -44622 -1510 63129 -89040 -53789 92545 -30129 -50707 119657 8925
146 8925 -119681 52705 50565 -115849 28799 128566 -78245 -51999 120432 -45469 -126421
157 -126421 98624 56933 -115102 37371 97379 -95617 -48222 90227 -26711 -59330 75610
168 75610 24027 -62010 23501 24574 -51686 9551 44632 -22514 -4010 27735 -24241 -19843
180 -19843 16910 -12409 -4510 30352 -12498 -23384 24324 -8886 -33536 33800 17983 -38201
192 -38201 25431 32616 -51695 -3149 51942 -30939 -26611 53496 -3289 -48889 27961 20969 -48485
$$ packed form
114G4317l54820L68547M4300l84372K44580K59063l33074j8848K61037j93140
124c2410j37159K45275k687j49427J29708K4111j59180N9257N3023r9588Q3324
135A4247O8132j27001M3112O4639j52169L5251J46334j22674k0578J70364j10732
146H925j28606J72386k140j66414J44648R9767k06811K6246J72431j65901q0952
157a26421K25045m1691j72035J52473O0008j92996M7395J38449j16938l2619J34940
168G5610n1583q6037Q5511J073p6260O1237L5081o7146J8504L1745n1976M398
180a9843L6753k9319P899L4862m2850j0886M7708l3210k4650O7336j5817n6184
192c8201O3632P185q4311M8546N5091q2881M328Q0107n6785m5600P6850o992o9454
$$ plain form
205 -48485 2450 43038 -28047 -21181 41923 -10363 -36007 34566 11794 -35179 20729 24226
217 24226 -28063 -351 21373 -13210 -7278 16184 -1982 -12728 4123 2492 -11132 1095
229 1095 5503 -8276 4469 5746 -13610 6458 11359 -16069 6691 17801 -16519 -358 19435
242 19435 -11037 -8635 14280 -3201 -12418 6944 5446 -15295 -2622 16434 -11127 -15255 19383
255 19383 1309 -18233 14158 6788 -14849 10156 8831 -11779 2432 9763 -3529 -6827 2465
268 2465 5351 -6876 -5387 6579 -4527 -5651 5779 -4158 -2673 5838 -4399 1799 7341 -5722
282 -5722 2610 7329 -4501 2054 4726 -3913 1074 2367 -1874 -2785 -1933 3507 -3401 -6426 7025
297 7025 -1425 -9165 8683 1526 -8830 7834 4578 -5786 4645 4095 -2038 217 1960 1851
$$ packed form
205d8485N0935M0588p1085O866O3104n2286k5644P0573k2772m6973N5908L497
217B4226n2289K7712K1724l4583N932K3462j8166j0746J6851j631j3624J2227
229A095M408j3779J2745J277j9356K0068M901k7428K2760J1110l4320J6161J9793
242A9435l0472K402K2915j7481r217J9362j498k0741J2673J9056k7561m128L4638
255A9383j8074j9542L2391p370k1637K5005j325k0610J4211P331j3292l298R292
268B465K886j2227J489J1966j1106j124J1430r937J485Q511j0237O198N542j3063
282e722Q332M719j1830O555K672q639M987J293m241r11Q52N440o908l025J3451
297G025q450p740J7848p157j0356J6664l256j0364J0431n50o133K255J743j09
$$ plain form
311 1851 -3837 -2569 4640 -3948 -5645 4096 -3354 -4451 3760 -2737 -1691 2686 -2265 2930 2303
326 2303 -3793 3814 3497 -3166 2657 1248 -1833 1632 -1139 -2112 -853 -906 892 -3890 -2382 4984
342 4984 -3805 -4683 7005 -694 -4017 5972 1254 -2771 3777 2392 -17 315 1361 1500 -3396 -1107
358 -1107 3015 -3490 -2852 2687 -1624 -2310 79 -635 1244 -1378 -1332 4265 296 -1514 4941 -189
374 -189 -2206 3998 672 -3461 1122 2040 -3213 -3574 2525 -324 -6783 1069 4121 -6295 -1484 5838
390 5838 -2656 -2406 5161 1429 -1747 2199 3294 -1350 -1734 3447 1589 -3427 831 2282 -3182 -2851
406 -2851 48 267 -2052 -1949 3442 1349 -5036 2606 4806 -4957 233 7626 -817 -2771 5248 2113
422 2113 -6251 591 6156 -4951 -5435 7456 -1830 -9851 4831 2997 -8108 1268 6180 -3008
$$ packed form
311A851n688J268P209q588j697R741p450j097Q211o497J046M377m951N195o27
326B303o096P607l17o663N823j409l081L465k771r73J259n3J798m782J508P366
342D984q789q78J1688p699l323R989m718m025O548j385k409L32J046J39m896K289
358a107M122o505O38N539m311o86K389p14J879k622M6N597l969j810O455n130
374a89k017O204l326m133M583R18n253l61O099k849o459P852L052j0416M811P322
390E838q494K50P567l732l176L946J095m644l84N181j858n016M258J451n464L31
406b851K899K19k319J03N391k093o385P642K200r763N190P393q443j954Q019l135
422B113q364O842N565j1107m84J2891r286q021J4682j834j1105R376M912r188
$$ plain form
436 -3008 -2632 3341 2255 -1920 1270 5124 -393 -2091 2995 -1494 -3545 968 581 84 -1332 -2142
452 -2142 2447 -2797 -6592 5023 2112 -5635 4909 5657 -5149 -280 5737 -1089 -3263 5733 3822
467 3822 -6841 83 6370 -7565 -4404 9645 -3755 -7361 7167 -682 -7835 3133 3025 -2263
481 -2263 1897 3118 -245 -1712 1900 1475 -2130 2956 3239 -3098 911 -99 -5401 2011 363 -4871
497 -4871 4204 850 -6136 3108 849 -5714 3480 4371 -2580 628 5075 -829 -3730 4260 3482 -7337
513 -7337 2528 6979 -9559 -1556 9491 -8696 -5785 10577 -3423 -7798 7472 1597 -7543 2780
527 2780 7052 -3485 -1875 8927 -956 -8212 6663 2726 -9267 4622 5508 -7968 -127 2831
541 2831 -5481 -738 1100 -2038 1548 615 -1244 1414 467 -1032 1146 3083 -294 -1684 5631 714
$$ packed form
436c008L76N973j086m175L190L854n517j698N086m489k051M513l87m97j416q10
452b142M589n244l795J1615k911p747J0544P48j0806M869O017o826k174Q996j911
467C822j0663O924O287j3935L161J4049j3400l606J4528p849p153J0968j08n288
481b263M160J221l363j467L612m25l605N086K83o337M009j010n302P412j648n234
497d871R075l354o986R244k259o563R194Q91o951L208M447n904k901P990p78j0819
513g337R865M451j6538Q003J1047j8187K911J6362j4000m375J5270n875r140J0323
527B780M272j0537J610J0802r883p256J4875l937j1993J3889Q86j3476P841K958
541B831q312M743J838l138L586r33j859K658r47j499K178J937l377j390P315m917
$$ plain form
557 714 -8450 5370 4767 -12458 2535 11273 -11447 -5446 11640 -5448 -10323 9803 5317 -9979
571 -9979 2763 10371 -8145 -5952 13653 -146 -10249 10730 4900 -13070 1598 6429 -7505
584 -7505 -1889 6160 -930 -3654 -642 8 -1676 -1636 1887 3735 1597 -1224 222 2680 -2989 -3135
600 -3135 8549 1719 -8827 6117 4381 -14394 154 11347 -8819 -5302 12380 -2309 -13371
613 -13371 5959 7693 -10510 776 14948 -5080 -8736 10700 48 -11104 7442 7348 -7638
626 -7638 273 5179 -5215 -5507 2378 1453 -1804 535 1426 -1454 -1810 -1126 769 3723 -590 -236
642 -236 5496 -2304 -5722 5919 1708 -7630 5243 6033 -9685 -2528 7349 -5177 -7251 8200
656 8200 3222 -9158 3047 7250 -8671 -1699 10318 -3020 -4019 8505 613 -6656 2981 2360
$$ packed form
557G14r164J3820o03j7225J4993Q738k2720O001J7086j7088m875K0126m486j5296
571i979J2742P608j8516K193J9605j3799j0103K0979n830j7970J4668M831j3934
584g505N616Q049p090k724L012O50j684M0L523J848k138k821J446K458n669j46
600c135J1684o830j0546J4944j736j8775J4548J1193k0166L517J7682j4689j1062
613a3371J9330J734j8203J1286J4172k0028l656J9436j0652j1152J8546r4j4986
626g638P911M906j0394k92P885r25l257K339Q91k880l56O84J895K954m313L54
642b36N732p800l418J1641m211r338J2873P90j5718P157R877j2526k074J5451
656H200m978j2380J2205M203j5921O972J2017j3338r99J2524p892p269R637o21
$$ plain form
670 2360 -4156 -46 3335 -1355 -2891 668 -1263 -2072 1265 -452 -240 3079 -1510 -1632 4620 -1209
686 -1209 -2410 5830 548 -4422 3779 1599 -5316 808 3908 -3423 -2879 4234 -696 -6105 2797
701 2797 3293 -5838 1319 5331 -4164 -588 4521 -1947 -1284 3397 -192 -1039 1489 537 -1013 -689
717 -689 589 -1011 -1563 774 -982 -1769 1320 -1387 -990 3542 -1651 -1211 4480 -759 -1759 3534
733 3534 536 -1597 1450 630 -927 -672 748 -328 -2952 948 860 -3832 1116 2344 -3108 308
749 308 2567 -1789 741 2295 -699 863 809 -47 86 -297 548 -123 -1202 1068 -913 -2070 1107
766 1107 -1076 -1557 1720 -1024 -865 2400 -837 -673 2584 -284 -167 1503 337 339 -179 78 635 -1655
784 -1655 10 653 -2529 508 516 -2800 419 1258 -2019 873 1763 -929 1291 795 -147 1009 -1
$$ packed form
670B360o516M110L381m690j536L559j931q09L337j717K12L319m589j22O252n829
686a209j201Q240n282m970Q201k180o915O124L100p331N44P113m930n409Q902
701B797M96r131P157M012r495L576N109o468O63M681l589q47K528r52j550L24
717f89J278j600n52K337j756p87L089k707L97M532n193M40N691n239j000N293
733C534k998k133L047q20j557K55J420j076k624L900q8m692M948J228n452L416
749C08K259m356K530J554k994J562n4q56J33l83Q45o71j079K270j981j157L177
766A107k183m81L277k744J59L265l237J64L257k868J17J670j166Kn18K57N57k290
784a655J665O43l182L037Ql316L219Q39l277K892Q90k692K220m96r42J156j010
$$ plain form
801 -1 430 445 -685 1242 -769 -1437 1102 -1104 -1596 1227 -1494 -993 1458 -1368 129 1706 -1176
818 -1176 511 1500 -454 619 661 51 962 -330 211 176 -1372 390 -117 -1957 965 -564 -1983
835 -1983 894 -70 -1353 1243 252 61 833 -188 759 849 -108 605 119 -151 666 -807 -706 555
853 555 -1031 -879 102 -1370 4 42 -1168 400 280 -367 981 368 225 878 89 510 420 -429 306
872 306 43 -685 67 -714 -732 514 -934 -769 611 -589 192 248 -318 564 374 26 1021 -33 285
891 285 864 -595 307 474 -1357 -462 124 -866 -212 -428 -371 -547 -953 200 376 -734 847 876 -422
910 -422 910 334 -138 1163 666 -228 189 -573 -83 -299 -830 413 253 -1237 409 -256 -1001 109
928 109 -306 654 1078 -194 1223 727 -1140 647 415 -1000 1210 647 -671 -178 -1160 -524 -808 -937
$$ packed form
801aM31J5j130J927k011o68K539k206m92K823k721N01K451k826J497J577k882
818a176J687R89j954J073M2o10R11j292N41l5j548J762n07j840K922j529j419
835a983K877r64j283K596r91j91P72j021R47R0r57P13m86k70Q17j473J01J261
853E55j586J52R81j472J374L8j210J568j20o47J348o13j43O53p89M21r0q49P35
872C06k63p28P52p81j8J246j448J65J380j200P81N6n66Q82j90l48R95j054L18
891B85N79j459R02J67j831Q95N86r90O54k16N7j76m06J153J76j110J581K9j298
910d22J332n76m72J301m97q94M17p62M90k16n31J243j60j490J646o65p45J110
928A09m15R60M24j272J417m96j867J787k32j415K210n63j318M93r82O36k84j29
$$ plain form
946 -937 990 52 -1470 850 -25 -1677 1379 1032 -4 1277 226 -4 -38 -997 655 566 -480 1308
964 1308 -556 -1903 184 -709 -786 1118 -248 371 486 -1699 437 684 -1167 1813 2247 -470 797
981 797 221 -828 -101 -119 1198 352 -1231 514 -962 -3083 924 478 -1331 1687 584 -1179 382
998 382 -426 58 1041 -113 1751 653 -1309 141 -293 -1144 467 364 380 76 -1676 29 -412 -2296
1016 -2296 1698 1646 -1639 1474 1163 -2175 -50 1639 480 584 952 1496 -813 -1925 912 -497
1032 -497 -2054 1720 591 -1871 236 -237 -1234 -518 515 1731 833 -521 1290 -137 -2092 1170
1048 1170 1677 -675 679 965 -781 -1734 -1067 807 -573 -738 2247 -334 -2555 717 634 -1935 826
1065 826 2302 314 -390 690 830 -1347 -1021 2208 434 -1378 1631 -6 -2828 -330 516 -835
$$ packed form
946i37J927r38j522K320q75j652L056l47j036J281j051k30l4r59J652q9j046J788
964A308j864j347K087q93p7J904j366O19J15k185K136K47j851K980M34k717J267
981G97n76j049P27j8J317q46j583J745j476k121M007m46j809L018j103j763J561
998C82q08M84R83j154J864j098j962J450m34q51J611j03J6l04j752J705m41j884
1016b296L994n2l285L113l11l338K125J689j159J04L68N44k309j112K837j409
1032d97j557L774j129k462K107m73r97P16J033J216q98j354J811j427j955L262
1048A170N07k352J354K86j746r53O67J874j380j65K985k581k221L272q3k569K761
1065H26J476j988p04J080J40k177L26L229j774j812L009j637k822K498Q46j351
$$ plain form
1081 -835 -241 808 1078 -1058 -1012 941 -534 -932 2458 1554 -1152 497 82 -914 -935 631 1397 -501
1099 -501 -719 965 -1381 -2336 1120 437 -976 1146 932 -825 -1093 358 1163 -427 1044 2677 -408
1116 -408 -1397 599 -671 -1424 813 1050 -211 -602 -516 -335 -1403 -408 1778 287 55 1428 -509
1133 -509 -1202 74 795 883 698 1221 644 -1746 -1304 912 -923 -228 1757 -430 -1333 -377 -717 -364
1151 -364 90 1174 1333 -403 -108 369 -1378 118 1575 489 759 606 -1171 -844 -1193 -711 897
1168 897 -316 11 703 -1358 -759 -241 -430 911 842 281 946 -117 -645 316 -348 386 1603 -234
1186 -234 -224 147 -1439 -386 112 -33 800 -223 -765 305 -1140 -381 1543 -97 931 1126 -600
1203 -600 265 147 -816 1202 457 -372 772 -965 -1221 -265 -611 -263 200 -405 587 -399 -819 984 -116
$$ packed form
1081h35N94J049K70k136M6J953j475l98L390r04k706J649m15r96k1J566P66j898
1099e01k18J684k346r55L456o83j413K122k14j757k68J451Q05j590J471J633l085
1116d08r89J996j270p53K237K37j261l91Q6J81j068R95K186j491k32J373j937
1133e09o93J276P21Q8j85N23n77k390M42K216j835O95J985k187r03R56l40L53
1151c64M54J084J59j736K95M77j747J496J457j086K70j53j777L27l49M82J608
1168H97j213L27O92k061N99N18j89J341o9n61O65j063n28R61o64P34J217j837
1186b34J0L71j586J053M98j45Q33j023n42J070j445P59J924j640J028J95j726
1203f00Q65j18r63K018p45q29J144j737k56R56l46L48M63o05R92r86m20J803j100
$$ plain form
1222 -116 -253 1491 541 -235 795 -284 -335 297 -49 246 -131 -708 -115 -845 -685 727 -666 253 812
1241 812 -755 -76 404 -669 845 217 -81 1044 260 -882 710 11 -533 272 -371 -356 -645 -613 158
1260 158 -1070 -117 1073 -500 -263 1160 -480 -423 1374 145 12 706 -40 -20 285 43 19 -480 -144
1279 -144 -2 -545 -422 31 -736 36 207 -93 778 -43 -436 1003 109 -108 809 145 -361 235 93 -147
1299 -147 -304 -55 143 -731 -238 353 -750 81 410 -749 323 373 -99 20 624 -14 482 220 87
1318 87 248 -238 192 -65 -345 25 -354 -694 50 -608 -210 233 -338 141 825 -266 261 813 -158 141
1338 141 692 -67 141 56 -243 3 -655 155 37 -856 234 -168 -836 466 167 -494 746 183 -312
1357 -312 459 156 281 565 74 454 254 -492 300 -308 -324 308 -786 -260 365 -513 110 522 -524 482
$$ packed form
1222a16j37J744r50p76J030j079n1O32l46K95l77n77N93p30J60J412j393R19N59
1241H12j567O79M80j073J514o28k98J125p84j142J592o99n44Q05o43J5k89L2P71
1260A58j228R53J190j573K37J423j640N7J797j229j33O94p46K0L05k42k4m99L36
1279a44J42n43J23M53p67P72J71l00Q71q21l93J439q94k17R17o64n06N96j42k40
1299a47j57K49J98q74M93N91j103Q31L29j159J072N0m72J19O04o38M96k62j33
1318H7J61m86M30k57k80L70l79l40P44o58L98M43n71M79O84j091N27N52r71K99
1338A41N51p59K08q5k99K46o58Q10j18q93J090m02o68J302k99o61J240n63m95
1357c12P71l03J25K84m91L80k00p46P92o08j6O32j094N26O25q78O23M12j046J006
$$ plain form
1377 482 337 -270 528 435 -199 432 240 -13 589 -195 318 195 -812 369 -58 -890 444 -347 -718
1396 -718 611 -216 -711 568 226 563 367 -252 316 119 -318 410 -318 -419 229 -232 70 107 -731 -11
1416 -11 -273 -662 245 400 -596 318 115 -112 621 379 -64 371 -48 518 60 -650 497 -413 -680 670
1436 670 -579 -552 371 -628 -77 486 -96 329 184 -262 499 100 -16 770 -1 21 194 -333 -200 50
1456 50 -562 624 -113 -892 115 -295 -629 360 -266 -92 375 -374 41 574 -392 7 440 -195 499 33
1476 33 -366 -30 -765 -68 -1 -669 131 420 -812 -168 269 -617 338 371 383 251 222 90 64 -272 428 438
1498 438 -356 537 -87 -1183 107 30 -582 307 140 -71 -147 -819 374 281 -594 1004 860 -349 -259 -69
1518 -69 -61 174 117 660 16 -726 539 -785 -1279 420 505 -772 133 439 -354 -461 197 442 84 45 991
$$ packed form
1377D82j45o07P98r3o34O31j92k53O02p84N13j23j007J181m27q32J334p91l71
1396g18J329q27m95J279l42L37j96o19N68j97m37P28p28j01O48m61L02L7q38P20
1416a1k62l89R07J55r96R14k03k27P33k42m43M35m19N66m58p10J147r10k67J350
1436F70j249K7R23r99N51N63n82M25j45m46P61l99j16P86p71K2J73n27J33K50
1456E0o12J186p37p79J007m10l34R89o26J74M67p49M15N33r66L99M33o35O94m66
1476C3l99L36p35O97O7o68Q00K89j232O44M37q86R55L3J2j32k9j32k6l36P00J0
1498D38p94Q93o24j096J290p7o12Q89j67k11p6o72J193r3q75J598j44j209R0J90
1518f9QK35n7N43o44p42J265j324m94J699Q5j277R05L06p93j07O58K45l58l9R46
$$ plain form
1539 991 37 -497 529 80 -777 525 440 -355 -273 -426 -131 -745 -410 980 -27 -594 960 177 -707
1558 -707 374 502 162 221 465 711 -637 -626 913 -406 -769 920 137 -1278 153 -131 -836 -119
1576 -119 792 595 -482 -19 779 -808 -196 1226 -103 -423 800 174 -390 -381 -287 -27 -390 223 690
1595 690 -752 -1024 453 -319 -907 606 741 12 -450 340 566 -626 415 1165 -487 -637 907 -413
1613 -413 -1088 412 266 -418 198 151 -307 -764 -188 286 -562 102 1058 -492 -232 743 22 -124 -31 97
1633 97 384 -480 -252 488 -771 -791 451 -207 -652 507 63 -201 145 -47 231 -78 587 991 -616
1652 -616 -141 1003 -444 -247 442 -340 -196 376 -625 -358 -477 -47 114 -267 295 240 -227 -145 501 -136
1672 -136 723 465 -296 435 -70 -389 514 -330 -286 389 -201 -497 43 -513 -154 -79 -221 407 -18 516 582
$$ packed form
1539I91r54n34J026m49q57J302q5p95Q2j53K95o14L35J390j007n67J554p83q84
1558g07J081J28l40N9K44K46j348J1J539j319l63J689p83j415J431k84p05P17
1576a19R11j97j077M63P98j587O12J422j329l20J223o26n64RR4K60l63O13M67
1595F90j442k72J477p72n88J513J35p29m62P90K26j192J041P50j652j50J544j320
1613d13o75J500j46o84O16m7m58m57N76M74q48O64R56j550K60R75p21j46R3J28
1633I7K87q64K28P40j259k0J242o58m45J159m44k64L46j92K78l09O65M04j607
1652f16M75J144j447J97O89p82J44N72j001K67j19M30J61l81N62n5m67Q2O46o37
1672a36Q59k58p61P31n05l19R03q44M4O75n90k96N40n56L59P5j42O28m25N34O6
$$ plain form
1693 582 -394 115 532 -270 556 787 -22 269 142 -893 29 -95 -399 -15 -198 -31 -338 -126 124 118
1713 118 14 725 30 -501 563 -163 -76 595 158 -111 108 -122 -221 -66 -254 166 -220 -137 222 -377 -199
1734 -199 200 52 307 132 -66 334 310 -97 338 132 -291 157 -53 -396 366 -318 -309 -116 -248 21 -114
1755 -114 -159 587 -315 95 801 -167 -99 525 -28 -261 315 161 -125 -170 -128 -5 -392 -104 369 -362 -193
1776 -193 274 -308 292 228 -260 471 273 -284 393 -90 -17 190 65 -148 -176 -125 -203 -337 -256 -75 -241 -194
1798 -194 -49 -284 47 511 -264 146 396 -86 308 169 -92 138 19 146 -13 -209 120 246 -247 -152
1818 -152 -252 -318 88 -320 -87 488 -350 113 532 110 162 291 21 173 66 -156 89 -101 -109 362 -381
1839 -381 -241 232 -549 -66 366 -311 297 170 19 374 108 36 293 -180 91 106 -226 207 -228 -417 -21
$$ packed form
1693E82r76N09M17q02Q26K31q09K91j27j035R22j24l04L84j83J67l07K12K50o
1713A18j04P11o95n31J064p26Q7O71m37k69K19k30r9J55j88M20l86Q3L59n99J78
1734a99L99j48K55j75j98M00k4m07M35k06m23M48k10l43P62o84RJ93j32K69j35
1755a14m5P46r02M10P06r68O8O24n53k33N76j54k86m5M2J23l87K88M73p31J69
1776a93M67n82O00o4m88P31j98n57O77m83P3K07j25k13k8N1p8j34Q1J81j66M7
1798a94J45k35L31M64p75M10K50m82L94j39k61K30j19J27j59j96L29J26m93R5
1818a52j00o6M06m08K33N75q38M63M19m22N2J29k70J52j07k22K45j90qM71p43
1839c81J40M73p81M83M32o77O08j27j51L55k66p2K57m73K71J5l32M33m35j89L96
$$ plain form
1860 -21 71 -709 44 -62 -193 227 -269 63 239 58 296 59 -6 394 399 -296 368 69 -338 350 -392 -163
1882 -163 367 -488 -241 100 -697 120 149 -372 88 -113 -37 129 -25 144 299 -315 495 70 -473 395 -126
1903 -126 -453 54 -396 -368 57 -298 -232 -166 -429 262 152 -343 226 35 -198 300 44 -45 333 -325 214
1924 214 387 -174 362 -114 -468 409 -57 -43 104 207 -170 -202 63 82 259 151 540 99 138 477 -96
1945 -96 -168 400 -458 -209 244 -108 5 -64 -156 189 -158 6 265 -115 30 425 26 69 341 304 485 483 -512
1968 -512 90 127 -76 366 -118 -318 -107 -302 -162 -12 -265 174 -221 -263 392 13 219 430 316 207 82
1989 82 -108 171 -52 -153 3 103 -189 3 -180 -118 78 15 168 154 -54 135 -3 -271 456 250 -219
2010 -219 404 269 -257 74 -287 -79 -383 -230 295 -250 -588 133 -72 -265 388 233 9 216 -18 332
$$ packed form
1860b1R2p80P53j06j31M20m96L32J76j81K38k37o5M00No95O64k99m07O88p42K29
1882a63N30q55K47L41p97Q17K9n21M60k01P6J66j54J69J55o14Q10m25n43Q68n21
1903a26l27N07m50K8M25l55O6O6k63O91j10m95N69j91k33M98k56q9L78o58N39
1924B14J73n61N36m76l54Q77m66J4J47J03l77l2K65J9J77j08L89m41L9L39n73
1945i6p2N68q58K49M53l52J13o9r2L45l47J64K59l80J45L95l99M3K72l7J81kr95
1968e12O02L7k03M42m84k00K11j95J40J50k53M39l95m2O55l79K06K11j14j09j25
1989H2j90K79k23j01J56J00k92J92j83O2J96o3J53j4k08J89j38k68P27k06m69
2010b19O23j35n26L31l61K08l04J53N25n45l38P21k05j93O53j55k24K07k34L50
$$ plain form
2030 332 -200 152 505 281 82 387 -115 -486 -66 -127 -143 17 -37 87 -220 -192 545 -492 -234 502 318
2051 318 -297 645 170 -287 30 493 374 -362 -119 183 -597 -462 312 -307 -433 553 6 -511 -141 -399
2071 -399 149 -41 108 625 -225 -96 403 -345 -42 350 40 -85 0 -175 -142 -444 -10 533 -35 -175 664
2092 664 -325 -314 364 49 245 310 525 250 -226 -92 350 -171 217 663 -471 -505 168 -703 -375 255 -56
2113 -56 216 236 15 336 -500 93 805 -217 28 635 -209 -368 -227 91 15 -300 279 472 -1041 44
2133 44 355 -539 -218 552 140 17 234 -148 -86 -101 251 284 58 199 113 -296 -50 436 -181 -225 356 -33
2155 -33 -144 -185 -443 -192 -154 363 691 -20 43 315 37 86 97 216 486 19 -166 144 -633 -313 429 -432
2177 -432 -114 -12 -182 61 193 -101 183 87 170 86 -114 121 133 -86 161 307 19 -77 -51 -268 164 -33
$$ packed form
2030C32n32L52L53k24j99L05n02l71M20o1j6J60n4J24l07K8P37j037K58P36j84
2051C18o15R42m75m57L17M63j19p36K43L02p80J35P74o19j26R86n47n17L70k58
2071c99N48j90J49N17q50J29M99p48L03L92l10j25Q5j75L3l02M34N43n68j40Q39
2092F64r89J1O78l15J96O5K15k75m76J34M42n21L88M46j134l4O73q71L28O30l11
2113e6K72K0k21L21q36N93P12j022K45O07q44j59J41L18p6l15N79J93j513J085
2133D4L11q94L21P70m12j23K17l82O2j5L52L3k26J41q6m09K46M86o17m4N81l89
2155c3j11m1k58K51L8N17L28p11O3K72k78M9J1J19K70m67j85L10p77L20P42q61
2177d32L18J02j70K43J32k94K84r6Q3q4k00K35J2k19K47J46k88r6K6k17M32j97
$$ plain form
2199 -33 -253 193 58 144 192 -215 -221 18 -128 230 151 1 328 -313 191 172 -103 166 170 -490 -80 -116 -282
2222 -282 97 -202 -65 264 -406 90 359 -100 307 227 -24 188 -5 140 263 -389 -46 351 -114 -203 104
2243 104 -218 -200 -91 -330 5 -56 -23 189 -309 -216 275 -115 364 279 -434 -78 67 -298 -2 87 -220 -165
2265 -165 -223 -167 175 -480 -41 11 -107 10 60 40 299 376 -296 110 14 179 331 -358 49 408 -165 145
2287 145 -101 -360 117 92 -31 -74 -122 -31 75 -152 279 79 -150 346 170 299 156 -120 -34 272 -272 102
2309 102 -31 -94 160 -88 -296 -56 -219 -47 67 -321 200 263 -216 204 284 34 88 19 -304 -81 -175 -240
2331 -240 31 -400 -97 -6 -301 1 259 -323 191 97 -100 -5 17 210 313 -128 219 182 -207 42 -118 -134
2353 -134 -208 56 -376 164 -342 -320 109 -218 113 217 -342 148 184 -27 350 -48 -236 238 67 122 120 -204
$$ packed form
2199c3k20M46j35Q6M8m07oK39j46L58p9j50L27o41N04j9k75K69Mo60M10l6j66
2222b82L79k99J37L29o70M96K69m59M07q0k51K12j93J45J23o52L43L97m65q9L07
2243A04l22J8J09k39L35o1L3K12m98R3M91l90M79q5p13L56J45l65K96Q9l07N5
2265a65n8N6L42o55M39N2j18J17N0k0K59P7o72M06r6J65J52o89M07L59n73L10
2287A45k46k59M77k5j23m3m8R1J06k27M31k00k29M96j76J29j43k76Q6L06n44L74
2309A02j33o3K54k48k08K40j63J72J14l88N21O3m79M20Q0k50N4o9l23K23r4o5
2331b40K71m31L03R1k95L02K58n82N14r4j97R5K2J93J03m41L47l7l89K49j60j6
2353a34p4K64m32N40n06K2M29l27L31J04n59M90L6k11L77l98j88M74j71N5kl24
$$ plain form
2375 -204 130 -48 -17 64 75 -306 139 -146 -173 47 97 98 130 -329 53 353 -113 249 75 -36 192 89 -282
2398 -282 159 -146 -174 195 -220 77 199 -105 4 -41 33 577 -128 167 346 -366 -71 328 -184 -194 -208 -125
2420 -125 -1 -46 -65 113 -61 -128 268 107 125 57 -42 257 28 -30 55 145 -168 117 -188 89 107 -192 -22
2443 -22 -206 -72 -182 28 -175 129 -69 -101 254 45 -40 -66 136 85 324 -125 -103 81 101 159 -256 -232 281
2466 281 -6 -137 41 61 -117 -57 51 76 -31 119 315 -11 25 137 -95 125 289 -99 -61 66 138 161
2488 161 -241 -238 169 -262 -141 -54 96 -34 16 204 163 -223 147 314 -244 199 455 53 -171 199 -336 156
2510 156 -193 -473 -166 -143 -6 62 -227 -385 162 50 130 246 159 126 72 151 -175 8 -290 31 -62 -44 154
2533 154 -122 -239 135 -268 -148 105 -16 122 -149 -323 2 -95 72 259 214 -34 -112 -137 -190 175 94 -6
$$ packed form
2375b04L34j78L1Q1J1l81M45k85k7K20N0JL2m59L82L00m66L62j74j11K28j03l71
2398b82M41l05k8L69m15K97J22l04J09m5P4N44p05K95J79p12K95L99n12j0j4Q3
2420a25J24m5j9J78j74o7L96j61J8o8r9K99k29n8Q5R0l13K85l05K77J8k99J70
2443b2j84J34j10K10k03L04j98l2L55k09q5k6K02n1K39m49K2J84K0N8m15K4N13
2466B81k87j31J78K0j78O0J08K5j07J50J96l26L6J12k32K20J64l88L8J27P2K3
2488A61m02LM07m31J21Q7J50j30N0J88m1l86L70J67n58M43K56m02k24L70n35M92
2510A56l49k80L07K3J37O8k89j58N47j12Q0J16q7l3n4P9l26J83k98L21r3J8J98
2533A54k76j17L74m03J20K53j21J38k71j74L25r7J67J87m5k48p8k5n3L65q1j00
$$ plain form
2555 -6 -165 -88 -150 -203 -296 -7 152 251 98 108 -84 67 82 116 -81 -238 181 -112 -41 226 -314 -103 67 155
2579 155 -37 -100 -171 91 -142 -142 206 -264 91 121 -137 84 177 -73 88 37 -72 288 -193 175 23 -224
2601 -224 187 63 -222 -219 -47 -140 33 55 -26 44 70 10 317 -282 -58 203 -202 174 52 -56 37 -48 -9 163
2625 163 44 -45 157 -250 141 -4 -117 -211 189 -70 19 152 33 115 -204 194 297 -95 -1 119 -181 174
2647 174 -146 -112 80 -133 173 -186 -261 62 -198 -169 282 289 -73 405 84 -28 62 81 -136 20 -192 7
2669 7 157 -94 142 134 -188 108 -173 -39 192 -115 64 275 -156 18 2 -68 64 187 -183 -58 -2 -157
2691 -157 214 -195 100 19 -153 -55 -120 -115 207 42 53 193 16 24 156 -149 -218 130 11 -59 302 -408 -38
2714 -38 167 47 -439 -239 -168 20 -257 -20 -106 -187 31 -37 116 -208 230 242 42 0 -64 253 -174 -150 -2
$$ packed form
2555fj59P7o2n3r3K89J59R9j53J0j92J51J5L4j97j57M19k93P1K67n40K11J70Q8
2579A55j92o3p1K62k33%L48m70L55L0k58K21R3k50J61n1j09L60m81L68j52k47
2601b24M11j24k85LJ72r3J73K2q1P0K6o0L07n99K24K61m05L76j22j08R3q5L9J72
2625A63j19q9K02m07L91j45j13r4M00k59Q9J33j19Q2l19L98J03l92R4J20l00L55
2647A74l20L4J92k13L06l59p5L23k60K9M51Pl62M78l21j12R0J9k17J56k12J99
2669GJ50k51K36ql22K96k81J34K31l07J79K11m31J74j6p0J32J23l70J25N6j55
2691a57L71m09K95q1j72R8o5NL22j65J1J40j77QJ32l05o9L48j19p0L61p10L70
2714c8K05j20m86K00P1J88k77K37q6q1K18o8J53l24M38J2k00m2o4L17m27K4J48
$$ plain form
2737 -2 -311 253 -10 -42 145 -109 169 60 40 92 156 -124 -278 -187 -33 198 218 -217 -38 34 -152 53 -5
2760 -5 -95 -174 -114 230 -23 -102 298 -125 109 63 -167 129 289 -100 -136 -7 259 32 150 -254 153 216 -149
2783 -149 -61 -158 -23 120 -258 -64 -2 -27 -145 5 -218 -97 -129 77 142 16 87 258 -110 175 -225 -314 13
2806 13 -275 23 193 -90 -90 122 -60 85 53 -129 63 -57 124 41 -28 317 157 109 -198 -29 -142 -92 -35
2829 -35 -90 -155 28 -165 79 93 -268 30 -132 -254 243 -140 157 0 -6 65 -107 -16 97 -137 -100 18 -100
2852 -100 4 539 71 51 271 1 23 -116 46 137 -82 -256 52 -242 112 -121 -126 228 122 -361 37 -160
2874 -160 -39 356 -197 92 -9 155 284 -18 29 142 50 79 39 -5 148 81 -34 -144 176 -181 -384 125
2896 125 47 109 -75 252 45 120 25 -51 -115 139 329 -27 -47 153 84 195 164 -35 130 -97 -185 -65 -46 62
$$ packed form
2737bl09N64k63l2J87k54K78j09k0N2O4k80j54R1J54K31K0m35J79P2j86K05n8
2760er0p9O0L44k53p9M00m23K34m6k30K96J60l89l6J29K66k27J18m04M07O3l65
2783a49Q8r7J35J43l78J94O2k5j18J50k23J21l2K06O5j26P1J71l68K85m00q9L27
2806A3k88K98J70k83%K12j82J45l2j82J92j20J81q3o9L45j60m8l07J69j13N0N7
2829c5n5o5J83j93K44J4l61K98j62j22M97l83K97j57oP1j72R1J13k34L7J18j18
2852a00J04N35m68k0K20k70K2j39J62R1k19j74L08k94L54k33nL54j06m83L98j97
2874a60J21L95n53K89j01J64J29l02M7J13r2K9m0m4J53o7j15j10L20l57k03N09
2896A25p8O2j84L27k07P5r5p6o4K54J90l56k0K00o9J11l1j99J65k27q8J20J9J08
$$ plain form
2920 62 -71 -108 59 87 -72 100 137 -65 58 304 -106 -19 -51 -103 -194 -12 -69 26 75 -35 70 -226 -125 -61
2944 -61 -114 6 -36 253 -261 -228 177 -24 28 -186 -111 -75 24 -230 -14 211 -189 -78 -122 4 -26 -148 -183 113
2968 113 121 75 278 -24 131 191 -333 133 137 -91 69 -4 88 -216 -132 -286 13 -20 0 261 -203 -78 -188 78
2992 78 -123 -226 50 94 139 10 -204 -32 113 66 116 -5 -193 -286 337 -154 -40 -41 -175 -48 237 -15 32
3015 32 -93 -15 -99 -42 48 -163 160 -127 170 -12 -24 -114 -238 -150 -143 -66 202 35 -25 112 -252 32 201 -88
3039 -88 17 13 185 172 -275 152 72 -63 -57 -14 -80 -200 35 -228 -41 -16 -68 -198 -143 -212 77 -110 5 69 -40
3064 -40 98 112 67 186 99 -213 327 222 -172 -40 65 -1 280 5 133 102 -285 -13 226 -238 106 36
3086 36 42 -34 -21 -35 -288 -218 -78 112 -250 305 33 -37 151 33 -236 174 -13 39 200 55 -69 -91 172
$$ packed form
2920F2j33l7J67K8j59J72L7k02J23K46m10Q7l2n2r1J82n7R5M9j10J05k96J01O4
2944f1n3J20m2K89n14L3M05k01N2k14P5L6R9k54K16K25m00J11m4J26l0j22l5K96
2968A13Qm6K03l02J55O0n24M66Mk28J60p3R2l04Q4j54K99l3K0K61m64J25j10K66
2992G8k01j03K76M4M5j29k14J72J45m7N0j21j88r3O23m91J14jj34J27K85k52M7
3015C2j25P8q4N7R0k11L23k87K97j82j2r0j24Q8PP7K68j67o0J37l64K84J69k89
3039h8J05mJ72j3m47M27q0j35OM3o6j20K35k63J87K5n2j30N5o9K89j87J15O4j09
3064d0J38J4m5J19q7l12N40j05l94J32J05o6K81k75J28l1l87K72K39m64L44p0
3086C6Op6J3j4k53P0J40J90l62N55k72p0J88j18k69M10j87N2J61j45j24k2K63
$$ plain form
3109 172 -127 182 242 192 182 -115 80 124 40 -232 -17 -92 -97 -268 289 -14 -455 4 -156 -103 161 -186 -394
3132 -394 53 -130 101 -98 57 104 -93 -170 -6 -198 -123 -109 122 -55 -56 -38 -60 -25 101 270 109 -28 73
3155 73 166 76 163 55 -142 182 -203 -60 180 19 109 251 202 147 161 -147 131 -31 -248 -1 273 137 -165
3178 -165 -19 -5 -7 -106 96 -77 124 -339 -166 30 71 -9 6 -66 43 -98 105 27 -130 -96 -153 101 -4 123
3202 123 -276 52 -278 -18 131 299 316 -213 68 47 -357 78 44 -220 -141 -140 111 16 -56 -126 -138 -98 71 -355
3226 -355 -11 -114 -166 67 64 -225 -103 -170 -64 90 -164 317 54 -146 -19 23 -146 107 33 79 -53 98
3248 98 -241 151 -33 197 -10 -43 -3 -65 -196 132 149 -15 101 126 -236 17 108 -166 -98 -109 263 180 180 -11
3272 -11 -61 37 -44 -43 -4 76 -97 143 146 166 -166 191 -50 -36 -32 312 -238 101 156 -85 37 -48 -42 -322 83 -104
$$ packed form
3109A72k99L09O0n0j0k97J95M4q4k72K15p5nj71N57l03m41M59j60N3K64l47k08
3132c94M47j83K31j99J55M7j97p7J64j92P5J4K31j77jJ8k2L5J26J69j61j37J01
3155G3R3r0Q7j08j97L24l85J43K40j61R0J42m9n5J4l08K78j62k17K47K74j36l02
3178a65J46J4kr9K02j73K01m63J73J96M1q0J5p2J09j41K03p8j57L4n7K54j05J27
3202A23l99L28l30K60J49J68J7n29K81k1m04M35l4k64P9JK51r5p2p0j2M0J69m26
3226c55L44j03n2K33lk89J22o7J06J54k54M81k63k00J27M2j69K53p4M6j32J51
3248I8l39L92j84K30k07l3M0o2j31L28J7j64J16K5l62K53R1k74O8j1L72q3%j91
3272a1n0R8q1JL9Q0j73K40LK0l32L57k41J4ML44n50L39N5k41J22q5Ok80M05j87
$$ plain form
3298 -104 -165 173 36 -263 346 111 -137 -38 -101 171 0 -19 -13 125 -187 -129 147 -181 158 -161 133 132 -116
3321 -116 -291 -47 -72 -86 -92 140 46 -193 116 126 168 108 220 107 176 78 15 110 49 -288 -78 108 -219 1
3345 1 -54 222 159 226 344 23 231 102 -73 -142 -102 222 -175 -177 62 55 81 25 -108 100 219 -75 53 -4 -51
3370 -51 102 -118 144 -3 116 5 220 67 157 142 47 -464 10 2 209 226 -70 -131 119 296 -147 -32 38
3393 38 112 57 3 39 77 -371 -172 254 71 -177 22 -145 106 61 357 92 -175 -128 -241 143 62 -116 98
3416 98 -45 212 144 -142 -33 20 -195 -116 -12 83 -174 -326 116 -171 97 -133 4 -3 -37 -185 20 118 27
3439 27 -139 -134 -10 -22 92 -163 -42 -58 -153 -83 -116 168 80 -177 69 -186 150 -266 336 -5 32 69 -112 -53
3463 -53 -55 118 -53 73 -53 209 273 27 214 -126 -134 -15 -231 -180 23 25 -133 -195 -108 140 69 168 -226 350
$$ packed form
3298a04o1L38j37k99O09k35k48R9o3K72j71j9OJ38l12N8K76l28L39l19K94jk48
3321a16j75K44k5j4oK32r4k39L09J0M2o0J12j13O9r8o3R5o1l37K10J86l27K20
3345An5K76o3O7J18l21K08j29j75o9M0L24l97kK39pK6n6j33K08J19k94J28n7m7
3370e1J53k20K62j47J19j11K15j53R0j5r5n11M74qK07J7k96o1K50J77m43J15P0
3393C8P4n5n4L6L8m48J99M26j83k48J99j67K51m5K96k65k67M7j13L84q1j78K14
3416I8j43K57o8k86J09N3k15P9J04R5k57j52M42k87K68k30J37pl4j48K05R8r1
3439B7j66NJ24j2J14k55J21j6r5P0l3K84q8k57K46k55L36m16O02l41L7L7j81N9
3463e3kJ73j71J26j26K62O4k46J87l40qJ19k16N1K03Kj58o2Q7K48p1R9l94N76
$$ plain form
3487 350 -54 -100 275 -176 67 -57 84 62 -149 22 210 -73 -150 -41 -210 -246 -105 -139 -22 -14 -48 144 -199
3510 -199 347 198 288 24 -104 107 293 65 -178 156 101 -197 -45 140 2 -143 -4 -147 95 219 354
3531 354 -81 -139 -14 -141 58 -183 -41 -114 -253 -325 -164 -48 65 111 105 -130 169 -216 117 98 -167 23
3553 23 13 33 -177 266 146 234 -123 -59 164 213 13 -112 90 -31 162 -110 -255 -28 -217 -251 -151 86
3575 86 -149 -131 25 -72 233 -146 294 -87 99 -127 -144 47 -79 93 86 53 170 121 -192 283 -126 -69 -176
3598 -176 150 -146 -241 -50 -30 -79 -37 92 -85 -206 99 184 353 47 -251 74 -215 -54 31 -3 222 107
3620 107 67 140 12 -3 25 -135 270 -19 -54 -201 142 -31 -217 7 -165 177 -172 55 59 114 -101 13 -336
3643 -336 123 98 260 253 -128 319 274 7 112 -259 -145 -6 149 -260 -132 53 -67 -209 219 115 -179
$$ packed form
3487C50m04m6L75m51K43j24J41k2k11J71J88k83p7J09j69l6J41l4J17Ql4J92l43
3510a99N46j49R0k64j28K11J86k28k43L34n5k98J52J85j38j45J39j43K42J24J35
3531C54m35n8J25j27J99k41J42p3j39p2J61J16J13M6ok35K99l85L33j9k65J90
3553B3j0K0k10M43j20Q8l57O4K23M9k00j25K02j21J93k72j45K27j89l4J00K37
3575H6k35J8J56r7L05l79M40l81J86k26j7J91j26J72pl3J17m9l13M75m09N7j07
3598a76L26k96r5J91K0m9M2J29j77j21L05Q5J69l06k98L25k89J61Q5l4K25j15
3620A07m0P3j28j5K8j60M05k89l5j47L43j73j86K24j72L42l49K27MN5k15J14l49
3643c36M59k5J62pl81M47m5k67J05l71J14J39J55m09J28J85j20j42M28j04k94
$$ plain form
3664 -179 272 -246 -156 161 -247 122 26 141 167 174 137 -85 -40 116 -47 -222 -50 18 -103 -159 -105 49 30 -93
3688 -93 -153 122 458 -106 -165 -45 157 -38 -104 23 231 205 43 184 -162 129 216 -101 -3 79 146 -85 121
3711 121 228 80 -338 99 88 102 136 114 208 -103 232 -282 88 -175 -18 31 200 48 127 283 -160 271
3733 271 -198 -14 9 -134 105 -14 -175 -5 -9 62 -50 293 -127 64 166 -12 143 -143 67 54 -74 -297
3755 -297 102 -41 228 -290 143 129 -42 238 17 -123 304 149 198 114 132 -156 -109 -34 -139 -220 78 -54
3777 -54 -59 27 3 253 -53 73 226 44 -31 -171 -195 137 -99 -128 -8 24 209 -64 -104 139 153 -115 10 226
3801 226 -265 -22 -61 -193 -142 33 74 -17 -179 -136 45 81 -70 148 -110 139 -365 16 130 -151 -50 267
3823 267 19 -3 -15 0 -101 -59 211 -178 -195 52 13 95 -167 -62 45 329 -33 46 147 -43 146 34 226
$$ packed form
3664a79M51n18R0L17m08L69r6J15K6Pl7k22M5J56j63j75J72O8j21n6N4J54j9j23
3688i3o0K75L36n64n9J20K02j95o6J27K08k6j62J41l46K91Q7l17R8Q2O7k31K06
3711A21J07j48m18M37j1J4L4k2R4l11L35n14L70k63J57M9J69j52P9J56m43M31
3733B71m69J84K3j43K39j19j61J70mP1j12L43m20J91J02j78J55k86K10j3j28k23
3755b97L99j43K69n18M33j4j71K80k21j40M27j55M9q4J8k88M7P5j05q1K98j32
3777e4nQ6k4K50l06J26J53j82p5j40k4L32k36k9J20L2J85k73m0K43J4k68J25K16
3801B26m91K43l9j32N1J75M1r1j62M3J81L6j51K18k58K49n04L81J14k81J01L17
3823B67k48k2j2J5j01M2K70l89j7K47l9Q2k62J05J07K84l62P9J01j90J89j12J92
$$ plain form
3846 226 19 172 251 -106 93 26 -107 30 105 156 -18 109 7 -205 0 -107 -58 95 -34 295 481 24
3868 24 85 157 251 -42 30 0 -178 200 -157 -125 -55 -128 -179 74 -53 -158 -52 83 6 76 100 -22 205 178 -146
3893 -146 74 -253 335 46 121 -116 114 -9 -283 -121 44 143 -12 88 -236 -240 -308 -240 32 -50 287 29
3915 29 -61 -26 187 -7 -133 102 -206 22 200 90 -193 -13 121 -269 21 110 -242 35 245 40 97 -61
3937 -61 -196 72 52 113 12 -290 -12 162 135 -23 -296 35 109 277 76 -106 -106 -234 166 7 -87 -291 63
3960 63 -165 38 277 -73 -136 -302 43 343 114 5 120 56 179 -181 71 51 -58 11 -327 5 -283 -10
3982 -10 -193 89 -146 -172 16 -51 -181 -61 -191 -81 -308 -194 220 -207 -229 -43 -9 -521 258 64 -8 112
4004 112 239 129 228 -15 168 -176 166 -79 -170 17 270 -49 -94 41 -20 142 -11 117 -50 251 102
$$ packed form
3846B26k07J53P9l57J99o7j33J37P5N1j74J27j02k12K05j07M9J53j29L29J86m57
3868B4O1P2R4k93P2l0j78L78l57L2P0p3n1K53j27j05J06J35p7P0K4j22K27k7l24
3893a46K20l27N88k89P5k37K30j23k74J62J65R9j55J00l24mo8O8K72q2L37k58
3915B9r0L5K13j94j26K35l08K28J78j10k83J80J34l90K90Q9l52K77K10k05N7j58
3937f1j35K68k0O1j01l02K78J74k7j58k73L31P4J68k01j82%j28M00j59r4k04L54
3960F3k28K03K39l50o3j66L45L00k29j09J15o4J23l60K52k0j09O9l38L32k88K73
3982a0j83K82k35k6J88o7j30J20j30J10k27J14M14m27k2J86L4n12P79j94p2J20
4004A12J27j10R9k43J83l44L42k45r1J87K53l19m5J35o1J62j53J28j67L01j49
$$ plain form
4025 102 114 187 75 -177 -137 -27 135 98 187 217 31 195 -358 -71 -25 101 -49 -196 -40 -162 -21 -141
4047 -141 -92 54 31 1 -2 -148 45 -107 -93 99 -133 59 -116 171 71 -150 41 -216 288 -55 -192 258
4069 258 -217 -211 -86 75 121 -55 -127 -155 -159 52 -2 26 52 56 -149 -17 301 361 -108 -127 92 97 268 136 135 -176
4095 -176 -123 227 17 -46 271 4 -173 -152 169 110 -269 -259 -174 170 -28 -49 -71 34 24 -90 79 -162 385
4118 385 -25 -102 41 -196 134 5 30 59 73 44 201 212 -1 18 -120 -32 -70 -17 -142 108 -124 21 -9 27
4142 27 -213 -46 22 175 262 -101 -231 -11 -301 128 62 -120 -23 -60 -123 -58 146 83 -199 517 -70 156 -12
4165 -12 -147 156 43 67 4 -144 20 -111 -67 206 255 304 -49 -50 -9 -135 -6 133 122 -21 80 226 223 4
4189 4 261 143 80 -304 185 -57 -131 111 42 41 41 263 -100 -202 -43 -6 -65 -41 26 -140 -20 154 1 48 -40
$$ packed form
4025A02J2P3j12k52M0J10J62l7Q9L0j86J64n53K87M6J26j50j47J56j22J41j20
4047a41M9J46k3l0lj46J93j52J4J92k32J92j75K87j00k21J91k57N04l43j37M50
4069B58m75OJ25J61M6j76p2k8mK11n4K8K6Mk05J32L18O0m69j9K19NJ71j32jl11
4095a76N3L50k10o3L17k67j77K1L21n9l79J0Q5L44j98k1k2J05j0j14J69k41N47
4118C85m10p7J43k37L30j29K5K9J4k9J57J1k13J9j38Q8l8N3j25K50k32J45l0L6
4142B7k40J67O8J53Q7l63j30K20k90M29o6j82R7l7o3O5K04o3k82P16n87K26j68
4165a2j35L03j13K4o3j48J64j31M4K73M9M9l53jM1j26J29J39j1j43J01J46lk19
4189DK57j18o3l84M89k42p4K42o9j%K22l63j02J59L7n9K4O7j66J20J74j53M7q8
$$ plain form
4214 -40 -30 -244 186 -269 211 -141 44 -11 226 147 -5 116 -37 -16 -182 -97 319 -109 78 45 27 6 88
4237 88 38 -77 -21 -202 -19 -70 167 -343 -61 -67 -107 -42 112 -147 -5 -233 284 -301 -141 -24 169 20 -10
4260 -10 35 -93 -108 -57 18 40 49 -149 54 -126 223 123 51 208 119 -62 104 -97 17 -106 -88 92 336 -114
4284 -114 90 28 91 -1 49 -204 -94 -93 -32 1 -21 -13 112 31 -129 233 -154 107 38 135 -220 -125 -29 -88 -153 0
4310 0 28 197 69 56 101 189 25 -156 -36 -80 -127 -80 -102 36 -21 -4 -131 -174 -70 -78 10 36 93 34 89 36 -94
4337 -94 -268 198 2 202 166 -293 151 -32 -341 -194 279 -180 -205 33 2 66 115 49 -26 -57 132 -169 122
4360 122 95 -47 307 70 -320 26 -57 73 -192 92 -166 214 102 97 81 -107 -153 -172 109 80 -30 -55 -183
4383 -183 12 -25 3 353 107 268 88 -265 56 98 217 213 -154 179 1 -62 -64 84 -221 -116 42 240 213
$$ packed form
4214d0J0k14M30m55M80l52J85n5K37p9j52J21j53K1j66Q5M16m28J87l3j8k1Q2
4237H8n0j15N6j81J83n1K37n10K82om0O5J54k59J42k28N17n85J60J17J93j49l0
4260a0M5j28j5N1P5K2Rj98K03j80L49j00p2J57q9j81J66k01J14j23J8J80K44m50
4284a14K04o2O3r2N0k53J10JO1L3k2QJ25q1j60L62l87K61o9R7l55R5R6n9o5J53
4310@K8J69j28j3M5Q8j64j81J20m4m7M7k2J38n7J7j27m3J04qQ8K6N7n9N5n3j30
4337i4j74M66j96K00l6m59M44j83l09J47M73m59k5K38l1O4M9o6p5l1J89l01K91
4360A22k7j42L54k37l90L46q3J30k65K84k58L80j12nj6j88m6j9K81k9j10k5j28
4383a83J95l7K8L50k46J61j80l53L21M2J19ml67L33j78o3kJ48l05J05J58J98k7
$$ plain form
4406 213 196 166 -284 -80 -174 -110 -16 -26 52 -19 73 241 123 38 71 -119 -20 -9 -132 90 177 -83 46 38 191
4431 191 100 70 -40 -47 -135 -33 50 103 251 -281 88 50 -288 57 -161 163 -176 334 193 107 -38 111 -132
4454 -132 93 95 -152 -31 110 -48 -201 74 -59 -40 200 -23 75 -54 96 -33 200 47 5 -177 76 -299
4476 -299 -130 281 -18 -129 12 -3 93 39 134 144 51 -163 73 199 -42 -14 15 309 -35 -258 -12 37 27
4499 27 -177 253 63 163 30 102 -61 197 -235 -30 246 263 -96 -67 -3 -35 135 -37 95 7 -245 3
4521 3 240 -193 278 -268 -168 -6 -34 197 56 99 186 -90 -226 -170 156 74 -192 -53 -340 122 -97 236
4543 236 -16 -376 -222 -31 -283 156 27 95 25 30 -58 -98 206 -41 83 -5 -166 -184 88 148 -107 -112 -63 -379
4567 -379 -90 -146 -29 203 -173 -221 320 -106 142 172 -24 -127 -145 -42 203 24 -105 -45 62 82 169 -45
$$ packed form
4406B13j7l0m50K04r4O4R4j0P8p1R2J68j18q5L3j90R9J1j23K22Q7k60J29qJ53
4431A91r1l0j10pq8J02Q3N3J48n32L69l8l38L45k18L24l39N10j41q6j45J49k43
4454a32K25Kk47J21J41j58j53K75j33J9K40k23R8j29J50j29K33j53m2j82K53l75
4476b99J69M11k99j11J41j5R6n4R5J0r3k14K36J26k41K8K9K94l44k23K46M9j0
4499B7k04M30j90J00j33P2j63K58m32K05K76J7l59K9O4l2J70j72J32q8k52K48
4521CK37m33M71n46J00J62k8K31j41M3Q7k76j36N6L26q2k66J39k87M62k19L33
4543B36k52l60J54J91k52M39j29O8p0Nq8m0L04k47J24q8j61j8K72O0k55nM9l16
4567c79K89n6J17K32l76m8N41m26K48L0j96j03j8J03K45j79j29O0J07K0Q7k14
$$ plain form
4589 -45 74 -172 36 144 -137 -141 256 264 61 183 -18 239 186 166 167 44 55 20 221 66 10 -36 251 -90
4613 -90 -65 -108 34 139 -25 42 -29 -21 124 82 93 -25 -147 -169 234 14 146 -150 -31 -13 -136 -52 109 -226
4637 -226 -258 172 -99 180 -1 -154 122 50 -127 19 258 -195 -125 6 137 -123 81 61 -4 10 -150 80
4659 80 -297 204 13 146 154 -107 -153 -300 -50 44 -59 70 39 -35 -56 -69 -174 -14 -176 210 -147 -105 25
4682 25 135 112 48 161 -98 119 167 -16 -258 -354 -52 -77 271 50 -187 -83 -83 -20 -132 110 -88 -106 77
4705 77 168 -225 204 -13 -14 127 198 -264 168 137 27 -60 32 -34 -88 -10 206 -61 -282 97 206 215 -117 10
4729 10 -156 -132 147 -98 58 30 83 40 -82 231 138 24 -87 -136 -196 -88 232 -97 21 38 9 127 0
4752 0 77 -78 86 -142 77 121 10 172 220 159 -224 -63 57 53 -36 140 20 -17 -342 -180 -6 -35 69 133
$$ packed form
4589d5J19k46K08J08k81mL97Qk03J22k01K57n3k0Jj23J1l5K01j55n6m6K87l41
4613i0K5m3J42J05j64O7p1QJ45m2J1j18j22k2M03k20J32k96J19J8j23Q4J61l35
4637b26l2M30k71K79j81j53K76p2j77J46K39m53P0J31J31k60K04k0o5J4j60K30
4659H0l77N01j91J33Qk61m6j47K50R4j03J29l1p4k1j3j05J60j62L86l57M2J30
4682B5J10k3o4J13k59K17M8j83k42r6L02k5L48k21k37J04%O3j12K42j98j8J83
4705G7R1l93M29k17jJ41P1m62M32l1j10q7R2o6n4P8K16k67k21L79J09Rl32J27
4729A0j66K4K79k45J56k8N3m3j22L13r3j14j11m9o0J08L20l29J18J7k9J18j27
4752@P7j55J64k28K19M4j11J62M8o1l83J61J20mq9J76j20l7l25J62J74k9J04O4
$$ plain form
4776 133 -332 -18 -182 -96 146 41 -169 150 22 226 -195 127 -73 -248 -291 -248 -100 -287 107 86 4 0
4798 0 -246 -88 254 27 166 71 -130 -145 -79 -186 21 -142 146 79 14 27 -102 -196 133 96 -49 239 331 24
4822 24 243 206 -61 -175 99 -227 8 244 -170 -86 -55 -21 -21 -179 -138 -84 276 51 50 -104 281 74 -172 -254
4846 -254 42 -158 53 51 73 -176 83 201 74 288 -120 41 362 -130 -78 130 80 -111 231 60 -59 267
4868 267 2 -147 -4 104 -44 108 -170 149 -142 129 103 -103 109 -193 -28 -169 -249 151 176 76 111
4889 111 -469 89 128 40 59 3 -54 -189 -78 -38 -31 -131 82 -133 311 -175 209 -101 -210 -212 164 87 70 30
4913 30 156 48 78 7 105 257 4 57 60 -143 77 -19 63 212 80 234 -390 0 -233 -225 94 21 -133 18
4937 18 -354 116 37 -50 69 -15 149 149 -51 -26 -48 -152 -150 45 42 86 -15 81 155 -78 329 88 -74 121 -114
$$ packed form
4776A33m65L14j64Q6K42j05k10L19j28K04m21L22k00j75m3M3J48j87L94k1q2m
4798@k46J58L42k27J39r5k01j5O6j07K07j63K88o7o5J3j29r4L29l7j45K88R2l07
4822B4K19l7k67j14K74l26K35K36m14Q4L1L4%j58M1N4L60k25jj54L85k07k46q2
4846b54K96k00K11kK2k49K59J18j27K14m08J61L21m92N2K08n0j91L42j71j19L26
4868B67k65j49J43J08j48J52k78L19k91K71k6k06K12l02J65j41q0M00K5j00L5
4889A11n80N58L9q8J9n6n7j35J11M0Pj00K13k15M44m86L84l10j09kL76p7j7m0
4913C0J26j08L0p1R8J52k53N3Lk03K20r6Q2J49j32J54o24L90k33QL19p3j54J51
4937A8l72M70p9q7J19q4J64%k00K5k2j04KJ95lM4j01R6P4k33M07k41j62J95k35
$$ plain form
4962 -114 -43 45 -156 87 82 -69 66 -67 105 88 356 -71 -21 28 -136 -260 -137 -56 -54 104 -142 176 216 91
4986 91 -1 185 242 303 18 -153 77 -146 10 75 -170 -138 22 80 -258 130 -129 -119 -92 -168 80 -103 124
5009 124 -77 -49 429 51 164 395 -53 111 -149 91 135 29 -93 170 -230 184 -106 -374 34 -114 -244
5030 -244 208 166 85 190 109 -101 18 74 -197 -294 -68 287 81 34 -354 202 -274 202 101 -122 -109 245
5052 245 164 -52 139 121 -24 -65 -331 -96 107 -226 -55 -75 192 -57 161 78 -214 -440 205 76 -244 95
5074 95 63 -33 -257 219 163 213 27 29 -236 -119 -54 -30 21 65 92 203 101 143 -16 -76 319 145 -80 -169 -83
5099 -83 -144 167 172 -230 -56 -53 -119 117 -2 48 165 24 156 -58 78 408 185 32 114 -21 -88 -137 -69 -44
5123 -44 -134 -54 63 -21 -331 278 -124 179 188 93 20 117 284 58 -67 337 -78 143 115 201 -254 -151 -206 195
$$ packed form
4962a14P1Q8k01K43nj51J35j33J72j7K68m27N0M9j64j24J23Q1KJ58k46L18M0j25
4986I1r2J86N7O1k85j71K30k23J56O5k45L2J60N8l38L88k59J0K7p6K48j83K27
5009A24k01K8M78l78J13K31m48J64k60K40M4j06j22K63m00M14k90k68M08j48j30
5030b44M52m2q1J05q1k10J19N6k71r7K26L55k06m7l88N56m76M76j01k23J3L54
5052B45q1k16J91j8j45m1k66K35K03l33J71k0K67k49K18q3k92k26O45j29l20L39
5074I5l2r6k24M76n6N0j86Kk65J17O5K4N1M4K7J11j02M2j59o0L95j74k25q9Q6
5099h3o1L11Nm02J74Lo6K36j19N0J17j41J32k14J36L30k23j53Q2j35o7m9O8K5
5123d4r0Q0J17q4l10O09m02L03Rr5p3R7J67k26j25M04m15K21k8Q6m55J03n5M01
$$ plain form
5147 195 168 -52 -110 106 -7 -24 138 15 152 102 -100 43 149 -25 98 -162 -50 79 68 -143 65 207
5169 207 46 -121 183 -60 318 11 161 119 124 -33 206 41 -45 224 112 62 -75 -127 -10 -282 -187 86
5191 86 72 -189 -240 -229 -314 95 27 -174 34 89 31 -152 -159 237 201 130 -11 -224 61 -44 219 357 99 -18
5215 -18 98 25 160 -98 201 177 15 -156 -46 -4 135 162 102 -46 -187 -92 -71 -16 -182 37 -53 42 -128 -171
5239 -171 -87 102 336 259 -306 -89 57 158 -191 165 81 -118 -96 -179 93 0 -67 286 -257 -102 34 60 62
5262 62 -39 224 -160 -229 3 104 4 -288 -28 -63 -281 232 52 -147 -76 226 1 15 62 -27 -48 48 -101
5285 -101 -105 -177 94 136 60 -36 -40 -13 -62 215 322 -55 128 -29 -113 267 -80 59 -9 52 166 53 45 -5 51 141
5311 141 236 29 6 125 26 282 -46 -106 15 -330 -234 -60 -162 -200 -171 15 161 12 107 171 55 -63 -72 -135
$$ packed form
5147A95k7k20n8K16j13j7J62j23J37n0k02J43J06j74J23k60J12J29j1k11K08J42
5169B07j61j67L04k43L78l07J50m2Nj57K39j65q6K69j12n0j37n2J17k72R5K73
5191H6j4k61n1J1q5M09o8k01K08N5n8j83pL96l6p1j41k13K85j05K63J38k58j17
5215a8J16p3J35k58K99k4j62j71J10M2J39K7o0j48j41R5K1N5j66K19r0R5j70m3
5239a71Q4J89K34p7n65K17J46J01l49L56q4j99K2q3K72r3o7L53n43J55J36K6K
5262F2j01K63l84o9K32J01j00k92K60l5k18N13j80j99P1L02k25J4M7q9k1R6j49
5285a01mp2K71M2p6r6mK7m9K77J07l77J83j57q4L80l47J39o8O1J14j13qn0N6R0
5311A41R5k07k3J19r9K56l28o0J21l45R6J74j02l8K9J86J46j49R5O4j16j18ro3
$$ plain form
5335 -135 153 8 8 -130 -39 2 -128 -110 -37 7 -136 86 -92 -48 -41 5 -84 -57 114 181 187 150 371 -56 -267 94
5361 94 -21 -131 -146 180 -143 235 105 -51 -171 80 10 -40 3 -70 -178 103 -113 -53 46 21 160 -196 262
5384 262 98 -50 -28 392 -10 6 -122 39 -42 142 69 -5 27 -194 47 -33 -140 -67 7 293 -13 100 42
5407 42 -251 -93 23 159 172 85 -132 290 -98 -154 -237 -87 -24 27 -62 -135 334 54 -167 49 -206 13 -1
5430 -1 -13 7 -256 -75 -18 -6 287 -7 220 69 208 305 73 -314 156 55 -41 124 -174 -174 -86 13 -161 103
5454 103 219 120 189 -243 73 -203 115 -45 -61 146 208 -50 -276 -89 -318 238 102 41 -128 138 149 95
5476 95 3 177 -8 -97 26 187 -14 -195 -169 -157 -330 118 -118 159 -216 -154 50 -217 127 -111 140 178
5498 178 67 -213 61 -78 -119 -180 -79 -96 -42 83 -16 212 2 -112 180 -150 286 -142 56 87 4 173
$$ packed form
5335a35K88j45%j38R1M1j30J8P3M4j43K22j78M4PM6q9K7J71O7Ol7K21m27k11L61
5361I4j15j10j5L26l23L78j30j56j20K51p0n0M3p3j08K81k16O0R9k5J39l56M58
5384B62j64j48K2M20m02J6j28J61q1J84p3p4L2k21K41q0j07P3P4K86l06J13n8
5407D2k93J58J16J36J3q7k17M22l88n6q3J50O3N1q9p3M69k80k21K16k55K19j4
5430aj2K0k63J81N7J2K93k94K27j51J39R7k32l87M70j01r6J65k98%Q8R9j74K64
5454A03J16r9O9m32L16k76L18j60j6K07O2k58k26J87k29N56j36o1j69K66J1n4
5476I5r2J74j85q9J23J61k01j81K6J2j73M48k36K77l75O2K04k67L44k38K51L8
5498A78j11k80K74j39m1o1J01j7N4J25r9K28k10j14K92l30M36m28J98L1q3J69
$$ plain form
5520 173 316 175 101 71 -227 -2 164 -68 -253 -6 -149 118 -67 70 -109 -64 363 -137 135 -28 92
5541 92 -427 -209 37 -116 -63 233 -6 -111 -50 107 -141 -71 -151 3 -97 131 349 -6 75 37 158 37
5563 37 -23 18 182 104 34 200 -3 343 -66 106 -34 64 6 12 52 83 -86 -133 -238 -209 -11 372 -34 -113 146
5588 146 208 -27 -111 -200 -176 -2 -154 -151 -48 109 -125 -183 -52 -180 -110 147 -247 22 -61 59 22 175 86 -335
5612 -335 87 -179 48 58 -237 -191 64 149 89 -240 -117 -64 284 -256 -207 -94 -101 3 77 -128 -184 -183 -86 -21 -102
5637 -102 -224 64 72 -12 45 21 -328 -165 -74 -22 69 11 -38 -94 -16 -8 51 118 -30 36 -88 211 107 17 -53 68
5663 68 273 186 183 -21 98 -156 -7 295 -130 161 -16 -16 138 -41 -36 155 179 -8 -299 191 116 -99 82
5686 82 57 122 -89 -94 -31 69 -225 191 -187 159 -50 108 -103 -17 -45 135 -137 67 294 28 -177 27 225
$$ packed form
5520A73J43j41p4l0k98K25J66k32j85K47j43K67j85J37j79M5M27n00K72j63J20
5541I2n19K18K46j53N3K96k39j05O1J57k48P0q0J54j00K28K18l55Q1l8J21j21
5563C7o0M1J64p8p0J66k03L46m09J72j40R8n8OM0L1j69m7j05K9J98L83m06p9K59
5588A46O2k35q4q9K4J74j52LJ03J57k34n8J31j28P0K57l94K69q3J20l7J53q9m21
5612c35M22k66K27J0k95M6K55Q5o0l29J23N3L48n40M9J13pJ04P4k05n6JR7O5q1
5637a02j22K88Qq4N7k4l49J63R1N2R1n8m9n6P8QN9O7j48O6j24K99j04r0p0J21
5663F8K05q7lk04J19k54J49L02m25K91j77%J54j79NJ91K4j87k91M90p5k15J81
5686H2k5O5k11nO3J00k94M16l78L46k09J58k11Q6k8J80k72K04K27k66k05K04J98
$$ plain form
5709 225 93 155 -178 -58 107 148 -200 54 -78 52 83 -55 47 355 104 236 81 82 35 -236 -58 143
5731 143 -2 -282 41 197 -121 -109 275 -296 134 -174 97 248 40 88 212 -172 -138 -241 137 19 44
5752 44 2 17 22 -225 -198 139 23 -125 103 159 249 -16 -82 56 291 -24 139 88 -323 -114 183 -7 -156
5775 -156 -197 113 -315 162 -108 103 256 79 -101 36 -29 -40 -7 195 31 -98 65 -166 -209 147 -54 187
5797 187 111 -355 -166 123 -14 -61 260 135 -305 -149 -40 105 -345 -151 229 -24 -150 -113 17 -116 156
5818 156 131 -172 256 131 22 -66 21 180 19 194 150 185 -135 -108 -64 95 77 39 143 -31 -65 -31 21 -70
5842 -70 229 -209 -64 -185 -131 121 65 -95 74 29 -239 -18 -66 208 -4 254 99 -27 -121 -7 -40 -84 93
5865 93 -36 -140 -199 341 105 -173 106 14 -309 16 187 -80 106 -150 87 85 -145 164 -247 -71 -131 56
$$ packed form
5709B25j32O2l33J20J65M1l48K54j32J30L1j38J02L08k51J32j55Jm7k71J78K01
5731A43j45k80L23J56l18J2L84n71M30l08K71J51k08M8J24l84L4j03L78j18K5
5752D4m2J5Nk47K7L37j16j48K28N6R0k65o6J38K35l15J63n1m11K09K97j90j49
5775a56m1L10m28M77k70K11J53j77j80J37o5j1L3K02j64j29J63k31m3L56k01K41
5797A87p6m66J89K89j37m7L21j25m40J56J09J45m50J94L80k53j26L7J30j33K72
5818A56k5l03M28j25j09q8Q7J59j61J75m4L5l20K7M4J59j8l8J04j74l4L4N2r1
5842g0K99m38J45j21N4K52n6j60J69m5k68K21m8K74k12K58j55j26r4J14l3m4J77
5865I3j29j04n9N40k36k78K79r2l23L25J71k67J86k56K37kk30L09m11J76o0J87
$$ plain form
5887 56 -154 14 -65 35 -138 -253 -10 -202 -67 34 65 159 163 39 236 37 -11 -45 67 -178 -216 -78 -132
$$ packed form
5887E6k10J68p9J00j73j15K43j92J35J01L1R4Mj24J97j99m8l4J12k45l8J38n4
$$ [...]
8191E6
##END NTUPLES=NMR FID
##END=
