##TITLE=31P_DE-80H_X3
 64 sc D2O
 26.2.2025
##JCAMPDX= 6.0         $$ Bruker NMR JCAMP-DX V2.0
##DATA TYPE= NMR FID
##DATA CLASS= NTUPLES
##ORIGIN= UXNMR, Bruker Analytische Messtechnik GmbH
##OWNER= root
$$ XWIN-NMR		Version 3.5
$$ Mon Jun  8 10:52:21 2026 Russian Standard Time (UT+4h)  Yarkov@DPX200
##.OBSERVE FREQUENCY= 81.013821
##.OBSERVE NUCLEUS= ^31P
##.DELAY= (6, 6)
##.ACQUISITION MODE= SIMULTANEOUS
##.ACQUISITION SCHEME= undefined
##.AVERAGES= 64
##.DIGITISER RES= 17
##SPECTROMETER/DATA SYSTEM= spect
##.PULSE SEQUENCE= zgpg30
##.SOLVENT NAME= D2O
##.SHIFT REFERENCE= (INTERNAL, D2O, 0, 243.863)
##AUDIT TRAIL= $$ (NUMBER, WHEN, WHO, WHERE, WHAT)
$$ ##TITLE= Audit trail, XWIN-NMR		Version 3.5
$$ ##JCAMPDX= 5.01
$$ ##ORIGIN= Bruker BioSpin GmbH
$$ ##OWNER= Yarkov
$$ C:/Bruker/XWIN-NMR/data/yarkov2/nmr/P31/2/audita.txt
$$ ##AUDIT TRAIL=  $$ (NUMBER, WHEN, WHO, WHERE, WHAT)
(   1,<2026-06-08 10:50:36.12 +0400>,<Yarkov>,<DPX200>,
      <created by zg, POWCHK disabled, PULCHK disabled
       configuration hash MD5:
       00 E9 B6 7A A2 85 ED C7 34 08 36 98 17 FE 4E 26
       data hash MD5: 32K
       3E 0C F5 E1 B9 17 E4 7E 79 14 50 88 2B D5 71 A5>)
$$ ##END=
$$ 
$$ hash MD5
$$ 64 EC D0 56 DD 97 C4 BC 77 AE 69 4A 07 EA 7F AF
##$RELAX= 
##$RELAX= 
##$RELAX= 
##$RELAX= 
##$RELAX= 
##$RELAX= 
##$RELAX= 
##$RELAX= 
$$ Bruker specific parameters
$$ --------------------------
##$DU= <C:/Bruker/XWIN-NMR>
##$EXPNO= 2
##$NAME= <P31>
##$PROCNO= 1
##$TYPE= <nmr>
##$USER= <yarkov2>
##$AMP= (0..31)
100 100 100 100 100 100 100 100 100 100 100 100 100 100 100 100 100 100 
100 100 100 100 100 100 100 100 100 100 100 100 100 100 
##$AQSEQ= 0
##$AQ_mod= 1
##$AUNM= <au_zg>
##$AUTOPOS= <>
##$BF1= 81.014009
##$BF2= 200.13
##$BF3= 200.13
##$BF4= 200.13
##$BF5= 200.13
##$BF6= 200.13
##$BF7= 200.13
##$BF8= 200.13
##$BYTORDA= 1
##$CFDGTYP= 0
##$CFRGTYP= 5
##$CHEMSTR= <none>
##$CNST= (0..31)
1 1 145 1 1 1 1 1 1 1 1 1 1 1 1 1 1 1 1 1 1 1 1 1 1 1 1 1 1 1 1 1 
##$CPDPRG= <waltz16>
##$CPDPRG1= <>
##$CPDPRG2= <waltz16>
##$CPDPRG3= <>
##$CPDPRG4= <mlev>
##$CPDPRG5= <mlev>
##$CPDPRG6= <mlev>
##$CPDPRG7= <mlev>
##$CPDPRG8= <mlev>
##$CPDPRGB= <>
##$CPDPRGT= <>
##$D= (0..31)
0 1 0 0 0 0 0 0 0 0.06 0 0.03 2e-05 3e-06 0 0 0.0002 0 0 0 0 0 0 0 0 0 
0 0 0 0 0 0 
##$DATE= 1780901435
##$DBL= (0..7)
120 120 120 11 120 120 24 19 
##$DBP= (0..7)
150 150 150 150 150 150 150 150 
##$DBP07= 0
##$DBPNAM0= <>
##$DBPNAM1= <>
##$DBPNAM2= <>
##$DBPNAM3= <>
##$DBPNAM4= <>
##$DBPNAM5= <>
##$DBPNAM6= <>
##$DBPNAM7= <>
##$DBPOAL= (0..7)
0.5 0.5 0.5 0.5 0.5 0.5 0.5 0.5 
##$DBPOFFS= (0..7)
0 0 0 0 0 0 0 0 
##$DE= 6
##$DECBNUC= <off>
##$DECIM= 4
##$DECNUC= <off>
##$DECSTAT= 4
##$DIGMOD= 1
##$DIGTYP= 9
##$DL= (0..7)
0 0 52 120 120 21 21 25 
##$DP= (0..7)
150 150 150 150 150 150 150 150 
##$DP07= 0
##$DPNAME0= <>
##$DPNAME1= <>
##$DPNAME2= <>
##$DPNAME3= <>
##$DPNAME4= <>
##$DPNAME5= <>
##$DPNAME6= <>
##$DPNAME7= <>
##$DPOAL= (0..7)
0.5 0.5 0.5 0.5 0.5 0.5 0.5 0.5 
##$DPOFFS= (0..7)
0 0 0 0 0 0 0 0 
$$ [...]
##$SUBNAM1= <"">
##$SUBNAM2= <"">
##$SUBNAM3= <"">
##$SUBNAM4= <"">
##$SUBNAM5= <"">
##$SUBNAM6= <"">
##$SUBNAM7= <"">
##$SUBNAM8= <"">
##$SUBNAM9= <"">
##$SW= 400.765351723535
##$SWIBOX= (0..15)
0 1 3 0 0 0 0 0 0 0 0 0 0 0 0 0 
##$SW_h= 32467.5324675325
##$TD= 32768
##$TD0= 1
##$TE= 0
##$TE2= 300
##$TE3= 300
##$TEG= 300
##$TL= (0..7)
0 120 53 12 22 120 120 120 
##$TP= (0..7)
150 150 150 150 150 150 150 150 
##$TP07= 0
##$TPNAME0= <>
##$TPNAME1= <>
##$TPNAME2= <>
##$TPNAME3= <>
##$TPNAME4= <>
##$TPNAME5= <>
##$TPNAME6= <>
##$TPNAME7= <>
##$TPOAL= (0..7)
0.5 0.5 0.5 0.5 0.5 0.5 0.5 0.5 
##$TPOFFS= (0..7)
0 0 0 0 0 0 0 0 
##$TUNHIN= 0
##$TUNHOUT= 0
##$TUNXOUT= 0
##$USERA1= <user>
##$USERA2= <user>
##$USERA3= <user>
##$USERA4= <user>
##$USERA5= <user>
##$V9= 5
##$VALIST= <valist>
##$VCLIST= <CCCCCCCCCCCCCCC>
##$VD= 0
##$VDLIST= <DDDDDDDDDDDDDDD>
##$VPLIST= <PPPPPPPPPPPPPPP>
##$VTLIST= <TTTTTTTTTTTTTTT>
##$WBST= 1024
##$WBSW= 4
##$XGAIN= (0..3)
0 0 0 0 
##$XL= 0
##$YL= 0
##$YMAX_a= 2322585
##$YMIN_a= -2398623
##$ZGOPTNS= <>
##$ZL1= 120
##$ZL2= 120
##$ZL3= 120
##$ZL4= 120
##$ABSF1= 60
##$ABSF2= -190
##$ABSG= 5
##$ABSL= 3
##$ALPHA= 0
##$AQORDER= 0
##$ASSFAC= 0
##$ASSFACI= 0
##$ASSFACX= 0
##$ASSWID= 0
##$AUNMP= <proc_1d>
##$AZFE= 0.1
##$AZFW= 0.5
##$BCFW= 1
##$BC_mod= 2
##$BYTORDP= 1
##$COROFFS= 0
##$CY= 9.86611175537109
##$DATMOD= 1
##$DC= 1
##$DFILT= <>
##$DTYPP= 0
##$F1P= 182.462994727601
##$F2P= 168.069089081705
##$FCOR= 0.5
##$FTSIZE= 0
##$FT_mod= 0
##$GAMMA= 1
##$GB= 0
##$INTBC= 1
##$INTSCL= 1
##$ISEN= 30
##$LB= 1.5
##$LEV0= 0
##$LPBIN= 0
##$MAXI= 11.51145
##$MC2= 0
##$MEAN= 0
##$ME_mod= 0
##$MI= 1.244541
##$NCOEF= 0
##$NC_proc= 0
##$NLEV= 6
##$NOISF1= 0
##$NOISF2= 0
##$NSP= 1
##$NTH_PI= 0
##$NZP= 1
##$OFFSET= 243.8632
##$PC= 1.4
##$PHC0= 1583.601
##$PHC1= 73.15952
##$PH_mod= 0
##$PKNL= yes
##$PPARMOD= 0
##$PSCAL= 0
##$PSIGN= 0
##$REVERSE= no
##$SF= 81.0140731611343
##$SI= 65536
##$SIGF1= 0
##$SIGF2= 0
##$SINO= 80
##$SIOLD= 65536
##$SREGLST= <31P.CDCl3>
##$SSB= 0
##$STSI= 0
##$STSR= 0
##$SW_p= 25641.0256410257
##$SYMM= 0
##$S_DEV= 0
##$TDeff= 0
##$TDoff= 0
##$TI= <>
##$TILT= no
##$TM1= 0
##$TM2= 0
##$TOPLEV= 0
##$USERP1= <user>
##$USERP2= <user>
##$USERP3= <user>
##$USERP4= <user>
##$USERP5= <user>
##$WDW= 1
##$XDIM= 64
##$YMAX_p= 0
##$YMIN_p= 0
$$ End of Bruker specific parameters
$$ ---------------------------------
##NTUPLES= NMR FID
##VAR_NAME=  TIME,          FID/REAL,        FID/IMAG
##SYMBOL=    X,             R,               I
##VAR_TYPE=  INDEPENDENT,   DEPENDENT,       DEPENDENT
##VAR_FORM=  AFFN,          ASDF,            ASDF
##VAR_DIM=   16384,         16384,           16384
##UNITS=     SECONDS,       ARBITRARY UNITS, ARBITRARY UNITS
##FACTOR=    3.08e-05,      1,               1
##FIRST=     0,             0,               0
##LAST=      0.5045964,     0,               0
##MIN=       0,             -2398623,        0
##MAX=       0.5045964,     2322585,         0
$$ Real data points
##PAGE= N=1
##DATA TABLE= (X++(R..R)), XYDATA
0@%%%%%%%%%%%%%n1N2o5J28j28J28j34J54k12K56l07L70m01M59n29N96o88P69
31C97q62R77j100J230j376J537j716J905k106K344k593K861l161L484l837M229
47B213m662N138n667O252o899P633q466R426j0536J1831j3379J5271j7641K0706
61A1220k4840L0785m0085N6902r7012L67815O83053K2990J58183N6891J23418
72A349320O2167J05274O1551R1170N9668P9260N6203O7289M9254N6621M0166M9529
84B127472L2940L9658K6376K8539J7147K0484J1622J0923M194L230n374m582j2383
97B300246j2536j9418k0839k6121k8643l5256l6052m0889m3838m8094m9349n7484
109A881727n5868o3092o4706o9435p0722p5450p6457q1038q5054q5353q9051q9582
$$ y = [0, 0, 0, 0, 0, 0, 0, 0, 0, 0, 0, 0, 0, 0, -51, 1, -64, 64, -64, 64, -70, 84, -128, 128, -179, 191, -210, 249, -280, 316, -372, 397, -465, 512, -588, 642, -734, 803, -913, 992, -1114, 1230, -1363, 1498, -1663, 1821, -2016, 2213, -2449, 2689, -2978, 3274, -3625, 4008, -4458, 4968, -5568, 6263, -7116, 8155, -9486, 11220, -13620, 17165, -22920, 33982, -63030, 304785, 987838, 1010828, 1169011, 1225902, 1349320, 1411487, 1516761, 1578312, 1669482, 1729150, 1808410, 1864613, 1931902, 1981156, 2037777, 2077943, 2127472, 2160412, 2200070, 2226446, 2254985, 2272132, 2292616, 2304238, 2315161, 2319355, 2322585, 2317211, 2312629, 2300246, 2287710, 2268292, 2247453, 2221332, 2192689, 2157433, 2121381, 2080492, 2036654, 1988560, 1939211, 1881727, 1825859, 1762767, 1698061, 1628626, 1557904, 1482454, 1405997, 1324959, 1239905, 1154552, 1065501, 975919]
121I75919r4987r4595r5977r7902r8809j01140j01514j01008j02337j02723j01080
132a16153j00988j01642j00248r8369r8322r5481r4028r2489r0165q8028q6021
143a161934q2984p8462p7649p5553p1392o9849o2556o2839n8372n5398n2008m7268
155a956264m6191l9421l8720l2506l0362k5242k3083j8059j4118j2364n467l250
167b245047J922M053Q092J3931J8427K0969K4696L0908L3037L6679M3128M5096
179a964109M9235N3919N6366N9828O3133O8537O8919P4557P5867Q0062Q1938Q2679
191a149069Q7153Q6979Q9271R2338R3147R4541R5104R6153R6730R5377R7355R6834
203b8087R7195R5055R7324R4270R4195R2157R0676R1329Q7860Q7818Q4143Q4093
$$ y = [975919, 880932, 786337, 690360, 592458, 493649, 392509, 290995, 189987, 87650, -15073, -116153, -217141, -318783, -419031, -517400, -615722, -711203, -805231, -897720, -987885, -1075913, -1161934, -1244918, -1323380, -1401029, -1476582, -1547974, -1617823, -1680379, -1743218, -1801590, -1856988, -1908996, -1956264, -2002455, -2041876, -2080596, -2113102, -2143464, -2168706, -2191789, -2209848, -2223966, -2236330, -2241797, -2245047, -2243125, -2239072, -2230980, -2217049, -2198622, -2177653, -2152957, -2122049, -2089012, -2052333, -2009205, -1964109, -1914874, -1860955, -1804589, -1744761, -1681628, -1613091, -1544172, -1469615, -1393748, -1313686, -1231748, -1149069, -1061916, -974937, -885666, -793328, -700181, -605640, -510536, -414383, -317653, -222276, -124921, -28087, 69108, 164163, 261487, 355757, 449952, 542109, 632785, 724114, 811974, 899792, 983935, 1068028]
215A068028Q1619P7265P6936P3391P1241O8992O4045O3357N8721N8278N3123N0337
227A865333M6741M2657L9541L6627L1340K7835K5724K0173J7069J3376Q486M688
239B179590l78k200r165j1857j5128k0671k3098k9342l1208l6984m0272m2709
251A916578m8138m9346n5877n6274o2310o2047o8784o9143p3337p5262p5371q0162
263A140527q0292q3314q6758q5540q8384q9136q9366r3520r0846r0744r2455r3635
275G6537r2326r1668r2641q9909r1704r0554q8208q7295q7044q5521q2708q1473
287i84514p9870p8688p4047p3240p0865o8779o7100o1771n9671n7506n2549n1024
299a779624m6997m2645m1889l6296l2274k9932k5425j9906j9200j2989r570o088
$$ y = [1068028, 1149647, 1226912, 1303848, 1377239, 1448480, 1517472, 1581517, 1644874, 1703595, 1761873, 1814996, 1865333, 1912074, 1954731, 1994272, 2030899, 2062239, 2090074, 2115798, 2135971, 2153040, 2166416, 2174902, 2179590, 2179212, 2177012, 2167847, 2155990, 2140862, 2120191, 2097093, 2067751, 2036543, 1999559, 1959287, 1916578, 1868440, 1819094, 1763217, 1706943, 1644633, 1582586, 1513802, 1444659, 1371322, 1296060, 1220689, 1140527, 1060235, 976921, 890163, 804623, 716239, 627103, 537737, 444217, 353371, 262627, 170172, 76537, -15789, -107457, -200098, -290007, -381711, -472265, -560473, -647768, -734812, -820333, -903041, -984514, -1064384, -1143072, -1217119, -1290359, -1361224, -1430003, -1497103, -1558874, -1618545, -1676051, -1728600, -1779624, -1826621, -1869266, -1911155, -1947451, -1979725, -2009657, -2035082, -2054988, -2074188, -2087177, -2096747, -2102835]
311b102835r90J647O262R426J5360J8069K2630K6012K8221L3677L7234L9981M5049
324a820257M6342N1667N3913N7420N9588O3304O6173O5982P3088P2610P4063P7441
336a058666P9163Q0461Q2546Q3216Q5369Q5844Q7111Q7602Q8410Q9021Q8153Q9595
348c2175Q9661Q8560Q7831Q9207Q6054Q6888Q4940Q5777Q1328Q2818P9806P6186
360I86881P8539P2213P2488O9895O7826O4669N9849O2192N5861N2006N1067M7310
372A740796M2740L9854L8191L2834K8744K5666K2659J8418J4603J1494O682K538
384B025219M01n759o104j4942j4639j9804k2228k7701l2235l1115l9572l9750
396A771771m4148m8339m9113n5762n4509n9752o0007o6347o7039o7300p0794p3638
$$ y = [-2102835, -2103825, -2102178, -2095916, -2086490, -2071130, -2053061, -2030431, -2004419, -1976198, -1942521, -1905287, -1865306, -1820257, -1773915, -1722248, -1668335, -1610915, -1551327, -1488023, -1421850, -1355868, -1282780, -1210170, -1136107, -1058666, -979503, -899042, -816496, -733280, -647911, -562067, -474956, -387354, -298944, -209923, -121770, -32175, 57486, 146046, 233877, 323084, 409138, 496026, 580966, 666743, 748071, 830889, 910695, 986881, 1065420, 1137633, 1210121, 1280016, 1347842, 1412511, 1472360, 1534552, 1590413, 1642419, 1693486, 1740796, 1783536, 1823390, 1861581, 1894415, 1923159, 1948825, 1971484, 1989902, 2004505, 2015999, 2022681, 2025219, 2025620, 2019861, 2013757, 1998815, 1984176, 1964372, 1942144, 1914443, 1882208, 1851093, 1811521, 1771771, 1727623, 1679284, 1630171, 1574409, 1519900, 1460148, 1400141, 1333794, 1266755, 1199455, 1128661, 1055023]
408A055023p5935p4884p9045p9340q1110q3308q2058q4754q4451q5040q6723q4092
420G4283q5725q6076q6227q5964q3421q4121q2904q3088q0110p8391p8642p5541
432i15927p4689p1827p1974o7162o6677o3081o0279n9077n4186n4118m8514m6990
444a654501m2377l9567l8383l3427l0274k5483k4172j6599j5897j2327o778o481
456a946266o62K521O490J0677J2326J8208J9969K4735K7566L1404L5170L6730
468a721132M2256M4294M5781N0900N2482N4432N9527N9746O2651O6275O6194O9661
480a046933P2538P1660P5321P5416P6889Q0491P7741Q0618P9771Q3780Q1134Q3813
492a07761Q1508Q2318Q3736Q0623Q3701P8637Q0611Q0141P6519P8482P4243P3539
$$ y = [1055023, 979088, 904204, 825159, 745819, 664709, 581401, 499343, 414589, 330138, 245098, 158375, 74283, -11442, -97518, -183745, -269709, -353130, -437251, -520155, -603243, -683353, -761744, -840386, -915927, -990616, -1062443, -1134417, -1201579, -1268256, -1331337, -1391616, -1450693, -1504879, -1558997, -1607511, -1654501, -1696878, -1736445, -1774828, -1808255, -1838529, -1864012, -1888184, -1904783, -1920680, -1933007, -1939785, -1946266, -1946928, -1944407, -1937917, -1927240, -1914914, -1896706, -1876737, -1852002, -1824436, -1793032, -1757862, -1721132, -1678876, -1634582, -1588801, -1537901, -1485419, -1430987, -1371460, -1311714, -1249063, -1182788, -1116594, -1046933, -974395, -902735, -827414, -751998, -675109, -594618, -516877, -436259, -356488, -272708, -191574, -107761, -26253, 56065, 139801, 220424, 304125, 382762, 463373, 543514, 620033, 698515, 772758, 846297]
504H46297P3637O8371O9848O4966O5328O1262O0304N7949N3293N1997M7411M7917
516A568580M0519M0850L8116L1033L1932K5585K2846K1619J6540J3154R877N220
528A865871K409m7o921o081j2126j5483j7191k3069k4065k8444l1630l4392l8340
541A630491m0792m3525m5516n2148n0709n3866n7275n8857o2825o2408o6011o7528
553I69031o8876p1358p2340p3626p4731p5867p7535p6582p8935p8691q0270p7820
565F2400p9840p9940p8214p8727p7775p6724p6956p4650p6243p1209p2892o8908
577h49678o8693o6496o4079o4199o0115n8406n5284n3311n0061m9102m5604m0842
589a525870l9296l6784l3594l0362k6150k5277k0549j8337j2519j0416p821l378
$$ y = [846297, 919934, 988305, 1058153, 1123119, 1188447, 1249709, 1310013, 1367962, 1421255, 1473252, 1520663, 1568580, 1609099, 1649949, 1688065, 1719098, 1751030, 1776615, 1799461, 1821080, 1837620, 1850774, 1860651, 1865871, 1868280, 1868233, 1861312, 1855231, 1843105, 1827622, 1810431, 1787362, 1763297, 1734853, 1703223, 1668831, 1630491, 1589699, 1546174, 1500658, 1448510, 1397801, 1343935, 1286660, 1227803, 1164978, 1102570, 1036559, 969031, 900155, 828797, 756457, 682831, 608100, 532233, 454698, 378116, 299181, 220490, 140220, 62400, -17440, -97380, -175594, -254321, -332096, -408820, -485776, -560426, -636669, -707878, -780770, -849678, -918371, -984867, -1048946, -1113145, -1173260, -1231666, -1286950, -1340261, -1390322, -1439424, -1485028, -1525870, -1565166, -1601950, -1635544, -1665906, -1692056, -1717333, -1737882, -1756219, -1768738, -1779154, -1786975, -1790353]
601a790353n01L690M909R220J3407J4990K0453K0640K6908K8921L1483L4867L8049
614a543317M1193M2852M5424M9919N0508N3348N5628O0123N8493O2426O3691O5698
626h94014O7029O8630P1148O9863P3686P3386P3552P4637P5610P6818P5344P6350
638a7961P5799P6234P5765P3913P5956P3575P1287P2001P0526P0689O6088O7447
650H51319O3724O3985O0448N8152N6264N3444N3270M8923M7521M4380M3241L9508
662A484179L4432L4591K9092K7238K3507K1583J8954J3006J4220P458N368K384
674A716012q99l368q798r322j5029j6082k0689k4471k5479k9387l0565l5024l7652
687A459247l9745m3394m4991m7675n0291n2667n4907n6732n9212o0059o3417o3292
$$ y = [-1790353, -1790854, -1787164, -1782255, -1773035, -1759628, -1744638, -1724185, -1703545, -1676637, -1647716, -1616233, -1581366, -1543317, -1502124, -1459272, -1413848, -1363929, -1313421, -1260073, -1204445, -1144322, -1085829, -1023403, -959712, -894014, -826985, -758355, -687207, -617344, -543658, -470272, -396720, -322083, -246473, -169655, -94311, -17961, 57838, 134072, 209837, 283750, 359706, 433281, 504568, 576569, 647095, 717784, 783872, 851319, 915043, 979028, 1039476, 1097628, 1153892, 1207336, 1260606, 1309529, 1357050, 1401430, 1444671, 1484179, 1518611, 1553202, 1582294, 1609532, 1633039, 1654622, 1673576, 1686582, 1700802, 1708260, 1713628, 1716012, 1715113, 1711745, 1702947, 1693625, 1678596, 1662514, 1641825, 1617354, 1591875, 1562488, 1531923, 1496899, 1459247, 1419502, 1376108, 1331117, 1283442, 1233151, 1180484, 1125577, 1068845, 1009633, 949574, 886157, 822865]
699H22865o5375o6442o7950o9860o9273p1579o9909p3106p3124p0776p4667p1265
711b0461p3757p2563p2141p1927p0301o9994o8297o8597o7141o6294o4330o1629
723h47432o1808n7749n8255n4444n2407n2314m7087m7615m3110m1936l9190l5235
735a438582l4828k7748l0758k2385k1615j9338j6421j3303p930o935m117p71K970
748a641761O412O972J2384J4941J7949K0105K4279K7286K6927L3533L5167L7630
760a378176L9776M2240M5809M6115N0655M9879N4534N5514N7089N9680N9516O1997
772g55372O3075O4587O5424O6760O7743O8687O9117O8619O8880P0392O9244P0029
784E7185O8969O9242O8939O7239O8238O5437O5411O5655O2481O2085O0807O0152
$$ y = [822865, 757490, 691048, 623098, 553238, 483965, 412386, 342477, 269371, 196247, 125471, 50804, -20461, -94218, -166781, -238922, -310849, -381150, -451144, -519441, -588038, -655179, -721473, -785803, -847432, -909240, -966989, -1025244, -1079688, -1132095, -1184409, -1231496, -1279111, -1322221, -1364157, -1403347, -1438582, -1473410, -1501158, -1531916, -1554301, -1575916, -1595254, -1611675, -1624978, -1632908, -1639843, -1643960, -1644731, -1641761, -1635349, -1628377, -1615993, -1601052, -1583103, -1562998, -1538719, -1511433, -1484506, -1450973, -1415806, -1378176, -1338400, -1296160, -1250351, -1204236, -1153581, -1103702, -1049168, -993654, -936565, -876885, -817369, -755372, -692297, -627710, -562286, -495526, -427783, -359096, -289979, -221360, -152480, -82088, -12844, 57185, 126154, 195396, 264335, 331574, 399812, 465249, 530660, 596315, 658796, 720881, 781688, 841840]
796H41840N7268N4907N3957N2656M9609M7810M6158M1422M1042L8340L6896L2420
808A394325L0433K8764K4263K3699J7080J8831J3391J0577P891M268K562j155
820A574929n613m852j1586j0737j6876j9818k1800k2972k6689l0243l1753l5719
832A336271l6075m1006m1234m2688m7521m7886n0311n1963n4036n5976n6739n9736
844G51100n8748o2318o0403o5556o1740o4319o6092o5922o8626o3827o7915o5402
856a9768o6908o6932o5431o5382o5513o3932o3318o2310o0861o0830n8991n6028
868g76204n6298n5237n1853n0962m7564m8982m3375m2388m1013l7879l6070l1930
880a319755l1414k8590k4459k1766k1371j7335j2949j2232r852n081m154J355
$$ y = [841840, 899108, 954015, 1007972, 1060628, 1110237, 1158047, 1204205, 1245627, 1286669, 1325009, 1361905, 1394325, 1424758, 1453522, 1477785, 1501484, 1518564, 1537395, 1550786, 1561363, 1569254, 1573522, 1576084, 1574929, 1569316, 1564464, 1552878, 1542141, 1525265, 1505447, 1483647, 1460675, 1433986, 1403743, 1371990, 1336271, 1300196, 1259190, 1217956, 1175268, 1127747, 1079861, 1029550, 977587, 923551, 867575, 810836, 751100, 692352, 630034, 569631, 504075, 442335, 378016, 311924, 246002, 177376, 113549, 45634, -19768, -86676, -153608, -219039, -284421, -349934, -413866, -477184, -539494, -600355, -661185, -720176, -776204, -832502, -887739, -939592, -990554, -1038118, -1087100, -1130475, -1172863, -1213876, -1251755, -1287825, -1319755, -1351169, -1379759, -1404218, -1425984, -1447355, -1464690, -1477639, -1489871, -1499723, -1504804, -1508958, -1507603]
892a507603K634O745P524J0454J3134J7304K0583K0357K4634K7096K8659L3271
904a295208L4057L6336L8305M0692M3633M5319M7028M7757N1955N1630N4452N5106
916g48938N4958N9853N8379N9180N9813O3505O1974O3116O2674O3532O3886O4542
928a3526O3664O2036O4886O3552O1704O3810O0191O0188N9383N7133N9414N5390
940G17825N3248N2561N0535N0732M6598M5675M4927M2517L8143L8145L4539L2126
952A247571L1763K7297K5153K1756K1723J8057J4113J2432Q948O643M976N43R03
965A441878n881n285r323j3528j3112j7629j8256k2649k4131k6313k9069l2064
977A224638l2850l5794l9601l8875m2041m3772m6696m6445m8408n1852n1939n3325
$$ y = [-1507603, -1504969, -1498224, -1490700, -1480246, -1467112, -1449808, -1429225, -1408868, -1384234, -1357138, -1328479, -1295208, -1261151, -1224815, -1186510, -1145818, -1102185, -1056866, -1009838, -962081, -910126, -858496, -804044, -748938, -693980, -634127, -575748, -516568, -456755, -393250, -331276, -268160, -205486, -141954, -78068, -13526, 50138, 112174, 177060, 240612, 302316, 366126, 426317, 486505, 545888, 603021, 662435, 717825, 771073, 823634, 874169, 924901, 971499, 1017174, 1062101, 1104618, 1142761, 1180906, 1215445, 1247571, 1279334, 1306631, 1331784, 1353540, 1375263, 1393320, 1407433, 1419865, 1428813, 1435456, 1440432, 1440975, 1441878, 1435997, 1430712, 1421389, 1407861, 1394749, 1377120, 1358864, 1336215, 1312084, 1285771, 1256702, 1224638, 1191788, 1155994, 1116393, 1077518, 1035477, 991705, 945009, 898564, 850156, 798304, 746365, 693040]
989F93040n5156n4880n7667n7860n9574n9257n9963o0242o1311o1891o0900o1432
1001a7093o0484o2183o0089n9688o0661n8692n8329n7667n5864n5056n5109n2173
1013g13088n0174m9432m7352m6712m4161m2474m1680l8237l4794l5535l2315k9570
1025a205524k7948k5625k3160k0957j7969j4611j4610q792q782n853m019O7K173
1038a375610M602P236Q922J2686J3300J8540J8421K1858K4306K5550L0289L0475
1050a159425L3716L5195L5769M0497L9975M4354M4002M6749M8012M8734N1592
1061f90830N1304N3837N4258N4280N7418N5950N6346N7768O0228N7536N7761N9801
1073a4343N7268O0412N5595N8482N7182N7475N5690N4597N4320N3370N1005N1689
$$ y = [693040, 637884, 583004, 525337, 467477, 407903, 348646, 288683, 228441, 167130, 105239, 44339, -17093, -77577, -139760, -199849, -259537, -320198, -378890, -437219, -494886, -550750, -605806, -660915, -713088, -763262, -812694, -860046, -906758, -950919, -993393, -1035073, -1073310, -1108104, -1143639, -1175954, -1205524, -1233472, -1259097, -1282257, -1303214, -1321183, -1335794, -1350404, -1359196, -1367978, -1373831, -1377850, -1377783, -1375610, -1371008, -1363772, -1354850, -1342164, -1328864, -1310324, -1291903, -1270045, -1245739, -1220189, -1189900, -1159425, -1125709, -1090514, -1054745, -1014248, -974273, -929919, -885917, -839168, -791156, -742422, -690830, -639526, -585689, -531431, -477151, -419733, -363783, -307437, -249669, -189441, -131905, -74144, -14343, 42925, 103337, 158932, 217414, 274596, 332071, 387761, 442358, 496678, 550048, 601053, 652742]
1085F52742M9167M8702M4871M6695M2812M1028M1102L8069L5820L3633L2666K9167
1097A136474K9268K5250K3827K0877J9886J6884J3398J1284J0481O642N041N55
1109A319867J493k610o520q095j1459j0946j5691j7170k0373k2217k3347k8103
1121A154829k8035l0860l2640l6120l4883l9990m1370m0223m5752m3615m7291
1132G34050m8937m6474n2183n1423n1186n3382n4340n4401n3674n6048n5068n5997
1144A00937n5623n4355n7796n3046n7133n3514n4772n2946n3881n3133n0555n1268
1156e47085m7550m8456m7570m4201m6056m1653m0387l9099l8237l7165l2482l3010
1168a042951k9429k9153k6363k3226k2700j8460j7031j4975j2932j1080q028m847
$$ y = [652742, 701909, 750611, 795482, 842177, 884989, 926017, 967119, 1005188, 1041008, 1074641, 1107307, 1136474, 1165742, 1190992, 1214819, 1235696, 1255582, 1272466, 1285864, 1297148, 1307629, 1314271, 1319312, 1319867, 1321360, 1318750, 1312230, 1304135, 1292676, 1281730, 1266039, 1248869, 1228496, 1206279, 1182932, 1154829, 1126794, 1095934, 1063294, 1027174, 992291, 952301, 910931, 870708, 824956, 781341, 734050, 685113, 638639, 586456, 535033, 483847, 430465, 376125, 321724, 268050, 212002, 156934, 100937, 45314, -9041, -66837, -119883, -177016, -230530, -285302, -338248, -392129, -445262, -495817, -547085, -594635, -643091, -690661, -734862, -780918, -822571, -862958, -902057, -940294, -977459, -1009941, -1042951, -1072380, -1101533, -1127896, -1151122, -1173822, -1192282, -1209313, -1224288, -1237220, -1248300, -1256328, -1261175]
1180a261175k233j844K549L142O725Q297J1641J3503J4893J8686K0725K0931K6610
1193a117550K4635K9372L0161L2680L2621L6695L9742L8181L9289M3813M3637
1204g26724M4055M6762M7133M7984M9549M7985N2120N1526N2780N2835N1064N5032
1216a27899N2477N3239N3500N2273N3936N1383N3807N0098N2657M9828N1148M7367
1228D93814M8671M6433M5110M5354M3046M1292M0523L8835L8255L4421L3119L2016
1240I80889K9498K9184K5044K4689K1642J8357J8456J5694J4368R230R588P534
1252A204173K548K369l24l047m372p661j1047r848j3992j5494j8788k0016k2281
1265A082220k2783k5454k9057k9755l1766l4195l3791l6839l7887l9506m1409
$$ y = [-1261175, -1263408, -1265252, -1262703, -1259561, -1252836, -1244539, -1232898, -1219395, -1204502, -1185816, -1165091, -1144160, -1117550, -1092915, -1063543, -1033382, -1000702, -968081, -931386, -891644, -853463, -814174, -770361, -726724, -682669, -635907, -588774, -540790, -491241, -443256, -391136, -339610, -286830, -233995, -182931, -127899, -75422, -22183, 31317, 83590, 137526, 188909, 242716, 292814, 345471, 395299, 446447, 493814, 542485, 588918, 634028, 679382, 722428, 763720, 804243, 843078, 881333, 915754, 948873, 980889, 1010387, 1039571, 1064615, 1089304, 1110946, 1129303, 1147759, 1163453, 1177821, 1187051, 1196639, 1204173, 1206721, 1209090, 1208766, 1205719, 1201347, 1193686, 1182639, 1172791, 1158799, 1143305, 1124517, 1104501, 1082220, 1059437, 1033983, 1004926, 975171, 943405, 909210, 875419, 838580, 800693, 761187, 719778]
1276G19778m1177m3591m4086m4456m6456m7546m7574n1079m8249n0256m9458n1800
1288A54050n0369n1804n0834n1457n1274m8656n2858m9138n0094m8022m8307m7705
1300d46468m5629m5718m3188m4250m2223m1082l7912l8462l6681l5576l2794l0644
1312i20627k9050k8259k5292k4469k2068k0625j7678j5565j4503j0303j0426p408
1324a146273n039l107o88J324L446M655Q621J0072J0912J3779J5675J8942J9092
1337a048589K1642K3274K6166K7615K7789L1633L1009L4870L4883L5748M0147
1348g13813L9312M1345M0931M3361M3075M5034M6501M5644M8772M6414M7306N0271
1360a75847M8112M8936M8611M9115M8900M8081M8668M7621M8933M5602M7728M4686
$$ y = [719778, 678601, 635010, 590924, 546468, 500012, 452466, 404892, 353813, 305564, 255308, 205850, 154050, 103681, 51877, 1043, -50414, -101688, -150344, -203202, -252340, -302434, -350456, -398763, -446468, -492097, -537815, -581003, -625253, -667476, -708558, -746470, -784932, -821613, -857189, -889983, -920627, -949677, -977936, -1003228, -1027697, -1049765, -1070390, -1088068, -1103633, -1118136, -1128439, -1138865, -1146273, -1151312, -1154419, -1155107, -1153783, -1150337, -1145682, -1137061, -1126989, -1116077, -1102298, -1086623, -1067681, -1048589, -1026947, -1003673, -977507, -949892, -922103, -890470, -859461, -824591, -789708, -753960, -713813, -674501, -633156, -592225, -548864, -505789, -460755, -414254, -368610, -319838, -273424, -226118, -175847, -127735, -78799, -30188, 18927, 67827, 115908, 164576, 212197, 261130, 306732, 354460, 399146]
1372C99146M5896M4428M0994M3120M0098M0322L6714L7371L6172L3746L3619L0264
1384H61890K9629K7042K7005K3383K1483J9626J8822J6592J4036J1977J1513O120
1396A089118Q126M337K047K2j921m135o346o274j1591r577j5048j4967j8719k0945
1410I94127j9856k4020k3217k7631k7842l0022l2272l2001l5593l5891l7140l8040
1422F30602l9203m1148m2062m0770m4703m2419m7109m4436m5877m6194m6383m5881
1434A04417m7838m5845m6278m9241m4675m5376m6214m4685m5151m4823m1995m2743
1446d40447m1275m0971l9983l7877l6129l7403l5044l3531l2182k9853k9101k6607
1458h60403k5792k3903k2930k1487j7954j8010j3178j3857j1633r563p565m892
$$ y = [399146, 445042, 489470, 530464, 573584, 613682, 654004, 690718, 728089, 764261, 798007, 831626, 861890, 891519, 918561, 945566, 968949, 990432, 1010058, 1028880, 1045472, 1059508, 1071485, 1082998, 1089118, 1097244, 1101581, 1103628, 1103650, 1101729, 1097594, 1091248, 1084974, 1073383, 1063806, 1048758, 1033791, 1015072, 994127, 974271, 950251, 927034, 899403, 871561, 841539, 809267, 777266, 741673, 705782, 668642, 630602, 591399, 550251, 508189, 467419, 422716, 380297, 333188, 288752, 242875, 196681, 150298, 104417, 56579, 10734, -35544, -84785, -129460, -174836, -221050, -265735, -310886, -355709, -397704, -440447, -481722, -522693, -562676, -600553, -636682, -674085, -709129, -742660, -774842, -804695, -833796, -860403, -886195, -910098, -933028, -954515, -972469, -990479, -1003657, -1017514, -1029147, -1038710, -1046275, -1051167]
1470a051167m060q2k571L604N344N342Q791J1000J0966J4567J6280J9303J7987
1483i44696K0456K2653K4967K7888K7551K8234L0360L5202L1393L4934L5325L7947
1495e87786L8161L8754M1624L9589M1815M1163M3187M3733M5135M3075M4406M4015
1507h3129M5166M4677M4340M3159M5424M3262M3370M4236M1572M2090M0199M0219
1519D34585M0947L7697L7140L6701L6048L4182L1726L0847L1723K8306K7247K6115
1531H33264K3389K3599K1041J7779J7464J6390J3575J2116R740Q905O093L796
1543A007151K972J483l085k409m061q419q622j0254j0143j5563j6858j7529j9770
1556H94893j9948k2788k3843k6152k6773k8411l1347k9121l3778l3265l4564l5775
$$ y = [-1051167, -1055227, -1055309, -1057880, -1054276, -1048932, -1043590, -1034799, -1023799, -1012833, -998266, -981986, -962683, -944696, -924240, -901587, -876620, -848732, -821181, -792947, -762587, -727385, -695992, -661058, -625733, -587786, -549625, -510871, -469247, -429658, -387843, -346680, -303493, -259760, -214625, -171550, -127144, -83129, -37963, 6714, 51054, 94213, 139637, 182899, 226269, 270505, 312077, 354167, 394366, 434585, 475532, 513229, 550369, 587070, 623118, 657300, 689026, 719873, 751596, 779902, 807149, 833264, 856653, 880252, 901293, 919072, 936536, 952926, 966501, 978617, 988357, 997262, 1003355, 1007151, 1010123, 1011606, 1008521, 1006112, 1002051, 993632, 985010, 974756, 964613, 949050, 932192, 914663, 894893, 874945, 852157, 828314, 802162, 775389, 746978, 715631, 686510, 652732, 619467, 584903, 549128]
1568E49128l7135l8472l7267l9822l7890m3168l9449m1762m2125m2781m1603m3298
1580F4356m2871m2332m2371m2076m1749m3387l9932m1688m0864l8378m1109l6506
1592d28907l8773l5762l5513l5508l2277l3388l0709l0111k8928k6490k5700k4317
1604h06383k1777k0657j9422j7408j5766j4811j1875j1232r658o419m397m944
1616i64749k267J432J288M256M873P247R322J0246J2832J3325J7149J6580J9034
1629h49432K0133K2087K4226K4692K6594K7832K8273L0067L2567L2825L3370L3435
1641e13331L5137L6199L7287L7709L9485L8286L9124L9950M0780M0448M1052M0233
1653d7641M0360M1627M0599M0745L9916L9930L9740L9532L8271L7651L6716L6848
$$ y = [549128, 511993, 473521, 436254, 396432, 358542, 315374, 275925, 234163, 192038, 149257, 107654, 64356, 21485, -20847, -63218, -105294, -147043, -190430, -230362, -272050, -312914, -351292, -392401, -428907, -467680, -503442, -538955, -574463, -606740, -640128, -670837, -700948, -729876, -756366, -782066, -806383, -828160, -848817, -868239, -885647, -901413, -916224, -928099, -939331, -948989, -955408, -959805, -964749, -967016, -965584, -964296, -960040, -955167, -947920, -938598, -928352, -915520, -902195, -885046, -868466, -849432, -829299, -807212, -782986, -758294, -731700, -703868, -675595, -645528, -612961, -580136, -546766, -513331, -478194, -441995, -404708, -366999, -327514, -289228, -250104, -210154, -169374, -128926, -87874, -47641, -7281, 34346, 74945, 115690, 155606, 195536, 235276, 274808, 313079, 350730, 387446, 424294]
1665D24294L5562L4362L3622L2591L1415L0476K9739K7013K7482K4825K2382K5271
1677G79034J9936J9647J8405J4301J6105J2334J2082R033R769L725N974J531K288
1690I24164o58k961k614q045o239r652j0851j1343j4991j4788j8598j6733k1634
1703G85057k0336k3573k5466k4368k6953k9008k7670l2257l0775l1566l3856l3944
1715D45285l5772l5029l6943l6253l8592l7003l8473l8754l8599l9005l8095m0218
1727g451l7680m1001l7918l8388l7993l6734l7677l6520l6309l5460l5412l3487
1739d52030l1167l3396k9813k8488k9434k8139k6949k3455k3057k3380k0588k0145
1751g70041j8122j7119j5074j3618j0515j0574j0203p121l964l471m177l32K012
$$ y = [424294, 459856, 494218, 527840, 560431, 591846, 622322, 652061, 679074, 706556, 731381, 753763, 779034, 798970, 818617, 837022, 851323, 867428, 879762, 891844, 900877, 910646, 914371, 920345, 921876, 924164, 923506, 920545, 917931, 909886, 903647, 893995, 883144, 871801, 856810, 842022, 823424, 806691, 785057, 764721, 741148, 715682, 691314, 664361, 635353, 607683, 575426, 544651, 513085, 479229, 445285, 409513, 374484, 337541, 301288, 262696, 225693, 187220, 148466, 109867, 70862, 32767, -7451, -45131, -86132, -124050, -162438, -200431, -237165, -274842, -311362, -347671, -383131, -418543, -452030, -483197, -516593, -546406, -574894, -604328, -632467, -659416, -682871, -705928, -729308, -749896, -770041, -788163, -805282, -820356, -833974, -844489, -855063, -865266, -872387, -876351, -879822, -883999, -884331, -882319]
1764h82319K505M294N101Q983Q996J0928J2273J2375J6965J6504J8758J8386K1955
1777g24296K2699K3832K5722K5256K8094K7603K8835L1813K9445L2731L3907L2767
1789c81592L5581L5069L5658L5039L7296L6121L6477L8474L6957L7395L7318L7316
1801E7109L7100L7414L6478L5536L6298L4299L6529L2479L4806L2997L0644L2415
1813D74104K8737L0459K7252K7124K6211K4149K3789K1731K1274J9631J8143J8113
1825G60717J4654J4897R813J3105R061P075P162L048M951p0J687l022k998m010
1839H36070o927p983r306j0664j1968j4066j4433j8481j5209k0269k1446k1755
1851F63563k2901k4548k6257k4948k8261k8995k8582l0447l1279l1617l2137l4249
$$ y = [-882319, -879814, -875520, -870419, -861436, -852440, -841512, -829239, -816864, -799899, -783395, -764637, -746251, -724296, -701597, -677765, -652043, -626787, -598693, -571090, -542255, -510442, -480997, -448266, -414359, -381592, -346011, -310942, -275284, -240245, -202949, -166828, -130351, -91877, -54920, -17525, 19793, 57109, 94209, 131623, 168101, 203637, 239935, 274234, 310763, 343242, 378048, 411045, 441689, 474104, 502841, 533300, 560552, 587676, 613887, 638036, 661825, 683556, 704830, 724461, 742604, 760717, 775371, 790268, 800081, 813186, 822247, 829322, 836484, 839532, 844483, 844413, 846100, 843078, 840080, 836070, 829143, 821160, 811854, 801190, 789222, 775156, 760723, 742242, 727033, 706764, 685318, 663563, 640662, 616114, 589857, 564909, 536648, 507653, 479071, 448624, 417345, 385728, 353591, 319342]
1863C19342l3851l3565l4514l4597l5428l4919l4699l7214l5978l4833l4740l6136
1875a01132l5601l5186l4745l3647l4234l1888l3566l0833l1708l0210k8426k9576
1887d90752k7737k6088k5902k3982k3704k1049k2171j9244j9252j6986j4840j4293
1899g46000j2678j2924p334r782o920o866l299k638j117J252K220L619M780N219
1913g92468R918Q386J1187J1927J4545J4272J5576J9062J7272K1103K1184K2376
1925f05660K4243K4088K6949K4710K8353K7997K9281L0425K9930L1326L1146L3430
1937b63782L2996L1767L3902L4150L5002L3598L4245L3531L4298L3971L4259L3360
1949A41297L3179L4077L1728L1494L3194L0322K9899L0629K7179K8294K6891K6314
$$ y = [319342, 285491, 251926, 217412, 182815, 147387, 112468, 77769, 40555, 4577, -30256, -64996, -101132, -136733, -171919, -206664, -240311, -274545, -306433, -339999, -370832, -402540, -432750, -461176, -490752, -518489, -544577, -570479, -594461, -618165, -639214, -661385, -680629, -699881, -716867, -731707, -746000, -758678, -771602, -778936, -788718, -795638, -802504, -805803, -808441, -809558, -808306, -806086, -802467, -797687, -792468, -782550, -774164, -762977, -751050, -736505, -722233, -706657, -687595, -670323, -649220, -628036, -605660, -581417, -557329, -530380, -505670, -477317, -449320, -420039, -389614, -359684, -328358, -297212, -263782, -230786, -199019, -165117, -130967, -95965, -62367, -28122, 5409, 39707, 73678, 107937, 141297, 174476, 208553, 240281, 271775, 304969, 335291, 365190, 395819, 422998, 451292, 478183, 504497]
1961E04497K4579K5407K1839K2240K1125J8931J8191J8212J5531J4145J3099J2220
1973G30016J0462J0603N710P265L475M400K351r53R2k585k478n874o894p161j1100
1988G37329j0331j2000j2536j5791j6164j7018j8709j9025k1874k2022k2838k3694
2000E25327k4266k7365k3875k8784k8287k8318l0986k9097l1511l0004l3018l0998
2012A78818l2696l1240l3875l3136l2027l3798l2225l2142l2659l2652l1680l0496
2024b09808l1944k8776l0491l0684k7363k7841k6668k7603k5220k4373k3038k3617
2036e37426k1649k0196k0601j7663j7049j5839j3663j3997j2605j1881r199p544
2048g19312p605o057l788k702j033j669L338K321M408L948Q464O474J0380J1115
$$ y = [504497, 529076, 554483, 576322, 598562, 619687, 638618, 656809, 675021, 690552, 704697, 717796, 730016, 740478, 751081, 756791, 764056, 767531, 771931, 774282, 773329, 773421, 770836, 768358, 762484, 755590, 748429, 737329, 726998, 714998, 702462, 686671, 670507, 653489, 634780, 615755, 593881, 571859, 549021, 525327, 501061, 473696, 449821, 421037, 392750, 364432, 333446, 304349, 272838, 242834, 209816, 178818, 146122, 114882, 81007, 47871, 15844, -17954, -50179, -82321, -114980, -147632, -179312, -209808, -241752, -270528, -301019, -331703, -359066, -386907, -413575, -441178, -466398, -490771, -513809, -537426, -559075, -579271, -599872, -617535, -634584, -650423, -664086, -678083, -690688, -702569, -711768, -719312, -726917, -732974, -736762, -739464, -740497, -742166, -738828, -736507, -732099, -728151, -719687, -713213, -702833, -691718]
2062f91718J1650J3640J4617J5566J6716J7017J9863K0430K2011K2888K1362K5272
2074d70686K3975K5991K6891K7440K7497K9547K8177K8951L1462K9367L0119L1872
2086a29397L1149L0845L0726L2711L1045L1660K9435L2245K9770K9264L0977K8747
2098B39177K9372K9174K6890K6506K7766K5882K4136K4004K4587K2312K1407J8783
2110E39996K1050J8010J6702J6680J3720J6719J0034J3337Q997P222P546O784
2122F96797O188L464O41J581j030K71k538m384q159m925q271r737j0508j3338
2136F46052j2103j4918j4251j6911j8534j8160j9750k0415k1790k2697k1966k6506
2148D18051k3203k6602k5676k7279k8502k8011k7292k8337k9747k8552l0422k9773
$$ y = [-691718, -680068, -666428, -651811, -636245, -619529, -602512, -582649, -562219, -540208, -517320, -495958, -470686, -446711, -420720, -393829, -366389, -338892, -309345, -281168, -252217, -220755, -191388, -161269, -129397, -98248, -67403, -36677, -3966, 27079, 58739, 88174, 120419, 150189, 179453, 210430, 239177, 268549, 297723, 324613, 351119, 378885, 404767, 428903, 452907, 477494, 499806, 521213, 539996, 561046, 579056, 595758, 612438, 626158, 642877, 652911, 666248, 675245, 682467, 690013, 696797, 702985, 706449, 707090, 708671, 707641, 707912, 705374, 700990, 692831, 687906, 679635, 669898, 659390, 646052, 633949, 619031, 604780, 587869, 569335, 551175, 531425, 511010, 489220, 466523, 444557, 418051, 394848, 368246, 342570, 315291, 286789, 258778, 231486, 203149, 173402, 144850, 114428, 84655]
2160H4655k8526l2303k7663l0691k8903k8368l0993k9121k9116k8593k7277k8078
2172b64977k6746k7873k4341k5500k3875k4635k2302k2607k1720j9696j9876j8461
2184e42609j6928j6293j4888j4800j2060j3005r113j0449o849p519m797m102l585
2197f76997k106j066R98L159K482M919N185P439Q107J0130J0887J1789J3012J3335
2211e88727J6714J4426J7934J8401J8837K0341K0674K1603K1960K3549K5629K3484
2223c45175K5869K4463K7528K6042K7573K7291K8671K7738K7437K9617K9720K7321
2235a5905K9005K7893K9120K7055K9397K7812K7069K7154K7470K6242K5278K4806
2247C12396K5115K4184K4404K1992K1623K0029K0702J9457J6608J8348J5115J7090
$$ y = [84655, 56129, 23826, -3837, -34528, -63431, -91799, -122792, -151913, -181029, -209622, -236899, -264977, -291723, -319596, -343937, -369437, -393312, -417947, -440249, -462856, -484576, -504272, -524148, -542609, -559537, -575830, -590718, -605518, -617578, -630583, -639696, -650145, -656994, -664513, -669310, -673412, -676997, -679103, -680169, -679171, -676012, -673530, -668611, -663426, -655987, -647880, -637750, -626863, -615074, -602062, -588727, -572013, -557587, -539653, -521252, -502415, -482074, -461400, -439797, -417837, -394288, -368659, -345175, -319306, -294843, -267315, -241273, -213700, -186409, -157738, -130000, -102563, -72946, -43226, -15905, 13100, 40993, 70113, 97168, 126565, 154377, 181446, 208600, 236070, 262312, 287590, 312396, 337511, 361695, 386099, 408091, 429714, 449743, 470445, 489902, 506510, 524858, 539973, 557063]
2259E57063J3831J3020J0977J0886J0519O840Q958N960N618K289K000K225m07
2272F49779j637k252k937m760p514m952r278r396j0374j1719j2447j3794j3819
2285E44900j6543j6723j7896j8257j9349k0696k1252k1533k2597k3302k2604k4408
2297B99740k5698k5498k6526k4152k6802k8184k7082k6583k7538k7474k7427k7788
2309b1012k7882k5588k7787k7262k6402k5923k5850k5480k4839k6640k3320k4005
2321c31990k1608k1247k2931j9581k0728j8279j9242j5913j5876j4954j5515j2161
2333e50025j2734j0686j0879p796p788o533n551n658k241j582O4p63J140K354
2347f18678L793N114N823Q942O513Q739J0612J1287J3178J3025J4692J6157J5788
$$ y = [557063, 570894, 583914, 594891, 605777, 616296, 623136, 632094, 638054, 643672, 645961, 647961, 650186, 649779, 648142, 645890, 642953, 638193, 630679, 625727, 616449, 607053, 596679, 584960, 572513, 558719, 544900, 528357, 511634, 493738, 475481, 456132, 435436, 414184, 392651, 370054, 346752, 324148, 299740, 274042, 248544, 222018, 197866, 171064, 142880, 115798, 89215, 61677, 34203, 6776, -21012, -48894, -74482, -102269, -129531, -155933, -181856, -207706, -233186, -258025, -284665, -307985, -331990, -353598, -374845, -397776, -417357, -438085, -456364, -475606, -491519, -507395, -522349, -537864, -550025, -562759, -573445, -584324, -592120, -599908, -606441, -611992, -617650, -619891, -621473, -621409, -622172, -621032, -618678, -614885, -609771, -603948, -595006, -588493, -579754, -569142, -557855, -544677, -531652, -516960, -500803, -485015]
2360d85015J6066J9705J8648J8662K0799K0159K3113K0958K3704K4317K2480K4058
2372b32346K5857K5437K6209K5873K4744K6666K6934K6226K6783K6418K5191K5340
2384G9332K5312K8498K3431K6407K4024K6293K2614K2004K4543K0009K2343K2166
2396C66976J9292J8934J8242J8889J6086J6496J3758J6334J4490J0811J1328R839
2408E51475J0088Q014N591O816O178M107J573J790J125j910k28l629l541n505
2422E81944o933n278r076q628j0925j0538j2238j3230j4602j4324j5668j6921
2434D43583j8455j6600k0861j8202k1282k1472k2963k0462k2793k2983k2737k5649
2446A89124k2479k5711k5462k3963k4819k5439k6114k4791k5711k4776k4801k4599
$$ y = [-485015, -468949, -449244, -430596, -411934, -391135, -370976, -347863, -326905, -303201, -278884, -256404, -232346, -206489, -181052, -154843, -128970, -104226, -77560, -50626, -24400, 2383, 28801, 53992, 79332, 104644, 133142, 156573, 182980, 207004, 233297, 255911, 277915, 302458, 322467, 344810, 366976, 386268, 405202, 423444, 442333, 458419, 474915, 488673, 505007, 519497, 530308, 541636, 551475, 561563, 569577, 575168, 581984, 588162, 592269, 593842, 595632, 596757, 594847, 594619, 590990, 587449, 581944, 575011, 569733, 560657, 552029, 541104, 530566, 518328, 505098, 490496, 476172, 460504, 443583, 425128, 408528, 387667, 369465, 348183, 326711, 303748, 283286, 260493, 237510, 214773, 189124, 166645, 140934, 115472, 91509, 66690, 41251, 15137, -9654, -35365, -60141, -84942, -109541]
2458a09541k3727k5176k3101k4095k2420k3416k2535k1145k0022k0407k0877j8939
2470c75401j8820j6664j7616j7272j3744j4713j1883j4387j0254j0752r508q777
2482e39791p242o747o551m272k157l300j908J550q53K871K157M906M845O225O693
2497e43574R443R667P972J2316J1936J2340J4625J3680J5825J6076J7790J7773
2509c84131J8157J8592J9927K0698J9922K3440K0337K1799K4315K2265K4062K3145
2521a27472K3146K4135K5016K3386K3021K5173K2348K5539K3232K4010K3440K3228
2533A58202K3024K1348K2619K1422K1651K0329J9818K1011J6602J8260J9087J5654
2545C99027J7113J3218J4877J2812J3641J2724Q907J0422Q409Q925P444N477N085
$$ y = [-109541, -133268, -158444, -181545, -205640, -228060, -251476, -274011, -295156, -315178, -335585, -356462, -375401, -394221, -410885, -428501, -445773, -459517, -474230, -486113, -500500, -510754, -521506, -531014, -539791, -547033, -553780, -560331, -564603, -566760, -570060, -571968, -570418, -571271, -568400, -566243, -561337, -556492, -550267, -543574, -534131, -524464, -516492, -504176, -492240, -479900, -465275, -451595, -435770, -419694, -401904, -384131, -365974, -347382, -327455, -306757, -286835, -263395, -243058, -221259, -196944, -174679, -150617, -127472, -104326, -80191, -55175, -31789, -8768, 16405, 38753, 64292, 87524, 111534, 134974, 158202, 181226, 202574, 225193, 246615, 268266, 288595, 308413, 329424, 346026, 364286, 383373, 399027, 416140, 429358, 444235, 457047, 470688, 483412, 492319, 502741, 511150, 520075, 527519, 532996, 538081]
2558E38081K614M166J511O14J33n11l188l625l065n805n779p394p931q703r938
2573D91180j1486j1366j1725j4640j3717j4780j8048j3939j8197j7848j9391j8520
2585C07523j8177k2078k0227k0425j9929k3694k1190k2660k2626k3352k3286k2095
2597D7784k3732k2811k3747k4000k0508k4490k1593k2410k2096k1174k2655j9928
2609b21360k1229j9669k0603j9287j7334j7899j7407j5822j7112j4234j4329j2690
2621d28975j4062j1305j2057r233q262r447o783n531n290n639l722k037j893J86
2635e24050m25K448K537J923M071M694Q433O443P486Q598R631J1080J0693J2992
2649d33446J2061J4643J5039J5593J4416J8349J6475J7096K0178J9228J8670J9342
$$ y = [538081, 540695, 544861, 546372, 546986, 547119, 546608, 543420, 539795, 536730, 530925, 525146, 517752, 509821, 501118, 491180, 479694, 468328, 456603, 441963, 428246, 413466, 395418, 381479, 363282, 345434, 326043, 307523, 289346, 267268, 247041, 226616, 206687, 182993, 161803, 139143, 116517, 93165, 69879, 47784, 24052, 1241, -22506, -46506, -67014, -91504, -113097, -135507, -157603, -178777, -201432, -221360, -242589, -262258, -282861, -302148, -319482, -337381, -354788, -370610, -387722, -401956, -416285, -428975, -443037, -454342, -466399, -475632, -483894, -493341, -500124, -505655, -510945, -516584, -520306, -522343, -524236, -524050, -524475, -522027, -519490, -517567, -513496, -508802, -500369, -493926, -486440, -477842, -468211, -457131, -446438, -433446, -421385, -406742, -391703, -376110, -361694, -343345, -326870, -309774, -289596, -270368, -251698, -232356]
2661b32356K0889K1013K0427K1198K2579J9740K2698K2887K2814K0838K3022K2104
2673B7853K1378K2920K1028K2284K0928K1756K1032J8724K0021J9607K0869J7411
2685B75811J7690J7814J8139J4823J5867J4861J4153J4019J2938J0616J2824R765
2697D49320R156Q373P230P010N688M654M041L599K740N03N38j412j166j521l504
2712D95249m992o519n023p668o052q983j1125r656j1100j1953j3328j3138j3772
2725C71940j6511j4651j6031j6551j8296j7777j7391j7739k0331j9850j9156k1081
2737A56575k0886k0630k0885k0382k2663k0110j9977k2537k0939k0458k1551k1482
2749i5925j9676k2256j9732j9126j8916j9199j8702j7281j9263j5885j6865j6427
$$ y = [-232356, -211467, -190454, -170027, -148829, -126250, -106510, -83812, -60925, -38111, -17273, 5749, 27853, 49231, 72151, 93179, 115463, 136391, 158147, 179179, 197903, 217924, 237531, 258400, 275811, 293501, 311315, 329454, 344277, 360144, 375005, 389158, 403177, 416115, 426731, 439555, 449320, 458476, 466849, 474079, 481089, 486777, 491431, 495472, 499071, 501811, 502314, 502852, 501440, 500274, 498753, 495249, 490257, 483738, 478715, 471047, 464995, 456012, 444887, 435231, 424131, 412178, 398850, 385712, 371940, 355429, 340778, 324747, 308196, 289900, 272123, 254732, 236993, 216662, 196812, 177656, 156575, 135689, 115059, 94174, 73792, 51129, 31019, 11042, -11495, -32434, -52892, -74443, -95925, -115601, -137857, -157589, -176715, -195631, -214830, -233532, -250813, -270076, -285961, -302826, -319253]
2761c19253j5442j4819j3502j3835j2754j2188j2023q301j1014q618p466p169
2773d56384n977n258m168m442k059k306k394P30O79K352J930M246L156O028N613
2788d58254P222R070P765R377J0877R191J3859J1892J3394J2865J5765J5383J5668
2801c05926J6521J5958J7821J5393K0167J8331J8917J9807J7652K1529J8885J9892
2813h5053K0638K0662J9848J9408K2201J9389K0711K0068J7886K1569J8341K0718
2825A56386J7615J9077J8541J7386J7725J6536J7179J3669J5498J5429J2646J4544
2837C52231J2924J2498J0422J0623R637Q478R377O268P138O002M884M653K936
2850D58071L183j2J737j04k083r23l993k360m686o419o610n679p551r906r212
$$ y = [-319253, -334695, -349514, -363016, -376851, -389605, -401793, -413816, -422117, -433131, -441749, -449215, -456384, -462361, -467619, -471787, -476229, -478288, -480594, -482988, -482258, -481579, -479227, -477297, -473051, -469895, -463867, -458254, -451032, -441962, -434197, -424820, -413943, -404752, -390893, -379001, -365607, -352742, -336977, -321594, -305926, -289405, -273447, -255626, -240233, -220066, -201735, -182818, -163011, -145359, -123830, -104945, -85053, -64415, -43753, -23905, -4497, 17704, 37093, 57804, 77872, 95758, 117327, 135668, 156386, 174001, 193078, 211619, 229005, 246730, 263266, 280445, 294114, 309612, 325041, 337687, 352231, 365155, 377653, 388075, 398698, 408335, 416813, 426190, 432458, 439596, 445598, 450482, 455135, 458071, 461254, 461242, 462979, 462875, 460792, 459869, 455876, 453516, 448830, 442411, 435801, 430122, 422571, 412665, 403453]
2865D03453r999r961j1052j3338j2251j4391j3331j2898j6494j6576j6154j5846
2877B41162j7724j7765j6846j8224j9854j7943j8243j9824j7813k0478k0755j7860
2889A7833k0709j8660j8502k0285j7968k1726j6930j9144j7947j8393j8571j6420
2901b07422j6446j6705j7060j5012j3352j6728j3676j1527j2532j3722j0826q216
2913c73224j2674q621p775q729o552o143n990m615k916m760K84j810k17L31J700
2928d41711K537K289N303K273O969N488P006Q995O730J0698Q716J1115R922J3107
2942c40563J1982J2145J5151J2577J4725J6984J5013J6625J6121J6211J7271J6956
2954a58802J9520J6737J7727J8473J9341J7374J9258J8746J7134K0509J8034J8207
$$ y = [403453, 393454, 383493, 372441, 359103, 346852, 332461, 319130, 306232, 289738, 273162, 257008, 241162, 223438, 205673, 188827, 170603, 150749, 132806, 114563, 94739, 76926, 56448, 35693, 17833, -2876, -21536, -40038, -60323, -78291, -100017, -116947, -136091, -154038, -172431, -191002, -207422, -223868, -240573, -257633, -272645, -285997, -302725, -316401, -327928, -340460, -354182, -365008, -373224, -385898, -394519, -402294, -411023, -417575, -423718, -429708, -434323, -437239, -441999, -441715, -443525, -443742, -443411, -441711, -439174, -436885, -431582, -429309, -422340, -416852, -409846, -400851, -394121, -383423, -374707, -363592, -353670, -340563, -328581, -316436, -301285, -288708, -273983, -256999, -241986, -225361, -209240, -193029, -175758, -158802, -139282, -122545, -104818, -86345, -67004, -49630, -30372, -11626, 5508, 26017, 44051, 62258]
2966F2258J7688K0222J7027J8333J8173J6030J7103J5814J7094J5373J5069J4436
2978B64620J5249J3243J3937J2066J0912J2613J0545Q554J1290P257P031Q742
2990C96059M391Q247L091N764K321K151K040N82J577j758k071j605l637l355m899
3005D08898n085o467o565p155r133o883j0957r659j1546j1548j2582j2755j3213
3018B85350j1731j4868j4433j5225j5226j6394j5811j8582j4315j8807j6461j7149
3030I6348j8433j6715j9538j6759j9672j6327j8098j7670j9198j7786j6457j8079
3042a18384j6126j6615j8190j3973j6394j4515j6052j4941j2814j5572j1753j1660
3054b96989j2137j1656j0884r602r162q270q695o134p554o385n195m343k348l761
$$ y = [62258, 79946, 100168, 117195, 135528, 153701, 169731, 186834, 202648, 219742, 235115, 250184, 264620, 279869, 293112, 307049, 319115, 330027, 342640, 353185, 361739, 373029, 380286, 387317, 396059, 400450, 408697, 411788, 417552, 419873, 422024, 424064, 424646, 426223, 424465, 422394, 420789, 417152, 413797, 408898, 403813, 397346, 390781, 383626, 374493, 367610, 356653, 346994, 335448, 323900, 311318, 298563, 285350, 273619, 258751, 244318, 229093, 213867, 197473, 181662, 163080, 148765, 129958, 113497, 96348, 77915, 61200, 41662, 24903, 5231, -11096, -29194, -46864, -66062, -83848, -100305, -118384, -134510, -151125, -169315, -183288, -199682, -214197, -230249, -245190, -258004, -273576, -285329, -296989, -309126, -320782, -331666, -341268, -350430, -358700, -367395, -373529, -381083, -387468, -392663, -397006, -399354, -403115]
3068d03115k605j547r15N64P69K214K001L039L151N438N392N564P566O817Q225
3083c57442Q137R288J1868Q777J1147J1580J2121J3835J2478J4529J2688J6464
3095b14530J4898J5212J4495J6946J6650J5761J7626J7116J5127J7915J7193J7390
3107a8201J8625J5711J8060J7049J6492J6380J7712J6013J4256J7654J3864J7340
3119A80955J4307J6036J2928J4416J2354J2297J4401R953J1652J0341J1492R372
3131C30504P933R225O128P769O340M800M430M288M397K011K142J367J71M77l022
3146C88960o59l010k800m093m740m230o396o168p689q467p833j0332r069j0479
3160C02995j0514j2641j1142j1813j3163j3218j3622j3604j5706j4689j5064j5252
$$ y = [-403115, -405720, -407267, -408182, -407618, -406849, -404635, -402634, -399595, -396444, -391006, -385614, -380050, -372484, -365667, -357442, -349305, -340017, -328149, -319372, -308225, -296645, -284524, -270689, -258211, -243682, -230994, -214530, -199632, -184420, -169925, -152979, -136329, -120568, -102942, -85826, -70699, -52784, -35591, -18201, 424, 16135, 34195, 51244, 67736, 84116, 101828, 117841, 132097, 149751, 163615, 180955, 195262, 211298, 224226, 238642, 250996, 263293, 277694, 287647, 299299, 309640, 321132, 330504, 338437, 347662, 353790, 361559, 367899, 372699, 377129, 381417, 385814, 387825, 389967, 391334, 391505, 391982, 388960, 388301, 385291, 382491, 378398, 373658, 369428, 363032, 356864, 349175, 340708, 332875, 322543, 313474, 302995, 292481, 279840, 268698, 256885, 243722, 230504, 216882, 203278, 187572, 172883, 157819, 142567]
3172A42567j6149j5463j5451j7753j5489j6291j7235j5361j7283j5381j6622j6473
3184e2384j7097j5340j5990j7441j4650j4960j5731j3364j5604j2168j5609j1691
3196b32029j2680j3142j1576j1112j0052r666j0057q050q455q051p358o087n222
3209c53537m673n128m262j746k518l288m56J85j49K208J707J106L862M756N430
3224c56503N022L884Q978O162P943Q649P442J0235J0844J0118R907J3041J0793
3237b43485J2600J2821J3183J5078J3313J4521J4122J5667J5921J4129J6364J4791
3249g0975J6929J5169J5570J6507J3944J6678J5459J5168J6409J4062J6396J5408
3261A16724J3714J5858J5252J1928J3810J4417J1587J3449J0559J2715J0947J0354
$$ y = [142567, 126418, 110955, 95504, 77751, 62262, 45971, 28736, 13375, -3908, -19289, -35911, -52384, -69481, -84821, -100811, -118252, -132902, -147862, -163593, -176957, -192561, -204729, -220338, -232029, -244709, -257851, -269427, -280539, -290591, -300257, -310314, -318364, -326819, -334870, -342228, -348315, -353537, -358210, -363338, -367600, -369346, -371864, -375152, -375608, -375423, -375572, -373364, -371657, -370551, -366689, -361933, -356503, -351481, -347597, -338619, -332457, -324514, -315865, -308423, -298188, -287344, -277226, -267319, -254278, -243485, -230885, -218064, -204881, -189803, -176490, -161969, -147847, -132180, -116259, -102130, -85766, -70975, -54046, -38877, -23307, -6800, 7144, 23822, 39281, 54449, 70858, 84920, 101316, 116724, 130438, 146296, 161548, 173476, 187286, 201703, 213290, 226739, 237298, 250013, 260960, 271314]
3273B71314J0855Q396R818P968P851P871O217N683M775M122N324K104L676J281
3287C57255K492m73Q71j423j403j147k585k447m369o250m177o098n937p480o212
3302C10617r368r433q774r469r909j1868r810j3038j1258j3337j1838j3439j4657
3315A64419j2738j4302j4060j4836j5150j4131j5052j4682j4651j6397j4408j4852
3327a0840j5569j6638j3944j5371j5102j2691j4923j2690j6705j2794j4408j1776
3339a83451j1842j3751j0731j2180r885j2455q464r820q777q067q857p253n603
3352c11136p989m320m278m737n031k406j794l400K62k190J383J058L89L521K119
3367c38549L215L105N767N036N026P470N924P565P989Q834R103J0354Q568J0108
$$ y = [271314, 282169, 290565, 300383, 308351, 316202, 324073, 330290, 335973, 340748, 344870, 350194, 352298, 355974, 357255, 359747, 359274, 360145, 358722, 357319, 356172, 353587, 351140, 346771, 340521, 336344, 330246, 324309, 316829, 310617, 301249, 291816, 283042, 273573, 263664, 251796, 241986, 228948, 217690, 204353, 192515, 179076, 164419, 151681, 137379, 123319, 108483, 93333, 79202, 64150, 49468, 34817, 18420, 4012, -10840, -26409, -43047, -56991, -72362, -87464, -100155, -115078, -127768, -144473, -157267, -171675, -183451, -195293, -209044, -219775, -231955, -241840, -254295, -262759, -272579, -281356, -289423, -298280, -305533, -311136, -319125, -323445, -327723, -332460, -337491, -339897, -341691, -345091, -344829, -347019, -345636, -344578, -344189, -340668, -338549, -335334, -332229, -326462, -321426, -316400, -308930, -303006, -295441, -287452, -278618, -269515, -259161, -250593, -240485]
3381b40485J2476J0356J1901J2296J3074J2053J3353J4140J1648J5376J3572J3434
3393h6806J6465J2725J4699J4221J4347J5497J3555J5408J4382J4808J3485J5150
3405H7936J3710J3210J4288J1161J4266J2488J2952J1713J1766J0342J0878J1196
3417B35906R451J0461Q284O780J0410O625P700M916N387O074M389L759K541L718
3431C26401K289J772J035M86k14j865r24l404j400m088m252m198m341n733n906
3446B95658o268o571r807q405q490q303j0438j0163j1044j1137j0299j2540j2080
3459A70113j1632j3915j1109j3889j2348j3483j5159j3514j4130j2745j4704j3063
3471A0422j4287j4949j3132j3065j4682j3862j3629j3689j3019j2972j3201j1505
$$ y = [-240485, -228009, -217653, -205752, -193456, -180382, -168329, -154976, -140836, -129188, -113812, -100240, -86806, -70341, -57616, -42917, -28696, -14349, 1148, 14703, 30111, 44493, 59301, 72786, 87936, 101646, 114856, 129144, 140305, 154571, 167059, 180011, 191724, 203490, 213832, 224710, 235906, 245357, 255818, 264102, 270882, 281292, 287917, 295617, 300533, 305920, 311994, 316383, 320142, 322683, 326401, 328690, 330462, 331497, 331983, 331769, 329904, 328980, 325576, 324176, 320088, 315836, 311638, 307297, 301564, 295658, 289390, 282819, 273012, 264607, 256117, 247814, 237376, 227213, 216169, 205032, 194733, 182193, 170113, 158481, 144566, 133457, 119568, 107220, 93737, 78578, 65064, 50934, 38189, 23485, 10422, -3865, -18814, -31946, -45011, -59693, -73555, -87184, -100873, -113892, -126864, -140065, -151570]
3483a51570j1671j2790r700j2361j0216j1194r222r516q305r105q657o519q882
3496b79708m421n926n591m411n836k594l854j489k721j196j57K78m09J175J494
3511c15366J856L241L350K302N803M882N555O739O764P225P294Q650P387J0081
3525b34237J0001R407R573J0937J2259J0818J1341J1137J2264J4164J1191J2912
3537i8233J2032J4272J3604J2580J4243J2442J4269J1901J4380J3655J2161J4048
3549F1354J1869J4005J1829J3281J1779J3095J1848J0377J2772R381J1917Q255
3561B01762R536R839R306Q730Q224P454P650N903P175N251M365M312L814L814
3575B97135K417K526J486J136M18P23j940k81j970k290j894l835m292l844n337
$$ y = [-151570, -163241, -176031, -185731, -198092, -208308, -219502, -228724, -238240, -246545, -255650, -264307, -270826, -279708, -284129, -290055, -295646, -300057, -305893, -308487, -312341, -313830, -316551, -317747, -317904, -317626, -318035, -316860, -315366, -313510, -310269, -306919, -304617, -298814, -293932, -288377, -281638, -274874, -267649, -260355, -251705, -244318, -234237, -224236, -214829, -205256, -194319, -182060, -171242, -159901, -148764, -136500, -122336, -111145, -98233, -86201, -71929, -58325, -45745, -31502, -19060, -4791, 7110, 21490, 35145, 47306, 61354, 73223, 87228, 99057, 112338, 124117, 137212, 149060, 159437, 172209, 181590, 193507, 201762, 211298, 221137, 230443, 239173, 247397, 254851, 262501, 268404, 275579, 280830, 285195, 289507, 293321, 297135, 299552, 302078, 303564, 304700, 305118, 305841, 303901, 303620, 301650, 299360, 297466, 293631, 289339, 285495, 280158]
3590B80158m757o466o859o345p946o740j0348q033r818r792r677r774j0753j2179
3604A60671r661j2525j1300j0594j4427j0605j2409j4153j2885j0962j3199j2161
3616A5790j2592j4947j0675j3728j4068j1706j2380j3067j1882j1654j1349j2325
3628a34583j0040j3280q982j1255q134j0659r860p497r972p228q185o660p346
3641b53681n360o192n443l323n658k762m079l014j046k913Q91j26r66J451P58
3656b91463J764J729M088L684K369M749N704N671L916Q212N923P224Q460P543
3670b20427Q886Q579Q031J2136Q931J0733Q763J3364J0033J2273J0207J2536J1758
3683h4197J1457J2176J3288J1614J3039J2432J1818J1834J3358J2045J2535J0705
$$ y = [280158, 275401, 268935, 262076, 255731, 247785, 241045, 230697, 222664, 212846, 203054, 193377, 183603, 172850, 160671, 151010, 138485, 127185, 116591, 102164, 91559, 79150, 64997, 52112, 41150, 27951, 15790, 3198, -11749, -22424, -36152, -50220, -61926, -74306, -87373, -99255, -110909, -122258, -134583, -144623, -157903, -166885, -178140, -186274, -196933, -206793, -214290, -224262, -231490, -239675, -246335, -253681, -259041, -265233, -270676, -273999, -279657, -282419, -286498, -289512, -290558, -293471, -292580, -292706, -293672, -292221, -291463, -289699, -287970, -283882, -280198, -277829, -273080, -267376, -261705, -257789, -249577, -243654, -236430, -227970, -220427, -211541, -202962, -194931, -182795, -173864, -163131, -154368, -141004, -130971, -118698, -108491, -95955, -84197, -72740, -60564, -47276, -35662, -22623, -10191, 1627, 13461, 26819, 38864, 51399, 62104]
3695F2104J2883J1954J1201J2136R859J2379J0389J0474J0491R297R931Q061R605
3708B00764O982Q693R204N899Q185M293O322O289L357M899L145N086J669J958
3722B76745L727K93J235j066j99O09j532k595k649k082l971l380m581n221m656
3737B50677o485o820n388o264r435o799q943q972p754r229r840j0407j0497r364
3751A34480j1937j0751j0344j2725j0623j0865j2794j1592j1377j2912j1539j1831
3763d810j1853j0780j3019j1577j1517j1181j1538j0802j1047j1361j0211j0390
3775a40086r700r053j0048r875q031q232p150o870q738o506n490o562n239m295
3789b45875o088l750l390l124k488j952j355p12j009j330J414p7K681P58L076
$$ y = [62104, 74987, 86941, 98142, 110278, 120137, 132516, 142905, 153379, 163870, 173167, 183098, 191159, 200764, 207746, 216439, 225643, 231542, 239727, 244020, 250342, 256631, 259988, 264887, 268032, 273118, 274787, 276745, 280472, 280765, 282000, 280934, 280735, 281344, 279812, 277217, 274568, 272486, 268515, 265135, 260554, 255333, 250677, 244192, 237372, 231984, 225720, 216285, 209486, 200543, 191571, 183817, 174588, 164748, 154341, 143844, 134480, 122543, 111792, 101448, 88723, 78100, 67235, 54441, 42849, 31472, 18560, 7021, -4810, -16663, -27443, -40462, -52039, -63556, -74737, -86275, -97077, -108124, -119485, -129696, -140086, -149786, -158839, -168887, -178762, -186793, -195025, -202175, -209045, -217783, -224289, -229779, -236341, -241580, -245875, -251963, -255713, -259103, -262227, -264715, -266667, -268022, -268734, -269743, -271073, -269659, -269736, -267055, -266297, -263221]
3804b63221K727K909M237O009L515N158M435P109O182Q527O065Q142P814P944
3818a82448Q821Q744J0283R130J0326R693J0730J0171J0411J1249J0312J1550
3830f1028J1786J0249J1399J2663J1225J1041J2297J0361J0772J3613Q461J1029
3842G3868J1771J0214J1621Q946R752R807R139J0227Q550R784P210P140R236O724
3856B03989N963O642O473N585N210N118L770L613K897M044J097K639J392O40L67
3871B59439J91N16l222j9k748k240k737l756l399m805m546m540n716o827o286
3886B09305n721p993p104q171q196o601j0962p436j0779p669j0740j1193q096
3899I8644j0962q967j2139j0555j1740j1011j0002j1625r809j1420j0687j1463
$$ y = [-263221, -260494, -257585, -253348, -247339, -243824, -238666, -234231, -227122, -220940, -212413, -206348, -198206, -190392, -182448, -173627, -164883, -154600, -145470, -135144, -125451, -114721, -104550, -94139, -82890, -72578, -61028, -49242, -38993, -27594, -14931, -3706, 7335, 19632, 29993, 40765, 54378, 62839, 73868, 85639, 95853, 107474, 116420, 126172, 135979, 145118, 155345, 163895, 173679, 180889, 188029, 197265, 203989, 209952, 216594, 223067, 228652, 233862, 238980, 242750, 246363, 249260, 253304, 254401, 257040, 258432, 259072, 259439, 259630, 260146, 256924, 256905, 254157, 251917, 249180, 245424, 242025, 237220, 232674, 228134, 222418, 215591, 209305, 203584, 195591, 188487, 180316, 172120, 165519, 154557, 147121, 136342, 128673, 117933, 106740, 98644, 87682, 78715, 66576, 56021, 44281, 33270, 23268, 11643, 1834, -9586, -20273, -31736]
3911c1736j1487r939j0449j0368r871j0304r322j0935q952r760r347r704p337
3924a59511q426r005o412o841p221o682o229n015o861k411n934l886l327k579
3938b40340l577k179p15k468q55N29M71L33J902J449J238K392L070L286M858K719
3954b27887O089N520M228O971N359P382M000J0622N437Q268Q531P708J0453P577
3968a29742R879R598R147J0487Q351J0547J0139J0931J0053J1700R401J0768J0018
3981A277J0261J1414J0551R961J0367R676J0792R549R521R797R687J0526O740
3994A30119J0755O048Q764P812N248Q641O237Q920M350N457O077M929L540O133
4008B23030L104K385L869J268K130P53J969J065j057P45l47k993L71l270l199
$$ y = [-31736, -43223, -53162, -63611, -73979, -83850, -94154, -103476, -114411, -123363, -133123, -142470, -152174, -159511, -167937, -176942, -183354, -190195, -197416, -204098, -210327, -215342, -222203, -224614, -230548, -234434, -237761, -240340, -243917, -246096, -246811, -249279, -250134, -249605, -249134, -248801, -246899, -245450, -244212, -241820, -238750, -235464, -230606, -227887, -221798, -216278, -212050, -205079, -199720, -192338, -188338, -177716, -172279, -164011, -155480, -147772, -137319, -129742, -119863, -110265, -101118, -90631, -82280, -71733, -61594, -50663, -40610, -28910, -19509, -8741, 1277, 11538, 22952, 33503, 43464, 53831, 63507, 74299, 83848, 93369, 103166, 112853, 123379, 130119, 140874, 146922, 155686, 163498, 168746, 177387, 183624, 192544, 196894, 202351, 208428, 213357, 216897, 223030, 226134, 228519, 232388, 233656, 235786, 236539, 238508, 239573, 238516, 239261, 238914, 235921, 236292, 233022, 229823]
4023B29823k473k985l363m268l736o074n976l714p190o196o242o322p654p888
4037A55742r306p520q475q003q951j0997q060q382j0440r473j0468q811j0797
4050C6059j0163r305j0423j0046j0328q313j1806j0685q957r783j0295j0482q291
4063i2818r085q364q144q470r112p739p275p362o748o947p848n138m990o430m864
4078b01334m980m431m464j722k583l422l717m26m90j536m70m48Q48R07J097J428
4094b25743K094J789L703L574L219L383O379L808O332L688O465O576O398O353
4108a61982P630P385P393Q202R551P398Q271P953J0390Q181R922R202Q250J0792
4122d1462Q966J1421Q941Q510J1811P638J0869R087R395R005R025J0091Q861J0177
$$ y = [229823, 227350, 224365, 221002, 216734, 212998, 206924, 200948, 197234, 190044, 183848, 177606, 171284, 163630, 155742, 146436, 138916, 130441, 122438, 113487, 102490, 94430, 86048, 75608, 66135, 55667, 46856, 36059, 25896, 16591, 6168, -3878, -14206, -22519, -34325, -45010, -53967, -63750, -74045, -84527, -92818, -101903, -110267, -118411, -126881, -135993, -143732, -151007, -158369, -165117, -172064, -179912, -185050, -190040, -196470, -201334, -206314, -210745, -215209, -216931, -219514, -222936, -226653, -227079, -227569, -229105, -229575, -230023, -229175, -228268, -227171, -225743, -223649, -221860, -218157, -214583, -211364, -207981, -201602, -197794, -191462, -187774, -181309, -174733, -168335, -161982, -154352, -146967, -139574, -131372, -121821, -114423, -106152, -98199, -87809, -79628, -69706, -60504, -52254, -41462, -32496, -21075, -12134, -3624, 8187, 15825, 26694, 35781, 45176, 54181, 63206, 73297, 82158, 92335]
4136I2335P700Q532Q243Q442P952N920Q798O442O998O934O004M470N460M936N600
4151A94766M405L561K785M550J278L886J805J050K019o78J175pM56j934j363j210
4167B16544k911j433l339k589l708l841m519m807m837n854n968o220o757o009
4181A53752p585o442q318p666p877q780o433r740p651r920p506j0183r635q272
4195C7744r381q932j0334q528j1239p282r047r470q787q924j0095q193q874p628
4209h8970j0214o081q200q506n831q282p223o153m755q727o177m158n747l470
4223a82494n252n194k010m037k555j025l541k798p34j483j978J771q18P54J181
4238b10213M05L053O81L575K317L270L232M136M423M207N853M853N954O130O268
$$ y = [92335, 100035, 108567, 116810, 125252, 133204, 139124, 147922, 154364, 161362, 168296, 174300, 178770, 184230, 189166, 194766, 199171, 202732, 205517, 210067, 211345, 215231, 217036, 218086, 220105, 219427, 220602, 220595, 221051, 219117, 217754, 216544, 213633, 212200, 208861, 206272, 202564, 198723, 194204, 189397, 184560, 178706, 172738, 166518, 159761, 153752, 146167, 139725, 131407, 123741, 115864, 107084, 100651, 90911, 83260, 73340, 65834, 55651, 46016, 37744, 28363, 19431, 9097, 569, -10670, -17952, -26999, -36469, -45256, -54180, -64275, -72468, -81342, -88970, -99184, -105265, -113465, -121971, -127802, -136084, -143307, -149460, -154215, -162942, -169119, -173277, -179024, -182494, -187746, -192940, -194950, -198987, -201542, -202567, -206108, -208906, -209640, -211123, -213101, -211330, -212148, -211394, -210213, -209808, -206755, -206074, -202499, -200182, -196912, -193680, -189544, -185121, -180914, -175061, -170208, -164254, -158124, -151856]
4253a51856O240P808O041P123Q956N655Q069Q105Q413P816Q372R571Q458Q298
4267d2931Q911Q475J0159P947R667P884R348R546P591R339P415Q517R172Q685
4281G9725Q639P537P784O301Q734O011P528P583N374O913O008M401N539M407N952
4296A78436K125N484K652K466M481J228K417P38K784N5J908j527l2m66j887n28
4312B00334j608j415k938l996l191k924k944n256n325l777n987l768o883n743
4326A44579o170o940m618r208n310q497p120q019j0190o796q228p700r406o956
4340C9421q832r237q130r921q162p569p858r573q001q511r077q172p311p958p327
4355h6218q695p120p169o237o638p145n239p278n439n199m400n646m444l737m447
$$ y = [-151856, -145616, -137808, -131767, -124644, -115688, -110033, -101964, -93859, -85446, -77630, -69258, -59687, -51229, -42931, -34020, -25545, -15386, -7439, 2228, 10112, 19460, 29006, 36597, 45936, 53351, 61868, 71040, 79725, 88364, 95901, 103685, 109986, 118720, 124731, 132259, 139842, 145216, 152129, 158137, 162538, 168077, 172484, 178436, 180561, 186045, 188697, 191163, 195644, 196872, 199289, 200027, 202811, 202866, 204774, 203247, 203215, 202749, 200862, 200334, 198726, 197311, 194373, 190377, 187186, 184262, 181318, 176062, 170737, 166960, 160973, 157205, 150322, 144579, 138409, 131469, 126851, 117643, 112333, 103836, 96716, 88697, 78507, 71711, 63483, 55783, 46377, 39421, 30589, 21352, 13222, 3301, -4861, -12430, -20288, -29861, -37862, -46373, -55450, -63622, -70933, -78891, -86218, -94913, -102033, -109202, -115439, -122077, -129222, -134461, -141739, -147178, -152377, -156777, -162423, -166867, -170604, -175051]
4370a75051m051k829l350k396j484j316l140n2j611K01p87J457J090k50J716K029
4386a89824J224L490K320M246Q33M909M286N735L897M069O953M752O432N532P453
4401a23693N842O109O982O652Q256O626P215Q793P267R716P519P800P307R226
4415a8383Q191P876Q094P199R389Q142P657P779Q573P527P656P991O161P969Q046
4430I9867N516P633M797P618O275O043M263M761N462M977M767K278M718M091J406
4445A74472L316K145J824K085K000J445p12K060l66m97j508j254o53k957m81l995
4461A76924l162j675m352l005m722l637n278m477m769o219o675m493o117o338
4475A12005p256n728q117p357o159p498o767q473n610j0066q353o623p628q142
$$ y = [-175051, -179102, -181931, -185281, -187677, -189161, -190477, -193617, -193669, -195280, -195079, -195866, -194409, -193319, -193569, -191853, -189824, -188600, -185110, -182790, -178544, -177711, -172802, -168516, -162781, -158884, -154815, -147862, -143110, -136678, -131146, -123693, -117851, -111742, -104760, -98108, -89852, -83226, -76011, -67218, -59951, -50235, -42716, -34916, -27609, -18383, -10192, -2316, 5778, 12977, 22366, 30508, 38165, 45944, 54517, 62044, 69700, 77691, 83852, 91821, 99867, 105383, 113016, 117813, 125431, 131706, 137749, 142012, 146773, 152235, 157212, 161979, 164257, 168975, 173066, 174472, 177788, 179933, 181757, 183842, 185842, 187287, 186575, 188635, 188269, 187772, 186264, 185010, 184357, 181400, 180919, 176924, 173762, 172087, 167735, 164730, 160008, 156371, 151093, 146616, 141847, 135628, 128953, 124460, 118343, 112005, 104749, 99021, 90904, 83547, 77388, 69890, 63123, 54650, 49040, 38974, 30621, 23998, 16370, 8228]
4489H228q860o090q670q057p701p205p950p986q145o454p445o394p355m920r477
4504a04481l624q402n279m690n952n136n555l846n097k689m375m965j273m552
4518a69916n93l720j627j084q89j704q3n1j12q36K467L32J030R69L435K484J682
4535a68216L795J953N622K928N263K590O851M868M109N718O865O170O048N119
4549a00317Q672N107P679O823P033P329O418P196P544Q500P706O987P783P693
4563B153P751O497R460N397Q171P005O724P651O785P666O210O532O484N973O150
4578A06609O351N972M580M624N713L630N601L459M371M329K134K884M115J086
4592A65458J887K503J357m43J744J39K734l252N65j131j811j001k605j701k738
$$ y = [8228, -632, -6722, -15392, -23449, -31150, -38355, -46305, -54291, -62436, -68890, -76335, -82729, -90084, -95004, -104481, -108105, -116507, -121786, -126476, -132428, -137564, -143119, -146965, -152062, -154751, -159126, -164091, -165364, -169916, -170509, -174229, -175856, -176940, -177829, -179533, -179616, -179667, -179779, -180615, -178148, -177816, -176786, -175817, -172382, -169898, -168216, -164421, -162468, -156846, -153918, -148655, -146065, -139214, -134346, -130237, -124519, -117654, -111484, -105436, -100317, -91645, -86538, -78859, -72036, -65003, -57674, -51256, -44060, -36516, -28016, -20310, -13323, -5540, 2153, 9904, 16401, 25861, 31258, 39429, 46434, 53158, 60809, 67594, 75260, 81470, 88002, 94486, 100459, 106609, 112960, 118932, 123512, 128136, 133849, 137479, 143080, 146539, 150910, 155239, 157373, 160257, 164372, 165458, 167345, 169848, 171205, 170762, 172506, 172645, 175379, 172127, 172692, 171561, 169750, 168749, 166144, 164443, 161705]
4607A61705j935k281m578k411m940k154p002l162m640n544m499o859m901o546
4621A00253n123p048o111o640p064p097p040o095p136q233o354r337n110p752
4635D113q041o476p300p343q369o273o577p181o255p096n226q204n343p013o916
4650i9500m482o675l603p264l641m150n091l333m176k761m215l762k203l147K81
4665a57722l887k214o88j04j035n52J255j928J542O82N25K217J933J807K296L870
4681a52003J605M012L909K776M946L664N276M391L940N105M534P363N626N801
4695h9055N915P042O311O477O827N365Q480N954O290P836M988Q195P838N550P854
4710A1867P321O455N173Q853O013P176O569O371O536N765N822O299O788L789N583
$$ y = [161705, 159770, 157489, 152911, 150500, 145560, 143406, 136404, 133242, 128602, 123058, 118559, 111700, 106799, 100253, 95130, 88082, 81971, 75331, 68267, 61170, 54130, 48035, 40899, 32666, 26312, 16975, 11865, 4113, -3928, -10404, -17704, -25047, -33416, -39689, -46266, -53447, -59702, -66798, -72024, -80228, -85571, -92584, -99500, -103982, -110657, -114260, -121524, -125165, -129315, -134406, -137739, -141915, -144676, -148891, -152653, -154856, -158003, -157722, -161609, -163823, -164511, -164615, -165650, -166202, -164947, -166875, -165333, -164651, -164126, -161909, -159976, -158169, -155873, -152003, -150398, -146386, -142477, -139701, -134755, -131091, -125815, -121424, -117484, -112379, -107845, -100482, -94856, -89055, -83140, -76098, -69787, -63310, -56483, -51118, -42638, -36684, -30394, -22558, -17570, -9375, -1537, 4013, 11867, 19188, 25643, 30816, 39669, 45682, 52858, 59427, 65798, 72334, 78099, 83921, 90220, 97008, 100797, 106380]
4725A06380N613L473N781L845M522M904L025K895K286M109K539L278J473n0K905
4740A56978J567J191j398P26K85j477J553k309n87j934k364k99k292k919m006
4755A42715j507n105k229m276o026j791o446m562m415o780m539n224n054n717
4769G9044n711o530p137n386p849m811r029m582q289n795o893o691n913p882o007
4784a9461q217n281o134p353n846n990o253m960o861o578o303m134n002n526l944
4799a07843o641k864n042k579m225l865j990l589k658l151j634p92l358K03k264
4814a52292q0k68p79k77q1J319O13J969J006J584L224R09M857O35M164L419K807
4831a27271M626K875N490K709O027M285M534P765L937N280O124N419N930O122
$$ y = [106380, 111993, 115466, 121247, 125092, 129614, 134518, 137543, 140438, 142724, 146833, 149372, 152650, 154123, 154073, 156978, 158545, 159736, 158338, 159064, 159349, 157872, 159425, 157116, 156529, 154595, 152231, 151932, 149640, 146721, 142715, 141208, 136103, 133874, 129598, 123572, 121781, 115335, 110773, 106358, 99578, 95039, 89815, 84761, 79044, 73333, 66803, 59666, 54280, 46431, 41620, 32591, 28009, 19720, 13925, 7032, 341, -5572, -13454, -19461, -27678, -32959, -39093, -46446, -52292, -58282, -64535, -69495, -76356, -82934, -89237, -93371, -98373, -103899, -107843, -114484, -117348, -122390, -124969, -129194, -133059, -135049, -138638, -141296, -144447, -146081, -146873, -150231, -150028, -152292, -152372, -152640, -153419, -153696, -153777, -152458, -151845, -149876, -148870, -147286, -144062, -143153, -138296, -137661, -133497, -130078, -127271, -122645, -119770, -114280, -111571, -105544, -101259, -96725, -88960, -85023, -79743, -73619, -68200, -62270, -56148]
4845e6148O351N444P643M982P375O668N390O978O630O440N629P368N729O185P053
4860C9717N450O690N219P067M640N872P121K635P007L616N832M305M908L731M402
4875A18212K474L354L726K822M829J983J212K906K14K029P26J234J057J79R26
4890A47883k67j479p28j006p14j552r93j833m334j127m012k303l174l580l922
4905A16859k434m975m893l477n237m289p618l722m255p370m008n821n457o211
4919D7092o956n483o554n707o556n864o477n710o658p901m118o839o004n938o026
4934d5699m998o346m854n986n322m552o108m738n911l659m763l174n607j646m446
4949a17809k450k615l768j938k534l282j086k235p47r73k264J56j002J349K81
$$ y = [-56148, -49797, -44353, -36710, -31728, -24353, -17685, -12295, -5317, 1313, 7753, 13382, 20750, 26479, 32664, 39717, 45167, 51857, 57076, 64143, 68783, 74655, 81776, 84411, 91418, 95034, 100866, 105171, 110079, 113810, 118212, 120686, 124040, 127766, 130588, 135417, 137400, 138612, 141518, 141732, 143761, 144487, 145721, 146778, 146957, 147883, 147616, 146137, 145409, 144403, 143689, 142137, 141144, 139311, 134977, 133850, 129838, 127535, 124361, 120781, 116859, 114425, 109450, 104557, 101080, 95843, 91554, 83936, 80214, 75959, 68589, 64581, 58760, 53303, 47092, 40136, 34653, 28099, 22392, 15836, 9972, 3495, -2215, -8873, -16774, -20892, -27731, -33735, -39673, -45699, -50697, -57043, -61897, -67883, -73205, -77757, -83865, -88603, -94514, -98173, -102936, -106110, -111717, -113363, -117809, -120259, -122874, -126642, -128580, -131114, -134396, -135482, -137717, -138464, -139437, -141701, -141545, -142547, -141198, -140917]
4964a40917M97l08J050K093N91K037K524J690K688J755M146K463M356L269N216
4979a06850L248L859L417M925N133N157M019O481L891O543O413N504N140N706
4993c7414O228N412O622N355O564N540N754O660M699O241N100P698M379M756O999
5008E0593M202O969O633L536M084N661M933L914N206K724N916K099L280L687L290
5023A16727L288K146K662J857J373K751R55J941M19N95R83K21R05j577J12k434
5039A32924R69j074j244k914k443j286l352j901l105l862k247m236k883m619m015
5054I4712m003m748l888n344m171n550m779n058n001o349o504l826o906n922l760
5069A8903o527m271o366o609n096n997o359o574m559n840m315n955n340l423n967
$$ y = [-140917, -140420, -140728, -139678, -137585, -136994, -134957, -132433, -130743, -128055, -126300, -122154, -119691, -115335, -112066, -106850, -103602, -99743, -96326, -91401, -86268, -81111, -77092, -70611, -66720, -60177, -53764, -48260, -43120, -37414, -31186, -25774, -19152, -13797, -7233, -1693, 4061, 10721, 15420, 21661, 26761, 34459, 38838, 43594, 50593, 54795, 61764, 68397, 71933, 76017, 81678, 86611, 90525, 95731, 98455, 104371, 106470, 109750, 113437, 116727, 120015, 122161, 124823, 126680, 128053, 130804, 131759, 133700, 134119, 134714, 135697, 135918, 136823, 135246, 135358, 132924, 133893, 132819, 131575, 128661, 126218, 124932, 121580, 119679, 116574, 112712, 110465, 106229, 103346, 98727, 94712, 90709, 85961, 82073, 76729, 72558, 67008, 62229, 57171, 52170, 45821, 39317, 35491, 28585, 22663, 18903, 12376, 8105, 1739, -4870, -9966, -15963, -22322, -28896, -33455, -39295, -43610, -49565, -54905, -58328, -64295]
5084f4295n349n219m202n262l906k653n802l891k567l131l562l193l451j844j721
5099a20048j453l377j102j796q09r03r45n6J35j36M1Q79K38O56J364J870K438
5116a23004Q53L393K131L161K785K256L023K412N403K511M986M043L026N489L870
5131g3662O680L767M883N260M841M107M579P745M503N802P190L423M855P111N972
5146G056M119N634N526N358O422L072O917M013N610M961M393M958M759L782M845
5161H1425L822M146L621L292M176L679J363L768K663R31L690J517J785J816L76
5176A22070K335P95m60O53J377j327n76M58j487l27k274r59l569j262p21l104
5192A11622j624l170k782k760n184j969m189m074m599l481m280n099k917n032
$$ y = [-64295, -69644, -74863, -79065, -84327, -88233, -90886, -96688, -100579, -103146, -106277, -109839, -113032, -116483, -118327, -120048, -121501, -124878, -125980, -127776, -128585, -129488, -130433, -130489, -130354, -130490, -130449, -129570, -129332, -128676, -127312, -125442, -123004, -122151, -118758, -116627, -113466, -110681, -108425, -105402, -102990, -97587, -95076, -90090, -86047, -83021, -77532, -73662, -66982, -63215, -58332, -53072, -48231, -44124, -39545, -31800, -27297, -21495, -14305, -10882, -6027, 1084, 7056, 11175, 16809, 22335, 27693, 34115, 37187, 44104, 48117, 53727, 58688, 63081, 68039, 72798, 76580, 81425, 85247, 89393, 93014, 96306, 100482, 104161, 105524, 109292, 111955, 112886, 116576, 118093, 119878, 121694, 122070, 124405, 125200, 124740, 125393, 126770, 125443, 124867, 125325, 123838, 123511, 121237, 120278, 116709, 115447, 114726, 111622, 109998, 106828, 104046, 101286, 96102, 94133, 89944, 85870, 81271, 77790, 73510, 68411, 65494, 60462]
5206F0462n303m682n776l832p151l310n546n204m893n820m544o755l731o872m513
5221a7470m986n215n200m751n131n880m407l784n251m062n441l176n049l580k977
5236h6360k916l592m002l123k779k579k558j956k450l167j214o35o62M41k893
5251a20445J524j982O27m13K23O90J287K498q60K179J425K513J662K453L193K23
5267a03203N165J918K814M633J756N655K973M744L883L829M756M274O961K235
5281d7607N472M010M931O456L908N401M496N773N182N355M765M349N237N368M770
5296B7866N124O119M192L139O253L222M347L991M080N125J559L572N028L543L904
5311I1064J856L765L165K358J788J611K384J235J848J942P42Q31J080K45n07N84
$$ y = [60462, 55159, 50477, 44701, 40869, 33718, 30408, 24862, 19658, 14765, 8945, 4401, -2354, -6085, -12957, -17470, -22456, -27671, -32871, -37622, -42753, -48633, -53040, -56824, -62075, -66137, -71578, -74754, -79803, -83383, -86360, -89276, -92868, -96870, -99993, -102772, -105351, -107909, -109865, -112315, -115482, -116696, -117331, -117993, -117552, -120445, -118921, -120903, -120276, -120689, -120466, -119776, -118489, -115991, -116851, -114672, -113247, -110734, -109072, -106619, -103426, -103203, -98038, -96120, -93306, -88673, -86917, -81262, -78289, -73545, -69662, -65833, -61077, -56803, -49842, -47607, -42135, -38125, -33194, -26738, -22830, -17429, -12933, -7160, -1978, 3377, 8142, 12491, 17728, 23096, 27866, 32990, 39109, 43301, 46440, 52693, 55915, 60262, 64253, 68333, 73458, 75017, 78589, 83617, 87160, 91064, 92920, 96685, 99850, 102208, 103996, 105607, 107991, 109226, 111074, 113016, 113758, 114589, 115669, 115914, 115407, 115991]
5327A15991q96q98L70r72l13k433m82k108j217j478m439j202m127n74m143k910
5343H8169k986l830l831n340k255m545l441l775m516m677n337m307m563l360m700
5358B6706o376l701n504m228o487m440m604n524l648m926m900m605m507m355n671
5373d6770l603n723l342l410l668m779l810l288l348k557l402l059k781k136j161
5388i6837l733j614p29k441j260o78j777m38k203J59o37L43n6J319J55J015K102
5405a07310Q1K290J204K788K67L170J947K197K611L914K332M358K751N031K382
5420f9987L132M131L916M998L079M142M065O501L189M754M786M586N192L642N253
5435d621L333M772N868M698N153L744M385M647N093L875L474N770K768M259L988
$$ y = [115991, 115095, 114197, 114567, 113595, 113282, 110849, 110367, 108259, 107042, 105564, 101125, 99923, 95796, 95222, 91079, 88169, 85183, 81353, 77522, 72182, 69927, 65382, 61941, 58166, 53650, 48973, 43636, 39329, 34766, 31406, 26706, 20330, 16629, 11125, 6897, 410, -4030, -8634, -14158, -17806, -22732, -27632, -32237, -36744, -41099, -46770, -50373, -56096, -59438, -62848, -66516, -71295, -75105, -78393, -81741, -84298, -87700, -90759, -93540, -95676, -96837, -100570, -102184, -102913, -105354, -106614, -107292, -109069, -109507, -111710, -111551, -112188, -111845, -111901, -110582, -110427, -109412, -107310, -107229, -104939, -103735, -100947, -100680, -97510, -95563, -93366, -90755, -86841, -84509, -80151, -77400, -72369, -69987, -66855, -62724, -58808, -53810, -50731, -46589, -42524, -36023, -32834, -28080, -23294, -18708, -13516, -9874, -4621, -1288, 3484, 9352, 14050, 19203, 22947, 27332, 31979, 37072, 40947, 44421, 50191, 52959, 57218, 61206]
5450F1206L978L420L476L717L307K317L322K633M522O68L434R81J316K258R41
5465A01496J964N23J424J451p38P90o45K33O12o1p14j690j267q88j132k096j134
5482I8128k069j954l016j718l471l509q11n550k552k415n873j894n685j536m794
5497E1281l854l346o052k160p040k139n021l810n190m172m709n849k312n564n233
5512a5170l346m674m258m977l191n053m531k389n142l034m306l411m039l509j752
5527g2782n494j136j416l984k257l514j081j867r27k927j702J51k208j53j298
5542a02595M43q43o16O51m78J412l00P06R95L406O61J677K314O28L043Q03L174
5559h4919L276K761J290M106L529L324L530L317M064L378L743M359L463L989M668
$$ y = [61206, 65184, 68604, 72080, 75797, 79104, 81421, 84743, 87376, 91898, 92566, 96000, 96981, 98297, 100555, 101496, 103460, 103983, 105407, 106858, 106120, 106910, 106265, 106498, 107110, 107049, 106335, 104645, 103378, 102490, 101358, 99262, 98128, 96059, 94105, 91089, 89371, 85900, 82391, 81580, 76030, 73478, 71063, 65190, 63296, 57611, 56075, 51281, 47427, 44081, 38029, 35869, 28829, 26690, 21669, 17859, 12669, 8497, 3788, -2061, -4373, -9937, -15170, -18516, -23190, -27448, -32425, -35616, -40669, -45200, -47589, -52731, -55765, -60071, -63482, -67521, -71030, -72782, -78276, -79412, -80828, -84812, -87069, -90583, -91664, -93531, -94458, -97385, -99087, -98936, -101144, -101297, -102595, -102152, -102995, -103611, -102960, -103438, -102026, -102326, -101620, -100625, -97219, -96558, -94881, -92567, -91939, -88896, -88093, -84919, -81643, -78882, -77592, -73486, -69957, -66633, -63103, -59786, -55722, -52344, -48601, -44242, -40779, -36790, -32122]
5574c2122L027M963M839L705M311M375M796L826N407K699M993M327M159M414L027
5589C0746L209N304K644O194L148M870K607L328L689K856K931J823K983L399L184
5604H2915J144K662J257J864K959J10K775p80J867N20m11J628J08J75N97r01J38
5621I8627k073l29j548Rk854j158j609k399J33n089p07k543l686k334l191l771
5637F5478k219l856j609n096l146m623k790l813l524m615m865k730l888l060n489
5652A0155m394l773o067k924l752m341l276n822k455m811m339l251m469k735l586
5667d9840l376l547k407m458k661k968k326k304l473n73k401m764p25q82r63k941
5683i0609n0j150k448K060k482K66p11P78k71O79p4MK097M9K465m6K508K013m35
$$ y = [-32122, -29095, -24132, -19293, -15588, -11277, -6902, -2106, 1720, 7127, 9826, 14819, 19146, 23305, 27719, 30746, 33955, 39259, 41903, 48097, 51245, 56115, 58722, 62050, 65739, 68595, 71526, 73349, 76332, 79731, 82915, 84059, 86721, 87978, 89842, 92801, 92911, 95686, 94906, 96773, 97293, 96882, 98510, 98618, 98793, 99390, 98489, 98627, 96554, 96225, 94677, 94686, 91832, 90674, 89065, 86666, 86799, 81710, 81003, 78460, 74774, 72440, 69249, 65478, 63259, 59403, 57794, 52698, 49552, 44929, 42139, 38326, 34802, 30187, 25322, 22592, 18704, 15644, 10155, 5761, 1988, -4079, -7003, -10755, -15096, -18372, -24194, -26649, -31460, -35799, -39050, -43519, -46254, -49840, -53216, -56763, -59170, -63628, -66289, -69257, -71583, -73887, -77360, -77933, -80334, -85098, -85823, -86705, -87668, -90609, -90659, -91809, -94257, -92197, -94679, -94413, -95124, -94346, -94617, -93938, -94012, -94008, -91911, -91862, -89397, -89443, -86935, -84922, -85357]
5702h5357K871L020L082J561K961L970P94M268K481L698J918K639N662K307M798
5717c9327K950M465M451K941M141K362N541L164M963M524K976M042K159O481L420
5732A9253L431M127L383M588L445L709J453N023K786M247K223L723K846K655K622
5747F9514J179L045K230K812Q90L334K62K724m08K631k89K537j215K283K57j069
5763I0717J202j619J104k393O95j688n32j08k200j197k499j126j770l144r10l503
5779G1029k243j740l515l325j856m064m556k187k427l913l273n203j810m733l283
5794B2901l828n301j693n215j822m220n290k894l776l985m549k932k940o113j778
5809c3435m330k054n890j399m736k668j040m429k209l084j489k712k056l592j406
$$ y = [-85357, -82486, -79466, -76384, -74823, -71862, -67892, -67098, -62830, -60349, -56651, -54733, -52094, -46432, -44125, -39327, -36377, -31912, -27461, -24520, -20379, -18017, -12476, -9312, -4349, 175, 3151, 7193, 9352, 15833, 19253, 22684, 26811, 30194, 34782, 38227, 41936, 43389, 48412, 51198, 55445, 57668, 61391, 64237, 66892, 69514, 70693, 73738, 75968, 78780, 79670, 83004, 83266, 85990, 85582, 88213, 87924, 90461, 89246, 91529, 91786, 90717, 91919, 90300, 91404, 89011, 89706, 88018, 87486, 87378, 85178, 83981, 81482, 80356, 78586, 75442, 74532, 71029, 68786, 67046, 63531, 60206, 58350, 54286, 49730, 47543, 45116, 41203, 37930, 32727, 30917, 26184, 22901, 19073, 13772, 12079, 6864, 5042, 822, -4468, -7362, -11138, -15123, -19672, -22604, -25544, -31657, -33435, -37765, -39819, -45709, -47108, -51844, -54512, -55552, -59981, -62190, -65274, -66763, -69475, -71531, -75123, -76529]
5824g6529r63j810k537o48j943j5j915P82j970R33k33k292K524j254J373k085
5840h8582K048K104n0J469J013K683J419K304J282J407L241K271J788L291J691
5855f0621L817K483L193L868J174M527L719L588K054L525K424N603L118L474L935
5870a0119L225M048M172L807L277L601N203J529M748J970M577L497L544K980K615
5885D2674K211L720M332J512L297K395L391K003J653J690L246J132J980J383J884
5900G8503J211J252O8J201K482j73k87O53j94J645k371n01j11J6j125k304l23
5917G9642k115M14l249j226k738k418n98k638k289k450l064k705l112j847l950
5932D5657k752k254m445k508m444k673k947l725l451l286l763m103k559m687l014
$$ y = [-76529, -77492, -79302, -81839, -82487, -84430, -84445, -86360, -85578, -87548, -86615, -86848, -89140, -86616, -87870, -86497, -88582, -86534, -84430, -84480, -83011, -81998, -79315, -77896, -75592, -74310, -72903, -69662, -67391, -65603, -62312, -60621, -56804, -54321, -51128, -47260, -46086, -41559, -37840, -34252, -32198, -28673, -26249, -20646, -17528, -14054, -10119, -6894, -2846, 1326, 5133, 8410, 12011, 17214, 18743, 23491, 25461, 30038, 33535, 37079, 40059, 42674, 44885, 48605, 52937, 54449, 57746, 60141, 63532, 65535, 67188, 68878, 72124, 73256, 75236, 76619, 78503, 79714, 80966, 81034, 82235, 84717, 84544, 84257, 84910, 84716, 86361, 83990, 83489, 83378, 83394, 82269, 79965, 79642, 77527, 77941, 74692, 73466, 70728, 68310, 67712, 65074, 62785, 60335, 57271, 54566, 51454, 49607, 45657, 42905, 40651, 36206, 33698, 29254, 26581, 23634, 19909, 16458, 13172, 9409, 5306, 2747, -1940, -4954]
5947d954l833l852k588m442k469l861k949l580k611k439m440j930m167j949l550
5962e3614k483j788k487k125k217k790k478n81k488j674l67j338r61j553M35k737
5978h1246pJ493j390N35M90j274J026J826K5L53o1K109K01L074R51K247J609J966
5996f6073K932M43L324J680M177K441J204M304K071L561J312N080K269K226M599
6011b4450K923L846K659L047M247L687L506L079L181K392M601K811L694K541M031
6026B5795L331J804M369K622L424L118J637L179J999L102K822K425J335Q73L677
6041F5512J197J299J462K505J128L59J680M67J381O76l21O15r66P50q55J018j198
6058G6709k85r13j236r9r32k394k54j628k172j593k673o88k089k599l569j341
$$ y = [-4954, -8787, -12639, -15227, -19669, -22138, -25999, -28948, -32528, -35139, -37578, -42018, -43948, -48115, -50064, -53614, -56097, -57885, -60372, -62497, -64714, -67504, -69982, -70563, -73051, -74725, -75092, -76430, -77391, -78944, -78509, -81246, -81253, -79760, -81150, -80615, -80125, -81399, -80373, -78547, -78522, -78169, -78230, -76121, -75920, -72846, -71895, -69648, -68039, -66073, -63141, -62698, -59374, -57694, -53517, -51076, -49872, -45568, -43497, -39936, -38624, -33544, -31275, -29049, -24450, -21527, -17681, -15022, -11975, -7728, -4041, -535, 2544, 5725, 8117, 12718, 15529, 19223, 21764, 25795, 29126, 30930, 35299, 37921, 41345, 44463, 46100, 49279, 51278, 54380, 57202, 59627, 60962, 61835, 65512, 66709, 68008, 69470, 71975, 73103, 73462, 75142, 75609, 76990, 77666, 77345, 77960, 76994, 77744, 76889, 77907, 76709, 76424, 75511, 74275, 74176, 73244, 70850, 70596, 68968, 66796, 65203, 62530, 61842, 59753, 57154, 53585, 52244]
6074E2244m047j481k774j667k686m525k368k437l938l197l648k999l479l212k413
6089G373m956j313m853r56m986k906l294l443j819m982k549k791k884j630k871
6104c8860l983l451k112k964j662n28m012j815k667n00j838j754q66j949p07j312
6120g0980j262j645J049j757Q1K83r77L7K48J38J181n33J347J60K743M17N12K555
6138f6403J196k7L786L85K309K572K895J045L260J990M912J165J040L499J129
6153c5247N043J777K822M481K941K483K663L368L033M346J403L456L546J751O055
6168A3921J909K302L243L046L209K680L104L478K031L679J071L256J257K518J743
6183E2447L141K218J121J113J620K084O62J585R47J800m83J962J708o89J008j597
$$ y = [52244, 48197, 46716, 43942, 42275, 39589, 35064, 32696, 30259, 26321, 23124, 19476, 16477, 12998, 9786, 7373, 2417, 1104, -3749, -4705, -9691, -12597, -15891, -19334, -21153, -26135, -28684, -31475, -34359, -35989, -38860, -42843, -46294, -48406, -51370, -53032, -53560, -57572, -59387, -62054, -62554, -64392, -66146, -67012, -68961, -69668, -70980, -72242, -73887, -72838, -74595, -74514, -74231, -75208, -75171, -74923, -74785, -73604, -74137, -72790, -72630, -69887, -69470, -68958, -66403, -65207, -65234, -61448, -61063, -58754, -56182, -53287, -52242, -48982, -46992, -42080, -40915, -39875, -36376, -35247, -30204, -28427, -25605, -21124, -18183, -15700, -13037, -9669, -6636, -2290, -887, 2569, 6115, 7866, 13921, 15830, 18132, 21375, 24421, 27630, 30310, 33414, 36892, 38923, 42602, 43673, 46929, 48186, 50704, 52447, 55588, 57806, 58927, 60040, 61660, 63744, 64406, 65991, 66938, 68738, 68255, 70217, 71925, 71236, 72244, 70647]
6199G0647J306J350k453J251n58p47l71j420k63k875J23j706k347Q20l782o53
6215E8322k167k369j511k980j170l468k435j807l549k149k454l813l751n54l698
6230B0447l272k780l040k227n642j495k055m008k496l152l293l225r23m840k189
6245b4190l222k986j386k216l207k664l563k407j616q66k720j646j454l534O27
6260e7050l372r13j980j364q11j121k2q71m68j568j22N07J11P70j257R15J099
6277f7517k97M85J617J402P76M62J777K82K172J052L378J865J959J205K181K370
6293d4831J954K745K860J680L029K329L378K255K583K633K159M630J572K826K411
6308e787M961J803L744K664J379N345P03L783K368K824L027K298J965K330L794
$$ y = [70647, 71953, 73303, 70850, 72101, 71543, 70796, 70425, 69005, 68742, 65867, 65990, 64284, 61937, 62757, 58975, 58322, 56155, 53786, 52275, 49295, 48125, 44657, 42222, 40415, 36866, 34717, 32263, 28450, 24699, 24145, 20447, 17175, 14395, 11355, 9128, 3486, 1991, -64, -4072, -6568, -9720, -13013, -16238, -17161, -22001, -24190, -27412, -30398, -31784, -34000, -37207, -39871, -43434, -45841, -47457, -48323, -51043, -52689, -54143, -57677, -57050, -60422, -61335, -63315, -64679, -65490, -66611, -66633, -67504, -67972, -69540, -69662, -69155, -69044, -68274, -69531, -68616, -67517, -67814, -67329, -65712, -64310, -63534, -63072, -61295, -61013, -58841, -57789, -54411, -52546, -50587, -49382, -47201, -44831, -42877, -40132, -37272, -35592, -32563, -30234, -26856, -24601, -22018, -19385, -17226, -12596, -11024, -8198, -5787, -826, 977, 4721, 7385, 8764, 14109, 14812, 18595, 20963, 23787, 26814, 29112, 31077, 33407, 37201]
6323C7201K393J431K463K525J730J009L190J317K183P97K379J263J684L20O16
6338F2501J974p02K193O89q88O40n36M51K55j298L53j497N40j091j24k69k773
6355F0418P49j605j035k462k044J90k197k638l515j024q01l958m72m497r46l426
6371C0737j392l421l161j129m440j969l250k411k457k348l992l374j242l542k305
6386i696k043m165k701j715k115l808k441j969l042k438k542j131k430k433j160
6401d5829k937j227k382p56j884p34k063k039J037k444m91k36q73O13j564l55
6417f4164K44j132N41Q07O74K81J239R76j185K610P63J747J27J489J523J165K624
6434d9671M96L565P99J679J934K063M288j96N146J149L166R67L049L143K497K138
$$ y = [37201, 39594, 41025, 43488, 46013, 47743, 48752, 51942, 53259, 55442, 56239, 58618, 59881, 61565, 61885, 62501, 64475, 63773, 65966, 66655, 65767, 66407, 65871, 66322, 66577, 65279, 65632, 64135, 64675, 63584, 63460, 63191, 60418, 61167, 59562, 58527, 56065, 54021, 54211, 52014, 49376, 45861, 44837, 44036, 40078, 39606, 35109, 34163, 30737, 29345, 25924, 22763, 21634, 17194, 15225, 11975, 9564, 7107, 4759, 767, -2607, -3849, -7391, -9696, -11739, -15904, -18605, -20320, -22435, -26243, -28684, -30653, -33695, -36133, -38675, -39806, -42236, -44669, -45829, -48766, -49993, -52375, -53131, -55015, -55749, -57812, -59851, -58814, -61258, -61749, -61985, -62858, -62245, -63809, -64164, -63920, -65052, -64511, -63704, -63030, -62749, -61510, -60534, -61719, -59109, -58346, -56599, -56472, -54983, -53460, -52295, -49671, -49175, -45610, -44811, -43132, -41198, -39135, -34847, -35043, -29897, -28748, -25582, -24615, -21566, -18423, -15926, -13788]
6450a3788J038M414K579K323J772L492L458K169K893K259K646K721K227K785L343
6465B6331J302K852Q20M780O34K200M76L283L040N9L549k82K992J053J378J403
6481E5870N13J581R03J713j38J190l70L39Q87m52M09j351l87R31j306j226J93
6498E9299q01q29j704j45j333j853j733j387j236j417j607k554p32m391q51k595
6514C4131j890j874k975k051k554k644j924l083l176k027j983k641j870l035l719
6529c315j506m577L29k881l270r57m834k348k110j563k173j564k603k978k088
6544c8438k457p47j715j860q52k497o70j554k408o76m06j460j252P0j636p28K64
6561e9022q26J291l19l96P4J666p75n8J570n21J815R59J023K09P47K702P15J425
$$ y = [-13788, -12750, -8336, -5757, -3434, -1662, 1830, 5288, 7457, 10350, 12609, 15255, 17976, 20203, 22988, 26331, 27633, 30485, 31305, 36085, 36719, 38919, 39395, 42678, 45718, 45777, 49326, 49044, 52036, 53089, 54467, 55870, 56383, 57964, 58867, 60580, 60442, 61632, 61262, 61601, 62488, 62036, 62445, 61094, 60707, 61638, 60332, 59106, 59299, 58498, 57669, 55965, 55820, 54487, 52634, 50901, 49514, 48278, 46861, 45254, 42700, 41968, 37577, 36726, 34131, 32241, 30367, 27392, 25341, 22787, 20143, 18219, 15136, 11960, 9933, 7950, 5309, 3439, 404, -3315, -4821, -9398, -9069, -11950, -15220, -16177, -21011, -23359, -25469, -27032, -29205, -30769, -33372, -36350, -38438, -40895, -41642, -43357, -45217, -46069, -48566, -49236, -50790, -53198, -53874, -54280, -55740, -56992, -56922, -58558, -59286, -59022, -59848, -58557, -58876, -59272, -59198, -57532, -58307, -58365, -56795, -57316, -55501, -54542, -53519, -53310, -52563, -49861, -49146, -47721]
6579d7721J559J522K255j7M164K16L777J411K190K404J022L252K106K631K660
6594a6569J791J824L173L251J621L499J715K438L135J932L231J238K300L907J216
6609A9702J450K923K775K256K868K273O04K702M89L465P33K423L12K434J506j62
6625D8753K703K81K4J685L81J612J68R8J320m91k75L85M66j529r01R27n17j13
6643E4977q71rj620k77r07j672j010k067O59l482j783p7m549L37l934j15k717
6660C0883l050j442k432j037k422j443k650j052l516k488k206k533j508k864l383
6675c143l452j561j753k732j522k336l140k012j735l262j923j494k728K1l679
6690c6451j445j787j258K6k955j029j150j550n32k059q90l79n05L24j393L92k054
$$ y = [-47721, -46162, -44640, -42385, -42402, -38238, -38022, -34245, -32834, -30644, -28240, -27218, -23966, -21860, -19229, -16569, -14778, -12954, -9781, -6530, -4909, -1410, 305, 2743, 5878, 7810, 11041, 12279, 14579, 18486, 19702, 21152, 24075, 26850, 29106, 31974, 34247, 34851, 37553, 38042, 41507, 42240, 44663, 44975, 47409, 48915, 48753, 51456, 51737, 51761, 53446, 53827, 55439, 55607, 55705, 57025, 56534, 56259, 56644, 57110, 55581, 54680, 55607, 55090, 54977, 54106, 54097, 52477, 52200, 51293, 49621, 48611, 46544, 47203, 43721, 41938, 41861, 37312, 37649, 33715, 33600, 30883, 27833, 26391, 23959, 22922, 20500, 19057, 16407, 15355, 11839, 9351, 7145, 4612, 3104, 240, -3143, -6595, -8156, -9909, -12641, -14163, -16499, -19639, -21651, -23386, -26648, -28571, -30065, -32793, -32772, -36451, -37896, -39683, -40941, -40915, -43870, -44899, -46049, -47599, -48131, -50190, -51080, -51459, -51964, -51640, -53033, -52641, -54695]
6707e4695N07j028j75J629j254J527q12J626N81k73R68J099J100j62K890J165
6723d5307JJ856J143K697O91J972N90L112J629J508K893J928K104J417J512L909
6739a6345K005K177K175J534K206K310L248J731K204K986J062L967j02M125Q04
6754A6087M235K15K204L134R1K907Q31L143K377J322J354L15K974J532J336J265
6770D5322J030J348r58K880j35N58J759q99J781o63J419o93k10m33M43o0k68m8
6788E2173k177Q06j394r32q88k774J203l023l88j231j577n03k330j348j900j739
6804C1978k090j241j304l920j863k050k307j94l943m90j638l218l004j676k543
6819D97k227j267l300k076j444k902k276j413k255l009p50k643k650j039k609
$$ y = [-54695, -54188, -55216, -55391, -53762, -55016, -53489, -54301, -52675, -52094, -52367, -51399, -50300, -49200, -49362, -46472, -45307, -45306, -43450, -42307, -39610, -38919, -36947, -36357, -33245, -31616, -30108, -27215, -25287, -23183, -21766, -20254, -16345, -14340, -12163, -9988, -8454, -6248, -3938, -690, 1041, 3245, 6231, 7293, 11260, 11158, 15283, 16087, 20322, 20537, 22741, 25875, 25966, 28873, 29704, 32847, 35224, 36546, 37900, 38215, 41189, 42721, 44057, 45322, 46352, 47700, 46742, 49622, 49487, 50045, 51804, 50905, 52686, 52023, 53442, 52749, 52539, 52106, 52549, 52489, 52221, 52173, 49996, 50802, 49408, 48476, 47588, 44814, 46017, 42994, 42606, 41375, 39798, 39295, 36965, 35617, 33717, 31978, 29888, 28647, 27343, 23423, 21560, 19510, 17203, 17009, 13066, 12576, 10938, 7720, 4716, 3040, 497, -1730, -2997, -6297, -8373, -9817, -12719, -14995, -16408, -18663, -21672, -22422, -25065, -27715, -28754, -31363]
6834c1363o72j723j978j61l059l41j860j62j805j742p14j622Q14k140q29K34n21
6851d9644m18j525J832q26R9O4K24L66L58O87r14J397R13K45K293n89K431M83
6869d2524J008K184M59J348R37K386K272J521J718J374J655J824M140n34K733
6884a7499L487J95K937J167L631J050K247K371K307K755J402J982J249K863K457
6899A4601P32M012P19J522R63L053L844N43O27J516J767J978M6K874P27Q74J305
6916D1703J381J622L1P71M65J059L54P05M37j063J809j913K208l67Q8j064j718
6933D6508J657k142J463k371p73p05k138m19j007k88j217j535j029k363r96k870
6949B9775j209m64k489o77k584k469k391r56j937m023q56j850j512k997r98k461
$$ y = [-31363, -32035, -33758, -35736, -35897, -38956, -39297, -41157, -41319, -43124, -44866, -45580, -47202, -46388, -48528, -49357, -49123, -49644, -50062, -51587, -49755, -50581, -50482, -50418, -50194, -49828, -49470, -48783, -49697, -48300, -47387, -47142, -44849, -45438, -43007, -42524, -41516, -39332, -38873, -37525, -36588, -34202, -31930, -30409, -28691, -27317, -25662, -23838, -19698, -20232, -17499, -14012, -13817, -10880, -9713, -6082, -5032, -2785, -414, 1893, 4648, 6050, 8032, 9281, 12144, 14601, 15333, 19345, 20064, 21586, 22549, 25602, 29446, 29989, 30616, 32132, 33899, 35877, 35923, 38797, 39524, 40398, 41703, 43084, 44706, 44737, 45508, 45973, 47032, 47386, 48091, 48528, 47465, 49274, 47361, 49569, 49202, 49290, 48226, 46508, 48165, 46023, 47486, 45115, 44342, 43637, 41499, 41080, 40073, 39785, 38568, 37033, 36004, 33641, 32645, 29775, 28566, 28102, 25613, 24936, 22352, 19883, 17492, 16536, 14599, 10576, 9720, 7870, 6358, 3361, 2363, -98]
6965i8k160j639k475j215k223k585j256j602k263k974p47j471k012j624l477J8
6981b9803j830j407j503K26l276k475K173k189m92r18j498m25r63j06q58p12o47
6998d6703j51J204j298N65q43J469p09K74J879r50K432n72K49K181o77J773J240
7015c8637K562p86J371P35J774K693L44K672K741M26J655J354K380P52L658P94
7031a3512J140L580Q53J743J596L517J181K337K168R07L194K257K744j52K912
7046A6465K550J70J629J139J918K277K147P91J342J936J063R60J465J143K096
7061C9091J26J433M84L49J533oP96j54M89n60J334O7j028J655k074J081L75j816
7079D3175J204j556L41j700M27r46j737j151j351j092r93q72j193k286J12k102
$$ y = [-98, -2258, -3897, -6372, -7587, -9810, -12395, -13651, -15253, -17516, -20490, -21237, -22708, -24720, -26344, -29821, -29803, -31633, -33040, -34543, -34317, -37593, -40068, -37895, -40084, -40576, -41494, -42992, -43417, -44380, -44486, -45344, -46056, -46703, -46854, -45650, -46948, -46383, -47226, -45757, -46466, -46192, -44313, -45263, -42831, -43403, -43154, -40973, -41650, -39877, -38637, -36075, -36861, -35490, -34755, -32981, -30288, -29944, -27272, -24531, -24105, -22450, -21096, -18716, -17964, -14306, -13512, -12372, -8792, -7939, -6196, -4600, -1083, 98, 2435, 4603, 5510, 8704, 10961, 13705, 13553, 16465, 19015, 19185, 20814, 21953, 23871, 26148, 28295, 29086, 30428, 32364, 33427, 34387, 35852, 36995, 39091, 39217, 40650, 41134, 41483, 43016, 43010, 43806, 43652, 44141, 43581, 44915, 44982, 43954, 45609, 43535, 44616, 44991, 43175, 44379, 42823, 43164, 41464, 41891, 40945, 39208, 38057, 36706, 35614, 34621, 33749, 32556, 30270, 30382, 28280]
7095B8280j060k272j012l037p86j562j660j631l329m93l055m12k469l002o61l031
7111a192j116j893k199j548k256k171j819j262k041j376j611k740L73j511k925
7126b7287j021k310j78j842J51j331k522L80k100p43k82n97j132j184Q68j517
7142d2647k64n15Q48j445R03k6k68J767k481K255l36J156J142j162L340r53R55
7159c7731J20R98K735O11K401m64J911J124J158L185N28K027Q43J359K030M13
$$ y = [28280, 27220, 24948, 23936, 20899, 20113, 18551, 16891, 15260, 11931, 11438, 8383, 7971, 5502, 2500, 1839, -1192, -2308, -4201, -6400, -7948, -10204, -12375, -14194, -15456, -17497, -18873, -20484, -23224, -22851, -24362, -27287, -28308, -30618, -30796, -32638, -32487, -33818, -36340, -35960, -38060, -38803, -39085, -39682, -40814, -41998, -41130, -42647, -42911, -43426, -42578, -44023, -43120, -43146, -43414, -41647, -44128, -41873, -42209, -41053, -39911, -41073, -37733, -38686, -37731, -37611, -36613, -33878, -33267, -30866, -31330, -29419, -28295, -27137, -23952, -23424, -21397, -20554, -19195, -17165, -16752]
$$ [...]
16383f51
##END NTUPLES=NMR FID
##END=
