##TITLE=1H_DE-80H_X3
 200.13MHz, d2o
 8 sc
 
 19ns.26.2.2025
##JCAMPDX= 6.0         $$ Bruker NMR JCAMP-DX V2.0
##DATA TYPE= NMR FID
##DATA CLASS= NTUPLES
##ORIGIN= UXNMR, Bruker Analytische Messtechnik GmbH
##OWNER= pz
$$ XWIN-NMR		Version 3.5
$$ Thu Feb 27 16:44:05 2025 Russian Standard Time (UT+4h)  new_Human@DPX200
##.OBSERVE FREQUENCY= 200.1313
##.OBSERVE NUCLEUS= ^1H
##.DELAY= (6, 6)
##.ACQUISITION MODE= SIMULTANEOUS
##.ACQUISITION SCHEME= undefined
##.AVERAGES= 8
##.DIGITISER RES= 18
##SPECTROMETER/DATA SYSTEM= spect
##.PULSE SEQUENCE= zg30
##.SOLVENT NAME= CDCl3
##.SHIFT REFERENCE= (INTERNAL, CDCl3, 0, 14.3821)
##AUDIT TRAIL= $$ (NUMBER, WHEN, WHO, WHERE, WHAT)
$$ ##TITLE= Audit trail, XWIN-NMR		Version 3.5
$$ ##JCAMPDX= 5.01
$$ ##ORIGIN= Bruker BioSpin GmbH
$$ ##OWNER= new_Human
$$ C:/Bruker/XWIN-NMR/data/yarkov/nmr/H-C/1/audita.txt
$$ ##AUDIT TRAIL=  $$ (NUMBER, WHEN, WHO, WHERE, WHAT)
(   1,<2025-02-27 16:42:18.60 +0400>,<new_Human>,<DPX200>,
      <created by zg, POWCHK disabled, PULCHK disabled
       configuration hash MD5:
       00 E9 B6 7A A2 85 ED C7 34 08 36 98 17 FE 4E 26
       data hash MD5: 16K
       4D A5 28 73 23 59 1E 8C D4 3F A5 9D 83 07 C1 9F>)
$$ ##END=
$$ 
$$ hash MD5
$$ 02 85 DA 7D 61 0E B4 04 D2 18 BC 4A 25 77 F0 72
##$RELAX= 
##$RELAX= 
##$RELAX= 
##$RELAX= 
##$RELAX= 
##$RELAX= 
$$ Bruker specific parameters
$$ --------------------------
##$DU= <C:/Bruker/XWIN-NMR>
##$EXPNO= 1
##$NAME= <H-C>
##$PROCNO= 1
##$TYPE= <nmr>
##$USER= <yarkov>
##$AMP= (0..31)
100 100 100 100 100 100 100 100 100 100 100 100 100 100 100 100 100 100 
100 100 100 100 100 100 100 100 100 100 100 100 100 100 
##$AQSEQ= 0
##$AQ_mod= 1
##$AUNM= <au_zg>
##$AUTOPOS= <>
##$BF1= 200.13
##$BF2= 200.13
##$BF3= 200.13
##$BF4= 200.13
##$BF5= 200.13
##$BF6= 200.13
##$BF7= 200.13
##$BF8= 200.13
##$BYTORDA= 1
##$CFDGTYP= 0
##$CFRGTYP= 5
##$CHEMSTR= <none>
##$CNST= (0..31)
1 1 145 1 1 1 1 1 1 1 1 1 1 1 1 1 1 1 1 1 1 1 1 1 1 1 1 1 1 1 1 1 
##$CPDPRG= <>
##$CPDPRG1= <>
##$CPDPRG2= <>
##$CPDPRG3= <>
##$CPDPRG4= <mlev>
##$CPDPRG5= <mlev>
##$CPDPRG6= <mlev>
##$CPDPRG7= <mlev>
##$CPDPRG8= <mlev>
##$CPDPRGB= <>
##$CPDPRGT= <>
##$D= (0..31)
0 0.7 0 0 0 0 0 0 0 0 0 0.03 0 0 0 0 0 0 0 0 0 0 0 0 0 0 0 0 0 0 0 0 
##$DATE= 1740660137
##$DBL= (0..7)
120 120 120 120 120 120 120 120 
##$DBP= (0..7)
150 150 150 150 150 150 150 150 
##$DBP07= 0
##$DBPNAM0= <>
##$DBPNAM1= <>
##$DBPNAM2= <>
##$DBPNAM3= <>
##$DBPNAM4= <>
##$DBPNAM5= <>
##$DBPNAM6= <>
##$DBPNAM7= <>
##$DBPOAL= (0..7)
0.5 0.5 0.5 0.5 0.5 0.5 0.5 0.5 
##$DBPOFFS= (0..7)
0 0 0 0 0 0 0 0 
##$DE= 6
##$DECBNUC= <off>
##$DECIM= 32
##$DECNUC= <off>
##$DECSTAT= 4
##$DIGMOD= 1
##$DIGTYP= 9
##$DL= (0..7)
0 120 120 120 120 120 120 120 
##$DP= (0..7)
150 150 150 150 150 150 150 150 
##$DP07= 0
##$DPNAME0= <>
##$DPNAME1= <>
##$DPNAME2= <>
##$DPNAME3= <>
##$DPNAME4= <>
##$DPNAME5= <>
##$DPNAME6= <>
##$DPNAME7= <>
##$DPOAL= (0..7)
0.5 0.5 0.5 0.5 0.5 0.5 0.5 0.5 
##$DPOFFS= (0..7)
0 0 0 0 0 0 0 0 
##$DQDMODE= 0
##$DR= 18
$$ [...]
##$SUBNAM0= <"">
##$SUBNAM1= <"">
##$SUBNAM2= <"">
##$SUBNAM3= <"">
##$SUBNAM4= <"">
##$SUBNAM5= <"">
##$SUBNAM6= <"">
##$SUBNAM7= <"">
##$SUBNAM8= <"">
##$SUBNAM9= <"">
##$SW= 18.0517328524113
##$SWIBOX= (0..15)
0 0 2 0 0 0 0 0 0 0 0 0 0 0 0 0 
##$SW_h= 3612.71676300578
##$TD= 16384
##$TD0= 1
##$TE= 0
##$TE2= 300
##$TE3= 300
##$TEG= 300
##$TL= (0..7)
0 120 120 120 120 120 120 120 
##$TP= (0..7)
150 150 150 150 150 150 150 150 
##$TP07= 0
##$TPNAME0= <>
##$TPNAME1= <>
##$TPNAME2= <>
##$TPNAME3= <>
##$TPNAME4= <>
##$TPNAME5= <>
##$TPNAME6= <>
##$TPNAME7= <>
##$TPOAL= (0..7)
0.5 0.5 0.5 0.5 0.5 0.5 0.5 0.5 
##$TPOFFS= (0..7)
0 0 0 0 0 0 0 0 
##$TUNHIN= 0
##$TUNHOUT= 0
##$TUNXOUT= 0
##$USERA1= <user>
##$USERA2= <user>
##$USERA3= <user>
##$USERA4= <user>
##$USERA5= <user>
##$V9= 5
##$VALIST= <valist>
##$VCLIST= <CCCCCCCCCCCCCCC>
##$VD= 0
##$VDLIST= <DDDDDDDDDDDDDDD>
##$VPLIST= <PPPPPPPPPPPPPPP>
##$VTLIST= <TTTTTTTTTTTTTTT>
##$WBST= 1024
##$WBSW= 4
##$XGAIN= (0..3)
0 0 0 0 
##$XL= 0
##$YL= 0
##$YMAX_a= 594422
##$YMIN_a= -726779
##$ZGOPTNS= <>
##$ZL1= 120
##$ZL2= 120
##$ZL3= 120
##$ZL4= 120
##$ABSF1= 10
##$ABSF2= 0
##$ABSG= 5
##$ABSL= 3
##$ALPHA= 0
##$AQORDER= 0
##$ASSFAC= 0
##$ASSFACI= 0
##$ASSFACX= 0
##$ASSWID= 0
##$AUNMP= <proc_1d>
##$AZFE= 0.1
##$AZFW= 0.1
##$BCFW= 1
##$BC_mod= 2
##$BYTORDP= 1
##$COROFFS= 0
##$CY= -3
##$DATMOD= 1
##$DC= 2
##$DFILT= <>
##$DTYPP= 0
##$F1P= 0
##$F2P= 0
##$FCOR= 0.5
##$FTSIZE= 0
##$FT_mod= 4
##$GAMMA= 1
##$GB= 0.15
##$INTBC= 1
##$INTSCL= 1
##$ISEN= 128
##$LB= 0.25
##$LEV0= 0
##$LPBIN= 0
##$MAXI= 10000
##$MC2= 0
##$MEAN= 0
##$ME_mod= 0
##$MI= 1.114404
##$NCOEF= 0
##$NC_proc= 0
##$NLEV= 6
##$NOISF1= 3.799351
##$NOISF2= 2.8
##$NSP= 1
##$NTH_PI= 0
##$NZP= 0
##$OFFSET= 14.38212
##$PC= 1
##$PHC0= -1193.078
##$PHC1= 21.79223
##$PH_mod= 1
##$PKNL= yes
##$PPARMOD= 0
##$PSCAL= 0
##$PSIGN= 0
##$REVERSE= no
##$SF= 200.129724274929
##$SI= 16384
##$SIGF1= 3
##$SIGF2= 2
##$SINO= 400
##$SIOLD= 16384
##$SREGLST= <1H.CDCl3>
##$SSB= 0
##$STSI= 0
##$STSR= 0
##$SW_p= 3205.1282051282
##$SYMM= 0
##$S_DEV= 0
##$TDeff= 0
##$TDoff= 0
##$TI= <>
##$TILT= no
##$TM1= 0
##$TM2= 0
##$TOPLEV= 0
##$USERP1= <user>
##$USERP2= <user>
##$USERP3= <user>
##$USERP4= <user>
##$USERP5= <user>
##$WDW= 1
##$XDIM= 8192
##$YMAX_p= 0
##$YMIN_p= 0
$$ End of Bruker specific parameters
$$ ---------------------------------
##NTUPLES= NMR FID
##VAR_NAME=  TIME,          FID/REAL,        FID/IMAG
##SYMBOL=    X,             R,               I
##VAR_TYPE=  INDEPENDENT,   DEPENDENT,       DEPENDENT
##VAR_FORM=  AFFN,          ASDF,            ASDF
##VAR_DIM=   8192,          8192,            8192
##UNITS=     SECONDS,       ARBITRARY UNITS, ARBITRARY UNITS
##FACTOR=    0.0002768,     1,               1
##FIRST=     0,             0,               0
##LAST=      2.2672688,     0,               0
##MIN=       0,             -726779,         0
##MAX=       2.2672688,     594422,          0
$$ Real data points
##PAGE= N=1
##DATA TABLE= (X++(R..R)), XYDATA
0@%%%%%%%%%%%mM%Qj6J6j6J6j8K6l2L2l6M4n3O1o8P8q7R8j13J27j41J58j78J97
37A03k17K42k70K98l28L61l98M39m82N28n79O38p05P76q55R44j044J162j297J452
57G68j634J855k126K466k907L496m318N527p442J0826j7851L7455j82685n70209
71g26779O89028L37120n66217K60239O01031n15504m89956M21151N612l83710
81c67985M71066M27098n76887k36481M82004j84643m64847M39165L89187m05844
91b8167o0402L43904l01441l18668M17997J20406l80160K54721M02636m96212
101d5386l68611M93832R7865m73282K25410M98336l43691l73253L12564M9397
111G3181l35904K26860L56590l05671k04038L25539m4433l68331J99348L34671
$$ plain form
0 0 0 0 0 0 0 0 0 0 0 0 0 -4 0 0 8 -8 8 -8 8 -10 16 -16 16 -20 24 -29 32 -36 42 -45 53 -60 67 -74 84 -94 103
37 103 -114 128 -142 156 -172 189 -209 230 -252 276 -303 335 -370 406 -449 495 -549 613 -684 768
57 768 -866 989 -1137 1329 -1578 1918 -2400 3127 -4315 6511 -11340 26115 -156570 -726779
71 -726779 -37751 299369 -266848 -6609 594422 78918 -411038 10113 15725 -367985
81 -367985 103081 530179 -46708 -283189 198815 14172 -450675 -11510 377677 -28167
91 -28167 -88569 255335 -46106 -364774 53223 173629 -206531 48190 450826 -45386
101 -45386 -413997 79835 177700 -295582 -70172 428164 84473 -288780 23784 73181
111 73181 -262723 -35863 320727 15056 -188982 136557 92124 -276207 -76859 257812
121B57812k39445j66441K66187j6417k63379J23865J53340k10845m891K68551
131A68337j01838k18856J97167Q7408l10380J1917L45116p0670k33357J84511
141E9355R6191l02274k1225K89871o3161j60393K14202N3902l25486l519K82997
152A20460r9173j74536K35631J08646k72951l7857J88419r9881r7833K21236M6739
163A38900k11154N5515J36191j96901r4812K50355M4030j88537P6384J14814j96391
174g1606q0593J97085L073j22455J31673P5288k10942m1691J81485m3963j15045
185i7691J54488Q5220j83766m2144J33329n0198q4625J24463N0203j27253Q743
196b9231Q8787q9371o5129J26230L5301j10209K3916Q5586p4218o1452Q7250K1975
$$ plain form
121 257812 18367 -148074 118113 101696 -161683 -37818 115522 -95323 -100214 168337
131 168337 66499 -152357 44810 132218 -178162 -166245 178871 108201 -125156 59355
141 59355 155546 -146728 -167953 121918 58757 -101636 112566 166468 -159018 -162537 120460
152 120460 21287 -153249 82382 191028 -81923 -119780 68639 -31242 -129075 92161 138900
163 138900 -72254 -16739 119452 -77449 -172261 78094 122124 -66413 9971 124785 -71606
174 -71606 -152199 44886 47959 -74496 57177 132465 -78477 -120168 61317 17354 -97691
185 -97691 56797 142017 -41749 -83893 49436 -762 -85387 39076 89279 -37974 -29231
196 -29231 59556 -29815 -94944 31286 66587 -43622 -19706 65880 -8338 -69790 17460 39435
208C9435p2798L3642O2565o5729m5408O5851N347o1991L2410N3557n0429l1752
220c5300N2308m353n5889K9536M9402l6542k3339M5911k408m7458J9235L4675
232B5778l0541j0005M2996j0109m4133K0290K6700l6028p679M5019q273m2133
244b8118K1659K7842l5014j1530M0732J274l0322J4185J6195k4278j530K5706
256A6801j2680j9208K6494J0157l5201l761K9194q184k1252J6642J3109j7273
268e162m007J1560n615k969J4122j143j2786J0163Q696j7155n019K0480J843j9427
282f419j023J2989j993r005n2K401K157K645m905o019Q247R903p952r419Q431
297a4R592m652p656K321N739j152m968k081L439K577m292n059K077M485j989l507
$$ plain form
208 39435 -33363 279 62844 -2885 -48293 17558 22905 -39086 -6676 46881 -3548 -35300
220 -35300 17008 12655 -43234 -13698 35704 -838 -24177 21734 19326 -28132 -8897 25778
232 25778 -4763 -14768 28228 18119 -26014 -5724 20976 -15052 -22731 22288 14015 -28118
244 -28118 -6459 21383 -13631 -25161 15571 16845 -13477 708 16903 -7375 -8905 16801
256 16801 4121 -15087 11407 21564 -13637 -17398 11796 3612 -17640 -998 12111 -5162
268 -5162 -9169 2391 -3224 -6193 7929 6786 -6000 4163 12859 -4296 -9315 11165 13008 -6419
282 -6419 -7442 5547 3554 -5451 -5503 -3102 -945 1700 -3205 -9224 -977 8926 974 -8445 -14
297 -14 9578 4926 -2730 -409 5330 4178 -790 -2871 568 3145 -1147 -6206 -4129 356 -1633 -5140
313e140J499M523M67k625q15M613L411m083m369M317M264l253m101J810J872k485
329i5j779k03l10k2Q40l84q02J028R52J317J706j191k045K176M231k245m392J702
347D84M205j089m745k332L201L410m642o283K833P326j168n148J132M030P49k130
363a67k149K344P597n10j2029K14J3434k282j3310M832J1893r838j1784P892N844
378A981m411K204R56o591M951J0042j0922j0766J6336R723j5332m862J5508J549
392A0366j1914l722R22K653Q940j723j4357K996J2314j1500j2623J8789J7169
405A8310j5091j3320Q353K349o076N936P990k494k60P56j1597q730J2933J1334
419A0393j2153q024J6459P704k2565j3547J7996J1580r806J231J3225n658j3079
$$ plain form
313 -5140 -3641 882 1349 -1276 -2091 2522 5933 1850 -2519 1798 6062 2809 -1292 518 2390 -95
329 -95 -1874 -2077 -2387 -2409 -1569 -1953 -2755 -1727 -775 542 2248 1057 -988 1188 5419 3174 -1218 484
347 484 4689 3600 -1145 -3477 -276 3134 -1508 -7791 -4958 2368 1200 -3948 -2816 1214 1963 -167
363 -167 -2316 28 7625 7115 -4914 -4700 8734 6452 -6858 -2026 9867 29 -11755 -3863 1981
378 1981 -2430 -226 730 -5861 -910 9132 -1790 -12556 3780 13503 -1829 -6691 8817 10366
392 10366 -1548 -5270 -4348 -1695 7245 5522 -8835 -5839 6475 -5025 -17648 1141 18310
405 18310 3219 -10101 -1748 601 -5475 461 8451 5957 5697 6453 -5144 -13874 -941 10393
419 10393 -1760 -9784 6675 14379 -8186 -21733 -3737 7843 -1963 -732 12493 6835 -6244
432f244j2k833R80K4204J1531k8054j2748J7008j0487k0021K8327K8139k2979
445F811j4634J1356j8522j3648L7951J2704l1368J4042K6215m4706k5228N3340
457A4313J1566m5109J9533L6150m2310k2342M0727j2428l3073M7193K2899o0446
469b3327L868N5227m1731m7465O5167K9665o1151J1260N0317n0131l5003O3658
481B0354L681n8542L7145M7031o4194k5190O4820j2784n5665M4773L5448n4068
493a7191J389N1015l9299m0706N5793J2322n1476L5575M9118o5301l5992O0461
505A5708q079n2967N7944N2360p1159l1205N6274k4477n5895O4318N8560n6579
517D803k4714M2937k8566m9938M7834M5749k8568N75K4441m4142m0779L7627K5129
$$ plain form
432 -6244 -6256 -9089 -8109 16095 27626 -428 -13176 3832 -6655 -26676 1651 29790 6811
445 6811 -7823 3533 -14989 -28637 9314 22018 -9350 4692 30907 -13799 -39027 14313
457 14313 25879 -19230 303 36453 -5857 -28199 12528 100 -32973 14220 37119 -23327
469 -23327 -19459 35768 -5963 -53428 11739 41404 -19747 -8487 41830 -8301 -43304 20354
481 20354 24035 -34507 2638 49669 -14525 -39715 25105 12321 -43344 1429 36877 -17191
493 -17191 -15802 35213 -4086 -44792 11001 23323 -28153 7422 56540 -8761 -44753 15708
505 15708 7629 -45338 12606 64966 -6193 -37398 18876 -5601 -61496 2822 61382 4803
517 4803 -19911 23026 -5540 -55478 -7644 38105 9537 10112 34553 -9589 -50368 -12741 12388
530A2388j4976K2952K0800m5228l0285K0570m800o061N4889K4757n8605k1820
542b5419L4263k3715l6627N9773N6481m7894l6837L1134j4403m7757L6033N6553
554D1585k4559k2386K6806k1983n1509K9414N0386k0521j2982L5401j2121m9575
566c2044P968K8299m989J1270J9507k9216j8057K8345j4190l6386M3345M2641
578D6493n2224k6188N2485o027n3296L0848M0945m4367j1153N4361j7493m9032
590c4648M0682K8657o1083p650O7686o920m9204K4181K0553m3379p546L5572k489
603D412j548K6709k3578m3653K7307K5539l4382R239N5614k0112n3438J7380J6214
616E703k9800J6829M4176k4368k7250L0453r628n4560K3863N9962j9058k9711
$$ plain form
530 12388 -2588 20364 41164 -4064 -34349 -13779 -18579 -24640 30249 55006 -3599 -25419
542 -25419 8844 -14871 -51498 8275 64756 16862 -19975 11159 -3244 -51001 -14968 41585
554 41585 17026 -5360 21446 -537 -52046 -22632 27754 7233 -5749 29652 17531 -32044
566 -32044 -24076 4223 -766 10504 30011 795 -17262 11083 -3107 -39493 3852 46493
578 46493 -5731 -31919 20566 14539 -38757 -7909 33036 -11331 -22484 31877 14384 -34648
590 -34648 6034 34691 -26392 -34042 33644 26724 -22480 1701 22254 -21125 -28671 6901 4412
603 4412 2864 29573 5995 -37658 -10351 15188 -19194 -9955 45659 25547 -27891 -10511 5703
616 5703 -24097 -7268 36908 12540 -14710 15743 6115 -48445 -24582 35380 16322 -13389
628a3389L0372J753m7490l154L4004O164N797J7268k2213l3413J0367J0752j3876
641a7058J9105L8615j6851m2718j881R763m789J4878K4678q708j5397K595j3567
654a1335j8383K4959L3399j5224k2027J5272M525k6795l674K5790M925j1110M041
667D363R95j3639L24Q267r236j033K5001L033k6739k249J7541q619j2885J9556
681D680J4004j4211o801L204j0677L28J9646k829j7395J2251J1819k3992r152
694a9125K6818L797k1209M743J5231j0120m091J2203q441j1253J7034N650j8707
707g470M484K0235j5559k2171J6509J4454j2987L19J1993j0773j1010J1781J542
720A347r220J3145J1599k0840r474J9717J261j5800P436J3332j1711p778R264
$$ plain form
628 -13389 16983 18736 -28754 -31908 2096 8260 14057 31325 9112 -24301 -13934 -3182 -17058
641 -17058 2047 40662 23811 -18907 -20788 -11025 -15814 -936 23742 15034 -363 2232 -11335
654 -11335 -29718 -4759 28640 13416 -8611 6661 11186 -15609 -19283 6507 11432 322 4363
667 4363 5358 -8281 -7957 310 -8926 -9959 15042 18075 -8664 -10913 6628 -1991 -14876 4680
681 4680 18684 4473 -2328 876 -9801 -9473 10173 7344 -10051 2200 14019 -9973 -19125
694 -19125 7693 11490 -9719 -4976 10255 135 -3956 8247 -194 -11447 5587 11237 -7470
707 -7470 -2986 17249 1690 -20481 -3972 10482 -2505 -2186 9807 -966 -11976 -195 1347
720 1347 -7873 5272 16871 -3969 -13443 6274 7535 -8265 -829 12503 792 -6986 2278
733B278k746p585J0490L830j3872K912J4302q638j2061J0810P324j0375O10J0421
747G700m592o876N733L11p935O295Q093r158o287Q479O7q718M596Q050n832m688
763d762N480n65m307M938M572o085j167O130k345n498M754L244n537j875M661
778A638j075l460L106Q91m226P4M344j324k382L451J090l384N13L508j165j940
794c41K063j95l050J086K518k224j329K523o16l021N53K847j722r41K348J34j988
811a355J754J700j536o94K438j303k136J933J650l030o84K353j689j104J709Q1
827H7k446J393J866k371j0L459j006k574K691J442l835J419L331l338k529M147
843A726K85m502Q78M068l775k130L931j78l095K642K022l245K27L862k204k179
$$ plain form
733 2278 -468 -8053 2437 6267 -7605 -4693 9609 971 -11090 -280 7044 -3331 -2721 7700
747 7700 3108 -3768 1965 2276 -5659 636 8729 -429 -6716 1763 1830 -6888 -2292 5758 -74 -4762
763 -4762 718 153 -4154 784 5356 -729 -1896 4234 1889 -3609 1145 4389 -1148 -3023 1638
778 1638 563 -2897 209 1100 -3126 -3052 1292 -32 -2414 1037 2127 -1257 -744 2764 1599 -341
794 -341 1722 1527 -1523 -437 2081 -143 -1472 1051 435 -2586 -2033 814 -908 -1849 499 633 -1355
811 -1355 399 2099 563 -131 2307 1004 -1132 801 2451 -579 -1263 1090 -599 -1703 6 87
827 87 -2359 -966 900 -1471 -1481 1978 972 -1602 1089 2531 -1304 115 3446 108 -2421 1726
843 1726 2011 -2491 -1613 2455 -1320 -3450 481 303 -2792 -150 1872 -1373 -1146 2716 512 -1667
859a667L670L17l666J923K390m219j4M230l022m189N143J929o391L21N917j953
875G19m168L509K729k847m11J799r72m11J887k49j805N17J087q81j394j483J247
892a127L417k308m108L763L697n534k284O197J976m691P47J750k230J122K046
907B433l399N18N957m982p119O066M740p690P10P122n635l959R012j890j0557
922h673R656R527j4638m736J8188j737j7830P765J2928j1786n002J2636m170j0501
936h373R847M271j4175M268J5813j1698j2746J5759N786j5839L194J3921r613
949D15p397J2985j288j3066J0570Q586j8378l323K1550k487k0079R084J3044j5962
963e746o501J8582J567j3334P146M747j6110J269J9953m440j5257J2733P343k2994
$$ plain form
859 -1667 2003 2320 -1346 577 2967 -1252 -1266 2964 -58 -4247 896 2825 -3566 -3245 2672 719
875 719 -3449 60 2789 -58 -469 1330 358 -53 1834 1585 -220 297 1384 503 -891 -2374 -1127
892 -1127 2290 -18 -4126 -363 3334 -2200 -4484 1713 3689 -1002 -255 1495 -735 387 2433
907 2433 -966 -448 5509 527 -6592 -526 4214 -3476 -2766 4356 -1279 -5238 3774 1884 -8673
922 -8673 983 10510 -4128 -8864 9324 7587 -10243 -2478 10450 -1336 -6338 6298 2128 -8373
936 -8373 1474 5745 -8430 -4162 11651 -47 -12793 2966 8752 -7087 -3893 10028 415
949 415 -6982 6003 4715 -8351 2219 10805 -7573 -10896 10654 8167 -11912 -2828 10216 -5746
963 -5746 -12247 6335 7902 -5432 1714 6461 -9649 -8380 11573 7133 -8124 4609 11952 -11042
977a1042l522K3892r67j6367J0044P880j9360k393J9855o144j3311J8935Q305
990A5805k6709k077K6401r090k1322K1142J6118k4853n381K0123j1928j6193K4264
1003F300R106k4594O511J9833k6505j6765L5554Q193k9773J1861K1812l1282j4331
1016b4080L6460J15k7930K2975J7463m1838p975M4375q721l4593K9039K0922m2725
1029a6513o364M1243j1514k7781K8881J1107l7477O607L5357k2741k1889L4311
1041A3227K874l7070J4506K9771k7066j3927L2762o693l1893K3761K1506l4207
1053a2449m249L8270j3250l3753K7245K0436l5537k904L8163j0947k9755K1706
1065B976J2788l1996K091L4240j1075k3206J8927O195k9808L747L1292o907j6908
$$ plain form
977 -11042 -14564 9328 8361 -8006 2038 9918 -9442 -11835 8020 1876 -11435 7500 15805
990 15805 -10904 -12981 13420 4330 -16992 4150 20268 -4585 -9966 10157 -1771 -17964 6300
1003 6300 15406 -9188 -2677 17156 -9349 -26114 9440 17633 -12140 -279 21533 -9749 -24080
1016 -24080 12380 12495 -15435 7540 25003 -16835 -24810 19565 10844 -23749 5290 26212 -16513
1029 -16513 -22877 18366 6852 -20929 7952 19059 -18418 -11811 23546 805 -21084 13227
1041 13227 16101 -20969 -6463 23308 -3758 -17685 15077 8384 -23509 252 21758 -12449
1053 -12449 -16698 21572 8322 -25431 1814 22250 -13287 -16191 21972 11025 -18730 2976
1065 2976 15764 -16232 -14141 20099 9024 -14182 4745 10940 -18868 -15121 16171 9264 -7644
1078g644J4814o3k5902P700K5396r550q940J8242n705k9386R514K5519j2513r250
1092g768K2167l443k9696P631K2083j4200p348K5680j854l0179Q487K2091j7619
1105c968j0248K7518K919k7547M788J8319j7832q790K5410K055k2886Q977J3154
1118A1869k2068o440K7491o17k0671J1996J1896k3420l956K5542m768j7188J6976
1131F642O953k7207J502K7080j0375j8968K0684P803k7842J129K5448j0089j4873
1144a2113J9428L317k4224O784K1433j5120j1227K2101N95k4472O781J9810j3416
1157c23r949J8432l51j9879Q098J3584j4751l136J9327m942j8834J1002J2615
1170A0893j6271l715J9570l014j6456Q243Q839j3490k81J5581o340j2896J1676
$$ plain form
1078 -7644 7170 7107 -18795 -11095 14301 4751 -4189 14053 8348 -21038 -11524 13995 1482 -7768
1092 -7768 14399 10956 -18740 -11109 10974 -3226 -10574 15106 13252 -16927 -8440 13651 -3968
1105 -3968 -14216 13302 16221 -11326 -6538 11781 -6051 -14841 10569 12624 -10262 -1285 11869
1118 11869 -10199 -16639 10852 10235 -10436 1560 13456 -9964 -13920 11622 6854 -10334 6642
1131 6642 13595 -13612 -12110 14970 4595 -14373 6311 14114 -13728 -12599 12849 2760 -12113
1144 -12113 7315 10632 -13592 -6808 14625 -495 -11722 10379 10974 -13498 -6717 13093 -323
1157 -323 -10272 8160 7809 -12070 -3972 9612 -5139 -8275 11052 6110 -12724 -1722 10893
1170 10893 -5378 -9093 10477 7463 -8993 -750 8089 -5401 -5682 9899 3559 -9337 2339
1183B339N734j6963J62J8220n067j3888J0551O710j3588j13J3284n474q082J1228
1197E053J963j4859L508J3218q227r044J2374L574j4424J303J1471o403n783J0585
1211D309K46j1104M916Q146r321l420J2613n52j2444M402R204p951m271R437r28
1226C282q843M838M935p981j75R412l541q992P434N499q454j272Q668k346o784
1241d320N057L509o579J106O010n092m514O960J683p573J454O416m347m439O025
1256A356J574n771J519M204l742j480N381q62m708K738L122m583j590N134n64
1271A728m299J813K025k512o2K546j479j817K436N75k321Q81K749j229k316J806
1287E24Q73j493Q8R28j311o94J252K01j188K38J023q95q21J059Q73p44n35Q47
$$ plain form
1183 2339 8073 -8890 -8728 9492 4425 -9463 1088 7798 -5790 -5903 7381 1907 -6175 5053
1197 5053 7016 -7843 -4335 8883 656 -8388 3986 7560 -6864 -5561 5910 -493 -6276 4309
1211 4309 4555 -6549 -1633 6513 -2808 -6228 6385 5833 -6611 -2209 6995 -956 -5227 4210 3282
1226 3282 -5561 -723 4212 -3769 -3944 5468 1927 -7065 369 5868 -2586 -3858 4810 2464 -4320
1241 -4320 737 4246 -2333 -1227 4783 -309 -4823 2137 3820 -3753 -2299 4117 -230 -4669 1356
1256 1356 2930 -2841 -1322 2882 -860 -2340 3041 2179 -2529 209 3331 -1252 -2842 2292 1728
1271 1728 -2571 -758 1267 -1245 -1307 1239 -240 -2057 379 954 -1367 -486 2263 1034 -1282 524
1287 524 1397 -96 -8 920 -391 -1085 167 368 -820 -582 441 -454 -1275 -216 657 -87 -622 225
1305B25M89p77j51Q50M25o16m61J84k77m7N50n21p75L32L60l17j31N42j89J50
1325a55J78J03k43Q50K08j135J0J302o76j057P04O38j119j96P49j57p92O06J19
1344f3m60QM24O62j86l23k14Q46j7r96M32J215j322q33J078M91j263j22J171j106
1364e78q97J084Q42q77OJ233o03p92M31P43O9l8n30m8P35p63q83J216Q17j699
1384e32j071J701J70j576J035R78j745K10J492k58r86R59L21p94J31O82n86N77
1402G08m75j509O68J876j684j472L473m22m059J654L659k805j744M356o05m276
1418b657K629K859l879m36M834j668m510L173J744m415P10L701k746j426M285
1433B198j508m909M380L043n814Q13O748l311o476N396L042o647J522O888m845
$$ plain form
1305 225 714 -63 -214 636 1061 445 -16 168 -109 -156 394 -127 -902 -570 -210 -527 -658 -116 -305 -155
1325 -155 23 126 -117 733 941 -194 -184 1118 442 -615 89 727 -392 -588 161 4 -788 -182 -63
1344 -63 -523 -515 -91 571 385 62 -152 694 677 -319 113 1328 6 -827 251 742 -521 -643 528 -578
1364 -578 -1475 -391 451 -426 -420 813 210 -582 -151 592 661 623 93 45 780 17 -866 350 1167 -532
1384 -532 -1603 98 268 -1308 -273 705 -1040 -830 662 404 -582 377 698 -96 35 717 131 708
1402 708 233 -1276 -608 1268 -416 -1888 1585 1163 -2896 -1242 2417 -388 -2132 2224 1619 -2657
1418 -2657 -28 2831 -1048 -1484 3350 1682 -2828 345 2089 -2326 -1616 2085 -661 -2087 2198
1433 2198 690 -4219 161 3204 -2610 -1797 4951 1640 -4836 560 3602 -3045 -1523 5365 520
1448E20m867O375j01p192M176O436o034l526O731j150o427M918M205n433k12N551
1464C970m013m469O833J129p209K924N756n268m317O297P38o180K821M649n438
1479a777j190N967k079m498M005L095n303m33N369j535l819K851J305m047O23
1494a466L947k821j476L593l50n070J235M526j587j922L387N95m235q58K875P2
1510D45o87K806L25l801j376K085p56q12L343K006l691k131J163l78o28L047K386
1527C346j950p73m60l431p2M757K039k681O41J255n278k807N428K224k175K085
1543B148O51n571k325M908J207k145L643K273n929l027L656J192j458K710J298
1558C231l077j286R83j731l92L946L86k857R08P42l195j83L340O3j212K231m76
$$ plain form
1448 520 -4347 2028 1927 -5265 -1089 5347 -687 -4213 2518 1368 -5059 -141 4064 -1369 -1581 3970
1464 3970 -43 -4512 2321 3450 -3759 -835 4921 -347 -4664 1633 2371 -3809 -988 3661 -1777
1479 -1777 -2967 3000 921 -3577 428 3523 -1780 -2213 3156 1621 -2198 653 1958 -2089 -1466
1494 -1466 2481 -340 -1816 1777 1427 -3643 -2408 2118 531 -1391 1996 2591 -1644 -2502 373 445
1510 445 -242 2564 2889 -912 -2288 -203 -959 -1771 1572 3578 -113 -2244 -1081 -1459 -2087 960 3346
1527 3346 1396 623 163 -3268 -3340 1417 3456 775 1416 2671 -2607 -5414 14 2238 63 2148
1543 2148 2799 -2772 -5097 -189 1018 -1127 2516 4789 -1140 -4167 -511 681 -777 1933 3231
1558 3231 154 -1132 -149 -1880 -2272 1674 2060 -797 111 853 -2342 -2525 815 878 -334 1897 1421
1575A421l492P14L030j703r66L487l20l992l28L163k47j054R19l50j357K64R57
1592A46j55R19N1j515j311J395J629N45L14j648j987K5N37O45J680J606j542l753
1610b419l17J702O68J439J156n52k173j318m33J269K308J071q14j079o06q45n43
1627a486O74J137J038M69j391j745l57M52k90J208K282M06j992k012o15J090J068
1644f4J951R27r71j748k261q18K004K047J206q24j843j381j94L43J424J942O41
1661B381j790j897M33P26K27N03M66j67n83n50m11%J256l81j222O85J428n65j599
1680a060k03J038l49N45Q48l02k79J68r13p27J885J184j669r51J039j28j218P99
1698b93Q47o98k60K30j72m22J328J16j996R55J554q63j078J736K48k220L86R86
$$ plain form
1575 1421 -2071 -1357 1673 -30 -996 2491 2171 -1821 -2149 1014 767 -287 632 282 -1075 -811 146
1592 146 -9 910 961 -554 -1865 -470 1159 1704 2018 370 -1617 -1592 -1055 -410 1270 2876 1334 -2419
1610 -2419 -2736 -1034 -366 1073 2229 1677 -496 -1814 -2247 -978 1330 2401 1587 508 -98 -943 -1486
1627 -1486 -812 325 1363 1832 441 -1304 -1661 -1209 -1499 -291 1991 2397 405 -1607 -2222 -1132 -64
1644 -64 1887 2814 1843 95 -2166 -2984 -980 1067 2273 1449 -394 -1775 -1969 -1626 -202 1740 2381
1661 2381 591 -1306 -873 -147 80 583 1049 882 299 -251 -662 -662 594 213 -1009 -324 1104 539 -1060
1680 -1060 -1263 -225 -574 -29 819 517 238 406 -507 -1234 651 1835 166 -785 254 126 -1092 -293
1698 -293 554 -144 -404 -174 -346 -768 560 676 -1320 -365 1189 326 -752 984 1232 -988 -602 384
1716C84l7j79J017j381j655J168J123j155K75J488n31j923M27J561o83n6J172
1733A015n69r06P22L37j191M81R57q74o98Q56L87j221J55O85l04l70J123L9j196
1752e72L94P71q83Q2J239n1j099k6M55n12m16R22L58r65p9N47n72k59J155m2j190
1773g43L42J231q62k32Q79o5r26O00N47q32q1R27m69j286J077L97r85p2J091r40
1793d02q17J245O97j147M53R23j274l71J600m3j168N15M19j106l27J217j32j018
1811g36R68J05r95J80J043p11l31J060o15n94O96N90j059L25J204j185q25J261
1829C81R9j179K00J260j317m1R33L0j008P96P3o40L8R29l52m02R70n79p47J149
1849E93J34j315O45N22j178j71J207j71j308J167O63j376j78J605o69r64J208
$$ plain form
1716 384 347 168 1185 -196 -1851 -683 440 -715 -440 1048 517 -1406 -979 582 -101 -157 1015
1733 1015 446 -460 262 599 -592 -111 846 -28 -726 130 517 -704 -549 136 -168 -538 585 624 -572
1752 -572 -178 593 -290 -208 1031 980 -119 -145 310 -202 -618 304 662 -303 -382 165 -407 -666 489 447 -743
1773 -743 -401 830 -32 -264 615 550 -376 224 771 -61 -142 785 316 -970 107 504 -481 -553 538 -402
1793 -402 -1219 26 723 -424 29 952 -322 -693 907 864 -304 211 630 -476 -803 414 282 -736
1811 -736 232 337 -658 -478 565 -146 -477 583 -32 -626 70 660 -399 -74 1130 -55 -880 381
1829 381 480 -699 -499 761 -556 -597 336 366 -642 154 227 -413 -375 554 202 -200 770 191 -556 593
1849 593 727 -588 57 579 -599 -770 437 266 -1042 125 788 -588 -766 839 170 -794 414
1866D14M00j007J12O18m75j74Q58p30m85R07k33p27P91J43j116K00J190o19j190
1885a123J620N38j692K05J437j154p06J548J22j296N50P28j041k81Q99n61o94
1902i01R79j36n56P27J34r66J71J659o58r15J001L64j776N88J233o31j059J347
1920F05m9j573O87Q98p62n64J366k57r82K62O90j15o45P91j5j15O68m59p37n3
1940c59P44p8o03N38L98j324m25J109o9j71N16K76p60l18Q77J6p55R86M52j443
1960c93m45J710J3j806L42J328j202l52J580k69j499P98N25j426M31K697q90k634
1978a492J896N37k329P14K951j323k038J659k47k590J609L114k661j126K714j130
1994B58l176K311K696k536l46K953j146k964J953J251k772J475L043k363k529
$$ plain form
1866 414 814 -193 -81 537 62 -112 746 16 -469 438 205 -522 269 412 -704 -504 686 67 -1123
1885 -1123 497 1035 -657 -452 985 -169 -875 673 795 -501 49 777 -264 -545 354 -207 -901
1902 -901 78 -58 -614 113 247 -719 -548 1111 453 -462 539 903 -873 -285 948 317 -742 605
1920 605 556 -1017 -330 568 -194 -758 608 351 -631 -369 321 206 -439 352 337 222 890 431 -306 -359
1940 -359 385 307 -296 242 640 -684 -1109 0 -69 -240 276 552 -208 -526 351 367 -388 598 1050 -393
1960 -393 -838 872 885 -921 -579 749 -453 -805 775 506 -993 -195 330 -1096 -665 2032 1142 -1492
1978 -1492 404 941 -1388 -674 2277 954 -1084 575 328 -2262 -653 2461 -200 -1326 1388 258
1994 258 -2918 -607 2089 -447 -793 2160 1014 -1950 3 1254 -1518 -43 3000 637 -1892
2009a892K552J06l714K016L643k037j849J986l20l327K005L329k002q69K383j470
2025E40l708K447L240k266q60K654j583l065J833J896j808K52K131j997j913K454
2041B47Q73k292M55K201j223j649K196R04k763M41J983j489j267K413M87k785
2057a268J80K218j310j788K432J379k836J57K096j170j896J771J466k101O18J656
2073A604j317k230J924O59k072J072K847j873k385J364N31k144J824L018j951
2088H71k167J728o17k410K363L358k105k130K333j300k788K022L317k300r55K599
2104A819j586l555K546K447j937J35K726j970l209K037J871k125L20L185j776
2119I28l291K397R06k607R08L140k094k102K292J20k608J468K740j960j703K479
$$ plain form
2009 -1892 660 766 -2948 -932 2711 674 -1175 811 491 -2836 -831 2498 496 -373 2010 540
2025 540 -3168 -721 2519 253 -607 2047 464 -2601 -768 1128 -680 -428 1703 -294 -2207 247
2041 247 1120 -1172 -717 1484 261 -1388 808 1712 -1051 -610 1373 -116 -1383 1030 1517 -1268
2057 -1268 -1088 1130 -180 -1968 464 1843 -993 -836 1260 90 -1806 -35 1431 -670 -52 1604
2073 1604 287 -1943 -19 640 -1432 -360 2487 614 -1771 -407 124 -2020 -196 2822 871
2088 871 -1296 432 -185 -2595 -232 3126 1021 -1109 1224 -76 -2864 -842 2475 175 -780 1819
2104 1819 233 -3322 -776 1671 -266 -131 2595 625 -2584 -547 1324 -801 -481 2704 928
2119 928 -2363 34 940 -1667 -759 2381 287 -1815 477 597 -2011 -543 2197 237 -1466 1013
2135A013Jk903J277K781j962j396K304k12k736J405J956k279p20K653o41k413
2151a872J437K121k173q00K532l03k345J362J877k259j27J784p84k171J543J756
2167A578k450j26K310j018k198J801J593k020k48K171j416j686K009Q76j983P14
2183i3J697j718j519J776J224k213L98J796j116j885K042L46j833O27J750j313
2199c4j242K063J88k221J115J515j402j280K268j72j939R90J120j339m42J571
2215G59q41j237J316R12j828M14J616k64j971J240Q21j347J70J035n58q03Q02
2232B36K05r36L77J180j161q68J398J03j210N54N87o00n89J055K12r63K92N07
2250C79m30l18J000k28q23K68L78n40j22L95L46m94k95O66m07K78M87j58o20L29
$$ plain form
2135 1013 1014 -1889 -612 2169 207 -1189 1115 903 -1833 -428 1528 -751 -1471 1182 541 -1872
2151 -1872 -435 1686 -487 -1287 1245 942 -1403 -41 1836 -423 -550 1234 450 -1721 -178 1578
2167 1578 -872 -998 1312 294 -1904 -103 1490 -530 -778 1393 -23 -1709 300 1176 -807 -93
2183 -93 1604 -114 -1633 143 1367 -846 -448 1348 232 -1653 389 735 -1098 -471 1279 -34
2199 -34 -1276 787 975 -1246 -131 1384 -18 -1298 970 798 -1141 -151 969 -370 -812 759
2215 759 -82 -1319 -3 909 -919 -505 1111 847 -1124 116 937 -410 -240 795 237 -566 236
2232 236 441 -495 -118 1062 -99 -967 431 534 -676 -122 465 -135 -724 331 543 -420 -128 379
2250 379 -51 -369 631 403 -420 -152 226 -314 -436 -41 305 -189 -484 182 -225 53 540 382 -238 91
2270I1N29l91l96M46L8k89l67K54p2K16K08r3k76r4L43l29J7M68K73o27J35K39
2292C23k43l29L91J34n45Q47k64n77J47K88k8m60L00J27k06m0M5j5j70K94J82
2313B01m38J08N16o60J86K55J28l83K92J34k10k19L16l33J50l25N55m11J65J11
2333A38l03J36o4J25K59j05n5M5j91m8jJ80k38K52j57n4J94j69M8J35n43K52M61
2356B97k30l44N82k86j64M36n78K33K04n7j11r0J58n56N05R5k50m53N24J07k18
2377a96J7K56j7l87O35L1j30j91J48k86j4J74P7l75M94j22k10P2J68l74j30N26
2399A66k33j05L80K83p97K89N27m60l31N59j3p75O16J81n79%N85m6p59N51P3l37
2421b25J01Q2K24m11K65L59n72K18M32p24m5O71l42l5q9J64n09L20L13k05k92
$$ plain form
2270 91 620 229 -167 279 317 28 -339 -85 -157 59 267 174 -102 -196 147 -182 -165 303 576 -51 84 323
2292 323 80 -249 142 276 -269 578 314 -263 -116 172 144 -316 -16 111 -95 -135 -90 -105 -275 19 201
2313 201 -237 -129 387 -273 -87 168 296 -87 205 339 129 -90 226 -107 43 -282 273 -138 27 138
2333 138 -165 -29 -93 32 291 186 131 176 -15 -63 -64 116 -122 130 -27 -81 113 -56 -8 127 -416 -164 297
2356 297 67 -277 305 19 -145 291 -287 -54 150 93 -18 -108 50 -506 -1 94 -156 -609 -85 22 -196
2377 -196 -179 77 60 -327 308 339 209 18 166 -120 -134 40 117 -258 236 114 -96 -24 144 -230 -360 166
2399 166 -67 -172 208 491 -306 -17 510 50 -281 278 265 -510 106 287 -292 -292 293 247 -512 39 112 -225
2421 -225 -124 -42 182 -229 36 395 -177 41 473 -251 -296 375 33 -2 -91 73 -436 -116 197 -8 -300
2442c00O85l54l79L19K51k12k09J35L30l01r4K90j38J11j4l17N0K65k81L74j68
2463D3l56K77M2k18J05N9k02J79K67J40m37k62N94l99L4M45j78o9r4m2l82K16
2485b38M72r0k28k1K30j69j73L33J03n84P22j29k13l60M04j56J21m1J76l41J00
2506h2O10o01n46P37k16m39K92N36q6k50K3M7k61J64K90k15o3J77n3o17L57N65
2528C69l37k21L87j48l98K52p4J15J68K65r7m50l93Q09p7j43Q33m22q91J78m7
2549c22K74J8M87l09n23K17L48o00QJ340o35o28J02L82j54l05O91l0n06J25K22
2570B02m42J30O50o14j45J06O62o63j34L13jm61O15J98p30N5O37l83k68P39Rj051
2592e76K2R71p51j74J190o2r60l6P55n52Q6M59Pp47J45O08l90l1Q55p67q40J64
$$ plain form
2442 -300 385 31 -348 -29 222 10 -199 -64 266 -35 -129 161 23 134 120 -197 -147 118 -163 211 43
2463 43 -313 -36 6 -212 -107 -48 -250 -71 196 336 -101 -363 231 -168 -134 311 133 64 -30 -72 -454 -238
2485 -238 234 144 -84 -105 125 -44 -217 116 219 -365 357 228 15 -345 59 -97 24 -17 159 -182 -82
2506 -82 528 -73 -619 118 -98 -537 -245 291 205 -45 -22 25 -236 -72 218 3 -60 117 64 -553 -196 369
2528 369 32 -189 198 50 -348 -96 -170 -55 113 378 281 -169 -562 247 170 27 860 438 -453 -275 -322
2549 -322 -48 -30 457 148 -375 -158 190 -410 -402 938 303 -325 -223 159 5 -300 391 361 -145 -20 202
2570 202 -240 -110 540 -74 -219 -113 549 -114 -248 65 64 -397 218 416 -314 -259 378 -5 -273 466 475 -576
2592 -576 -554 417 -334 -508 682 620 -340 -376 379 -173 -87 372 379 -368 -223 385 -5 -36 819 52 -788 -624
2614f24O96m25L07P61o35o45M86O67o35J44O85p75l21M18J39l69r8R23m13m29
2634a43N03m42k15J02P60m53l16N82l24k51N1O03m77k62O38L02j300K96N11k82
2654a17M72J55l15o03J88M47k90o0N29m71k69J19K95k62j20N53j82j56o4M75l88
2675f4R1N25l53o30M71K60m14o9M88k80n78M37J92l47r7L73J15p07M04N34p16
2696c65L04N90n81o69Q07M0l83K30L81k62l89M87J56q75N14L41n00j86P96k70
2716A66m25P9O81l10m20N96k75k78K26K34n16L0M27J97o48J99L91m22j29N04o0
2737B47n75L14K46l93o0L80q8j34J90k83k8K08K5J18n37M83p0j29l83L52k54L29
2759d2J6K18m09ON54n23j42N08K10m77K55O7k24n42N88K6j72j2J60j67j05K51
$$ plain form
2614 -624 72 -353 -46 715 80 -565 -79 588 -47 97 782 7 -314 104 243 -126 -224 699 286 -143
2634 -143 360 -82 -297 -195 565 112 -204 378 54 -197 -146 457 -20 -282 356 658 -642 -346 165 -117
2654 -117 355 510 195 -408 -220 227 -63 -123 406 -65 -334 -215 80 -182 -302 251 69 -87 -151 324 -64
2675 -64 27 552 199 -431 40 300 -114 -183 305 25 -553 -116 76 -271 -368 5 120 -587 -183 351 -365
2696 -365 -61 529 -52 -721 86 126 -257 -27 354 92 -297 190 346 -529 -15 326 -174 -360 436 166
2716 166 -259 -180 501 191 -229 367 92 -186 40 274 -242 -212 215 412 -236 -37 354 -68 -197 307 247
2737 247 -328 -14 232 -161 -221 159 71 -63 127 -156 -184 24 49 167 -370 113 43 -86 -469 -117 -371 -42
2759 -42 -26 192 -217 -211 343 -180 -322 186 396 -81 174 241 17 -525 63 89 -83 -95 65 -102 -207 44
2781D4Jk36K6M75k76k70K41j11Q7K0R7l89P8M02l51J95L7j05R4JjQ1o01M26K56
2806B21l29K59J45m22P7j01J20k12K0J98J23j43K71r9m42J44L65n14L75j00K00
2827A56j58L9n3l2K2p1m3K49j95J4k57L54L15p40J43J62m9J12Qq2j76K28k9R7
2851A4J72P6M9k73K3J10l20J03j62O9J66l34L55O8K0k64j9N9m09O42j21m7L9O
2875B2Q3j29P1J80l32K49k1pr2j1p9O9n8Q4pj03K04j52L01l32L91l36L0j01K51
2900A75q8r3J35j39mR8l88K71J68k75K25mMl41K34o9L20m36K59j72J81k72K24
2923A3o7J40p9q2J09L0O5j84J80P1k22j74L9J92k56%K13k1J46M4K9k16J6L33l55
2948c6J80l07K25p3J01k48o9RK75j31n4J13M6Q3k0k36q1J48O3q4m8M27m30N8j54
$$ plain form
2781 44 45 -191 -165 310 34 -236 5 -106 -19 1 98 -291 -213 189 -162 33 70 -35 59 60 59 140 -461 -35 221
2806 221 -108 151 296 -126 -49 -150 -30 -242 -222 -24 99 -44 227 128 -314 -170 195 -319 56 -44 156
2827 156 -2 37 -16 -48 -26 -97 -140 109 -86 -72 -329 25 340 -400 -257 -95 -144 -32 -24 -106 -282 -54 -83 14
2851 14 186 262 311 38 61 171 -149 -46 -208 -139 27 -307 48 116 136 -128 -147 -88 -497 145 24 -23 16 22
2875 22 105 -24 47 227 -105 144 123 116 24 13 -66 3 -55 29 22 -81 123 -29 272 -60 331 -5 25 -76 175
2900 175 87 -6 129 -10 -14 84 -304 -33 135 -140 85 81 85 -256 -22 -91 229 -207 52 -120 61 -211 13
2923 13 -54 86 7 -75 34 64 129 -55 125 196 -26 -200 -161 31 -225 -225 -12 -33 113 157 186 -30 -14 319 -36
2948 -36 144 -163 62 -11 90 -158 -227 -218 57 -74 -128 -15 31 114 94 -142 -223 -75 -12 -96 -144 283 -147 -89 -243
2973b43J12K06m6k39L97m14L16m2j75K42j50n6L07Q7l39RJ23n59L05N31qj31p7
2996A56j51l73R5N27k90j94L31k42oJ88k75J21K50O9j61l56K34J50j45q0M24m88
3018b16J40J65Jj80m3j05K01K30j53Mk48J9L82j57k03M58j40o17L96J00j33J39
3040D0R5j44j39j22K59O8J70l14R5j41K55O0k62J07N4j18N5j41N50n85L5J18p5
3063h0L3J91r6r3r4r4K97j71k41J80M01k60K62n6m3k08Q1K88k15L02l07j60k12
3086b95M03m23J14M69j49j82k40J81j42J83O57j95n3k9j85m94p9N97p0M2O5k12
3108c7k21k72N76r6O3L03p0k29j94j26%M45J74l0j22j58k91J12k3J31K11r4J46
3131A98k98L2N7j29L53l83L97j89j71K96k38K63m0J33k72J07jj28l37J49N8J68
$$ plain form
2973 -243 -131 75 29 -210 187 -227 89 47 -128 114 -36 -92 215 302 -37 -28 95 -464 -159 372 364 233 156
2996 156 5 -368 -273 254 -36 -230 101 -141 -147 41 -234 -113 137 206 45 -311 -77 73 -72 -152 272 -216
3018 -216 -76 89 90 -90 -133 -238 -37 193 40 44 -204 -185 197 40 -163 295 155 -462 -66 34 -99 40
3040 40 135 -9 -148 -270 -11 57 227 -87 8 -133 122 182 -80 27 81 -37 18 -123 427 -158 -123 -5 -80
3063 -80 -47 144 48 -45 -139 -233 64 -107 -348 -168 233 -27 235 179 136 -72 9 297 82 384 77 -83 -295
3086 -295 108 -315 -201 268 119 -63 -303 -122 -264 -81 576 381 328 299 114 -380 -459 138 68 110 175 -37
3108 -37 -258 -530 46 -50 13 316 246 17 -177 -303 -303 142 316 286 164 6 -285 -173 -196 -65 146 52 198
3131 198 -100 -68 -11 -140 213 -170 227 38 -133 163 -75 188 148 281 9 116 115 -13 -350 -201 -143 25
3153B5J18j43J5l57L24p9R5r4L30q6j03J8m45L24j21L17J43j15k66j8K14l21K78
3176E3J84K8j72j38J31l04j32J11N42j72j58K24m62K97q9J41Q9j73L53k19l11
3197a77R1K04j45K57j60j6K9l22L36m2L2k15K22J6m70L15l4j44M6L53K8l01LL3
3221f1m32L09J10K1J12J72j89O9l13K13OR6J89l67m6J26k1n3K48l5j56j31J87
3244E4k4k20K18J20O6m43J41Q1l93M16LJ12k3j68J09j53o5J66K51j84J1o7j40
3267a32J71o3r2J07K13j70l30M8K92l84J91K66Q6k53j33K32l42K03J54j6J64k47
3289c5q7L06k77K34j03J23J39k43k57J39J61k58J78m0p6J18k70J65m9j16R2K30
3311G4l8j07M2K0L3j37K42k58o9L31k19o6L9J42j10J02J00p3k3q5J32L5J4k23
$$ plain form
3153 25 143 0 15 -342 -18 -97 -2 -96 234 148 45 63 -382 -58 -179 138 281 166 -100 -118 96 -225 53
3176 53 237 265 93 -45 86 -218 -350 -239 303 131 -27 197 -265 32 -57 84 173 0 353 134 -177
3197 -177 -86 118 -27 230 70 54 83 -239 97 55 87 -128 94 110 -360 -45 -79 -223 -177 176 204 -97 -94 -61
3221 -61 -493 -184 -74 -53 59 231 42 111 -202 11 17 113 302 -65 -111 15 -6 -59 189 154 -2 -133 54
3244 54 30 -190 28 148 214 -229 -88 -7 -400 16 19 131 108 -60 49 -104 -169 -3 248 64 75 8 -132
3267 -132 39 -24 -116 -9 204 34 -296 -248 44 -340 -149 117 203 -50 -183 49 -293 -90 64 48 212 -35
3289 -35 -122 184 -93 141 38 161 300 57 -200 -61 100 -158 20 -20 -96 22 -248 -83 -132 -248 -156 74
3311 74 36 -71 -29 -9 24 -113 129 -129 -198 133 -86 -152 -113 29 -81 21 121 48 25 -60 72 107 121 -102
3335a02L6J38Q4j8j13k08KK63j81O8K08J7l49K69j56j36L08k89N0k6J02k98L83
3358E2R9j95j62K18j37L8K91K6M8j65R1k77j20K78k30N8J62L62j71n41M56J84
3380C65n23n7L95j02l58K45J00Nj00M7j47J77l54L28J26j9m79M5K06M7p7OO4q
3404f8n8J19R7k7k2k60L50k1j13o1J19l35K88o0K25m4l62L76k66N50l77M3m12
3427c19N11j71l5k38M72j81j20j34L77r5j2j60J20j99J56P7n30N08J09k42p7Q5
3449i8K74j70J9L59l51l21M82j39l95L44J26l00k7L66j44p6j59N83l85K13r0j84
3471g3j54J72J20m75J71K61J34k12L78M5k31J5K39m01m93N42r3m20N10R0k02j56
3493b33J58L26k38nK61n73L54j13O1j45J33J21l39J92L5j14N9k29K54k0M3K07
$$ plain form
3335 -102 -66 72 156 138 25 -183 -181 82 -99 -31 177 194 -155 114 -42 -178 130 -159 -109 -135 -33 -331 52
3358 52 151 -44 -206 12 -125 -87 204 230 278 113 204 -73 -193 85 -145 -87 75 437 266 -275 181 365
3380 365 -158 -215 180 78 -280 -35 65 70 -30 17 -130 47 -307 21 147 128 -351 -306 -100 -53 -130 -124 -60 -68
3404 -68 -126 -7 90 63 41 -219 131 110 -3 -64 55 -280 8 -52 173 129 -233 143 -123 427 50 93 -319
3427 -319 192 21 -14 -252 220 39 -81 -215 162 67 55 -105 15 -184 -28 49 -481 27 136 -106 -183 -98
3449 -98 176 6 25 384 33 -288 194 55 -340 4 130 -170 -197 169 25 -51 -210 373 -12 201 111 -73
3471 -73 -227 -55 65 -410 -239 22 156 -56 322 367 136 151 390 -11 -504 38 -55 -475 35 125 -77 -233
3493 -233 -75 251 13 8 269 -304 50 -63 -2 -147 -14 107 -232 -40 -5 -119 -60 -289 -35 -55 -12 195
3515A95q6n19N7L34l71K61L55j22l21L10K30n46j74O95j98l06M01k46k81K05N04
3536C77m30l07P36l31k47k51Q57k98l39N63j06n15J94N48p86j81N43L1l91L87
3556E4K10n85j61Q51l14k93L13M50p54k4L72l01MN39J83o31k39P02p70k59Q36
3577A83K56o51o6M17n13l39P39K75p15N99M06q20k84P68j32l68M35J58m25l17
3597c94M00p2k40L73L12n66l65O41J68p57O89L76n25k43M31k48l48Q74k21m82
3617a97J93K83l74j88J75L04m62j02R45n87l44N50J79p11P8M84m01q6M87K38j037
3638e73L62M01j78j13L91P7j049L91O08l67j12L84K11j016M35L18m25j8N27L7
3658B91m78K9L36m13m0M86R4o48M72L1n43K27L51l40k28N05L03o41j9L31N8k07
$$ plain form
3515 195 109 -410 -353 -19 -390 -129 226 104 -217 93 323 -223 -397 298 100 -206 195 -51 -332 -127 377
3536 377 -53 -360 376 45 -202 -453 404 106 -233 330 224 -291 -97 451 -335 -516 27 58 -333 54
3556 54 264 -321 -482 369 55 -238 75 525 -229 -253 119 -182 -178 361 544 -87 -326 376 -394 -653 183
3577 183 439 -212 -278 139 -374 -713 26 301 -414 185 591 -229 -513 255 123 -245 190 348 -77 -394
3597 -394 6 -66 -306 67 379 -187 -552 89 257 -500 189 565 40 -203 228 -20 -368 506 285 -197
3617 -197 -4 279 -95 -283 -108 196 -266 -368 577 -10 -354 196 375 -336 -258 226 -175 -261 226 464 -573
3638 -573 -211 190 12 -101 290 367 -682 -291 317 -50 -162 222 433 -583 -148 170 -255 -273 254 291
3658 291 -187 -158 178 -235 -275 211 305 -343 129 160 -383 -156 195 -145 -373 132 435 -206 -225 106 164 -43
3680d3L56J49q26L43K39l44l05M51M18l81j81K94j93l01M83L21q05M26J03m80
3700b76k8N11q4l49K05N01m75m82N69r5k77L42K79k49l30N73j17o33N58L21o36
3721a72j0N66k53m44J3N44m09J6K72k68m8L09J09k99m22P93k05m60K10K96m45
3742c07J06O08l39j93M64k11n28J50O52j87l42L74J6l86J32O4L8j38K56k22k91
3763b84L89n5M8k47M93k0k96r4L67o49J39M77j44l84J11K69j28j19J72O5l29N0
3785a69M28j01k36J07K6k65K84j49p9J71K29j36l05M6M29l88J23j8R3k5r1K53
3807B27q7l98R5K59m1J05o2J78k37Q0l21M03k53J46P2q4P5l59K54J18n4m20L20
3830A6r1M09m07J18rJ78k26o8O9k7qJ44k86L95j18p1K1Lj51M38m26j68J88M4J3
$$ plain form
3680 -43 313 462 -364 -21 218 -126 -431 20 438 57 -124 170 -23 -324 159 480 -325 101 204 -276
3700 -276 -304 207 123 -226 -21 480 5 -477 92 -3 -280 62 341 92 -238 335 218 -415 143 464 -172
3721 -172 -182 384 131 -313 -300 244 -165 -149 123 -145 -193 116 225 -74 -496 297 92 -368 -158 138 -307
3742 -307 -201 407 68 -125 339 128 -400 -250 402 215 -127 247 263 -123 9 73 111 -27 229 7 -284
3763 -284 105 50 98 -149 344 324 28 -66 301 -348 -209 268 124 -260 -149 120 -8 -127 45 110 -219 -169
3785 -169 259 158 -78 29 55 -210 74 -75 -154 17 246 110 -195 -149 280 -108 15 -3 90 65 -26 227
3807 227 140 -258 -163 96 55 160 98 276 39 119 -202 201 -52 94 166 82 157 -202 52 170 116 -304 16
3830 16 -75 334 -73 45 36 214 -12 -80 -11 -38 -46 98 -188 207 89 18 39 42 -109 329 -97 -265 -77 -33 -20
3855b0J28J52N9j01k22J13l2O3m12M00j05k2p8L14j03m6K0k11j12m9K83Rq3K43
3879A88m6qK77k40j06j49J81k72K63l09K38j87N0J69j66Q1j43K61Lj89M6K11j83
3902c0J47j19J62l04K05O5q9P8n9j19P0O5j42j12M71k44k43J08K81k36mP7J3j68
3926a27p9j32N33k44J08L6l3Rp9Q9n5j00J28m2r2J68N6m8K8j27r7J0K03rj07K46
3952B43k12l77L26o7j8j18K53k05J23K89j25l64K93K23k78j37L50k00J46N4n1
3973A48l16J32k43L70k67o6J84k73K61K62j83m47M60M78n05p6Q4n4J90l10K76
3994A05j92JMK36l58J39J73j52R4J19m3J07l81J62r7PK81k47r2L82p5l27M55k04
4018I7J6l87N14j40l28K01j53P6Q1J01l18K52n9P0j28K28j13K73m22J41J21n11
$$ plain form
3855 -20 108 260 319 218 -4 109 77 140 -272 128 23 1 -77 237 134 88 108 -103 -215 -264 19 28 -55 188
3879 188 142 134 411 171 65 -84 97 -175 88 -221 17 -170 -120 49 -117 -36 -179 82 85 -104 -58 153 -30
3902 -30 117 -2 160 -144 61 126 37 115 56 -63 7 72 -70 -182 289 45 -198 -90 191 -45 -49 28 41 -127
3926 -127 -206 -338 195 -49 59 95 62 71 -8 81 26 -74 54 12 -80 88 144 96 124 -3 -100 -90 113 104 -3 243
3952 243 31 -346 -20 -87 -105 -223 30 -175 -52 237 112 -252 41 264 -14 -151 199 -1 145 199 148
3973 148 -168 -36 -279 91 -176 -242 -58 -331 -70 192 9 -438 22 500 -5 -81 3 -51 139 -171 105
3994 105 -87 -86 -82 154 -204 -65 108 -44 50 169 126 233 -148 14 -83 -76 205 -42 -134 248 173 -154 301 97
4018 97 113 -274 240 100 -228 -27 -180 -104 -23 78 -240 12 -47 23 -105 123 10 283 -139 2 123 -388
4040c88N18j46o0k19M16k91j39K28L11j10j68O2O1k84J89J71q8j84L75J68o83
4061b61P9K10Mk86M24j08k19K00K50k40j20J45J99n53L81J46n55J95K79j45J24
4082A49j78O6j25l0K21r6o9M5L9m5J39j95p9Q8K9O6j85L6K51n48L24m7M67k88
4106C5k65M10l57J09M1K67n46K43L15l46J94R9k82k36L02K39j88j61K58R4j16
4127A09k20l1L16k39J56n2l41J8K27j53J45J01J31k32k49M79j00P1n2k5k92K87
4149E4j1l70L65J86k58K00n8j35j07L8L68l97K19J22j3j15r6J84m15R3L44J01
4171B99n85M02j26K05m41P7J25k86M00r7o2j97L30p6K83j59K7k53oJ85O6l54J95
4194d8J71l71jL69j14m5K35O0k78q6L96k40k85J71K39l53K95P4l53l01N97j6r4
$$ plain form
4040 -388 130 -16 -76 -295 121 -170 -309 -81 230 120 -48 14 75 -209 -20 151 63 -121 254 422 -261
4061 -261 -182 28 32 -254 170 62 -157 43 293 53 -67 78 277 -276 105 251 -304 -109 170 25 149
4082 149 -29 37 -88 -118 103 7 -62 -17 22 -23 116 -79 -158 -70 -41 25 -160 -124 127 -421 -97 -144 323 35
4106 35 -230 180 -177 -68 -27 240 -306 -63 252 -94 100 199 -83 -319 -17 222 34 -127 131 225 109
4127 109 -111 -142 174 -65 91 39 -302 -284 -57 -210 -65 36 167 -65 -314 165 65 136 84 59 -233 54
4149 54 43 -327 38 224 -34 166 108 -27 -134 -96 272 -125 94 216 203 88 -8 176 -239 -146 198 299
4171 299 -286 116 -10 195 -246 -169 -44 -330 70 -27 -89 -286 44 -32 251 92 119 -134 -140 45 111 -243 -48
4194 -48 123 -248 -249 120 6 -39 196 256 -22 -108 288 48 -237 -66 173 -180 115 189 -164 -465 132 116 22
4217B2M28j19n00L23k70J33o3K94j79k24K00P6k12j89L52R9j28KL36l16j02Q3
4239D6j24p5l5N88n49J02m0K91j95k51L70m63M07J4m1j58R9J11k42K05nj29M6
4262b8j04J65P0q4r7R0j21j44L88k77N8J27j9m10P35l94r5J53K1K99k16j55P3
4285C5Q6j78j13J98j16J38j09m60K29L67n0j32K79j14m77O7M22j99J36J67J1n3
4307A34J03k25j37L13n4j28j34J52r1M1R5M6l47M54K1j35q6k29K88j21J05J88
4329B53l97j12J88l6j25J09K54j09qJ51k22J51j88J43Ok67K16k34J37Q6K8K4J61
4352B09Q6k41k74L18J7n3k43K14k01N5P5j64J73N8P0k5NJ11k05j05J76J28l09
4375a25J54l5j40L11j60k04K01r2J37r1J78j73q9p9L20j61R8l7q7J18k2j5K15
$$ plain form
4217 22 450 331 -169 154 -116 17 -46 248 69 -155 45 121 -91 -280 72 171 43 45 381 65 -37 46
4239 46 -78 -153 -188 400 -149 -47 -87 204 9 -242 128 -335 72 86 45 -113 -14 97 -145 60 55 -74 -28
4262 -28 -132 33 103 19 -78 12 -109 -253 135 -142 -84 43 24 -386 349 -45 -140 13 34 333 117 -38 35
4285 35 121 -57 -170 28 -88 50 -59 -519 -290 77 27 -105 174 60 -417 -350 72 -127 9 176 187 134
4307 134 237 12 -125 188 134 6 -128 24 -67 -26 69 115 -232 222 243 108 22 -207 81 -40 65 253
4329 253 -144 -256 -68 -104 -229 -120 134 25 17 168 -54 97 -91 52 58 -209 7 -227 -90 -4 24 48 209
4352 209 295 54 -220 98 115 62 -181 33 -168 -113 -38 -202 -29 29 99 74 79 190 -15 -120 56 184 -125
4375 -125 29 -6 -146 165 5 -199 2 -90 47 -44 134 -39 -128 -207 113 -48 50 13 -74 44 22 7 222
4398B22k65l3Q9J41l65J69Kj41MK01j24J40j29J31J01k36K0L3K15k45J16n0P3
4421F9j12K59m77J54L1J16J22l20P6j89K51J41N9j20j98J98k32L44l1L0k56r1
4443a76K28j07K2PL82o00N30j16k05p3K44J88n19K13J64l51K16k70J92j83K43
4464B9q9n1J6O2l8N7J93k49k12K22M5r5O8o3N07m88k28M98l51j0L54j5k66J06
4488BK85l93J6J15rk29K88p4j08j6K47m2k78L02J08l13k08L13Q3k41K77j68j47
4511a90j17N55k82k75L06J50m85J97L34o4n52N25K50o30L80j13J2k70K40K48n16
4532b97n8Q16o98M9K22q9k53L04J99m37O0N59m18M7K62p0l12qK50J36m98M03K69
4555D38m39j13L55L4m22J50J25m39K31L81k23k75N05j24m33p2N72j96j81M99m01
$$ plain form
4398 222 -43 -76 13 154 -211 -42 -40 -181 -177 24 -100 40 -89 42 143 -93 -73 -40 175 -70 46 -4 69
4421 69 -43 216 -261 -107 -76 40 162 -158 -82 -271 -20 121 180 60 -138 60 -172 172 141 171 -85 -176
4443 -176 52 -55 -33 -26 356 -244 286 170 -35 -108 136 324 -195 18 182 -169 47 -223 -31 -214 29
4464 29 -60 -111 -95 -33 -71 -14 179 -70 -282 -60 -15 -110 -42 -105 402 -86 -314 184 -167 -177 177 162 -104 2
4488 2 287 -106 -90 25 16 -213 75 1 -107 -123 124 82 -196 106 214 -99 -307 6 89 -152 125 -43 -190
4511 -190 -307 248 -34 -309 -3 147 -338 -141 193 129 -423 102 352 -278 102 -11 1 -269 -29 219 -297
4532 -297 -355 461 -237 -188 34 -55 -308 -4 195 -242 -182 377 -41 6 268 198 -114 -122 128 264 -234 169 438
4555 438 -1 -114 241 275 -147 3 128 -311 -80 301 78 -197 308 184 -249 -321 251 55 -126 373 -28
4576b8j55K66L58p46j1O06J57r36M22K46k89k40L70K3n02M91L26l98K23L82p29
4597a64j31N90o8k97j53N08k79m28M46J75n70J73O75n28k87N14J08p83M17N76
4617D94l12n37N96o3o24L00K29j68m78R26k46n12O26j43k72j69O63l89m2K7L05
4638B11l41j9L06pk62K21M4n32K91K43j21l42N12P1p08M70Kj3o27O45J07l62n7
4661b68N72l16m16N43R8n43L71K77j51m46M09L16m05r1M29n23k69O54O1m92n4
4682b44N27k51n4L24k00l53J61N48p73K6M97j60l81J64L48l40j64L50J27m75K16
4703a07O24n37k16M49j30l99L95K46m98J71L08k70k20M5K65m15J99J93p4k33M39
4724B35o1l31J60K88j01l93K75J27l08J4N02m38k9MK91k60j09M11m38j60M53m1
$$ plain form
4576 -28 -183 83 441 -305 -316 290 447 -489 -67 179 -110 -350 20 43 -459 32 358 -40 183 565 -164
4597 -164 -295 295 227 -70 -223 285 6 -422 24 199 -371 -198 477 -51 -338 176 284 -499 -82 494
4617 494 182 -355 241 178 -446 -146 83 -85 -563 363 117 -395 231 88 -184 -353 310 -79 -121 -94 211
4638 211 -130 -149 157 150 -112 109 153 -379 -88 155 34 -308 204 275 -433 37 39 26 -601 44 151 -211 -268
4661 -268 304 -12 -428 115 213 -330 41 318 167 -279 130 446 41 -50 379 -144 -413 241 302 -190 -244
4682 -244 283 32 -22 302 102 -251 -90 458 -315 -289 208 48 -333 -169 179 -161 -325 25 152 -323 -107
4703 -107 517 -20 -236 213 83 -316 79 325 -173 -2 306 36 -184 -139 126 -289 -90 103 29 -204 235
4724 235 174 -157 3 291 190 -203 72 199 -109 -95 407 -31 -60 -56 235 -25 -134 277 -161 -321 132 91
4746I1k24K47L64q30K66M18m15j57L73p1j11j68J34L6j89M56N0k69j53L35j89
4767fr1J03J2l1Q3J57j69k24jL90l23Q5K19m30j24J21L72k41K01Q8k97K97j77
4790A4p2M40k51M4p0J5p0R7j12Q2k03k60L19M6J53k31r7J59P8k37J10J79k35J45
4814D3p2N3q5J72l12K14m7m1J97l40M75m11J07j99K68K19l46Q9j92L50L2m48M3
4837b31J08L21Q3m52n5N01l46J44r7K68l29J78k25j78K18N0o3J31k54L14Ml13
4859b23M28l09J65j24r7mL5j8R7m5J31m3J40j65N0Lj96K71K66k31n60M79j57K46
4883A39k41J77kQ6O4l45J85j62J51P5l03J45J4r0K18k12J12p2N07l50m3J71k30
4906fj17J60K35k75J54l53n3R6J3M32n98N20k02J24k07J32J2K2P5j27n13M78o8
$$ plain form
4746 91 -133 114 478 -352 -86 332 -83 -240 133 62 -49 -217 -83 -47 -236 220 270 1 -152 183 -6
4767 -6 -97 6 18 -13 70 227 58 -166 -167 223 -100 -15 204 -226 -350 -229 143 -98 103 191 -106 191 14
4790 14 -58 382 131 175 105 120 50 147 35 117 -86 -346 -27 19 172 -59 -156 3 81 -156 -46 133 -102 43
4814 43 -29 24 -61 111 -201 13 -34 -75 122 -218 257 -154 -47 -246 22 241 -105 -16 -208 142 174 -274 -231
4837 -231 -123 198 281 -171 -226 275 -71 73 -24 244 -85 93 -132 -310 -92 -42 -105 26 -228 86 90 -223
4859 -223 205 -104 61 -63 -160 -164 -129 -147 -50 -95 36 -7 133 -32 18 21 -175 96 362 131 -429 50 -107 139
4883 139 -102 75 73 159 223 -122 63 -99 52 127 -176 -31 -17 -107 111 -101 11 -61 446 96 53 224 -6
4906 -6 -123 37 272 -3 151 -202 -255 -159 -146 286 -312 208 6 130 -77 55 67 89 164 37 -476 2 -66
4929f6q3J29j52J88J65n14M26P0r4j31L47k42J81m3k74J77L4j45K25l81K52K08
4951B77j83k38K79j27l84K99l3J37l13K85m6N9J86l81K23j11R9k07M37l31Q2p
4973BJ70k67J63rj62J02j76L26p8K1j12j18K30J7k14J57k38K41j73M4Qj19oK41
4997E0J56k63J63k65R4k9K41k12j07q3J37p5J98N5j71L18k28L58m75N8m1J87K1
5020H7m4l5np1K80m6n33J64L23l30J07P6J94j98J12m8P7j47JM4q0o0j03L43p7
5045C1J7J69k75j3R1j74L66j98KR2j37K27q6j20J27k82k7L9N55n10J38L29l59
5068BJ96j51J03l68K53J19m05m7L37MN1K1K9k7j60J83j66n6L1R8r8O2M0qN8R3
5094A94q6k03M2n7L2J88K3qj70J04Q7j2j80j45K82j87r0L03p7kM2j67k0K09j09
$$ plain form
4929 -66 -149 -20 -172 16 181 -333 93 163 69 -62 285 43 224 181 -93 84 118 -27 198 -183 69 277
4951 277 94 -144 135 8 -376 -77 -110 27 -286 -1 -47 12 198 -183 40 -71 28 -179 258 -73 9 2
4973 2 172 -95 68 59 -103 -1 -177 149 71 92 -20 -138 92 109 -105 52 -186 55 -118 -74 -66 -185 -191 50
4997 50 206 -57 106 -159 -65 -94 147 -65 -172 -255 -118 -193 5 60 -111 207 -21 337 -138 -80 -121 66 87
5020 87 43 8 3 -68 212 166 -367 -203 120 -210 -103 -27 167 -31 81 33 110 -37 -36 8 -72 -132 -235 108 31
5045 31 48 217 -58 -71 20 -154 212 14 16 108 -29 198 112 -8 119 -163 -190 -151 404 -106 32 361 2
5068 2 198 47 150 -218 35 154 -251 -298 39 43 94 115 144 117 -43 140 -26 -82 -51 47 -51 11 51 43 101 194
5094 194 108 -95 -53 -110 -78 110 133 125 -45 59 146 134 -46 -191 91 -96 -186 117 40 38 80 -87 -107 102 -7
5119gj83R7J02j06r5L55l88K10k6N5J70j84MO6j39Jn2N26n31J13o2k8P1K21o7
5144A23l56M4Q7O4J12Mj31j4J49k6nQ2j53J63l04L9K83k84L41j30J1l00N77j71
5168B05l3j70J14K75n71L84l33M42m08K29m3k0k00K59p4j14n6J47q3KK71k25j13
5191a15J70J18Nk54M1K22k05K92k63n1R7o3l0o1l5J44J0r5Q6j00oM92k18m40M79
5216B20kk38j10J63j38J37J28k22K90m1l31J92nl94L33j20j3N3L21m25J74J80
5238A52k11P2J29j63k2j0j25J92o7j02K97j41LJ49j27N8j2l06K41K77r3k63Q0
5261Ho6j95Q7K8J35r0L52k42J38j59j25K41k4R6j63k79M83k24l7j3k7j9K33k35
5285i7p9R5l0Q7O2j86L73m41L07l03J0J36k2k93P05p9k92J62k21K01j99M9K4M0
$$ plain form
5119 -7 -190 -93 9 -97 -192 163 -225 -15 -41 14 184 0 4 70 -69 -68 -120 406 -125 -12 -74 -102 -31 190 123
5144 123 -233 -189 -102 -38 74 78 -53 -67 82 56 51 133 -20 143 -161 -122 161 -123 218 88 99 -201 376 205
5168 205 172 2 116 391 -180 204 -129 313 -95 134 91 71 -129 130 56 -58 -114 33 -50 -48 223 -2 -115
5191 -115 55 173 178 -76 -35 187 -18 274 11 -40 57 -6 -36 -97 -132 12 22 -73 13 -87 -93 399 181 -259 220
5216 220 218 -20 -130 33 -105 32 160 -62 228 187 -144 48 43 -351 -18 -138 -151 -98 223 -202 -28 152
5238 152 -59 13 142 -21 -43 -53 -178 14 -53 -155 142 1 4 153 26 84 72 -234 7 284 191 -72 8
5261 8 -58 -253 -166 -138 -3 -93 259 17 155 -4 -129 112 88 184 21 -258 225 1 -36 -49 -76 -95 138 -97
5285 -97 -176 -81 -111 -24 38 -148 225 -216 91 -212 -202 -66 -88 -381 324 245 -47 115 -106 95 -104 -55 -31 9
5309IK93m97L17O1j76j66M23j11k27l2l3L0j84K73k69M09N4j27L04m49l6J18L0
5332A4N3K3p1K8j86J08j72J90R2k56J03j62J07J17K0k48J08K02q1P3N4Kk26L49
5356B41l17j02K0Q9k4K8K2J33%l53L15m1lR8k04J09j52M7M14m40Q1L2l1J28J74
5381B64j80j59K39q3Rj67K18k87M19k56j09qP4j07K86m0j4p3j33Q6J2L7j3p9N1
5406a3j65K93l20M8LP0L40j35j48k63N18n26J81j53K21k39J68O4k1K96k36M74
5428D57n01r4K65j30k19L57l01K40j54L11k65j99L74j88J64j83r6j6L87k29J05
5449H5j01J83j12J2J24k58J77N0j84J04k19N1K37j79J6J13Q5j26j87J47N3K13
5471B84m54J07q8J16p5n8K74k71K72j10L7j2L90k30k23J17J01n91K73J03J27O5
$$ plain form
5309 9 302 -195 122 183 7 -159 264 153 -74 -106 -139 -109 -293 -20 -289 120 174 47 351 -98 -134 -16 14
5332 14 67 90 19 47 -139 -31 -203 -13 79 -177 -74 -236 -129 -12 8 -240 -132 70 -11 62 116 118 -108 241
5356 241 -76 -178 -158 -69 -93 -65 -43 90 90 -263 52 11 8 106 -98 11 -141 -94 320 -120 -39 -7 -38 90 264
5381 264 84 -75 164 81 90 -77 141 -146 273 17 -92 -100 -26 -133 153 113 99 26 -107 -21 -9 28 15 -64 -13
5406 -13 -178 115 -205 -157 -154 -84 256 121 -27 -290 228 -298 -117 -270 -49 -288 -120 -56 -77 219 -17 457
5428 457 -44 -138 127 -3 -222 135 -166 74 -80 231 -34 -233 141 -47 117 -66 -162 -178 209 -20 85
5449 85 -16 167 55 67 191 -67 110 160 -24 80 -139 -88 149 -30 -14 99 184 58 -129 18 71 284
5471 284 -170 -63 -151 -35 -110 -168 106 -165 107 -3 34 22 412 182 -41 76 177 -414 -141 -38 89 154
5493A54j79K2r3L02k93K3M7O7k11K0K22r0lK1L10k03N2O5k01J8n7j05oj75M06
5518A13J29l73K72J1R0o18M39l97M81j33K24j36l08K89j46m3P3k3O9j77l1K36
5540D1k28m9L24j85J23K15l66L24k51K35j48j69M41j71k80K63j6p3k34L51j67
5561b0j19K68J2l88L79J84l94M3J5K17O4j16n5j29oK24O0m16L70J84m89J3J56
5584E7j14j02M00k74n8K65P0m82L30M8Pl67K92k0Nl98K64J39m13K29K93l74p3
5607b76L78Q8k88q5M48k44j92J69K71l68J45M41n71q6M11m17K84k47R9n7J12J03
5629A18j14j57J54M55m27J07j48P1k35P4J85n6o7Q9j40q6K21j80l15O55k85k8
5651a09j63L41k9m47K31K07J0P3o5Q8m64M72k1j85K15k0o8J8J23k31k52J9M45
$$ plain form
5493 154 -25 -3 -96 206 -87 -64 -17 50 -161 -141 81 -9 -12 9 319 116 168 233 32 50 -7 -112 -118 -293 113
5518 113 242 -131 141 152 242 -376 63 -334 147 14 238 102 -206 83 -63 -106 -33 -56 13 -164 -195 41
5540 41 -187 -236 88 -97 26 241 -125 199 -52 183 35 -134 307 136 -144 119 103 30 -204 147 -20
5561 -20 -139 129 141 -247 132 316 -78 -35 -20 197 261 145 90 -39 -45 179 239 -177 193 377 -112 -99 57
5584 57 -57 -159 241 -33 -91 174 244 -238 92 140 147 -220 72 52 57 -341 -77 62 -351 -122 171 -203 -276
5607 -276 102 190 -98 -183 265 21 -171 -2 269 -99 46 487 -84 -170 241 -176 108 -139 -40 -97 15 118
5629 118 4 -153 1 456 29 136 -12 59 -176 -102 83 27 -40 49 -91 -177 44 -136 -451 204 -81 -109
5651 -109 -272 69 40 -407 -176 31 41 114 49 137 -327 145 124 -61 154 134 66 84 207 -24 -276 -257 188
5674A88m28k4K63J22l40K73O8j60n4R9J06j73m1L30q4j79J9n8M3j04M03j68j38
5697c7J58k55Q6N5n9o3n1M66k50j03P1J64k2j53j40O0j75L90r7n28M69P7k71J97
5721a1K6P4k08j37N74j36k33Q6J34k58j68M29j71l89N87m5m40K0L98m02P2l0L41
5744A13k13N18j09m02J59l3r3k46N21j77j92j00L48p5K02r6P8k57K63l83K24k64
5766b14k6L77j4k7k0j15j30J89p1J70j5n7K45n29N60m00J42q8N1k62J61J66j81
5789h8k20M32R3m8k10JR6j1J01r0m8j70Q9p8K19o1p8K37m37J57j48J56j4L34j78
5814C6k98N58j1j3j73j98p3L06j85J13l4j59R1M4q8J95N6k78L35k31r3K34k98
5837a64J79k13K20q9J37J60J4k25k09M5L52k91J10K74l67L9r5J6K78j30j29K07
$$ plain form
5674 188 -240 -264 -1 121 -219 54 122 -38 -92 7 113 -60 -101 229 145 -34 -15 -73 -30 -134 269 101 -37
5697 -37 121 -134 -48 7 -52 -115 -166 300 50 -53 18 182 160 7 -133 -73 -248 142 45 -483 -14 63 -208 -11
5721 -11 15 89 -119 -256 318 182 -51 35 169 -89 -257 172 1 -388 199 154 -286 -266 132 -270 -198 -228 113
5744 113 -100 418 309 -93 66 33 -60 -306 215 38 -154 -254 94 19 221 125 203 -54 209 -174 50 -214
5766 -214 -240 137 123 96 76 -39 -169 20 -51 119 104 47 292 -237 323 -77 65 -23 28 -234 -73 93 -88
5789 -88 -308 124 217 169 -41 -40 56 45 146 56 8 -162 -73 -151 68 7 -71 166 -271 -114 -262 -106 -120 214 36
5814 36 -262 296 285 272 99 -99 -172 134 -51 62 28 -131 -40 4 -84 111 167 -111 224 -7 -100 134 -164
5837 -164 15 -198 22 -67 70 230 244 19 -190 -145 207 -84 26 300 -67 -28 -123 -107 171 41 -88 119
5859A19k7K2J83j09k13ll45K4J06J14K38m02L88k29N9J07k08J45J33p7j67Q9J11
5882E8k23J59L0J67j63q3K20k14k35K16K16k76M49l72k9l11M93j03MN7M8k1j98
5905a11R2p6L2J10n0j70J12J99k91l3J9J76k03j04M08J38k3m5j52j37j19M80m42
5928a90O2M44j22k07R4Q4m75M77j09J28l20N53k82n08N5K54J37n4K83j54j99q7
5950a36J74mo2L5K41j88l5jJ31j63J71j39m94N17j82J68q4j58J42j47m8K54j55
5973a63O6K66r6j26J84J36k75nN0r3rL2L88n26J78J68j23r8J1M2k03k06O06l23
5997a19K41p4R5j09Q6k66K91k36p3L57k21r7L26l93j3L06r3l24N20r9m64L82J19
6020A42k9l07K52k50K28l01L28l50R8K64r8Q3k03M45l90J80Ok23j68L77J05k96
$$ plain form
5859 119 92 114 297 188 -25 -28 -373 -349 -243 -129 109 -293 95 -134 -75 32 -176 -31 102 25 -142 -53 58
5882 58 -165 -6 24 191 28 -55 165 -49 -284 -68 148 -128 321 -51 -80 -391 102 -1 3 60 108 87 -111
5905 -111 -19 -95 -63 47 -3 -173 -61 138 -153 -186 -167 9 -194 -298 110 248 225 180 28 -109 -228 252 -190
5928 -190 -128 316 194 -13 81 165 -310 167 58 186 -134 419 137 -371 -316 -62 75 21 304 150 -49 -136
5950 -136 38 34 -28 7 248 60 25 24 155 -8 163 24 -470 47 -135 33 -51 -209 -67 -214 -262 -8 -163
5973 -163 -97 169 73 -53 131 267 -8 -13 37 -56 -65 -33 355 -171 7 175 52 -46 -35 7 -196 -402 204 -119
5997 -119 122 48 143 34 120 -146 145 -91 -164 193 -28 -125 201 -192 -205 101 8 -316 204 105 -359 23 142
6020 142 113 -194 58 -192 36 -265 63 -287 -189 75 -23 60 -143 302 -88 92 98 -125 -293 84 189 -107
6042a07J61J19L65o55k43Q05m00j20M8R6j59L02k32j23K35oj24j60J81N0oj34
6064a07J68j60J40l05M22j00J38k89L65p12L75m2k4MK96j29k32J69O8k76J64o
6086g3j39R7J95n0K5m8k8j89j45L36k3m3J05J97k19k24L62K68m63J36Pq0l7K88
6110B55l75mj47L11j43O0J65m51K05P4J72j83J94j03K31l88L34j11k66K9L80l12
6132g3k72O20O9m46J33R2j17k4K12r3k77J69oJ66k84N05k7p78N73j51j7j96J00
6155a22M11l69r1K54j31j33j06K02J3J48k9j77o6L24j90j33L26j44J0pK7J52j48
6178B1J2J60j34r0J48n2l63K16J23p9K00M0l74nJ79M1k06K19M3j13M0K33k98k81
6202c20L88L8k40k1M15j73l57L38J3k60K88J6l18M0N3P4j53J41p7j00J30L6L96
$$ plain form
6042 -107 54 173 538 -117 -360 445 45 -75 -27 69 -90 212 -20 -143 92 86 -38 -198 -17 33 27 -107
6064 -107 61 -99 41 -264 158 58 196 -93 272 -440 -65 -107 -131 -127 169 40 -192 -23 45 -231 -67 -73
6086 -73 -212 -115 80 30 55 7 -21 -210 -355 -19 -42 -85 20 217 -2 -226 136 404 -59 77 84 4 -33 255
6110 255 -120 -124 -271 40 -103 -43 122 -329 -124 -50 122 -61 133 30 261 -127 207 96 -170 -141 239 -73
6132 -73 -345 275 344 -102 31 123 6 -18 194 101 -176 -7 -13 153 -131 374 347 -431 142 -9 -26 -222 -122
6155 -122 289 -80 -171 83 -48 -181 -287 -85 -72 76 47 -130 -196 128 -62 -195 131 -13 -3 -10 17 169 21
6178 21 33 193 59 -31 117 65 -298 -82 41 -38 162 202 -172 -177 2 43 -163 56 99 -14 26 259 -39 -320
6202 -320 68 106 -134 -155 260 87 -270 68 81 -179 109 125 -193 -153 -100 -26 -179 -38 -115 -215 -85 -49 347
6225C47l08q5M5j0j59R3J28l06J99L32n37J84p8K97l94P2J09P0M19k80J51k39
6247E0m8Q5j40OR9k23K37k04k5K91j02j17K79J8j77j85K5J30j01j24J94K30Q6
6270B84n02K57j3k76J05L49M8k64pK8j5m7j70K21m89K90kK67j86J09J84j66R7
6293A02q5Q3l17K22J66K2j60K40n80L43o0m7O3J52O7k27r7K33q9K68m81K5K27
6316G0k41M14j36L9k40J04J82m78M04l41J94L8J9k88L69j01M9k72L8Q0L18k11
6338A0j19r3J94J59j01P8k39J14k46N87l11J95R4k09L5J11k64k7j48R2K62K29
6360D03n91K67j81L60k99p8J04J04o56O00J2k28O41k54J31m41J81l43P0M6K21
6381F9j02J28j27O4j83qO9K76k90l7K11pN4R5n59J21K08P8k66N09n34J44K39q4
$$ plain form
6225 347 39 -46 -1 -11 -170 -77 51 -255 -56 276 -261 -77 -155 142 -252 -180 -71 -1 418 138 289 50
6247 50 2 87 -53 -47 52 -171 66 -138 -163 128 26 -91 188 206 29 -156 -131 -1 -102 -226 -32 198 284
6270 284 -218 39 26 -250 -145 204 252 -12 -19 9 -6 -53 -223 -2 -491 -201 -203 64 -122 -13 171 5 102
6293 102 17 100 -217 5 171 193 33 273 -307 36 -24 -71 -8 144 211 -16 -113 120 31 299 -182 -157 70
6316 70 -171 243 107 146 -94 10 192 -286 118 -223 -29 9 28 -260 109 8 57 -215 -177 -97 221 10
6338 10 -109 -202 -8 151 50 128 -111 3 -243 344 33 228 322 113 148 259 -5 -32 -180 -88 174 403
6360 403 -188 79 -102 258 -41 -119 -15 89 -567 33 45 -183 458 204 335 -106 75 -268 -198 -152 69
6381 69 -33 95 -32 32 -151 -159 -90 186 -104 -141 70 63 117 212 -347 -226 -18 60 -206 303 -231 -87 152 68
6405F8j48J91j35j9q7j30K87k9J5J60j12m04M08N4j63r3o1K47k72J65M7k02K47
6428C4k70L76j69O3J9M4j11j42J73J59k20m0j5P9J58n8o7j08K24j11M8l69K60
6451d3M5J50J17j73l84M49n5j06N1k10J17MJ02m19L25j46K14Nj07J74On4j13K28
6475A77j79j6j07q3K3L93j0j18n8K39m95K30k26k35L31J46j60O4R9k23L92l83
6497a99J00J24m61N59l22P3J51n7p5P8J2N7n2Q7m5J38j51J1L8O4j08J38l54K47
6521E3J75k85j5j91K22K59j67k00K34k11J99n3k16L38j30j87l8L12j1J49l55P7
6543d1O1k38J65K1K28m38L25q3R8N5n5j02l5J90M5k15J36l4j22J19J00j67l61
6566c48L61Kl02K43j8L5J51PJ15k27J36j44j90J76n7l4o6J77j18L01r3j77M54
$$ plain form
6405 68 -80 111 -24 -43 -130 -260 27 -2 13 173 61 -343 65 119 -44 -137 -198 49 -223 -58 -11 -213 34
6428 34 -236 140 -29 34 53 97 -14 -156 17 176 -44 -84 -99 -20 138 80 13 -95 129 18 66 -303 -43
6451 -43 2 152 269 96 -288 161 106 0 51 -159 -42 -38 64 -355 -30 -176 38 43 -64 110 116 62 -51 177
6475 177 -2 -18 -125 -208 -185 208 198 80 22 261 -234 -4 -230 -465 -134 12 -148 -84 15 -208 184 -199
6497 -199 -99 25 -436 123 -199 -126 25 -32 -107 -29 -17 40 -12 75 30 168 17 28 66 130 22 160 -194 53
6521 53 228 -57 -72 -263 -41 218 51 -149 85 -126 73 20 -196 142 12 -175 -213 99 88 237 -118 -41
6543 -41 20 -218 -53 -32 196 -242 83 0 98 153 98 -4 -39 151 196 -19 117 83 -39 80 180 13 -348
6566 -348 13 15 -287 -44 -62 -27 124 131 246 19 155 11 -179 -3 -60 -94 -160 17 -101 200 107 -70 384
6589C84m86K0J18r7kM1lk75J85K04j43J21j30J65M9k59K8OPp1J18K40k22Mj02
6614a00p0K19J6j99L33j61l09L67K6l4K6j99N28n23N4K51o56K42L69m8k33l1K34
6637A02O6j63j93L48k02j5M9k56L49l1q4mK22Ll97Q7R3m9q9Q4J15l37N8L60k34
6662a18R2K22n9j78J84j18j65q0K98j18J78m6J2q1p6j29J98J49k93k6j56L13j18
6685a15J01j3J98m42J35J14J30j79m5P4K09k11j17L20k45n7J98J6q4J7K23p7m7
6708A03Q6j64K7K03j22j95Q0J63k25j45M27l62J46RP2j69j39L46k44M45m51K21
6730A12K8J52l19K83k57j10J32k4J24j86M84l50l17L56j70J1M7k41J89N5K2r6
6752g5K4J43K61l24k03L61j72k53J49K19l93J31M33m43Q9n2r1L03k08M5r5j42
$$ plain form
6589 384 -102 -82 36 -61 -63 -22 -25 -300 -115 89 -54 67 -63 102 151 -108 -80 -74 -67 -138 -20 220 -2 2 -100
6614 -100 -170 49 65 -134 199 38 -271 96 122 88 114 -85 443 -80 -26 225 -431 -189 180 132 -101 -132 102
6637 102 168 5 -188 160 -42 -57 -8 -264 85 54 -30 -34 188 191 -206 -119 -26 -75 -164 -80 35 -302 -244 116 -118
6662 -118 -26 196 137 -41 143 25 -140 -220 78 -40 138 92 104 23 -53 -182 16 165 -128 -154 -310 3 -115
6685 -115 -14 -27 171 -271 -136 -22 108 -71 -116 -42 167 -44 -161 159 -86 -143 55 71 -13 4 227 150 103
6708 103 189 25 52 255 133 -62 18 181 -44 -189 238 -124 22 31 103 -66 -205 141 -103 342 -109 112
6730 112 140 292 -27 256 -1 -111 21 -3 121 -65 419 69 -248 108 -62 -51 -4 -245 -56 -1 21 -75
6752 -75 -51 92 353 29 -174 187 15 -238 -89 130 -263 -132 301 -142 -53 -105 -196 107 -101 -56 -151 -293
6774b93K68k4NJ22m8J19k83L06k70o9j09M25j21l03K82n1R9n8k78K95J25k50k6
6797a37m1J2PL81j24M9j28k73K60j03q7P5L02k77n1K14j31J41j92K16k87kO6j15
6821b25J34J93j52kj67K76J10l35J57K34k73k4r7n1K01K40l27J28K00l13k79M87
6843A15l78L49j80K89m13K90j42j11L83l48P8J12Q9k3k53L3P0l34j9N05Q7l78
6865a79J13K77k72l47M67K6j78J36O4o7L1k23K6K50q4p4j54J91k23J96R0N7k4
6888I9J87m46N10l64o3L6R8J62l24J49K15r5l78L08m05K45j06Q9K78j75j1J19
6910A28L3J72n38J2K99k36K75j06k9J64Mk34q9J57j4j67K49M8j10q5l9K86q0J31
6934B31l53K61P5j58M3p5j27P5RNJ37l29K16M92m64j03k3Q1j19J52rR4l94N94
$$ plain form
6774 -293 -25 -49 -44 78 30 149 -134 172 -98 -167 -276 149 28 -275 7 -44 55 -3 -281 14 139 -111 -137
6797 -137 -178 -166 -159 222 98 147 19 -254 6 -97 -184 -109 193 -84 -135 79 -52 89 -103 113 -174 -176 -110 -225
6821 -225 -91 102 -50 -52 -219 57 167 -168 -11 223 -50 -74 -171 -222 -21 219 -108 20 220 -93 -372 115
6843 115 -263 86 -94 195 -218 72 -70 -181 202 -146 -68 44 133 110 -143 -110 -40 -374 -393 112 199 -179
6865 -179 -66 211 -61 -408 59 85 -93 43 107 40 71 -152 -126 124 40 -34 -188 3 -220 -24 66 123 99
6888 99 286 -160 350 -14 -77 -41 57 219 -105 44 259 164 -214 94 -311 -66 -172 -83 195 20 9 128
6910 128 161 333 -205 -193 106 -130 145 39 10 174 178 -56 -145 12 -2 -169 80 128 18 -67 -106 180 100 231
6934 231 -122 139 214 56 99 24 -103 -28 -19 -14 123 -206 10 502 38 -65 -88 -7 -126 26 17 111 -283 311
6958C11k87q6j48J24J5k63M46j00J36l10P9M4J55nk2n6J0j02r3R7J46k11J54p5
6982d1j13L08k80L10P0l41L1J01k28K07j61R2J51m70J79P7LK82r9j6J16l89OO2
7006a43J72m39J22J58L81l05q9R9J16k40O6J10k22k02K97L01k09J74J2R4k77M7
7028B3k99K25L6k18qK67j45K66J58m34K97O7j57j61LJ19k9j49K88k12j03oM1J
7052a30K35l79J6K46MN4J75j37r3K7M9k41K00r6R8P0k46L06n9j42k6J75k17K93
7076A82n7k15l3Q7K11l89N9j1k70M44ok54K07K52k94j8Q9r8LK4J0L0n6j93M13
7101A17k09J23j38J86M06m31J24n2P2j90r7J72N0q5K22m53J80J3MJ11j23K7l0
7124an5p7p0L15j41m50M84r8j64K07k05N1LK90m58M2K66J55k33J03J46k68L44
$$ plain form
6958 311 24 -62 -210 -86 -71 -334 112 12 148 -162 -83 -39 116 111 89 33 43 -59 -152 -55 91 -120 34 -41
6982 -41 -154 154 -126 184 254 -87 -56 45 -183 24 -137 -45 106 -364 -185 -108 -105 177 78 62 178 -211 -205 -143
7006 -143 29 -410 -288 -130 251 -54 -143 -44 72 -168 -102 8 -214 -416 -119 182 -27 147 159 253 -24 23
7028 23 -276 -51 -15 -233 -241 26 -119 147 305 -129 168 235 78 -83 -80 39 10 -139 149 -63 -166 -172 -131 -130
7052 -130 105 -274 -258 -12 -8 46 221 84 -9 18 67 -174 26 -70 28 98 -148 158 99 -43 -69 106 -111 182
7076 182 125 -90 -123 -36 175 -214 -155 -166 -436 8 2 -252 -45 207 -87 -105 -16 -114 -111 -87 -77 -47 -103 -296 117
7101 117 -92 31 -107 79 485 54 178 126 198 8 -89 83 133 48 270 -183 -3 10 14 125 2 29 -1
7124 -1 -56 -133 -203 112 -29 -479 5 -93 -257 -50 -255 -204 -201 89 -369 -327 -61 94 -139 -36 110 -158 186
7147A86m6k13j39N8L77m04L15j23j73j55L27R6j32L1J05M8J82l73j79L89P1l85
7169a37K0J8J39k27K32m29L29J08m37L40L04j82k53K42q0M9k4p2k4k83M18k51
7191b00K63l27K55Q6q0j82J95J72m77M21l11l1J33l2k2J74J16l93j0J92K24j73
7213gO9m3J43j83JM0Q9J36l56l9oK77j71J37o2R7m42J95l9n6L07k51M75l09j00
7238i8J25k65M64l7pJ07k41k1r6K22m70L73M9k62M15l88K41Q0qk74m1m3q6M75
7262B14j72Pk61J81o8J65J93l99N2p1P5K57rj47N5l38L37J05m86K08k37J68L04
7285A33n4Q6m86L44j29J29j09J80Jj35K13k6M0k04k23O60k13k44k89M58j72r2
7307a32L10o4j53j10L08k09J89r5M8j21k1K22l86J16J01j41o1N03k01l91K4M73
$$ plain form
7147 186 140 -73 -212 -154 223 -181 134 11 -162 -317 10 106 -26 5 110 158 340 -33 -212 177 248 -137
7169 -137 -117 -99 40 -187 45 -384 -55 53 -384 -44 260 78 -175 67 -13 36 12 -60 -84 -367 51 -200
7191 -200 63 -264 -9 77 -3 -185 10 182 -295 126 -185 -216 -83 -115 -137 37 153 -240 -250 -58 166 -7
7213 -7 62 19 162 -21 -20 20 109 245 -111 -150 -156 121 -50 87 25 122 -320 -125 -164 -220 87 -164 311 2 -98
7238 -98 27 -238 226 189 182 289 48 27 -69 153 -317 56 105 -157 258 -130 111 191 183 -91 -132 -175 -261 214
7262 214 42 49 -212 -31 -99 66 259 -140 -88 -159 -84 173 164 17 72 -266 71 176 -310 -102 -339 -171 133
7285 133 79 165 -321 23 -106 23 -86 94 95 -40 173 147 187 -17 -240 420 207 -37 -326 132 -40 -132
7307 -132 178 114 -39 -149 159 -50 139 44 92 -29 -50 172 -214 -98 3 -138 -199 304 103 -288 -264 209
7329B09j98m0O7k94J16oM35qm77K74r8k52J91j04O4jJ11j03P4J55k09N6J12j38
7353f4PJ64jl16L16q8Q3j55mJ00J55l75J07K83k05J29J31n08J49J47k39K19j07
7376g2O0k03P8J78R1jk01K35q8k16O3j55K77J0k09J85l4j14L78o7q3k00O6l1k21
7401b74K65k8r0l1J91r8R9p8J52Q5j59k97K35J72j45n8l7N8NL9Q6m3Q1j57JK9
7427Cr7o8J78j2N8l24K55J97m0j60Q5j61N4K50k38J66j29j05Q8j30K83N8k94n0
7451a33J15n0j40L11j26O6Pk47M54n66L66J19Q4j56k35j50P6L39k79K61J4j97
7473f7N7k25K04M3j4J96m27M67k40k1P4j01J53k2k13M4LK66k12j2O9r2n4K87r5
7498F8j73R2J33j59k48K85J11K83m88o5l6J26O0j76K47n9j65M37n2k21j5P7m2
$$ plain form
7329 209 11 -29 38 -256 -140 -146 289 281 -196 78 -20 -272 -81 -185 -121 -122 -11 -114 -40 115 -94 -38 74 -64
7353 -64 -57 107 106 -210 106 18 101 -54 -58 42 197 -178 -71 212 7 136 267 -241 -92 55 -184 35 -72
7376 -72 -12 -215 -137 41 132 131 -70 165 77 -139 -76 -231 46 56 -153 32 -2 -116 262 195 112 -88 -22 -53 -274
7401 -274 -9 -37 -127 -158 33 -65 34 -44 108 193 34 -263 -28 144 -1 -59 -96 -38 -33 6 92 49 130 -27 -26 3
7427 3 -94 -162 16 4 62 -262 -7 190 150 -10 75 -86 -32 218 -20 146 17 -88 0 -130 153 211 -83 -133
7451 -133 -18 -68 -208 103 -23 43 50 -197 257 -309 57 176 260 104 -131 -281 -205 134 -145 116 130 -67
7473 -67 -10 -235 -31 12 -2 194 -233 234 -6 -27 47 -54 99 77 -136 -92 -89 177 -35 -47 22 -70 -124 163 68
7498 68 -105 -13 120 -39 -287 -2 109 392 -96 -161 -197 -71 -11 -187 60 1 -164 273 221 0 -15 62 20
7521B0m0K26m37K22p0J1PJ44p3r8M8J21j82O7J4j14J13Kq0l0lJ98J8j43K07l69
7547b21J7K72J75m09M5R1M7O5n6N7N7l49M22k85J98J66k71n9P5Rj29KL88k20q7
7572@K3j77J51J58k52p2K40N6j19j0k13L65l89J71K06P4l48m2J18K0K43j46J00
7595A57k28rj19J39P5M7K08m8l07J41Q1j76K29j92k7J98O1m04L73R5l11J52j03
7618C2n7K1nK61k29p8J24j29m8K46j37j68K03l91M37k39J60J68p2pr2L3l1j00
7642i8L12n8k00J02j89J89n5J8L8j43K96l78M08k58r4L5J12J69l25k6l7L70M0
7665B28l17j1M24n55L69K20M9n70M15j14l80N30m40K16O9m55K24K84k72n0J34
7686bk84K41N0m64K36N2K59p3j19L21j40ON8k37P9k3qJ72n7j58NL23l81J87k08
$$ plain form
7521 20 -20 206 -231 -9 -79 -68 -61 83 10 -88 -40 81 -101 -34 -20 -134 -21 -19 -99 -129 -132 66 84 -59 148 -221
7547 -221 -204 68 243 -166 -121 -30 17 82 26 83 140 -209 213 -72 126 292 21 -38 37 46 -83 -81 307 87 0
7572 0 23 -154 -3 155 -97 -169 71 127 8 -2 -215 150 -239 -68 138 212 -136 -178 -60 -40 203 57 157
7595 157 -71 -80 -199 -60 15 62 270 222 -85 56 137 -39 190 -2 -29 169 230 -174 199 294 -17 135 32
7618 32 -25 -4 -9 252 23 -55 69 -60 -108 138 1 -167 36 -355 82 -157 3 171 99 92 0 33 2 -98
7642 -98 214 156 -44 58 -131 58 3 21 59 -84 212 -166 242 -16 -110 -75 37 206 -119 -145 -182 188 228
7665 228 -89 -100 324 -231 138 358 407 -163 252 138 -242 288 -152 64 133 -322 -98 186 -86 -136 -2
7686 -2 -286 -45 5 -459 -223 -171 88 15 -104 217 77 83 141 -96 -17 -40 -48 124 67 -91 -86 237 -144 43 -165
7711a65L36j61j73p4K24Q6L6j03k06K15p7O2J68M7r9j16O5m54L17J47J67q4j16
7734D2K2K39k50n2r0P1J93j6k87K81K3O1j61k7j04J02N9M3l30j27K40K39k54p0
7758a53J52j00j54J69J02j0K8R8n06J94L12l18J50K02r0q0J06j84K33j04j31J04
7780B0K66m56J6j13L76r9j41L02j41J06M0q3l1m5P4Q0J42j90K0k22J79n33K80
7803a53J08K0Q2k31L11J78j77j28J11l94K35K75k01j43J70j61L16j95J17p4J5
7824H1p2M6k46K73m3l6m7P6Q4Mj1k52K06J70j32J10k97J40k10j4J28M3j22J56
7848C5m8p3N7j15J18L4j52J47j27P9Q4J27R8J61k14k75O1k4Q5po8O3k50L64k22
7873f2k30R9J33J85n5p1j64J16QK25k0k75J25L20m21J59k20K03Q0m01K61qK3j89
$$ plain form
7711 -165 171 10 -163 -237 -13 73 109 6 -200 15 -62 0 168 215 116 0 65 -389 -72 75 242 158 42
7734 42 64 303 53 1 -89 -18 175 159 -128 153 176 237 76 49 -55 47 106 149 -181 -308 -68 171 -83 -153
7758 -153 -1 -101 -255 -86 16 6 34 132 -374 -180 132 -186 -36 166 76 -4 102 -82 151 47 -84 20
7780 20 286 -170 -154 -267 109 10 -131 171 30 136 176 93 62 17 91 171 313 123 143 -79 100 -433 -153
7803 -153 -45 -25 57 -174 137 315 138 10 121 -273 -38 237 36 -107 63 -98 218 23 140 66 81
7824 81 9 55 -191 82 39 3 -44 32 116 120 109 -143 63 233 101 211 -86 54 -156 -170 -42 1 -121 35
7848 35 -13 -86 -29 -144 -26 8 -144 3 -124 -45 39 166 264 425 211 -64 -3 -27 58 51 -17 46 -204 160 -62
7873 -62 -292 -193 -60 125 70 -1 -165 -49 -41 184 164 -111 14 334 -87 72 -148 55 135 -266 -5 -13 10 -179
7897a79K72l41N67j28k81K27k64L36M8l58o7J96M7L0j54J66k00j29K45j81J93
7918D5n8l9o6r8J12J0J03j49J30L7k89P5K27P2J36j21m39L21M2n6j97L38n8j14
7942c6J53k42O6L0O7Lj04J83j84L4K54m20M83j06j98p5J81r9J73m9k22L56k86
7965c8j66J06K85r1j20J58k46N2lpR5J41J06l93L46k93NM12o44J65M4R5j2Q3L0
7990A10O2r9L21m75M4O5n9K19k52k5J42K05m01J4J78l7j24K00O6k35l77M76N5
8013G3r9j65M24l43L46J14m65N7k19L01j43k45N25l34J28J53n0j42k09M34k17
8034g6L09k19p3j6N8L22l77J37Q6k12O9J04j18J27N9n85L59j28M6J38j2M48j04
8057C42l90L4J03Lo2k4P5p1J3j87K53m4k21J82j18L8j00L30j73p3J85J63p4k14
$$ plain form
7897 -179 93 -248 319 191 -90 137 -127 209 257 -101 -168 28 75 105 -49 117 -83 -212 33 -148 45
7918 45 -13 -52 -118 -216 -104 -94 9 -140 -10 27 -262 -187 40 112 248 127 -312 9 51 -5 -202 136 78 -36
7942 -36 117 -125 -59 -29 38 41 -63 120 -64 -30 224 -196 287 181 -17 -92 89 -10 163 114 -108 248 -38
7965 -38 -204 -98 187 96 -24 134 -112 -60 -63 -70 25 166 272 -121 225 -68 -63 349 -295 -130 -86 9 -3 80 110
7990 110 172 73 394 -81 -37 28 -31 188 -64 -89 53 258 -143 -129 49 12 -112 88 154 -81 -458 18 73
8013 73 -26 -191 233 -110 236 350 -115 -58 -277 24 -119 -364 161 -173 -45 108 58 -84 -293 141 -76
8034 -76 233 14 -59 -75 -17 305 -72 65 151 -61 8 112 -6 121 180 -405 -46 -174 -128 10 -2 446 342
8057 342 -48 -14 89 92 30 6 81 10 23 -164 89 45 -176 6 -112 -74 -174 156 -17 -90 95 258 184 -30
8081c0j55R1K84o06K26J32J7o4J68N2l06L38q6j16Q7O3p9l44J17K82M4k57M7j40
8105b35o2J81J82Q6k13N4J58O4j34k00J12qk16K88j20L20j33j91K42M5j17N4P7
8128B34k50k39J28K18j87j49P4j08L43j97o0JJ56J30L2l27L62j83J24j96Kj05
8150a97J10J8J56j24R0P3K0J04k65K75n28J49K7R7o7k6L30j90Q4j96m9m7K94K63
8174D01m35J21k42J99l6R9L0M9k42J10lj54P6j5l0K92k52
$$ plain form
8081 -30 -185 -94 190 -416 -190 -58 -41 -105 63 115 -191 147 61 -55 32 95 16 -328 -211 71 115 -142 -95 -235
8105 -235 -297 -116 66 152 -61 -7 151 215 81 -119 -7 -15 -231 57 -63 257 124 -67 175 220 103 157 234
8128 234 -16 -255 -127 91 -96 -245 -171 -279 64 -133 -193 -192 -36 94 126 -201 161 -22 102 -94 -92 -197
8150 -197 -87 -69 87 -37 53 126 146 250 -15 260 -268 -119 -92 5 -62 -88 242 52 136 -60 -109 -156 138 401
8174 401 -34 87 -155 44 8 107 137 186 -56 54 51 -103 -27 -42 -72 220 -32
8191c2
$$ Imaginary data points
##PAGE= N=2
##DATA TABLE= (X++(I..I)), XYDATA
0@%%%%%%%qJ6j6J6k4L2m0M8n6P2r6J20j42J74k08K46k88L38m00M65n38O18p07
30c78Q12r32J061j203J360j531J724j934K162k415K692k994L322l680M075m506
46b365M975n487O046o662P342q086Q909r827J0852j2003J3304j4793J6515j8532
60i812K0931k3841K7461l2108L8319m7086O0481q3699J35013m48985K37582P09298
72E83554o97876L8184N25421m07429o22620N16224K59017l57246K49430M31995
82E18654n86427l62195N16227M0629m74456L60428M43836m39879k59891L69643
92A26569j45654l32902L90521K57429m02071O7622L82280m05607m10419N17380
102D5148K59175m70870P6574M90336l17756m67322L28346K23304l16186J10663
$$ plain form
0 0 0 0 0 0 0 0 0 -8 8 -8 8 -16 16 -24 24 -32 40 -56 64 -78 96 -112 134 -154 184 -216 249 -289 329 -378
30 -378 434 -498 563 -640 720 -811 913 -1021 1141 -1274 1418 -1576 1746 -1934 2141 -2365
46 -2365 2610 -2877 3169 -3493 3849 -4237 4672 -5155 5697 -6306 6998 -7795 8720 -9812
60 -9812 11119 -12722 14739 -17369 20950 -26136 34345 -49354 85659 -363326 -125744 583554
72 583554 -114322 -76138 449283 41854 -580766 -64542 194475 -162771 86659 518654
82 518654 -67773 -429968 86259 126888 -347568 12860 456696 16817 -243074 126569
92 126569 -19085 -351987 38534 295963 -106108 -38486 343794 -61813 -472232 45148
102 45148 304323 -166547 -89973 400363 82607 -384715 -56369 166935 -149251 -38588
112c8588L57986k86628l04978L13512P8572l46369J41809L71239k24517k60559
122a98521K52792O8823k74348P8181K20579j68159p7213K47199n6134k61035J44270
133b3566J54042k56889k9618L45616l9958l02621J20187J59758k50371n0442L18161
144A44299j1244k29887J34511R8121k85339k8306L21205l8448k28301J69432J33380
155A79423k74700q2061K38665k4646j36776J72997P2854k31203m201J74312j27149
166d2485j09007K42173P8081k28084R084J45954j46785r7638K11610N0234j63199
177e0062O1112R1479j85560o2610K06874O727j44912J04195R8196j82140o8280
188a24981J65359Q56j03979R5743O7916j34690k6441J08024n1240p6461J15059
$$ plain form
112 -38588 319398 32770 -272208 41304 119876 -226493 -84684 286555 62038 -198521
122 -198521 54271 123094 -151254 -73073 147506 -20653 -97866 149333 93199 -167836 -23566
133 -23566 130476 -126413 -156031 189585 149627 -152994 -32807 126951 -123420 -173862 144299
144 144299 133055 -96832 37679 135800 -149539 -177845 143360 104912 -123389 46043 179423
155 179423 -95277 -177338 61327 36681 -100095 72902 145756 -85447 -89648 84664 -42485
166 -42485 -151492 90681 168762 -59322 -50238 95716 -51069 -148707 62903 113137 -50062
177 -50062 11050 102529 -83031 -145641 61233 67960 -76952 27243 125439 -56701 -124981
188 -124981 40378 41234 -62745 32998 100914 -33776 -60217 47807 -3433 -79894 35165
199C5165N1802j23464r176R6026n3746p4181Q6117M5244p9511P155O8475n2712
211b806n5333O9586K7939o3158J5648N8832m4611m6110N0676J2663n5507J8338
223a3843N4049l5043l8874M1054R556m7704J2607M4294k3832k1264L7867j52m4714
236b5999J5704L7628k7944j6909M1083k397m6425J3565L4765k9658k0615L9358
248A2156O480l7038O041K4009j9316p848K8016m396k2127K0968J4841l1661p362
261a7237L3121k223k6060J2388J6407j9213j0305J4051j309p395J0425J344j4229
274a0235O207J1580j2740n652K0680L983j9899p18J6678q80j1651J074M848j73
288C102m04m927n265O090P762q574r918Q605J0242n479q219M074P779q94m543
$$ plain form
199 35165 86967 -36497 -45673 50353 -3393 -77574 8543 53787 -25724 -18569 49906 -2806
211 -2806 -58139 11447 39386 -23772 -8124 50708 6097 -40013 10663 23326 -32181 -13843
223 -13843 40206 5163 -33711 7343 16899 -30805 -18198 26096 2264 -19000 18867 18715 -25999
236 -25999 -10295 27333 -611 -17520 23563 21166 -25259 -11694 23071 -6587 -27202 12156
248 12156 18636 -18402 -12361 11648 -7668 -15516 12500 8104 -14023 6945 21786 -9875 -17237
261 -17237 15884 13661 -12399 -11 16396 -2817 -13122 929 -380 -7775 2650 3994 -10235
274 -10235 -4028 7552 -5188 -10840 9840 13823 -6076 -6794 9884 9004 -2647 -1573 3275 3102
288 3102 2698 -2229 -7494 -1404 6358 -2216 -12134 -3529 6713 1234 -6985 -2911 4868 3974 -569
303e69K91M480J904m031m305K936L691l222m472M53L235q74l807o67L683K140
319H66l557k766M825N319k935l433L298K828j826k272J024K61p09o8r61j696K36
336a566P50r01j30j003j551K224M103j588l473L195M696n43m575o97M435K231
352E607l955n504L154O174k584p533N69L991j098k371r78K510N177m90r293J020
368e604J3938k97j3351L572J3269q289j2069Q826Q248o719k336J832n880J171
382c689Q311q162j0270J4092J1183j5066o983J6627L236j3709k083P576L595M741
396I399k262j3435P24J3153p117j2278J4954J4508j9062j6397J1125Q189n290
409c789L700Q413m202m793P77n706l794J4160J0985j2225j0412J3436N890k1323
$$ plain form
303 -569 -278 4202 6106 2075 -2230 706 4397 1175 -3297 -2844 391 -483 -4290 -4957 -1274 866
319 866 -2691 -5457 -632 4687 1752 -1681 1617 4445 2619 347 1371 1632 923 855 -106 -1802 -1566
336 -1566 -816 -1717 -1847 -2850 -4401 -2177 1926 338 -3135 60 4756 4213 -362 -1059 3376 5607
352 5607 1652 -3852 -698 5476 2892 -4641 -4072 -81 -1179 -3550 -4528 -2018 3159 2669 -6624 -5604
368 -5604 8334 8037 -5314 -1742 11527 3238 -8831 -5 8243 1524 -812 1020 -4860 -3689
382 -3689 4622 -3540 -13810 282 11465 -3601 -10584 6043 9279 -4430 -6513 1063 4658 9399
396 9399 7137 -6298 -5574 7579 462 -11816 3138 17646 -1416 -17813 -6688 1501 -3789
409 -3789 -89 8324 4122 -671 106 -5600 -9394 4766 15751 3526 -6886 6550 12440 -8883
423h883j1004K0700J3390j3554n865J0651n098j4205L299Q023L260J5216N267
436B1197k8799j4776K3047L555j6486K1617K5330k9389k5731J4991k284j1319
448a9047L1150J5193l6440k095K7760l0502k5658N3270K1996m9820M016M0875
460C0698l3586l0698M3445P053l6919L1006K8299n7741j2909N8204k3392n2262
472d8802N6925M1444o5521j0950N6164l2467m3411O1119K2518o1921J7577N3877
484D6552n4196l8175O6509O777o1522L0518M6846n2441j9252N2489k2420m7269
496d5584N1159K9849n4179J2049N0128n4595m5046O6397J8387n4991L5667N2861
508F2102o9902m7048O3526M603n3380M8859N9336o5494m7678M7614l415m4419
$$ plain form
423 -8883 -19887 813 14203 649 -5216 5435 337 -13868 -10569 -2546 714 15930 21197
436 21197 -7602 -22378 669 4224 -12262 9355 34685 5296 -20435 -5444 -7728 -19047
448 -19047 12103 27296 -9144 -11239 16521 -13981 -39639 13631 35627 -14193 -10177 30698
460 30698 -2888 -33586 9859 16912 -20007 10999 39298 -18443 -31352 26852 3460 -48802
472 -48802 8123 49567 -15954 -26904 29260 -3207 -46618 14501 37019 -24902 -7325 46552
484 46552 -7644 -45819 20690 27467 -34055 -3537 43309 -9132 -28384 24105 1685 -45584
496 -45584 5575 35424 -18755 -6706 43422 -11173 -56219 10178 28565 -26426 9241 62102
508 62102 -7800 -54848 8678 13281 -40099 8760 68096 2602 -45076 2538 -877 -45296
520d5296M5026N2674l8722k5743K2478k6566l2300M7043L9350k4187k097J4072
532B5732m1860k9322L5295J8241q865L2018J3625o4243k9504M5892K364l0335
544c0962M8018M9204n8464n2857L6703J1748l5712L1320N6404l1511m4744K0877
556B4k851l9594K9950N5968k3812l3763K4270l824m5467J2831M4134l658o952
569G256J2414k4082k2127K9685M457l1204L1126M1105n0424l8136N1914J0042
581B2026n4550J9982M9080l8656k7152N0208l620n4007K9925M0701n1158j6624
593c3845O7771P02o1255J4471L4374l5582j2392M3619L137k0216J2634j4711l9097
606d0390K6788L8909k8434o913M5147j8229n8933J8650L8113k0624L756L9816
$$ plain form
520 -45296 -270 52404 13682 -12061 10417 -16149 -48449 -1406 37944 13757 11660 25732
532 25732 -16128 -45450 -10155 8086 -779 31239 44864 -19379 -48883 -2991 -627 -30962
544 -30962 17056 66260 7796 -45061 -8358 3390 -32322 -1002 55402 23891 -20853 24
556 24 -2827 -42421 -12471 43497 19685 -14078 10192 6368 -39099 -26268 17866 14208 7256
569 7256 19670 -4412 -26539 3146 7603 -23601 7525 48630 -1794 -39930 11984 22026
581 22026 -32524 -12542 36538 -2118 -29270 20938 17318 -36689 -6764 33937 -17221 -33845
593 -33845 33926 34628 -26627 -12156 22218 -13364 -25756 17863 21000 784 13418 -1293 -40390
606 -40390 -13602 25307 -3127 -10040 35107 16878 -42055 -23405 14708 -5916 -2160 37656
618C7656k2885m0443K5261P649m1712K0381O1030k1304m8249K0794J2468m0930
630c0284L81M6179P470j3933L704j8693k8778J7723K7178q018O956K5987k3066
643A2806m5694O096K8297J655O279J5812j5424k4677K690J055q024K2688K8606
656C2165k0667k9785J3394J2379k0755k005K9309N586j9180j726M377j0511r31
669h350J2186m084l878J7245N23k7998l969K2498j869j3508J5924J3529j8029
682B20j1651Q736j443l93J7288j274j9350O248J3698j9269j0316K6051O954k5255
696i756K74J8434q147j0012J2002j874j1754J3998R912j7967j038J9783j1289
709B566k1522J7170J9758j4963q305J1652o893j2640J2062P092j0474O456R492
$$ plain form
618 37656 14771 -25672 -411 7238 -34474 -14093 46937 25633 -22616 -1822 10646 -30284
630 -30284 -29903 16276 23746 9813 13517 -5176 -33954 -16231 10947 2929 9885 35872 12806
643 12806 -32888 -26792 1505 3160 9439 25251 9827 -14850 -12160 -11105 -19129 3559 32165
656 32165 11498 -18287 -4893 7486 -13269 -15274 14035 19621 441 -1285 3092 -7419 -8350
669 -8350 3836 -248 -4126 13119 13642 -14356 -18325 4173 2304 -11204 4720 18249 220
682 220 -11431 -2695 -4138 -4531 12757 11483 -7867 -1619 12079 -7190 -17506 8545 15499 -9756
696 -9756 -9482 8952 805 -9207 2795 921 -10833 3165 13077 -4890 -5928 13855 2566
709 2566 -18956 -1786 17972 3009 -5296 6356 -537 -13177 -1115 5977 -4497 1959 11451
722A1451j7786j0756K0930O520j7131L990J5098j0367j1010J0896K895q937O801
735B594N633j2796r71J3583o446j3603R987J0220j0844k946J0637l007q687N508
749a138M315o308L957Q152q319p197Q726K945q748K179Q291o047o965N107K189
764A139n237L583M628n876k646O450o42n434L952M990m860k487N482R2m463J726
780C97K134m404m77M057j206l698K582J536l334k54L841n93k616K020J005k085
796a095J217K823j559j786K183J64l297L10K510j660j876J830M24k204R71J755
812G10j797j043K676K86k157J805K358k179q74K338p20k131J642O94l107O22K026
829A149j775j556L142n52l323J643K600l185L51M111k000k975M421J558m853M97
$$ plain form
722 11451 -6335 -17091 3839 10359 -6772 -2782 12316 1949 -9061 1835 4730 -4207 2594
735 2594 8227 -4569 -5540 8043 1597 -12006 -2019 8201 -2643 -5589 5048 2041 -6646 -1138
749 -1138 3177 -3131 826 8978 659 -6538 2188 5133 -3615 -1436 6855 808 -6157 -1050 1139
764 1139 -4098 -515 4113 -1763 -4409 2041 1399 -4035 -83 4907 47 -2440 3042 3134 -1329 397
780 397 2531 -1873 -2350 1707 501 -3197 -615 921 -2413 -2667 1174 581 -2035 -15 990 -1095
796 -1095 122 2945 1386 -400 1783 1947 -1350 -1040 1470 -190 -2066 -236 188 -2016 -1045 710
812 710 -1087 -2130 546 832 -1325 480 2838 659 -215 2123 1403 -728 914 1608 -1499 -877 1149
829 1149 -626 -2182 960 408 -2915 -1272 1328 -1857 -1506 2605 605 -2370 2051 3609 -1244 -747
845g47M126k750l267L718J000m093J361K246l465r20L920j373k688K753J780l380
861a779J480K980l001q00M145j590m046L930K612n832j476O490j545n500K668
876a264L208l219j489K492J60j265K226L88j793P05J182m76o51o00J227K205j978
893A058m317K993L493m890l193O189K063n895l84L115j100M94K722k532n81M963
909D198k501o822N504O082p147k184P108l375o445P564Q46r968O009R769j2012
924c374p330J7031J727j8241M851J6454r423r413J2592N25j2531P298Q071j2971
938d734j27J5062q661j5112J4098R826j6219j169J5322o781j0909J2249L400j3514
952g269O417J1610j4719o170K0210Q77k1695N750J6119j3134r992J8333L587j6580
$$ plain form
845 -747 3379 629 -2638 1080 2080 -2013 -652 1594 -1871 -2791 1129 -244 -2932 -179 1601 -1779
861 -1779 -299 2681 -320 -1120 3025 1435 -2611 1319 3931 -1901 -3377 3113 1568 -3932 -1264
876 -1264 1944 -1275 -2764 -272 -112 -1377 849 1237 -556 149 1331 855 204 -396 831 3036 1058
893 1058 -3259 -266 3227 -1663 -4856 1333 3396 -2499 -2883 232 -868 -374 2348 -184 -765 4198
909 4198 1697 -5125 379 6461 -686 -2870 4238 863 -5582 1982 2828 -7140 -1131 8638 -3374
924 -3374 -10704 6327 8054 -10187 -5336 11118 1695 -7718 4874 5399 -7132 166 8237 -4734
938 -4734 -4861 10201 1540 -13572 526 10352 -5867 -7036 8286 1505 -9404 2845 6245 -7269
952 -7269 -852 10758 -3961 -10131 10079 10956 -10739 -4989 11130 -2004 -11996 6337 9924 -6656
966f656K444Q366j1105j370J9531k808j8166Q400J1354j7947n270K4720K232k0821
980g096M454J1545j5213n835K0949j404j7178J2285J0550k4345n269K7846k968
993H321k3638J6212J8937k4036j1370K2963k727j8330J9649J3277k6002k635K2020
1006A2641j7415j8658L3227J3601l3743M93K5431k2732j7981L6337Q948l3153
1018a3004J1142K2887l4348j2800M5639Q40m0307J8353K7394l7351j4206M3171
1030A7410k234l5525K0259K0095l4714k283L7924j4795k9079K9297J2803l6477
1042a7319O133L5058k1491k2715L0488L463l2943J5275K7630l0103j3672L7110
1054A6914n050l7236K0910K7672l1443j1253L7775m440l5033J6845K1778k7033
$$ plain form
966 -6656 -4212 4154 -6951 -8321 11210 8402 -9764 -1364 9990 -7957 -13227 11493 13725 -7096
980 -7096 -2642 8903 -6310 -12145 8804 7400 -9778 2507 13057 -11288 -16557 11289 8321
993 8321 -15317 895 19832 -4204 -15574 7389 4662 -13668 5981 19258 -6744 -9379 12641
1006 12641 -4774 -23432 9795 23396 -10347 -9854 15577 -7155 -25136 11201 20149 -13004
1018 -13004 -1862 21025 -13323 -26123 19516 20356 -19951 -1598 25796 -11555 -25761 17410
1030 17410 15176 -20349 -90 20005 -14709 -16992 20932 6137 -22942 6355 19158 -17319
1042 -17319 -11186 23872 2381 -20334 10154 13617 -19326 -4051 23579 -6524 -20196 16914
1054 16914 11864 -25372 -4462 23210 -8233 -19486 18289 13849 -21184 -4339 17439 -9594
1066i594m532L4606o803l0689J4392J4452k4559l85L2644n805k5796R618P390
1079D939k0621N825K7378p797j7958J2866M13k4853R427K9711j0054j8156J6431
1092G551J814k7380N512K7997j0644j4627J9532J836k9536M663K7246j2051j5643
1105a3730K3254O508k8793M03K3817j0894j3127K2965N436k5583K882J7534j5949
1118e277r916K6620L040k5296N322J6412j8359p665K6105K84k2086J0607J1904
1131A1695k2711k133K8698n783k3550J5907J2551k5423l096K7819o031k0836J4991
1144B098Q680k2670J669K4316j0902j6688J8587O430k3989L413K3079j0021j4836
1157a0834J6424M140j9781M363J6847j1621q519J7193r84k0309Q223J6073j3546
$$ plain form
1066 -9594 -14126 20480 13677 -17012 -2620 11832 -12727 -13112 19532 13727 -12069 -2451 4939
1079 4939 -15682 -9857 17521 9724 -8234 4632 5045 -19808 -10381 19330 9276 -8880 7551
1092 7551 9365 -18015 -12503 15494 4850 -9777 9755 11591 -17945 -13282 13964 1913 -13730
1105 -13730 9524 16032 -12761 -12358 11459 565 -12562 10403 15839 -9744 -6862 10672 -5277
1118 -5277 -15193 11427 14467 -10829 -5507 10905 -7454 -15119 10986 11270 -10816 -209 11695
1131 11695 -11016 -13149 15549 9766 -13784 2123 14674 -10749 -13845 13974 7943 -12893 2098
1144 2098 10778 -11892 -10223 14093 3191 -13497 5090 11520 -12469 -9056 14023 4002 -10834
1157 -10834 5590 9730 -10051 -5688 11159 -462 -8981 8212 7228 -13081 -4858 11215 -2331
1170b331q217J8411O19j8844N752J3388j0921m250J5405l436j4765Q555R750j4643
1184e527k595J7896k926j6812P601J0182j1890l362J3598k616j0906Q815N208
1197F666j3270J271J4461o122j1284J0996O094j4115p84J2886l969r323Q835K798
1211E140j1240K036J0128p232n678J1489J032j2600K833J1329o559o308Q910J847
1225E127r712K732P157o846k454Q818j976r693N421P250p595m011Q964m32p721
1240d971M069N353n893j176O609k845n405O051L071p269k22O869l258n769N481
1255F95K935o135l35M913j867l084M602M00n057K205L889l679j996M975N59m641
1271a621P73L267j909j701K445r87k455J812J509k660j04L108q73k590J608J722
$$ plain form
1170 -2331 -10548 7863 8482 -10362 -4610 8778 -2143 -6393 9012 5576 -9189 -634 9116 -5527
1184 -5527 -8122 9774 6848 -9964 -2363 7819 -4071 -7433 6165 3549 -7357 1458 6666
1197 6666 -6604 -5333 9128 3006 -8278 2718 8812 -5303 -6087 6799 2830 -6493 2342 5140
1211 5140 -6100 -4064 6064 -1168 -6846 4643 5675 -6925 -4092 7237 678 -5630 3280 5127
1225 5127 -4585 -1853 5304 -1542 -3996 4822 2846 -6847 -1426 5824 -1771 -5782 3182 2750 -4971
1240 -4971 -902 4451 -1442 -2618 3991 1146 -4259 1792 4863 -2406 -2628 4241 983 -4786 695
1255 695 3630 -2505 -2840 2073 206 -2878 1724 2124 -2933 -728 3161 -518 -2514 2461 3020 -1621
1271 -1621 -848 2419 510 -1191 1254 267 -2188 -376 1133 -1527 -1631 1477 604 -1986 -378 1344
1287A344j235m37R57J52j130J106M16j503k8R40j105m80P37Q92q33p22N45J70
1305b14%n84J066k6p42M32K63N6M88j08k88n04L70L16p69J53J71j3p03J53mk21
1327g08Q64k26o75J52J385j58p38L00O01p10j64R06k35o16L00l1p23j74N87J00
1347C7k71m28Q8M24J11m25L54R32n71q33J088R25j210n72J312o40j469J026J087
1366I65j269p32J110k31p36M48Q93l28l14j68J33N91j01l66N44J012j687o51J708
1385H21K02j969P17J111j491n21J421k2j339P81N53p03J05N38J2L43kj390Q59
1404B6K002j714j456K449L10l888R57L844k109l123L624N74m390J809L620l079
1420e44j659M599m22m680K472L405l962r86M469j813l113L639q7n036L224M158
$$ plain form
1287 1344 109 -328 629 781 -349 757 1173 -330 -358 582 -523 -1003 -266 626 -207 -929 -384 -214
1305 -214 -214 -798 268 242 -500 -68 195 251 739 631 343 -161 209 525 -244 -91 80 67 -636 -483 -487 -708
1327 -708 156 -70 -745 -593 792 634 -104 196 797 87 -77 829 594 -22 278 247 -476 -650 -63 37
1347 37 -234 -662 -574 -150 -39 -464 -110 822 251 -582 506 1431 221 -351 961 321 -1148 -122 965
1366 965 -304 -1036 74 -157 -893 -445 448 120 -194 -362 -229 362 261 -105 439 1451 -236 -887 821
1385 821 1023 -946 -229 882 -609 -1130 291 269 -1070 -289 264 -439 -334 204 216 559 557 -833 26
1404 26 2028 314 -1142 1307 1617 -2271 -1314 2530 421 -2702 922 1496 -2894 -1085 2535 -544
1420 -544 -2203 2396 1974 -2706 -234 3171 -791 -1777 2692 879 -2234 1405 1318 -3718 -494 3664
1436C664n268j279O835k657p043M921N144o541K55P008l841o018N839K338p115
1451c758K974O873n770n786O821Q57o503L204N701n385k602N728k375m707O121
1466A393K888p119P02O854m287n042O134K246o243J067N132m205k957N545m29
1481A679n559L218M024m780j677N539m46m789K452K624l435l32M356j721k826
1496a673K821L24m370Q69M874j711l173K180J364m160k10L946L51j734J491N65
1512A754l338j290L205P91q98J936J117m181k545K265J095m22K345J266l136j757
1528a793K51j123K52N058J717m041j034J416l434j310O100K676l635p55Q78m299
1544c076j833O102J993l197Q40J760n056l086N342K602k196Q44J764l339j634
$$ plain form
1436 3664 -1604 -2883 3952 1295 -5748 -827 4317 -2224 -1969 5039 1198 -4820 1019 3357 -3758
1451 -3758 -784 6089 319 -5467 1354 2211 -4292 -1088 4613 -772 -3374 2354 -21 -4728 1393
1466 1393 4281 -2838 -2136 4718 431 -4611 1523 3769 -2474 -1407 3725 -480 -3437 2108 1679
1481 1679 -3880 -662 3362 -1418 -3095 2444 1998 -2791 -339 2285 -1150 -1482 2874 1153 -1673
1496 -1673 1148 1472 -2898 -2029 2845 1134 -2039 141 1505 -2655 -2865 1081 1432 -302 1189 1754
1512 1754 -1584 -2874 331 1122 224 2160 3277 -904 -3449 -1184 -89 -511 1834 3100 -36 -1793
1528 -1793 -1542 -2665 -2413 2645 4362 321 -713 703 -2731 -4041 2059 4735 1100 345 1223 -3076
1544 -3076 -4909 1193 3186 -11 829 2589 -2467 -5553 -211 2391 195 1039 2803 -536 -2170
1559b170J902J08j88K811J39l783O1J661k308j25L122L33k039N97M57l061Q60
1576a623L316n31k114K193L88l585l9L706K44k325M65L33j326J39J806m75m19
1593A53K2j407n31J591J542J46r43j578j084J059J701Q05J38O07k076k977O74
1610b158K652J141k09P3j203k287p92J195J747J955k4j711j619q2L69L00J224
1627E71J149J87o51j747j348M31J477K50N40J209n62k998j749J014K142J264R27
1644B106o80j235j802r12J265K421J698m0k299j926o85R30J145J158O30p09j851
1661g86j804Q60J700L95L5J81j61q51N0O9L90O60Kq62p9R81m09j541O13P47m56
1682b66N80J21n56o89L24m02P2J771N92j547r52J226L37j160R32Q97j202o72Q60
$$ plain form
1559 -2170 -268 -160 -348 2463 2602 -1181 -1120 541 -1767 -1892 1230 1563 -476 121 578 -2483 -1623
1576 -1623 1693 1162 -952 1241 1629 -1956 -1995 1711 1955 -370 95 428 -898 -759 1047 572 153
1593 153 175 -1232 -1763 -172 1370 1516 573 -1005 -2089 -1030 671 1476 1614 2221 145 -2832 -2158
1610 -2158 494 1635 1426 1499 296 -1991 -2783 -1588 159 2114 2090 379 -1240 -1322 -953 -653 571
1627 571 1720 1907 1256 -491 -1839 -1408 69 319 859 2068 1506 -1492 -3241 -2227 -85 1179 2106
1644 2106 1426 191 -1611 -2523 -1258 1163 2861 2821 522 -1404 -2089 -1159 -14 1144 1774 1065 -786
1661 -786 -2590 -1730 -30 365 400 581 420 -431 -381 -312 78 738 740 -122 -201 780 371 -1170 -557 190 -266
1682 -266 314 435 -121 -810 -486 -888 -816 955 1547 0 -952 274 611 -549 383 1280 78 -594 266
1701B66l42m96R42P3j736L77J735m67j403J408K28j833P34J566j63q28O24o70
1719A5j206P47J511r70n18J326q00j823O81J469m89m00P71l35j067J247N48j062
1737c55L27R34n79q43Q35Q69j130n78J197n08r35Q86L00j267K47N33n1l96R29
1756D15M61j137k88J149j60r47J162L79r86l12N70n35j54O66Jj274L08J093n72
1775a61o48J003p0n90J4J110p47k96R57k75n18R00L06j345J05O92l31j123J281
1794B64M43j101j09Q35n30q68J071Q07j486K87J263r82n25J290L2j240P40O12
1812H03j027k01Q48m64m04O48r2r77O71M50o98m6J165n73o90R62N38j250R8J340
1832A101j032n62P37M11j295N93J43n81r5Q79n86k83O76K01r58P83N44j182N04
$$ plain form
1701 266 -76 -572 370 443 -1293 -916 819 352 -1051 357 585 -1248 -514 1052 889 61 685 15
1719 15 -1191 -444 1067 97 -421 905 105 -1718 -1037 432 -57 -457 314 -21 -1088 159 707 -355
1737 -355 -28 906 327 -516 319 1188 58 -520 677 169 -766 120 420 -847 -600 -67 -118 -514 415
1756 415 876 -261 -549 600 440 -507 655 1034 48 -264 306 -229 -383 283 284 -990 -682 411 -161
1775 -161 -809 194 124 -466 -452 658 -89 -385 572 297 -221 679 985 -360 -255 437 106 -1017 264
1794 264 707 -394 -503 332 -198 -1066 5 812 -674 -387 876 -106 -631 659 691 -549 191 803
1812 803 -224 -425 423 -41 -445 203 111 -866 -195 255 -443 -489 676 103 -587 375 913 -337 -239 1101
1832 1101 69 -493 244 655 -640 -47 96 -485 -580 299 -287 -570 106 307 -651 132 676 -506 -2
1851bP18q96m25J386k43j268N39R99j179m37J146k9j032Q44K69r33J82Q14m50
1870Cl22P23o3q56Q36qn00K70O26r07m92J560p13j207J005N97j229m8J471m44
1890C02j172J385J21r86J72J093j192k08J105j83o26M62J16r51J65N65p01q3J383
1909G67m75j513J161P53j515rJ860l46j201O24L67j316L75J580r73q59J045J48
1927D73j260K04J134l77n96K64K13Mk1K94p59K92O34O8q21P57J09j134r6Q82M14
1948F78q73K11K29m18p92J207k00r81R00J248j634n10J832K17k003K10J607p62
1966A66j000J875j1k265N85J032q73l6J980q10k557R62J678j592J47L310j527
1983A064k829J403J047j833R24L174k580k092K424j77l173K097L026k108j974
$$ plain form
1851 -2 716 -180 -605 781 538 -730 -191 808 -371 -808 338 309 -723 121 390 -543 -361 453 3
1870 3 -319 404 341 -515 321 313 -187 83 709 -198 -690 870 157 -1050 -45 552 -677 -725 746 302
1890 302 -870 515 636 -350 -178 915 -277 -485 620 437 -189 273 389 -562 -397 168 -533 -616 767
1909 767 292 -1221 -60 693 -822 -831 1029 683 -518 106 473 -843 -468 1112 139 -720 325 473
1927 473 -787 -583 551 174 -422 -158 55 59 38 332 -427 -135 499 567 -254 503 612 -522 -618 264 678
1948 678 -195 16 245 -173 -965 242 42 -939 -39 1209 -425 -935 897 1114 -889 -679 928 166
1966 166 -834 1041 1030 -1235 -650 382 -491 -527 1453 643 -1914 -952 726 -866 -719 2591 1064
1983 1064 -1765 -362 685 -1148 -224 2950 370 -1722 702 525 -2648 -551 2475 367 -1607
1998a607K880m80l292J717K375k342M2L400k182l049K392J644l125Q92M076k577
2014G64l071K104O35k634J599L477k481k076K213l68l093K424L751k393k206K452
2030A097n72k839J708K597j881r85K116j015k164J999J453k431o7K000j007j682
2046a673J960J420k465m24K299o77j744K000Q38k469l74K402r21j778K349R85
2062A728k395r54K656p07k377K090K059k354l19K041j045k294J805J655j893J70
2078a34K211j707k901J715J823j777R62K255j939l079J739J144k206J770L381
2093C257k925k285J851L68k462K041L773k562k677K284m70l126K377L228k375
2108B97j748K541o27l374K039L034k395n16K892j335l348J895K452k252J41K738
$$ plain form
1998 -1607 1273 793 -2499 -782 1593 -749 -707 2693 511 -2538 -146 1498 -1627 -735 3341 764
2014 764 -2307 -203 432 -2202 -603 2874 393 -1683 530 162 -2931 -507 3244 851 -1355 1097
2030 1097 525 -2314 -606 1991 110 -875 1241 226 -1938 61 1514 -917 -984 1016 9 -1673
2046 -1673 287 1707 -758 -1182 1117 440 -1304 696 1534 -935 -1309 1093 172 -1606 743 1728
2062 1728 -667 -1621 1035 328 -2049 41 2100 -254 -573 1468 423 -1871 -66 1589 -304 -134
2078 -134 2077 370 -2531 -816 1007 -770 192 2447 508 -2571 -832 312 -1894 -124 3257
2093 3257 332 -1953 -102 266 -2196 -155 3618 1056 -1621 663 193 -2933 -556 2672 297
2108 297 -1451 1090 463 -2911 -872 2162 -233 -749 2143 808 -2540 -645 1807 -445 -304 2434
2124B434j599l121K007J459k446N30K718j784k243J918J098k696Q92K879j489
2139E57k347K218R37k777Q28K601j663j725K425K03k714P02K561k060j482K427
2155F91J11k559J201J915j618q20J576J78j957J427J483j961p13K331o98k319
2171a732J535J752j859q31J808l68k285J843J169j460j58J706r58j983K045J755
2187A979k402k72K263j203j717J741O90j712k5J927j678r54J818K64j868L32K274
2204A457j465j394J748P29j770P8J493q70p84J637l49j488J037J390j814r20J998
2221G13j18k019J204J265j251m74J529m92j490J333M75j077K07J118p73j053R77
2238G4N92j075k30J013n22m17P07O3q87L11P85o44k70R11J95q92j15J037m02n59
$$ plain form
2124 2434 835 -2286 -279 1180 -1266 -736 1982 198 -2045 -127 971 -1725 -833 2046 557
2139 557 -1790 428 1365 -1412 -584 2017 354 -1371 1054 1257 -1457 -755 1806 -254 -1736 691
2155 691 802 -1757 -556 1359 -259 -1079 497 675 -1282 145 1628 -333 -1046 1285 587 -1732
2171 -1732 -197 1555 -304 -1135 673 305 -1980 -137 1032 -428 -586 1120 162 -1821 224 1979
2187 1979 -423 -695 1568 365 -1352 389 1079 -633 -658 1269 -409 -1363 455 719 -1149 -817 1457
2204 1457 -8 -1402 346 1075 -695 -617 876 6 -778 859 510 -978 59 1449 -365 -1285 713
2221 713 595 -1424 -220 1045 -206 -680 849 357 -1133 200 675 -402 -195 923 150 -903 74
2238 74 666 -409 -639 374 -148 -565 142 205 -682 -371 414 -230 -500 411 606 -286 -401 636 234 -325
2258c25N17J08k99l63L05k7l31O60k08m41J85K84kk55M85qo42M13L56k96m43L11
2280a6L41j61m56Q09l03o15P68k17k91o7M68k51l42R9J91Jj56P04l76l03L98k6
2302A99k88K78J85m11j70L39j19k90J71R0k09K82om06J55O28l18k94M5N50j88
2323B23j82K56j8m82K51j00L9j3Lj10mK76j76K06q1j58LL03k34R2m7J17m75N38
2347B27ok98K75j67K83l64j53K95j47j23L24k46J58j07o9N6P2K00k86J47Q2j39
2369A4m21P13qp25N85q7l65KM44l33J2M04n7n14K59k3J02j87L00R4k95J85O3k74
2393a12L03J0l79J71L76Mn19J9L38o23J07O26j67n41N28Q8l07k59L85J81n87P18
2415C60P3n91RO95o13j50K85j50o2J1j7j15J54K94j30K9L17j38k39J82K74l58
$$ plain form
2258 -325 192 300 1 -362 -57 -84 -415 245 37 -404 -219 65 63 -192 293 285 -357 56 412 116 -327 -16
2280 -16 325 164 -292 517 214 -401 367 150 -141 -208 260 9 -333 -234 -43 -42 -198 506 130 -173 225 199
2302 199 -89 189 374 -37 -207 132 13 -277 -106 -16 -225 57 51 -355 -200 428 110 -184 -139 411 223
2323 223 41 297 279 -203 48 -52 -13 -26 -23 -133 -137 139 -37 169 88 -70 -67 236 2 94 47 164 -311 227
2347 227 221 -77 198 31 314 -50 -203 92 -55 -178 146 -100 58 -49 -118 -62 10 210 -76 71 153 14
2369 14 -407 306 298 -427 158 71 -294 -292 152 -181 -169 235 178 -336 -77 -100 2 -185 115 209 -86 99 162 -112
2393 -112 191 201 -178 -7 369 373 -146 -127 211 -412 -305 321 154 -387 141 229 -78 -337 48 229 -358 360
2415 360 433 -158 -149 546 -67 -217 68 -82 -144 -133 -150 -265 -111 183 53 82 399 261 22 204 478 120
2437A20k33L12k17l00rK70j59J71L10k35m98O07ln39J37K82O2l62K76j71L08q5
2459D4k37J46J70j81J51j94r4j28L24m8l6K89k25k23L4K79k6j3j61Q4jJ14J26
2482A94j07J76m24K27m93K12J18J48k30L48m8n61K89M14j39m7K68j65l94L41J8
2503A45j78L6L72n40m13Q26k93j77J43K37k24l47K57L64p26O69J98l30k05L7L45
2524A96n11M57J99j76k39M46k72o56K99N75q5l13J97P2q91L84M44J21o7K21k08
$$ plain form
2437 120 -113 199 -18 -318 -327 -57 -216 -45 265 30 -468 139 136 -403 -266 16 78 -284 -8 -179 129 44
2459 44 -193 -47 123 -58 93 -101 -195 -323 1 -47 -83 206 -19 -242 -208 71 45 32 -129 -45 -46 68 194
2482 194 87 263 -161 66 -427 -215 -97 51 -179 169 121 -440 -151 263 124 77 345 180 -214 127 145
2503 145 -33 3 375 -165 -578 248 -45 -222 -79 158 -66 -413 -156 208 -518 151 349 19 -186 -149 196
2524 196 -315 142 341 165 -74 372 100 -556 -257 318 233 -80 117 189 -702 -318 126 247 180 401 193
$$ [...]
8191b0
##END NTUPLES=NMR FID
##END=
