##TITLE=1H_DE-80H_X3
 200.13MHz, d2o
 8 sc
 
 19ns.26.2.2025
##JCAMPDX= 6.0         $$ Bruker NMR JCAMP-DX V2.0
##DATA TYPE= NMR FID
##DATA CLASS= NTUPLES
##ORIGIN= UXNMR, Bruker Analytische Messtechnik GmbH
##OWNER= pz
$$ XWIN-NMR		Version 3.5
$$ Tue Apr 22 10:02:26 2025 Russian Standard Time (UT+4h)  Yarkov@DPX200
##.OBSERVE FREQUENCY= 200.1313
##.OBSERVE NUCLEUS= ^1H
##.DELAY= (6, 6)
##.ACQUISITION MODE= SIMULTANEOUS
##.ACQUISITION SCHEME= undefined
##.AVERAGES= 8
##.DIGITISER RES= 18
##SPECTROMETER/DATA SYSTEM= spect
##.PULSE SEQUENCE= zg30
##.SOLVENT NAME= CDCl3
##.SHIFT REFERENCE= (INTERNAL, CDCl3, 0, 14.3821)
##AUDIT TRAIL= $$ (NUMBER, WHEN, WHO, WHERE, WHAT)
$$ ##TITLE= Audit trail, XWIN-NMR		Version 3.5
$$ ##JCAMPDX= 5.01
$$ ##ORIGIN= Bruker BioSpin GmbH
$$ ##OWNER= Yarkov
$$ C:/Bruker/XWIN-NMR/data/yarkov2/nmr/H-C/1/audita.txt
$$ ##AUDIT TRAIL=  $$ (NUMBER, WHEN, WHO, WHERE, WHAT)
(   1,<2025-04-22 10:00:05.40 +0400>,<Yarkov>,<DPX200>,
      <created by zg, POWCHK disabled, PULCHK disabled
       configuration hash MD5:
       00 E9 B6 7A A2 85 ED C7 34 08 36 98 17 FE 4E 26
       data hash MD5: 16K
       D4 E8 31 6F 0C 06 1B 2A F2 38 FD 50 6B 31 AD 89>)
$$ ##END=
$$ 
$$ hash MD5
$$ 12 9A D5 53 A1 1C 86 97 71 EE 00 D6 C6 C4 41 54
##$RELAX= 
##$RELAX= 
##$RELAX= 
##$RELAX= 
##$RELAX= 
##$RELAX= 
$$ Bruker specific parameters
$$ --------------------------
##$DU= <C:/Bruker/XWIN-NMR>
##$EXPNO= 1
##$NAME= <H-C>
##$PROCNO= 1
##$TYPE= <nmr>
##$USER= <yarkov2>
##$AMP= (0..31)
100 100 100 100 100 100 100 100 100 100 100 100 100 100 100 100 100 100 
100 100 100 100 100 100 100 100 100 100 100 100 100 100 
##$AQSEQ= 0
##$AQ_mod= 1
##$AUNM= <au_zg>
##$AUTOPOS= <>
##$BF1= 200.13
##$BF2= 200.13
##$BF3= 200.13
##$BF4= 200.13
##$BF5= 200.13
##$BF6= 200.13
##$BF7= 200.13
##$BF8= 200.13
##$BYTORDA= 1
##$CFDGTYP= 0
##$CFRGTYP= 5
##$CHEMSTR= <none>
##$CNST= (0..31)
1 1 145 1 1 1 1 1 1 1 1 1 1 1 1 1 1 1 1 1 1 1 1 1 1 1 1 1 1 1 1 1 
##$CPDPRG= <>
##$CPDPRG1= <>
##$CPDPRG2= <>
##$CPDPRG3= <>
##$CPDPRG4= <mlev>
##$CPDPRG5= <mlev>
##$CPDPRG6= <mlev>
##$CPDPRG7= <mlev>
##$CPDPRG8= <mlev>
##$CPDPRGB= <>
##$CPDPRGT= <>
##$D= (0..31)
0 0.7 0 0 0 0 0 0 0 0 0 0.03 0 0 0 0 0 0 0 0 0 0 0 0 0 0 0 0 0 0 0 0 
##$DATE= 1745301605
##$DBL= (0..7)
120 120 120 120 120 120 120 120 
##$DBP= (0..7)
150 150 150 150 150 150 150 150 
##$DBP07= 0
##$DBPNAM0= <>
##$DBPNAM1= <>
##$DBPNAM2= <>
##$DBPNAM3= <>
##$DBPNAM4= <>
##$DBPNAM5= <>
##$DBPNAM6= <>
##$DBPNAM7= <>
##$DBPOAL= (0..7)
0.5 0.5 0.5 0.5 0.5 0.5 0.5 0.5 
##$DBPOFFS= (0..7)
0 0 0 0 0 0 0 0 
##$DE= 6
##$DECBNUC= <off>
##$DECIM= 32
##$DECNUC= <off>
##$DECSTAT= 4
##$DIGMOD= 1
##$DIGTYP= 9
##$DL= (0..7)
0 120 120 120 120 120 120 120 
##$DP= (0..7)
150 150 150 150 150 150 150 150 
##$DP07= 0
##$DPNAME0= <>
##$DPNAME1= <>
##$DPNAME2= <>
##$DPNAME3= <>
##$DPNAME4= <>
##$DPNAME5= <>
##$DPNAME6= <>
##$DPNAME7= <>
##$DPOAL= (0..7)
0.5 0.5 0.5 0.5 0.5 0.5 0.5 0.5 
##$DPOFFS= (0..7)
0 0 0 0 0 0 0 0 
##$DQDMODE= 0
##$DR= 18
##$DS= 0
$$ [...]
##$SUBNAM2= <"">
##$SUBNAM3= <"">
##$SUBNAM4= <"">
##$SUBNAM5= <"">
##$SUBNAM6= <"">
##$SUBNAM7= <"">
##$SUBNAM8= <"">
##$SUBNAM9= <"">
##$SW= 18.0517328524113
##$SWIBOX= (0..15)
0 0 2 0 0 0 0 0 0 0 0 0 0 0 0 0 
##$SW_h= 3612.71676300578
##$TD= 16384
##$TD0= 1
##$TE= 0
##$TE2= 300
##$TE3= 300
##$TEG= 300
##$TL= (0..7)
0 120 120 120 120 120 120 120 
##$TP= (0..7)
150 150 150 150 150 150 150 150 
##$TP07= 0
##$TPNAME0= <>
##$TPNAME1= <>
##$TPNAME2= <>
##$TPNAME3= <>
##$TPNAME4= <>
##$TPNAME5= <>
##$TPNAME6= <>
##$TPNAME7= <>
##$TPOAL= (0..7)
0.5 0.5 0.5 0.5 0.5 0.5 0.5 0.5 
##$TPOFFS= (0..7)
0 0 0 0 0 0 0 0 
##$TUNHIN= 0
##$TUNHOUT= 0
##$TUNXOUT= 0
##$USERA1= <user>
##$USERA2= <user>
##$USERA3= <user>
##$USERA4= <user>
##$USERA5= <user>
##$V9= 5
##$VALIST= <valist>
##$VCLIST= <CCCCCCCCCCCCCCC>
##$VD= 0
##$VDLIST= <DDDDDDDDDDDDDDD>
##$VPLIST= <PPPPPPPPPPPPPPP>
##$VTLIST= <TTTTTTTTTTTTTTT>
##$WBST= 1024
##$WBSW= 4
##$XGAIN= (0..3)
0 0 0 0 
##$XL= 0
##$YL= 0
##$YMAX_a= 94891
##$YMIN_a= -120032
##$ZGOPTNS= <>
##$ZL1= 120
##$ZL2= 120
##$ZL3= 120
##$ZL4= 120
##$ABSF1= 10
##$ABSF2= 0
##$ABSG= 5
##$ABSL= 3
##$ALPHA= 0
##$AQORDER= 0
##$ASSFAC= 0
##$ASSFACI= 0
##$ASSFACX= 0
##$ASSWID= 0
##$AUNMP= <proc_1d>
##$AZFE= 0.1
##$AZFW= 0.1
##$BCFW= 1
##$BC_mod= 2
##$BYTORDP= 1
##$COROFFS= 0
##$CY= 83.5205535888672
##$DATMOD= 1
##$DC= 2
##$DFILT= <>
##$DTYPP= 0
##$F1P= 10.8118882576601
##$F2P= -7.23987719738617
##$FCOR= 0.5
##$FTSIZE= 0
##$FT_mod= 4
##$GAMMA= 1
##$GB= 0.15
##$INTBC= 1
##$INTSCL= 1
##$ISEN= 128
##$LB= 0.25
##$LEV0= 0
##$LPBIN= 0
##$MAXI= 10000
##$MC2= 0
##$MEAN= 0
##$ME_mod= 0
##$MI= 1.114404
##$NCOEF= 0
##$NC_proc= 0
##$NLEV= 6
##$NOISF1= 3.799351
##$NOISF2= 2.8
##$NSP= 1
##$NTH_PI= 0
##$NZP= 0
##$OFFSET= 14.38212
##$PC= 1
##$PHC0= -822.0957
##$PHC1= 1.133718
##$PH_mod= 1
##$PKNL= yes
##$PPARMOD= 0
##$PSCAL= 0
##$PSIGN= 0
##$REVERSE= no
##$SF= 200.129724274929
##$SI= 16384
##$SIGF1= 3
##$SIGF2= 2
##$SINO= 400
##$SIOLD= 16384
##$SREGLST= <1H.CDCl3>
##$SSB= 0
##$STSI= 0
##$STSR= 0
##$SW_p= 3205.1282051282
##$SYMM= 0
##$S_DEV= 0
##$TDeff= 0
##$TDoff= 0
##$TI= <>
##$TILT= no
##$TM1= 0
##$TM2= 0
##$TOPLEV= 0
##$USERP1= <user>
##$USERP2= <user>
##$USERP3= <user>
##$USERP4= <user>
##$USERP5= <user>
##$WDW= 1
##$XDIM= 8192
##$YMAX_p= 0
##$YMIN_p= 0
$$ End of Bruker specific parameters
$$ ---------------------------------
##NTUPLES= NMR FID
##VAR_NAME=  TIME,          FID/REAL,        FID/IMAG
##SYMBOL=    X,             R,               I
##VAR_TYPE=  INDEPENDENT,   DEPENDENT,       DEPENDENT
##VAR_FORM=  AFFN,          ASDF,            ASDF
##VAR_DIM=   8192,          8192,            8192
##UNITS=     SECONDS,       ARBITRARY UNITS, ARBITRARY UNITS
##FACTOR=    0.0002768,     1,               1
##FIRST=     0,             0,               0
##LAST=      2.2672688,     0,               0
##MIN=       0,             -120032,         0
##MAX=       2.2672688,     94891,           0
$$ Real data points
##PAGE= N=1
##DATA TABLE= (X++(R..R)), XYDATA
$$ plain form
0 0 0 0 0 0 0 0 0 0 0 0 0 0 0 0 0 0 0 0 0 -5 8 -8 8 -8 8 -8 13 -16 16 -19 23 -24 28 -31 36 -39 44 -50 54 -60 67
41 67 -74 82 -91 100 -111 122 -134 147 -163 179 -197 218 -241 267 -296 331 -370 417 -475 545 -634
62 -634 752 -911 1141 -1498 2116 -3392 7004 -38813 -120032 32505 83065 2882 41957 94891
76 94891 23839 -857 50828 36721 -5614 25532 27500 -33277 -30225 -1349 -31426 -27311 5993
89 5993 -15359 -32050 -13146 -6722 -3553 2549 7907 16831 4326 -11470 7469 25167 10948
102 10948 -4264 3473 6515 -9975 -3228 10226 -15904 -17044 13160 -6476 -24082 7717 7364
115 7364 -12290 8851 19336 -2811 -3445 17280 11450 -8628 2692 10800 -11706 -9058 6922
128 6922 -9297 -12721 3668 -1942 -7092 1289 -92 -4712 -2608 6788 10053 -1309 -661 8434 1042
$$ packed form
0@%%%%%%%%%%%%%%%%%%%nJ3j6J6j6J6j6K1k9L2l5M2m7N2n9O7p5Q3r4J04j14J27
41F7j41J56j73J91k11K33k56K81l10L42l76M15m59N08n63O27p01P87q92J020j179
62f34J386j663K052k639L614n508J0396m5817q1219J52537N0560q0183L9075N2934
76I4891p1052k4696N1685j4107m2335L1146J968o0777L052K8876l0077M115L3304
89E993k1352j6691J8904O424L169O102N358Q924j2505j5796J8939J7698j4219
102A0948j5212P737L042j6490O747J3454k6130j140L0204j9636j7606L1799l53
115G364j9654K1141J0485k2147o34K0725n830k0078J1320Q108k2506K648J5980
128F922j6219l424J6389n610n150Q381j381m620K104R396L265j1362O48R095p392
$$ plain form
143 1042 937 9866 3521 -3731 -2062 -300 -3539 -8411 -1417 2496 -10050 -5439 4903 -8009 -4690
158 -4690 12741 4212 -3818 4961 4606 -2022 1651 9786 2636 -8053 1803 5212 -8018 -1103 6970
173 6970 -6418 -6584 3336 -1423 -5522 -1302 2071 533 -3716 2083 4948 -3387 1370 8201 -309
188 -309 -2967 2353 1729 -1430 -2074 2564 1201 -6395 1048 6033 -6275 -2581 6653 -2154 -4283 4268
204 4268 1736 -4231 -602 5451 903 -4828 3377 3926 -6330 961 6681 -4550 -3428 3800 -1759
219 -1759 -4178 226 1780 -1746 -3192 2592 1594 -4196 2006 5077 -2543 115 3636 -767 -349 2091
235 2091 2301 107 -2051 1908 1498 -4447 69 1953 -5234 -2575 1127 -2373 -2213 189 789 -694
251 -694 -1340 3132 2435 -1968 3357 3802 -2550 1595 4047 -1068 -384 1633 -394 -2363 -2023 1382 -1290
$$ packed form
143A042j05Q929o345p252J669J762l239m872O994L913j2546M611J0342j2912L319
158d690J7431q529q030Q779l55o628L673Q135p150j0689R856L409j3230O915Q073
173F970j3388j66R920m759m099M220L373j538m249N799K865q335M757O831q510
188c09k658N320o24l159o44M638j363p596P443M985j2308L694R234q807k129Q551
204D268k532n967L629O053m548n731Q205N49j0256P291N720j1231J122P228n559
219a759k419M404J554l526j446N784r98n790O202L071p620K658L521m403M18K440
235B091K10k194k158L959m10n945M516J884p187K659L702l500J60K402O00j483
251f94o46M472o97m403N325M45o352M145K452n115O84K017k027j969L40L405k672
$$ plain form
268 -1290 -4763 512 82 -4461 943 2426 -2377 230 2682 1333 650 1470 3255 546 -1826 2695
284 2695 1274 -3498 906 946 -3883 -1340 300 -1652 -1684 -436 890 -878 -1569 2771 1667 -1545
300 -1545 3130 2401 -1702 1486 2714 -281 -652 257 -111 -2143 -2557 1173 -1307 -3770 982 142 -2618
317 -2618 1288 2321 -76 677 1514 1915 97 530 3288 80 -2548 1621 -332 -3531 93 -171
333 -171 -2827 -1589 -771 -598 -1242 -589 2119 -83 -1058 3011 1582 -556 3039 2152 -466 857 1008
350 1008 210 -1238 -971 557 -2302 -2648 855 -1179 -3099 985 244 -1741 827 1194 1023 321 1513
367 1513 2551 118 151 2678 -37 -1658 1429 -231 -2443 -800 -747 -1492 -1798 -823 316 -1395 -376
384 -376 2162 -438 -590 2655 615 -494 1784 1041 -124 -183 84 599 -1352 -809 464 -2215 -1819
$$ packed form
268a290l473N275m30m543N404J483m803K607K452j349o83Q20J785k709k372M521
284B695j421m772M404M0m829K543J640j952l2J248J326j768o91M340j104l212
300a545M675p29m103L188J228k995l71R09l68k032m14L730k480k463M752q40k760
317b618L906J033k397P53Q37M01j818M33K758l208k628M169j953l199L624k64
333a71k656J238Q18J73o44O53K708k202r75M069j429k138L595q87k618J323J51
350A008p98j448K67J528k859l46L503k034j920M084p41j985K568L67j71p02J192
367A513J038k433L3K527k715j621L087j660k212J643N3p45l06R75J139j711J019
384c76K538k600j52L245k040j109K278p43j165n9K67N15j951N43J273k679L96
$$ plain form
401 -1819 678 -984 -1416 630 290 -587 384 930 1036 253 1063 1870 -211 -71 1685 -843 -852 645
419 645 -853 -1529 -553 -429 -519 -1050 -166 326 -1238 -108 1792 -287 321 2055 435 -118 955 655
437 655 389 -24 210 320 -1381 -592 659 -1669 -1055 769 -1056 -1131 363 353 -104 242 1251 618 -907
456 -907 1036 1998 -732 225 1357 -856 -610 779 -378 -1089 -626 -395 -347 -1624 403 823 -1280 323
474 323 1261 -528 52 1671 756 267 454 834 369 -739 494 640 -1471 -523 516 -1442 -994 374
492 374 -212 -697 -238 378 471 -460 872 1169 -930 542 1349 -413 24 819 -248 -488 -178 160 -315
511 -315 -1200 -43 -220 -1292 16 482 -604 110 642 28 409 526 613 526 73 584 259 -581 148 241
531 241 -950 -192 -147 -1170 -414 -191 -222 -211 -595 219 240 -324 801 795 -290 1069 619 -126 565 178 32
$$ packed form
401a819K497j662m32K046l40q77R71N46J06p83Q10Q07k081J40J756k528rJ497
419F45j498o76R76J24r0n31Q84M92j564J130J900k079O08J734j620n53J073l00
437F55k66m13K34J10j701P89J251k328O14J824j825p5J494j0m57L46J009o33j525
456i07J943R62k730R57J132k213K46J389j157p11M63K31M8j277K027M20k103J603
474C23R38j789N80J619r15m89J87L80m65j108J233J46k111R48J039j958M48J368
492C74n86m85M59O16R3r31J332K97k099J472Q07j762M37P95j067k40L10L38m75
511c15q85J157j77j072J308M66j086P14N32o14L81J17Q7q7m53N11l25q40P29R3
531B41j191P58M5j023P56K23l1J1l84Q14K1n64J125oj085J359m50p45O91l87j46
$$ plain form
552 32 120 -286 -144 -673 -946 132 -113 -997 319 -129 -824 119 548 -364 265 508 635 230 69 841
572 841 106 -527 554 -57 -803 359 -3 -612 -570 -101 -527 -455 -326 665 -101 -198 953 277 -448 778
592 778 553 26 316 478 305 -650 -462 495 -434 -710 460 22 -1335 92 5 -462 219 651 264 10
612 10 357 835 68 -334 901 -78 -482 719 -129 -682 -199 26 -413 -424 -599 154 -176 -563 799 28
632 28 -98 617 272 -226 414 301 335 -123 -37 305 -421 -394 235 -379 -1094 253 -285 -868 54 -144 -9
653 -9 -14 63 237 -1 296 793 140 -3 719 42 -244 -6 -103 -323 -42 -342 -28 -333 -88 123 -505 -348
675 -348 534 85 59 312 -51 256 447 -27 176 127 -235 540 -65 -229 265 -520 -420 129 -397 -407 -83
696 -83 -54 340 -241 324 449 -101 304 626 74 -108 347 -6 -12 309 -156 -560 -382 -23 207 -297 -227 175
$$ packed form
552C2Q8m06J42n29k73J078k45q84J316m48o95R43M29r12O29K43J27m05j61P72
572H41p35o33J081o11p46J162l62o09M2M69m26P2J29R91p66r7J151o76p25J226
592G78k25n27K90J62j73r55J88R57r29k76J170m38j357J427q7m67O81M32l87k54
612A0L47M78p67m02J235r79m04J201q48n53M83K25m39j1j75P53l30l87J362p71
632B8j26P15l45m98O40j13L4m58Q6L42p26K7O29o14p15J347n38n83R22j98J35
653inP7J74k38K97M97o53j43P22o77k86K38r7k20K81l00L14l05K45K11o28J57
675c48Q82m49k6K53l63L07J91m74K03m9l62P75o05j64M94p85J00N49n26j0L24
696h3K9L94n81N65J25n50M05L22n52j82M55l53oL21m65m04J78L59K30n04P0M02
$$ plain form
718 175 -500 110 159 -35 -76 261 295 254 -107 196 487 -229 -114 554 -517 -167 140 -590 -482 8 -166
739 -166 -302 -167 85 327 -292 87 682 200 446 402 -84 -48 358 -112 79 103 118 -129 -590 -71 -79 -451
761 -451 -116 153 -294 30 148 99 244 177 432 148 -248 218 230 -296 230 135 -504 -147 -101 -297 -122 -163
783 -163 -116 -205 -522 466 -86 -530 118 160 49 -111 369 194 358 -162 152 62 -256 -182 -154 -393 51 -170
805 -170 -317 -45 152 -76 45 419 -36 24 -40 251 309 213 426 171 -282 195 -73 -12 -18 -327 -180 -333 -187
828 -187 -50 -209 -307 130 331 4 166 114 218 237 191 -153 -44 -57 -196 69 -92 272 62 -363 -161 -84
850 -84 -226 -139 -8 155 -23 241 161 130 -99 130 191 -213 442 -69 -184 146 81 126 123 -153 -222 -102 -243 64
874 64 48 -144 169 96 95 237 104 40 237 35 -20 -4 -252 255 71 -345 54 -29 -124 231 -225 -350 -392 -160
$$ packed form
718A75o75O10M9j94m1L37L4m1l61L03K91p16J15O68j071L50L07p30J08M90j74
739a66j36J35K52K42o19L79N95m82K46m4m86L6M06m70J91K4J5k47m61N19ql72
761d51L35K69m47L24J18m9J45o7K55k84l96M66J2n26N26r5o39L57M6j96J75m1
783a63M7q9l17R88n52m44O48M2j11j60M80j75J64n20L14r0l18P4K8k39M44k21
805a70j47K72J97k28J21L74m55O0o4K91N8r6K13k55m53M77k68O1ol09J47j53J46
828a87J37j59r8M37K01l27J62n2J04J9m6l44J09j3j39K65j61L64k10m25K02P7
850h4j42Q7J31J63j78K64q0l1k29K29O1m04O55n11j15L30o5M5lk76o9J20j41L07
874F4j6j92L13p3jJ42j33o4J97k02n5J6k48N07j84m16L99q3r5L55m56j25m2K32
$$ plain form
898 -160 -157 112 250 141 0 4 216 98 192 157 27 -1 360 -106 -340 183 5 -64 -302 -184 -107 -133 -27 60
922 60 108 -151 279 176 56 345 0 553 -101 299 163 206 -13 -86 -297 -260 144 -264 -259 65 -140 -169 115
945 115 121 376 124 73 -65 -3 -8 339 -126 -173 71 -170 -89 -244 -331 15 -78 -93 219 -75 -77 131 -106 308 390
970 390 56 176 -149 283 559 224 81 -154 -201 -234 38 26 -192 -382 42 -90 -18 135 30 83 76 262 20
993 20 64 -42 -265 64 -36 115 7 -105 69 -202 -65 249 116 -113 -41 49 -132 72 46 87 284 165
1015 165 94 420 -113 303 -138 -244 -31 -60 -2 -327 235 -375 -184 -174 -250 -255 294 -3 249 -22 123 367
1037 367 306 223 -72 67 -5 -51 83 -74 64 -129 47 -50 -158 -57 -165 -205 -227 -193 201 148 -94 288 140
1060 140 235 -84 183 217 73 -104 80 120 185 -75 -299 -227 -140 -106 -55 -65 -393 99 -36 21 -37 173 395 189
$$ packed form
898a60LK69J38j09j41MK12j18R4l5j30k8L61m66k34N23j78o9k38J18P7k6J06Q7
922F0M8k59M30j03j20K89l45N53o54M00j36M3k19p3k11L7M04m08NL24k05k9K84
945A15OK55k52n1j38O2nL47m65m7K44k41Q1j55q7L46r3j5L12k94kK08k37M14Q2
970C90l34J20l25M32K76l35j43k35m7l3K72j2k18j90M24j32P2J53j05N3pJ86k42
993B0M4j06k23L29j00J51j08j12J74k71J37L14j33k29P2R0j81K04k6M1J97j19
1015A65p1L26n33M16m41j06K13k9N8l25N62o10J91J0p6nN49k97K52k71J45K44
1037C67o1q3k95J39p2m6J34j57J38j93J76r7j08J01j08m0k2L4L94n3k42L82j48
1060A40R5l19K67L4j44j77J84M0O5k60k24P2Q7L4N1j0l28M92j35N7n8K10K22k06
$$ plain form
1084 189 -63 -269 -103 25 -56 -82 112 -36 -157 -2 121 -105 -175 138 -205 -215 -96 16 -152 107 33 22
1106 22 10 -230 96 262 289 140 140 -75 -142 105 -87 -207 -117 -59 -11 10 -7 -72 -121 134 13 -90 251 158 27
1131 27 -70 32 164 -7 -28 302 -84 -98 -26 -44 -25 68 4 97 101 13 179 -165 -229 16 29 97 -85 249 -247
1156 -247 148 198 -100 95 -233 102 143 228 -160 219 -83 -150 132 112 -25 205 30 -76 171 -288 134 -5
1178 -5 202 -30 52 -103 131 36 66 38 194 -92 -29 68 95 -81 49 -192 -40 41 472 -174 24 256 -123
1201 -123 -305 -251 167 -258 -257 461 -195 -279 -14 99 45 126 -159 1 -28 -74 384 233 98 -125 -140 -204 38
1224 38 -188 -183 -245 95 -172 91 79 98 -49 -78 247 -108 126 32 -24 -169 230 109 22 96 -137 137 -77 36
1248 36 -17 69 -283 -107 -54 57 -8 -102 163 8 43 37 322 -254 4 -29 -103 263 99 6 -86 89 -88 9 -51
$$ packed form
1084A89k52k06J66J28q1k6J94j48j21J55J23k26p0L13l43j0J19J12j68K59p4j1
1106B2j2k40L26J66K7j49%k15o7K47j92j20R0N8M8K1j7o5m9K55j21j03L41r3j31
1131B7r7J02J32j71k1L30l86j4P2j8J9R3o4R3Mq8J66l44o4K45J3O8j82L34m96
1156b47L95N0k98J95l28L35M1Q5l88L79l02o7K82k0j37K30j75j06K47m59M22j39
1178eK07k32Q2j55K34r5L0k8J56k86O3R7K7j76J30k41J52Q1M31o46J98K32l79
1201a23j82N4M18m25JP18o56q4K65J13n4Q1k85J60k9m6M58j51j35k23j5o4K42
1224C8k26No2L40k67K63j2J9j47k9L25l55K34r4n6j45L99j21q7P4k33K74k14J13
1248C6n3Q6l52J76N3J11o5r4K65j55L5oK85n76K58l3p4L66j64r3r2J75j77R7o0
$$ plain form
1273 -51 50 102 -293 -273 -213 -69 102 -42 -151 5 193 -148 -33 40 -89 -86 150 150 25 -27 36 52 -52 46
1297 46 -58 -24 226 -12 -111 -232 190 -7 157 -18 110 42 -152 -22 -195 -244 125 6 -66 -125 65 21 -81
1320 -81 -150 -182 198 -289 86 33 72 18 23 -191 -4 -80 -102 51 -44 8 -20 -59 -132 -41 -191 19 38 166 31 76
1346 76 -255 83 120 50 -146 104 5 -75 96 -44 -126 -172 -201 -29 9 -111 -146 -22 99 74 -94 -20 -310 -139
1370 -139 -130 -4 -145 -227 -37 167 -24 -14 -92 -14 -116 -10 -357 34 -129 -59 -32 -86 330 -61 63 387 112
1393 112 -219 148 124 140 88 408 -51 -143 -135 -30 -49 -43 -144 -189 192 -253 140 -5 85 -273 -298 439 39 -42
1417 -42 73 -263 -90 -171 198 160 71 -67 153 246 -225 -94 -228 -136 23 110 129 -63 -66 186 119 160 5 -169
1441 -169 147 97 202 -234 105 -39 429 -8 -133 33 31 -24 -133 -36 -76 -109 -102 -307 196 106 -36 -69 64 -142
$$ packed form
1273e1J01N2l95K0O0J44J71j44j09J56J88l41J15P3j29LK36%j25n2O3J6j04R8
1297D6j04L4K50k38r9j21M22j97J64j75J28o8j94J30j73m9L69j19p2n9J90m4j02
1320h1o9l2L80m87L75n3L9n4Nk14J87p6k2J53r5N2k8l9p3R1j50K10J9J28j35M5
1346G6l31L38L7p0j96K50r9q0J71j40q2m6k9J72L8j20l5J24J21k5j68P4k90J71
1370a39RJ26j41q2J90K04j91J0p8P8j02J06l47L91j63P0K7n4M16l91J24L24k75
1393A12l31L67k4J6n2L20m59r2QJ05j9Oj01m5L81m45L93j45R0l58k5P37m00q1
1417d2J15l36J73q1L69l8q9j38K20R3m71J31j34R2J59Q7J9j92lK52o7M1j55j74
1441a69L16n0J05m36L39j44M68m37j25J66kn5j09R7m0l3Pk05N03r0j42l3J33k06
$$ plain form
1465 -142 224 -150 -323 -172 75 245 -130 111 -38 -246 -215 2 -70 -140 -69 -22 -7 226 278 -174 -94 128 113
1488 113 125 164 55 -224 147 -335 -26 50 58 -59 -131 -28 129 -121 13 -38 -84 104 -71 12 -136 -76 -69 67
1512 67 36 -264 35 169 63 -127 9 -47 -166 -1 -1 156 -88 59 167 214 35 85 -4 -119 59 101 -175
1535 -175 -160 -66 -76 -200 179 22 -7 65 -136 -88 158 72 -139 -138 38 126 136 252 2 -277 126 -94 -2 169
1559 169 -31 177 -65 103 69 -88 258 196 -19 -98 -139 48 -44 -235 304 221 21 30 -109 279 -311 -278 -60
1582 -60 66 -174 132 -29 -229 -1 -103 -80 73 -24 14 -5 -84 289 30 -35 61 -115 -243 67 104 196 51
1605 51 -190 12 174 21 84 -187 52 115 -3 101 65 198 181 0 -96 -66 -142 -138 -1 345 -241 274 23
1628 23 5 99 -20 -25 -212 -149 -78 31 16 206 -272 112 -67 -178 225 108 -3 -68 41 178 -13 251 -10
$$ packed form
1465a42L66l74j73J51K47J70l75K41j49k08L1K17p2p0P1M7J5K33N2m52Q0K22j5
1488A13J2L9j09k79L71m82L09P6Qj17p2J03J57k50J34n1m6J88j75Q3j48O0PJ36
1512F7l1l00K99J34j06j90J36n6j19J65%J57k44J47J08M7j79N0q9j15J78M2k76
1535a75J5R4j0j24L79j57k9P2k01M8K46q6k11JJ76Q8J0J16k50k79M03k20R2J71
1559A69k00K08k42J68l4j57L46o2k15p9m1J87r2j91N39q3k00Rj39L88n90L3K18
1582f0J26k40L06j61k00K28j02K3J53r7L8j9p9L73k59o5R6j76j28L10L7R2j45
1605E1k41K02J62j53O3k71K39O3j18J04l6J33j7j81r6L0p6MJ37L46n86N15k51
1628B3j8R4j19nj87O3P1J09j5J90m78L84j79j11M03j17j11o5J09J37j91K64k61
$$ plain form
1651 -10 115 -108 -23 141 -191 -167 -162 -150 18 -259 270 35 -131 71 -160 -127 69 -44 -321 -322 27 -198 178
1674 178 -79 -201 180 -44 -42 16 -123 316 49 -169 16 35 -142 -1 -91 139 173 -24 137 -231 -22 -66
1696 -66 4 -52 81 -69 -181 -100 159 -46 76 -165 -34 -69 53 167 175 71 -72 82 -108 43 110 -81 99
1719 99 71 59 2 32 -8 209 75 -181 65 -237 231 -202 297 123 -111 206 128 155 39 -259 20 191 -121
1742 -121 72 52 68 36 87 -294 -119 -19 -246 -59 32 32 190 137 -102 76 63 16 138 -137 -134 -92 -124 223 -71
1767 -71 -113 -8 83 -206 -65 218 -98 17 -14 108 153 424 -26 133 -128 -46 118 -99 24 -9 -37 -103 -79
1790 -79 -218 162 -36 176 41 -119 61 161 -101 -121 -186 -239 59 26 27 -179 3 -32 -87 -365 53 72 -212
1813 -212 -70 -212 41 137 -91 235 -76 128 -52 -32 -204 -95 195 87 -102 -50 282 -171 28 47 -3 85
$$ packed form
1651a0J25k23Q5J64l32K4NJ2J68k77N29k35j66K02k31L3J96j13k77jL49k25L76
1674A78k57j22L81k24KN8j39M39k67k18J85J9j77J41r0K30L4j97J61l68K09m4
1696f6P0n6J33j50j12Q1K59k05J22k41J31l5J22J14Qj04j43J54j90J51O7j91J80
1719I9k8j2n7L0m0K17j34k56K46l02M68m33M99j74k34L17p8K7j16k98K79J71l12
1742a21J93k0J6l2N1l81J75J00k27J87R1%J58n3k39J78j3m7J22k75LM2l2L47k94
1767g1m2J05R1k89J41K83l16J15l1J22M5K71m50J59k61Q2J64k17J23l3k8o6K4
1790g9j39L80j98K12j35j60J80J00k62k0o5n3K98l3Jk06J82l5n5k78M18J9k84
1813b12J42j42K53R6k28L26l11K04j80K0j72J09K90j08j89N2L32m53J99J9n0Q8
$$ plain form
1835 85 152 115 -91 -130 -21 228 27 58 159 -158 219 47 -63 -134 133 -60 -109 344 121 -166 -35 132
1857 132 -18 221 156 273 -289 5 185 186 -36 82 69 -425 -15 154 28 200 -129 99 36 206 97 -165
1879 -165 -38 28 103 22 73 -218 -26 -24 -9 -99 -108 109 32 202 -187 -175 -5 11 122 182 71 -67 338 31 -24
1904 -24 132 98 -69 -131 -137 -87 114 106 72 -20 -142 -37 -26 -68 -58 218 -178 303 115 73 -148 -245 -76 154 -118
1929 -118 247 -282 61 238 95 5 26 -100 68 -16 96 -161 56 -29 -381 38 140 -30 -147 -31 -117 18
1951 18 -25 -5 -20 110 -48 -113 29 123 -218 -101 118 -157 53 11 116 43 13 -257 39 -201 -84 182 -147
1974 -147 -86 -24 -64 45 141 -34 114 307 147 -22 -78 -29 13 89 -196 11 -8 -12 68 95 107 -68 81 -37 66
1999 66 -160 -76 72 117 39 219 19 2 201 61 165 205 -105 51 -86 -194 -162 -82 -191 -143 -48 -242 -91
$$ packed form
1835H5O7l7k06l9J09K49k01L1J01l17L77j72j10p1K67j93m9M53k23k87J31J67
1857A32j50K39o5J17n62K94J80Jk22J18j3m94M10J69j26J72l29K28o3J70j09k62
1879a65J27O6P5q1N1k91J92KJ5r0rK17p7J70l89J2J70J6J11O0j11j38M05l07n5
1904b4J56l4j67o2oN0K01ql4r2j22J05J1m2J0K76l96M81j88m2k21r7J69K30k72
1929a18L65n29L43J77j43r0K1j26J68q4J12k57K17q5l52M19J02j70j17J16q6J35
1951A8m3K0j5J30j58o5J42R4l41J17K19k75K10m2J05p3l0k70K96k40J17K66l29
1974a47O1O2m0J09R6j75J48J93j60j69n6M9M2P6k85K07j9mQ0K7J2j75J49j18J03
1999F6k26Q4J48M5p8J80k00j7J99j40J04M0l10J56j37j08L2Q0j09M8R5j94J51
$$ plain form
2022 -91 150 229 36 5 165 133 228 -190 -386 92 101 -18 -207 71 10 -23 55 -88 102 -15 138 128 -113 19
2046 19 197 -220 -2 -46 81 19 -27 42 146 -269 232 56 24 317 85 4 29 231 -21 -333 148 102 155
2069 155 179 -16 102 64 126 -11 -9 132 40 137 89 92 -8 -167 30 200 44 -163 -169 60 12 84 -90 -114 -95
2094 -95 -94 147 -191 -339 343 80 110 86 -78 34 -28 5 24 193 -220 116 -17 -146 67 66 45 104 247 162
2118 162 166 89 -12 200 -101 -177 57 -81 -299 -99 -42 -95 -267 24 153 -78 -19 -90 -40 -41 98 363 120 181
2142 181 5 43 -421 -70 44 146 24 349 26 -177 40 -137 -195 159 57 -142 -26 185 82 -47 38
2163 38 -51 -13 -19 -63 -176 283 -166 116 62 -123 -33 17 -73 77 -44 -110 271 -39 -124 74 -110 70 205 -17
2187 -17 30 44 20 374 9 -23 -28 98 -260 272 49 105 53 -147 -104 152 -51 -143 -81 -197 85 -76 -214 -111
$$ packed form
2022i1K41P9j93l1J60l2R5m18j96M78Rj19j89K78o1l3P8j43J90j17J53j0k41J32
2046A9J78m17K18m4J27o2m6O9J04m15N01j76l2K93k32q1K5K02k52l12M81m6N3
2069A55K4j95J18l8O2j37KJ41r2R7m8Lj00j59J97J70j56k07oK29m8P2j74k4J9
2094i5JK41l38j48O82k63L0k4j64J12o2L3J9J69m13L36j33j29K13jk1N9J43q5
2118A62Mp7j01K12l01p6K34j38k18K00N7n3j72K91J29k31N9p1N0jJ39K65k43O1
2142A81j76L8m64L51J14J02j22L25l23k03K17j77n8L54j02j99J16K11j03j29Q5
2163C8q9L8om4j13M59m49K82n4j85R0N0r0J50j21o6L81l10q5J98j84J80J35k22
2187a7M7J4k4L54l65l2nJ26l58N32k23N6n2k00M3K56k03r2O2j16K82j61j38J03
$$ plain form
2211 -111 -54 -11 89 -3 47 284 -180 163 -209 91 -53 -202 19 131 48 -103 -70 -33 92 -97 73 -100
2233 -100 -88 302 -29 -160 -273 30 -199 -9 62 -3 -33 -137 197 159 -98 299 -134 106 149 -267 -67 -192
2255 -192 -39 -122 194 -44 -31 -237 77 -95 50 9 -196 -3 46 161 86 10 -107 188 -196 -91 -131 5
2277 5 214 -122 102 -62 99 15 -145 15 12 103 -124 122 86 127 240 9 -61 244 223 67 -86 -204 10
2300 10 -38 281 -85 -125 -199 -112 152 19 41 -110 -109 128 -129 36 -171 249 -94 127 10 -50 -15 -160 88
2323 88 -145 72 203 8 160 -81 -173 203 -113 45 66 -59 68 -15 -85 194 -133 23 106 -171 11 98
2345 98 -46 138 -189 -287 -29 -157 -148 143 203 -15 125 -61 60 -136 58 -128 245 -154 -52 -154 -105 116
2367 116 -87 104 -173 191 139 111 240 244 218 137 31 312 -141 -19 -90 -13 190 301 -202 -14 -105 -186 75
$$ packed form
2211a11N7M3J00r2N0K37m64L43l72L00j44j49K21J12q3j51L3L7J25j89J70j73
2233a00J2L90l31j31j13L03k29J90P1o5l0j04L34l8k57L97m33K40M3m16K00j25
2255a92J53q3L16k38J3k06L14j72J45m1k05J93M9J15p5p6j17K95l84J05m0J36
2277EK09l36K24j64J61q4j60J60lR1k27K46l6M1J13k31p0L05k1j56j53j18K14
2300A0m8L19l66m0p4Q7K64j33K2j51JK37k57J65k07M20l43K21j17o0L5j45K48
2323H8k33K17J31j95J52k41r2L76l16J58K1j25J27q3p0K79l27J56Q3k77J82Q7
2345I8j44J84l27r8K58j28RK91O0k18J40j86J21j96J94j86L73l99J02j02M9K21
2367A16k03J91k77L64n2k8J29Mk6q1j06K81m53J22p1P7K03J11n03J88r1q1K61
$$ plain form
2390 75 52 -78 35 21 57 221 114 259 -94 -203 70 251 27 -28 -3 45 71 -29 -238 -9 319 164 -65
2413 -65 12 -192 93 -54 102 253 130 28 100 147 -2 -181 -175 -32 -353 -62 242 379 -174 84 -115 -110 -274
2436 -274 -130 113 -19 -9 239 62 271 51 140 -16 129 262 324 -67 -41 93 32 78 11 148 -124 -233
2458 -233 111 -81 16 99 -32 -208 -211 -47 46 -197 -155 156 184 100 -146 61 182 -207 89 -77 -171 10 28
2481 28 -285 47 -125 -400 -89 -296 -29 207 -74 -33 -91 3 30 -71 317 114 -4 -104 305 133 -239 29
2503 29 67 -108 -57 -41 -117 -58 -42 323 281 16 153 -2 114 93 -9 -50 -170 -66 -166 -55 183 -152 318
2526 318 127 -105 -80 295 -197 -155 -154 -148 268 -98 238 -132 -159 -121 -6 156 21 277 229 166 111 106 -92 187
2550 187 219 217 144 16 130 -62 -48 -256 -160 26 -81 -161 194 159 76 277 -159 -53 -76 118 288 203 -293 52
$$ packed form
2390G5k3j30J13j4L6J64j07J45l53j09K73J81k24n5K5M8K6j00k09K29L28j55k29
2413f5P7k04K85j47J56J51j23j02P2M7j49j79OJ43l21K91L04J37n53K58j99Nj64
2436b74J44K43j32J0K48j77K09k20Q9j56J45J33O2l91K6J34o1M6o7J37k72j09
2458b33L44j92R7Q3j31j76lJ64R3k43M2L11K8q4k46K07J21l89K96j66r4J81J8
2481B8l13L32j72k75L11k07K67K36k81M1n8R4K7j01L88k03j18j00M09j72l72K68
2503B9L8j75N1J6p6N9J6L65m2k65J37j55J16k1j02m1j20J04j00J11K38l35M70
2526C18j91k32K5L75m92M2JOM16l66L36l70k7L8J15J62j35K56m8o3n5nj98K79
2550A87L2kp3j28J14j92J4k08R6J86j07q0L55l5q3K01m36J06k3J94J70q5m96L45
$$ plain form
2574 52 93 -125 -58 355 -130 -6 116 162 30 -94 171 45 130 21 137 179 167 228 -84 316 92 241 200
2597 200 -187 -18 99 -6 206 258 8 -78 -297 15 191 7 -164 -27 -62 -91 -60 -4 -173 -107 -63 34 -150
2620 -150 -141 -64 203 178 126 -121 -169 109 -8 -112 -186 24 71 -1 125 -88 -98 -270 -111 -135 32 -75 2 -368
2644 -368 -74 278 -7 -193 -147 0 24 -86 -50 -243 -7 236 -80 12 121 54 -369 116 259 50 -63 139
2666 139 34 19 138 -12 -176 101 -25 -216 -60 127 -73 367 -67 60 -28 165 54 -204 -110 -148 161
2687 161 -222 -72 -48 128 57 -47 51 -24 -82 43 -213 -166 84 4 109 14 -102 -40 295 -280 -90 -402 128
2710 128 81 42 -147 -242 -112 6 -176 -84 177 39 30 -24 -91 -111 -13 177 -138 158 59 427 119 -90 97 -308
2734 -308 -92 49 130 -40 -169 -66 -36 226 -84 -243 -18 -100 -144 59 201 -234 121 279 165 174 -130 -127 -164
$$ packed form
2574E2M1k18O7M13m85J24J22M6j32j24K65j26Q5j09J16M2j2O1l12M00k24J49m1
2597B00l87J69J17j05K12N2k50q6k19L12J76j84j71J37l5k9L1N6j69O6M4R7j84
2620a50RP7K67k5n2k47m8K78j17j04p4K10M7p2J26k13j0j72J59k4J67j07P7l70
2644c68K94L52k85j86M6J47K4j10L6j93K36K43l16R2J09o7m23M85J43k09j13K02
2666A39j05j5J19j50j64K77j26j91J56J87k00M40m34J27q8J93j11k58R4l8L09
2687A61l83J50K4J76p1j04R8p5n8J25k56M7K50q0J05r5j16O2L35n75J90l12N30
2710A28m7l9j89r5J30J18j82R2K61j38rn4o7k0R8J90l15K96r9L68l08k09J87m05
2734c08K16J41Q1j70j29J03L0K62l10j59K25q2m4K03J42m35L55J58j14Rl04Ll7
$$ plain form
2757 -164 -143 -134 -88 23 -175 183 61 127 -57 -198 89 72 59 34 -48 -13 73 164 -44 5 53 113 4 10 59 66 -120
2784 -120 92 -86 40 -97 -156 -216 262 140 -20 -21 18 261 -149 -467 -115 -34 -47 130 -156 66 4 -125 59
2807 59 -12 -73 293 -213 -163 -2 -214 -175 -45 40 96 -58 -97 -137 -210 -61 292 -246 -24 -138 66 -1 134 233
2831 233 10 -57 46 68 56 48 -83 238 -322 348 -27 -72 82 147 -131 -22 -1 27 310 -27 306 204 -93
2854 -93 6 141 -21 122 -108 129 -120 47 -68 39 135 -291 -246 -228 129 48 22 223 -43 31 252 -4 144
2877 144 -55 86 -116 152 -22 -319 91 -22 7 -74 59 201 154 -19 -82 50 15 -9 -423 101 113 173 -171
2900 -171 -70 -129 23 -96 -122 145 -131 19 23 -25 38 -95 -6 110 50 259 84 112 35 183 20 72 -327 -100
2924 -100 21 -246 272 85 175 -177 -13 127 -20 124 -111 99 -46 74 9 -211 -94 255 235 -95 -17
$$ packed form
2757a64K1RM6J11j98L58j22O6j84j41K87j7j3k5q2L5Q6R1k08M9M8O0j09OM9Pj86
2784a20K12j78J26j37n9o0M78j22j60jL9K43m10l18L52Q1j3J77k86K22o2j29J84
2807E9p1o1L66n06N0J61k12L9J30Q5N6j54l9m0p3J49L53n38K22j14K04o7J35R9
2831B33k23o7J03K2j2qj31L21n60O70l75m5J54O5k78J09K1K8K83l37L33j02k97
2854i3R9J35j62J43k30K37k49J67j15J07R6m26M5J8L57q1k6K01k66P4K21k56J48
2877A44j99J41k02K68j74k97M10j13K9q1J33J42m7j73o3J32l5k4m14N24J2O0l44
2900a71J01n9J52j19k6K67k76J50Mm8O3j33Q9J16o0K09j75K8p7J48j63N2l99K27
2924a00J21k67N18j87R0l52J64J40j47J44k35K10j45J20o5k20J17L49k0l30P8
$$ plain form
2945 -17 177 -94 -46 203 -115 -90 -457 198 -52 129 65 211 261 38 178 -221 4 40 -111 72 -10 -71 170
2968 170 102 -154 -48 -157 222 148 -6 -29 58 -147 -9 -59 -223 -33 98 -57 366 -250 -256 -138 -43 112 43
2991 43 229 49 130 -35 -2 -4 6 -47 -159 -102 -18 -18 -67 6 9 0 -49 -150 -75 168 34 85 161 23 109 -52 103
3018 103 -114 -100 -154 74 -86 -10 -65 -50 -24 -118 -135 -64 82 203 -269 -295 167 216 240 -178 125 83 60 -104 23
3043 23 -52 112 -44 -235 33 -122 -118 251 249 108 270 -93 60 -49 -379 195 -13 41 -32 -15 31 97 41 112
3067 112 285 134 30 -157 -179 -145 -282 -236 -141 -51 -19 -293 368 -67 64 -214 105 89 -258 22 -76 -20 -59
3090 -59 100 12 -55 72 188 257 -193 39 153 -316 -98 -274 -10 230 35 -141 119 -46 -124 -31 181 -51
3112 -51 -88 -183 -271 -70 -286 42 -49 -62 144 161 54 -12 307 73 106 -28 -129 280 -72 -101 -169 131 -223 154
$$ packed form
2945a7J94k71M8K49l18K5l67O55k50J81o4J46N0k23J40l99K25L6j51J83q2o1K41
2968A70o8k56J06j09L79p4j54k3Q7k05J38n0j64J90J31j55M23o16oJ18R5J55o9
2991D3J86j80Q1j65L3kJ0n3j12N7Q4%m9P3Lrm9j01P5K43j34N1P6j38Q6j61J55
3018A03k17J4n4K28j60P6n5J5K6r4j7P1J46J21m72k6M62M9K4m18L03m2k3j64J27
3043B3p5J64j56j91K68j55ML69kj41J62l63J53j09l30N74k08N4p3J7M6O6n6P1
3067A12J73j51j04j87k2L4j37M6R5R0L2k74O61m35J31k78L19j6l47K80r8N6l9
3090e9J59q8o7J27J16O9m50K32J14m69K18j76K64K40j95j76K60j65p8R3K12k32
3112e1l7r5q8K01k16L28r1j3K06J7j07o6L19k34L3j34j01M09l52k9o8L00l54L77
$$ plain form
3136 154 19 84 214 -70 -35 -173 -77 -64 -180 81 -9 420 70 9 -103 78 113 -253 -85 -61 -4 247 -63
3159 -63 150 -103 -22 -271 94 -17 -158 -334 87 7 66 -216 146 -393 24 -165 83 124 -16 -329 -199 27
3181 27 -24 60 85 148 37 -138 -193 95 185 -77 81 -57 -191 -49 -259 -131 89 60 292 181 -35 196 -65
3204 -65 -199 -12 187 -94 -165 -110 -61 -140 105 -177 -18 32 -257 -151 324 -106 -92 96 75 24 8 -136 -67 -11
3228 -11 273 75 9 44 -23 -26 131 -326 105 153 -118 -59 -159 75 -127 5 -159 -71 -354 106 122 -112 53
3251 53 -84 -52 259 140 236 29 66 293 12 -137 49 -131 -48 -21 -100 11 301 -138 21 -188 174 123 -226
3274 -226 -64 -147 22 -3 -41 30 -122 -41 275 -8 -392 54 1 -157 133 -103 -136 72 152 -104 255 104 -79
3297 -79 134 97 25 30 235 174 -89 9 3 117 158 92 -51 -35 -220 73 95 157 56 171 102 -88 105 -64 40
$$ packed form
3136A54j35O5J30k84L5j38R6J3j16K61r0M29l50o1j12J81L5l66J68K4N7K51l10
3159f3K13k53Q1k49L65j11j41j76M21q0N9k82L62n39M17j89K48M1j40l13J30K26
3181B7n1Q4K5O3j11j75n5K88R0k62J58j38j34J42k10J28K20k9K32j11k16K31k61
3204f5j34J87J99k81p1N5M9p9K45k82J59N0k89J06M75m30J4J88k1n1j6j44O9N6
3228a1K84j98o6L5o7lJ57m57M31M8k71N9j00K34k02J32j64Q8k83M60J6k34J65
3251E3j37L2L11j19R6k07L7K27k81j49J86j80Q3K7p9J11K90m39J59k09L62n1l49
3274b26J62q3J69k5l8P1j52Q1L16k83l84M46n3j58K90k36l3K08Q0k56L59j51j83
3297g9K13l7p2NK05o1k63R8oJ14M1o6j43J6j85K93K2O2j01J15o9j90J93j69J04
$$ plain form
3322 40 123 261 139 -54 -1 3 164 76 -124 197 -28 79 -71 109 16 -59 144 57 343 3 -385 160 134
3345 134 -98 342 5 186 -226 -136 48 49 -2 131 223 -232 -62 -55 -64 -113 22 -172 -299 -39 73 13 267 -12
3369 -12 -35 269 46 272 273 234 173 37 124 31 -47 271 91 40 225 -138 78 -185 -75 150 67 87 162 150 122
3394 122 85 -276 148 39 -193 78 171 34 -92 -95 -268 -92 84 39 164 207 280 338 -61 -2 -47 -127 222 85
3418 85 -33 -34 124 90 -63 -134 48 186 174 87 -228 -129 357 316 -25 45 143 -36 -239 165 186 -96 227 -59
3442 -59 -21 -141 186 -71 28 210 -150 -193 -246 196 232 121 185 0 80 169 37 -151 218 -3 -152 -38 148
3465 148 141 40 280 -199 -270 -204 96 106 223 30 101 -107 5 239 -109 206 21 255 62 172 134 120 -97
3488 -97 38 -193 -12 -47 -51 196 -19 -184 -117 -103 -348 293 49 -388 104 29 -109 2 -204 67 -113 -96 -81
$$ packed form
3322D0Q3J38j22j93N3MJ61q8k00L21k25J07j50J80r3p5K03q7K86l40l88N45k6
3345A34k32M40l37J81m12R0J84Jn1J33R2m55J70Prm9J35j94j27K60J12o0K54k79
3369a2k3L04k23K26Jl9o1j36Q7r3p8L18j80n1J85l63K16k63J10K25q3K0P5j2k8
3394A22l7l61M24j09k32K71R3j37j26lj73J76J76m5J25M3P3N8l99N9m5q0L49j37
3418H5j18jJ58l4j53p1J82J38j2q7l15R9M86m1l41P0R8j79k03M04K1k82L23k86
3442e9L8j20L27k57R9J82l60m3n3M42L6j11O4j85Q0Q9j32j88L69k21j49J14J86
3465A48pj01K40m79p1O6L00J0J17j93P1k08J12K34l48L15j85K34j93J10l8j4k17
3488i7J35k31J81l5mK47k15j65O7J4k45O41k44m37M92p5j38J11k06K71j80J7J5
$$ plain form
3511 -81 146 123 219 -224 151 -243 -133 47 -195 4 12 -135 -120 -157 -56 36 131 31 -42 49 -33 67 -4 51 46
3536 46 -104 76 -49 188 -115 26 -89 -46 141 58 -131 42 58 -11 -56 -127 66 0 -32 2 61 139 29 -102
3560 -102 66 153 -103 235 115 42 32 109 -118 81 90 -344 94 -129 -81 297 135 -67 86 336 -151 3
3582 3 -76 4 172 153 -139 66 88 -210 -20 -41 133 411 15 12 -117 -183 140 53 -65 -86 36 67 -92 -140 62
3607 62 -4 153 -70 -36 110 -106 157 43 -32 -40 -129 -366 191 -85 -35 -144 -231 133 -122 182 141 202 60 265
3631 265 -47 172 248 104 276 163 -205 313 -19 -95 49 22 260 18 -116 -12 -144 -50 -102 93 48 3
3653 3 135 -146 215 -140 -64 50 -36 205 53 -92 133 103 162 -186 -98 87 -15 -67 -47 31 161 -88 50
3676 50 214 -456 131 22 -179 -61 22 28 -169 92 -318 207 2 -148 -172 -160 336 21 36 210 67 -170
$$ packed form
3511h1K27k3R6m43L75l94J10J80k42J99Qj47J5l7J01R2R5j00p3R1q2J00p1N5n
3536D6j50J80j25K37l03J41j15M3J87q3j89J73J6o9m5p1J93o6l2L4N9P8j10j31
3560a02J68Q7k56L38j20p3j0P7k27J99Rm34M38k23M8L78j62k02J53K50m87J54
3582Cp9Q0J68j9k92K05K2k98J90k1J74K78l96lj29o6L23q7j18k1J22L1j59m8K02
3607F2o6J57k23L4J46k16K63j14p5qq9k37N57k76N0j09q7L64k55L04m1O1j42K05
3631B65l12K19P6j44J72j13l68N18l32p6J44k7K38k42j34J04j32R4n2J95m5m5
3653CJ32k81L61l55P6J14q6K41j52j45K25l0N9l48Q8J85j02n2K0P8J30k49J38
3676E0J64o70N87j09k01J18Q3Oj97K61m10N25k05j50k4J2M96l15J5J74j43k37
$$ plain form
3698 -170 -48 90 179 -234 -40 6 -219 6 78 150 -162 48 54 58 -294 -44 64 49 -20 -115 53 -118 159 155
3722 155 -178 92 49 2 -284 -107 125 224 -65 -266 -73 65 22 -113 95 -113 100 178 -166 51 5 -137
3744 -137 31 -144 -75 113 -91 -86 -3 -8 67 -41 -77 28 31 322 98 112 -125 131 24 35 168 97 178 78 105
3769 105 10 189 40 -9 173 -2 -104 30 -149 57 261 16 91 70 -298 62 -231 22 75 -61 87 -88
3791 -88 -334 -222 200 -122 148 14 163 -452 135 -26 -30 -117 -129 -121 -247 59 13 31 -184 72 169 28 174
3814 174 -100 -50 -220 26 83 -57 202 -105 77 -235 -64 -147 250 14 93 -88 -82 -231 224 -168 122 -168
3836 -168 -61 14 -35 -105 54 -139 -135 65 -135 236 134 -95 -130 82 109 -13 1 -65 95 167 31 133 -15
3859 -15 -67 -34 -71 -189 -210 161 -142 -140 -260 61 -140 -52 -176 168 497 -185 -20 -6 301 -102 302 -9 -123
$$ packed form
3698a70J22J38Q9m13J94M6k25K25P2P2l12K10OMl52K50J08j5o9r5J68j71K77m
3722A55l33K70m3m7k86J77K32R9k89k01J93J38m3j35K08k08K13P8l44K17m6j42
3744a37J68j75O9J88k04NQ3nP5j08l6J05LK91k24J4k37K56j07J1J33p1Q1j00K7
3769A05r5J79j49m9J82j75j02J34j79K06K04k45P5k1l68L60k93K53N3j36J48j75
3791h8k46J12M22l22K70j34J49o15N87j61mq7j2Qj26L06m6J8k15K56R7j41J46
3814A74k74N0j70K46N7j40K59l07J82l12J71q3L97k36P9j81Oj49M55l92K90k90
3836a68J07P5m9p0J59j93MK00k00L71j02k29l5K12K7j22J4o6J60P2j36J02j48
3859a5n2L3l7j18k1L71l03Kj20L21k01Q8j24L44L29o82J65J4L07m03M04l11j14
$$ plain form
3882 -123 254 0 -11 169 -72 125 -209 -120 66 66 39 -38 96 66 -57 26 -100 61 219 45 143 -15 -139
3905 -139 -188 117 110 -156 -119 101 15 -169 -113 -62 -61 212 8 -78 48 -40 -141 55 -30 17 -83 39 94 -70 -93
3930 -93 118 81 -78 -224 -149 58 -162 45 153 -36 -186 -218 138 -79 -2 -260 -75 -93 187 73 -140 -49
3952 -49 101 47 281 140 -84 -69 -387 -196 173 -306 68 155 11 -145 -254 237 -295 168 -1 -9 53 -98
3974 -98 93 108 -18 -2 -177 86 160 -39 220 184 88 -316 65 -178 -24 -57 76 -97 -139 -169 -117 99 211
3997 211 36 208 205 164 -31 196 193 51 88 88 -43 159 -162 -31 151 -88 166 -18 -60 53 11 215 -140
4020 -140 -106 -148 -41 189 -139 -110 -178 -134 -34 -98 232 -202 116 -61 -22 -191 -44 176 47 -109 48 199
4042 199 -312 -91 138 217 -5 52 -99 136 -8 -16 58 96 -69 -105 -90 74 35 -52 52 -3 40 39 -105 131 47
$$ packed form
3882a23L77k54j1J80k41J97l34Q9J86%k7p7J34l0j23Q3j26J61J58j74R8j58j24
3905a39m9L05pk66L7K20q6j84N6N1JK73k04q6J26q8j01J96q5M7j00J22N5j64k3
3930i3K11l7j59j46P5K07k20K07J08j89j50l2L56k17P7k58J85j8K80j14k13R1
3952d9J50n4K34j41k24J5l18J91L69m79L74Q7j44j56j09M91n32M63j69qO2j51
3974i8J91J5j26J6j75K63P4j99K59l6r6m04L81k43J54l3J33j73m2l0N2K16J12
3997B11j75J72lm1j95K27lj42L7%j31K02l21J31J82k39K54j84m2J13m2K04l55
4020a40L4m2J07K30l28K9o8M4J00o4L30m34L18j77L9j69J47K20j29j56J57J51
4042A99n11K21K29P9k22N7j51K35j44qP4L8j65l6J5J64l9q7J04n5M3jj44K36q4
$$ plain form
4067 47 -102 32 197 76 37 -192 -86 -97 127 59 188 200 -17 118 -229 -33 -8 48 218 -99 64 -8 6
4090 6 -137 360 -44 -157 -251 37 26 19 -217 189 152 103 -53 35 34 259 -10 -102 -3 -288 -66 107 -39 183
4114 183 -117 121 83 -298 107 -7 -199 -57 163 -52 -95 -250 83 37 -129 -231 18 -252 172 -149 -203
4135 -203 -65 -28 56 49 13 -62 -9 27 -84 52 -48 -265 138 -48 -231 -52 -18 29 40 25 -47 -24 -212 0 150
4160 150 243 -62 41 -170 -283 95 8 395 130 -44 149 -103 -30 57 134 104 141 -247 -67 53 -296 172
4182 172 16 263 -379 223 275 269 -106 -48 -29 -181 -46 -14 263 -111 271 -29 -48 70 107 296 -18 110 -118
4205 -118 70 -143 45 -55 84 24 36 47 22 27 -49 -23 56 -207 -258 -103 147 -114 -147 -30 66 191 103 -90
4229 -90 38 -11 50 -16 241 -56 -61 -35 47 204 -215 39 -193 78 31 110 81 -139 150 43 -272 22 59 98
$$ packed form
4067D7j49J34J65j21l9k29J06j1K24o8J29J2k17J35l47J96K5N6J70l17J63p2J4
4090Fj43M97m04j13r4K88j1pk36M06l7m9j56Q8jK25k69r2R9k85K22J73j46K22
4114A83l00K38l8l81M05j14j92J42K20k15m3j55L33m6j66j02K49k70M24l21n4
4135b03J38L7Q4pl6p5N3L6j11J36j00k17M03j86j83J79L4M7J1j5p2K3j88K12J50
4160A50R3l05J03k11j13L78q7L87k65j74J93k52P3Q7P7l0L7l88J80J20l49M68
4182A72j56K47o42O02N2ol75N8J9j52J35L2K77l74L82l00j9J18L7J89l14J28k28
4205a18J88k13J88j00J39o0J2J1k5Np6K6P9k63n1J55K50k61l3J17R6J25q8j93
4229i0J28m9O1o6K57k97nK6Q2J57m19K54k32K71m7P9k9k20K89j07l15K94L7L9
$$ plain form
4253 98 128 71 315 -74 -172 -36 -15 161 14 166 130 -27 212 -94 -152 17 289 10 82 -100 -84 112 -36
4276 -36 134 -200 10 -166 -53 -67 20 162 -141 -44 -353 -27 -39 -237 -121 65 -190 38 31 -78 -89 -25 -93
4299 -93 133 48 -248 229 -21 -33 22 -21 -9 -144 79 -56 196 105 15 49 -9 26 -152 -102 241 49 -80 -71 -1
4324 -1 -287 230 128 -13 167 2 -119 -52 107 -118 152 -226 407 -80 -1 -257 -107 -250 30 -78 52
4345 52 126 -96 -4 151 19 -102 89 -216 -51 183 -169 -97 104 -208 -131 36 109 144 -248 31 -64 80 168
4368 168 -215 56 -71 151 24 188 -173 -96 127 -195 74 -45 -206 -162 112 57 -212 -120 43 155 -140
4389 -140 129 281 -76 -103 1 -340 67 26 100 -75 30 105 125 -120 23 82 190 75 86 50 146 275 -58
4412 -58 -54 -82 183 3 152 15 -263 -185 -13 -27 -125 -250 99 -157 -83 88 -50 18 203 -126 73 -122 148
$$ packed form
4253I8L0n7K44l89r8J36K1J76j47J52l6j57K39l06n8J69K72k79P2j82J6J96j48
4276c6J70l34K10j76J13j4Q7J42l03R7l09L26j2j98J16J86k55K28pj09j1O4o8
4299i3K26q5k96M77k50j2N5m3J2j35K23j35K52r1r0L4n8L5j78N0L43j92j29RP0
4324ak86N17j02j41J80j65j21O7J59k25K70l78O33m87P9k56J50j43K80j08J30
4345E2P4k22R2J55j32j21J91l05J65K34l52P2K01l12P7J67P3L5l92K79r5J44Q8
4368A68l83K71j27K22j27J64l61P7K23l22K69j19j61M4K74n5k69R2J63J12k95
4389a40K69J52l57k7J04l41M07m1P4j75J05P5K0k45J43N9J08j15J1l6R6J29l33
4412e8Mk8K65j80J49j37k78P8J72j4r8j25L49k56P4J71j38O8J85l29J99j95K70
$$ plain form
4435 148 261 -3 12 -232 341 47 16 -177 -143 -86 32 -266 189 -134 118 133 53 60 -59 282 258 -404 -100
4458 -100 -77 -1 90 -173 28 -216 41 -38 -310 -4 49 -114 -50 271 129 69 14 9 85 138 -76 -269 420 -35
4482 -35 -137 -3 -26 190 -64 -201 7 -28 -100 -101 24 -23 133 89 -18 -210 -15 -96 -8 167 23 19 88 64 -21
4507 -21 105 266 58 229 200 -182 163 -391 -230 -67 -101 91 22 -11 111 -217 117 -188 -177 -12 -197 198
4529 198 -4 -82 -98 -82 38 -138 15 -8 5 125 149 8 -61 -159 -75 -71 -140 125 -128 54 -35 -286 -160 22
4553 22 143 182 -24 -57 -140 -305 70 110 230 185 110 221 91 23 -45 -114 159 205 -330 -76 -235 71 -5 -88
4577 -88 -9 63 -225 -3 325 -235 -241 45 16 -149 -111 -173 -219 116 -313 113 -114 4 -11 90 -24 -142 85
4600 85 -17 187 -346 374 28 22 100 33 -51 138 -160 -153 -59 -191 43 -17 -70 -44 127 142 -82 -209 77 -97
$$ packed form
4435A48J13k64J5k44N73k94l1j93L4N7J18k98M55l23K52J5q0Pj19L41k4o62L04
4458a00K3P6R1k63K01k44K57p9k72L06N3j63O4L21j42o0n5nP6N3k14j93O89m55
4482c5j02J34k3K16k54j37K08l5p2jJ25m7J56m4j07j92J95q1Q8J75j44mO9k4q5
4507b1J26J61k08J71k9l82L45n54J61J63l4J92o9l3J22l28L34l05J1J65j85L95
4529A98k02p8j6J6J20j76J53k3J3J20K4j41o9r8Q4Mo9K65k53J82q9k51J26J82
4553B2J21L9k06l3q3j65L75M0J20m5p5J11j30o8o8o9K73M6n35K54j59L06p6q3
4577h8P9P2k88K22L28n60oK86k9j65L8o2m6L35m29M26k27J18j5J01j14j18K27
4600H5j02K04n33P20l46oP8o7q4J89k98PR4j32K34o0n3K6J71J5k24j27K86j74
$$ plain form
4624 -97 72 108 150 18 161 24 335 194 76 98 27 -180 -34 -121 154 -177 -67 142 -113 -11 293 -158
4646 -158 261 -237 -114 -39 -283 -206 82 -9 -161 142 228 -278 32 -96 161 5 98 57 280 -199 -32 127
4668 127 58 251 202 -92 -41 271 58 79 138 154 148 128 -115 -105 -273 2 -58 59 75 -127 74 -237 138 153
4692 153 -291 -45 44 19 89 -37 -85 -94 -199 188 -90 -7 159 239 -168 223 -219 115 -9 1 190 -196 51
4715 51 42 38 66 -9 220 -77 123 -50 -196 17 41 165 -174 -106 -62 -197 -158 -136 -117 37 59 280 111 60 21
4740 21 -22 204 -175 -184 136 -15 -75 -19 -118 -135 -35 -66 44 -59 12 -86 -144 -219 34 304 106 -21 37 -159 237
4765 237 -24 -112 123 83 -74 317 -92 50 41 287 -71 -144 -66 331 -46 370 -18 -43 12 15 -174 108 -174
4788 -174 -102 -71 -17 107 36 -85 226 28 310 -18 -91 69 -120 -29 89 51 -196 34 260 -228 -90 106
$$ packed form
4624i7J69L6M2j32J43j37L11j41j18K2p1k07J46q7K75l31J10K09k55J02L04m51
4646a58M19m98J23P5k44P7K88r1j52L03Q6n06L10j28K57j56R3m1K23m79J67J59
4668A27o9J93m9k94N1L12k13K1N9J6ok0k43J0j68K75o0J17J6k02K01l11L75J5
4692A53m44K46Q9k5P0j26m8rj05L87k78Q3J66Q0m07L91m42L34j24J0J89l86K47
4715E1rmK8p5K29k97K00j73j46K13K4J24l39O8M4j35L9K2J9J54K2K21j69n1l9
4740B1m3K26l79rL20j51o0N6r9j7J00l1J10j03P1r8n8p5K53K70j98j27N8j96L96
4765B37k61q8K35m0j57L91m09J42rK46l58p3P8L97l77M16l88k5N5Lj89K82k82
4788a74P2L1N4J24p1j21L11j98K82l28p3J60j89R1J18l8k47K30K26m88J38J96
$$ plain form
4810 106 17 193 93 19 153 2 -143 159 -276 -105 -138 -106 153 141 -84 123 -122 103 51 17 56 119 -66
4833 -66 158 106 187 -18 -319 -172 153 271 97 139 18 -40 204 -158 -76 119 -105 -81 -23 34 -206 -321 -57
4856 -57 127 41 -110 -121 -178 -130 -174 52 48 -43 -123 -298 -124 -256 117 49 -63 -34 -16 144 105 -38 145 -6 90
4881 90 -166 100 70 -218 -116 -14 -73 84 139 -74 -66 -283 -350 237 -241 130 223 103 -74 129 94 198 -119
4904 -119 -39 68 -331 69 113 100 58 57 -63 -30 -16 56 21 -274 -270 -42 -37 104 -24 92 -50 -176 -68 25 94
4929 94 187 37 -45 77 -73 291 241 -46 73 77 246 205 -66 -102 -124 -294 -128 -92 -163 82 81 16 108 27 52 -114
4955 -114 -118 29 -43 211 -306 -113 4 12 -7 -121 -168 171 -25 -112 202 347 80 22 -133 -233 65 -137 -28
4978 -28 -47 -267 67 144 204 198 81 -3 219 0 95 -115 -64 -218 -31 -224 -49 -97 56 64 57 -153 22 -3 3 -56
$$ packed form
4810A06q9J76j00p4J34j51j45L02m35J71l3L2K59j2k25K07k45K25n2l4L9O3j85
4833f6K24n2Q1k05l01J47L25J18j74M2j21n8K44l62Q2J95k24K4N8N7k40j15K64
4856e7J84q6j51j1n7M8m4K26mr1q0j75J74j32L73o8j12K9J8J60l9j43J83j51R6
4881I0k56K66l0k88J02J02n9J57N5k13Qk17o7N87m78L71R3j20j77K03l5J04l17
4904a19Q0J07l99M00M4j3m2jj20L3J4P2l5k95MK28NJ41j28J16j42j26J08R3O9
4929I4R3j50q2J22j50L64n0k87J19MJ69m1k71l6k2j70J66L6p1K45jo5R2q1K5j66
4955a14mJ47p2K54n17J93J17Qj9j14m7L39j96q7L14J45k67n8j55j00K98k02J09
4978b8j9k20L34P7O0oj17q4K22k19R5k10N1j54J87j93J75m8J53Qpk10J75k5On9
$$ plain form
5004 -56 213 -52 -26 26 -154 151 -4 118 75 -35 -26 -164 1 -27 -261 -165 -269 33 -47 -416 -249 90 43
5027 43 227 -89 -1 126 3 19 -146 -85 313 53 -83 146 150 122 294 -109 232 -58 118 2 -89 107 60
5050 60 1 -225 22 118 275 -1 -24 13 101 78 -225 -50 72 23 -15 258 -35 171 -49 166 -21 83 219
5073 219 -220 12 -207 -114 304 9 282 249 36 4 -49 38 -134 61 -60 -7 -49 86 -273 -57 -24 161 -225
5096 -225 -134 -241 -272 -137 -121 97 -215 240 -116 -356 115 -255 -116 46 246 11 20 -88 127 10 41 -87
5118 -87 -167 -248 32 -173 -89 -190 148 126 112 -25 277 382 -112 222 149 134 8 124 6 91 -63 -116 -154 53
5142 53 -305 52 112 98 162 -461 28 104 41 75 13 280 185 -176 -284 -92 -21 60 315 -42 65 -218 -136 104
5166 104 67 -69 38 110 -131 203 157 -5 -102 -6 116 -44 21 47 -259 -21 -46 -109 -97 -99 214 83 -232 -79
$$ packed form
5004e6K69k65K6N2j80L05j55J22m3j10Rj38J65k8k34R6j04L02q0l69J67L39m7
5027D3J84l16Q8J27j23J6j65O1L98k60j36K29Mk8J72m03L41k90J76j16r1J96m7
5050F0n9k26K47R6J57k76k3L7Q8k3l03J75J22m9l8K73k93K06k20K15j87J04J36
5073B19m39K32k19R3M18k95K73l3k13l2n3Q7j72J95j21N3m2J35l59K16L3J85l86
5096b25R1j07l1J35J6K18l12M55l56k40M71l70J39J62K00k35Rj08K15j17L1j28
5118h7q0q1K80k05Q4j01L38k2j4j37L02J05m94L34p3j5j26J16j18Q5j54n3l8K07
5142E3l58L57O0j4O4o23M89P6o3L4o2K67r5l61j08J92P1Q1K55l57J07k83Q2K40
5166A04l7j36J07P2k41L34m6j62r7R6J22j60O5K6l06K38k5o3J2kL13j31l15J53
$$ plain form
5190 -79 30 -179 -134 26 73 -25 -239 147 -9 -58 58 -190 72 -78 -344 95 34 184 -1 -54 2 237 80
5213 80 -154 -9 -177 -59 -82 35 34 55 28 -156 -56 288 -121 -341 106 -214 -76 164 94 1 -89 224 -25
5236 -25 49 -60 60 -28 19 -172 -103 73 259 -145 -22 189 84 -21 -167 -122 0 60 -103 76 43 21 -43
5259 -43 -177 -321 59 -160 -2 -160 24 165 108 260 -107 235 231 76 -121 130 -39 128 -58 187 -158
5280 -158 -93 286 172 -144 55 14 27 -139 21 26 -254 430 -80 96 158 28 83 -236 72 -173 -56 160
5302 160 258 26 -19 148 -220 18 37 83 -192 108 223 -151 218 -153 -32 60 -66 84 94 -9 59 0 89
5325 89 130 -127 159 190 197 82 73 -82 -243 140 41 115 -11 -426 133 86 -32 121 -37 -60 6 109 116 -25 133
5350 133 75 -183 130 -233 210 -90 -87 82 -14 416 -103 -147 -2 144 -112 -54 72 -90 32 19 210 -129
$$ packed form
5190g9J09k09M5J60M7r8k14L86j56m9J16k48K62j50k66M39o1J50j85n3N6K35j57
5213H0k34J45j68J18k3J17jK1k7j84J00L44m09k20M47l20J38K40p0r3r0L13k49
5236b5P4j09J20q8M7j91O9J76J86m04J23K11j05j05j46M5J22O0j63J79l3k2o4
5259d3j34j44L80k19J58j58J84J41n7J52l67L42mj55j97K51j69J67j86K45l45
5280a58O5L79j14l16J99m1J3j66J60Nk80O84n10J76O2j30N5l19L08k45J17K16
5302A60R8k32m5J67l68K38J9M6k75L00J15l74L69l71J21R2j26J50J0j03O8n9Q9
5325H9M1k57K86L1Pj15rj55j61L83r9P4j26m15N59m7j18J53j58k3O6J03Pj41J58
5350A33n8k58L13l63M43l00LJ69r6M30n19m4J45J46k56N8J26j62J22j3J91l39
$$ plain form
5372 -129 -9 2 -271 115 -65 -5 -48 -100 147 240 102 266 53 -109 9 214 -106 70 -108 16 308 20
5394 20 69 -235 212 -33 240 80 -68 -46 2 -88 14 263 -106 58 200 -96 72 114 -87 -180 136 14
5416 14 -75 -322 231 -126 -26 48 -190 -426 -234 51 -141 -168 -290 -40 38 82 204 47 -32 187 -195 11
5438 11 -11 -153 57 -77 -214 3 41 191 -112 -206 -14 -93 -21 106 -158 121 -40 -13 -10 43 80 56 -249 -189
5462 -189 94 -162 -2 -186 -63 -105 -266 180 25 65 -60 256 128 -163 -89 192 -49 -87 -36 -180 -330 47
5484 47 44 198 149 -50 -84 -104 217 -226 -93 84 252 82 134 75 -178 -47 248 71 -41 72 -177 96 56
5507 56 -125 280 116 -38 -143 -51 -124 4 203 190 -235 -142 15 -240 187 -279 44 -109 288 -138 -280 124
5529 124 -148 115 61 103 -36 80 -151 -225 -103 91 -67 -62 -45 -42 44 -35 31 20 34 -166 -109 -153 82 96 -17
$$ packed form
5372a29J20J1k73L86j80O0m3n2K47R3j38J64k13j62J18K05l20J76j78J24K92k88
5394B0M9l04M47k45K73j60j48K2M8r0J02K49l69J64J42k96J68M2k01r3L16j22
5416A4q9k47N53l57J00P4k38k36J92K85j92k7j22K50P8M4J22j57p9K19l82K06
5438A1k2j42K10j34j37K17L8J50l03r4J92p9P2J27k64K79j61K7LN3L7k4l05O0
5462a89K83k56J60j84J23m2j61M46j55M0j25L16j28k91P4K81k41l8N1j44j50L77
5484D7lJ54m9j99l4k0L21m43J33J77J68j70N2n9k53J31K95j77j12J13k49K73m0
5507E6j81M05j64j54j05R2p3J28J99j3m25R3J57k55M27m66L23j53L97m26j42M04
5529A24k72K63n4M2j39J16k31p4J22J94j58NJ7LQ6p9O6j1J4k00N7m4K35J4j13
$$ plain form
5554 -17 -88 -74 -36 -262 -161 28 -169 164 117 -214 -113 -197 -129 -1 67 -133 -2 20 -29 145 -149 198 -228
5577 -228 154 -47 -283 -71 114 -78 75 172 -97 -105 -172 -78 -8 49 162 142 -87 -62 231 -119 79 103 132 218
5601 218 -87 67 53 82 48 232 8 -38 -248 -16 205 -364 229 -24 29 -131 28 -176 56 298 23 -171
5623 -171 -303 -38 -193 257 -3 -311 -278 -5 226 -72 -8 -4 113 -204 -51 39 5 -96 15 54 67 -113 128
5646 128 101 106 -46 29 325 90 19 182 -14 158 120 188 -125 81 -232 32 -172 -14 275 5 -90 -22 230
5669 230 -121 238 -93 -58 -216 1 -130 23 -59 -17 48 232 -234 -31 192 129 -3 -94 80 -62 258 13
5691 13 16 -5 168 -26 182 180 54 -305 -2 -81 -24 117 -60 317 -35 38 304 92 8 -53 -102 64 -42 142
5715 142 98 -134 70 -26 -217 262 168 74 119 -118 -177 22 -104 74 75 10 -106 22 94 3 207 -140 89 230
$$ packed form
5554a7p1J4L8k26J01J89j97L33m7l31J01q4O8J28O8k00J31K2m9J74k94L47m26
5577b28L82k01k36K12J85j92J53R7k69qo7R4P0N7J13k0k29K5K93l50J98K4K9Q6
5601B18l05J54j4K9l4J84k24m6k10K32K21n69N93k53N3j60J59k04K32K42k75j94
5623a71j32K65j55M50k60l08L3K73K31k98O4MJ17l17J53R0l4j01J11L9J3j80K41
5646A28k7Nj52P5K96k35p1J63j96J72l8O8l13K06l13K64k04J58K89k70r5O8K52
5669B30l51L59l31L5j58K17j31J53q2M2O5J84m66K03K23o3j32r1J74j42L20k45
5691A3Lk1J73j94K08kj26l59L03p9N7J41j77L77l52P3K66k12q4o1m9J66j06J84
5715A42m4k32K04r6j91M79r4r4M5k37n9J99j26J78Jo5j16J28P2r1K04l47K29J41
$$ plain form
5739 230 -26 167 144 -162 -1 -9 -59 -99 80 -39 251 35 -66 187 -53 -179 -127 143 38 -43 -85 -91 -25 315
5763 315 129 -86 100 101 44 -6 50 68 240 -11 35 -63 60 77 -58 -310 -153 -79 -164 290 32 240 -97 191
5787 191 -28 146 -160 59 -117 184 68 137 342 -101 -115 -46 -24 -2 -102 -27 207 -88 100 -243 -213 220
5809 220 -140 -45 156 30 -180 -93 -17 -123 -114 -122 224 -83 -19 71 -70 -146 87 -182 -66 -170 183 135 102 -248
5833 -248 76 6 -86 13 40 87 132 65 -118 -11 -32 323 215 -152 178 -176 -115 139 294 376 -108 17 -270
5856 -270 -4 4 1 -254 309 -28 -37 72 159 23 95 -93 -93 105 -84 -56 -68 -67 -96 65 -186 261 86 -120 62
5881 62 103 143 172 48 -112 16 -97 12 196 -50 137 -63 252 21 209 135 8 -9 19 -139 15 99 -59
5904 -59 -8 200 -83 -31 65 -37 -7 -89 160 47 163 -105 66 -108 98 61 170 -123 -252 127 20 -119
$$ packed form
5739B30k56J93k3l06J61qn0m0J79j19K90k16j01K53k40j26N2K70j05q1m2oO6L40
5763C15j86k15J86Jn7n0N6J8J72k51M6r8J23J7j35k52J57P4q5M54k58K08l37K88
5787A91k19J74l06K19j76L01j16O9K05m43j4O9K2K2j00P5K34k95J88l43L0M33
5809B20l60R5K01j26k10Q7P6j06RqL46l07O4R0j41p6K33k69J16j04L53m8l3l50
5833b48L24p0r2R9K7M7M5o7j83J07k1L55j08l67L30l54O1K54J55Q2m84J25k87
5856b70K66Qlk55N63l37rJ09Q7j36P2j88%J98j89K8j2Jk9J61k51M47j75k06J82
5881F2M1M0K9j24j60J28j13J09J84k46J87k00L15k31J88p4j27j7K8j58J54Q4j58
5904e9N1K08k83N2R6j02L0q2K49j13J16k68J71j74K06l7J09k93j29L79j07j39
$$ plain form
5926 -119 -88 93 -250 45 -245 57 -85 324 -94 90 65 -200 -319 84 -120 -17 -36 215 -12 -225 249
5947 249 -51 104 125 100 155 -124 -63 9 229 -38 -182 -80 -164 21 -330 110 -46 -239 87 34 -256 -266 -76
5970 -76 218 -105 2 -94 15 -234 -65 262 -61 -7 -54 162 -124 76 -35 -54 -152 -77 -98 -230 100 -181 122
5993 122 -191 145 277 -49 80 27 -58 45 -180 112 -148 -179 216 -40 -22 161 29 -126 -141 -76 73 342
6015 342 -183 385 -166 41 103 -8 18 -86 -14 118 -73 7 -179 -186 280 -282 109 110 81 -39 432 -87 -69
6038 -69 217 -27 143 -30 20 134 72 -133 8 -85 -82 -60 -140 -17 -208 140 4 146 -48 -30 -15 -164 -62
6061 -62 -50 -30 3 296 -65 -9 122 -116 -17 90 -48 -118 89 -5 -104 -181 -4 20 35 -65 -111 117 150 289 179
6086 179 -251 -113 82 -34 -6 153 -22 -8 -21 102 -80 -106 -187 68 -63 -298 187 -97 21 -327 193 147
$$ packed form
5926a19L1J81l43K95k90L02j42M09m18J84k5k65j19M03k04J03j9K51k27k13M74
5947B49l00J55K1k5N5k79O1P2K20k67j44J02q4J85l51M40j56j93L26n3k90j0J90
5970g6K94l23J07r6J09k49J69L27l23N4m7K16k86K00j11j9r8P5k1j32L30k81L03
5993A22l13L36J32l26J29n3q5J03k25K92k60l1L95k56J8J83j32j55j5O5J49K69
6015C42n25N68n51K07O2j11K6j04P2J32j91Q0j86pM66n62L91Jk9j20M71n19J8
6038f9K86k44J70j73N0J14o2k05J41r3LK2q0J23j91L48j36J42j94J8J5j49J02
6061f2J2K0L3K93l61N6J31k38R9J07j38p0K07r4r9p7J77K4J5j00m6K28L3J39j10
6086A79m30J38J95j16K8J59j75J4j3J23j82k6q1K55j31k35M85k84J18l48N20m6
$$ plain form
6108 147 -111 179 -13 26 13 146 -92 -148 24 89 5 -69 -145 -24 -12 -21 -34 98 -87 157 -305 -6 99 32
6132 32 253 158 -67 -39 -267 -107 0 -34 -145 189 2 4 51 -194 -103 26 451 142 11 -113 212 185 7
6155 7 82 126 197 57 -216 -279 -60 -14 61 -78 159 88 -38 128 99 -34 -61 72 113 52 136 29 -217 216 155
6180 155 -30 -135 89 -81 -11 40 -276 94 129 -37 -295 286 -43 -115 -195 -57 -7 -24 -380 -167 49 -64
6202 -64 103 -254 17 -33 2 151 19 73 -21 -12 -232 -132 196 272 164 99 69 23 74 -115 -32 48 -196 132 -66
6227 -66 -15 3 -174 58 81 73 -259 -145 93 -22 -150 70 -171 37 347 183 -309 7 -62 -87 -87 -244 31
6250 31 -107 204 13 55 71 205 -8 -151 32 12 -262 -53 106 -65 -108 251 262 -95 -54 -41 -158 30 366
6273 366 202 -10 -39 -243 -7 94 -47 24 116 152 14 140 65 87 -5 7 3 112 95 105 22 -165 -180 297 -59
$$ packed form
6108A47k58K90j92L9j3J33k38n6J72O5q4p4p6J21J2rj3J32j85K44m62K99J05o7
6132C2K21r5k25K8k28J60J07l4j11L34j87KM7k45R1J29M25l09j31j24L25k7j78
6155GP5M4P1j40k73o3K19M6P5j39K37p1j26J66k9j33k7J33M1o1Q4j07k46M33o1
6180A55j85j05K24j70P0N1l16L70L5j66k58N81l29p2q0J38N0j7l56K13K16j13
6202f4J67l57K71n0L5J49j32N4r4Rk20J00L28P6j08o5l0m6N1j89Q3Q0k44L28j98
6227f6N1J8j77K32K3ql32J14K38j15j28K20k41K08L10j64m92L16o9k5%j57K75
6250C1j38L11j91M2J6J34k13j43J83k0k74K09J59j71m3L59J1l57M1J3j17J88L36
6273C66j64k12k9k04K36J01j41P1R2L6j38J26p5K2r2J2mJ09j7J0q3j87j5M77l56
$$ plain form
6298 -59 -68 88 278 261 94 -189 122 260 14 102 47 265 49 -78 51 -60 21 -61 166 -73 -162 10 -18
6321 -18 34 -92 -132 -103 -22 -5 73 164 -16 169 95 -89 24 -97 48 177 40 33 97 -211 3 94 -137 185
6345 185 224 -73 -27 110 -25 109 283 -71 -45 -241 -141 -44 27 -28 -181 268 -126 173 -98 -6 -5 -59 -51 -164
6369 -164 -105 -33 0 23 -99 -21 -97 -19 -80 74 183 49 -28 125 81 -63 55 16 -47 21 204 17 -45 -132 232
6394 232 96 287 13 223 -156 150 347 70 -33 -41 -45 41 -18 -65 99 -59 -310 -212 -133 77 -179 -109 -83 -251
6418 -251 -158 140 450 45 -103 -155 -38 -21 11 132 135 130 -18 -135 -118 -22 110 -43 -146 75 -27 -158 -16
6441 -16 -88 236 -42 216 389 -185 11 324 -334 -193 9 125 375 69 223 323 149 72 277 -52 -24
6462 -24 -215 51 45 74 6 86 95 5 84 245 -273 -83 126 -260 25 -273 -33 84 -75 -26 99 -16 252 -43
$$ packed form
6298e9rJ56J90j7j67k83L11J38k46Q8n5K18k16j27J29j11Q1q2K27k39q9J72k8
6321a8N2j26m0K9Q1J7P8R1j80J85p4j84J13j21J45J29j37pO4l08K14R1k31L22
6345A85L9k97M6J37j35J34J74l54K6j96J00R7P1n5j53M49l94K99k71R2Jn4Qj13
6369a64N9P2L3K3j22P8p6P8o1J54J09j34p7J53m4j44J18l9o3O8J83j87o2q7L64
6394B32j36J91k74K10l79L06J97k77j03qmQ6n9m7J64j58k51R8P9K10k56P0K6j68
6418b51R3K98L10m05j48n2J17J7L2J21Lnj48j17J7R6J32j53j03K21j02j31J42
6441a6p2L24k78K58J73n74J96L13o58J41K02J16K50l06J54J00j74p7K05l29K8
6462b4j91K66oK9o8Q0Rr0P9J61n18J90K09l86K85k98K40J17j59M9J25j15K68k95
$$ plain form
6486 -43 -67 -104 -127 -211 -108 -25 52 95 103 -103 85 -100 58 154 47 53 61 31 178 -182 -306 137 22 175 -83
6511 -83 -253 -174 22 -101 134 70 -192 13 296 -85 -41 -81 30 -72 83 30 -75 -157 4 -77 139 -140 -172
6534 -172 -56 -88 -124 -82 -38 -85 -158 -300 38 -236 -46 -213 313 -214 133 -10 -152 202 -68 -6 115 61 8
6557 8 130 46 -253 79 205 -6 -85 104 6 131 -275 -103 115 41 147 289 -56 122 -5 -288 243 70
6579 70 138 -279 -42 212 142 -175 -267 139 96 -48 -19 153 45 40 -10 1 166 312 52 127 -20 24 95 -214
6603 -214 25 174 -225 -127 -175 -43 -73 -81 121 100 -107 337 77 -130 362 138 15 86 271 220 47 -79 144
6626 144 301 -143 167 -76 -293 2 37 167 39 131 23 -11 102 22 38 -200 -130 97 -13 -138 -49 212
6648 212 20 32 -50 -250 40 42 85 34 292 18 -107 -76 -338 447 142 155 19 -1 -251 -33 316 45 -23
$$ packed form
6486d3k4l7k3q4J03Q3P7M3Qk06J88j85J58R6j07OQl0J47l60j24M43j15J53k58
6511h3j70P9J96j23K35o4k62K05K83l81M4m0J11j02J55n3j05q2J61q1K16k79l2
6534a72J16l2l6M2M4m7p3j42L38k74J90j67N26n27L47j43j42L54k70O2J21n4n3
6557HJ22q4k99L32J26k11p9J89r8J25m06J72K18p4J06J42l45J78j27k83N31j73
6579G0O8m17K37K54p0l17r2M06m3j44K9J72j08nn0J1J65J46k60P5j47M4P1l09
6603b14K39J49l99R8m8J32l0qK02k1k07M44k60k07M92k24j23P1J85n1j73j26K23
6626A44J57m44L10k43k17K95L5J30j28R2j08l4J13q0J6k38P0K27j10j25Q9K61
6648B12j92J2q2k00K90KM3n1K58k74j25L1k62P85l05J3j36k0k50K18L49k71o8
$$ plain form
6671 -23 -123 -95 256 17 115 115 -13 -74 98 114 -179 91 -224 252 -257 121 118 46 157 -29 12 -132 -50 22
6695 22 -301 155 -29 -143 -23 -61 -204 254 -44 135 268 -160 125 73 -167 -106 68 -5 -171 -166 -388 45
6717 45 141 3 57 1 148 -134 -66 126 -56 238 -103 -96 82 350 107 -79 14 -6 85 19 33 -94 -7 95
6741 95 133 -210 98 -72 61 -54 -60 104 -105 -23 22 -167 -139 177 219 216 -151 -46 21 39 86 -119 -194 121 -154
6766 -154 43 47 306 177 268 -79 -30 129 -31 -18 141 -216 -62 -107 -313 -8 -26 99 -102 349 80 -11 -46
6789 -46 -94 -19 -66 146 -153 36 -95 68 109 -183 3 -192 4 -8 -238 67 31 -209 -191 56 146 224 59
6812 59 47 -85 -16 198 123 265 189 -17 89 -120 147 191 230 40 -281 -181 -69 41 100 -91 242 119 -99
6835 -99 65 45 31 79 146 219 50 -123 124 -57 -96 178 61 157 11 36 160 -130 -42 -78 199 133 25 -35
$$ packed form
6671b3j00K8L51k39R8%j28o1J72J6k93K70l15M76n09L78lp2J11j86M1j44Q2P2
6695B2l23M56j84j14J20l8j43M58k98J79J33m28K85n2k40O1J74p3j66Nk22M33
6717D5R6j38N4n6J47k82O8J92j82K94l41PJ78K68k43j86R3k0R1o6J4j27Q7J02
6741I5L8l43L08j70J33j15oJ64k09Q2M5j89K8L16M2ll67J05O7J8M7k05p5L15k75
6766a54J97MK59j29R1l47M9J59j60J3J59l57J54m5k06L05j8J25k01M51k69r1l5
6789d6m8P5m7K12k99J89j31J63M1k92J86j95J96j2k30L05l6k40J8K47R0P8j65
6812E9j2j32O9K14p5J42p6k06J06k09K67M4L9j90l21J00J12J10N9j91L33j23k18
6835i9J64k0j4M8O7P3j69j73K47j81l9K74j17R6j46K5J24k90Q8l6K77o6j08o0
$$ plain form
6859 -35 -140 -13 -90 -144 -107 147 264 63 -127 -43 -151 5 -54 133 167 66 175 101 -103 100 147 40 73
6882 73 -188 46 -229 139 -137 -132 -20 -212 64 96 36 -239 15 52 241 1 22 21 -126 249 -240 -121 -142
6905 -142 -112 64 207 231 -100 -119 215 -227 -144 136 34 63 10 -12 -66 -92 -145 -254 -48 -80 -145 -163 -15 61 -204
6930 -204 293 111 -262 -210 143 64 46 -236 -38 -37 -84 -24 56 -183 1 36 196 -87 -146 72 150 -65 -208 -52
6954 -52 -203 152 222 -127 -14 312 -129 -40 8 49 160 317 -321 -3 5 -28 171 67 181 -293 61 17 -135
6977 -135 203 130 236 -1 -112 11 178 -3 182 -81 88 310 -97 -243 266 -71 -99 103 63 23 -111
6998 -111 258 -99 -5 -154 -106 9 132 146 62 186 -253 111 -101 -138 -95 63 -8 -4 11 -124 -97 138 124 -162
7022 -162 -3 89 -4 -143 -18 273 0 -225 -58 -176 123 25 426 -57 105 -1 -65 2 -188 52 -1 -83
$$ packed form
6859c5j05J27p7n4L7K54J17k01j90Q4j08J56n9J87L4j01J09p4k04K03M7j07L3
6882G3k61K34k75L68k76NJ12j92K76L2o0k75K54L7J89k40K1jj47L75m89J19k1
6905a42L0J76J43K4l31j9L34m42Q3K80j02K9n3k2n4k6n3j09K06l2o5j8J48P6k65
6930b04M97j82l73N2L53p9j8k82J98Jm7O0Q0k39J84L5J60k83n9K18P8k15j43J56
6954e2j51L55P0l49J13L26m41Q9M8M1J11J57o38L18Ql3J99j04J14m74L54m4j52
6977a35L38p3J06k37j11J23J67j81J85k63J69K22m07j46N09l37k8K02m0m0j34
6998a11L69l57R4j49M8J15J23J4q4J24m39L64k12l7M3J58p1MJ5j35K7K35j4k86
7022a62J59R2r3j39J25K91k73k25J67j18K99r8M01m83J62j06o4O7j90K40n3q2
$$ plain form
7044 -83 133 289 115 31 -240 141 57 194 -166 282 295 -92 33 217 -171 15 160 48 41 -142 23 5
7066 5 310 43 258 73 -265 -142 -227 67 13 -182 -16 -18 24 207 131 -18 -209 -36 -156 347 191 151 -83
7089 -83 -46 -123 -9 -147 183 155 86 -66 -184 -261 70 -34 77 62 144 60 86 140 -29 -133 152 77 68 -65 -266
7114 -266 90 160 -136 -59 118 -262 281 231 127 92 -138 -179 -54 3 -144 -39 70 90 19 -39 93 -162 -73
7137 -73 184 213 -286 -15 91 61 -95 -185 -72 -135 317 -107 61 95 24 284 116 124 231 -293 -81 149 251
7160 251 -151 7 3 13 159 -208 -95 -13 -42 52 -124 -201 40 -135 -150 -4 94 -53 93 47 261 -88 -16 -76
7184 -76 -153 66 -36 146 53 163 -187 -311 106 140 114 -141 -144 103 -391 -340 175 259 -89 54 -191 187 -169
7207 -169 106 -89 102 -147 -76 111 -49 -115 -156 217 86 86 -53 -190 -221 -245 -323 23 -97 -83 63 71 -109 184
$$ packed form
7044h3K16J56j74q4k71L81q4J37l60M48J3l87J25J84l88J86J45j12pj83J65j8
7066EL05k67K15j85l38J23q5K94n4j95J66kM2J83p6j49j91J73j20N03j56m0k34
7089h3L7p7J14j38L30k8o9j52j18p7L31j04J11j5Q2q4K6N4j69j04K85p5rj33k01
7114b66L56P0k96P7J77l80N43n0j04l5k30m1J25N7j47J05J09K0p1n8J32k55Q9
7137g3K57K9m99K71J06l0j56r0J13o3M52m24J68L4p1K60j68QJ07n24K12K30J02
7160B51m02J58mJ0J46l67J13Q2k9R4j76p7K41j75j5J46R8j47J46m6K14l49P2o0
7184g6p7K19j02J82r3J10l50j24M17L4k6k55lK47m94N1N15Q4l48J43k45L78l56
7207a69K75j95J91k49P1J87j60o6m1L73j31%j39j37l1k4p8L46j20J4J46Qj80K93
$$ plain form
7231 184 25 -14 -127 64 -81 25 -102 -226 211 -139 95 134 150 126 -214 174 144 83 4 160 100 -88 -305
7254 -305 -21 120 -43 -19 -122 8 5 -19 46 23 -267 -3 107 10 -4 160 108 66 -26 -98 -3 53 73 -183 -158
7279 -158 -77 249 171 -270 173 80 6 1 -70 113 22 -185 -208 117 163 127 -13 -279 197 300 -21 78 -174 8
7303 8 287 -131 -69 -210 -150 -47 57 -95 84 -136 260 -76 -186 22 -98 -3 228 297 1 55 86 -95 21
7326 21 -141 77 -320 -116 -260 71 292 16 -38 -232 -163 -35 -49 98 64 -13 -249 -78 250 -10 -354 -95
7348 -95 65 8 11 126 -62 58 125 -30 -51 -244 -101 41 226 215 -28 207 135 -135 -19 -5 146 118 12
7371 12 -118 -31 269 50 -230 -138 -85 -124 -187 25 139 -33 160 -26 2 -150 -110 -62 192 152 145 -85 -19 -55 -72
7396 -72 337 -260 -24 -111 -27 -131 -189 299 -15 93 -16 -38 -120 45 -172 -131 -181 -3 88 190 -71 128 -63
$$ packed form
7231A84j59l9j13J91j45J06j27j24M37l50K34L9J6k4l40L88l0o1p9J56o0j88k17
7254c05K84J41j63K4j03J30lk4O5k3k90K64J10r7j4J64n2m2r2p2R5N6K0k56K5
7279a58Q1L26p8m41M43r3p4np1J83r1k07k3L25M6l6j40k66M76J03l21R9k52J82
7303HK79m18O2j41O0J03J04j52J79k20L96l36j10K08j20R5K31O9k96N4L1j81J16
7326B1j62K18l97K04j44L31K21k76n4j94O9J28j4J47l4p7k36J71L28k60l44K59
7348i5J60n7LJ15j88J20O7j55k1j93J43J42J85j1k43K35p2k70J16J4J51k8j06
7371A2j30Q7L00k19k80R2N3l9o3K12J14j72J93j86K8j52M0M8K54m0pk30O6l6j7
7396g2M09n97K36q7Q4j04n8M88l14J08j09k2q2J65k17M1n0J78R1J02k61J99j91
$$ plain form
7419 -63 -255 355 -20 30 -354 -74 -192 -300 -143 -243 256 67 17 -116 261 -64 89 8 -57 -121 120 -236
7441 -236 6 69 149 294 -120 -90 -174 -26 -203 127 79 -203 5 -75 -316 25 128 170 168 -125 90 200 51
7464 51 33 300 -52 -28 38 180 -284 -220 26 -126 -76 -41 -164 -20 -71 185 -298 -74 151 74 -125 -32 312
7487 312 100 -22 -114 -293 -2 -58 -112 -88 22 -116 111 -43 72 -91 -109 89 215 -253 -38 42 5 139
7509 139 57 106 -212 -1 -300 111 -287 -13 206 32 -26 -40 366 -56 74 -65 -84 62 83 38 84 179 101
7532 101 20 191 -97 -299 -8 -53 -28 138 39 -69 14 25 -21 -246 -142 54 24 54 -13 -210 -109 71 -93
7555 -93 108 -212 23 18 -34 -258 -103 -16 -112 284 -79 -172 173 316 19 -109 -98 228 44 -214 -47 160 159
7578 159 85 -131 -82 104 -254 -224 97 59 288 94 0 -355 14 101 -262 -94 126 87 115 29 -140 -59 -203
$$ packed form
7419f3j92O10l75N0l84K80j18j08J57j00M99j89n0j33L77l25J53q1o5o4K41l56
7441b36K42O3Q0J45m14L0q4J48j77L30m8k82K08q0k41L41J03M2kk93K15J10j49
7464E1j8K67l52K4O6J42m64O4K46j52N0L5j23J44n1K56m83K24K25p7j99R3L44
7487C12k12j22r2j79K91n6n4K4J10j38K27j54J15j63j8J98J26m68K15Q0l7J34
7509A39q2M9l18K11k99M11l98K74K19j74n8j4M06m22J30j39j9J46K1m5M6R5p8
7532A01q1J71k88k02K91m5K5J66r9j08Q3J1m6k25J04J96l0L0o7j97J01J80j64
7555i3K01l20K35nn2k24J55Q7r6L96l63r3L45J43k97j28J1L26j84k58J67K07j
7578A59p4k16M9J86l58L0L21l8K29j94r4l55L69Q7l63J68K20l9K8q6j69Q1j44
$$ plain form
7601 -203 108 204 83 -112 -240 -64 46 55 -387 -15 -104 -26 -104 62 -17 95 219 52 -67 -123 37 112 -47
7624 -47 146 -183 83 -66 103 -169 -139 -1 44 -102 128 114 10 2 5 -20 -19 274 -138 -143 192 107 -89 125 -2
7649 -2 54 171 -89 -164 118 95 -6 69 40 -311 159 177 51 -195 -165 67 -229 -194 42 -47 -198 280 209 -152
7673 -152 -207 -68 144 -54 -55 164 237 43 -57 98 34 -8 -106 -13 83 -72 19 149 7 297 128 148 -325 96
7697 96 34 49 149 -13 196 -24 13 270 121 -69 7 -125 -120 -102 -140 25 -173 -48 -149 59 27 -92 -96 -224
7721 -224 -138 -213 103 -162 -58 -70 -101 110 251 138 120 -70 70 252 170 -46 -54 315 47 -5 102 194 22
7744 22 258 -90 -82 -187 89 205 50 32 27 -1 90 -80 176 15 -273 240 150 197 -25 -12 -142 181 7 167
7768 167 -61 113 148 114 262 409 -55 -83 -257 32 -23 -168 -21 120 -128 149 202 -133 -79 280 178 27
$$ packed form
7601b03L11R6j21j95j28J76J10Rm42L72q9P8p8J66p9J12J24j67j19n6J60P5j59
7624d7J93l29K66j49J69k72L0J38M5j46K30j4j04qLk5JK93m12nL35q5j96K14j27
7649bN6J17k60p5K82k3j01P5k9l51M70J8j26k46L0K32k96L5K36q9j51M78p1l61
7673a52n5J39K12j98jK19P3j94j00J55o4m2r8R3R6j55R1J30j42K90j69K0m73M21
7697I6o2J5J00j62K09k20L7K57j49j90P6j32NJ8l8J65j98J25j01K08l2j19mj28
7721b24Q6p5L16k65J04j2l1K11J41j13j8j90J40J82q2k16qL69k68n2J07R2j72
7744B2K36l48Qj05K76J16j55j8nk8R1j70K56j61k88N13r0M7k22J3j30L23j74J60
7768A67k28J74L5l4J48J47m64k8j74K89n5j45J47J41k48K77N3l35N4L59j02j51
$$ plain form
7790 27 11 48 -137 -23 17 260 48 -127 280 -3 -115 239 145 -123 97 -82 83 -159 -131 -79 133 -140
7812 -140 63 -92 -33 46 157 -33 36 168 -77 62 228 49 97 -124 25 104 -238 132 30 -43 -178 -27
7834 -27 151 142 -90 81 -89 97 153 -253 244 94 90 -46 239 -407 9 -240 -203 114 -408 -27 -145 -2
7856 -2 -147 -203 -204 85 142 -78 30 311 105 162 -25 -57 180 237 -12 -263 97 -42 10 114 3 140 107 155
7880 155 27 -125 188 246 148 -129 141 54 -57 -105 -78 -113 -5 23 114 -17 -179 60 94 -125 13 -346 81
7903 81 -22 259 -142 243 -23 -171 -146 171 120 -101 130 -152 -167 -83 40 318 403 145 -11 -105 33 -199
7925 -199 -275 -5 -19 61 238 -253 62 197 28 269 -204 -317 -91 60 245 30 86 -7 40 -232 -63 -199
7947 -199 -27 -74 -125 -14 -98 72 96 -262 -20 -83 265 91 -55 -167 106 223 199 -305 -249 66 194 -57
$$ packed form
7790B7j6L7j85J14M0K43k12j75M07k83j12L54r4k68K20j79J65k42K8N2K12k73
7812a40K03j55N9P9J11j90O9J32k45J39J66j79M8k21J49P9l42L70j02p3j35J51
7834b7J78rk32J71j70J86N6m06M97j50mj36K85o46M16k49L7L17n22L81j18J43
7856bj45n6jK89N7k20J08K81k06N7j87l2K37N7k49k51L60j39N2J04j11J37l3M8
7880A55j28j52L13N8r8k77K70q7j11m8K7l5J08K8R1j31j62K39L4k19J38l59M27
7903H1j03K81m01L85k66j48K5L17n1k21K31k82j5Q4J23K78Q5k58j56r4J38k32
7925a99p6K70j4Q0J77m91L15J35j69K41m73j13K26J51J85k15N6r3M7k72J69j36
7947a99J72m7n1J11q4J70K4l58K42o3L48j74j46j12K73J17k4n04N6L15J28k51
$$ plain form
7969 -57 58 -54 -41 158 -139 -194 61 -154 -230 -92 -198 136 137 136 -179 -19 -20 60 -112 153 372 -57 172 -77
7993 -77 6 101 -93 -19 -98 69 -28 -326 209 6 -9 -168 -86 -234 256 69 -50 362 136 24 151 129 -181
8016 -181 45 43 5 -220 -236 50 -32 -182 -20 -145 30 -102 -136 -44 -214 300 -16 323 126 254 -128 266
8038 266 142 -83 81 -179 334 -56 -67 -11 160 63 14 109 -137 -175 -203 95 -59 -49 103 129 140 88 -23 -66
8062 -66 229 174 -147 152 -7 -174 123 -17 229 -137 -355 205 -130 150 -147 51 -131 -139 158 -149 290
8083 290 -172 -24 -261 -136 76 48 31 234 -29 23 -102 -69 -206 72 43 -116 -127 95 -135 -138 -113 -151 -86 41
8107 41 -46 23 -100 -65 69 61 -99 -134 -57 -36 -270 232 217 40 361 -85 43 -106 163 -26 -157 -13 -89 -146
8131 -146 62 23 -129 -53 -314 42 195 74 61 51 144 -235 239 32 -59 29 14 85 6 -126 -22 167 95 -109
$$ packed form
7969e7J15j12J3J99k97n5K55k15p6J38j06L34Jjl15J60jQ0j72K65K19m29K29k49
7993g7Q3R5j94P4p9J67r7k98N35k03j5j59Q2j48M90j87j19M12k26j12J27k2l10
8016a81K26kl8k25j6K86q2j50J62j25J75j32l4R2j70N14l16L39j97J28l82L94
8038B66j24k25J64k60N13l90j1N6J71r7m9R5k46l8k8K98j54J0J52K6J1n2j11m3
8062f6K95n5l21K99j59j67K97j40K46l66k18N60l35K80k97J98j82qK97l07M39
8083B90m62J48k37J25K12k8j7K03k63N2j25L3j37K78k9j59j1K22k30lK5l8O5J27
8107D1q7O9j23L5J34qj60l5P7K1k34N02j5j77L21m46J28j49K69j89j31J44p6n7
8131a46K08l9j52P6k61L56J53j21j3j0R3l79M74k07r1Q8j5P1p9j32J04J89p2k04
$$ plain form
8155 -109 -45 97 204 -62 188 58 122 61 41 165 95 -189 -58 -237 -249 82 39 -122 -100 161 80 79 -54 -168
8179 -168 -184 -44 -87 -213 -36 78 111 -20 -304 -48 40 111
$$ packed form
8155a09O4J42J07k66K50j30O4o1k0J24p0k84J31j79j2L31m3j61K2K61q1jj33j14
8179a68j6J40m3j26J77J14L3j31k84K56Q8P1
8191A11
$$ Imaginary data points
##PAGE= N=2
##DATA TABLE= (X++(I..I)), XYDATA
$$ plain form
0 0 0 0 0 0 0 0 0 0 0 0 0 0 8 -8 8 -8 8 -16 16 -17 24 -30 32 -40 48 -56 64 -72 83 -96 112 -126 144 -161
34 -161 184 -206 232 -257 289 -322 359 -399 441 -489 544 -600 662 -729 805 -886 977 -1073
52 -1073 1185 -1307 1446 -1599 1774 -1976 2211 -2487 2818 -3224 3736 -4402 5307 -6624 8710
67 8710 -12560 22035 -101934 -79388 48021 -77410 -47596 23536 -13475 -46957 37177 45854
79 45854 8261 29113 56740 1423 655 42432 23130 1697 30553 6586 -25261 -10950 -2372
92 -2372 -13011 -11364 -14105 -9744 -16589 -25215 -4074 20112 5876 -7690 5394 16581 3677
105 3677 4479 19560 -775 -13578 14658 1957 -26576 316 9335 -18392 -5280 11107 -10099
118 -10099 -13696 10185 9991 -9191 52 16410 -598 -4432 16249 5150 -6703 9271 5028
$$ packed form
0@%%%%%%%%%%%%Qj6J6j6J6k4L2l3M1n4O2p2Q8j04J20j36J55j79K08k38K70l05
34a61L45l90M38m89N46o11O81p58Q40r30J033j144J262j391J534j691J863k050
52a073K258k492K753l045L373l750M187m698N305o042O960q138R709j1931J5334
67H710k1270L4595j23969K2546J27409j25431K9814P1132l7011l3482Q4134Q677
79D5854l7593K0852K7627n5317p68M1777j9302k1433K8856k3967l1847J4311Q578
92b372j0639J647k741M361o845q626K1141K4186j4236j3566J3084J1187j2904
105C677Q02J5081k0335j2803K8236j2701k8533K6892R019k7727J3112J6387k1206
118a0099l597K3881j94j9182R243J6358j7008l834K0681j1099j1853J5974m243
$$ plain form
131 5028 -8195 -2379 -3186 -9563 -7213 -795 1397 -8146 -8852 4602 2396 -463 8849 6424 -1904
146 -1904 2485 5702 3241 -827 2258 6504 -5318 -7152 4754 -5038 -9323 6986 378 -12550
160 -12550 -2765 1925 -4362 -676 7535 2925 -6530 2304 10842 -1148 -369 10792 -1358 -6642
174 -6642 5184 1232 -5713 -1403 1034 -1221 -5311 -1790 3212 -3810 -2931 6010 -952 -5421 2570
189 2570 3086 -659 -340 3137 2919 -3644 173 7136 -3562 -4921 6366 -608 -6729 2516 1646 -5144
205 -5144 -1489 4840 1177 -5018 1549 5290 -4698 -783 7687 -2529 -4369 4982 489 -3813 1119
220 1119 2772 -1143 -3312 862 1753 -4766 -1122 3697 -3646 -3607 2643 -900 -1914 2327 2302 608
236 608 -829 2240 3911 -1499 995 5048 -2168 -1913 3345 -398 -2744 -240 -657 -2125 -3108 -195
$$ packed form
131E028j3223N816q07o377K350O418K192r543p06J3454k206k859R312k425q328
146a904M389L217k461m068L085M246j1822j834J1906r792m285J6309o608j2928
160a2550R785M690o287L686Q211m610r455Q834Q538j1990P79J1161j2150n284
174f642J1826l952o945M310K437k255m090L521N002p022Q79Q941o962m469P991
189B570N16l745L19L477k18o563L817O963j0698j359J1287o974o121R245q70o790
205e144L655O329l663o195O567L741r988L915Q470j0216j840R351m493m302M932
220A119J653l915k169M174Q91o519L644M819p343L9O250l543j014M241k5j694
236F08j437L069J671n410K494M053p216K55N258l743k346K504m17j468r83K913
$$ plain form
252 -195 253 -4341 -679 2694 -3457 -667 4669 -54 -447 3414 1916 357 1279 2712 1229 -2734
268 -2734 483 1623 -4356 -1383 2095 -3788 -2973 939 -948 -1685 -67 1303 212 -1559 2351 2839
284 2839 -1937 1427 4230 -1373 -311 2683 32 -1476 -444 -248 -1924 -3054 517 417 -3662 247
300 247 1855 -2296 408 3502 384 172 1509 1747 455 -304 2082 960 -3069 210 735 -3638
316 -3638 -985 1061 -2568 -1969 -187 71 -552 -105 2703 1341 -1577 2685 2756 -952 1916 2836 -1153
333 -1153 -846 333 -785 -1492 -1735 25 -1711 -3584 250 267 -3029 925 2005 -1127 577 2069
349 2069 1417 1070 1111 2422 650 -1338 1867 575 -2870 -282 -48 -3336 -1137 -151 -1887 -1379 -898
366 -898 794 -312 -798 2275 1311 -831 2613 2136 -728 1404 1618 -400 -511 -216 445 -1421 -1948
$$ packed form
252a95M48m594L662L373o151K790N336m723l93L861j498j559R22J433j483l963
268b734L217J140n979K973L478n883Q15L912j887p37J618J370j091j771L910M88
284B839m776L364K803n603J062K994k651j508J032J96j676j130L571j00m079L909
300B47J608m151K704L094l118k12J337K38j292p59K386j122m029L279N25m373
316c638K653K046l629N99J782K58o23M47K808j362k918M262P1l708K868R20l989
333a153L07J179j118p07k43J760j736j873L834J7l296L954J080l132J704J492
349B069o52l47M1J311j772j988L205j292l445K588K34l288K199R86j736N08M81
366h98J692j106m86L073r64k142L444m77k864K132K14k018j11K95O61j866n27
$$ plain form
383 -1948 385 -1303 -2727 975 129 -1704 391 1278 -326 470 1372 1506 458 63 1715 -157 -1702
400 -1702 1240 58 -1816 455 -568 -1865 -725 -258 -32 -720 -523 1235 -493 -386 2128 862
416 862 -282 1740 1094 -465 679 634 -259 -451 -354 266 -1713 -1351 510 -1049 -1661 752 -573 -1307
434 -1307 634 1036 451 688 932 1366 -307 244 1995 -323 -872 1220 -563 -1550 -183 -426 -1265 -719
452 -719 -370 -160 -1191 -75 1417 -735 -369 2031 98 -362 1720 908 -101 14 457 -101 -885 -158
470 -158 1017 -1364 -1061 790 -990 -1563 791 -120 -652 172 709 429 -250 774 1733 -229 -4 1702
488 1702 -335 -870 721 -312 -671 -535 -83 -429 -1090 -215 879 -1158 -432 1307 -219 -427 1129
505 1129 394 69 606 870 767 -475 160 685 -1004 -552 696 -986 -844 118 -896 -686 -56 341
$$ packed form
383a948K333j688j424L702q46j833K095Q87j604P96R02J34j048l95J652j872j545
400a702K942j182j874K271j023j297J140M67K26o88J97J758j728J07K514j266
416H62j144K022o46j559J144m5q93j92R7O20j979L62J861j559o12K413j325p34
434a307J941M02n85K37K44M34j673N51J751k318n49K092j783r87J367k43q39N46
452g19L49K10j031J116J492k152L66K400j933m60K082q12j009J15M43n58p84P27
470a58J175k381L03J851j780n73K354r11n32Q24N37k80o79J024R59j962K25J706
488A702k037n35J591j033l59J36M52l46o61Q75J094k037P26J739j526k08J556
505A129p35l25N37K64j03j242O35N25j689M52J248j682J42R62j014K10O30L97
$$ plain form
523 341 60 -185 612 790 255 554 1137 22 491 523 -125 -263 70 -346 -279 -749 -578 -214 -1007 -416 -247
544 -247 -919 -123 600 -685 104 774 206 386 499 443 422 -19 351 510 -809 272 286 -1126 -227 285
564 285 -781 -664 133 44 -54 -313 372 139 -535 643 736 -488 654 889 -417 -27 31 27 -330 -245 262
585 262 -602 -1210 203 -95 -729 215 414 -228 37 555 320 305 259 934 338 -513 791 53 -1078 304
605 304 329 -746 -511 151 -327 -767 -127 471 -159 -543 582 528 -281 531 719 75 41 528 0 -34 -86
626 -86 152 -165 -733 358 -172 -1178 44 5 -617 -132 246 182 314 129 982 514 -181 970 224 -382
646 -382 300 475 -550 -123 -237 -390 -387 -403 83 -294 -488 396 112 -492 655 521 -185 705 372 -59 121
667 121 -43 -85 -188 -287 182 -283 -478 231 -224 -441 -395 -296 -369 162 61 229 165 -172 705 360 290 697 93
$$ packed form
523C41k81k45P97J78n35K99N83j115M69L2o48j38L33m16O7m70J71L64p93N91J69
544b47o72P96P23j285P89O70n68J80J13n6k1m41L70J59j319J081J4j412Q99N12
564B85j066J17P97q9r8k59O85k33o74J178R3j224J142K35j306L90N8ml57Q5N07
585B62q64o08J413k98o34R44J99o42K65N18k35j5m6O75n96q51J304p38j131J382
605C04K5j075K35O62m78m40O40N98o30l84J125n4q09Q12J88o44l4M87n28l4n2
626h6K38l17n68J091n30j006J222l9o22M85L78o4J32j85Q53m68o95J151p46o06
646c82O82J75j025M27j14j53Lj6M86l77j94Q84k84o04J147j34p06Q90l33m31J80
667A21j64m2j03r9M69m65j95P09m55k17M6R9p3N31j01J68o4l37Q77l45p0M07o04
$$ plain form
690 93 -401 502 77 -540 -79 -196 -323 -418 -305 110 -195 -352 422 -260 -319 585 180 -129 670 418 63
711 63 153 208 375 -166 -8 223 -519 -424 182 -514 -246 -179 -392 63 147 46 229 -79 -39 544 66 -38 588
734 588 163 10 351 -66 -150 -285 -107 -84 -451 -473 99 -531 -423 432 -84 -287 428 77 -13 203 -137 252
756 252 129 -213 295 -285 72 -3 -609 -288 191 -84 -326 178 -141 -32 -151 92 320 277 -159 486 225
777 225 21 248 22 -80 -41 98 119 -179 88 82 -242 -214 224 -277 -283 244 -31 44 366 221 321 32 -26
800 -26 487 -37 39 327 -424 -211 40 -108 -245 -249 -333 95 -12 -82 -24 -376 76 214 -84 63 486 -176 -29
823 -29 344 -229 -41 -458 -139 94 -199 98 246 -623 -51 163 -463 127 -72 -131 -159 128 176 -22 -116 413
845 413 141 -22 118 100 -40 23 329 -345 -117 152 -212 -89 -189 240 -71 -470 168 193 -24 216 236 135
$$ packed form
690I3m94R03m25o17M61j17j27r5J13M15l05j57P74o82n9R04m05l09P99k52l55
711F3R0N5J67n41J58K31p42R5O06o96K68O7k13M55Q4j01J83l08M0N83m78j04O26
734E88m25j53L41m17q4j35J78K3l67k2N72o30J08Q55n16k03P15l51r0K16l40L89
756B52j23l42N08n80L57p5o06L21M79k75k42N04l19J09j19K43K28m3m36O45k61
777B25k04K27k26j02L9J39K1k98K67ol24K8M38n01oN27k75P5L22j45J00k89n8
800b6N13n24P6K88p51K13K51j48j37mq4M28j07p0N8l52M52J38k98J47M23o62J47
823b9L73n73J88m17L19K33k93K97J48q69N72K14o26N90j99n9k8K87M8j98r4N29
845D13k72j63J40j8j40O3L06o74K28K69l64J23j00M29l11l99O38K5k17K40K0j01
$$ plain form
867 135 235 38 271 150 -136 78 150 -114 -98 163 -294 -195 57 97 -146 60 23 243 53 363 60 -55
889 -55 28 344 -221 -71 38 -224 -33 47 188 -109 -203 -154 -339 -184 151 191 25 336 136 140 54 -7 81 91
913 91 107 -20 9 -355 -37 274 -343 -104 -68 -129 -11 13 -166 -101 59 168 209 -183 261 341 -83 159 -42
936 -42 -34 51 116 -60 -180 -354 18 -355 -465 7 -111 -76 138 -169 75 29 249 -102 -258 90 100 91 209 425
960 425 96 151 -77 -117 -141 -107 323 -71 -230 -70 69 194 -82 232 224 -180 427 192 17 367 -79 -154 238
983 238 -272 -148 -98 83 -31 -12 -321 115 -100 -199 -144 33 -266 -260 -299 76 251 60 -180 189 -78 493 71
1006 71 -126 -48 -252 -236 -89 -106 309 -287 -128 30 -48 -128 42 -68 -153 93 -18 75 252 245 -120 -138 -73 -8
1030 -8 -71 -46 64 -210 -297 80 -81 -20 -232 18 68 24 -112 462 173 4 170 155 27 149 33 102 31 16
$$ packed form
867A35J00j97K33j21k86K14P2k64J6K61m57R9K52M0k43K06l7K20j90L10l03j15
889e5Q3L16n65J50J09k62J91Q0J41k97r4M9j85J55L35M0j66L11k00Mq6o1Q8J0
913I1J6j27K9l64L18L11o17K39L6o1J18K4j79O5J60J09M1l92M44Q0m24K42k01
936d2QQ5O5j76j20j74L72l73j10M72j18L5K14l07K44m6K20l51j56L48J0rJ18K16
960D25l29N5k28m0k4L4M30l94j59J60J39J25k76L14qm04O07k35j75L50m46p5L92
983B38n10J24N0J81j14J9l09M36k15r9N5J77k99Ol9L75J75j91k40L69k67N71m22
1006G1j97P8k04J6J47j7M15n96J59J58p8q0J70j10q5K46j11R3J77pl65j8O5O5
1030ho3K5J10k74q7L77j61O1k12K50N0m4j36N74k89j69J66j5j28J22j16O9p1j5
$$ plain form
1054 16 -54 -45 -30 -226 194 -218 -166 -4 105 78 101 139 50 -12 103 119 -58 132 -33 49 -42 -79 -69 -59 -114 -51
1080 -51 -225 40 54 92 153 162 76 -23 29 116 -32 122 -58 -138 163 -55 -132 -107 1 -47 -133 -279 -116 58 -50
1105 -50 -220 74 -152 60 179 322 240 92 145 79 199 -39 103 -160 -214 -96 -91 -135 -70 -73 -59 81 28 14 177
1130 177 271 17 46 222 -163 37 238 138 73 181 -193 71 114 -263 -76 -190 94 76 76 55 254 -35 -45
1153 -45 128 -78 58 186 -288 -121 -205 -138 -89 -46 81 -136 -114 232 73 -274 -65 4 140 -361 78 14 148
1176 148 83 134 -144 102 -67 104 17 289 -173 4 -170 -116 185 -304 -100 -136 105 -148 299 307 91 293
1198 293 63 138 228 -28 212 57 -129 -85 -158 -138 -29 56 -116 -168 -7 111 -57 83 87 -92 -97 -209 -252 -112
1222 -112 21 71 -89 189 48 -12 -174 -86 29 -56 -320 -141 -66 -134 183 -101 -143 -89 291 -64 106 -1 -145
$$ packed form
1054A6p0RJ5j96M20m12N2J62J09k7K3L8q9o2J15J6j77J90j65Q2r1l7J0J0n5O3
1080e1j74K65J4L8O1Rq6r9N2Q7j48J54j80q0L01k18p7K5J08m8q6j46J63J74j08
1105e0j70K94k26K12J19J43q2j48N3o6J20k38J42k63n4J18Nm4O5lJ4J40n3j4J63
1130A77R4k54K9J76l85K00K01j00o5J08l74K64M3l77J87j14K84j8%k1J99k89j0
1153d5J73k06J36J28m74J67q4O7M9M3J27k17K2L46j59l47K09O9J36n01M39o4J34
1176A48o5N1k78K46j69J71q7K72m62J77j74N4L01m89K04l6K41k53M47Qk16K02
1198B93k30P5R0k56K40j55j86M4p3K0J09Q5j72n2J61J18j68J40Mj79nj12m3J40
1222a12J33N0j60K78j41o0j62Q8J15q5k64J79P5o8L17k84m2N4L80l55J70j07j44
$$ plain form
1245 -145 -32 -3 -144 60 170 -43 111 -121 -252 -326 16 139 127 3 132 118 50 241 -58 221 -103 155
1267 155 -83 -9 270 219 153 -39 193 8 -44 25 -154 -18 -242 488 26 -283 113 -149 -58 -59 296 -174 -43
1290 -43 142 -49 -249 326 -217 154 -103 5 101 81 -107 160 -150 226 -131 8 -44 -144 -229 107 90 69
1312 69 -329 37 -109 298 -294 -276 33 -252 -79 125 -125 -23 160 -44 158 -30 86 109 -70 -86 -1 161
1334 161 -12 -65 126 -109 -6 105 369 139 122 -131 6 254 -1 -15 -75 -115 -167 -15 -120 11 217 1
1356 1 -214 -209 267 49 86 -82 -318 38 150 86 -183 -72 -118 190 5 -99 -174 -68 56 23 144 -43 -46 268
1380 268 72 -53 -206 -34 41 44 37 23 -37 17 -142 -75 -96 -7 345 -149 172 -183 63 -7 -163 73 -35 -108
1404 -108 25 210 -22 -216 92 164 -41 -136 -58 193 -71 125 -38 4 -266 -78 -109 90 47 -124 -106 270
$$ packed form
1245a45J13K9j41K04J10k13J54k32j31p4L42J23j2j24J29j4o8J91k99K79l24K58
1267A55k38P4K79n1o6j92K32j85n2O9j79J36k24P30m62l09L96k62R1jL55m70J31
1290d3J85j91k00N75n43L71k57J08R6k0j88K67l10L76l57J39n2j00q5L36j7k1
1312F9l98L66j46M07n92J8L09k85J73K04k50J02J83k04K02j88J16K3j79j6Q5J62
1334A61j73n3J91k35J03J11K64k30j7k53J37K48k55j4o0m0n2J52j05J31K06k16
1356Ak15NM76k18L7j68k36L56J12o4k69J11m6L08j85j04p5J06J24l3J21j87lL14
1380B68j96j25j53J72P5Lpj4o0N4j59O7k1Q9L52m94L21l55K46p0j56K36j08p3
1404a08J33J85k32j94L08P2k05r5P8K51k64J96j63M2k70J88l1J99m3j71J8L76
$$ plain form
1426 270 144 44 -21 -124 190 -97 9 47 -105 20 191 71 11 99 -218 164 36 357 -24 209 12
1447 12 89 60 1 232 111 250 -79 -85 -136 17 -66 -228 164 132 -170 21 -31 -328 -1 159 252 19 142 12
1471 12 -63 -135 -36 63 16 201 -124 129 66 -28 -84 102 50 -74 -66 108 136 64 -128 -19 -146 -189 143 -26 330
1496 330 303 90 -292 -188 -52 260 -187 34 -21 13 63 -16 66 175 47 19 -84 302 -148 63 132 -201 -105
1519 -105 170 -170 -170 60 41 39 51 57 283 91 -241 122 100 60 102 -23 30 31 -338 112 279 -218 -163 102 12
1544 12 -50 -244 -37 236 -62 66 223 -152 -146 182 -119 126 53 -187 -93 144 106 -156 -86 -106 220 -60 18
1567 18 -62 -250 218 21 -65 106 124 -81 -81 67 -133 52 228 -92 122 16 -175 -73 -96 123 -266 138
1589 138 213 224 127 3 -105 -184 -200 67 -84 -62 -8 -154 339 204 152 122 -91 -243 -28 20 142 -29 -134
$$ packed form
1426B70j26j00o5j03L14k87J06L8j52J25J71j20o0Q8l17L82j28L21l81K33j97
1447A2P7k9n9K31j21J39l29on1J53q3j62L92l2l02J91n2k97L27J60R3k33J23j30
1471A2p5p2R9R9m7J85l25K53o3r4n6J86n2j24QJ74K8p2j92J09j27m3L32j69L56
1496C30k7k13l82J04J36L12m47K21n5L4N0p9Q2J09j28k8j03L86m50K11O9l33R6
1519a05K75l40%K30j9kJ2OK26j92l32L63k2m0M2j25N3Jl69M50J67m97N5K65r0
1544A2o2j94K07K73k98J28J57l75OL28l01K45p3k40R4K37l8k62P0k0L26k80P8
1567A8q0j88M68j97q6J71J8k05%J48k00J85J76l20K14j06j91J02k3K19l89M04
1589A38P5J1r7j24j08p9j6K67j51K2N4j46M93j35n2l0k13j52K15M8J22j71j05
$$ plain form
1612 -134 255 -187 214 -47 177 209 -233 218 191 87 -160 -133 -37 130 -319 141 -5 204 70 113 68 -27
1634 -27 206 -315 -76 35 -162 126 -133 62 66 -170 245 373 -135 -198 -62 143 100 -157 34 -155 -4 -144
1656 -144 -37 187 40 -26 -173 -28 66 158 66 -143 -136 84 -45 -41 9 -200 13 6 -47 158 -130 149 -149 -26
1680 -26 -104 -197 -172 -2 203 -2 -87 -4 -22 11 -399 19 -101 -25 150 -10 227 -89 22 -268 -22 0 32 -181
1704 -181 37 -34 -273 101 -121 25 69 -226 155 4 120 114 229 -14 -11 99 -2 63 98 93 -276 -11 116
1727 116 -21 281 37 48 -48 170 -63 -81 -35 -47 13 -41 -127 220 138 -159 -71 -73 208 78 -20 -108 -137 -37 99
1752 99 101 -3 17 53 143 -23 -51 81 40 -31 73 216 20 -337 93 31 -54 144 -208 -102 -100 -41 178 198 102
1777 102 16 20 -238 -200 -152 -21 -81 108 227 -66 -155 -55 -32 49 268 132 -16 -193 67 170 -72 -263 237
$$ packed form
1612a34L89m42M01k61K24L2m42M51k7j04k47K7R6J67m49M60j46K09j34M3m5r5
1634b7K33n21K39J11j97K88k59J95Mk36M15J28n08o3J36K05m3k57J91j89J51j40
1656a44J07K24j47o6j47J45R4R2r2k09PK20j29MN0k09K13pn3K05k88K79k98J23
1680b6p8r3K5J70K05k05q5Q3j8L3m10M18j20P6J75j60K37l16J11k90K46K2L2k13
1704a81K18p1k39L74k22J46M4k95L81j51J16oJ15k43LJ10j01O5L5nl69K65J27
1727A16j37L02k44J1r6K18k33j8M6j2O0n4q6L47q2k97Q8kK81j30r8q8k9J00J36
1752I9Kj04K0L6R0j66k8J32m1p1J04J43j96l57M30o2q5J98l52J06KN9K19K0r6
1777A02q6Mk58L8M8J31o0J89J19k93q9J00K3Q1K19j36j48j77K60J03k42j91N00
$$ plain form
1800 237 16 271 -93 -94 -33 58 -40 -141 220 -85 121 -201 160 168 -61 -273 -126 328 233 -101 -53 58 -77
1823 -77 -229 -37 114 -234 -130 293 68 1 130 9 -53 124 -81 91 38 61 -78 16 216 100 -142 123
1845 123 300 127 109 60 17 81 175 -40 -180 300 -279 -51 -116 -271 -8 302 -27 -325 117 -268 62 162
1867 162 -106 115 -53 -26 178 122 -52 -149 -400 -183 68 61 -99 -170 135 86 71 4 278 -54 -169 215 244
1890 244 64 40 160 16 -112 212 169 -179 153 324 -155 -10 112 -149 -25 -153 116 -61 -22 23 -70 319
1912 319 97 32 -140 146 -175 71 169 -47 -4 -49 141 130 -75 -43 -133 -78 388 -219 157 269 -36 2 -158
1935 -158 -120 -206 40 3 -57 53 267 82 83 -100 221 -8 24 125 -156 -79 -18 -88 130 -209 -105 -23 6 24
1959 24 -13 197 151 -16 110 135 0 -175 56 -14 -5 35 -117 77 -106 169 -75 50 -76 49 115 15 35
$$ packed form
1800B37k21K55l64jO1R1r8j01L61l05K06l22L61Qk29k12J47M54r5l34M8J11j35
1823g7j52J92J51l48J04M23k25o7J29j21o2J77k05J72n3K3j39R4K00j16k42K65
1845A23J77j73j8m9m3O4R4k15j40M80n79K28o5j55K63L10l29k98M42l85L30J00
1867A62k68K21j68K7K04n6j74r7k51K17K51pj60p1L05m9j5o7K74l32j15L84K9
1890B44j80k4J20j44j28L24m3l48L32J71m79J45J22k61J24j28K69j77L9M5r3L89
1912C19k22o5j72K86l21K46R8k16M3m5J90j1k05L2r0N5M66o07L76J12l05L8j60
1935a58L8q6K46l7o0J10K14j85Jj83L21k29L2J01k81P7O1p0K18l39J04Q2K9J8
1959B4l7K10m6j67J26K5j35j75K31p0RM0j52J94j83K75k44J25j26J25O6j00K0
$$ plain form
1982 35 -24 -90 87 164 -208 -160 -11 134 -286 165 -38 59 -199 260 -29 -38 -222 112 -130 -28 190 -41 -339
2005 -339 33 244 273 9 216 88 -126 48 226 -5 -18 -41 -86 35 457 41 149 -34 -252 56 -251
2026 -251 57 -49 -165 -228 -9 349 -237 -264 -184 194 175 26 -103 139 -40 6 -80 37 11 -134 -12 -9 -198
2049 -198 81 215 -129 101 -128 113 152 -150 -25 33 -173 82 189 19 -124 -68 146 -289 74 45 -38 -181
2071 -181 -14 -91 4 103 404 -149 157 -299 -94 -112 -46 16 -51 158 -35 -38 200 78 56 278 213 5 180 172
2095 172 235 -187 80 -209 -67 -37 126 63 19 -18 404 -56 12 -50 110 12 7 -87 -152 158 22 -5 -77 311 112
2120 112 61 189 346 279 33 59 -138 -97 -108 338 87 288 -47 18 -341 -51 -198 -4 -25 -207 249 35
2142 35 210 -44 61 128 83 174 -136 -114 20 122 -261 227 -145 -45 35 -30 -180 50 220 38 56 198 -102
$$ packed form
1982C5n9o6J77P7l72M8J49J45m20M51k03R7k58M59k89rj84L34k42J02K18k31k98
2005c39L72K11K9k64K07j28k14J74J78k31j3k3m5J21M22m16J08j83k18L08l07
2026b51L08j06j16o3K19L58n86k7Q0L78j9j49j29K42j79M6q6J17k6j45J22Lj89
2049a98K79J34l44K30k29K41L9l02J25N8k06K55J07j70j43N6K14m35L63k9q3j43
2071a81J67p7R5R9L01n53L06m56K05j8O6O2o7K09j93lK38j22k2K22o5k08J75q
2095A72O3m22K67k89J42L0J63o3m4l7M22m60O8o2J60r8nr4o5L10j36k7p2L88j99
2120A12n1J28J57o7k46K6j97M1j1M46k51K01l35O5l59K90j47J94k1j82M56k14
2142C5J75k54J05O7m5R1l10K2J34J02l83M88l72J00Q0o5j50K30J70j82J8J42l00
$$ plain form
2165 -102 -114 -161 -54 -154 101 91 -5 -53 177 113 110 167 168 39 323 8 -139 147 -143 -34 35 -240 -86 -172
2189 -172 133 -51 -147 -103 158 266 -91 -149 -12 86 -246 -47 22 12 -40 -185 2 6 -65 41 120 134 136 109 -20
2214 -20 -48 133 105 29 -141 -85 -15 59 -325 193 152 -44 -132 68 73 46 16 -73 60 206 125 -69 175 -134 -38
2239 -38 -27 129 112 93 -256 49 -278 -26 57 -17 163 39 81 -33 -81 129 -27 -168 -274 -76 -102 202 -39
2262 -39 -164 14 154 182 -199 26 -26 -138 115 -67 136 -21 -126 61 129 94 117 260 -113 17 -56 -17 29
2285 29 -153 8 61 -50 62 228 -29 -114 -35 82 251 38 47 -74 195 -189 40 319 -20 -161 -195 231
2307 231 33 -301 -176 144 -26 -77 95 -120 152 11 0 28 4 176 104 20 215 97 -69 118 -275 233
2329 233 -107 38 141 -239 -262 -178 176 29 -90 -209 206 281 -224 159 -37 172 232 -23 -211 55 131 -53
$$ packed form
2165a02j2m7J07j00K55j0r6m8K30o4lN7Jj29K84l15j47K86k90J09O9k75J54q6
2189a72L05j84r6M4K61J08l57n8J37R8l32J99O9j0n2j45J87Mp1J06P9J4Kk7j29
2214b0k8J81k8p6j70N6P0P4l84N18m1j96q8K00Nk7l0q9J33J46q1j94K44l09R6
2239c8J1J56j7j9l49L05l27K52Q3p4J80j24M2j14m8K10j56j41j06J98k6L04k41
2262c9j25J78J40K8l81K25n2j12K53j82K03j57j05J87O8l5K3J43l73J30p3L9M6
2285B9j82J61N3j11J12J66k57q5P9J17J69k13Rj21K69l84K29K79l39j41l4M26
2307B31j98l34J25L20j70n1J72k15K72j41j1K8k4J72p2q4J95j18j66J87l93N08
2329B33l40J45J03l80k3Q4L54j47j19j19M15P5n05L83j96K09O0k55j88K66P6j84
$$ plain form
2351 -53 -10 156 -165 48 134 -32 -23 -60 -118 -115 -75 -214 79 -49 -122 104 24 129 44 -33 235 474 125 178 -32
2376 -32 148 47 -13 160 48 186 -32 -180 2 157 169 239 -127 -105 1 56 37 66 16 -158 170 10 68
2399 68 -8 -119 -163 335 -147 -23 -241 327 222 63 268 -24 158 -31 206 -84 95 129 -120 107 14 5
2421 5 167 -101 -288 64 75 -68 81 178 -111 165 43 95 168 -15 -241 -257 18 -16 -41 -100 -86 -53 -158 7
2445 7 36 -21 243 -56 6 62 85 -39 -135 92 -49 257 -178 77 4 -168 158 -172 -48 256 0 178 52
2468 52 11 -48 181 -164 -44 -134 216 -25 105 143 49 142 -15 -176 -259 -92 65 -189 -64 -92 55 172 93
2491 93 -36 -3 212 162 147 94 -7 26 57 -300 -94 -310 -49 46 53 1 -131 140 -5 -192 21 -21 -59 -405
2515 -405 149 -278 88 -153 -103 -128 -84 113 -154 199 228 119 -238 330 -284 271 -60 -189 -173 -230 107 34
$$ packed form
2351e3M3J66l21K13Q6j66Rl7n8LM0j39K93j28p3K26q0J05q5p7K68K39l49N3k10
2376c2J80j01o0J73j12J38k18j48J82J55J2P0l66K2J06N5j9K9n0j74L28j60N8
2399F8p6j11m4M98m82J24k18N68j05j59K05k92J82j89K37k90J79L4k49K27r3r
2421EJ62k68j87L52J1j43J49R7k89K76j22N2P3j83k26j6K75l4k5n9J4L3j05J65
2445GK9n7K64k99O2N6K3j24r6K27j41L06m35K55p3j72L26l30J24L04k56J78j26
2468E2m1n9K29l45J20r0L50k41J30L8r4R3j57j61q3J67J57k54J25k8J47J17p9
2491I3j29L3K15n0j5n3j01L3L1l57K06k16K61R5Pn2j32K71j45j87K13m2l8l46
2515d05N54m27L66k41N0k5M4J97k67L53K9j09l57N68o14N55l31j29J6n7L37p3
$$ plain form
2537 34 3 -127 -173 -49 106 -57 -297 -125 153 3 16 -256 -21 91 87 56 -147 7 142 53 -237 138 -89
2560 -89 95 -196 93 128 -42 234 -48 59 56 66 114 -72 -37 -249 51 -41 94 -118 -90 107 -50 55 -84
2583 -84 357 -57 27 17 -152 139 -127 279 -1 -62 -235 49 -5 103 -15 64 141 -38 -93 -27 -199 175 116
2606 116 106 169 44 167 77 -75 78 -99 79 130 -349 -154 149 -25 -153 227 -82 174 -273 156 247 161
2628 161 -25 -122 110 -269 -2 42 -18 -230 -168 -334 -105 64 -82 -199 28 23 -389 37 -25 -35 -55 78 4
2651 4 137 43 5 18 -291 -25 -37 64 205 106 -205 -18 73 -19 -28 81 -30 68 0 -221 163 112 35 -41 57 40
2677 40 -26 19 -179 -219 -231 -241 113 -198 -37 -82 134 142 76 164 54 171 60 373 99 164 -70 -34 -205 101
2701 101 116 118 77 193 19 2 160 49 -34 66 101 149 40 29 -211 -39 -40 -60 -67 -35 137 58 -34 -51 -139 -77 -175
$$ packed form
2537C4l1j30m6J24J55j63k40J72K78j50J3k72K35J12ml1k03J54J35q9k90L75k27
2560h9J84k91K89L5j70K76k82J07lJ0M8j86L5k12L00r2J35k12K8J97j57J05j39
2583h4M41m14Q4j0j69K91k66M06k80o1j73K84n4J08j18P9P7j79n5O6j72L74n9
2606A16j0O3j25J23r0j52J53j77J78N1m79J95L03j74j28L80l09K56m47M29R1q6
2628A61j86r7K32l79K67M4o0k12O2j66K29J69j46j17K27nm12M26o2j0k0J33p4
2651DJ33r4l8J3l09K66j2J01J41r9l11J87R1r2rJ09j11R8o8k21L84n1p7p6R8j7
2677D0o6M5j98m0j2j0L54l11J61m5K16Qo6Q8j10J17j11L13k74O5k34L6j71L06
2701A01J5Km1J16j74j7J58j11q3J00L5M8j09j1k40J72jk0pL2J72p9r2j7q8O2r8
$$ plain form
2728 -175 86 -206 152 -244 -101 125 96 25 148 227 173 16 -98 121 123 -74 92 -189 -138 -111 -93 -57 -210
2751 -210 -83 -107 131 294 -345 14 -121 0 267 182 198 3 -112 -6 129 143 -9 5 19 23 25 60 91 38
2775 38 52 158 135 112 313 75 158 -182 12 216 147 -159 -66 -160 -179 264 264 -181 -15 -140 206 -45 54 -4
2799 -4 -238 183 -129 -324 -250 -308 -119 -286 33 -230 -183 -144 -137 -26 -287 136 23 43 228 129 -177 21 131
2822 131 -78 14 30 -20 -8 -13 155 232 63 60 180 54 66 -21 47 134 179 -105 -132 28 -32 -493 -181 -157 -50 146
2848 146 130 -63 4 -476 -161 227 -167 172 -122 71 266 66 -131 122 87 76 34 -20 93 266 164 -231
2870 -231 -60 34 49 -245 57 124 114 -59 -16 -75 50 -166 -43 -147 -39 161 -209 -161 67 20 -40 -85 36
2893 36 126 -3 -201 -109 106 40 84 -39 23 -147 -21 0 -34 37 166 80 91 306 235 95 105 15 -39 49 26 -197
$$ packed form
2728a75K61k92L58l96J43K26k9p1J23P9n4j57j14K19Kj97J66k81N1K7J8L6j53
2751b10J27k4K38J63o39L59j35J21K67q5J6j95j15J06J35J4j52J4J4MKL5L1n3
2775C8J4J06k3k3K01k38Q3l40J94K04o9l06R3r4j9M43%m45J66j25L46k51R9n8
2799dk34M21l12j95P4n8J89j67L19k63M7L9PJ11k61M23j13K0J85r9l06J98J10
2822A31k09R2J6n0J2nJ68P7j69lJ20j26J2q7O8Q7M5k84k7J60o0m61L12K4J07J96
2848A46j6j93O7m80L15L88l94L39k94J93J95k00j97K53l5j1m2n4J13J73j02l95
2870b31J71R4J5k94L02O7j0j73M3n9J25k16J23j04J08K00l70M8K28m7o0m5J21
2893C6R0j29j98R2K15o6M4j23O2j70J26K1l4P1J29q6J1K15p1j40J0r0n4Q8k3k23
$$ plain form
2919 -197 -35 199 -96 87 -67 -23 -81 36 125 -47 -75 168 122 -188 -153 -210 -245 -112 34 -25 228 104 57
2942 57 -14 -185 -314 24 192 -61 -40 -6 224 -49 149 -68 211 261 9 188 16 6 -10 225 -6 100
2964 100 66 -36 -135 -113 -65 -129 397 88 120 -157 -119 4 76 -127 17 185 -30 60 328 -209 153 -92 -35
2987 -35 -261 274 116 -23 106 -233 277 48 -33 -17 84 44 -74 -90 36 387 -28 -89 66 62 72 -55 107
3010 107 119 216 -28 64 46 140 124 -65 297 -59 -128 -219 -50 -140 -236 -163 8 -60 262 -124 -285 -95 -198 -134
3034 -134 -86 -38 -193 214 96 -169 -188 168 135 58 125 50 -129 56 -40 -149 18 -103 136 -129 184 -221 -69
3057 -69 68 -59 -4 -108 50 46 -1 112 137 213 71 100 -60 -58 -68 -67 119 95 35 -251 248 170 22 -122 73
3082 73 -144 124 -11 -211 222 76 234 98 -154 34 -4 -139 -39 166 341 266 -32 -375 45 82 -212
$$ packed form
2919a97J62K34k95J83j54M4n8J17Q9j72k8K43m6l10L5n7l5J33J46n9K53j24m7
2942E7p1j71j29L38J68k53K1L4K30k73J98k17K79N0k52J79j72j0j6K35k31J06
2964A00l4j02r9K2M8o4N26l09L2k77L8J23P2k03J44J68k15R0K68n37L62k45N7
2987c5k26N35j58j39J29l39N10k29q1J6J01m0j18j6J26L51m15o1J55mJ0j27J62
3010A07J2R7k44R2j8R4j6j89L62l56o9r1J69r0r6P3J71o8L22l86j61J90j03O4
3034a34M8M8j55M07j18k65j9L56l3p7O7p5j79J85r6j09J67j21K39k65L13m05J52
3057f9J37j27N5j04J58mm7J13K5P6j42K9j60Kj0JJ86k4o0k86M99p8j48j44J95
3082G3k17K68j35k00M33j46J58j36k52J88l8j35J00K05J75p5k98l43M20L7k94
$$ plain form
3103 -212 207 19 -63 -145 121 111 7 12 21 31 -32 -484 135 179 -29 148 104 -168 -1 87 52 -113 250 -56
3127 -56 -74 -251 -85 -133 115 62 176 249 -263 -272 117 -5 -189 59 77 -51 242 26 -68 14 163 -153 -88 -84
3151 -84 311 -30 51 143 -27 -29 -50 -270 212 41 223 247 51 20 -217 132 47 -301 112 -94 -104 1 -6 4
3175 4 92 194 117 5 -76 98 -2 -7 25 -55 -68 206 -36 -53 -25 60 -222 -127 -149 149 72 -16 -174 -235 218 62
3201 62 -52 72 154 -74 77 -235 59 -202 -358 -27 314 40 176 10 -168 35 112 131 -15 99 -8
3222 -8 -81 -198 -91 -118 146 76 43 164 -270 9 -248 -302 -137 -128 -392 -107 -55 38 -335 -318 41 -80 -107 -66 -32
3247 -32 184 -36 -5 316 -69 215 303 -83 -18 161 193 75 -30 -28 -94 313 -36 -20 373 -353 18 34 83 -43
3271 -43 11 -63 -16 57 -306 -16 152 -22 74 193 199 -51 -147 -218 192 -59 204 36 -246 -388 -59 -75 22 -165
$$ packed form
3103b12M19j88q2q2K66j0j04NRJ0o3m52O19M4k08J77m4k72J67Q8l5j65L63l06
3127e6j8j77J66m8K48n3J14P3n12rL89j22j84K48J8j28K93k16r4Q2J49l16O5M
3151h4L95l41Q1R2j70kk1k20M82j71J82K4j96l1k37L49q5l48M13k06j0J05pJ0
3175DQ8J02p7j12q1J74j00nL2q0j3K74k42j7K8Q5k82R5k2K98p7q8j58o1M53j56
3201F2j14J24Q2k28J51l12K94k61j56L31L41k74J36j66j78K03P7J9j46J14j07
3222hp3j17J07k7K64p0l3J21m34K79k57n4J65Rk64K85N2R3l73J7L59j21k7M1L4
3247c2K16k20L1L21l85K84Q8l86O5J79L2j18j05Ko6M07l49J6L93p26L71J6M9j26
3271d3N4p4M7P3l63K90J68j74R6J19Ok50r6p1M10k51K63j68k82j42L29j6R7j87
$$ plain form
3295 -165 -95 -117 43 -132 156 50 42 116 75 -132 13 69 -117 77 -226 -121 19 -100 -168 164 -103 -124 -287
3318 -287 -247 -82 194 -224 103 58 -27 196 316 86 92 -268 210 154 -86 102 155 10 -227 74 252 35
3340 35 150 -112 41 -207 257 67 -88 -6 134 -245 -222 -114 -225 -167 194 -116 68 305 8 24 -151 175
3362 175 196 184 274 -77 96 205 -61 82 39 -154 35 110 25 -32 205 109 22 -163 -180 98 -239 -183 114 -112
3386 -112 177 146 41 72 -190 -173 -73 281 -454 128 175 231 251 30 253 -129 86 -87 -54 -41 52 -65 140
3409 140 -215 -89 -68 -112 7 342 162 131 179 -169 38 -105 -67 -59 70 -85 -64 -78 -10 -9 -33 78 -274 -108
3433 -108 152 -80 25 -4 -120 -102 -33 119 -23 -292 -163 135 -59 10 -194 153 -60 -399 183 10 -13 -24
3455 -24 23 -105 203 -86 243 60 -129 69 319 -68 -218 192 248 93 64 242 86 89 158 114 85 -13 -76 -103
$$ packed form
3295a65P0k2J60j75K88j06qP4m1k07J45N6j86J94l03J05J40j19o8L32k67k1j63
3318b87M0J65K76m18L27m5q5K23J20k30Ol60M78n6k40J88N3j45k37L01J78k17
3340C5J15k62J53k48M64j90j55Q2J40l79K3J08j11N8L61l10J84K37k97J6j75L26
3362A75K1j2R0l51J73J09k66J43m3j93J89P5q5n7K37r6q7j85j7K78l37N6K97k26
3386a12K89l1j05L1k62J7J00L54p35N82M7N6K0k21K23l82K15j73L3J3R3j17K05
3409A40l55J26K1m4J19L35j80l1M8l48K07j43L8QJ29j55K1j4O8Jk4J11l52J66
3433a08K60k32J05k9j16J8O9J52j42k69J29K98j94O9k04L47k13l39N82j73k3j1
3455b4M7j28L08k89L29j83j89J98K50l87j50M10N6j55k9J78j56LO9m4k9r8o3k7
$$ plain form
3479 -103 -33 107 -169 -54 235 -39 56 86 58 -23 -74 -174 -6 73 196 -18 -342 -6 -173 35 -225 -141 -86
3502 -86 -4 200 305 -72 -175 -58 -85 195 169 8 46 42 -59 -87 201 -216 344 -398 161 249 76 -115 -188
3525 -188 -149 -426 65 17 -121 -127 -20 -145 307 25 265 -152 103 -65 -43 189 53 -163 -83 72 -174 112
3547 112 65 1 -146 -8 -118 -150 -16 46 20 43 -174 -19 28 266 119 76 110 11 70 33 103 -167 140 -74
3571 -74 -76 196 10 25 -2 62 5 28 449 -32 -107 -17 -204 84 -18 -131 79 -198 54 147 -16 -74 209 -55
3595 -55 119 -73 -27 30 -22 559 16 174 -46 -140 -105 294 -202 11 -222 141 -29 8 220 -101 128 -203
3617 -203 -218 94 66 241 158 111 -55 -234 -259 185 21 133 92 203 16 -31 119 -71 67 90 69 90 -168
3640 -168 46 -32 72 -211 -22 235 9 -99 -352 14 15 -61 43 -1 174 -176 8 35 -220 11 155 224
$$ packed form
3479a03P0J40k76J15K89k74R5L0k8q1n1j00J68P9J23k14l24L36j67K08k60Q4N5
3502h6Q2K04J05l77j03J17k7K80k6j61L8mj01k8K88m17N60p42N59Q8j73j91p3
3525a88L9k77M91m8j38oJ07j25M52k82K40m17K55j68K2K32j36k16Q0J55k46K86
3547A12m7o4j47J38j10l2J34O2k6K3k17J55M7K38j47m3L4r9N9l7P0k70L07k14
3571g4kK72j86J5k7O4n7K3M21m81p5R0j87K88j02j13K10k77K52R3j63n8K83k64
3595e5J74j92M6N7n2N81n43J58k20r4L5L99m96K13k33L63j70L7K12l21K29l31
3617b03j5L12k8J75q3m7j66j79k5M44j64J12m1J11j87m7J50j90J38K3k1K1k58
3640a68K14p8J04k83J89K57k26j08k53L66Jp6J04m4J75l50J84K7k55K31J44O9
$$ plain form
3662 224 -171 72 105 58 -102 73 -210 235 -57 239 78 25 132 278 53 30 -134 172 -49 30 115 224
3684 224 -63 -118 129 -46 27 -94 -91 77 -75 22 -184 -262 3 -15 -57 -72 1 -25 87 115 139 -173 -79 29 124
3709 124 -53 300 152 147 144 -242 -137 56 -7 -180 -1 235 -37 -169 123 231 157 -48 -168 -54 -240 103
3731 103 185 158 86 -269 32 -40 23 27 -2 85 -22 57 -93 195 72 -97 -37 5 101 10 60 178 26 36 25 199
3757 199 21 89 0 -135 61 200 -106 -74 2 -79 -9 192 322 41 22 -159 33 -147 284 75 89 -8 -99
3780 -99 -132 55 178 108 140 -110 118 45 79 62 -159 164 236 260 131 173 131 -317 110 -54 -271 -146 206 -205
3804 -205 98 191 337 -118 94 -26 -81 120 -93 -83 267 -73 -147 52 -3 110 17 -131 222 -270 207 -229
3826 -229 -312 366 155 -16 322 -67 42 -131 -46 216 -64 183 129 -158 -31 -24 282 76 -45 46 -27 -44 235
$$ packed form
3662B24l95K43L3m7j60J75k83M45k92K96j61n3J07J46k25k3j64L06k21P9Q5J09
3684B24k87n5K47j75P3j21LJ68j52R7k06p8K65j8m2j5P3k6J12K8K4l12R4J08R5
3709A24j77L53j48nll86J05J93o3j73J79K36k72j32K92J08p4k05j20J14j86L43
3731A03Q2k7p2l55L01p2O3Mk9Q7j07P9j50K88j23j69O0M2R6r1N0J18j52J0j1J74
3757A99j78O8q9j35J96J39l06L2P6q1P0K01J30k81j9j81J92j80M31k09J4r7r1
3780i9l3J87J23p0L2k50K28p3L4j7k21L23P2K4j29M2m2m48M27j64k17J25L52m11
3804b05L03R3J46m55K12j20n5K01k13J0L50l40p4J99n5J13r3j48L53m92M77m36
3826b29q3O78k11j71L38l89J09j73Q5K62k80K47n4k87J27PL06k06j21R1p3j7K79
$$ plain form
3849 235 -125 -59 311 -15 -165 116 15 264 18 122 -206 -143 -18 25 -178 92 -59 -253 238 42 84
3870 84 -80 92 106 2 -27 186 85 83 20 -7 -133 57 141 -99 -40 69 102 35 -383 21 -28 -124 -47 199 4
3895 4 -107 138 42 -232 214 -21 27 44 -99 499 32 60 -95 -158 289 -92 14 127 139 58 123 4 157
3918 157 -197 92 39 101 144 -108 63 -268 -21 156 -210 -217 12 -102 -209 -224 12 -141 222 -96 13 -41
3940 -41 102 -23 -58 78 -93 51 4 -198 -156 149 -7 132 -65 -85 74 -72 160 21 251 -138 -68 -245
3962 -245 1 -56 58 108 163 -22 29 161 88 -248 -163 54 -85 -184 -92 -139 68 -20 -98 153 345 101 208 89
3986 89 -51 -218 95 256 -279 -119 -142 7 -217 9 -32 -158 -137 -21 1 137 -169 -44 -41 -100 -92 -79 -93 189
4010 189 349 -63 -111 64 46 52 -38 -51 93 59 -83 204 -13 -213 251 184 -222 -161 124 -78 -87 -139 -12 66
$$ packed form
3849B35l60O6L70l26j50K81j01K49k46J04l28O3J25M3k03K70j51j94M91j96M2
3870H4j64J72J4j04k9K13j01ko3k7j26J90Q4k40N9J09L3o7m18M04m9r6P7K46j95
3895Dj11K45r6k74M46k35M8J7j43N98m67K8j55o3M47l81J06J13J2q1O5j19J53
3918A57l54K89n3O2M3k52J71l31K47J77l66pK29j14j07j5K36j53L63l18J09n4
3940d1J43j25l5J36j71J44m7k02M2L05j56J39j97k0J59j46K32j39K30l89P0j77
3962b45K46n7J14N0N5j85N1J32p3l36Q5K17j39r9R2m7K07q8p8K51J92k44J07j19
3986H9j40j67L13J61n35J60k3J49k24K26m1j26K1J16K2J36l06J25Ln9QJ3j4K82
4010A89J60m12m8J75j8Or0j3J44l4j42K87k17k00M64o7m06O1K85k02rn2J27P8
$$ plain form
4034 66 -49 -10 87 -213 -111 18 422 -30 -211 -172 -186 34 -265 -50 -90 336 -73 19 -153 -154 -219 230 178 12
4058 12 -71 -174 182 233 -261 -283 146 69 -20 -105 -157 -64 244 72 59 -16 143 -140 -28 -6 254 28 100 68 258
4083 258 25 -297 51 118 -139 28 -281 -21 -41 93 35 -72 112 326 -96 -5 105 233 186 -23 56 17
4105 17 32 15 -364 -40 11 -27 237 -251 6 38 166 149 -19 -150 182 -46 78 14 -135 87 -1 114 31
4128 31 -3 -82 -11 219 282 193 -60 185 102 -137 -167 382 -226 121 -156 -141 -115 225 264 -55 80 -8 -86 6 -55
4153 -55 90 251 -82 -209 91 26 204 158 16 155 -114 -12 79 -34 119 256 101 77 -17 93 183 -41
4175 -41 -270 96 -83 -46 -3 -84 23 -170 -227 104 79 143 271 36 33 -106 -157 -122 19 175 101 -27 -105 -112 -207
4200 -207 35 -8 22 -256 -224 79 281 -151 150 -32 -24 -25 -122 133 -189 -102 -168 -113 0 99 -9 -112 76 -42
$$ packed form
4034F6j15L9R7l00J02J29M04m52j81L9j4K20k99K15m0M26m09R2j72jo5M49n2j66
4058A2q3j03L56N1m94k2M29p7q9q5n2R3L08j72j3p5J59k83J12K2K60k26P2l2J90
4083B58k33l22L48O7k57J67l09K60k0J34n8j07J84K14m22R1J10J28m7k09P9l9
4105A7J5j7l79L24N1l8K64m88K57L2J28j7j68j31L32k28J24o4j49K22q8J15q3
4128C1l4p9P1K30O3q9k53K45q3k39l0N49o08L47k77J5K6L40L9l19J35q8p8R2o1
4153e5J45J61l33j27L00o5J78m6j42J39k69J02R1j13J53J37j55k4r4J10R0k24
4175d1k29L66j79L7M3q1J07j93n7L31k5O4J28k35lj39n1L5J41J56p4j28p8pr5
4200b07K42m3L0k78L2L03K02m32L01j82Qjr7K55l22Q7o6N5J13R9j08j03J88j18
$$ plain form
4224 -42 183 -186 -108 134 208 -14 -126 219 -21 -140 309 -20 -57 -6 -61 -41 -114 25 -103 -103 -68 -76 -104 72 -55
4249 -55 -113 -65 -72 -113 209 -97 147 134 -7 -61 204 49 102 79 151 -297 -206 36 190 -60 -55 264 220 191 -285
4274 -285 10 293 65 282 155 -110 152 99 192 -71 91 -33 7 -17 -229 -229 137 -111 11 76 -77 7 -299
4297 -299 5 -5 26 -156 171 -108 -166 -71 47 -152 -290 109 -90 188 -205 90 -283 -143 -61 -101 262 -33
4319 -33 -274 -139 180 108 -56 293 -51 293 209 126 -55 156 -63 68 -3 -20 -35 245 -133 -60 258 46 165
4342 165 -71 60 34 96 80 -205 132 -76 -59 -270 163 103 -225 66 6 49 -14 247 -27 177 -19 1 -20
4365 -20 -166 -72 -253 8 -4 -25 -63 -281 -8 -112 -252 288 1 68 209 125 -131 36 0 -33 82 14 97 -278
4389 -278 52 -199 140 -25 146 -14 184 -7 -40 -193 144 -34 107 23 110 216 25 5 50 75 10 -5 -219
$$ packed form
4224d2K25l69P8K42P4k22j12L45k40j19M49l29l7N1n5K0p3J39j28%L5qk8J76j27
4249e5n8M8pm1L22l06K44j3j41n4K65j55N3k3P2m48R1K42J54k50NL19m4k9m76
4274b85K95K83k28K17j27k65K62n3R3k63J62j24M0k4k12%L66k48J22O5j53Q4l06
4297b99L04j0L1j82L27k79n8R5J18j99j38L99j99K78l93K95l73J40Q2m0L63k95
4319c3k41J35L19p2j64L49l44L44q4q3j81K11k19J31p1j7j5K80l78P3L18k12J19
4342A65k36J31k6O2j6k85L37k08J7k11M33o0l28K91o0M3o3K61k74K04j96K0k1
4365b0j46R4j81K61j2k1l8k18K73j04j40N40k87O7J41q4k56J67l6l3J15o8Q3l75
4389b78L30k51L39j65J71j60J98j91l3j53L37j78J41q4Q7J06j91k0M5K5o5j5k14
$$ [...]
8191H0
##END NTUPLES=NMR FID
##END=
