##TITLE=1H_DE-80H_X3
 200.13MHz, d2o
 8 sc
 
 19ns.26.2.2025
##JCAMPDX= 6.0         $$ Bruker NMR JCAMP-DX V2.0
##DATA TYPE= NMR FID
##DATA CLASS= NTUPLES
##ORIGIN= UXNMR, Bruker Analytische Messtechnik GmbH
##OWNER= pz
$$ XWIN-NMR		Version 3.5
$$ Tue Jul 29 11:22:48 2025 Russian Standard Time (UT+4h)  Yarkov@DPX200
##.OBSERVE FREQUENCY= 200.1313
##.OBSERVE NUCLEUS= ^1H
##.DELAY= (6, 6)
##.ACQUISITION MODE= SIMULTANEOUS
##.ACQUISITION SCHEME= undefined
##.AVERAGES= 8
##.DIGITISER RES= 18
##SPECTROMETER/DATA SYSTEM= spect
##.PULSE SEQUENCE= zg30
##.SOLVENT NAME= CDCl3
##.SHIFT REFERENCE= (INTERNAL, CDCl3, 0, 14.3821)
##AUDIT TRAIL= $$ (NUMBER, WHEN, WHO, WHERE, WHAT)
$$ ##TITLE= Audit trail, XWIN-NMR		Version 3.5
$$ ##JCAMPDX= 5.01
$$ ##ORIGIN= Bruker BioSpin GmbH
$$ ##OWNER= Yarkov
$$ C:/Bruker/XWIN-NMR/data/yarkov2/nmr/H-C/1/audita.txt
$$ ##AUDIT TRAIL=  $$ (NUMBER, WHEN, WHO, WHERE, WHAT)
(   1,<2025-07-29 11:21:40.64 +0400>,<Yarkov>,<DPX200>,
      <created by zg, POWCHK disabled, PULCHK disabled
       configuration hash MD5:
       00 E9 B6 7A A2 85 ED C7 34 08 36 98 17 FE 4E 26
       data hash MD5: 16K
       AF DC 69 2E B4 76 C8 F5 58 80 52 51 1E FE C4 BA>)
$$ ##END=
$$ 
$$ hash MD5
$$ D9 D7 F7 48 2F FF A3 08 FC 16 97 80 47 B8 A5 12
##$RELAX= 
##$RELAX= 
##$RELAX= 
##$RELAX= 
##$RELAX= 
##$RELAX= 
$$ Bruker specific parameters
$$ --------------------------
##$DU= <C:/Bruker/XWIN-NMR>
##$EXPNO= 1
##$NAME= <H-C>
##$PROCNO= 1
##$TYPE= <nmr>
##$USER= <yarkov2>
##$AMP= (0..31)
100 100 100 100 100 100 100 100 100 100 100 100 100 100 100 100 100 100 
100 100 100 100 100 100 100 100 100 100 100 100 100 100 
##$AQSEQ= 0
##$AQ_mod= 1
##$AUNM= <au_zg>
##$AUTOPOS= <>
##$BF1= 200.13
##$BF2= 200.13
##$BF3= 200.13
##$BF4= 200.13
##$BF5= 200.13
##$BF6= 200.13
##$BF7= 200.13
##$BF8= 200.13
##$BYTORDA= 1
##$CFDGTYP= 0
##$CFRGTYP= 5
##$CHEMSTR= <none>
##$CNST= (0..31)
1 1 145 1 1 1 1 1 1 1 1 1 1 1 1 1 1 1 1 1 1 1 1 1 1 1 1 1 1 1 1 1 
##$CPDPRG= <>
##$CPDPRG1= <>
##$CPDPRG2= <>
##$CPDPRG3= <>
##$CPDPRG4= <mlev>
##$CPDPRG5= <mlev>
##$CPDPRG6= <mlev>
##$CPDPRG7= <mlev>
##$CPDPRG8= <mlev>
##$CPDPRGB= <>
##$CPDPRGT= <>
##$D= (0..31)
0 0.7 0 0 0 0 0 0 0 0 0 0.03 0 0 0 0 0 0 0 0 0 0 0 0 0 0 0 0 0 0 0 0 
##$DATE= 1753773700
##$DBL= (0..7)
120 120 120 120 120 120 120 120 
##$DBP= (0..7)
150 150 150 150 150 150 150 150 
##$DBP07= 0
##$DBPNAM0= <>
##$DBPNAM1= <>
##$DBPNAM2= <>
##$DBPNAM3= <>
##$DBPNAM4= <>
##$DBPNAM5= <>
##$DBPNAM6= <>
##$DBPNAM7= <>
##$DBPOAL= (0..7)
0.5 0.5 0.5 0.5 0.5 0.5 0.5 0.5 
##$DBPOFFS= (0..7)
0 0 0 0 0 0 0 0 
##$DE= 6
##$DECBNUC= <off>
##$DECIM= 32
##$DECNUC= <off>
##$DECSTAT= 4
##$DIGMOD= 1
##$DIGTYP= 9
##$DL= (0..7)
0 120 120 120 120 120 120 120 
##$DP= (0..7)
150 150 150 150 150 150 150 150 
##$DP07= 0
##$DPNAME0= <>
##$DPNAME1= <>
##$DPNAME2= <>
##$DPNAME3= <>
##$DPNAME4= <>
##$DPNAME5= <>
##$DPNAME6= <>
##$DPNAME7= <>
##$DPOAL= (0..7)
0.5 0.5 0.5 0.5 0.5 0.5 0.5 0.5 
##$DPOFFS= (0..7)
0 0 0 0 0 0 0 0 
##$DQDMODE= 0
##$DR= 18
##$DS= 0
$$ [...]
##$SUBNAM2= <"">
##$SUBNAM3= <"">
##$SUBNAM4= <"">
##$SUBNAM5= <"">
##$SUBNAM6= <"">
##$SUBNAM7= <"">
##$SUBNAM8= <"">
##$SUBNAM9= <"">
##$SW= 18.0517328524113
##$SWIBOX= (0..15)
0 0 2 0 0 0 0 0 0 0 0 0 0 0 0 0 
##$SW_h= 3612.71676300578
##$TD= 16384
##$TD0= 1
##$TE= 0
##$TE2= 300
##$TE3= 300
##$TEG= 300
##$TL= (0..7)
0 120 120 120 120 120 120 120 
##$TP= (0..7)
150 150 150 150 150 150 150 150 
##$TP07= 0
##$TPNAME0= <>
##$TPNAME1= <>
##$TPNAME2= <>
##$TPNAME3= <>
##$TPNAME4= <>
##$TPNAME5= <>
##$TPNAME6= <>
##$TPNAME7= <>
##$TPOAL= (0..7)
0.5 0.5 0.5 0.5 0.5 0.5 0.5 0.5 
##$TPOFFS= (0..7)
0 0 0 0 0 0 0 0 
##$TUNHIN= 0
##$TUNHOUT= 0
##$TUNXOUT= 0
##$USERA1= <user>
##$USERA2= <user>
##$USERA3= <user>
##$USERA4= <user>
##$USERA5= <user>
##$V9= 5
##$VALIST= <valist>
##$VCLIST= <CCCCCCCCCCCCCCC>
##$VD= 0
##$VDLIST= <DDDDDDDDDDDDDDD>
##$VPLIST= <PPPPPPPPPPPPPPP>
##$VTLIST= <TTTTTTTTTTTTTTT>
##$WBST= 1024
##$WBSW= 4
##$XGAIN= (0..3)
0 0 0 0 
##$XL= 0
##$YL= 0
##$YMAX_a= 71192
##$YMIN_a= -88438
##$ZGOPTNS= <>
##$ZL1= 120
##$ZL2= 120
##$ZL3= 120
##$ZL4= 120
##$ABSF1= 10
##$ABSF2= 0
##$ABSG= 5
##$ABSL= 3
##$ALPHA= 0
##$AQORDER= 0
##$ASSFAC= 0
##$ASSFACI= 0
##$ASSFACX= 0
##$ASSWID= 0
##$AUNMP= <proc_1d>
##$AZFE= 0.1
##$AZFW= 0.1
##$BCFW= 1
##$BC_mod= 2
##$BYTORDP= 1
##$COROFFS= 0
##$CY= 83.5205535888672
##$DATMOD= 1
##$DC= 2
##$DFILT= <>
##$DTYPP= 0
##$F1P= 10.8118882576601
##$F2P= -7.23987719738617
##$FCOR= 0.5
##$FTSIZE= 0
##$FT_mod= 4
##$GAMMA= 1
##$GB= 0.15
##$INTBC= 1
##$INTSCL= 1
##$ISEN= 128
##$LB= 0.25
##$LEV0= 0
##$LPBIN= 0
##$MAXI= 10000
##$MC2= 0
##$MEAN= 0
##$ME_mod= 0
##$MI= 1.114404
##$NCOEF= 0
##$NC_proc= 0
##$NLEV= 6
##$NOISF1= 3.799351
##$NOISF2= 2.8
##$NSP= 1
##$NTH_PI= 0
##$NZP= 0
##$OFFSET= 14.38212
##$PC= 1
##$PHC0= -1360.197
##$PHC1= 16.59091
##$PH_mod= 1
##$PKNL= yes
##$PPARMOD= 0
##$PSCAL= 0
##$PSIGN= 0
##$REVERSE= no
##$SF= 200.129724274929
##$SI= 16384
##$SIGF1= 3
##$SIGF2= 2
##$SINO= 400
##$SIOLD= 16384
##$SREGLST= <1H.CDCl3>
##$SSB= 0
##$STSI= 0
##$STSR= 0
##$SW_p= 3205.1282051282
##$SYMM= 0
##$S_DEV= 0
##$TDeff= 0
##$TDoff= 0
##$TI= <>
##$TILT= no
##$TM1= 0
##$TM2= 0
##$TOPLEV= 0
##$USERP1= <user>
##$USERP2= <user>
##$USERP3= <user>
##$USERP4= <user>
##$USERP5= <user>
##$WDW= 1
##$XDIM= 8192
##$YMAX_p= 0
##$YMIN_p= 0
$$ End of Bruker specific parameters
$$ ---------------------------------
##NTUPLES= NMR FID
##VAR_NAME=  TIME,          FID/REAL,        FID/IMAG
##SYMBOL=    X,             R,               I
##VAR_TYPE=  INDEPENDENT,   DEPENDENT,       DEPENDENT
##VAR_FORM=  AFFN,          ASDF,            ASDF
##VAR_DIM=   8192,          8192,            8192
##UNITS=     SECONDS,       ARBITRARY UNITS, ARBITRARY UNITS
##FACTOR=    0.0002768,     1,               1
##FIRST=     0,             0,               0
##LAST=      2.2672688,     0,               0
##MIN=       0,             -88438,          0
##MAX=       2.2672688,     71192,           0
$$ Real data points
##PAGE= N=1
##DATA TABLE= (X++(R..R)), XYDATA
0 0 0 0 0 0 0 0 0 0 0 0 0 0 0 0 0 0 0 0 0 0 0 0 0 0 0 0 0 0 0 0 0 0 0 -1 2 -3 4 -5 5 -6 6 -6 7 -8 9 -11 12 -13 14 -16 18
51 18 -19 20 -23 24 -27 31 -32 36 -37 37 -40 40 -36 26 -1 -61 224 -815 6274 32828 -29926 -37155 42621
74 42621 12489 -67276 -32334 30364 12815 -10265 -9590 -19881 348 47942 29645 -25586 -12094
87 -12094 34724 30734 -1241 -17013 -17693 -11309 -519 442 -18389 -31289 -4671 25334 9976
100 9976 -13722 -3069 12807 16067 21186 9995 -19888 -12601 25123 15931 -22872 -19011 282
113 282 -3487 1736 6814 -17412 -21119 15063 22473 -7375 -12308 5823 7698 5757 9326 -1068
127 -1068 -9625 5751 14944 -327 -11511 -6959 -2715 -2096 -1585 -5330 -10109 -3220 10628 8818 -5309
142 -5309 -3806 10735 11895 1995 -779 -739 -3323 1640 5224 -7600 -14746 -581 5432 -4807 -4552
157 -4552 1591 -1783 1250 10988 4569 -6658 692 10044 2380 -4496 -1183 -1576 -2104 3644 950
172 950 -8487 -5787 3230 2297 -2425 -2025 -485 52 3596 5839 636 -3182 2409 5564 585 -2502
188 -2502 -604 -1137 -2612 -310 -16 -4653 -4099 2087 1350 -2814 893 3855 215 1500 5166 1658
204 1658 -1722 1552 2049 -2955 -2774 900 -1672 -4325 -670 601 -1835 -225 1584 -765 -208 3342
220 3342 2852 -323 -5 2026 845 -237 717 -1002 -3374 -772 1727 -1264 -3210 -747 673 -396
236 -396 339 1120 -1060 -925 3208 3022 -873 -387 1710 471 -138 651 -1215 -3209 -720 1354 -1308
253 -1308 -2556 -250 699 -287 1194 1415 -504 199 2473 1596 -445 -14 346 -664 -592 206 -1286 -2137
271 -2137 48 767 -973 -730 1063 517 -256 789 1026 -431 -41 1485 386 -910 298 788 -755
288 -755 -565 164 -508 -1075 291 298 -1003 -469 992 399 -318 512 722 -224 522 916 -149 -772 187 240
308 240 -717 -646 -223 -744 -645 766 291 -600 155 1199 261 1 702 73 -517 59 646 -499 -928 26
328 26 22 -593 -22 161 -581 -119 653 450 -453 62 545 88 28 485 -138 -709 11 419 -561 -552 -32 -185
350 -185 -357 96 243 -414 -243 647 461 -31 297 238 -267 285 381 -333 -807 -131 216 -275 -293 186 -424
371 -424 -411 413 407 -113 -52 411 395 1 209 -104 -377 55 404 -193 -542 -201 -75 -226 64 112 -289 -205 456
394 456 452 -78 15 246 96 28 394 -15 -268 -66 186 -243 -354 -18 -2 -311 27 107 -65 -159 270 130 -14
417 -14 74 126 -31 -6 134 67 -218 -83 23 -209 -169 29 -144 -44 29 209 -77 51 189 189 -53 103 196 1
441 1 19 33 -148 -138 -2 134 -269 6 115 -29 -67 97 137 -149 87 216 61 -111 -4 54 -47 -86 -5 -92
465 -92 -69 7 82 -128 -66 138 69 68 149 9 -162 74 173 -15 -35 56 -31 27 0 85 -95 -72 -52 70 -96 -50 45
492 45 -70 36 102 16 -53 112 157 0 -66 -16 9 16 -32 88 -153 -112 24 99 -87 6 135 -96 78 181 53
517 53 -77 -36 -54 3 77 1 -40 -53 17 120 -9 -131 65 14 46 -43 -129 -34 9 54 -8 25 -65 -45 -27 6 87 -5
545 -5 -115 44 17 19 -41 13 36 -51 49 -56 -54 -57 96 -26 -96 -41 9 -26 -42 91 -40 66 53 -79 -162 -12 126
572 126 -59 -7 36 0 -16 97 -45 -61 8 -1 37 1 94 -71 -111 49 -15 -6 -83 -10 113 68 8 -31 31 34 9 -2 -83
601 -83 17 -45 62 -143 109 19 63 -101 40 12 42 6 -11 -14 -1 47 -127 -85 -84 -17 28 72 0 80 14 -72 -61 40
629 40 -99 95 -81 -61 11 18 16 -50 -19 -9 -44 -63 102 -8 66 61 54 -45 93 74 42 1 119 -16 -6 7 123 -41
657 -41 16 30 -45 -19 -32 34 -38 -13 12 -25 -77 -163 -54 -8 -77 28 118 74 38 -132 -100 49 110 20 36 2 26 77 38
686 38 66 24 -9 43 -128 14 87 -26 -9 12 69 -94 -17 -26 37 40 -11 86 -86 7 21 -73 -15 -30 -12 -123 -15 8
714 8 -23 -17 57 -39 31 76 -49 63 33 34 49 71 13 -53 -35 106 -70 40 89 94 47 12 -41 -29 -58 33 23 -56 43 -10
744 -10 11 -56 114 -53 -57 85 56 -119 -6 -28 -35 121 -26 38 53 -90 -18 -22 9 81 39 -36 60 128 50 55 86 -10 -3
773 -3 -37 -13 29 19 30 9 66 90 -4 -24 -46 -97 96 1 47 -3 -8 39 -62 -52 3 41 55 -101 64 -9 -87 99 -20
802 -20 91 -53 -47 12 99 -43 -38 -35 -52 17 9 -101 5 30 26 34 -70 39 76 -9 17 11 -10 -12 -92 80 7 -106 -87 -28
832 -28 26 33 72 -8 26 54 -37 -24 -32 -74 -22 -123 19 -41 37 -11 10 77 -4 -31 -21 -90 -45 113 -104 17 -63 -45 -42 39
862 39 -54 46 -45 52 -73 65 7 23 9 -48 15 84 41 -6 64 -47 -12 -18 -46 20 -43 2 72 -12 102 32 -103 -53
890 -53 -102 7 -1 -134 -97 24 24 -68 -69 -96 108 7 19 65 -22 -35 78 46 37 -56 -20 26 -22 27 -46 93 0 -6 37 -98
920 -98 45 -39 -1 31 5 4 -144 -62 -18 37 90 -33 15 -46 1 -3 -25 -107 8 -53 -56 85 54 16 52 21 -73 -42 -65 88
950 88 -33 76 -58 -18 -20 -88 12 112 -55 39 -61 -61 -136 18 55 1 59 -46 -8 -91 50 76 -12 -27 93 -25
976 -25 -48 27 72 26 -21 -9 -19 4 -53 6 -79 -122 7 72 10 -42 20 -6 15 88 26 129 21 -15 -18 54 -40 41 30 31
1006 31 25 -72 16 -8 61 44 144 -110 -52 -121 -48 -40 26 12 -70 -75 17 -86 8 89 -41 -112 -52 -87 -82 -3 31 63 -2 83
1036 83 -5 29 -55 24 18 31 -9 -8 143 -41 -31 52 -74 33 -46 -52 -61 -29 -14 40 -50 24 23 -61 11 -24 -4 -31 -51 -42 -22
1067 -22 102 -74 -27 3 33 63 -58 8 18 46 40 17 -23 42 -56 -9 82 -64 11 75 -11 9 -2 -7 -33 30 -25 -59 -30
1096 -30 1 -91 11 -48 -42 -18 -15 -32 -67 -4 -29 -12 16 -28 34 -91 -13 5 -1 51 99 13 14 57 77 36 5 -46 -16 32 27 23
1128 23 -1 -24 -15 -11 -53 -23 -11 22 11 65 15 -34 15 -33 22 62 7 66 99 9 -14 22 41 6 -76 79 -14 53 -20 -2 51
1159 51 95 85 -118 43 -5 -70 -15 61 -118 -92 -61 -36 -41 16 -106 -56 47 -117 -31 -66 -19 -104 -2 -39 -85 47 -85
1186 -85 -99 -49 -110 8 -7 7 51 85 -9 -63 -3 42 11 -46 111 54 139 -72 9 -25 -55 40 -86 143 78 33 -84
1213 -84 -104 52 -45 -50 -23 47 61 70 -26 -73 -80 -64 -78 -12 -129 -24 83 55 17 7 -7 76 -45 -115 -2 -27 -22 7 -8
1242 -8 -102 67 90 -1 9 -113 -78 40 43 -145 -76 -45 67 -72 72 41 40 -86 7 -39 119 -43 -98 -86 -5 -12 90
1269 90 42 -99 -67 -31 -102 19 123 53 36 40 -63 69 44 -26 97 41 13 41 64 58 -19 -96 73 40 26 86 1 72
1297 72 -24 -89 -79 -52 -129 76 -53 43 -93 92 -66 16 -67 -38 -8 -59 100 -47 26 -60 6 -20 -6 28 33 -109 47
1324 47 19 0 -93 -69 -74 -28 56 78 1 29 -9 66 -8 41 15 113 -74 -13 -69 35 44 13 47 -5 14 -3 20 46 -19 96
1354 96 -12 9 61 29 57 28 -104 -50 -22 67 11 5 -16 51 41 -19 -2 5 -64 21 -17 68 124 77 157 97 25 -8 -27 -86
1384 -86 -54 -35 45 21 33 -51 -24 69 -56 83 -105 -66 -84 -22 -80 -11 -59 -83 9 43 -22 -23 53 -61 74 95 7 4 7
1413 7 22 17 -86 -65 -70 7 62 133 -33 -21 -15 -93 -5 4 -66 60 -16 -45 44 -11 -39 107 -117 -37 28 -6 4 6 -23 -27 -41
1444 -41 6 -32 29 124 83 33 80 73 68 24 -13 63 26 48 -100 -34 81 36 92 43 46 78 107 61 -27 -60 -32 64 39 66 4
1475 4 9 -54 -11 -78 87 -10 29 -42 -22 -70 -47 -17 51 42 -74 -73 37 -60 -9 133 -55 27 -92 15 15 13 5 -59 93 -43
1505 -43 23 10 -24 -15 20 -3 -35 -12 -1 -57 63 92 1 26 -57 11 -71 31 -47 -88 -61 35 -34 40 -13 -36 -5 -7 117 45
1535 45 41 144 1 18 25 -24 -35 -55 -38 -41 8 -96 51 80 74 -29 11 -86 52 16 19 25 9 -1 -22 4 13 -59 43 -76
1565 -76 45 51 77 -8 78 2 28 21 37 -52 34 -132 60 -16 -93 -54 -47 10 86 -43 0 24 20 9 88 42 -39 30 -34 -31 -56
1596 -56 82 -23 -23 67 -113 -31 -75 43 -39 -122 70 10 -18 -1 -129 103 -43 -13 13 -137 -20 20 4 81 -51
1621 -51 71 -64 70 0 75 30 87 12 -59 -102 26 41 -11 -58 -11 114 22 -28 -1 -56 -64 117 3 1 44 135 -23
1648 -23 9 -63 -96 80 -123 -136 42 -38 12 -101 52 48 5 54 -57 51 -65 24 -53 -4 39 45 -36 43 40 26 39 96
1676 96 25 77 -18 55 130 -6 -23 10 -53 -88 -37 57 30 -89 -5 15 58 30 39 41 9 107 -23 -141 7 -2 -7 14 65 84
1706 84 169 5 -85 29 44 80 115 -95 113 -1 17 32 -52 60 12 25 5 -41 -14 -10 97 -1 31 -22 -57 45 -122
1733 -122 -55 -31 4 10 90 22 -14 -38 61 4 37 18 4 106 -99 -4 65 18 91 -3 -27 126 -3 83 48 0 -57 29
1761 29 -39 62 26 -76 -80 -5 -2 28 -12 35 -16 -198 149 -103 -31 -47 -136 25 -100 19 -41 -13 47 6 14 62 -10 -21
1789 -21 49 -18 -52 -28 -52 0 -39 130 29 23 -71 -65 14 -35 83 -52 -27 8 -18 45 11 -2 44 23 -7 -74 37 -94
1817 -94 -85 -50 -9 -82 -46 1 166 -25 -96 0 -55 -33 -87 109 -49 -22 11 22 15 -18 -27 30 21 65 -42 27 63 -38 13
1846 13 76 48 10 -64 11 -33 58 -103 48 -47 -43 -36 -23 41 -43 109 -9 65 1 52 30 -9 -7 -22 -5 17 25 -100 98
1875 98 -34 -11 -33 193 92 66 -48 60 94 98 -32 -38 23 -97 -65 21 8 18 -52 -43 -28 31 -58 -6 -66 -199 -44
1902 -44 -22 -3 30 -37 83 107 -81 120 -90 82 99 -102 -6 -66 70 78 65 68 -37 14 -68 -32 39 -21 -93 20 46
1929 46 -44 42 26 41 29 42 -9 -56 12 62 -80 14 90 -51 80 -84 33 -17 0 23 51 -18 86 -166 12 -50
1955 -50 -68 -42 53 74 -9 48 -65 10 -22 -14 60 0 67 -13 -152 22 113 7 -17 -6 -1 99 -27 -55 54 -39 -9 -10
1983 -10 -22 -80 -15 -121 -3 8 25 -32 -3 38 29 55 -29 47 -24 -15 87 -60 -64 -26 43 -1 -72 -25 78 97 -20 11 -124
2012 -124 -106 -69 -53 2 80 -30 -67 52 0 -123 -66 -100 36 86 -89 -12 40 -22 -41 -28 25 21 -8 -11 13 -21 -27 17 -97
2041 -97 -10 -24 18 -55 48 70 -112 -67 37 -97 -44 -2 55 8 69 -9 67 10 0 38 -90 89 -51 48 5 -66 136
2068 136 -62 -141 -142 63 -34 41 -77 -47 -89 -66 -12 -69 -43 -28 -37 -80 -7 60 24 -18 -5 82 18 116 57 59 10 95 17 21
2098 21 -64 17 -49 10 63 -34 -26 125 43 37 -55 20 -28 -53 -58 -70 15 -30 -1 -12 -33 0 135 -55 -77 -39 64 -18 31 -3
2128 -3 -13 10 56 -44 28 -38 94 -42 6 22 -38 -11 -48 22 171 25 -11 20 -3 -10 -138 8 -37 -259 -48 -26 15
2155 15 -75 -104 14 -22 37 -18 -88 53 -135 46 29 -89 -28 20 -18 85 -10 49 140 63 100 -57 29 46 19 -49 79
2182 79 123 -135 -24 8 -12 -102 160 37 31 5 39 -15 -40 -29 112 57 23 101 -46 27 9 -33 -55 28 44 -70 -74 -68
2210 -68 -40 -123 2 67 -58 -38 5 97 72 89 86 14 88 -31 123 12 -55 13 -82 -19 54 -105 -134 -31 -69 38 21
2237 21 -49 97 96 -52 -76 62 30 -84 -45 -48 15 13 -1 -21 -8 -49 -4 -45 2 118 -103 36 152 -26 114 -27
2263 -27 94 -54 -25 70 -54 17 -37 -4 -5 69 50 14 -65 -80 -52 -125 -103 125 -69 66 -22 51 82 26 -76 -24 108
2290 108 40 -15 102 37 -20 72 -13 -17 1 -50 23 -60 18 -16 7 -24 35 -33 15 70 54 -12 108 -24 18 -39 -18 31 -25
2319 -25 -47 -58 -13 43 -19 112 -35 -85 6 -3 -48 -147 34 -39 25 6 -5 59 -13 -150 -16 -46 -7 95 11 32 -70
2346 -70 -19 70 103 8 -24 14 -66 -2 58 -27 58 -87 -28 -25 -52 3 75 -151 61 -28 -48 1 103 -40 -97 5 81 46
2374 46 88 -32 -70 -54 12 25 -90 -64 -10 -10 1 37 85 -25 20 9 27 -63 47 144 -27 75 8 -46 35 27 -65 55
2402 55 7 44 -21 47 17 -61 -79 46 8 -18 -48 61 -74 78 1 31 -63 70 33 -38 64 -57 -31 80 88 62 34
2429 34 -141 -55 -92 37 90 31 -80 -4 1 9 -12 -43 2 6 -45 -18 -58 33 -40 9 -35 -66 -33 6 1 56 7 -32 -58 -12 27
2460 27 37 -22 -56 81 131 36 13 -32 46 40 80 117 -17 -3 -42 78 124 36 -40 -20 -69 80 125 98 -19 -35 -33 -6 -76
2489 -76 32 56 83 -16 -20 43 -77 -42 56 -103 110 -102 45 132 -87 -42 49 -55 33 40 50 -12 52 71 56 -17 40
2516 40 -34 2 32 -69 -32 55 -15 48 8 13 -45 -4 38 -33 -29 107 -95 -48 54 77 -99 -34 53 32 -16 -168 70 24
2544 24 -102 -138 -28 -10 71 -82 37 24 -39 95 59 32 -25 59 -3 27 -16 29 54 39 -7 194 39 -13 5 17 -52
2571 -52 -33 61 -48 -45 13 53 15 13 54 -42 -69 24 -10 39 -35 85 60 -29 35 -64 51 37 -47 73 83 22 30 23 -88 -3
2601 -3 15 87 -5 -38 -88 58 -104 -9 23 42 39 19 -77 32 -37 -87 51 34 -8 -13 43 97 27 27 29 15 -19 41 40 -17 -70
2632 -70 7 -51 -9 -121 95 89 0 -43 57 -7 -35 70 56 19 -21 -26 -19 25 2 -118 -106 76 61 49 35 -37 -80 114
2660 114 160 -25 -8 -65 141 -26 -48 50 20 -52 -32 29 -50 23 -53 -26 54 -67 -39 -24 -41 31 78 -6 -71 -6 16 4
2688 4 -43 19 77 18 -1 9 44 64 0 83 57 -11 94 52 -4 -209 -43 38 -109 -42 -5 26 -38 -82 34 -12 67 -28
2716 -28 -113 -86 -83 -19 -42 -74 -19 80 46 1 47 -87 10 63 83 94 -92 102 -45 -73 43 63 -54 -54 82 -69 86
2743 86 -64 -53 44 -65 -20 86 -23 -36 -48 33 -45 -97 35 -24 31 -34 37 107 -9 -98 72 49 109 49 -41 -5 -15
2770 -15 -25 86 38 -29 -34 0 -7 -47 42 22 91 59 -12 8 -26 71 -62 11 63 -99 -121 -68 -22 123 79 -12 72 -5 -47
2799 -47 -68 20 -82 -3 -32 -18 -32 -69 110 -38 65 -25 -10 47 18 13 28 -67 -75 64 -89 32 -76 -88 -61 -39 -75
2826 -75 34 -7 -93 -28 -25 -51 85 23 20 0 48 -52 11 -55 -21 56 15 28 75 -11 -56 -34 26 47 -8 -72 55 41 -72
2855 -72 121 -35 51 -80 20 57 -71 57 -61 54 -45 -55 74 -62 40 32 53 49 20 -22 37 24 -25 24 -109
2880 -109 -79 -23 -8 -112 -29 -3 -35 62 -8 21 -29 -60 44 -5 64 43 45 -25 -32 116 -54 5 78 36 73 88 97 43 -31
2909 -31 -76 3 -4 60 77 4 101 -20 -97 30 38 17 7 99 -13 108 -2 39 -96 -57 -43 -110 32 -52 -50 67 -47
2936 -47 -4 -53 -34 -14 10 13 -26 95 -12 100 3 7 -48 -58 95 -49 32 -88 13 13 -59 -27 -144 -68 -4 -37 -13 105
2964 105 22 -121 -76 -96 78 -113 47 -113 22 72 39 83 139 5 71 -17 53 96 38 45 77 -17 11 -28 44 -60
2990 -60 22 56 -17 49 14 86 -50 24 -89 -98 20 78 41 27 -23 -71 -42 75 -59 53 -52 150 35 -37 0 40
3016 40 66 -9 -64 51 43 93 -24 -5 133 -15 60 8 23 56 30 -33 20 81 -13 31 -164 -19 36 66 -50 82 -141
3043 -141 108 -60 31 -33 -33 6 -109 50 -100 -3 61 -33 -107 -45 -53 27 72 24 21 25 -42 24 -26 29 -11 45 -31 49 34
3072 34 -11 17 0 34 54 33 -107 74 44 54 3 -83 -38 -104 -87 -66 -98 3 -169 11 -6 -122 -51 15 64 -74 -56
3099 -56 -45 -27 45 -60 104 -105 53 -54 0 38 82 38 -65 15 -18 -67 33 55 -1 46 -73 -39 -48 26 2 -25 -44
3126 -44 21 -42 -12 -55 -42 -55 38 -90 3 -17 151 118 66 -139 37 77 -48 -73 -28 31 -19 9 12 11 123 54 -51 -7
3154 -7 16 -133 16 23 -8 49 31 -21 37 88 -16 -37 36 61 -31 -27 -143 -49 -33 -125 -18 -13 51 42 -75 87 -90 -61 -2
3183 -2 65 14 84 194 -22 -31 -43 -8 8 -2 -35 -42 -31 59 28 83 16 -15 -73 38 -33 -115 -18 50 19 -40 103 29 -1 -11
3213 -11 -93 64 -46 -20 40 55 -74 22 4 -32 72 51 3 40 42 -7 42 -77 62 -8 -20 -51 -26 15 29 46 -40 74
3241 74 -40 49 -2 43 -65 6 79 36 115 -122 6 71 -67 6 56 15 -47 -19 -76 42 -15 -33 -43 -88 14 -40 3
3268 3 -66 -32 -24 53 66 -70 -13 11 -33 -25 119 5 20 103 52 83 2 112 -19 50 39 170 -66 12 -37 -88 -67 -60 34
3297 34 -55 14 -34 117 -62 50 0 -87 41 -24 14 -115 -60 -94 71 64 -19 -68 -26 -4 4 66 -16 -35 -142 64 30
3324 30 -84 4 91 23 47 66 -23 -6 70 83 -36 98 -70 -90 -25 78 41 -3 66 -129 -114 34 62 73 69 -4 -119
3351 -119 2 -11 -12 33 53 -38 -17 42 34 1 25 98 -23 45 25 38 -18 -40 56 69 -87 -92 -42 89 -43 16 4 -54 31
3380 31 32 -97 -2 -10 -69 -47 -36 6 -69 -39 63 46 -17 -95 44 29 81 -86 -3 -79 -37 32 83 -10 12 16 -25 114 -105
3409 -105 108 52 34 99 43 -82 -35 31 -107 36 54 -14 -67 0 -1 -1 52 -89 61 -81 -114 -30 69 -56 -11 -10 -43
3436 -43 -50 65 102 -74 47 -95 57 -16 35 -19 10 -50 -1 -23 0 93 -65 25 -23 -68 -65 62 -43 76 42 30 -30
3463 -30 41 -125 -135 73 39 -41 68 -11 17 72 -28 -68 -3 3 -58 22 45 18 82 38 0 56 6 21 53 -25 46 14 59
3492 59 37 -19 131 1 -50 20 13 -26 -81 -12 33 -27 55 2 -84 -5 -95 7 73 -102 14 -33 84 3 -124 -24 -81
3519 -81 -62 -150 -113 97 -5 -86 -71 -121 -31 26 -2 -21 -33 -72 21 4 28 -14 -20 -36 25 99 57 62 -14 -30 -46 53 14 -76
3549 -76 -45 86 -4 88 -24 -31 79 -18 -102 -86 61 -25 44 -82 53 18 -79 13 -24 -37 5 -18 -117 -98 35 39 39 77
3577 77 28 -68 10 59 59 -1 7 82 115 33 -78 -63 96 -2 -29 -6 -2 0 -21 -59 28 -54 -11 -6 63 -155 18 59 60 -20 -38
3608 -38 -56 13 -40 -35 2 -49 -25 18 -2 -26 2 59 -43 -3 54 78 44 22 52 -25 68 -80 -43 -25 31 -101 -10 -81 40
3637 40 -10 -48 -119 15 32 15 79 -52 -41 -91 -177 -2 -44 61 143 -51 18 -104 -11 77 13 30 -35 97 38 -8 -9
3664 -9 -68 10 18 106 179 14 69 -30 20 34 -43 85 45 13 64 32 -61 -82 -65 55 109 14 -15 -47 -89 60 -17 -95 -6
3693 -6 110 7 -6 -60 118 -5 59 3 -10 59 -92 -43 -66 -22 -25 54 -43 42 26 80 118 -41 5 80 -62 -35 -38 -65
3721 -65 -28 -109 72 61 -18 -18 -55 -16 89 -64 -27 -71 4 -137 -15 40 42 -42 -27 104 50 -24 9 -9 -18 -37 115 -29
3749 -29 -22 4 61 36 -35 -66 -50 67 10 -20 -41 -16 35 -6 -82 -49 -40 26 38 -24 14 -8 -22 36 -59 33 -75 -29 63 -138
3779 -138 10 -98 63 -80 26 -33 -37 8 33 -16 -84 -34 3 105 69 -78 3 5 69 -22 45 80 103 0 66 100 -115
3806 -115 -35 16 98 -57 -65 -49 70 -22 -124 -63 99 -6 -47 -139 41 -62 -14 20 -38 -78 35 2 71 -82 67
3831 67 107 -44 -79 38 -17 106 -71 64 -84 -3 29 84 89 -91 62 55 144 -17 -105 -17 -22 -116 -82 63 88 -116
3857 -116 -32 39 85 -8 -81 -14 -48 -95 105 -49 85 35 21 -40 -92 -42 -5 108 43 3 -22 -131 135 -41 -6 5
3883 5 12 -73 -21 19 94 57 -23 -60 64 4 -33 -94 69 -14 -86 -42 -63 2 47 -27 -78 -45 29 2 26 -103 23 86 -3
3912 -3 69 23 69 -32 66 -6 55 -30 39 135 38 27 26 65 43 22 -111 -27 51 -85 -70 -14 86 127 91 -125 46 -40
3940 -40 3 -30 -16 33 -17 16 -42 -40 36 -30 39 27 -47 -26 -74 -23 11 74 -9 -155 58 -58 60 -34 -33 -70 -18 10 53
3969 53 4 -72 -14 -16 -68 -46 -55 -64 -16 -19 -43 40 -51 35 -64 -29 -22 12 135 -68 117 9 -78 -121 -71 -12 -81 -83 -42 -25 -1
4000 -1 6 -20 74 40 75 -183 90 -2 -2 -11 -70 3 7 35 21 -22 -72 -43 -71 -88 -29 -126 18 14 77 0 18 -17 -1 43 -34 12
4032 12 -24 -51 46 -45 -58 -58 -29 -46 27 73 -101 88 -90 60 -44 51 47 76 -11 125 -20 -53 53 -3 -29 23 -25
4059 -25 64 7 48 3 23 5 19 -24 24 62 46 85 -10 55 -19 2 37 -92 -114 32 -50 36 60 42 0 -84 21 12 -4
4088 -4 -24 87 -30 31 33 -58 -67 26 3 -48 50 10 -16 4 -54 -108 -2 -27 22 -49 74 -68 -1 57 -105 27 -90 -87
4116 -87 28 -4 -86 14 88 -67 26 89 -14 -21 -78 23 14 63 54 6 12 50 22 87 -10 18 -16 77 -17 -67 -130 46 37 -33
4146 -33 17 -30 71 133 -77 -95 4 49 -75 14 -76 17 -17 -53 -5 -65 14 -10 -66 72 -30 97 -20 -9 -20 20 -23
4173 -23 -69 -19 -29 22 -31 28 55 24 -33 -52 -17 -45 -31 72 -108 67 38 -17 -45 -66 -9 19 -110 -23 4 12 -49 33 21
4202 21 -22 -156 -12 6 50 -25 27 39 24 90 -74 54 164 36 -4 39 0 25 40 -23 25 -62 52 1 -24 -47 32
4229 32 -97 39 -28 -130 -40 -82 15 27 11 -21 7 -79 -88 29 -56 -14 -37 -111 -126 22 -78 25 -10 76 82 -76 17
4256 17 -1 -145 -72 41 -4 57 84 41 -10 -35 -40 130 -57 -27 -20 49 -56 39 -30 -58 -91 -110 46 -36 -100 -23 -74 -50
4284 -50 -78 -25 -143 22 41 72 136 -56 -92 -11 -152 58 31 -3 -46 -7 -23 39 -29 -71 102 -26 8 28 40 58 -42
4311 -42 53 36 -91 6 22 49 25 55 3 -120 -45 27 46 25 -49 -22 -14 -58 4 44 -117 37 7 -71 194 42 50 22
4339 22 3 118 -66 -18 60 50 7 -13 -39 -150 55 22 -72 77 -65 88 27 138 -29 -106 -12 51 83 -78 -145
4364 -145 67 37 -14 57 -30 45 33 -28 23 -42 7 112 30 -66 80 12 -42 -68 -49 46 67 96 -46 -16 29 -22 6 14
4392 14 62 46 96 -63 -1 -18 -78 28 -103 -1 -33 -47 52 15 1 33 -2 46 50 -16 54 26 -65 39 -5 -46 68 18
4420 18 -82 104 -18 -103 83 24 -2 31 -58 30 -35 44 53 -69 113 120 -79 47 -26 -77 55 -53 -62 -44 12 3 -133
4447 -133 19 29 -34 -18 -33 -56 38 33 -104 -27 -16 -9 -68 14 -60 53 -56 14 -50 143 40 11 95 41 14 5 40 14
4475 14 77 -33 48 -11 62 -15 13 15 4 -86 -17 -4 17 49 56 10 -71 -15 -33 28 -76 -69 78 -5 78 70 7 -28 1 63 19
4506 19 -23 12 1 41 -25 62 95 12 47 -57 19 -13 -25 -26 9 6 53 -58 -27 4 -20 -101 59 17 14 -14 -14 0 37 -14 32
4537 32 77 -35 -16 23 86 114 -24 -38 36 -59 89 83 27 42 31 -46 -39 25 -63 -7 -23 -33 36 38 34 -22 -79 32 55 -53
4567 -53 2 52 53 -60 47 -46 -8 -59 -10 -99 66 47 8 -55 -146 58 46 -23 10 38 -116 67 39 22 -31 -43 16 33
4595 33 17 -29 59 -128 -3 -5 7 46 -52 137 21 55 53 75 16 48 3 31 -156 16 -57 29 87 34 -4 48 18 -1
4623 -1 46 27 15 47 -102 -72 -22 -100 -17 55 69 153 14 -55 20 -63 89 44 29 -20 -6 -37 -19 -19 41 32 48 25 -28 147
4653 147 22 -33 -5 -22 15 -75 -4 13 -57 -32 -50 44 -128 57 -16 -101 13 -69 35 -29 -19 48 -79 -3 88 33 -12
4680 -12 19 46 48 1 -4 -56 -74 18 22 -41 114 8 28 -7 -91 18 69 -36 -73 -90 -107 -52 -60 -81 40 70 27 -82 3
4709 3 79 -116 7 -40 -91 70 -59 -92 -9 21 27 -51 -2 -18 20 78 57 85 84 38 14 7 -11 -48 75 13 -121 45 21
4738 21 -76 8 -50 -23 -44 56 -106 -95 -90 59 -60 21 -153 -78 -48 -60 -13 11 52 -23 -70 -82 -117 -63 6 -116 -3
4765 -3 118 -19 60 -37 103 73 67 -56 -86 -37 56 -73 -39 50 -79 -68 -103 15 -104 2 -7 -92 -19 -55 40 -157 -59
4792 -59 -83 -27 -17 -23 -63 -16 7 13 84 42 45 -2 -40 -132 47 50 -24 27 104 17 65 -44 105 -32 34 58 -42 37 -104
4821 -104 -16 -25 23 32 -19 -2 -51 68 -11 -44 -40 24 -1 25 -39 -65 -70 66 -10 -47 -80 98 35 44 102 -6 -17 65 0 33
4851 33 -9 -138 -53 81 0 -84 -2 20 93 -12 109 9 -68 -46 -74 -16 -48 -54 44 -5 -12 22 -7 47 -1 -105 -68 -24
4879 -24 -80 77 43 22 24 -41 6 -31 -3 104 -3 -107 44 -47 26 -61 -12 75 68 5 -13 69 88 -104 0 135 -56
4906 -56 -114 29 -17 -63 103 17 -49 25 -63 -2 -60 -61 54 -33 130 -24 3 -75 2 -50 3 -45 44 20 -99 22 5
4933 5 -26 39 44 -75 -7 66 26 68 -1 -13 88 35 -13 76 -7 -81 36 -103 -128 33 28 -2 34 -1 4 -27 28 45 -29 -46
4963 -46 15 76 44 42 -55 27 46 79 -43 -24 62 -76 17 62 1 24 -23 -82 60 65 55 20 -20 -51 -82 -34 28 4 66 4
4993 4 -34 34 131 3 -35 -54 -94 59 -67 -30 3 -45 -18 -32 -13 98 56 -38 23 -6 -47 63 26 -29 -45 -106 26 90
5021 90 4 -92 37 -11 94 67 -27 100 -33 30 -89 -116 53 31 -76 39 -105 -82 -91 22 -2 -100 71 28 -77
5046 -77 -10 -17 -49 7 -28 -16 34 -4 -112 5 58 3 90 -26 -10 14 31 3 -20 78 33 106 -53 37 44 -13 -104 51 92
5075 92 -24 -78 64 36 -3 47 -48 -19 -5 74 75 -9 36 93 15 -48 19 -10 -29 58 -22 -48 -55 -68 8 -49 -7 19 35 196
5105 196 -53 105 8 54 1 41 -64 12 88 10 59 -80 -41 -46 -25 -40 -12 -40 35 13 -12 -73 -5 8 -40 -126 -18 44
5133 44 -67 -81 62 -22 32 -207 -2 -50 -54 10 -8 -16 -1 40 -104 -5 49 -142 -20 96 -53 0 54 9 29 -6 -24
5160 -24 34 -20 74 100 -81 -65 -78 -43 55 -49 -61 -71 15 28 9 46 8 -15 5 -173 85 -3 -52 39 14 -13 87 -7
5188 -7 83 44 62 29 161 49 -51 -107 13 -34 -56 -46 32 -18 -67 101 31 64 67 -11 -4 -63 -124 -187 -69 -35 16 0 -40
5217 -40 -2 -167 64 96 4 84 51 -62 38 5 91 -26 -45 103 84 81 28 19 35 -2 -22 85 13 -97 60 -79
5243 -79 35 -10 -51 -131 -48 -4 -27 19 40 32 52 -73 12 -57 57 -35 -47 -55 13 -29 -16 35 10 13 -126 -29 13 -23 131
5272 131 -20 67 -33 -46 84 74 97 -94 -40 -23 55 -46 -41 -24 71 45 -62 -45 -10 32 -13 -70 1 -35 -121 -53 64
5299 64 -75 -86 83 -46 132 27 44 38 -36 102 49 -46 43 15 9 27 13 156 82 -110 -53 -47 38 62 -19 13 9 52
5327 52 -16 17 52 -61 63 -150 13 14 54 23 -75 16 17 -13 -48 11 -81 88 104 9 30 -11 66 -88 2 48 -43 -28
5355 -28 50 6 -24 16 47 1 164 -6 -57 46 -17 75 14 -30 70 -128 -118 -18 1 44 -48 18 50 39 -34 -52 -20
5382 -20 5 1 -14 115 -22 -59 8 60 -29 -27 18 35 23 -37 22 -151 88 6 111 3 98 -11 39 24 27 28 33 -23 -51
5411 -51 42 -107 74 27 -106 -37 12 43 -68 72 -102 1 59 -11 9 -63 16 -2 -57 -78 -18 -65 32 36 59 61 108 41
5439 41 70 -27 -56 0 24 46 21 29 -95 82 1 139 53 -34 140 52 29 -40 63 -38 -18 6 -54 -53 -55 -48 14 -11 -38
5468 -38 -12 -63 -74 -6 -52 -18 -14 95 -36 50 -14 -34 -68 -4 -129 74 -39 79 130 139 -108 -31 -97 -86 41 18 10 18
5496 18 0 -68 -71 145 60 -14 31 120 -28 37 -25 -71 13 -40 24 -15 -64 143 23 -31 19 -17 -66 -140 -41 66 12 -92
5524 -92 56 25 12 -9 53 -24 50 2 44 -4 -57 57 -63 -26 55 44 21 -44 -58 -3 18 -70 70 29 23 119 -147 -140 -52
5553 -52 -21 -29 -86 -111 7 34 105 -81 63 -40 -49 -72 -7 86 -16 125 -58 158 -33 -21 -28 85 -17 -38 -9 37
5579 37 -113 83 -3 -26 -81 98 13 10 5 29 -24 90 -133 -11 -82 -148 -101 -68 87 38 107 -106 -45 -73 2 -2 33 28
5607 28 14 61 83 -76 7 26 26 31 -37 90 69 -91 -50 -43 -72 -6 63 -6 -19 -22 43 -87 85 44 118 4 -103 37
5635 37 -59 72 -31 82 137 104 14 -4 26 -70 -61 -8 -33 21 -24 44 59 7 13 33 -2 36 65 3 105 99 -50 12 -52
5664 -52 -19 66 52 -61 -13 35 -21 -3 1 12 88 11 50 51 -96 -108 -60 -38 -41 -63 58 67 -96 -11 90 -8 -11 9 -11 70
5694 70 8 9 -99 11 -5 15 32 66 1 2 -19 79 44 -14 95 -9 -91 -18 69 15 -28 -57 50 26 -44 -134 -88 43
5722 43 13 86 40 1 17 -113 62 26 -66 102 3 111 20 -132 0 86 1 -60 -17 48 -8 -7 -53 -38 14 39 36 70
5750 70 25 53 3 -60 -87 -44 -19 7 -4 -15 -58 -59 61 -17 35 -71 88 67 -5 5 -37 29 -108 178 -48 -7 -1 21
5778 21 18 -94 -40 -42 60 38 88 95 -57 2 105 24 -108 153 127 16 -52 3 -5 2 -36 32 -50 102 1 -30 -37 -34 82
5807 82 -119 102 68 21 -41 22 8 -24 94 94 -11 84 31 -43 113 78 -33 0 -14 -94 19 122 17 -67 75 110
5833 110 -25 -96 111 87 -32 -4 132 -94 -129 -41 30 15 -52 91 -61 -26 -27 60 24 -29 -114 -1 21 -39 -89 58
5859 58 43 104 10 -53 -64 -99 4 -35 19 -43 36 -47 -50 -21 -3 139 -35 -4 52 -9 -5 13 -44 -124 -57 9 -20 35 -7 95
5889 95 43 29 -107 78 13 -34 133 -14 -80 -11 -45 9 19 20 34 -71 20 -81 73 34 -45 43 -43 1 3 -12 -13 -58
5917 -58 11 -94 41 -12 -22 167 132 -61 -11 89 2 39 -49 53 30 -78 26 -55 23 -62 32 -38 -100 -5 98 84
5943 84 -8 -98 33 9 -103 17 -10 151 -34 92 117 -6 113 -2 146 28 -67 46 -4 31 -19 35 -19 6
5967 6 -39 8 2 25 38 97 -127 -2 22 -53 109 17 20 20 68 -121 -22 21 65 42 40 -100 44 -7 -7 57 -84 52 32
5996 32 -100 -14 31 51 -94 56 75 -110 60 27 25 80 -25 -16 106 -58 56 -77 -68 -72 -78 66 -92 92 -81 14
6022 14 42 43 -8 -85 -58 -51 -109 -20 166 33 45 60 -39 30 175 -33 -89 -104 -28 87 22 -15 60 18 -4 32 17 41 40
6051 40 -11 50 -20 86 -73 33 -26 -110 -79 -38 -132 -148 43 -29 -92 -61 -80 -69 41 62 -46 114 -9 32 -13 -48
6077 -48 -6 51 31 13 17 97 -46 -39 -33 100 -133 -58 -149 -5 -98 -98 -48 73 -21 -92 10 120 -118 88 -76 -5 43
6104 43 -5 8 43 79 -22 14 131 -27 -36 166 48 -51 49 63 -25 150 14 -2 65 -47 15 -4 63 -95 39
6129 39 27 -85 -3 27 18 -4 -48 -34 64 -138 76 53 34 -124 53 25 -39 -33 -17 87 -75 24 17 -34 -155 -68 36
6156 36 -24 15 62 18 4 39 -9 129 28 -14 -21 -33 81 43 -46 68 85 -15 -32 -24 55 -40 42 -22 81 54 -17 -68
6184 -68 18 -9 -43 112 -7 -58 32 7 -17 -39 -13 -4 -33 -21 -30 -107 -34 119 57 -35 -11 43 -36 70 75 70 -61 41 -32
6213 -32 -119 -84 57 33 -40 59 -3 42 -90 -46 -136 38 -107 25 -1 97 20 7 2 -193 23 -16 -21 -2 -70 -11 -66 137
6241 137 18 -12 8 -35 -32 1 -16 -16 -58 -68 48 -33 -18 -46 39 48 -133 28 22 -100 -30 -63 22 -126 -15 -12 -51 56
6269 56 -108 12 7 -120 42 -120 51 -31 -30 -25 -39 -67 36 -79 -13 -49 -15 39 -51 -3 24 68 -4 41 94 -53 51
6296 51 15 57 55 57 60 -44 71 2 61 -76 -52 60 -39 -136 70 -48 -7 -17 70 -8 -121 -89 -25 -5 -28 0 -58 6
6324 6 23 -76 91 -102 -27 43 -48 -69 -20 103 -1 98 14 119 -37 20 -47 93 -45 4 57 -5 87 -27 39 -1
6350 -1 56 -35 65 -43 -9 -2 129 10 1 -13 12 59 10 -60 -113 64 -53 11 -36 0 37 -4 -98 -92 -39 58 -130 17
6378 17 -18 69 17 92 45 11 57 -45 -20 98 -60 62 -42 73 81 -61 -46 34 48 -40 24 17 68 -89 4 -23 14
6405 14 10 -85 -64 -51 12 27 -4 -12 -100 46 -54 2 -81 26 70 -31 37 -111 59 0 -40 -40 -63 48 -75 -42 19 62
6433 62 53 25 -108 -84 56 -22 38 118 -12 110 -56 15 -3 -35 -42 -4 9 27 -28 6 -33 -19 61 -25 21 69 -51 -91
6461 -91 1 4 88 -21 -73 -88 3 31 12 14 33 -38 11 14 12 -45 -61 79 34 100 133 37 17 62 79 -41 -99 39 46 -63
6491 -63 -38 3 -66 -177 -27 -15 39 -9 -67 20 -75 -27 66 -110 11 114 12 -22 93 85 151 14 1 95 -78 31
6517 31 -51 128 -64 -18 34 -9 -114 67 -10 -37 -87 -62 -97 45 4 -67 87 17 -53 3 -91 -39 -50 60 -4 -45 -24
6544 -24 -31 14 -6 44 -48 74 -13 -67 -59 24 42 -56 35 3 -20 -4 46 85 -80 51 -11 -39 32 75 0 47 -94 -27 -87
6573 -87 32 -50 -32 -96 -63 20 -37 -85 -24 -15 -70 40 -46 63 38 76 38 -29 -48 84 77 -15 36 85 17 -137 73 68 64
6602 64 29 84 46 -13 109 26 70 -31 -34 84 6 15 -16 -31 77 30 23 -62 -1 -31 26 -6 -115 33 -21 43 -55 44 -17
6631 -17 -130 -71 -34 94 20 169 -43 54 -84 4 7 -55 131 120 51 -79 -44 -84 33 -51 -98 -45 28 -2 -14 -44 32
6658 32 67 -68 54 55 -76 23 3 6 38 -5 16 -20 96 -37 -4 129 -90 26 -5 -49 -18 18 41 -25 38 -20 68
6685 68 19 -2 13 -47 76 -163 12 26 37 -24 13 21 -72 91 -55 36 23 21 45 -148 -94 -44 127 -14 3 12 -62 -7
6713 -7 83 90 -12 66 -36 -29 42 -29 -53 -11 118 91 -13 -9 -96 100 -16 -78 68 6 90 -17 -32 -95 -58 -18 -31 -40 -44
6742 -44 -44 41 -65 10 -15 55 -89 5 47 -40 21 13 24 26 50 -50 -32 -67 -55 13 66 66 -98 50 10 -1 -25 -96 -70 -130
6772 -130 43 101 -84 -42 -32 -14 -79 -51 -103 8 35 -100 27 -14 -110 26 -55 -75 -74 -44 -38 -86 5 -77 95 -22 12
6799 12 10 34 -39 25 -68 -77 34 11 -13 -1 -2 -20 -95 4 37 115 81 -24 -50 -51 43 -54 -126 -103 27 -24 49 39 29 -161
6829 -161 -25 24 23 20 30 36 -15 76 82 -61 47 48 120 -22 14 -58 51 -10 -41 -35 79 4 107 68 -125 59 -46 42
6857 42 -44 -34 -65 42 -71 16 20 -27 27 -99 -7 5 17 15 -85 52 -24 67 -47 45 -41 7 -9 57 6 13 1 21 50
6886 50 82 42 -15 91 -1 -63 -104 -4 30 107 -25 -30 33 69 44 59 -14 71 -23 17 26 -37 25 -130 -84 -24 -85 -76 8 126
6916 126 -22 37 -50 -108 41 -151 -4 79 31 -102 44 -4 -80 -23 54 -74 -45 26 -37 131 116 13 87 0 91
6941 91 -83 6 15 -112 -67 62 44 -86 -97 -28 14 -28 77 -33 3 23 -11 102 -42 16 100 77 -23 63 -57 -3
6967 -3 28 -9 23 -38 49 -22 80 -7 -24 79 -6 73 -9 39 8 37 -15 -15 -47 82 60 -16 -72 20 56 7 66 0 -32 -14
6997 -14 -103 -92 -47 -5 -98 -39 -12 53 34 65 63 23 86 74 -147 51 -7 31 -13 -148 7 -36 -25 88 15 -33 -40 9 50
7026 50 58 52 -23 61 -17 54 3 -119 -32 5 54 -28 16 17 7 32 -34 3 13 -104 -53 41 -7 -32 63 -13 -52 20 -41 1 68
7057 68 -30 160 -41 8 5 8 40 6 79 4 88 10 -27 67 -10 80 20 -74 -5 -9 16 -26 22 -59 127 26 -35 -3 38 -14
7087 -14 -26 -55 -115 -50 -14 -40 34 6 36 -74 -15 19 48 47 159 23 7 -34 -40 -51 2 96 -14 -5 6 37 209 -33 33
7116 33 -33 48 -16 -36 -125 -51 13 -41 -41 -34 71 67 -41 15 -8 65 55 -74 -45 -4 43 8 18 -2 -22 9 78 -15 44 74
7146 74 -82 165 6 32 -20 33 -28 -87 69 69 70 84 -91 -10 11 101 164 7 26 8 -24 4 6 -30 8 -30 -46 93
7174 93 -22 -23 15 -56 49 -25 13 -82 -11 55 -3 -14 41 -9 28 123 28 68 130 -40 61 34 80 12 87 -58 -93 6
7202 6 12 34 0 9 33 -43 -24 46 -158 2 -96 -2 -112 -2 4 8 -38 103 43 7 -83 56 -28 49 81 139 -9 -39 64
7231 64 21 70 45 2 54 -80 84 -60 -48 178 133 -89 -79 15 85 36 -86 -110 -74 -32 37 -57 -11 0 -16 -25 -46 -45
7259 -45 -70 -35 -11 -12 -18 -86 64 -62 -75 40 45 4 14 10 117 31 -65 67 7 36 10 -20 15 -57 155 -39 13 -93
7287 -93 49 82 -1 -24 -36 79 35 -50 -115 3 -56 31 -15 -55 -111 38 113 -44 -77 -95 51 -122 -47 83 26 75
7313 75 -5 32 -92 90 70 19 -43 35 -32 -63 -27 145 -10 66 -26 4 9 -80 -19 -68 -14 83 -9 56 -64 5 56 4
7341 4 -34 73 45 -75 65 57 -83 -82 -84 -106 37 60 30 -55 42 -45 17 4 -17 -30 -87 -6 -59 -42 111 3 114 -7
7369 -7 -35 33 46 57 -88 -20 80 14 -138 21 80 19 27 37 -29 31 49 51 -63 58 -17 -14 2 -10 -18 -48 15 -2 112
7398 112 -52 -79 60 -120 -18 86 62 46 38 -2 -18 -13 47 82 -41 -9 77 10 71 14 -13 -15 105 29 -18 -32 -130 -58
7426 -58 -23 72 -57 11 28 -117 -6 -26 -59 56 -27 45 129 -42 -142 -52 23 59 56 -36 3 -4 -114 47 42 40 100 68
7454 68 158 -46 64 -6 -66 1 68 -18 -19 122 42 2 12 -28 -11 -12 63 26 -62 -19 23 4 39 40 56 -6 -33 138 30
7483 30 11 -122 -55 -16 120 45 10 59 -137 83 21 -24 143 43 -30 -13 -11 -110 -1 -28 -39 -51 -13 -35 25 41 78
7510 78 -35 26 -64 25 25 -21 -83 38 -104 8 64 133 47 78 6 34 179 73 -53 74 16 -68 77 30 32 39 -14
7537 -14 33 103 57 12 -41 -2 -60 21 -14 -12 20 -20 133 60 53 -21 -60 -10 -126 -14 20 -50 36 -29 40 36 -29 -87 17 26
7567 26 -27 -22 26 5 -20 113 102 7 25 1 50 0 36 5 -33 29 63 62 -68 -108 9 -33 -15 -6 15 -39 -140 51 -66
7596 -66 6 77 98 13 -28 43 62 -11 16 39 -27 -56 -26 94 -44 -36 40 -28 31 -76 14 62 -45 72 32 83 35 -45
7624 -45 -18 -48 90 22 -61 25 9 -93 94 61 87 -9 70 48 45 -20 -24 1 -1 -2 4 -99 -10 67 -68 15 5 9 28 33 -100
7655 -100 -55 37 1 33 46 170 -88 39 43 144 94 42 5 -27 -76 23 -40 -43 88 9 -59 -108 -25 -86 -29 42 -56 31
7683 31 -46 -64 145 -13 1 8 66 62 -81 -4 -26 50 199 2 -44 12 -45 62 -24 -44 75 -39 28 -95 14 115
7709 115 21 -58 116 -26 13 -1 -13 -24 38 78 -49 91 12 -34 -47 -25 80 -54 -15 -64 6 -17 55 58 0 -111 138
7736 138 120 70 95 -139 42 -6 150 22 -62 43 122 80 -129 116 -53 -89 -49 43 -47 -52 -40 -7 91 -38 -18 -33
7762 -33 -29 -65 79 40 -30 -7 1 83 -58 -21 12 -17 40 -38 18 -1 100 -38 -101 -30 -78 24 34 -19 -26 72 35 42 112 38
7792 38 59 117 -65 64 10 35 51 -78 -14 -6 -46 -21 -7 -126 138 -48 -24 -17 14 71 13 -71 -31 13 -163 -5 69
7819 69 -28 28 -45 -46 31 37 -51 18 -15 -53 -107 -98 134 85 19 -39 75 101 2 -72 -7 47 -52 64 -33 -61 -40 41 -19 -129
7849 -129 -9 96 -20 -91 52 67 -29 21 -102 -101 45 10 88 26 -87 -21 -17 2 12 -44 82 -23 -49 88 33 134
7875 134 71 20 -62 0 -45 -7 76 -15 -7 -43 -52 6 18 -68 52 -114 87 7 -48 -57 -22 90 -22 -15 22 147 -31 -63
7903 -63 -24 -56 48 -91 -70 77 21 9 31 127 -7 -80 27 -16 41 -57 -109 24 -105 -78 -29 -56 25 24 62 -126 -115
7930 -115 73 168 -13 -14 -81 7 18 -44 -2 63 23 51 -3 -23 35 85 -15 -71 38 70 97 131 -38 84 93 -25 -117
7957 -117 12 22 -22 49 73 40 -40 -111 39 -28 130 31 -108 116 4 -80 33 -75 -54 -48 -18 -17 76 -33 32 19
7983 19 25 122 -55 22 -19 -59 -4 108 -23 3 47 -96 -13 3 50 -63 13 23 88 31 -27 100 37 11 15 -91 -88 -9
8011 -9 -2 -46 148 -34 -37 -21 24 -8 47 -159 -1 4 13 -47 -35 -46 -1 -35 -119 -90 -45 35 42 -41 52 -40 48 158 14 111
8041 111 -36 65 73 -25 -33 -21 -159 15 -53 66 -19 -61 -73 -42 -143 -8 51 108 -26 19 -73 42 44 71 -119 21
8067 21 -10 31 -50 -36 47 11 47 6 80 54 216 -40 -37 6 30 39 -97 9 19 33 -86 -63 -4 5 -18 -63 91 14 -6
8096 -6 -45 -45 44 1 -37 36 41 -89 -3 28 11 82 -21 60 31 -113 72 -43 28 -41 11 53 59 126 56 -23 -16 -26 45 47 56
8127 56 -91 45 34 -22 -23 -10 126 -33 64 -52 52 -54 -123 -8 6 34 -18 11 -4 -82 -90 -90 -113 27 42 -56 -4
8154 -4 60 -43 -23 -58 38 -2 -75 5 -40 56 61 72 -60 -6 -9 57 -4 38 -7 67 -123 76 -9 -28 -3 79 56 -75 -54
8183 -54 -96 -78 -18 -82 46 57 16 0
8191@
$$ Imaginary data points
##PAGE= N=2
##DATA TABLE= (X++(I..I)), XYDATA
0 0 0 0 0 0 0 0 0 0 0 0 0 0 0 4 -8 8 -8 8 -8 16 -16 16 -24 24 -32 40 -46 48 -56 65 -80 88 -98 112 -128 144
36 144 -160 182 -200 224 -249 280 -310 344 -377 417 -462 509 -561 617 -681 749 -826 912 -1007
55 -1007 1117 -1238 1380 -1544 1738 -1970 2256 -2617 3088 -3731 4667 -6165 8935 -15793 71192
70 71192 57057 -88438 -11536 38173 16081 -1936 -8442 -57632 -29638 33978 17612 -43998
82 -43998 -27192 9872 17036 18425 13156 -19133 -11996 31678 37717 -8039 -30235 -3466 25897
95 25897 12663 -12469 -20060 -15379 -379 17362 -129 -30147 -15219 18637 9662 -10096 8
108 8 7384 3423 19691 21821 -11083 -13528 17809 10224 -18394 -13238 -3883 -10928 -2797 6920 -10398
123 -10398 -16677 9325 20059 2201 -4335 4152 6965 9187 8292 -4967 -11971 -92 9046 -1501
137 -1501 -13745 -8779 1096 1199 61 1261 -3111 -4070 6762 10026 -2565 -6082 5534 7466 300
152 300 1932 1011 -6604 -536 7340 -4950 -13152 -1006 4278 -3772 -3172 2154 -1214 -334 8190 5270
168 5270 -3500 1728 7141 1083 -2427 142 -1907 -3303 -181 -1665 -6820 -4727 2926 2963 -2356 -818
184 -818 3205 3009 3007 3822 -264 -3229 1634 5101 -840 -5624 -1762 634 -1967 -572 -465 -5104 -2456
201 -2456 5211 2907 -3395 -809 3617 2236 1689 2635 -985 -3123 2278 3896 -2241 -4132 -899 -839
217 -839 -985 145 -1633 -3772 -449 3590 1910 -921 1041 2515 1235 1834 1984 -1249 -2447 598
233 598 1044 -2386 -2824 -516 -842 -1694 467 804 -1681 78 2884 1203 -378 1809 1756 -651 87
250 87 1332 -761 -2116 -8 61 -1729 -643 655 -1143 -1310 673 535 -642 452 1074 140 382
267 382 1801 849 -883 265 913 -855 -1088 120 -747 -1683 -301 623 -873 -1090 917 854 -224 778
285 778 1340 30 149 1213 281 -1042 -261 105 -953 -1006 77 -408 -966 361 756 -278 -9 988
303 988 326 -247 409 660 -262 -141 335 -273 -668 305 157 -966 -430 457 -144 -484 350 105 -486 180
323 180 997 74 -626 331 702 -192 -101 289 -556 -646 401 -46 -770 -443 305 203 58 431 195 -240 570
344 570 905 60 -451 -22 220 -230 -11 -144 -823 -507 273 265 -383 -114 357 139 290 608 -31 -363 250
365 250 669 -106 -365 8 -84 -412 183 209 -658 -495 153 216 -69 98 65 -64 281 682 225 -207 209 377
387 377 -88 -30 -142 -428 -320 103 37 -379 -308 91 39 -68 347 233 -73 285 459 87 -208 118 8 -176
409 -176 -166 54 -259 -372 111 -13 -286 -79 225 66 28 365 127 49 19 356 90 -102 62 -56 -297 -79
431 -79 -6 -222 -87 13 -19 -49 93 156 -32 -182 167 94 -102 156 99 -17 -14 49 -225 -238 -72 30 -101 -66
455 -66 102 -26 -91 0 157 -20 -6 143 -11 -202 88 82 -102 -103 -14 -50 -159 23 -115 -115 61 170 -122 -3
479 -3 160 70 128 59 17 -153 -78 52 24 -150 14 157 -87 83 22 -115 -56 -121 218 78 -67 84 -20 -12 141
504 141 71 -134 -80 74 94 -4 -103 -102 -90 15 150 -61 -90 93 72 101 21 21 -81 -38 100 -10 -99 -230 2 -54
530 -54 23 -42 21 -30 -42 87 15 31 -63 -6 -27 -34 70 -48 2 -18 126 104 -66 -13 -46 -14 53 -59 35 6 43 80
558 80 -126 -75 90 80 -2 -68 20 -65 85 37 -94 4 -50 39 66 187 -7 -155 -83 129 80 -94 61 14 -4 -43
584 -43 -57 -31 34 47 18 -17 -47 -16 -72 40 106 14 0 45 66 9 20 -27 -7 -50 64 -62 -52 -16 42 -99 8 133
612 133 39 -135 7 92 70 7 172 86 -73 66 -22 -22 94 -9 -69 -12 27 111 109 122 94 78 3 -39 77 -134 23
639 23 115 158 23 16 104 57 -75 60 -38 -125 89 -35 -23 64 56 61 -59 -51 -15 36 15 46 -6 -54 -128 1 -109 -46 101
668 101 50 -60 -19 99 46 19 -7 -22 -49 78 29 79 37 -52 -12 -104 -41 147 -26 61 -22 -59 71 -19 48 10 186
695 186 19 70 -5 -38 72 -18 -76 -62 -48 -27 -36 -25 34 11 -26 -147 -36 54 83 -43 51 96 23 -110 84 33 -113
722 -113 173 133 -3 -1 135 -84 44 -5 -58 -24 -28 -59 60 6 87 -25 -51 12 -147 -41 -41 129 8 -81 -40 6
748 6 47 122 130 -14 26 -96 -35 -46 -75 -93 -58 78 39 -46 -6 -71 -75 -23 -116 -63 -46 -116 -28 2 79 18 18 -15 62 10 -57
779 -57 -55 -8 -20 -116 -45 -7 -102 32 53 -13 50 37 21 -32 11 49 1 88 -6 -128 12 -6 -5 -27 -31 -24 70 128 59 127 -34
810 -34 0 -11 -19 19 53 -89 -18 11 -15 112 3 -7 -30 64 -63 77 33 -48 -73 6 44 -165 -15 -23 13 15 1 -179
838 -179 -94 -30 -31 0 78 14 -53 -60 133 48 52 34 54 49 96 -32 93 1 -30 3 32 55 -15 -44 23 -23 33 54 30 -35 -74
869 -74 22 -89 -121 -15 -18 -32 4 51 47 153 -134 -82 3 -34 54 -126 -17 0 26 76 -186 19 26 -98 38 -44 20
896 20 14 -49 14 142 44 51 9 -17 27 122 -55 54 -151 36 -91 53 -83 -34 -7 12 -10 62 -11 105 -59 103
922 103 -34 -18 16 61 27 -105 -63 9 -82 -109 -45 -5 13 104 8 35 4 17 21 -74 39 -22 -68 73 -30 -8 -59 88
950 88 76 32 14 -6 58 88 10 -84 48 11 58 -19 -1 -73 -30 -51 51 106 -78 -48 0 72 -116 -45 -7 43 8 -55 1
979 1 -40 24 92 40 35 13 42 -2 67 -54 12 36 29 -155 64 -79 18 20 96 45 -53 -2 28 3 21 69 11 -31 36 75 8
1010 8 117 62 32 77 2 29 30 -31 28 76 3 43 -25 -43 55 93 88 -120 -5 -8 26 -93 41 -78 66 -42 67 -24
1038 -24 -56 -14 -10 -42 9 -26 -23 85 -32 -42 66 -27 -3 38 -7 -46 -18 6 -75 90 2 75 -60 12 15 57 -120 -12
1066 -12 5 96 -120 12 45 -63 70 35 30 35 8 -33 -53 -18 -2 -31 -23 94 -25 47 -89 89 84 55 -45 -127 -79 -53
1094 -53 33 42 3 116 -3 -18 71 -9 63 97 -60 109 39 103 10 20 -71 4 -32 -62 -53 -11 -22 -91 -40 22 -46 3 16
1123 16 15 51 -38 -64 52 -24 -15 5 23 124 -36 -50 -57 129 41 57 20 14 123 45 -18 -64 56 61 34 -90 47 18 138
1152 138 55 -35 63 22 76 1 58 32 -90 -4 2 -35 37 -41 8 -15 -22 18 -8 31 -75 81 -60 -40 -87 120 -6 43
1180 43 25 -8 -48 -40 -28 157 93 -75 -1 -77 1 24 -29 -35 -35 -17 76 -25 26 -49 -159 47 93 -3 5 56 47 -36 -30 97
1210 97 -13 -51 -50 0 83 -6 -38 80 -14 -76 31 -56 -7 -47 -55 37 137 75 -111 -36 -12 -47 -12 17 53 74 10 -30 -117
1239 -117 -5 27 36 6 135 0 86 -64 -9 -45 -77 -29 -67 -52 -105 6 74 99 1 20 47 76 -58 114 -13 50
1265 50 -12 66 45 59 -76 -43 33 91 -48 36 -55 -49 -52 34 4 -11 -9 -15 15 12 77 43 83 78 -21 -80 -29 -20 -77 2 -31 5 -73
1298 -73 -98 -11 -128 -74 11 -67 2 35 26 15 -132 92 46 -58 77 -75 55 -18 -5 -64 30 -113 -27 -53 -5 -6 56
1325 56 -5 53 -20 -67 -14 -8 -40 21 38 31 61 -56 97 -33 -38 14 -25 35 6 -87 -11 -42 50 -66 83 27 27 -1 14 -80
1355 -80 50 -33 -92 32 -41 -33 27 15 39 88 49 70 17 97 -7 -36 -48 -28 8 24 -74 -82 116 -24 -60 -3 -69 -107 39
1384 39 -132 -12 -58 24 7 126 112 33 -12 -11 79 -43 5 -28 -13 -15 -23 55 62 89 26 2 48 42 42 -31 59 -12 2 -31 -72
1415 -72 73 -76 57 30 -71 -40 -45 50 -45 -12 35 -39 -46 -5 -92 -5 -103 -26 18 -54 50 99 -79 -71 -25 -63 -14 -8 -14 67
1445 67 -64 54 43 -64 94 -42 63 -8 -45 27 88 5 8 -60 154 -31 -2 109 -30 -122 -52 -79 -93 59 8
1470 8 11 -56 101 -73 14 -73 -136 6 -43 -6 -76 -36 64 33 13 29 77 59 -46 144 -29 -43 14 9 -12 28 72 -27
1498 -27 34 -12 17 36 -3 -28 -131 111 87 64 -14 23 -1 -3 -46 35 24 38 52 -144 30 130 -48 -18 85 15 36
1525 36 33 108 -103 -57 13 79 16 -35 -43 -16 43 -89 81 -64 -80 -44 -8 -121 -21 -4 -99 -31 -20 -47 96 -23 -15 -91
1553 -91 -60 -73 9 5 -14 -84 -109 -48 -102 11 32 29 -119 37 44 -67 -82 104 -6 110 45 106 23 -21 -56 -16 36 115
1581 115 -48 63 34 -43 -68 25 86 -71 36 37 19 -66 -66 19 -75 -56 40 -64 -96 -5 53 -44 -4 138 24 -15 -38
1608 -38 35 141 -12 -22 54 -23 -3 -20 153 -54 161 -13 55 -107 -50 113 7 -19 93 -55 -12 -4 122 -5
1632 -5 -59 59 -83 -43 66 -10 -62 19 -76 -64 77 73 47 -71 48 -25 91 151 -45 21 21 -117 106 -31 27 35 67
1659 67 16 9 -15 16 66 -59 61 -71 14 4 -44 26 -32 -40 23 55 -63 -122 -83 101 93 25 -1 -90 21 -63 -22 -13 13
1688 13 36 48 -58 -64 44 -58 36 130 -30 87 98 22 13 -38 -45 84 56 62 -44 53 -46 13 -175 -95 68 4 9 4 -71
1717 -71 6 -59 -40 -50 51 88 -91 -36 68 -55 73 38 101 -36 -3 44 13 8 -33 -34 -112 52 31 18 44 -3 20 32
1745 32 27 -26 119 73 -66 -15 -34 -10 -49 -61 68 -85 -26 12 88 -20 63 2 83 -19 -18 -39 -7 167 25 -78 -8
1772 -8 14 -100 -33 -21 7 9 -14 -115 16 12 -54 -49 26 -10 -21 -31 -22 -91 140 -21 13 53 -7 18 102 -45 -116 -23 46 44
1802 44 -32 -46 -68 -90 33 23 35 -77 58 164 -56 -36 42 -13 27 58 -84 -68 -35 76 -53 47 -12 29 41 79
1828 79 22 -30 23 68 -1 -7 -91 30 -2 -27 -5 32 9 11 -50 -129 -33 -39 -110 -38 -129 -105 -62 -22 -45 -35 33 -73 24 -22 38
1859 38 -56 -1 -10 29 16 -103 74 -85 -47 9 35 -4 -164 -115 25 -58 6 -22 -21 33 -24 -10 3 -115 20 -112 127
1886 127 38 -9 17 36 -28 -37 -58 -89 115 -6 86 -36 30 10 -17 -2 168 14 -10 -68 39 153 62 -55 -3 -90
1912 -90 0 -34 0 79 41 70 101 26 16 23 -44 -36 28 54 -102 -69 -80 44 10 -38 2 -59 113 -31 15 -62 -52 102 -108
1941 -108 -95 123 -55 60 -15 -33 26 -50 75 -41 37 -88 -70 -92 -36 138 -47 20 1 11 -9 -14 49 -53 -72 -20
1967 -20 -3 -35 36 -42 -25 -126 7 -10 -32 14 -20 -37 42 -18 -59 31 38 -50 -16 32 67 -10 21 -65 -50 -6 75 -19 -90 -20
1997 -20 -51 -33 57 -23 189 -50 18 33 -118 -70 52 97 -14 -44 -60 -17 24 0 -20 -25 -66 62 -11 32 35 -23 10 16 -22
2026 -22 31 51 62 120 -66 87 55 79 -64 -12 29 73 -4 203 -23 56 15 -150 -41 13 -11 -59 25 -34 37 21 -34
2053 -34 -99 -29 20 -17 -93 -60 -32 -123 28 44 -86 -23 -2 -120 9 30 49 -67 -32 13 14 -8 -68 54 -38 -16 13 -58
2081 -58 57 14 127 20 -27 -34 21 11 60 -37 -4 99 62 -18 7 12 -28 135 -58 13 14 33 -35 33 -41 -38 -1 54 -10
2110 -10 -71 -5 66 -40 -17 60 103 14 57 3 -51 19 47 59 7 67 8 11 -132 43 -72 -15 69 -35 0 2 78 -13 -36
2139 -36 -54 -14 32 8 -17 -54 -101 94 -19 -16 -3 100 47 47 9 -35 -32 -73 -43 12 27 110 -19 -122 122 -3 17 -72
2167 -72 -10 22 80 135 -44 -72 -26 48 20 18 59 82 49 -63 -42 32 -96 46 -4 -21 -2 -22 -77 -29 -87 -24 25 -67 -36
2196 -36 136 107 7 -23 -91 10 -28 -51 -7 34 10 -71 15 80 -94 51 -22 5 -26 29 150 81 22 -4 -7 -16 66 0
2224 0 -58 -86 -60 48 -78 30 15 -94 -29 39 109 42 132 35 73 45 -3 -62 -34 -22 5 29 49 -71 54 104 1
2251 1 61 -42 44 -4 -11 84 21 -25 -49 10 26 34 -16 8 -62 -1 -158 157 7 -74 31 69 -10 54 8 -29 -73 -14 144
2280 144 -57 38 39 62 64 -27 -99 5 -75 -56 -63 79 -19 9 96 -3 -62 163 112 -5 12 -60 85 10 44 -36 21 -68
2308 -68 79 -13 -42 24 47 -31 -67 117 -63 -22 10 31 20 49 39 -19 -73 26 3 -111 38 95 13 -58 83 16 -32
2335 -32 31 97 42 77 -19 -52 35 -4 42 -46 -88 -16 -32 86 -37 136 -75 54 61 14 -86 19 7 24 55 4 102
2362 102 19 6 -3 -68 -35 29 4 -64 -27 41 25 26 46 95 5 55 -47 3 3 83 72 -6 -23 102 37 72 -19 6 22 -60
2392 -60 -27 -33 56 -130 9 -19 67 -52 6 -60 72 50 137 92 11 -43 98 103 -61 -13 -211 28 -67 62 23 89 -150
2419 -150 -57 68 -42 -11 24 71 88 -27 45 -22 24 139 73 -1 8 -122 -92 34 23 42 -78 -23 -106 -133 86 -68
2445 -68 -6 103 -81 111 -22 -27 -23 39 23 -23 -10 -11 -99 -12 -71 97 -92 -38 -9 -20 -96 0 13 72 81 -66 24 -12 -37
2474 -37 -138 15 -8 -6 -26 -52 -130 -13 -64 1 2 -77 -93 33 77 -48 -20 -27 11 -27 17 96 -4 17 35 187 97 -18
2502 -18 34 -7 124 18 50 -2 98 45 -48 -34 30 59 2 -80 -45 -18 29 28 -26 75 -36 39 76 93 -213 -70 -58
2529 -58 -30 -149 2 -7 -67 -92 -40 89 -52 -7 39 180 -12 -70 -19 -1 32 86 0 54 3 117 16 58 -21 46 -24
2556 -24 -80 -46 -24 78 30 51 39 -21 -74 117 -70 7 45 7 107 -51 55 -58 7 -78 62 88 44 -110 -70 -27
2582 -27 13 -75 78 102 -19 -52 49 -7 77 1 11 118 -81 116 -7 15 104 -17 60 7 1 42 -13 13 65 62 -107
2609 -107 26 -29 -111 -32 87 -12 -31 -17 -32 -69 -54 -31 -7 -9 81 -54 -40 -16 -28 -1 89 -34 -80 147 89 19 -26 -48
2637 -48 23 -6 132 -31 33 7 5 -5 122 63 69 -27 136 27 -12 -38 2 -11 25 7 -12 -46 -81 -103 -48 26 -1 -40 84
2666 84 49 -30 -47 38 27 64 -53 2 93 -14 27 82 69 19 9 -50 -13 -31 -44 -1 77 -38 103 46 -84 -72 -53 -61
2694 -61 17 -21 -55 0 -40 -49 50 0 -24 26 60 -43 94 -26 -15 2 14 -22 13 40 -59 7 12 7 -10 46 -4 95 -33 18
2724 18 22 15 11 82 57 -43 69 2 -44 32 51 28 -58 9 27 -2 -94 -46 20 84 -20 -64 -5 39 -93 -91 17 -5 -51 -36
2754 -36 -5 -31 81 19 43 -34 6 28 53 37 -6 60 -47 -19 -9 -10 -11 -92 33 14 -80 -4 14 -70 -33 0 -81 -13 85 -44
2784 -44 -34 50 14 62 47 -67 -17 -22 73 -13 -3 -49 73 37 -28 -3 -47 -56 -119 56 74 -40 81 38 -73 62 79 68
2812 68 124 62 24 -14 33 1 11 -30 48 -40 53 -17 -22 -45 -6 9 -122 -48 -64 -46 29 4 -111 27 34 34 -24 21 40 -71
2842 -71 52 6 -20 44 49 20 -50 42 140 10 -51 -4 45 -16 -69 65 34 -25 47 2 -80 -2 -36 -9 -37 -72 -62 -27 -104
2871 -104 -29 -81 48 85 -18 -11 82 -103 58 4 -4 29 2 -43 -6 26 87 14 74 -92 -15 26 78 40 13 -36 20 46
2899 46 -28 25 52 -77 73 -13 40 -11 -19 -24 19 20 30 -48 21 -12 12 107 30 -10 88 -31 -129 120 -35 -14 7 -43 51
2928 51 10 80 4 -84 1 -104 -67 -14 51 -118 55 56 154 -34 -26 -9 -23 13 48 -44 35 -21 -62 86 -31 -83 14 35
2956 35 -64 -26 -30 -61 -129 -2 -50 -85 80 -52 -70 -112 101 111 66 -73 127 12 -43 48 -8 15 -2 96 -3 33 -5
2983 -5 65 11 45 44 62 -5 -42 -21 -17 -172 -42 -7 -86 -12 52 -121 -33 -59 -40 -36 -83 -111 88 -7 -23 -45 -2 -28 14 -1
3013 -1 -32 129 -3 -178 83 79 -120 -11 6 25 -29 -44 -29 35 86 -110 -19 -5 -31 -73 120 65 -38 -58 19 55 -70
3040 -70 -19 -35 48 -1 -92 -59 -39 15 -80 -19 40 -59 3 -67 47 1 -43 8 -110 8 -37 -14 28 -40 40 -25 -107 -17 -78
3069 -78 -1 99 -37 -26 67 -32 -45 -32 -99 -101 -80 43 -25 -30 119 46 -16 19 -4 12 58 -27 1 -40 13 -94 26 -4
3097 -4 69 70 39 -105 -31 151 127 133 46 138 -66 -51 63 82 -14 -100 -71 -94 -28 66 22 -80 -33 71 10 -40 0 50 44
3126 44 11 75 63 -30 -76 47 30 -18 -59 -23 -41 9 32 9 48 66 -118 -51 35 74 -22 28 79 -44 30 92 -13 30
3154 30 63 147 59 -4 -25 -8 23 -25 0 -29 35 -5 -34 15 7 -50 -95 -11 -21 11 -47 40 2 14 -20 -8 113 108 71 29 51
3185 51 32 12 72 18 14 39 89 12 -6 17 -8 -36 -23 45 -11 39 -110 -61 -77 22 -143 -72 66 -29 -14 -2 -57 45 -11
3214 -11 24 -6 21 49 22 -79 -20 101 -17 90 -45 0 -44 68 -21 -25 14 -20 32 75 107 -56 -28 -54 27 8 -76
3241 -76 8 58 4 8 -51 -18 -83 -30 -66 53 -52 82 -25 34 -43 14 25 -75 -78 24 105 -28 68 84 44 26 -25 65
3269 65 87 36 -36 -29 -6 100 89 32 -38 -59 79 18 24 7 36 55 37 9 -59 -115 -98 -73 -13 8 -32 -65 -100 96 19 4
3299 4 -3 -30 -56 -42 6 -13 151 -117 7 28 88 29 33 -10 -45 -9 1 -137 111 10 72 12 32 -71 71 -23 2 -51
3327 -51 -99 110 -85 -33 -63 -53 -44 32 16 12 -26 -72 -62 -34 -13 121 -48 -40 -32 -58 106 67 -35 -15 14 107 26 -23 3
3356 3 25 -105 -91 -15 38 28 -9 16 -49 -48 -63 -34 -99 14 -49 -23 -52 -36 12 -49 35 -23 44 -13 85 -89 33 154 14
3385 14 -84 -31 -12 5 42 -15 -16 -45 17 20 -111 -22 -76 -86 110 41 82 -13 -48 -37 -66 19 83 153 21 84 -9 42 -47 129
3415 129 5 33 -16 28 29 -57 -17 102 24 -105 -42 1 -12 38 73 61 -53 -4 3 -37 24 -38 -27 12 17 96 98 111 -14
3444 -14 58 89 35 28 28 112 114 -98 106 32 9 -37 64 -105 -19 -20 -10 -31 -68 -187 -122 -37 -27 23 54 24 -80 -58 -91
3473 -91 -37 57 9 -92 -98 152 22 -72 143 4 -93 63 -32 44 59 -107 40 76 35 41 55 1 -27 -53 -36 53 -76
3500 -76 97 25 -49 43 50 -93 -54 -102 2 -10 52 18 -69 -47 115 -1 59 -171 1 88 -50 -41 -94 71 27 -34 -76
3527 -76 64 -77 50 -15 54 31 46 81 40 -16 -24 0 97 -32 -6 -52 -44 -69 -20 -6 -94 -224 -13 -65 21 0 4 -39 -35
3556 -35 79 -5 -111 22 47 6 -9 91 -1 76 -13 69 17 51 3 13 103 28 -63 -35 -64 -13 -38 -41 20 -19 5 36 -19
3585 -19 14 -62 42 37 -38 -76 -4 -109 -19 28 44 77 3 46 34 25 59 -10 107 -5 -12 81 -86 -21 -76 -20 -43 -16 -149
3614 -149 55 35 -51 2 32 -79 -27 -143 20 26 -30 111 53 46 -44 28 -79 -35 124 -61 33 33 -44 -12 47 -105 126
3641 126 -120 18 -27 12 -50 -27 25 -35 77 -88 15 39 40 63 -53 79 0 -72 -53 71 85 -98 47 -46 -8
3666 -8 87 -113 -3 -42 -79 52 -84 -69 -21 35 -119 -38 3 19 74 27 -33 -24 -62 53 -74 46 4 -10 27 26 -72 -59
3694 -59 -75 45 61 8 -20 -37 -89 66 -24 6 -7 -68 32 -129 -31 -91 -24 15 71 94 -80 -74 62 85 11 -23 -4 -35
3722 -35 -7 45 -58 -40 50 2 83 -46 -27 -35 37 102 -7 9 7 -47 -44 79 0 -71 158 7 -57 88 -14 -91 -32 18
3750 18 37 56 47 49 -10 10 -82 39 -83 -20 -62 50 50 -78 -60 66 2 75 81 -131 -21 35 -26 19 152 112 -37 103
3778 103 -113 -89 -62 80 77 20 15 126 11 -37 148 -83 2 -32 -125 -21 100 77 42 47 -11 -38 -101 -8 -36 23 73
3805 73 36 37 -42 -27 -51 -23 65 -9 -18 -22 -14 -29 21 -23 -129 32 -5 -7 65 -17 -101 -60 46 -38 -47 41 -62 -157 33 -66 -44
3836 -44 193 -16 -63 10 38 -18 4 -5 99 7 -41 -128 -97 -17 99 -59 -21 -53 103 38 -27 54 38 -133 -3 48 -23
3863 -23 -20 -32 -3 75 -37 -17 59 -73 -43 17 12 53 -17 -7 15 -52 -67 7 -107 -44 32 -41 46 -76 -35 77 -44 -114
3891 -114 54 -43 26 69 -46 -26 30 47 -56 -16 42 87 3 51 14 104 12 -48 35 -3 11 67 -63 -18 -94 26 18 54
3919 54 10 -17 -32 -40 -191 -74 -13 -34 8 14 78 -66 20 -37 34 -9 59 100 11 -89 -83 110 -10 -100 -161 -21 182 62
3947 62 -48 -107 73 -37 0 17 -50 -38 67 123 60 30 39 67 47 16 -85 89 -13 -41 -29 -67 -82 -22 -18 62 -56
3974 -56 -26 -37 4 16 101 -52 -73 7 -64 -44 -23 -45 50 -23 -56 66 16 22 120 -36 -130 -58 7 41 -20 15 158 7
4002 7 5 -32 -9 78 60 29 -76 44 10 -31 -63 -20 -70 -89 39 5 -48 45 -18 -53 4 97 -90 61 -42 30 -110 -99
4030 -99 -12 -16 -56 78 9 -71 21 -17 37 146 53 4 64 -110 5 70 30 -105 44 -3 8 6 -122 -28 -45 -108 18
4057 18 27 -92 29 -126 19 33 68 -12 -17 -58 -15 84 -53 13 33 6 -42 161 -69 -8 113 7 15 -121 1 37
4083 37 -15 -70 -51 61 -46 41 -8 -50 -7 30 154 0 -91 20 -54 -25 -35 48 20 -12 102 -37 -64 25 -110 1
4109 1 21 -67 14 44 55 28 -29 62 -13 -34 -26 53 -113 82 -121 -48 -4 34 -117 -59 -73 -25 -76 -72 77 -37 72 -132
4137 -132 16 -53 42 -45 61 -20 89 -21 6 -92 19 27 9 -7 51 57 -40 103 67 -63 -91 -75 6 -40 -59 110 56
4164 56 19 26 85 -51 37 14 -13 35 23 -86 8 8 -91 -30 -49 77 18 71 -89 76 -12 14 -50 108 -14 15 5 55
4192 55 -53 86 -79 44 -60 11 63 27 -39 17 -61 22 2 53 -2 163 -58 100 -83 -78 1 -21 44 20 30 -131
4218 -131 -9 26 -25 -61 -51 -89 -18 -57 -126 -80 -61 -9 11 -50 80 -47 86 101 30 -36 -25 12 81 48 -46 6 67 -143
4246 -143 -105 -68 8 -10 -28 23 80 -3 -151 -46 48 -9 -33 9 -15 9 132 -13 39 -72 12 -39 62 -11 -41 -42 -87
4273 -87 118 11 15 -2 -13 3 75 32 29 -9 -36 24 64 -44 -21 11 13 49 19 190 13 -22 -31 92 65 -25 -7 45 -25
4302 -25 52 -93 45 -14 4 67 45 -128 81 -78 31 51 -99 52 -5 -146 99 -12 -57 -19 -84 60 41 -42
4326 -42 64 -83 -102 106 8 11 -33 10 33 -17 -13 38 41 55 31 -68 -19 -10 66 -110 -106 71 -50 -24 -9 72 -8 -33 49 -19
4356 -19 47 -65 -45 -86 -131 69 66 -21 22 32 -50 68 24 64 37 -93 -5 -27 10 -39 -35 -42 123 141 -7 -8 59 -3 35
4385 35 -106 -23 126 1 -24 128 -107 44 44 -89 -74 62 90 -98 -3 -24 70 84 34 25 42 59 -21 32 90 101 3
4412 3 -48 -22 -29 -41 40 56 126 -38 60 122 8 -90 30 52 -105 7 17 -31 -42 132 -15 11 -46 -41 32 -33 -31 72
4440 72 -102 -70 4 36 15 95 20 20 -29 -72 -29 -46 78 45 -40 -24 -100 -48 15 17 -1 41 26 -32 -4 39 -32 -72 94 -30
4470 -30 35 24 -99 -46 25 -46 29 -47 25 23 -49 -14 -125 81 6 -62 41 22 99 -66 -16 17 25 -35 33 -18 -44 75
4498 75 -27 56 34 45 19 44 -44 0 -12 80 -70 26 17 -72 4 160 22 -13 -3 162 63 -178 -16 -42 19 -25 92
4525 92 -15 -20 -2 30 30 -8 55 -79 23 -106 -17 -73 34 62 -93 52 -63 11 -6 148 -16 4 63 31 29 70 35
4552 35 -45 -23 -35 -17 -53 -8 -16 -7 -23 -65 114 -91 55 33 47 8 -20 -15 -86 70 58 84 5 -59 -4 35 -51 5 -32 161
4582 161 15 -63 -7 61 115 -90 -57 -7 28 17 59 0 57 -115 -26 67 32 -90 27 -1 -50 -62 82 51 -156 28
4608 28 -102 -9 -6 -103 55 17 -63 -11 -17 -11 -14 82 79 -75 3 -1 86 -175 -37 -93 45 -78 49 -182 -13 22 94 -26
4636 -26 67 23 50 69 31 142 167 -30 12 -14 89 -107 -76 -29 160 66 34 -21 -60 33 81 65 26 140 9 60 -37
4663 -37 -29 24 -52 47 64 -4 -8 85 -3 4 -17 2 67 -61 18 3 15 59 -98 44 23 115 50 -81 -73 -119 100 -81 -34
4692 -34 -56 -79 -49 -5 3 8 -15 84 -45 51 -35 -63 17 15 40 37 -51 101 60 -62 -65 -48 -53 14 105 55 -52 63 47 -22 -1
4723 -1 -4 -7 28 147 -112 -23 -13 -74 -34 -63 5 8 -72 -38 9 -28 -62 -46 -19 -86 48 4 -11 -7 -206 -107 -100 28 19 -2 -42
4754 -42 2 -85 -5 13 -51 66 28 -2 -16 -23 -11 -87 -12 78 -12 -22 -68 -21 55 -5 28 22 -35 -66 -80 -19 26 28 54 49 15 60
4786 60 -29 0 -9 1 12 -89 28 67 -88 -126 -7 37 61 12 64 139 32 12 65 -156 6 33 17 -11 11 8 48 108
4814 108 -7 7 -27 -152 -26 -8 -36 -31 -24 -97 -7 -37 108 56 -235 -56 3 -35 -44 -67 -77 -38 -92 -65 69 99 -45
4841 -45 -144 -87 9 -8 78 -23 112 -39 -54 -43 112 9 -11 7 -81 -63 -11 19 -14 25 41 -47 -65 -11 -57 -45 68
4868 68 -79 57 -31 -100 11 -20 -29 7 -85 74 6 -11 14 54 -36 -31 7 -142 -29 -63 29 -69 51 -104 16 34 -123
4895 -123 -38 13 -23 53 -112 -96 -9 -22 -46 17 86 17 13 10 -56 133 4 20 -13 123 45 71 3 -2 -69 10 70 5 44
4924 44 -30 -5 30 -36 -50 -20 -93 66 -74 -26 19 8 109 -109 -19 -6 -28 -37 21 47 26 -47 48 2 24 69 -50 2
4952 2 -40 52 53 -27 5 -25 49 0 -84 32 -41 -41 -48 -13 -43 23 -5 98 42 -2 71 98 44 49 102 -7 65 -112 -19 -39 21
4983 21 -51 158 60 -11 50 -27 51 -93 16 52 -151 26 55 81 43 47 136 35 112 -9 -11 -34 51 2 70 2 84 60
5011 60 -30 -56 -16 9 -14 23 -57 -33 -13 -31 -31 -50 18 -66 41 4 -13 46 -55 72 -21 50 -36 -56 10 -16 -3 -82 -17
5040 -17 62 53 -12 93 122 -38 39 -55 61 56 -6 -13 -19 6 43 -55 -73 88 21 -46 -86 -90 39 37 -27 45 75 -26 53 -64
5070 -64 -55 111 77 31 -82 52 -24 68 10 -94 108 20 -79 72 0 -6 0 -72 -25 0 -20 28 35 116 -37 -31 1 -28 48
5099 48 15 22 -44 -19 -15 19 -99 -25 2 -43 55 114 -55 -69 -42 97 -31 34 25 -82 16 -20 -4 33 67 -115 67 -118
5127 -118 -34 -26 44 -51 -57 -15 -80 -46 -17 66 -51 24 32 -21 91 44 155 -41 1 -121 -41 54 -126 8 -16 28 -72
5154 -72 9 -12 -82 -64 27 -29 -14 -83 82 -32 -29 19 -39 2 -50 -18 -94 27 -86 150 83 64 19 -21 -53 -61 31 -80
5182 -80 60 84 53 -33 -13 -100 1 -106 -99 102 19 -62 -57 63 -2 -19 19 72 133 -7 -52 -79 21 -56 -27 -139 -26
5209 -26 -12 0 71 128 -41 -47 35 19 25 -53 -13 19 69 91 -53 44 -80 8 150 6 63 11 149 -31 -104 74 -25
5236 -25 -27 61 -97 -108 67 13 -28 -74 29 39 -3 -63 45 99 -91 89 -104 -17 -59 -113 41 -95 19 -63 -31 -29
5262 -29 -40 80 77 74 -30 -4 59 25 86 7 20 83 51 -131 0 79 -27 -131 31 -39 14 61 56 2 -44 8 -71 29
5290 29 12 32 -4 93 80 -39 -34 50 83 -96 -59 16 -39 14 51 -27 -67 -13 84 5 -10 -37 50 34 -16 19 -47 13 -1 -63
5320 -63 -48 -12 65 84 -32 21 -54 -70 -159 -47 -16 -9 -60 -12 -10 40 130 9 -46 -61 -40 46 -39 11 -40 91 20 18 2 -4
5350 -4 105 26 -7 104 96 -69 -10 81 -64 6 8 -6 -61 -84 22 -50 0 -52 -49 -20 -66 -39 40 -60 57 -10 -13 8 63
5379 63 -70 -36 -35 67 68 45 11 46 103 60 40 -12 34 39 81 -14 112 -49 -73 -29 43 31 61 81 -77 -51 -36 4 30
5408 30 -49 -2 99 -35 -98 32 -37 -4 -1 101 -118 -7 -23 -6 -41 18 -34 -98 -24 -31 36 29 -46 56 -74 -43 120
5435 120 -2 41 -2 -84 -24 39 32 111 -64 -26 -34 50 -74 3 35 -39 -50 -27 -16 77 -31 -128 47 3 -18 28 28 49 43
5464 43 27 -1 -15 14 7 86 94 66 -16 -10 41 88 27 1 55 34 31 15 81 -9 -59 -130 30 -83 19 60 -45 24 -113 30
5494 30 -87 -107 -66 -6 -34 -81 -16 62 74 15 -46 -69 41 42 36 44 5 -28 -47 169 -89 79 -51 -18 199 50 70 15
5522 15 16 -98 -26 -129 -101 5 34 -66 141 0 17 -109 -44 24 62 18 -123 -20 50 -19 7 -90 44 -11 -69 -39
5548 -39 -104 -25 -190 76 -119 -79 -47 29 9 7 -2 -32 31 21 61 39 -57 -32 -41 -32 50 -111 -43 -8 19 65 67 -43 4 13 48
5579 48 109 34 -147 -7 80 39 100 -56 -85 -52 -42 -50 29 -7 39 -41 60 130 -104 -68 35 -125 -5 41 35 -70 27
5606 27 62 -3 80 -14 99 -29 -78 77 62 -26 -42 -31 76 4 93 -50 15 21 -26 24 15 62 -87 -123 -55 -17 -15 -38 177
5635 177 10 -104 -17 -1 -86 -35 13 -54 -6 22 24 44 -41 50 25 -52 0 50 35 40 -43 26 -59 0 69 36 -15 -75 -46 -48
5665 -48 -68 -28 19 -15 -35 159 -22 -63 -27 -17 54 48 -29 6 57 76 18 -26 -53 -44 39 19 21 -99 150 86 22 64 -27 79
5695 79 33 63 4 15 -52 13 19 -69 -84 41 82 -25 -33 104 6 -18 -69 -17 10 -103 -73 -3 3 -10 46 68 -38 69 32
5724 32 40 9 4 73 -25 -45 -1 25 -68 87 -35 -18 40 -7 -41 27 31 -15 -105 37 -20 173 45 -73 12 -30 15 -73 -100
5753 -100 10 -24 47 -45 -44 -12 -76 -24 -84 -5 -87 -91 12 6 63 -62 65 5 91 -54 13 -82 5 56 42 -2 -9 76 -8
5782 -8 40 20 10 2 -37 69 43 43 30 35 -4 -38 -18 -125 -46 -80 41 27 -76 -52 -1 165 -31 -44 -5 -36 68 -11 -81
5811 -81 -14 -30 76 12 41 -23 36 -1 26 114 30 -23 -18 71 108 41 46 -11 -25 -97 -71 -38 17 -43 121 37 0 -69 -9 49
5841 49 54 9 36 -69 -9 -45 23 -117 -63 115 13 -11 18 99 77 -6 55 48 44 75 -24 -66 -23 20 -59 81 86 46 59 68
5871 68 81 -71 65 26 17 -34 -137 -44 -119 -61 22 84 -10 51 4 32 -93 1 -24 -36 69 60 -119 -88 14 91 -56
5898 -56 -14 -21 1 17 -103 -32 -52 -109 90 -109 -79 -49 -63 9 5 3 24 10 -98 35 -48 -32 -87 -8 -8 -16 -93 -38 2 -85
5928 -85 -1 37 -64 -9 -35 -24 16 19 -60 39 68 -37 58 28 113 -8 62 -2 10 38 34 98 14 125 -9 -11 -25 15 84
5957 84 21 68 16 4 -8 -14 -15 26 50 5 9 65 12 85 -51 -72 66 -18 -33 -5 75 26 -10 -3 4 52 40 -76 -24 -75 -43
5988 -43 42 23 -45 59 25 42 -42 -29 -12 19 31 -33 41 94 80 -95 -15 -35 77 45 121 5 -7 -38 -140 -69 16 98
6016 98 12 -127 -16 16 -77 -20 -102 -136 18 -97 -1 29 -108 -20 -93 34 41 115 69 -83 -1 15 23 46 -50 -30 60 -16
6044 -16 -16 -87 -12 0 -55 -82 39 58 66 101 81 29 31 -2 -56 -10 19 -43 49 -62 46 6 -34 54 23 -10 9 15 44 57 74
6075 74 60 44 -53 -19 -12 -32 -42 36 -39 -12 17 105 56 -36 37 47 -36 -21 18 -43 55 11 -23 4 -44 -45 -32 30 34 121 -33
6106 -33 -53 -101 67 -45 -35 -26 -77 31 11 -41 -79 -9 -139 129 6 -70 -95 5 -70 130 80 -72 -28 -10 34 -9
6132 -9 -5 -62 -36 -74 84 47 60 -1 27 -34 40 72 -61 51 142 55 -19 55 -48 139 16 60 -74 -53 -36 -3 85 70
6160 70 -12 19 94 -97 97 -11 41 -53 20 29 -69 40 26 -50 22 -63 39 -9 148 -113 -36 7 -38 -100 -63 30 16
6187 16 16 -7 6 -86 154 -5 48 77 -43 -47 97 1 -11 -72 86 -33 -47 127 116 -21 -85 13 19 -26 -16 -32 50 -67
6215 -67 -3 -66 -58 -78 -146 6 -67 0 14 110 89 -16 109 19 6 0 -1 63 -25 -77 -36 87 -50 -111 -119 21 13 -1 120
6244 120 26 -78 46 50 -8 56 61 -53 60 95 34 43 66 -11 -39 -25 -26 -53 -59 -132 -88 -106 -22 -174 71 -14 51 55 5 16
6274 16 103 -62 -2 50 -34 -8 -17 7 -110 -33 -13 43 -37 36 -8 -71 91 40 0 -56 -42 57 0 -33 59 -83 -11 59 1
6303 1 -103 13 10 2 24 103 0 -87 -178 -43 40 54 -74 29 -4 -14 -68 -60 -35 -36 35 83 -77 -58 -28 -87 90 18 -73
6332 -73 -12 60 -13 7 -70 -73 -53 -69 -27 -38 19 -171 51 -46 -85 -75 -89 29 41 -38 39 55 -49 43 -21 107 7 -6
6360 -6 -23 -57 -79 -19 54 27 24 -85 60 -76 -52 -43 45 -38 117 -29 -31 -41 -59 2 -133 -12 -129 -5 0 -13 -87 32
6388 32 -32 -21 69 -126 6 -88 74 -1 -18 20 37 1 -66 -30 -11 95 -50 29 -117 52 -45 -87 -61 72 -10 63
6414 63 3 -5 94 -19 -27 -68 150 -40 42 29 99 -31 -117 -141 63 -5 -38 -82 -146 -67 -48 -1 -28 -121 -53 -54 11 11 -33 -91
6444 -91 -33 25 -76 -41 15 -42 20 -84 -53 -92 37 -21 -37 -32 62 71 89 135 65 37 38 -62 67 -14 -9 38 -54 19 66 8
6474 8 -102 -68 59 50 12 -9 -17 -26 -30 14 5 8 54 101 -63 -12 -24 65 8 -18 71 -21 -59 97 12 -9 23 100 3 -11 61 74
6506 74 -81 -19 -10 100 -7 -22 72 90 110 17 -51 -30 -1 -64 21 72 32 17 -18 70 -29 46 39 162 -32 100 -178 1
6534 1 34 105 23 10 35 -76 -6 18 16 64 -28 -77 32 -62 -87 -36 1 54 106 -72 -15 -16 8 -29 -63 -1 51 18 -30 -83
6564 -83 111 -56 57 -21 -7 -91 40 24 -82 97 -33 83 132 -53 62 56 -36 -33 86 92 -64 -8 -13 -8 -30 31 13
6591 13 -130 91 50 18 -49 32 2 -16 -76 -70 -7 95 19 -26 0 -171 163 -11 -36 -44 -61 57 -20 34 -54 63 -86
6618 -86 -6 -53 47 -85 41 30 -16 16 82 22 -129 -17 -130 -70 -2 87 23 -35 -24 10 -80 -94 -83 5 87 68 -90
6645 -90 -20 93 75 1 98 -96 77 112 9 24 27 80 -53 91 31 -45 33 73 5 11 -24 23 -70 -3 81 -22 57 43
6673 43 35 -32 32 -96 -53 -55 -15 105 -45 6 -8 13 -25 62 59 -146 52 54 51 -27 -83 39 91 -81 -47 -4 -97 -8 77
6702 77 117 65 5 127 -3 -83 146 28 34 -103 15 64 -86 95 -124 0 68 -27 9 2 -41 9 42 18 -79 -29
6728 -29 40 111 -39 -134 13 4 10 -1 75 -59 41 -53 -67 -44 77 78 9 42 120 -39 -40 23 48 26 -12 34 -61 102 -66
6757 -66 -5 -42 -42 3 14 60 21 29 -7 52 74 -30 -111 1 15 46 -113 -25 25 63 39 -45 -14 -33 95 85 -20 -56 -88
6786 -88 -25 12 13 -21 50 23 -6 -64 -21 93 -9 -32 13 -4 21 -146 -22 -12 63 7 104 41 -26 -49 84 -35 -90 28
6814 28 -8 -3 8 -53 56 -2 -89 104 -70 -83 155 1 -54 55 41 -27 -22 -9 49 -76 87 66 -40 35 -4 -23 17
6841 17 -1 21 -12 43 -4 -51 -117 -23 -19 -12 20 27 0 12 -57 76 43 -20 -88 -21 -84 -20 29 -51 -63 -6 155 48 -39 -11
6871 -11 28 28 129 -12 48 65 69 -68 7 -44 27 12 69 -45 -30 -134 4 6 -5 -1 49 -29 72 94 -37 -81 111 17
6899 17 -6 -117 8 -107 -77 -72 21 18 38 34 58 57 60 -20 -17 65 -48 7 3 43 -26 8 47 40 27 10 -13 79 53 138 34 46
6931 46 -12 5 52 41 -28 135 -92 37 70 -87 -49 17 -102 -4 122 -86 -55 40 -10 8 -25 -120 59 -2 -57 -60 -161
6958 -161 113 -107 -30 -6 72 -11 -2 62 -35 83 -52 -12 -58 3 -17 73 -13 -94 11 -25 133 182 43 -120 -64 -97
6984 -97 37 26 -40 -23 33 -73 -68 28 -8 -25 86 -14 -50 50 -21 124 -59 86 -3 4 -36 30 53 1 -8 3 -4 35
7012 35 -6 -76 -87 -32 87 -43 73 95 -77 17 16 -55 -117 29 -44 -182 -98 -23 -30 -1 -5 58 39 -112 34 -26 7 -25
7040 -25 6 -16 108 84 113 75 41 35 119 -54 36 62 -28 -26 -23 -45 3 8 2 -11 -81 30 1 -30 6 -4 -26 -94 -3 -2 -31 77
7072 77 -39 28 100 18 -25 48 -29 -56 -76 67 19 -33 95 -81 41 57 -72 -23 10 15 -20 -146 -14 -38 73 8
7098 8 8 -20 -25 60 -59 3 5 134 -17 8 7 -58 -9 29 -89 -22 -37 -73 -40 6 -26 62 -81 -38 102 8 -46 -27 -129
7127 -129 121 -79 -18 -30 -63 151 2 31 -4 115 -15 -7 66 168 43 32 28 -40 -83 25 12 -52 -76 -57 54 28
7153 28 -27 80 -3 15 -14 -64 2 -94 -2 -109 89 104 -1 -18 82 48 30 -20 125 -92 78 46 -73 -2 -28 -57
7179 -57 6 -5 31 11 4 -41 7 1 -136 27 -33 -71 -75 52 -87 -95 -9 -96 -48 -26 26 107 -12 -67 8 22 -158 -62 -26
7208 -26 20 -84 -51 0 -31 -33 101 34 21 13 23 -24 -46 20 88 21 86 28 -27 32 17 -12 64 16 21 50 -52 -10 -33 -18
7238 -18 66 30 -1 -135 -2 -59 1 133 -14 -83 -50 28 8 -88 -41 -33 -75 8 88 -46 23 14 -7 50 11 -69 2 17 5
7267 5 -77 115 -29 -25 69 -17 -26 142 53 25 -18 -51 -76 18 -15 40 -59 -30 -54 -49 -106 -135 63 2 -14 -40 -36 -105 -114 -62 -3
7298 -3 -28 66 33 -59 76 -15 -41 69 23 18 -18 -7 16 -79 -84 2 -10 -44 -94 -174 90 38 -87 56 -12 -68 -1 77 34
7327 34 2 21 2 -28 -19 -47 112 -93 54 -29 13 -159 -54 44 -9 41 60 95 17 -20 -18 35 47 8 70 -35 105 47
7355 47 -35 19 94 29 -64 -29 54 3 2 -1 -28 31 -39 73 -17 36 -27 69 28 -23 -5 -57 30 130 19 -71 24 -19 -18 -46
7385 -46 15 87 18 -41 -5 14 7 57 99 -30 99 -44 40 -43 -94 -43 28 56 60 29 56 -47 40 -121 42 98 44 17
7413 17 70 82 53 2 49 -16 26 29 -34 138 -16 19 36 102 -56 -23 -49 91 24 47 -70 16 52 -105 4 -95 -52
7440 -52 5 -48 84 40 -12 73 -32 -21 62 -16 -26 112 50 16 72 -35 -10 26 -56 -43 -56 24 -36 38 65 46 -47 35
7468 35 59 -41 -60 -22 -5 18 74 31 -58 64 126 -93 -69 -88 71 61 -10 -6 82 7 48 -85 15 36 -229 -85 -34
7495 -34 -64 -56 14 -18 17 -18 70 41 -12 34 22 -42 -68 173 68 28 -4 45 133 48 55 -7 -16 -123 -31 -60 -137 61 -64
7524 -64 99 -14 -1 -83 105 -92 -140 -80 -6 64 -1 21 -27 49 -22 -13 -50 6 -48 2 -39 -64 57 3 115 33 -24 27
7552 27 55 134 -8 95 3 -9 42 47 2 -16 30 183 51 118 -2 7 -28 35 42 25 88 -13 8 -17 70 37 -117 45
7580 45 -57 17 76 -10 -41 28 -42 107 20 65 23 37 56 78 32 20 45 93 29 7 -40 -23 20 44 54 42 -19 22 -18
7609 -18 -75 21 50 95 -55 38 -4 51 -60 27 54 -11 -86 -79 114 -115 57 -112 0 -101 -157 -22 25 39 -6 -28
7635 -28 23 36 -45 -1 -110 151 68 27 0 -43 -24 12 -101 102 28 58 36 9 38 -36 -6 95 47 14 -42 74 -129
7662 -129 -65 14 65 69 -38 -5 134 -61 -10 49 -116 64 6 56 6 75 57 -5 17 -88 -82 143 60 -12 17 42 52
7689 52 34 13 -12 -71 -89 -8 -109 -100 -28 -4 -56 77 90 -85 130 -82 42 -45 57 4 -26 -32 175 26 -75 83
7715 83 58 -97 58 1 82 -90 65 -17 56 62 148 87 12 35 45 86 12 -54 -7 -57 -41 0 40 -28 -59 18 91 22 67
7744 67 -39 43 38 -13 52 -60 -12 65 -14 43 -106 -80 -22 -26 -66 39 -11 -11 16 -50 5 39 24 -22 33 81 6 113 -43
7773 -43 77 38 -59 59 13 73 -62 -40 -27 21 -46 -44 -55 -108 -123 -89 3 -51 28 -39 -35 20 163 -91 -40 -14 -13 27 12
7802 12 49 20 57 -82 27 -22 11 68 -51 11 107 31 -6 -36 71 -34 16 56 -7 -18 72 100 105 99 48 -33 -61 -36 -97
7831 -97 -158 -126 40 -15 101 29 85 5 -31 -48 -67 -28 25 53 98 95 -5 -38 4 -61 -27 33 78 -15 131 14 -46 11
7859 11 10 -26 -52 5 -51 39 -2 11 78 -26 15 -44 21 37 67 -13 -42 -13 71 0 63 7 -60 -3 96 -5 -89 -75 -34 14
7889 14 0 83 41 -39 -58 1 -26 81 -33 5 41 68 -106 5 79 8 -36 -9 -21 59 116 -107 42 -36 68 -3 -45
7916 -45 36 -18 22 -37 111 47 -35 52 -190 3 141 22 109 -34 14 -36 -16 74 -4 -1 -19 6 63 19 49 98 14 75
7944 75 -52 5 52 -65 -82 -80 -54 12 -14 -81 -6 46 -58 5 111 -51 -44 -119 -24 16 35 -51 76 59 18 4 -134 112
7972 112 -62 -66 -33 -83 27 -59 -103 -53 62 50 30 -30 15 62 -25 9 -81 56 -38 -52 20 -93 -2 -23 69 -15 3 90
8000 90 -47 -2 -38 15 0 63 -7 -130 30 -25 -78 -115 -106 23 22 -51 -41 -24 -36 -63 -16 -15 -11 20 53 49 -63 44 -60
8029 -60 34 -105 36 -11 87 16 -30 36 136 -36 37 -1 97 -77 -48 -45 -8 2 -32 19 30 -18 -45 -89 23 12 12 -79
8057 -79 21 -18 -126 11 -108 -51 -121 -25 77 42 -104 22 -25 -9 96 -193 -29 6 11 47 23 61 -113 56 58
8082 58 -48 183 25 -13 10 -62 74 -82 -38 -77 -82 -81 33 1 -2 -15 34 44 13 37 135 103 -64 -58 58 84 63 68 18
8111 18 60 16 -8 -74 46 -21 -46 -78 -25 -7 60 -70 -71 -46 -47 74 88 56 -45 -7 -24 73 26 61 61 -92 -1 19 -55
8140 -55 33 -49 -70 99 -16 -9 -90 59 -59 -11 88 8 121 41 86 65 53 13 -5 71 34 74 -62 56 -16 28 75
8167 75 46 38 -97 -60 -8 22 -8 -6 -23 81 42 65 53 60 62 -16 -50 -42 46 -26 50 21 112 -130
8191a30
##END NTUPLES=NMR FID
##END=
