##TITLE=1H_DE-80H_X3
 200.13MHz, d2o
 8 sc
 
 19ns.26.2.2025
##JCAMPDX= 6.0         $$ Bruker NMR JCAMP-DX V2.0
##DATA TYPE= NMR FID
##DATA CLASS= NTUPLES
##ORIGIN= UXNMR, Bruker Analytische Messtechnik GmbH
##OWNER= pz
$$ XWIN-NMR		Version 3.5
$$ Tue Jun 24 12:44:24 2025 Russian Standard Time (UT+4h)  Yarkov@DPX200
##.OBSERVE FREQUENCY= 200.1313
##.OBSERVE NUCLEUS= ^1H
##.DELAY= (6, 6)
##.ACQUISITION MODE= SIMULTANEOUS
##.ACQUISITION SCHEME= undefined
##.AVERAGES= 8
##.DIGITISER RES= 18
##SPECTROMETER/DATA SYSTEM= spect
##.PULSE SEQUENCE= zg30
##.SOLVENT NAME= CDCl3
##.SHIFT REFERENCE= (INTERNAL, CDCl3, 0, 14.3821)
##AUDIT TRAIL= $$ (NUMBER, WHEN, WHO, WHERE, WHAT)
$$ ##TITLE= Audit trail, XWIN-NMR		Version 3.5
$$ ##JCAMPDX= 5.01
$$ ##ORIGIN= Bruker BioSpin GmbH
$$ ##OWNER= Yarkov
$$ C:/Bruker/XWIN-NMR/data/yarkov2/nmr/H-C/1/audita.txt
$$ ##AUDIT TRAIL=  $$ (NUMBER, WHEN, WHO, WHERE, WHAT)
(   1,<2025-06-24 12:43:25.04 +0400>,<Yarkov>,<DPX200>,
      <created by zg, POWCHK disabled, PULCHK disabled
       configuration hash MD5:
       00 E9 B6 7A A2 85 ED C7 34 08 36 98 17 FE 4E 26
       data hash MD5: 16K
       CB 88 30 1D 1B F6 64 6A AB 4C 11 F2 EC 35 AB 46>)
$$ ##END=
$$ 
$$ hash MD5
$$ 38 C6 1C 8C 18 0E EE B8 E4 DC 1E DB 4F E6 D3 4E
##$RELAX= 
##$RELAX= 
##$RELAX= 
##$RELAX= 
##$RELAX= 
##$RELAX= 
$$ Bruker specific parameters
$$ --------------------------
##$DU= <C:/Bruker/XWIN-NMR>
##$EXPNO= 1
##$NAME= <H-C>
##$PROCNO= 1
##$TYPE= <nmr>
##$USER= <yarkov2>
##$AMP= (0..31)
100 100 100 100 100 100 100 100 100 100 100 100 100 100 100 100 100 100 
100 100 100 100 100 100 100 100 100 100 100 100 100 100 
##$AQSEQ= 0
##$AQ_mod= 1
##$AUNM= <au_zg>
##$AUTOPOS= <>
##$BF1= 200.13
##$BF2= 200.13
##$BF3= 200.13
##$BF4= 200.13
##$BF5= 200.13
##$BF6= 200.13
##$BF7= 200.13
##$BF8= 200.13
##$BYTORDA= 1
##$CFDGTYP= 0
##$CFRGTYP= 5
##$CHEMSTR= <none>
##$CNST= (0..31)
1 1 145 1 1 1 1 1 1 1 1 1 1 1 1 1 1 1 1 1 1 1 1 1 1 1 1 1 1 1 1 1 
##$CPDPRG= <>
##$CPDPRG1= <>
##$CPDPRG2= <>
##$CPDPRG3= <>
##$CPDPRG4= <mlev>
##$CPDPRG5= <mlev>
##$CPDPRG6= <mlev>
##$CPDPRG7= <mlev>
##$CPDPRG8= <mlev>
##$CPDPRGB= <>
##$CPDPRGT= <>
##$D= (0..31)
0 0.7 0 0 0 0 0 0 0 0 0 0.03 0 0 0 0 0 0 0 0 0 0 0 0 0 0 0 0 0 0 0 0 
##$DATE= 1750754604
##$DBL= (0..7)
120 120 120 120 120 120 120 120 
##$DBP= (0..7)
150 150 150 150 150 150 150 150 
##$DBP07= 0
##$DBPNAM0= <>
##$DBPNAM1= <>
##$DBPNAM2= <>
##$DBPNAM3= <>
##$DBPNAM4= <>
##$DBPNAM5= <>
##$DBPNAM6= <>
##$DBPNAM7= <>
##$DBPOAL= (0..7)
0.5 0.5 0.5 0.5 0.5 0.5 0.5 0.5 
##$DBPOFFS= (0..7)
0 0 0 0 0 0 0 0 
##$DE= 6
##$DECBNUC= <off>
##$DECIM= 32
##$DECNUC= <off>
##$DECSTAT= 4
##$DIGMOD= 1
##$DIGTYP= 9
##$DL= (0..7)
0 120 120 120 120 120 120 120 
##$DP= (0..7)
150 150 150 150 150 150 150 150 
##$DP07= 0
##$DPNAME0= <>
##$DPNAME1= <>
##$DPNAME2= <>
##$DPNAME3= <>
##$DPNAME4= <>
##$DPNAME5= <>
##$DPNAME6= <>
##$DPNAME7= <>
##$DPOAL= (0..7)
0.5 0.5 0.5 0.5 0.5 0.5 0.5 0.5 
##$DPOFFS= (0..7)
0 0 0 0 0 0 0 0 
##$DQDMODE= 0
##$DR= 18
##$DS= 0
$$ [...]
##$SUBNAM2= <"">
##$SUBNAM3= <"">
##$SUBNAM4= <"">
##$SUBNAM5= <"">
##$SUBNAM6= <"">
##$SUBNAM7= <"">
##$SUBNAM8= <"">
##$SUBNAM9= <"">
##$SW= 18.0517328524113
##$SWIBOX= (0..15)
0 0 2 0 0 0 0 0 0 0 0 0 0 0 0 0 
##$SW_h= 3612.71676300578
##$TD= 16384
##$TD0= 1
##$TE= 0
##$TE2= 300
##$TE3= 300
##$TEG= 300
##$TL= (0..7)
0 120 120 120 120 120 120 120 
##$TP= (0..7)
150 150 150 150 150 150 150 150 
##$TP07= 0
##$TPNAME0= <>
##$TPNAME1= <>
##$TPNAME2= <>
##$TPNAME3= <>
##$TPNAME4= <>
##$TPNAME5= <>
##$TPNAME6= <>
##$TPNAME7= <>
##$TPOAL= (0..7)
0.5 0.5 0.5 0.5 0.5 0.5 0.5 0.5 
##$TPOFFS= (0..7)
0 0 0 0 0 0 0 0 
##$TUNHIN= 0
##$TUNHOUT= 0
##$TUNXOUT= 0
##$USERA1= <user>
##$USERA2= <user>
##$USERA3= <user>
##$USERA4= <user>
##$USERA5= <user>
##$V9= 5
##$VALIST= <valist>
##$VCLIST= <CCCCCCCCCCCCCCC>
##$VD= 0
##$VDLIST= <DDDDDDDDDDDDDDD>
##$VPLIST= <PPPPPPPPPPPPPPP>
##$VTLIST= <TTTTTTTTTTTTTTT>
##$WBST= 1024
##$WBSW= 4
##$XGAIN= (0..3)
0 0 0 0 
##$XL= 0
##$YL= 0
##$YMAX_a= 35559
##$YMIN_a= -32673
##$ZGOPTNS= <>
##$ZL1= 120
##$ZL2= 120
##$ZL3= 120
##$ZL4= 120
##$ABSF1= 10
##$ABSF2= 0
##$ABSG= 5
##$ABSL= 3
##$ALPHA= 0
##$AQORDER= 0
##$ASSFAC= 0
##$ASSFACI= 0
##$ASSFACX= 0
##$ASSWID= 0
##$AUNMP= <proc_1d>
##$AZFE= 0.1
##$AZFW= 0.1
##$BCFW= 1
##$BC_mod= 2
##$BYTORDP= 1
##$COROFFS= 0
##$CY= 83.5205535888672
##$DATMOD= 1
##$DC= 2
##$DFILT= <>
##$DTYPP= 0
##$F1P= 10.8118882576601
##$F2P= -7.23987719738617
##$FCOR= 0.5
##$FTSIZE= 0
##$FT_mod= 4
##$GAMMA= 1
##$GB= 0.15
##$INTBC= 1
##$INTSCL= 1
##$ISEN= 128
##$LB= 0.25
##$LEV0= 0
##$LPBIN= 0
##$MAXI= 10000
##$MC2= 0
##$MEAN= 0
##$ME_mod= 0
##$MI= 1.114404
##$NCOEF= 0
##$NC_proc= 0
##$NLEV= 6
##$NOISF1= 3.799351
##$NOISF2= 2.8
##$NSP= 1
##$NTH_PI= 0
##$NZP= 0
##$OFFSET= 14.38212
##$PC= 1
##$PHC0= -1713.766
##$PHC1= 10.1666
##$PH_mod= 1
##$PKNL= yes
##$PPARMOD= 0
##$PSCAL= 0
##$PSIGN= 0
##$REVERSE= no
##$SF= 200.129724274929
##$SI= 16384
##$SIGF1= 3
##$SIGF2= 2
##$SINO= 400
##$SIOLD= 16384
##$SREGLST= <1H.CDCl3>
##$SSB= 0
##$STSI= 0
##$STSR= 0
##$SW_p= 3205.1282051282
##$SYMM= 0
##$S_DEV= 0
##$TDeff= 0
##$TDoff= 0
##$TI= <>
##$TILT= no
##$TM1= 0
##$TM2= 0
##$TOPLEV= 0
##$USERP1= <user>
##$USERP2= <user>
##$USERP3= <user>
##$USERP4= <user>
##$USERP5= <user>
##$WDW= 1
##$XDIM= 8192
##$YMAX_p= 0
##$YMIN_p= 0
$$ End of Bruker specific parameters
$$ ---------------------------------
##NTUPLES= NMR FID
##VAR_NAME=  TIME,          FID/REAL,        FID/IMAG
##SYMBOL=    X,             R,               I
##VAR_TYPE=  INDEPENDENT,   DEPENDENT,       DEPENDENT
##VAR_FORM=  AFFN,          ASDF,            ASDF
##VAR_DIM=   8192,          8192,            8192
##UNITS=     SECONDS,       ARBITRARY UNITS, ARBITRARY UNITS
##FACTOR=    0.0002768,     1,               1
##FIRST=     0,             0,               0
##LAST=      2.2672688,     0,               0
##MIN=       0,             -32673,          0
##MAX=       2.2672688,     35559,           0
$$ Real data points
##PAGE= N=1
##DATA TABLE= (X++(R..R)), XYDATA
0 0 0 0 0 0 0 0 0 0 0 0 0 0 0 0 0 0 0 0 0 0 0 0 0 0 0 0 0 0 0 0 0 0 0 0 1 -2 4 -5 7 -8 8 -8 8 -9 9 -10 12 -13 16 -16 18
51 18 -20 21 -23 25 -29 31 -35 38 -40 46 -50 54 -56 59 -58 42 16 -274 2687 24471 -5177 -32673 -9659
74 -9659 -900 -16724 -15574 -5676 -12003 -12580 348 4533 3509 13560 17368 10134 11465 15189 7735
89 7735 3109 5850 1347 -9647 -10874 -3026 -3541 -12164 -11177 -4415 -4701 -3463 1853 -1173 -5551 1833
105 1833 8663 3231 369 8001 8670 1836 3474 6025 97 -1175 1993 -3294 -8159 -3615 -1105
120 -1105 -5010 -4776 -689 -220 224 3722 2614 -1001 1629 4841 1692 -1336 -302 605 -552 -1147
136 -1147 -496 -724 -1231 400 526 -1940 -1240 1503 803 -863 582 1829 794 762 2315 789 -1059
153 -1059 1093 1048 -2402 -2056 -297 -1973 -2317 -162 -355 -1635 232 2097 547 -287 1902 2006 394
170 394 972 1017 -213 374 970 -551 -1137 -255 -7 -1247 -1752 -741 -639 -1220 -448 -84 -572 390 1423
189 1423 880 434 1181 1483 567 133 849 147 -903 161 124 -1403 -830 418 -672 -1438 -238 195
207 195 -754 -677 490 125 -395 731 936 241 837 1058 174 409 832 -52 -728 -191 19 -906 -1174 -39
227 -39 -104 -969 -268 387 -133 -86 547 418 -10 358 824 243 -211 554 398 -422 -37 251 -541 -546 -12 -377
249 -377 -870 -273 260 -329 -392 554 631 -65 450 793 228 191 380 -42 -236 -34 -143 -565 -438 12 -314
270 -314 -597 46 159 -324 48 454 164 -14 435 423 -17 1 458 101 -446 19 116 -396 -373 -96 -280 -323
292 -323 -82 -8 -159 29 399 131 12 504 475 -38 132 360 -61 -282 -27 -157 -377 -324 -48 -299 -284 100
314 100 112 -197 95 310 81 125 306 133 -66 95 238 -149 -202 122 -121 -388 -116 24 -181 -305 -11
335 -11 105 -89 74 187 76 113 272 136 -46 198 206 -127 -53 -42 -120 -217 -35 -20 -192 -115 135 -42 -178 131
359 131 136 -106 -15 193 4 -7 84 69 -43 -33 105 -24 -63 93 70 -169 -19 82 -60 -93 19 85 -5 11 134
384 134 23 -84 104 14 -110 -22 -17 -94 -86 3 19 -52 -53 72 -53 -59 54 -19 -146 56 116 -131 -94 120 -3 -75
410 -75 -1 101 -12 -77 55 54 -91 55 49 -83 -27 94 31 -46 12 64 -33 -22 52 20 -49 81 41 -52 2 53 -40 -77
438 -77 -12 85 -65 -43 71 26 -55 50 82 -95 31 49 -38 -62 0 3 -95 -22 71 -38 -75 20 69 -44 -30 56 -10 -40
466 -40 67 71 -14 -5 62 14 -77 17 -44 32 43 -18 -104 -30 -18 -62 -87 -30 33 -1 -15 67 49 -12 47 78 -11 -31 -2 -48 -92
497 -92 28 35 -35 45 41 3 -27 65 36 -40 51 58 16 -31 68 59 -3 -58 68 -22 -74 -54 25 -11 -25 -27 -9 -30 41 22 -9 28
529 28 42 44 1 19 61 -11 -8 -3 6 6 -24 41 -67 2 1 -20 -54 18 24 -40 -45 31 5 63 53 2 -8 27 -2 12 43 -46 -19 -5
563 -5 11 -26 -24 -3 32 11 -26 33 28 19 -26 -24 -10 -31 44 -51 -18 -6 4 -13 15 -18 -24 -43 -36 38 33 -10 34 19 -1 -51 1 16 -33
598 -33 56 30 -73 -86 16 -37 45 34 32 -65 -15 18 19 -20 -38 -3 -6 -6 35 38 -30 37 50 -50 -13 22 20 -27 -58 -42 23 -17
630 -17 9 -23 -26 27 12 32 2 52 78 -40 13 96 -22 17 -15 -21 -29 22 -17 10 15 -49 -50 -58 77 -45 57 -45 5 -43 -12
661 -12 27 -7 16 11 52 -21 -35 16 -19 23 -27 -7 72 4 21 -35 5 63 76 23 53 56 -27 -6 26 -4 -46 -26 -19 42 -58 0
693 0 -47 -8 -21 58 -18 8 7 -10 -8 8 54 -7 34 67 10 -9 -25 40 -5 26 -24 9 -21 3 18 8 33 20 49 27 -32 53
725 53 46 -12 13 -34 23 59 -16 -58 -37 30 -34 -23 -11 9 -5 -30 -16 30 -4 -31 10 8 -32 2 -22 14 -32 -6 50 -4 5 0 23
758 23 16 5 -46 8 -18 -49 -30 0 10 -23 10 19 -45 -6 -3 27 8 -14 -22 -6 10 -8 29 -22 33 -8 -17 17 -40 34 16 18 -2 -5
792 -5 18 -8 17 1 15 61 -7 -2 -54 36 28 27 -11 -21 27 -34 -35 21 25 -26 -19 -22 -34 23 -33 -1 42 0 10 -83 15 -19 -22 -44 22
827 22 -18 -14 -38 15 -27 -3 -19 40 6 -36 15 47 9 51 5 26 16 8 15 62 -7 3 6 2 -7 36 -40 -9 14 1 26 -32 61 -24
861 -24 12 16 -65 -31 -24 -9 2 49 19 -49 33 -32 24 32 92 0 -1 -3 -24 -4 17 18 9 19 10 -3 24 -11 -29 1 46 -26 34 50 -3
896 -3 21 -15 66 -1 -13 16 -33 37 48 -6 39 -32 -27 -14 -43 41 -3 -7 -7 -23 17 -29 -38 -16 -15 -23 15 50 19 11 -9 29 -9 7 -18
931 -18 -2 1 -13 -3 5 -9 24 -12 -38 2 -10 -12 24 30 18 -19 29 31 -36 -16 -36 2 -25 -13 60 17 0 34 -7 34 6 -51 -25
964 -25 26 -16 -2 -18 -16 0 6 0 18 43 82 -39 -13 32 -21 -12 -3 -5 21 20 -1 -18 17 -15 15 20 -12 -8 -27 -21 6 45 -33 -20 -26 -32
1000 -32 -38 19 7 50 26 12 -11 21 18 76 32 60 -9 -32 29 -9 28 28 47 -35 -31 45 -4 -38 12 13 -62 -40 -10 -71 -35 -7 -4
1033 -4 -6 -53 -11 -25 -22 -7 -26 -24 -43 -12 -31 -14 56 -36 -6 13 47 -14 28 29 -10 27 -6 -41 22 -4 28 18 -24 19 6 16 8
1066 8 -17 -7 8 43 52 -31 -20 39 -16 -26 -31 -50 -16 -22 46 -42 -70 2 2 14 -50 16 -20 -15 25 -3 39 -26 23 -28 46 15 2
1099 2 -37 -38 43 -11 -5 -25 -19 -7 -34 -25 22 26 56 19 1 39 -39 11 -17 -17 -40 -16 15 21 6 -29 8 22 1 -6 14 -15 13 33 -4
1134 -4 -28 -10 11 -18 35 25 9 61 0 29 -23 -47 -36 12 26 -3 19 4 -16 -38 29 6 2 -33 29 12 -40 -20 43 -9 -14 2
1166 2 -7 -34 -5 -10 -45 1 -6 5 24 27 -9 58 -21 -12 22 5 9 32 10 1 47 26 -27 -18 -1 51 48 65 -21 -6 18 27 -22 -8 -25 -53
1202 -53 -2 -25 1 -43 -17 -9 44 -6 -27 7 -47 -49 -2 30 -16 67 -52 31 40 -14 9 7 10 -25 -22 48 18 -36 21 -1 -19 8 -55
1235 -55 1 -36 0 10 -7 -27 -16 58 -18 -31 32 16 12 9 -7 -31 5 -6 17 7 -26 -28 -35 22 -37 -42 7 6 3 3 -31 40 -84 15
1269 15 -16 -50 17 7 49 4 21 25 3 -51 2 -12 -12 -55 -4 -9 42 -57 -52 -64 -2 13 18 15 0 -36 -26 -15 54 -11 -16 12 48 -46
1303 -46 -73 -1 -1 26 46 37 47 -19 47 27 49 51 -8 41 2 -10 8 -6 3 -1 -7 -46 17 -1 -61 -13 39 -4 25 -27 -39 2 -3 -33
1337 -33 -36 -23 -27 5 -18 54 66 32 17 -9 30 -53 -31 10 -56 -15 63 4 29 -66 42 -20 -19 14 -19 24 18 -9 -13 -38 20 -72
1369 -72 2 76 -7 8 10 -33 -76 -10 -6 4 -2 -20 0 -3 38 20 -8 -18 -9 -20 -15 8 23 41 28 12 23 0 37 -2 32 9 53
1402 53 -18 25 -6 20 -6 -23 13 26 10 16 33 33 -15 -16 1 -12 -9 -17 -12 34 29 32 -27 -20 12 -23 -15 -42 33 -13 44 34 -8 38 0
1437 0 44 -55 73 6 22 -17 41 -23 0 50 9 45 -23 -4 19 -36 -12 -66 -34 -34 -49 7 61 -20 37 12 5 -27 -15 10 10 31
1469 31 5 52 3 9 17 2 27 52 -4 2 22 0 -1 -22 -30 -14 -59 9 -3 29 -52 -1 -13 -23 -19 -48 -7 0 -26 10 44 51 -6 25
1503 25 5 -49 15 -9 -13 -38 12 19 30 8 27 14 -12 0 21 36 -8 2 -6 6 49 -56 7 -8 7 61 38 -21 15 -46 -38 -56
1535 -56 -40 17 -8 49 -30 -7 -28 -36 1 36 3 0 1 -10 10 1 -33 8 -47 -24 33 -9 78 42 31 -59 32 18 34 44 11 33
1567 33 47 -31 6 50 -30 -17 -55 2 -23 9 6 -79 -32 -4 5 -23 -9 57 23 -44 -16 2 13 -39 -44 15 72 -9 -4 -13 -30 -14 -72
1600 -72 21 23 44 -20 13 17 10 35 27 -38 56 -38 -2 -14 -21 -18 42 15 -9 -25 64 21 -62 -3 7 5 9 3 -24 -29 -68 -32 -41 -54 47
1635 47 -43 3 43 -30 21 21 -1 -49 9 -38 34 73 61 -14 -27 13 4 3 2 36 -5 -25 -28 -37 -12 -63 -64 -1 -35 11 -17 11 -73 -50
1669 -50 -56 -17 -40 -1 -17 -29 -5 35 38 26 -34 -30 -16 13 -40 -103 12 0 -1 20 10 -47 6 18 48 14 3 -1 -8 30 -27 0 1
1702 1 -40 9 -20 -42 52 -2 -76 17 -25 -5 41 -33 -14 0 -10 37 13 -17 30 0 -30 0 -2 25 -37 3 -28 -39 19 -12 7
1733 7 24 -36 46 -13 -45 -13 19 -18 66 -69 16 -73 -1 -30 46 15 34 -6 -4 -42 -12 -29 -33 19 -29 20 -39 50 39 55 -19
1764 -19 -12 34 7 -4 35 -16 26 -12 3 3 -22 -7 38 -2 -61 53 -4 -11 -1 -14 28 -23 2 27 39 -51 -42 -2 -10 -42 10 45
1796 45 -49 70 39 -39 -3 -21 19 35 8 64 26 -41 -24 15 -15 -9 41 -14 -24 59 0 12 -4 7 -61 25 -30 29 24 33 3
1827 3 -17 -8 6 14 -23 2 -74 1 -20 -51 -5 -20 -45 -25 24 11 24 39 -28 27 43 -25 -13 16 -27 -19 -19 23 -6 45 0 19 -27
1860 -27 43 -45 23 -8 -30 -17 -19 16 -31 13 -6 -52 -53 31 -67 40 3 -78 5 12 15 9 58 -41 30 -46 -59 -79 -2 4 -19 31 -25
1893 -25 -36 -28 -19 29 13 3 58 -17 9 -12 48 12 18 51 44 12 -19 21 -11 9 24 -90 -56 -38 31 -13 33 -1 21 13 35 -2
1925 -2 48 4 -12 -29 -61 7 0 -17 -14 31 -43 46 4 74 -5 23 3 -39 -9 32 5 -33 -16 -2 -47 22 0 33 -5 2 9 25 46
1958 46 -43 6 -81 -35 1 -1 7 11 -21 -34 38 -2 14 14 -34 18 39 16 -9 8 35 -6 -21 10 -57 -15 -15 -9 -13 -12 38 -2 -47 7
1992 7 44 47 7 -27 51 34 -1 35 0 28 -40 -5 12 -16 -32 -38 -47 -58 -44 13 -35 -30 21 10 21 -44 43 36 35 -3 -19 22 46 54
2026 54 26 -55 -4 48 30 51 -31 1 -26 37 27 -21 -39 -24 25 5 17 -7 -7 41 -3 -15 13 -50 -14 -7 -10 -4 11 0 11 -28
2058 -28 -14 14 -21 17 54 -22 9 -16 37 -23 68 88 -34 -47 -42 -6 30 -5 -40 22 19 15 -7 -7 15 50 15 -13 17 56 -44
2089 -44 4 -4 -57 18 -18 -34 7 -29 -9 -15 -28 41 -16 -3 -25 10 -17 -56 26 43 37 -8 2 -15 12 3 -8 39 -26 62 39 -12
2121 -12 34 4 77 20 -44 -15 20 14 -25 -3 -47 -3 -63 -14 27 -1 2 28 8 21 10 -10 43 3 13 14 47 -13 -92 -18 33 -11
2153 -11 17 65 9 6 49 20 -1 28 -24 -39 6 -19 70 -28 10 13 -12 -4 -60 -40 2 -45 -76 2 -18 -2 18 -72 10 -23 16 -51
2185 -51 4 51 15 0 26 -10 25 -15 -28 8 67 -76 -8 7 8 -28 20 23 12 20 19 23 20 16 1 -26 -39 -19 -21 -22 -1 18 30 -1
2219 -1 -7 17 -10 1 49 4 25 0 -4 -14 -13 62 6 25 23 -31 -53 25 -21 1 53 10 -6 -16 14 3 -4 -15 -25 36 42 -34 -44 -28
2253 -28 11 3 62 -30 -9 35 -42 -25 -14 0 -9 2 36 33 -46 -41 -5 -10 -15 -19 -42 17 -19 -19 0 -5 -14 -2 42 -26 38 -16 48 42 -2 21
2289 21 1 48 -23 4 35 27 -15 5 -25 -35 -10 2 33 -14 3 -20 8 -19 22 19 82 19 -36 -54 5 -4 9 -23 46 16 84 -11
2321 -11 0 25 52 38 6 38 42 -23 26 47 -44 31 -22 -10 -17 -6 -22 -14 23 -34 -48 -45 -34 -46 -47 -63 20 -74 -17 -32 -60 -10 10
2354 10 26 -25 27 62 36 24 -64 24 12 -9 18 -70 9 -13 -5 -2 4 3 23 43 -27 11 -19 61 -43 -10 -35 -52 -61 16 39 -21
2386 -21 -13 26 -14 -41 -7 7 22 41 -56 -29 2 59 45 -20 -60 26 -16 9 21 21 -10 26 43 43 11 -15 46 17 25 32 45 9 -39
2419 -39 -56 14 -56 -4 -4 -9 -12 -48 -25 -8 55 10 -2 -64 -19 -3 72 13 25 -18 47 28 -2 -52 15 10 10 -31 63 -17 -24 -31 8 -17
2453 -17 -27 27 -30 18 -20 66 7 -15 48 -1 3 -15 29 25 -70 -29 46 33 17 34 -16 -17 12 -9 -44 22 4 -46 23 -19 -19 64
2485 64 -15 49 16 54 -6 8 -16 1 -20 -20 23 -24 -8 54 10 -9 32 17 10 19 -8 -8 67 42 13 -42 -2 -31 13 -14 -35 -46
2517 -46 -59 -40 -30 21 -7 -41 -32 31 -33 34 -12 35 -37 12 31 -41 18 26 44 22 81 7 -47 -18 26 39 6 22 3 -17 3
2548 3 2 -3 -18 -37 -24 -38 -10 -15 24 -26 18 8 -30 21 -21 -24 18 0 7 14 27 41 -25 -45 2 64 19 45 -32 50 48 -32 22 -40
2582 -40 40 74 28 -35 54 -1 -12 32 -42 2 10 -8 -2 -5 -2 1 12 -5 15 12 26 5 -19 -11 -35 -21 63 -20 -21 -42 -15 50 1 -13
2616 -13 10 -19 18 -19 -4 1 24 6 -51 -1 -29 22 27 1 20 9 -33 -25 -7 -68 9 -24 42 19 -2 32 28 16 -4 -20 23 -9
2648 -9 -5 1 3 -2 22 -26 -94 3 5 39 -4 99 25 -20 -22 63 -43 -37 21 29 46 28 -7 -15 -19 12 8 -37 -18 -38 -30 4 -21 -63 -38 6
2684 6 23 -32 36 -18 -12 -16 -36 -37 -17 -9 -35 -30 -6 0 65 -14 30 19 -7 11 40 -13 15 29 67 7 -4 -39 -20 46 -12 39 -7 -23
2718 -23 3 -15 0 76 -14 37 -11 -44 -38 -29 14 37 7 -6 -8 6 68 4 -33 33 4 32 -44 5 -10 37 33 -29 1 24 26 -34 -19
2751 -19 15 -66 2 35 -9 4 -39 -7 5 0 -66 -5 -44 48 -33 -50 -24 -32 -7 18 -33 -9 21 48 29 -28 32 16 -6 10 37
2782 37 -16 -88 -10 -40 14 7 7 11 -40 26 10 21 0 11 13 69 11 11 55 -25 -19 -22 -68 -92 -40 4 -39 -5 -57 26 23 44 39 -39 -22
2817 -22 -23 12 -14 12 27 -56 -22 -41 53 19 -88 1 -11 -5 8 -50 15 -2 55 56 5 -37 10 42 -1 27 29 -9 -29 13 -22 9
2849 9 20 -1 -53 -45 -3 -8 -53 13 -12 -15 -40 -10 24 51 -1 22 38 -32 -8 -26 -11 -31 21 25 6 3 42 28 -47 -58 -10 -26 -4
2882 -4 19 -14 5 28 -43 -62 27 -7 -6 17 4 -40 -2 -57 3 -23 -2 16 6 -43 -20 23 12 72 -24 -28 -47 -8 15 30 -33 49
2914 49 -7 15 38 69 26 48 36 -12 -23 25 29 -13 -8 9 -20 -36 -37 35 21 -3 50 21 11 23 -20 11 -10 -29 13 27 -35 7
2946 7 -10 -15 17 -58 -22 21 -4 -31 -18 -23 -4 -8 26 -28 -29 -36 13 8 11 15 -45 -34 -25 -45 1 26 9 -12 6 -44 1 -75 -8 -32 -50
2981 -50 -20 -1 11 -18 -58 -44 4 -50 33 31 -12 43 4 35 4 4 30 11 -91 0 -11 69 35 -5 -2 -9 31 -15 -39 -29 -11 23
3013 23 14 2 -8 -44 -8 -39 14 -19 26 -23 12 -23 6 3 -37 9 44 -3 9 26 -7 -21 58 -13 -21 -4 -26 7 10 -36 42 -18
3045 -18 18 15 -48 30 -24 15 -16 -14 -26 -20 -43 7 -44 -3 40 -29 20 19 -2 -42 20 8 -12 -18 -17 -2 -20 44 84 -31 3 26 36
3078 36 57 9 57 10 26 9 22 -4 -5 67 -1 32 25 -41 1 8 -16 -16 -34 -10 -44 -36 -20 35 -3 -16 24 51 -19 22 44 -5 -8
3111 -8 -12 -43 50 4 18 17 12 29 9 58 -15 47 -1 40 44 64 18 -15 -16 -19 25 2 -1 15 26 55 -1 16 8 -12 -36 12 2 16 -34
3146 -34 -51 14 3 -16 34 30 11 13 9 19 -15 -23 -1 25 32 0 31 58 7 18 38 -21 24 11 15 69 31 11 4 -17 -9 25 11 26
3180 26 -39 3 -6 14 -51 0 -6 -27 12 7 11 31 -18 9 32 14 -3 -26 31 16 -44 -15 -44 -34 -15 -12 -20 51 -38 9 33 -16 0
3213 0 -29 -2 19 19 14 7 -18 47 14 -51 -9 -27 -11 -16 -38 -30 -15 -31 -37 53 -21 -27 -30 -26 -62 -38 36 13 1 2 -14 5 38 16 6 11
3249 11 41 3 -34 -35 57 4 -2 7 -5 -44 7 -46 30 12 -49 -4 -27 -1 70 29 2 -13 -23 -30 -3 -71 29 7 -4 -19 -10 -10 6
3282 6 2 8 -10 -12 36 -32 -24 -6 34 -12 39 27 18 39 -45 -27 6 -39 6 -10 -29 57 53 63 -5 29 5 8 -10 -17 -21 -6 5 18 -23
3317 -23 14 -10 32 26 17 -19 13 21 -2 -29 -19 37 68 0 14 31 -52 23 -38 -4 1 -43 -26 -51 -1 -5 -5 -6 18 31 -11 4 -40 11
3351 11 53 26 -5 -14 -2 -37 10 -32 6 -8 19 1 71 12 -11 47 27 32 0 35 2 5 4 -3 74 57 -45 -37 52 -18 17 -10 -17
3384 -17 23 6 -2 59 7 -8 21 9 44 -11 12 2 -11 -21 28 -23 4 -36 -18 -19 -42 -37 3 -49 -12 -23 17 34 25 5 22 -18
3416 -18 -8 55 29 54 19 2 -42 12 -21 -34 -1 -50 -32 -49 -16 -42 8 -59 -21 12 17 7 4 57 -25 54 52 45 -43 -13 -62 16
3448 16 -89 -68 -27 -20 10 -32 -18 3 -17 34 -4 51 46 1 30 -27 25 -4 6 -61 4 22 62 -65 9 -41 39 40 -27 -16 -43
3479 -43 8 -30 7 10 -15 -66 -55 10 -9 -27 -47 -40 -10 -39 60 -15 -50 8 62 9 -9 7 43 61 30 -24 -2 -4 39 3 25 17
3511 17 9 0 -18 -50 -25 32 -11 21 -17 7 -4 -27 -38 -64 18 10 30 -21 -8 20 28 -13 6 34 14 78 25 11 45 -14 -14 -30 8
3544 8 48 -40 26 11 15 4 -40 68 40 -10 -5 -4 66 14 -54 8 25 29 9 -57 4 -13 -26 9 32 -50 -65 -29 -28 -16 3 64 -15
3577 -15 1 42 -21 -20 62 0 -13 -9 -19 -4 31 3 64 8 -10 -26 -5 -9 38 -5 43 10 9 17 15 39 -4 -9 10 35 64 -3 7 -40
3611 -40 -1 14 35 -13 -51 -16 -19 31 -16 21 15 61 32 15 -13 9 36 44 -8 22 29 23 -4 37 14 -4 36 75 -46 -28 2 -48
3643 -48 -18 52 0 -13 -55 -60 -19 26 8 -17 -53 14 -32 6 -1 47 -27 -63 -27 -35 55 -11 40 -2 41 3 -47 -28 -35 -25 -58 -14
3675 -14 14 -24 55 5 1 -3 28 -9 -2 -3 2 9 23 -44 3 16 22 -17 30 -7 -13 -2 8 -16 -8 1 -22 -11 -41 -6 -30 32 16 -15 -40
3710 -40 -9 32 -21 0 26 -2 11 -33 30 39 1 24 34 -23 30 -36 -36 11 9 -17 29 0 28 -40 2 11 -20 3 47 -6 -24 -8
3742 -8 -61 36 6 -46 17 -57 -20 -13 4 40 42 -1 -11 25 38 59 -6 -52 -12 47 34 -10 -5 6 39 -19 -7 -30 -13 -8 -9 29 -37
3775 -37 -45 -42 -25 -52 36 1 3 -5 0 -74 32 13 -10 -12 60 28 -49 -26 -7 17 34 16 -16 -20 14 30 16 40 35 6 13 25 -35 -34 -14
3810 -14 -52 -26 -54 -4 24 -9 18 4 -26 10 -56 -15 43 -12 46 -46 -32 28 -8 3 0 -22 38 36 -23 83 52 24 17 13 16 4
3842 4 11 34 42 52 -12 4 8 3 18 10 96 9 -19 3 -41 22 -10 -13 -58 75 -38 -7 -1 -38 -1 -47 56 -28 5 31 34 -65 -22
3875 -22 43 45 29 35 -30 29 25 -12 -4 -12 -34 52 41 23 -45 -20 -11 -22 0 -2 2 4 -18 -22 -3 -45 9 -19 -7 -23 -48 -52 23 -36 57 24
3911 24 -5 -25 3 -29 -59 1 -1 42 -21 5 -10 -1 22 -14 19 -30 -40 32 -48 35 -1 30 23 -8 67 -22 26 -38 -23 13 9 -54
3943 -54 1 10 8 38 39 -5 28 34 28 10 13 -24 15 -68 -28 11 42 43 2 -19 -62 30 33 25 33 26 10 56 15 17 -7 -23 31 -41 -63 2
3979 2 -13 -29 24 29 -20 -50 -12 31 22 31 -25 16 19 56 9 1 -59 -43 14 -15 -15 -7 -5 39 19 -19 18 62 7 -9 53 33 17 14 98
4014 98 14 -34 51 -12 -3 -55 -12 -8 70 44 -22 1 11 -1 -35 -47 -18 -63 -49 11 -22 -2 -45 -6 44 -29 37 -35 -6 -1 -6 15
4046 15 22 31 16 -12 -42 -19 0 1 -21 3 18 8 -6 8 -6 47 6 2 -1 7 11 -28 -40 7 -19 -22 -8 29 53 49 -44 -33 -8 -62 -42
4081 -42 -3 -5 -2 29 20 1 -25 16 -45 -9 53 14 11 21 7 -36 11 54 3 -2 -40 5 0 73 19 -10 4 31 4 -31 8 -30 3
4114 3 -59 -54 -21 -19 -46 -32 16 -61 -42 -26 -33 -4 -38 -10 -3 -2 32 -11 34 39 41 33 40 28 52 -1 46 27 42 6 16 -9 9 -39 -26
4149 -26 28 8 -53 28 53 -39 -6 7 -9 13 0 50 -32 31 28 -27 -11 -38 17 -20 21 -10 -27 31 36 -1 -26 2 19 -8 26
4180 26 -24 -5 23 14 -5 26 0 -13 -19 15 -4 -40 65 -17 -34 -26 -7 -35 15 -20 -5 -16 26 28 10 15 -76 44 -3 -5 14 -39
4212 -39 3 46 47 -24 -19 -12 -9 20 23 -24 26 9 7 -11 10 4 8 36 19 -39 -88 -10 -5 -5 -3 -9 -42 19 24 -21 18 -35 -49 0 14 34 17
4249 17 -39 -27 -24 -27 -13 13 -34 38 28 -2 75 -15 -24 28 25 -40 -32 30 31 1 46 -2 4 29 -44 -9 2 20 21 -1 -26 46 -72 24
4283 24 -58 -3 -23 29 11 28 42 -1 16 22 -5 8 -35 0 -28 20 22 -32 22 -45 -2 35 19 -15 20 86 -38 42 48 16 -15
4314 -15 23 10 2 40 -1 -14 8 -16 -29 15 4 56 25 -29 -19 9 -4 -35 -7 -20 8 11 -82 15 -49 8 -48 11 21 14 -13 -2
4346 -2 -9 9 31 -12 -31 -46 26 -73 18 35 12 12 36 5 41 -20 2 52 -12 -7 30 7 5 28 -30 -3 -16 -49 -8 60 -13 35 5
4379 5 -8 0 -1 -1 -44 2 -14 17 16 -42 3 44 -45 -23 12 -4 -66 6 -51 -1 -15 3 42 -10 0 2 -32 -50 -19 9 -33 26 -27
4412 -27 -56 19 -58 61 -61 30 -41 -71 -25 -24 35 -26 -31 62 53 -49 7 38 -27 -31 19 42 21 -24 -41 26 11 -39 25 -36 46
4443 46 17 1 23 -11 5 7 20 37 5 -1 -28 -7 12 8 36 -2 23 -15 20 -16 3 -25 -27 -41 -15 -23 22 41 47 44 11 38 -10 -8
4477 -8 34 -28 -19 49 37 21 -11 -20 45 50 23 2 -3 -15 26 -46 -20 -17 -26 -49 -1 -15 7 24 -2 -32 21 24 19 -53 32 22 -65 43
4511 43 20 12 18 -61 -48 -34 0 32 -4 -33 -3 55 46 4 28 44 55 -42 15 30 -34 10 -12 17 -18 -7 17 -21 -20 -7 7 30
4543 30 32 27 7 30 0 20 15 3 27 -57 16 -22 8 -40 -1 -15 -32 59 44 50 29 -3 -17 40 65 -41 33 -22 23 -29 -25 31
4575 31 42 14 31 -30 -26 15 -53 -61 21 -25 8 61 -11 0 14 -24 20 0 -19 13 -32 10 5 34 84 85 23 -50 45 31 -18 -13 3
4608 3 47 -93 27 -8 -7 27 -18 -31 19 1 34 -3 3 86 44 21 -4 -21 17 27 -30 4 4 -19 64 12 -9 -25 43 -51 -53 56
4640 56 4 9 -27 -30 53 -1 8 -6 -37 8 22 -53 5 -25 -38 -6 21 -15 -26 53 -61 -10 26 1 -30 -62 -27 1 7 12 28 1
4672 1 -7 -14 10 -32 25 57 17 -11 -7 49 61 -21 -50 2 3 -52 11 10 34 49 31 7 0 5 16 -73 15 44 29 34 1 -34 49 -34 -69
4707 -69 21 5 2 -5 5 -9 -23 22 13 21 -50 -6 31 8 55 17 22 11 -21 29 50 58 -33 -18 32 -26 -27 -23 48 13 10 -32 36 -3 24
4742 24 -1 -30 -30 12 -11 -61 15 16 17 -7 44 -31 -10 -1 39 -56 -29 -14 -25 -4 3 17 32 21 10 45 -35 49 8 -13 16 -5 -8
4775 -8 -26 22 -48 42 -15 -6 -64 -27 31 -40 38 4 35 1 -49 -29 -61 -18 3 -55 -43 24 -17 -9 22 0 10 -34 -4 -29 29 51
4807 51 6 25 -40 22 -30 25 8 23 5 15 3 8 68 16 -23 1 58 43 -15 -25 -41 -5 7 52 -48 3 -24 -43 -1 -4 -13
4838 -13 10 12 -22 -7 11 -44 3 6 21 16 30 -82 -25 -4 31 48 28 -15 -16 -36 -16 -17 28 -10 -24 -9 16 39 -23 -9 -62 28
4870 28 -24 12 18 1 22 -30 -2 0 42 4 19 -12 -2 12 -10 88 -11 -18 -16 -32 1 -7 -49 2 28 -56 60 -14 -36 20 17 -10 15
4903 15 44 56 -8 -60 44 -43 12 8 2 -46 21 5 85 -46 13 -34 -32 18 -7 -16 11 -5 63 39 22 32 5 -44 18 -28 -17
4934 -17 -48 -46 0 75 -1 -7 -66 36 -13 26 37 43 -31 -13 1 -42 25 -60 2 54 15 -39 -20 -46 5 -47 3 20 -1 -22 58
4965 58 -23 2 -36 -45 -15 38 -9 -17 15 9 21 -9 15 -6 -16 31 -4 31 53 50 8 20 72 16 23 13 10 62 -41 -40 9 -5 25
4998 25 31 -44 -25 -28 -20 -35 40 15 -1 -7 3 3 9 0 -8 52 -23 50 -7 -25 54 -20 34 19 4 -19 5 8 -28 8 14 -31 -21 -18 3 75
5034 75 6 -17 11 30 -20 25 -40 -11 -15 -9 -4 -67 4 -52 -58 -38 -48 -33 42 -26 -38 -26 8 -74 48 12 28 -21 30 39 22 -1
5066 -1 30 -20 -3 8 22 20 24 4 -46 -17 92 23 12 -31 -29 -42 81 -6 -18 58 5 -13 5 11 -6 -29 -33 27 -18 43 -2 10
5098 10 8 -35 0 -25 -23 9 16 22 -20 -10 -25 -52 -35 18 47 44 7 16 50 -44 -27 49 -17 -36 -34 -22 24 -2 24 17 -33 -51 -23 22
5132 22 41 15 -18 -37 6 58 3 -34 36 27 12 39 30 3 -6 25 91 4 11 42 -34 -24 -3 -29 -11 -7 -8 9 30 -14 -22 7 -32 -35
5166 -35 -49 -25 -9 -20 -26 -2 -9 33 -26 17 -35 23 -3 -33 -25 -30 -69 -17 -9 32 -22 -6 22 13 14 12 -18 46 66 -2 23 -22 82 20
5200 20 64 46 32 56 -17 -49 -30 -58 67 11 28 1 8 25 -10 29 4 35 -16 -77 12 50 19 -13 1 -17 -34 25 37 31 -20
5231 -20 -50 -17 16 53 49 -14 14 33 12 -6 6 7 -28 -19 -14 -7 -21 61 -14 21 9 48 -24 -32 11 27 -11 -9 -54 -21 10 8 -11 -12 -31
5266 -31 7 4 -36 5 -35 66 -14 -17 25 43 24 32 -39 33 22 11 -13 -40 -5 17 0 -26 62 -17 -26 32 45 17 -17 3 14 -64
5298 -64 22 12 30 -41 59 -39 -70 23 16 -97 6 -30 7 9 -34 -22 7 -31 -11 -18 -25 -7 38 11 29 4 -28 -13 -47 -18 -35
5329 -35 3 34 -55 -46 -18 -15 -22 -2 43 5 -26 45 -19 1 12 -14 19 -38 -11 -14 -18 -44 -65 26 7 -6 11 -13 -17 -17 -5 2 22 18 4
5364 4 -12 -23 -22 41 45 8 -13 -66 -9 52 -56 57 52 -39 6 5 -13 13 3 -3 -4 -15 -12 -60 -14 -9 -25 -2 0 -48 36 9 -35 -14
5398 -14 -52 -75 -26 8 -16 -32 43 38 30 12 -6 28 69 8 -35 22 24 -16 -35 -4 -34 19 -2 -21 18 44 -61 14 -58 -46 2
5429 2 -8 -50 -31 -88 -18 -4 -23 50 26 -77 33 58 -20 -11 -22 -29 -26 -77 -12 1 25 30 -17 -4 46 27 46 -4 -15 11 -25 41
5461 41 8 2 -11 20 -53 -15 8 -27 -39 -9 33 4 9 26 45 -28 -50 2 18 -19 49 20 -32 32 -11 1 -22 42 -19 61 -31
5492 -31 13 14 -38 34 8 71 21 49 -13 -4 -23 0 -12 -19 26 -3 4 30 -14 -63 -24 13 -32 1 -34 34 -26 -47 -50 -15 0 -19 16
5525 16 27 -1 49 -29 27 18 -10 21 3 -30 -15 -42 10 8 6 56 -30 -73 25 -5 46 5 -69 -5 14 25 35 -33 7 -14 -21 9
5557 9 12 -17 -44 -27 -13 -2 4 -1 17 8 -46 23 -9 -34 36 31 -55 0 1 10 13 50 -31 -24 -13 35 -41 -30 16 37 28 7 -55 -10 -3 -14
5593 -14 -36 53 -44 -22 -27 14 -38 -12 17 21 -73 15 -13 16 -34 -15 38 -27 25 -53 6 4 12 71 -5 18 -12 -18 -39 -19 -59 9 6
5626 6 -14 -6 -57 10 17 -7 -27 0 10 -47 13 -42 -16 13 23 -34 -30 -37 23 -8 -44 28 16 -1 39 -11 -1 -7 36 18 16 -27 0 10
5660 10 -4 -29 -6 -15 34 -3 12 -12 -26 -35 -14 42 20 -38 -55 -23 -18 21 -25 -25 76 -1 4 -10 32 -17 -21 27 -4 -67 -13 63 -23
5693 -23 1 6 13 0 74 -14 -9 23 15 10 54 27 67 22 -19 31 19 -31 23 -7 -13 -2 15 -6 -71 10 -14 16 -6 28 3 -2 27 -22
5727 -22 -38 2 57 -1 -24 23 -28 -35 68 -15 -12 46 12 39 -12 37 -74 -55 25 -29 -24 -45 -5 -37 66 -3 15 -12 -12 -28 -45
5758 -45 30 -34 -16 -37 17 0 54 12 -3 48 -9 -84 45 24 35 2 -12 -14 -20 11 -67 7 -39 -45 20 11 -6 -27 85 38 -13
5789 -13 3 -17 -4 -10 49 -6 15 42 -44 58 0 -10 2 -11 -42 -5 38 -8 -26 -1 31 5 -65 16 -28 20 0 -25 -40 -40 -7
5820 -7 -49 40 27 81 -20 50 -13 10 -19 3 29 17 16 -28 34 -28 5 -21 -8 10 -12 47 -27 8 20 -19 -39 15 -6 -12 15
5851 15 19 -5 -38 0 64 -27 -13 -50 3 17 16 -26 39 -30 -48 -3 -66 -31 -30 -45 30 -21 49 34 23 -9 38 2 9 -23 -27 -29 -49
5884 -49 31 -15 30 -3 -63 19 18 -63 -60 -6 19 34 7 33 -21 13 -11 19 12 -29 7 -27 17 -10 0 -18 25 -2 4 -4 33 5 25
5917 25 -2 -1 59 -12 -25 28 -32 45 45 11 -21 -13 32 -1 11 -19 9 -14 -9 3 3 -32 -61 -44 -15 -43 -7 -30 5 -56 -3 -33 -7
5950 -7 36 13 7 64 1 -22 -34 -75 6 45 12 7 -61 -9 -7 -47 10 -3 29 11 16 17 -22 52 22 -7 38 1 -35 2 42 -5 -27
5983 -27 -16 -56 12 -9 2 5 36 -39 12 -24 -31 -28 33 -8 38 12 9 91 -61 -60 -43 -11 -18 24 -34 -4 -39 -43 -7 -27 -40 4 22
6016 22 -11 -40 -2 -21 7 -49 20 32 11 18 24 14 -6 40 58 5 29 -101 26 -28 13 4 -35 -4 16 -14 49 39 -37 -6 -14
6047 -14 -22 40 14 5 2 -4 9 -30 3 -43 -34 9 0 -2 -32 -31 -22 -1 -28 5 -41 4 36 -10 10 -64 -35 -46 49 -2 -16 -8 -5 -50 25 -4
6083 -4 52 -27 -50 -6 3 41 37 0 -12 -6 4 4 26 -29 -6 23 -4 41 27 -39 -28 2 16 32 -20 -3 19 -27 27 -16 -7 -37 -27
6116 -27 11 16 23 -19 20 40 87 8 -22 21 13 -49 21 32 -8 9 22 36 -43 -61 -54 18 -36 -4 64 -22 -15 -41 -24 12 46 6 1
6149 1 -18 11 15 12 -61 -33 -31 40 -32 -42 18 -12 -2 22 2 57 -14 -9 22 -2 -31 -44 -2 -30 16 -11 51 -15 -22 7 22 -36 -4
6182 -4 -48 -19 34 -10 8 24 7 -48 -27 -17 3 -21 -9 -30 -52 1 6 4 -11 -19 -33 -15 25 39 -12 40 4 20 25 2 -39 51 -25
6215 -25 0 -2 4 -17 -9 44 -9 33 59 -4 27 -1 -10 60 17 -1 37 -38 17 -11 12 -17 49 22 6 24 19 14 37 17 -23 -11 -28
6248 -28 -83 -45 1 -11 -2 38 -22 -39 -10 35 31 6 27 -50 42 -28 4 -1 35 13 48 8 -22 3 -13 5 20 12 -22 -50 -12 -12 -5
6281 -5 3 -3 -45 27 1 52 -12 -10 -37 -4 23 45 -22 28 -22 10 12 0 26 -33 23 25 17 4 2 1 -60 8 -27 34 -8 -25 32 11 55
6316 55 14 16 -11 41 23 -35 -20 -4 -37 34 39 -21 -36 -9 -27 -25 2 54 -19 -4 33 23 -19 6 11 23 -15 19 -26 -14 -40 -28
6348 -28 4 -32 27 45 22 -42 5 0 43 -40 -18 18 -35 0 13 4 13 0 -3 -37 -12 -3 -10 -47 -9 -4 -53 -18 34 7 -2 51 -25 -43
6382 -43 8 -25 -1 38 -21 44 9 17 -12 57 -4 -29 -37 3 14 10 4 -38 -2 22 -4 18 -22 15 15 -37 -17 50 -28 12 -24 -23 22
6415 22 -8 36 -14 -5 -20 19 45 -26 6 20 -25 49 11 36 -50 -3 -1 -44 39 -89 -30 18 -14 -25 19 -18 -40 7 12 12 -20 2
6447 2 0 -17 11 -60 -61 76 -35 25 15 10 -70 -13 -5 34 22 -12 7 61 -18 -17 13 34 31 -37 37 38 17 0 27 20 47 21 -24 -66
6481 -66 -39 -43 6 -8 -6 -51 36 2 -53 25 0 42 -6 11 20 29 27 -18 22 -9 15 -21 -5 26 -1 13 39 -2 -41 -27 -30 -23 3 -40
6515 -40 -12 20 -13 -5 -22 12 -54 25 -34 -4 9 22 -29 -12 10 22 -82 5 27 -50 -12 -20 64 -15 49 -63 -42 -16 -14 -28 48
6546 48 0 -3 -36 21 -9 -12 9 19 -20 18 -8 17 28 -3 31 11 13 -11 -6 -18 -22 39 -17 -11 11 -15 29 41 -48 7 57 -41 -6
6579 -6 4 41 -25 19 -15 -8 -4 -54 9 -14 0 8 10 -30 -55 12 27 73 -34 48 20 2 -11 13 28 17 -22 -39 -45 18 2 -30 -10
6612 -10 7 14 -35 -10 32 -15 4 -66 -32 -67 -80 24 51 14 46 40 6 -10 -16 -26 2 17 -29 12 -42 50 44 -17 -24 42 3 -32
6644 -32 -13 -15 -7 5 62 -8 2 -42 4 -43 -16 -6 -37 -52 -39 24 17 -31 10 -23 -9 -28 -14 -14 -53 4 45 22 -6 51 -15 0
6676 0 39 24 6 -9 15 -6 -6 -5 -30 40 22 -25 -4 -4 42 37 -23 24 34 23 -20 5 -16 -11 58 1 -26 22 46 12 -28 -74 57
6709 57 -29 -5 -15 -29 11 -18 -33 -12 10 -15 -15 -18 0 -9 0 -31 5 -19 -43 25 -16 -37 -24 -23 41 10 32 12 0 -55 -3 -49 -14
6742 -14 -13 50 3 -11 34 -10 30 -18 20 30 -8 3 -60 -24 -21 -6 -19 -19 14 -3 1 35 -33 9 -23 -4 -25 8 21 -41 28 28 6
6775 6 -1 6 28 -27 -4 -24 -10 -15 -18 -4 2 -23 0 -7 -13 -24 -17 62 -29 47 26 25 -58 -3 20 25 0 -43 47 28 0 -32 10 1 0 -16 44
6812 44 76 11 -12 -26 -2 2 3 12 -4 39 -10 -7 -39 -41 11 -47 1 12 15 10 -6 17 18 8 -13 8 -2 -17 -3 20 -3 49 18 -17
6846 -17 18 8 -9 11 -38 60 18 -2 -38 -45 9 -28 -3 -1 -32 20 5 30 18 -14 3 9 11 -15 -19 -7 0 0 26 26 3 10 20 28 40
6881 40 -6 47 -39 16 -14 36 23 36 5 -9 -13 32 23 -32 -43 -50 13 -22 -68 -8 -6 -54 54 10 -19 49 27 24 9 43 -6 -2 -5
6914 -5 38 19 -3 -16 21 -24 2 -47 -9 -1 -27 23 33 28 25 -14 -41 40 -36 -4 -12 24 44 59 -1 -43 13 17 4 -10 42 80 25
6947 25 36 -21 18 59 1 27 -55 -18 46 1 34 -5 6 41 3 -4 -33 19 50 4 16 47 -31 11 16 -1 -19 4 -32 -33 19 -26
6979 -26 -14 4 11 63 -4 -13 -3 -1 45 8 -50 -1 25 3 -3 38 -26 -11 9 19 8 3 -25 -9 -39 -5 -16 -15 23 -28 -1 -5 36 43
7013 43 -9 -33 -16 -10 -16 -14 -4 -21 13 16 11 -59 -11 -46 9 47 33 33 -41 -53 11 -9 -32 -5 -29 17 -34 18 51 20 -27 17 -7
7046 -7 40 -33 -45 79 -14 -10 -28 3 20 32 -43 -43 -46 -3 0 52 14 -15 33 19 -32 -18 -26 -62 -23 -65 -8 -50 -15 24 -39 -33 9
7079 9 -20 22 -7 25 -27 38 7 0 -58 -27 -75 -39 50 -22 31 58 14 7 8 -4 17 6 3 41 22 2 17 -16 40 -7 -8 35 -27
7112 -27 -15 30 -34 3 -26 -50 13 -25 -5 -35 -45 -32 -7 26 13 -42 -54 54 42 -22 -19 -1 15 23 42 -33 -46 1 14 5 34
7143 34 -48 -18 -11 13 -1 -18 -76 10 7 -37 2 -37 1 -24 -45 -19 29 16 0 3 12 9 -35 -16 -59 -9 47 -25 21 50 16 -50 7
7176 7 -44 -22 -3 -40 14 42 -37 18 -19 -58 8 -7 -32 -16 -45 -4 -34 2 8 17 -24 -16 33 -13 -21 0 -22 37 -13 27 -9 20 -65
7209 -65 -28 27 2 34 -37 36 -8 -40 65 30 4 33 -39 -4 -11 -6 31 -45 32 -43 41 28 -3 13 64 8 21 -11 27 -2 2
7240 2 -30 46 -14 -18 -36 -45 28 -40 49 -54 6 -1 29 -40 48 8 -40 -20 21 -13 21 -15 19 5 -40 42 -53 -47 5 16 -8 49
7272 49 -28 63 -69 10 -3 -17 1 2 -1 -9 10 -30 10 -51 -18 24 -77 -1 36 -23 -39 -17 -31 -28 -22 -6 6 43 -7 -72 11 -16
7304 -16 -32 42 4 2 28 50 -15 3 61 17 9 -13 -23 -13 50 13 -17 -42 58 -11 40 23 20 1 38 -14 7 -3 31 -71 -5
7335 -5 -22 3 -21 -16 -14 -34 -28 -17 6 -1 29 -2 43 -14 46 -10 15 15 -46 -37 -7 9 -37 14 -6 43 -23 -45 -21 -47 17 7 -10 10
7369 10 19 -29 -49 -6 -14 -31 7 17 16 18 12 -54 2 9 -24 17 43 -3 12 22 -7 -27 -12 21 55 -19 -3 11 -4 24 15 4 43 10
7403 10 2 32 35 25 11 -30 59 17 14 5 -43 -26 -22 9 -17 -7 -19 13 -64 64 22 14 30 -34 2 15 14 -21 18 36 47 31 -5
7436 -5 1 10 -26 1 8 -27 24 -19 -74 -25 -23 1 28 57 -42 -3 -18 15 -23 37 6 -48 11 1 -37 25 12 -44 30 16 -46 -26 -33
7469 -33 27 -53 -6 -4 -33 -7 74 40 -21 -18 34 16 20 -17 42 -11 -3 33 41 -27 -6 22 -16 -37 -18 -6 23 -10 -18 34 5 13 34 -52
7503 -52 -83 30 -60 1 -32 15 -43 6 10 -8 12 11 8 24 -50 -34 25 -7 20 -29 18 13 50 5 13 47 -44 -15 -2 60 -45 -3
7535 -3 -23 -7 11 27 -28 2 4 1 -7 -49 -27 -3 -4 40 6 19 -5 21 17 37 -36 -70 20 -66 -32 39 8 -27 30 -17 1 -19 -23 -45
7569 -45 -43 -34 41 18 -22 -47 -28 5 50 -14 -37 -16 -44 45 -46 13 -15 25 -11 -7 -51 -74 -19 -22 -29 -29 30 32 -23 -31 -5 7 -9 21
7603 21 45 -29 25 7 -28 -24 -14 16 40 5 -25 4 -44 9 -1 -22 9 -4 6 -44 -60 -23 11 30 -11 -5 -29 3 -10 -5 -9 40
7635 40 -22 -7 -44 -48 -61 -3 -64 15 5 14 -42 -29 6 -35 25 -3 -26 -61 -8 19 -13 -27 40 -14 -25 -3 1 29 -29 -62 7 -44
7667 -44 -18 -33 5 12 9 46 7 43 -31 2 -26 -15 41 -24 35 -33 29 10 12 26 19 -13 -2 -16 2 -3 69 -3 -73 -8 -55 -17 -1
7700 -1 -7 -41 23 -40 -64 11 23 34 5 31 37 23 7 -17 -3 -7 1 -21 1 -27 -2 42 -28 28 20 27 47 -1 -12 12 -2 -7 -9 41 19
7735 19 -68 21 0 59 8 38 -3 1 17 15 -5 -8 5 -22 -24 -9 -23 -70 15 -29 24 28 40 7 17 -33 14 -19 -4 19 -4 -39 -22
7768 -22 0 -47 48 11 -12 -3 -25 27 -40 24 -36 39 -4 21 -36 14 6 55 -3 -25 -14 -67 -2 9 45 30 14 -23 -60 -20 -43
7799 -43 -36 45 10 47 -33 -22 16 38 14 -11 0 -16 -42 65 -19 30 11 -26 7 -49 1 -41 -29 -40 10 -37 -38 -17 -1 8 6 10
7831 10 -25 -10 -17 -48 17 -73 11 6 0 31 -12 -41 19 31 18 1 -2 -38 9 -47 1 -42 12 10 -18 35 -37 -28 35 -19 3 13 -9
7864 -9 2 -21 10 -18 -28 -31 -30 -22 -1 24 6 38 14 -16 12 17 -32 30 -25 -26 -21 22 2 -21 62 31 -25 -6 49 -45 -19 21 -7 37
7898 37 27 48 -16 -5 -18 0 44 -7 -10 17 -17 -16 61 -47 -10 -8 -18 4 20 13 -42 -27 -8 -7 0 -41 -37 29 -45 23 25 7 10 -11
7932 -11 -24 26 4 -21 24 -26 -48 30 15 14 9 -13 -13 -17 -22 -23 11 10 -3 12 1 24 -34 -38 -26 15 17 6 63 -15 -12 3 13 -29 23
7967 23 9 27 -7 15 18 -6 37 10 4 -33 24 36 -8 5 -10 49 75 20 44 38 16 34 34 -4 37 -23 30 22 -5 -11 20 17 -5 -62
8001 -62 43 20 -3 -22 46 -29 7 21 40 -42 22 -1 22 -5 -35 -37 15 73 51 37 26 39 -13 26 -35 -4 -31 8 -19 5
8031 5 -13 32 15 41 24 -33 -8 -23 53 38 39 -20 5 -18 2 75 -7 -9 58 57 -16 15 -20 15 -13 57 6 11 2 20 -16 38 -6
8064 -6 -15 13 -15 33 -1 13 -7 -15 -2 -18 55 10 58 -20 17 25 -13 -55 30 -8 3 -10 18 -33 3 26 -12 -5 -6 40 -19 20 -37
8097 -37 -4 -31 4 30 -11 -42 5 -16 -8 7 32 25 33 -22 -2 73 -5 17 10 -5 19 -19 -14 17 5 -3 12 39 -65 2 53 -15 43
8130 43 -6 35 37 -40 35 18 0 12 -9 14 2 26 -16 -1 -41 -41 -35 -11 78 -2 40 25 -46 0 2 -25 -14 -4 -47 -8 4 -24
8162 -24 -18 -7 19 -17 -16 68 -3 7 7 -18 -12 42 41 -9 46 -29 8 9 -3 3 -47 -22 19 6 25 23 -3 58 -29
8191b9
$$ Imaginary data points
##PAGE= N=2
##DATA TABLE= (X++(I..I)), XYDATA
0 0 0 0 0 0 0 0 0 0 0 0 0 0 0 0 0 0 0 0 -8 8 -8 8 -8 8 -16 16 -16 24 -24 24 -32 35 -40 48 -51 56 -64 72 -80 91
40 91 -104 112 -126 139 -152 169 -187 206 -227 251 -275 305 -335 371 -410 451 -504 560 -626 705
60 705 -800 916 -1062 1255 -1516 1901 -2512 3659 -6534 31063 35559 -13621 10612 17106 -2941
75 -2941 -11459 642 -9873 -18035 -13111 -10271 -16783 -8212 -1573 -5259 -4029 4842 1647 452 7876
90 7876 10668 5000 7313 14937 12905 798 -1515 3456 511 -4822 -3916 -8165 -13841 -8175 -749
105 -749 -5049 -7320 1718 5791 61 1939 7602 4045 2032 6160 2988 -2453 1342 3797 -1724
120 -1724 -3818 -277 -585 -2750 -1236 -1840 -4996 -2290 2233 64 -2265 606 3010 2170 1489 2149
136 2149 1820 481 748 231 -2566 -2648 -130 -835 -2789 -1316 796 124 -41 1758 1307 -237 1680
153 1680 2583 -607 -687 1752 257 -1197 436 90 -1961 -1095 288 -1370 -2611 -430 439 -1108 -447
170 -447 923 465 1121 2232 1096 514 1472 1539 8 -732 20 -24 -1183 -1019 -664 -1346 -968 -16 -560
189 -560 -1121 -183 525 -132 -246 822 885 99 1032 1632 83 336 1556 335 -837 -5 342 -1035 -1316
208 -1316 -287 -475 -1295 -385 188 -548 -78 617 23 133 913 462 -92 579 991 97 -315 614 572 -604
228 -604 -479 200 -555 -885 -325 -356 -768 -361 305 82 -274 606 922 75 419 918 147 -123 448 -31 -640
249 -640 -185 199 -469 -851 -19 218 -672 -253 400 -95 -92 260 248 144 363 441 107 87 451 89 -429 -105
271 -105 52 -621 -552 -16 -298 -598 -23 247 -81 -73 559 451 -17 402 644 27 -97 188 -79 -313 -193
292 -193 -208 -381 -293 -50 -165 -391 106 266 -201 68 430 178 74 237 274 2 12 156 19 -272 -33 -45
314 -45 -449 -251 -6 -293 -336 -38 2 -49 115 320 137 75 445 301 -148 50 264 -141 -300 -53 -19 -299
336 -299 -214 6 -74 -117 77 21 -125 93 179 -66 54 174 100 -92 17 146 -70 -114 69 -36 -239 42 101
359 101 -226 -151 112 4 -52 49 176 39 32 139 108 -41 149 101 -216 -33 121 -65 -148 6 94 -45 -64
382 -64 103 9 -115 60 -9 -76 -14 26 -33 -70 60 22 -30 -7 0 -29 -61 74 49 -100 31 146 -83 -43 71 73 -83
409 -83 -34 131 4 -65 25 26 -91 23 68 9 -75 60 68 -51 -13 93 27 -60 41 29 -58 29 35 -19 -58 27 -38 -103
437 -103 -12 63 -23 -25 26 13 -91 9 94 -50 26 31 23 -37 50 29 -6 19 47 12 -88 38 1 -76 -44 42 -67 -13 22
466 22 19 -19 17 -12 47 -61 39 42 -27 10 -38 -55 -32 39 -29 -68 -10 10 5 -39 20 -10 -28 3 -14 59 -17 78 45 -27 44
497 44 59 44 -52 84 56 -56 -3 30 -61 -26 15 -41 -6 12 39 -46 -42 51 -2 -22 1 8 -23 22 -47 -28 -25 -19 -8 -47 -32 16
529 16 16 9 39 7 9 24 48 1 1 40 55 -5 -14 18 -41 -81 -6 -35 -55 -22 -27 -1 -18 -17 23 -36 -35 -40 76 -46 6 -47 -48 -32 -4
564 -4 -2 -6 36 -19 -17 -29 5 -14 -36 6 1 -46 50 10 -4 -14 -11 16 26 10 -39 -27 -39 -7 50 8 -24 35 23 51 -2 11 17 -7
598 -7 0 -2 -7 23 12 -47 11 45 17 -26 36 53 -34 -28 -34 53 33 21 5 -6 -11 46 4 36 -12 -17 -20 -3 46 -23 -44 19 7 23 -27
633 -27 -33 -41 -22 17 9 33 -31 10 -11 16 -10 22 -24 -37 40 -13 20 -11 17 33 -49 -8 2 -4 -57 -5 17 80 -16 -40 15 47 19
666 19 8 20 50 -11 61 20 29 -23 -13 -8 -9 -79 -37 -66 -35 -27 -4 6 23 21 72 70 30 -68 -14 12 -31 33 -49 8 -2 -16 -6 13
700 13 -32 -4 -11 6 37 45 36 -18 23 17 -4 73 -9 -5 -28 22 -22 16 -39 -41 6 -92 -35 -16 -51 9 11 -19 -5 -3 30 -41 27 -26 -46
735 -46 11 -42 59 18 -33 36 22 -29 32 48 -14 -42 -15 6 44 7 49 -36 1 56 32 57 -16 -29 -15 -12 -33 13 -10 -49 -12
766 -12 0 -29 13 12 -4 7 10 -1 2 -22 2 -6 7 -10 -17 -25 34 27 3 11 -1 -4 25 -11 28 -35 32 43 25 -4 -15 -1 -5 8 -8 14
802 14 -48 25 -15 -53 -51 -42 48 12 -23 -6 -43 -37 26 -3 -26 -9 6 -19 1 33 -81 11 37 36 15 27 32 8 -31 28 -14 28 7
835 7 40 46 44 41 27 -22 6 45 -14 -51 20 22 -5 -20 10 43 -18 9 -48 -17 -11 21 -43 -16 40 -39 23 20 -19 -4 -26 13 46 -14
869 -14 10 21 2 44 39 13 -19 0 2 5 56 -19 25 -41 -33 15 -22 40 52 16 -36 -24 26 -16 30 -20 -44 -7 2 6 34 8 -23 -83
903 -83 -31 81 -29 -1 -34 13 16 18 12 -4 -5 72 73 -5 -3 28 -15 -9 1 33 54 -8 8 54 -26 -53 -35 25 -5 32 -15 -20 -34 -41
937 -41 -49 -16 -10 21 -24 20 -15 -28 37 47 9 2 -26 -15 -24 -35 30 9 65 -22 -42 11 31 25 -9 22 -25 -6 5 14 9 -46 60 -1
971 -1 -57 -5 68 15 -1 25 16 30 19 -36 42 -60 -32 -28 -7 -24 -55 42 -20 -5 -23 7 55 -19 -33 83 13 4 33 62 21 90
1003 90 18 -8 60 -33 -21 -48 -11 -6 69 3 33 15 -2 62 -3 -16 23 -28 -6 -53 -19 40 -34 -20 1 -55 -6 55 11 12 -3
1034 -3 29 -44 -14 -30 34 25 3 -9 16 74 55 54 12 15 48 13 37 12 53 7 48 -23 28 -41 -23 -33 -21 38 -15 -15 -11 -13 -2 -12
1068 -12 -50 -56 21 -27 -27 10 -43 5 7 26 -9 -15 51 -15 10 12 -3 -19 19 33 -20 71 24 -12 44 11 6 -10 11 -30 13 18 1 -6
1102 -6 -60 -22 -21 -7 -45 -47 42 14 2 62 -21 -12 -17 -2 19 11 14 -15 17 3 -14 83 -45 32 70 -31 61 -5 -31 31 33 24 25 -19
1136 -19 -10 21 -22 31 -38 10 11 20 39 -28 7 31 21 -57 -22 29 -42 -31 5 31 -3 18 65 -15 -59 -17 -18 30 18 67 26 2
1168 2 0 33 -22 -3 -16 29 48 11 79 9 29 14 -19 -45 27 11 10 -36 -7 9 -19 -22 -9 -21 -44 -42 33 21 -77 -50 -25 5 -38
1201 -38 1 25 -13 45 6 -9 10 2 -36 1 4 -32 -6 42 25 17 -63 -4 6 41 28 29 57 43 -18 33 -7 10 -1 -28 18 -70
1233 -70 -5 42 11 -31 52 2 12 -8 14 26 39 -26 15 -4 44 47 22 -20 40 78 21 40 -2 3 -24 64 21 35 59 58 -38 -4
1265 -4 31 13 -27 -39 28 0 -39 25 12 -17 -14 -65 25 -39 9 -38 -38 -7 3 38 -16 -2 -32 10 44 32 32 57 33 43 -17 24
1297 24 -2 23 26 69 18 -18 13 -34 2 -49 19 -7 31 6 15 -8 -43 76 -73 -30 -25 -44 23 -48 -36 7 -9 15 -29 -22 -15 -19
1329 -19 12 13 -42 22 11 -84 4 15 10 60 -32 -32 -16 2 20 -10 -7 26 11 5 -21 23 -27 -8 13 9 -64 8 21 -58 -14 -12 -26 -36
1363 -36 36 23 25 3 -41 -10 -14 11 15 60 16 25 49 -3 -29 -53 38 -2 45 -16 11 24 17 -61 31 20 -2 41 -6 4 -16 -33 9
1396 9 -17 -30 -30 16 14 -12 -44 -66 -30 39 27 -29 -41 0 -30 -18 -46 2 4 -28 25 29 16 -43 -45 -37 -70 -33 41 2 13 38 41 11
1430 11 -9 70 26 -20 2 1 -10 10 -26 34 17 7 -37 -2 -88 26 -34 -58 -28 16 61 -33 3 -20 -17 -23 72 -57 15 28 5
1461 5 -28 30 30 5 -4 77 -21 9 34 14 -29 -36 -9 23 6 -1 14 35 48 15 11 -16 -36 -26 -68 29 -24 12 4 -21 27 -13 -15 -22 -19
1496 -19 15 9 27 15 19 23 17 43 -21 -9 21 -14 24 -63 35 -1 -25 -4 21 15 42 4 -38 -11 3 42 -29 -26 -4 -13 23 -3 -6 6
1530 6 21 -23 46 -22 -27 -21 -19 22 -40 -54 17 10 12 -58 21 -9 -5 39 23 34 45 40 61 6 -13 2 5 41 55 45 24 -14 -1 56 -12
1565 -12 14 15 14 12 -26 17 29 -73 -51 -32 -45 -52 3 3 -5 -6 -29 25 2 12 30 64 -1 50 16 22 9 -3 49 51 4 75 6 60
1599 60 17 -23 -5 -10 12 -23 52 -22 -12 6 -94 38 -8 -2 -13 -57 -12 -6 9 3 -17 -23 12 -44 -70 7 17 8 22 -27 0 -25
1631 -25 -18 24 -19 56 3 6 46 -98 -12 47 23 13 17 -84 11 -21 2 -22 34 -11 -9 -2 -12 18 -25 10 4 25 30 18 -48 15 -28
1664 -28 25 -63 10 -39 42 43 5 56 38 8 18 23 12 35 55 39 -27 -28 10 -37 -17 -55 31 66 26 11 -53 -52 -54 -14 21 7 -17
1697 -17 -22 -36 18 -30 12 -11 26 3 -33 4 -5 -13 9 40 -7 18 -41 36 20 11 58 -21 49 27 68 0 -21 7 28 2 -9 6
1729 6 19 56 -47 10 -60 -21 20 6 12 -10 25 -46 -16 -10 48 9 -11 32 55 -2 23 61 -33 12 -18 -7 -19 -3 24 28 23 14 16
1762 16 -22 -1 44 -75 -26 -10 -7 -7 -11 7 -54 -9 16 50 35 -18 20 -29 23 -15 55 49 -23 -19 -42 -25 -33 9 -4 -57 12 68 51
1795 51 16 16 -23 68 -11 85 33 31 -3 -5 27 -38 12 20 11 -4 -4 -32 4 34 8 -52 -5 25 -13 13 -45 -24 -19 13 16 -7 -45 -24
1829 -24 18 -9 -22 -37 -1 66 -2 50 19 -16 -4 -65 67 -12 41 -28 -25 45 29 25 6 2 -10 4 21 17 -13 -33 13 -12 62 8
1861 8 -2 -31 -19 -15 11 21 -27 -10 1 4 -6 20 -49 -46 7 -17 17 26 -6 23 30 31 14 84 8 -42 8 32 17 -33 -20 13 60 -3
1895 -3 55 -20 -19 -30 -10 1 -56 6 -5 -16 75 5 34 -3 31 -8 -57 49 -25 9 -23 5 48 5 -33 12 12 22 14 -17 50 30
1927 30 -3 49 66 18 -23 -46 -46 -22 -39 -6 -6 -62 7 5 6 -11 14 4 9 3 -24 14 36 33 -55 -61 -23 -2 -28 42 5 -27 -31 -8 -34
1962 -34 -17 -51 -18 -12 28 33 -8 83 -15 77 -1 -4 7 -5 14 -59 76 20 -11 12 11 9 5 9 -10 -36 -5 4 7 -55 -45 29 8 -28
1996 -28 -7 -20 1 -31 33 36 -4 -36 -58 39 78 45 -47 -11 4 5 -28 47 -11 55 -6 0 -22 -7 1 5 24 30 -39 16 -16 -5 -46
2029 -46 12 -21 -19 -11 -23 -13 30 -24 -15 17 -25 -23 2 -47 3 -21 -14 21 20 18 -22 8 17 40 -10 0 47 5 33 19 9 37 3 64
2063 64 55 -32 -14 11 -6 -17 -51 22 44 78 -34 23 37 -34 16 -17 -26 -4 24 24 -3 39 4 -40 -3 -11 21 32 25 29 55 -2 -54
2096 -54 17 19 53 -27 51 -3 24 21 2 19 -36 -12 -12 -78 8 -12 -25 17 -35 -17 -8 28 -60 8 -63 -47 -16 18 -43 -2 -8 0 -1 -11
2130 -11 -33 12 36 -33 -5 -10 -4 19 1 44 8 23 74 -64 15 52 -37 12 1 -31 5 19 7 -26 52 -15 -19 -36 40 -12 72
2161 72 -19 -29 -69 -5 0 -22 -17 -34 -11 36 11 -5 -30 21 -5 -8 -36 16 17 32 0 16 6 -18 45 -17 -6 48 80 39 27 13
2193 13 30 -5 -13 16 34 13 50 -44 18 10 3 10 -6 15 -36 22 35 0 36 -32 -6 21 36 35 -17 18 1 -19 -14 -24 46 46 28 17
2227 17 -17 4 20 -10 30 27 32 -23 -31 -25 37 -51 13 -37 -32 -36 22 50 -36 -1 -31 -36 -21 -19 -51 -90 -53 8 17 -15 0 8 25 -40 -26
2262 -26 29 17 34 -38 -4 2 31 18 40 29 36 -19 18 10 -13 36 18 74 28 61 13 -6 -31 -8 -19 -8 -29 -47 -8 28 -28 3
2294 3 39 -57 -5 7 -34 15 55 50 -37 78 15 62 3 5 5 56 -1 63 -35 19 73 1 -26 4 64 11 23 -43 20 10 7 -44
2326 -44 -15 -8 -44 -26 -6 -21 -26 -67 -59 -5 5 -17 31 10 68 16 -3 -22 28 -6 19 51 98 40 17 -35 19 27 -36 15 3 -8
2358 -8 4 -26 -26 3 -1 12 -30 24 -53 -65 29 -65 -58 -25 30 -46 -7 -3 1 -34 37 -26 -20 40 6 -14 4 -71 37 31 16 32 31 17
2392 17 11 -17 -40 -54 16 -20 -6 26 32 4 28 66 61 54 19 18 66 -14 7 7 21 -27 -4 2 -6 -52 -43 -10 -49 31 -30 -12 -3 4 27 -29
2428 -29 -38 6 20 7 13 18 61 15 12 43 -36 23 4 35 -48 9 30 12 0 33 6 -1 4 -13 -13 -40 -2 1 -11 30 -61 15 -38 9
2462 9 -43 7 -64 -23 21 30 -32 -27 21 -10 28 -26 17 -36 59 34 7 35 46 12 -4 31 1 51 -1 21 -25 17 16 22 -11 2 3
2495 3 -33 -53 -34 2 -82 -53 23 -13 -45 15 27 -37 44 2 13 -42 4 -24 -26 16 2 43 65 -7 64 28 16 46 -12 -21 20 -24
2527 -24 8 10 8 6 34 -42 -32 19 -5 -12 26 -42 0 -15 16 -6 -16 27 -46 -12 -50 24 -4 29 -12 -41 -40 -37 -3 14 -15 5 45
2560 45 30 -6 7 40 -46 30 15 -21 4 -9 23 25 17 40 0 -33 25 -59 18 -19 21 -2 -38 5 -32 -29 -63 11 -1 50 -4 0
2592 0 16 -47 -23 -20 -27 -4 -32 4 -11 58 32 -77 46 32 -15 -1 10 58 56 5 50 6 70 -27 -12 63 -14 25 31 -38 -27 -19
2624 -19 0 -29 -5 6 21 32 36 70 88 2 28 -39 6 -14 7 -38 0 40 -6 -32 52 1 29 -12 -3 -43 18 48 -59 28 -19
2655 -19 45 19 -25 11 22 -11 10 60 -11 -41 30 -24 4 -14 -27 -41 -31 -62 -8 32 -43 -16 33 21 -19 1 -27 9 -5 15
2685 15 -10 20 -32 29 -53 24 20 -24 -62 29 -4 7 13 8 11 -5 1 18 21 -2 -30 -22 40 -42 -37 -19 -17 -35 -31 7 -34 5 1 -12 -28 -56
2721 -56 11 52 -36 -10 -42 43 8 -1 17 -9 10 -61 -12 34 19 50 -1 -4 10 18 68 -64 -31 -28 14 -37 22 38 -36 -17 1 -12
2753 -12 -16 5 -8 -70 4 21 -34 26 -54 25 3 -25 -31 -1 -11 22 -7 -9 -5 -45 27 -13 23 0 17 24 12 45 43 21 30 32 24 -20 33
2788 33 -29 -12 -66 26 44 56 -71 -77 6 -34 16 21 -3 -28 18 -35 19 -2 60 39 -15 12 -32 27 7 11 -54 -8 24 -5 54
2819 54 19 -42 6 -4 -37 23 60 -40 -10 -46 -5 -31 -48 -23 -41 4 38 3 -13 27 7 20 -35 5 -18 -9 -46 10 18 -19 -33
2850 -33 46 -36 -62 0 23 -37 -1 -15 20 37 13 49 -21 66 14 31 13 36 54 -54 -35 27 -10 5 -18 -6 -22 -32 -16 -9
2880 -9 -37 27 24 9 -1 -15 9 -8 -12 17 51 17 19 17 71 4 -25 4 19 20 24 28 -51 -23 -8 -5 45 36 11 8 6 -6 41 12 -36 -14
2916 -14 -10 -8 -34 -60 -9 -32 -11 -2 13 -5 -83 -15 42 -8 -13 -46 -38 22 -8 -3 -14 -14 18 -7 -20 43 21 -10 -2 23 51 -9 29 12
2950 12 61 9 36 6 -11 -63 -9 -42 -69 -16 9 -71 -38 30 -23 -22 -15 34 -45 -4 6 -17 -12 -10 -33 31 1 -9 84 -11 -13 70 -4
2983 -4 -19 43 16 10 75 68 7 11 -17 40 8 24 18 5 -4 -50 22 5 14 -55 7 -57 -35 -32 23 -28 -20 16 -9 -37 -50 -8 -15 -6 -10 26
3019 26 -24 -13 -41 -39 26 -4 9 82 53 23 -41 20 24 1 4 -41 -37 13 37 -65 -27 66 -65 -3 103 36 15 -19 -2 -15 5
3050 5 -33 -9 -24 4 -3 -25 15 20 3 -16 -32 -50 15 34 -7 1 -8 -9 -35 42 6 8 19 38 -4 31 30 80 33 13 19 20 -56 19 -20
3085 -20 -53 53 -15 12 -21 -58 23 46 -25 20 18 -29 -19 33 26 -15 -19 5 35 22 44 -36 13 -1 6 -30 -21 7 0 -3 17 24 6 -32
3119 -32 2 2 11 -7 2 11 22 40 -6 -25 -12 14 9 22 23 -17 -3 -40 24 9 -25 -74 62 8 -17 9 -44 22 -7 38 -13 24 -15
3152 -15 36 -20 1 49 -35 -63 44 26 -49 3 21 -19 2 3 -13 -25 17 7 -3 -28 3 -8 -11 -30 3 14 -24 36 -32 -11 35
3183 35 -34 -4 -1 -19 -20 -33 -41 15 33 23 -19 16 20 -21 38 -20 33 -21 16 56 -37 24 -22 21 -20 15 -6 -12 -35 -19 -29 11 32
3216 32 34 59 -38 -70 -1 -46 -24 35 -8 -15 11 -19 26 18 4 -53 -60 -20 -7 -40 5 26 47 -25 -38 83 -42 -50 -37 -27 -19 40
3248 40 11 -7 12 -6 -30 -29 49 -14 -21 31 18 14 -5 -27 46 -4 -59 -41 1 -8 -5 36 38 -42 -31 -26 -6 -14 57 38 -19 -22 68 35 27
3283 27 -35 28 22 -7 36 12 44 10 -6 -34 -29 18 15 -20 55 -44 -17 -24 -11 -15 -36 -7 -3 -18 -53 -42 7 -15 -4 -16 -19 -51 -34 -11
3317 -11 -42 15 -5 40 29 43 -6 -14 24 42 -32 2 27 37 -39 -16 -43 10 19 -43 -42 66 -67 12 -23 -41 -10 -20 25 -3 -24
3348 -24 21 25 -47 12 14 -3 29 23 -38 19 -9 46 3 -4 -4 43 17 35 31 37 -52 39 5 -42 52 -10 -18 -12 -8 -75 34 0 -30 -38 -30 21
3384 21 -10 11 -51 -10 -18 2 20 7 -40 6 21 -33 -2 -71 -57 -38 55 16 -45 -3 19 34 24 -20 1 -29 -44 11 73 11 8
3415 8 6 -7 23 53 1 13 0 4 -17 -3 55 -3 -29 5 -19 -31 -63 -7 -61 -19 -37 -14 -73 38 -3 7 -23 5 16 4 -38
3446 -38 -22 48 -34 -36 -2 4 -1 36 23 -23 0 22 23 26 15 -12 -6 -22 -2 -21 38 -17 -17 5 46 -13 19 -22 6 -4 15 7 3 25 6
3481 6 24 -18 9 24 0 -1 22 60 19 -45 1 11 72 29 -12 55 4 3 6 13 64 -23 8 -21 41 -17 22 -32 35 -9 6 9 -45
3514 -45 -9 -49 -45 -34 -20 -38 -29 32 -16 -39 -1 -15 11 46 -20 21 18 39 27 19 67 0 13 9 -36 -2 -14 58 -22 -18 -25 -36 -28 10
3548 10 4 9 -22 20 8 23 -19 -43 -59 -4 52 -46 -33 10 -50 -2 -45 -23 -50 -1 -4 9 -9 -34 11 36 -36 12 61 -18 -2 48
3580 48 5 37 7 0 -29 13 -18 22 23 -19 8 -6 -25 -66 -32 33 26 22 -18 -73 -73 -5 -15 22 -11 -16 4 -26 -28 -34 58 34 9 67
3614 67 -26 -58 36 35 17 -34 13 36 -21 -21 -4 -5 -9 6 16 20 -21 -31 16 39 38 -23 27 23 -5 -2 -12 -53 -25 8 -28 -23 -14 24 13
3649 13 31 -5 -15 -11 -65 19 42 -27 -30 41 10 34 28 -9 39 41 -61 -31 -24 -7 58 2 -10 -12 27 1 -13 -45 5 -27 -30 -8 -11 -41
3683 -41 -7 65 13 -44 37 9 24 11 -13 2 0 5 -3 -27 -10 20 12 31 -22 9 20 -69 35 2 35 18 8 43 -23 0 -7 16
3715 16 36 -64 8 34 8 44 -14 -33 15 -52 -40 -2 -21 -7 -38 -50 62 7 -25 -3 7 8 17 14 5 -36 -5 3 2 26 -14 20
3747 20 36 -3 57 33 -18 -47 64 34 -4 -3 26 87 -74 44 -6 -35 20 58 55 -14 -2 -20 2 7 -32 -3 -4 -31 4 -61 -8
3778 -8 24 12 -9 -12 -12 -51 30 25 -19 15 64 -29 3 32 -19 -26 -1 22 -12 -2 -29 -18 25 -26 -12 26 46 1 2 -3 12 7 -19 -36
3812 -36 -10 -32 -51 3 38 -30 23 -20 -25 18 34 -11 -7 10 -7 -17 -50 26 -8 -13 -5 1 6 13 -28 16 -5 70 23 -19 27 -26 5 -7
3846 -7 -48 18 32 47 -53 17 -48 14 -43 -37 0 -21 32 -3 -41 17 -24 29 14 48 -13 -27 -8 -5 52 40 -5 20 32 22 -3
3877 -3 22 5 -23 45 11 8 18 6 -37 -27 35 -4 7 12 -9 18 -50 -30 -33 24 14 -55 64 13 26 -47 3 -47 32 -13 15 6
3909 6 56 -2 -7 69 8 40 14 -1 14 20 28 13 32 56 75 67 23 -20 -19 -22 17 54 -11 15 -2 -38 -60 -31 43 6 -27 -25 -43 -23
3943 -23 6 1 -21 14 -10 -12 35 -9 13 -16 27 -22 -47 53 -25 16 -10 19 36 -3 29 35 -13 60 9 94 46 7 33 -36 -5
3974 -5 48 39 10 32 20 -35 -16 -29 -27 4 -17 25 -34 30 74 28 46 -24 3 21 28 4 54 18 20 74 -21 29 46 -42 78 39
4006 39 2 16 -17 23 9 -25 -21 8 -56 -41 -32 11 9 -8 -24 42 37 -80 18 23 16 -54 -3 -20 -88 0 33 -49 4 80 -18 -36 11
4039 11 34 -33 40 9 19 25 12 21 -14 -5 31 60 45 -19 -49 56 -3 -22 16 -5 -11 -2 32 34 -30 -22 -17 -28 -39 23 25 -10 -46 28
4073 28 -31 -50 -17 -8 18 -35 25 30 28 -59 27 23 1 32 15 44 16 -22 31 1 32 -22 12 43 39 23 8 -13 22 27 17 9 -14 51
4107 51 60 34 -52 -8 6 -29 -14 17 -18 49 -54 -42 -24 -6 -5 -39 49 3 -5 79 4 -57 -15 -11 28 -60 25 46 25 -6 54 7
4139 7 21 27 -21 -38 -9 -2 48 27 -4 -14 15 -24 -5 -34 -8 -49 41 -15 1 22 -31 38 -1 30 49 18 -3 20 32 -4 -36 12
4171 12 15 15 -7 -7 -11 30 -9 -52 38 -2 -8 9 -21 16 27 1 -23 0 28 -27 5 43 -21 -27 -47 27 1 21 19 32 -31 16 9 -11
4205 -11 6 26 -15 -14 -4 53 51 6 31 -17 -4 -30 52 -9 -9 41 18 35 65 7 4 1 18 -37 4 -28 7 46 -25 -22 19 -66 2
4238 2 44 -14 2 10 -12 5 -12 -8 -24 0 -6 85 6 33 11 -25 19 47 -18 -17 25 -51 -29 27 -6 35 42 11 14 -9 18 -54 -52 -34
4272 -34 -20 16 12 -67 -23 -45 22 -8 -58 -7 11 -53 -46 33 10 -17 -3 9 -38 41 30 44 64 26 10 -23 0 31 2 47 23
4303 23 0 -94 -28 -25 71 -11 -29 1 -36 -17 -24 -44 -41 33 10 47 -37 -87 24 48 -22 11 -18 -69 -38 -12 -56 31 -35 2 10 -34
4335 -34 26 -9 3 4 20 38 17 5 35 -4 21 33 15 -7 -8 -21 48 -30 -18 13 24 -40 -17 -43 -46 15 0 15 30 0 23 21
4367 21 -2 24 19 0 -5 11 34 34 26 -18 58 1 18 -1 18 60 23 -7 67 37 -11 -12 -7 -21 46 -4 38 -20 49 -44 37 18 27 -3
4401 -3 -45 -6 23 22 -16 -6 57 26 -42 26 -7 29 -36 0 -21 15 31 -33 18 6 28 34 2 26 24 44 -24 25 -27 30 34 5 -13
4434 -13 -19 12 20 -21 31 -13 -14 -18 -1 -39 -67 11 -1 4 -11 -2 56 8 -5 -6 -25 -19 22 -4 -3 -18 -24 12 -16 15 -46 4 5 10 41 1
4470 1 9 -2 -21 17 11 -35 -19 -7 -12 -11 -7 57 -31 -39 -8 -38 13 -39 -35 -22 -8 10 -7 31 29 -42 45 -43 -57 52 33 16 -40 -8
4504 -8 -47 -18 -17 -19 17 31 3 -9 -14 -10 5 52 19 31 23 -6 40 2 -25 7 -26 -14 -9 -20 -14 4 19 17 -14 -24 64 -25 -23 -3 -8 -48
4540 -48 36 12 41 40 18 -2 -23 -13 -11 -14 -7 44 -14 0 14 -1 29 -29 29 15 -22 -20 -9 8 -13 4 3 34 71 -19 -53 73 -5
4573 -5 -42 -63 23 12 20 10 -2 12 26 11 -5 33 26 32 12 -1 1 55 -4 15 65 -30 -7 56 48 28 25 -4 20 -27 -21 48 20 -33
4607 -33 15 -11 -37 34 -88 0 14 -40 -39 -15 17 -9 9 -20 0 -21 14 -3 19 38 2 7 22 52 -5 -1 -1 12 31 30 -21 6
4639 6 -6 -1 58 -12 50 -1 -26 12 -61 29 11 43 -26 -38 10 -30 -28 -32 -49 18 34 -64 25 -10 -45 23 -28 31 22 10 -32 59 -7
4672 -7 33 -17 -21 33 39 23 35 20 -1 -4 -31 8 -32 -12 -20 1 7 38 59 -2 16 26 -19 15 -12 -10 -14 -3 -10 -28 26 -8 -19 46 -38
4707 -38 -17 38 22 24 12 4 26 -1 50 12 31 -5 -11 -30 -2 101 9 -29 -23 63 32 7 49 -96 3 -28 10 20 40 -2 -3 39
4739 39 -29 4 -6 27 5 12 -16 52 0 -76 10 29 10 30 -43 53 21 13 8 6 19 -19 21 54 -49 1 -5 -25 12 51 -5 28
4771 28 15 -15 -17 23 -43 -6 38 2 -31 -29 26 -21 -50 2 17 -6 -26 -61 12 0 -29 15 -17 14 -5 -60 14 -14 -17 20 30 24
4803 24 48 -41 9 -17 -52 -5 25 15 42 44 -13 -1 -7 12 24 -17 -15 44 82 -11 -11 62 -7 -4 5 -4 -17 41 -4 19 -3 -32 -64 -34
4837 -34 -50 12 -7 22 21 20 21 28 6 -12 51 25 -48 11 -9 -14 -32 21 -15 -62 -28 8 31 -33 18 7 -7 -61 -7 -46 -51 34 -14
4870 -14 50 2 -12 -32 -27 -24 12 -39 17 11 -35 39 -22 28 79 31 -19 15 -13 -24 -61 -6 -4 24 -37 17 -66 -2 -5 -6 10 -20 -10
4903 -10 -5 15 39 -28 19 -36 -29 32 -6 25 -59 -6 -42 -8 21 -16 -25 -42 39 31 -20 33 -1 14 20 0 -17 83 13 27 1 -22
4935 -22 14 -34 32 -22 26 41 -4 -28 27 -45 -5 -39 -11 -42 32 -30 -13 17 -18 -45 -14 -38 -7 -25 -40 55 -61 23 -1 66
4965 66 -15 18 10 61 89 20 35 -14 36 47 -13 9 -31 54 14 -7 -6 -3 36 -10 -36 -40 -4 32 15 -42 25 -57 6 26 12 23
4997 23 -27 -47 -11 -13 -6 24 42 -31 5 35 -45 6 13 14 -13 5 -29 -2 25 -12 1 1 40 36 3 2 -5 38 -8 -51 -6 -15 -62 -42 19
5032 19 -21 -37 -47 18 4 -18 -12 42 -8 53 24 -25 -32 17 -4 8 22 34 4 26 -24 -12 -15 -6 19 29 -28 11 22 35 -27 0
5064 0 15 -49 44 -8 9 -7 22 35 -31 -43 -35 43 -5 -48 14 54 -11 -27 -53 34 20 -22 -21 -5 19 16 6 40 -22 -21 -14 5 22
5097 22 17 14 -72 17 -33 -5 68 -32 18 -10 24 33 -51 33 8 -11 -8 6 -10 -28 -32 1 12 40 1 20 21 -9 -3 -12 -10 20 -12 3
5131 3 -67 -4 5 -17 -35 -4 -43 14 28 -65 55 11 12 7 41 -5 73 7 -7 -38 -32 18 -53 10 -8 30 11 43 -85 61 -41
5162 -41 -19 -8 14 -1 22 -27 14 32 5 -7 0 1 4 36 34 -19 21 53 41 32 13 28 59 -13 -24 33 -2 -12 48 -20 -7 8 34
5195 34 2 -8 32 -26 56 -6 -57 -21 -52 -28 -35 32 71 18 9 9 -48 34 -6 -71 88 30 -21 57 42 45 56 33 8 14 -13 11
5227 11 5 37 25 56 3 44 32 25 48 -2 -23 16 60 -18 36 -6 33 -23 21 75 -33 -8 3 -5 -42 -8 -26 -26 -11 -20 -18 39 -33
5260 -33 -34 17 -7 -10 -45 23 32 5 50 -48 27 -15 45 28 12 0 99 9 -2 37 83 -23 10 -2 -8 10 21 -5 -32 -12 -29 36
5292 36 -4 -20 20 -29 11 -3 -105 12 20 23 29 27 -62 29 -9 15 45 41 0 37 15 8 47 12 25 -3 44 -11 -5 10 -34 -59 -5
5325 -5 -72 -71 -48 5 -6 30 8 23 -20 -35 -6 35 -53 -44 -61 -2 -37 9 53 28 21 0 27 6 26 1 48 49 46 -23 11 7 -24 51
5359 51 4 52 -14 -46 3 0 12 -9 0 -8 51 -26 10 20 -25 10 -22 8 26 -7 10 -24 41 -75 -23 33 -37 -15 37 25 -46
5390 -46 20 -18 31 -33 13 69 24 24 43 16 47 -32 50 24 13 -21 18 -16 0 55 -36 -19 8 -6 -58 2 -24 35 -19 -6 14
5421 14 -6 4 25 -4 12 -3 -14 -3 -39 43 11 -25 -4 -3 -6 -10 28 7 13 54 97 14 39 9 -44 8 21 29 -48 35 -18 20 4
5454 4 6 -11 -32 -22 -1 -5 1 7 -4 24 14 -10 16 88 -21 36 -6 13 -47 -5 -46 -2 -2 -13 22 9 -36 -13 32 -15 47 16 15
5487 15 9 1 -43 8 -4 32 4 -2 -14 -47 -40 -36 24 -11 -2 16 -20 40 -28 2 -49 -34 0 -28 4 -22 21 24 20 24 49 39 -29 44 32
5522 32 0 -13 -4 1 14 -37 -18 10 39 80 -46 3 -23 8 20 -2 -71 -34 10 15 -61 -12 24 -26 -107 24 16 -33 72 -7 -6
5553 -6 -72 -28 27 43 -5 1 64 -24 -7 -12 -42 50 -41 53 5 18 32 -32 -32 -15 -16 11 25 -12 -15 -15 -22 -7 16 -13 42 -3 -10 21 0
5588 0 9 18 -25 11 30 -13 -22 57 -10 6 16 32 -69 7 35 10 -6 -9 -20 -38 15 60 -3 14 33 4 50 -21 13 -32 7 46
5620 46 5 24 -47 -25 34 38 2 1 4 -24 -13 -24 25 -18 -21 -7 8 21 14 -2 8 51 15 -9 2 -10 42 65 -2 35 32 42 -19
5653 -19 20 27 30 23 17 -17 8 -14 14 -24 -68 16 10 -27 -3 -17 -32 -8 -54 -21 28 3 6 10 18 7 24 -10 47 -21 3 51 37 50
5687 50 21 6 -18 -21 45 10 32 -14 80 44 29 13 0 12 -32 -34 18 -6 7 -42 -57 25 -3 -1 -12 30 12 5 -24 -36 -7 -28
5719 -28 46 3 17 37 -36 -16 14 -5 -1 9 9 25 3 70 -3 73 23 3 -4 5 27 34 -2 -37 -13 29 -18 6 24 12 -41 -58 9
5752 9 -9 -32 -1 -23 37 40 -22 0 6 44 -32 13 33 7 31 20 -18 -5 -8 -21 -9 61 28 -5 16 25 24 26 1 28 -50 38 -7 -20
5786 -20 19 -30 40 -20 -68 5 -32 -14 0 -27 35 21 -28 -32 -36 -8 11 -16 -7 24 -8 64 -1 -11 -3 22 69 -16 -11 18 -31 -9 -5
5819 -5 16 -17 9 -15 -30 -8 37 0 40 -25 -11 -5 18 61 -26 36 -8 11 -10 -7 -48 40 -22 20 -42 -10 -25 -70 -13 -35 0 20
5851 20 -6 -35 -13 6 -22 19 22 -40 -19 24 32 -8 -29 -53 37 25 -11 23 -58 -29 10 16 37 29 -17 -38 -41 -50 0 28 -20 -2 60
5884 60 -53 -27 -6 18 -15 50 13 -8 48 -32 9 -23 -10 -15 35 30 -5 -3 15 38 -39 -20 -16 -15 1 12 34 2 51 -23 11 62
5916 62 -3 28 18 -2 7 -17 -30 -9 -79 11 -4 20 14 12 -62 26 -4 -90 26 -28 6 6 -5 24 26 43 11 1 39 55 5 31
5948 31 7 -39 -37 22 25 -18 -1 -11 -61 32 71 34 5 -33 -35 18 19 -33 9 -78 -36 37 11 -29 14 -32 30 -29 5 -23 57 17
5980 17 -9 45 -25 -46 39 -2 -25 -13 2 40 14 -8 -56 40 41 39 -46 1 -12 -48 55 -5 -14 -18 34 -6 34 43 -52 3 26 -15
6012 -15 21 -14 68 -23 16 -34 70 -8 39 15 50 50 23 26 7 54 1 -5 44 26 -29 -7 5 -16 6 28 -19 -4 -33 86 28
6043 28 14 55 -71 -28 16 -13 18 53 -18 -1 42 6 3 -55 -9 -31 -23 -7 30 -31 -17 -10 12 17 55 9 -17 11 10 -2 -37 17
6075 17 19 -14 26 -5 -49 -49 -11 -8 -3 -11 -26 -1 54 -88 -13 -34 1 -41 -20 8 -47 -26 -6 -30 -7 -3 44 -29 -35 -27 6 9 -57 -12
6109 -12 -33 -35 -29 8 24 -29 20 35 18 12 -6 25 19 6 5 -44 2 51 14 5 -32 26 -18 -28 -22 -12 -6 -10 -38 -16 -36 35 -69 14
6143 14 7 -50 57 19 -1 -7 -37 -19 13 1 3 -9 -17 17 28 75 19 38 -8 -41 21 -45 9 -36 -39 10 29 1 -16 43 28 4
6175 4 9 10 9 -51 11 -95 -14 24 10 -42 -37 25 -48 -15 38 28 -23 30 -5 29 27 12 39 72 39 11 13 -39 13 -23 -23 -7 -71 -21
6209 -21 -40 -75 -7 34 -7 -24 14 -19 -9 -45 -8 -9 -6 8 -17 -5 11 15 -63 -66 -14 0 -27 3 29 -13 -10 15 -65 27 -8 13 38
6242 38 16 -25 -22 0 43 -2 -19 81 6 31 36 -7 13 -51 -2 2 -11 -25 39 -12 -66 -24 0 36 5 -12 -15 9 27 27 11 34
6274 34 2 35 36 31 -3 58 -36 -20 -10 1 -42 -13 88 -8 47 35 -5 -47 18 2 15 0 -21 -11 15 -6 9 40 18 -16 6
6305 6 46 29 -67 33 -29 6 -22 -7 2 -68 1 93 21 -13 31 -37 39 26 10 49 51 -19 55 -24 -46 44 -3 -39 -51 46 -2
6336 -2 -64 -30 -20 -22 -1 -32 21 -15 14 -4 -9 -22 -59 11 15 -12 1 -21 22 -21 4 -4 -38 4 20 -10 -11 -12 -12 4 2 -7 8 -1 -33 22
6372 22 11 -24 9 31 -35 -16 -54 18 -39 -41 12 -28 -2 32 -17 -3 8 24 -6 -4 -28 13 18 -1 -6 4 11 -46 2 -4 58 -1 -10 2
6406 2 17 15 25 -14 65 -12 -10 7 -8 35 24 -7 18 20 1 67 -32 6 6 -4 -49 -21 -43 8 54 -3 14 -21 18 -44 -29 -10 0
6439 0 35 -21 -19 11 -36 -4 -10 -58 -4 9 -21 -34 -27 31 7 60 18 16 37 35 -14 8 -21 -5 -41 -55 -54 -45 53 0 5 8 -24 3 -82
6474 -82 -22 5 -44 20 47 -12 -41 14 -1 -7 -46 14 16 -31 -10 -37 17 5 14 -27 -42 12 -5 -25 67 -41 -56 0 -48 17 48
6505 48 13 -25 30 -9 -45 -12 -61 -39 5 -30 -23 -5 -12 2 28 27 16 -25 8 22 -63 -7 67 -8 26 -12 30 44 -5 59 63 -34
6537 -34 8 63 13 -4 -2 66 -6 21 28 -44 18 49 -8 40 -24 3 1 -39 -64 -20 25 -48 19 -17 -53 -81 -24 -45 -19 13 2 16
6569 16 0 -67 15 -46 -59 7 12 40 17 22 7 0 12 -34 53 -30 -90 8 -16 47 -10 -37 -20 76 -29 -16 20 -35 -69 1 15
6600 15 18 -13 -30 -62 -35 -29 25 -14 -13 7 -54 28 -47 -22 10 5 41 37 -36 24 -26 34 -33 9 -16 -43 12 40 -7 -10 10 20 1
6633 1 2 -25 -6 -6 -21 1 -22 12 -39 -18 15 -28 -11 72 -25 -5 9 7 -17 -10 -46 30 16 -25 -41 70 2 1 15 -16 47 14 -5
6666 -5 -31 8 -29 12 -24 -48 -35 0 52 -4 -36 -47 -6 -6 33 44 23 12 26 14 -34 -38 -25 -9 -19 33 -23 -5 -32 18 47 55
6698 55 73 25 4 -34 16 -10 43 26 58 16 5 23 -39 -19 16 20 -19 3 -8 53 1 -32 -47 -15 11 -17 0 -19 -19 19 62
6729 62 49 14 -15 -6 -35 -22 -4 6 -10 -8 -13 2 46 82 46 -81 35 17 -28 8 30 27 14 49 37 -9 17 38 -1 -7 -32 -64
6761 -64 34 -12 6 21 32 13 57 -16 -7 -27 -31 -29 -22 -7 9 16 -23 68 -15 -16 19 -2 32 0 -8 34 6 -23 30 -26 62 -5 -11 29
6795 29 -6 4 -27 -47 1 71 -7 -37 -65 -27 -4 5 28 -26 -30 13 26 21 -18 51 -29 -17 14 30 30 -10 -17 6 25 4 -30 41 12
6828 12 -34 -36 -38 -8 -32 -15 -39 0 26 21 77 8 7 58 1 11 -3 -22 -7 -38 17 -36 -5 9 -7 -22 -57 -41 -34 11 -2 -21 -9
6861 -9 -23 4 -5 26 -33 38 12 11 21 -3 13 7 -39 5 -5 66 -2 24 6 0 51 1 13 15 -26 -15 -12 35 -20 -39 -23 -6 -40 -51
6895 -51 31 -19 -28 51 -11 -38 25 19 30 -24 -35 -3 -13 -13 -15 -9 -30 28 64 42 20 19 -39 21 -30 9 12 -7 -13 -81 21 -39 -14 5
6929 5 -4 13 5 3 -27 -40 -24 22 -23 10 29 -11 46 23 29 17 -23 -2 -38 32 -2 -41 47 48 31 31 43 19 22 10 -70 6 -68 13
6963 13 -11 -27 -45 -12 -5 1 -7 4 5 -4 -28 -15 -44 -30 0 -61 -12 7 -18 37 -30 3 1 -83 18 30 -11 -16 -16 34 -15 17 51 7
6997 7 -14 -18 51 -12 -6 -21 3 -26 69 -15 -17 7 -24 10 67 55 18 -52 40 22 -4 -36 3 -22 21 -5 -8 36 13 2 -37 4 13
7030 13 -3 23 -10 23 9 29 41 -1 28 4 7 62 19 5 -28 10 -5 22 28 1 -67 -9 -3 -7 -8 -15 -3 35 2 30 10 14 -53 31
7064 31 62 -9 -42 22 -35 -10 8 -3 7 -23 -9 0 -5 31 22 -7 -9 -39 -20 -40 0 -16 -24 -30 -24 -39 87 10 -22 -26 -15 23 -11 13
7098 13 -45 -19 33 -7 55 11 -69 -1 19 12 20 -38 42 0 6 16 3 -37 6 21 23 74 30 -17 -11 29 12 -21 2 -17 20 23 40
7131 40 31 -26 22 4 5 4 4 45 -24 25 10 -14 -37 20 1 42 40 -12 -30 -25 -54 41 3 -41 16 47 19 6 -8 6 1 -37 23 11
7165 11 2 -1 -3 44 52 0 26 18 -9 57 48 6 -7 3 -48 5 -40 -58 -33 6 -10 -4 -7 -3 -41 -28 2 47 18 5 -1 -12 51 48 -17 -3
7201 -3 -38 19 41 41 -36 -16 -3 -3 0 2 11 -15 55 11 5 -10 11 -19 -23 20 34 -48 -26 37 2 -10 -16 37 2 40 17 21 8 -1 -7 11
7237 11 -2 -4 2 -31 -46 -6 -6 39 41 -13 22 -38 2 41 11 12 15 -8 2 9 -8 11 -27 10 32 -29 2 -18 -47 -11 -37 69 -5
7270 -5 -21 -10 43 10 1 15 4 25 -22 -39 8 -5 -32 22 8 18 59 -9 -3 0 4 38 6 19 -53 32 37 -2 15 -2 -21 30 -12
7303 -12 26 15 -23 -3 -25 1 21 27 -14 -54 4 -5 14 14 15 39 -32 16 16 19 2 42 26 7 -36 20 54 -68 68 66 -43 -54
7335 -54 -29 21 -12 -1 24 -5 -4 -3 -7 10 8 -21 15 0 -34 -39 -24 89 -46 -15 29 1 3 -20 -9 11 27 -7 -13 11 -37 -74 2
7368 2 12 2 9 14 9 11 49 -40 -16 -7 33 -26 23 15 -61 48 26 25 40 -8 -12 -4 -2 -2 -3 41 -3 38 2 -2 -5 -31 12 29 54 19 36
7405 36 9 6 0 -37 -30 12 10 -32 -2 -26 16 -22 3 12 -1 46 12 -13 4 -20 12 20 13 43 -15 -40 -21 75 28 -14 -17 -17 -8 -11 54 -6
7441 -6 -5 -21 -15 -51 29 -29 -8 -15 -38 -13 -24 29 -26 6 -24 -10 6 -27 -10 4 -56 -11 -27 22 -27 29 -11 0 12 23 22 10 -19
7474 -19 3 -11 -32 12 48 -41 -44 24 -44 38 45 -5 -28 37 -3 -2 10 -49 -41 -17 19 -5 24 3 3 29 15 14 -36 29 51 28 -13
7507 -13 37 1 9 1 -52 0 -17 17 11 82 29 25 -10 20 43 26 -1 -8 -32 -34 14 54 -20 -11 15 3 -46 1 13 79 3 3 28 -48
7541 -48 6 21 19 -20 19 4 17 -9 -56 26 20 16 -14 7 -37 33 -36 46 -35 -1 19 1 -13 -27 15 -4 8 -28 -39 -17 -45 -5
7573 -5 77 7 -8 42 -17 -75 18 -11 19 -4 66 29 -3 -20 -37 76 -37 -33 58 -15 42 -3 15 -38 -41 3 -33 -14 29 59 -50
7604 -50 -19 -25 -2 -24 -3 15 23 -30 -16 -1 12 19 -14 -5 -4 -17 4 28 -33 39 4 7 24 4 12 -9 -42 -5 -17 -26 3 3 19 -38 -31
7639 -31 -63 -23 7 -16 -27 -23 -1 -34 -6 12 -21 -33 -47 -10 -32 -48 -61 -27 21 17 11 36 -28 3 27 80 -38 53 -19 26 2
7670 2 -1 23 45 12 17 -27 17 20 -2 28 24 92 12 13 -40 37 1 10 -12 -42 -33 34 2 -5 -37 -17 -18 4 -49 51 14 -54 13 -7 22
7705 22 23 54 6 -8 -22 36 39 24 -8 0 1 0 -14 -35 44 -13 49 49 81 -54 19 18 10 3 75 -52 -6 24 2 69 -27 42 -23 -8
7739 -8 3 -48 -28 17 -7 -3 -34 1 15 33 -2 23 -25 0 102 25 28 3 42 19 27 8 53 -7 51 59 -39 -34 -20 49 14 -31 -17
7772 -17 -9 12 79 -10 -13 1 3 -20 -1 7 -3 -8 53 -15 -65 26 -28 -38 -22 20 -1 -24 -21 -50 -31 67 47 -23 -26 27 -61 -12 19 45
7806 45 -24 22 -18 -13 -9 -5 -27 19 -19 29 32 -11 -51 -2 -48 27 7 5 13 6 -14 50 -2 -10 58 -44 -2 10 -37 -19 -10 -51 22 23 -4
7841 -4 26 22 44 15 5 -10 -23 38 3 -35 -22 -32 -23 22 9 -51 -25 78 23 -25 15 35 -23 -5 -52 32 4 -4 52 -29 0 -23
7873 -23 12 -33 -7 -43 13 27 53 -11 -55 59 -4 3 16 21 5 27 30 -34 -34 -52 -16 0 -27 -47 -42 -35 7 27 -56 -6 56 -26 5
7906 5 22 -24 -15 -29 -16 10 23 28 6 -33 -50 12 -39 12 14 21 21 4 -8 -27 -1 -19 11 -4 -61 6 -23 3 49 28 -32 -5 -7 -67
7940 -67 15 41 -21 -15 -12 -52 35 -23 -45 -29 13 -51 -7 -34 -27 -14 -48 58 5 -40 -7 -34 -34 1 8 -56 58 -6 -1 1 11 5 53
7973 53 -13 -30 28 62 37 29 -24 -6 0 10 8 22 11 -19 -37 0 -34 -3 25 -51 10 -102 -52 -13 -64 17 4 16 -25 16 -17
8004 -17 57 -16 42 39 -22 -52 5 34 -13 -46 -5 55 27 17 -28 82 -22 15 16 -22 -11 -53 8 -32 43 60 -39 -3 -20 -37
8034 -37 -40 13 -17 -16 23 12 2 -39 1 15 -60 23 -17 -23 -13 -39 36 23 8 42 19 -14 -5 8 14 -1 27 -41 18 -1 4 -29 36
8067 36 21 -9 -31 4 -25 -34 -27 0 -34 -12 -32 15 -44 18 39 -12 -2 38 47 -16 4 -35 -14 -7 -17 -55 22 16 27 12 -9 29 10
8100 10 52 -46 0 -18 -1 44 -20 40 -43 -59 18 5 37 3 46 6 -50 -28 -13 11 -42 6 -17 -32 49 -7 -30 40 -28 35
8130 35 -19 -26 -13 -22 -5 -12 10 -58 -61 -39 22 72 6 25 -10 12 -15 -3 -1 -26 15 57 2 27 -7 -2 -13 -22 26 0 -2 25 21 23 -1
8165 -1 57 0 -14 -14 4 25 12 -7 -38 -23 0 10 8 4 -21 5 18 43 31 0 2 35 0 -42 11 12
8191A2
##END NTUPLES=NMR FID
##END=
