##TITLE=1H_DE-80H_X3
 200.13MHz, d2o
 8 sc
 
 19ns.26.2.2025
##JCAMPDX= 6.0         $$ Bruker NMR JCAMP-DX V2.0
##DATA TYPE= NMR FID
##DATA CLASS= NTUPLES
##ORIGIN= UXNMR, Bruker Analytische Messtechnik GmbH
##OWNER= pz
$$ XWIN-NMR		Version 3.5
$$ Mon May 19 14:21:46 2025 Russian Standard Time (UT+4h)  Yarkov@DPX200
##.OBSERVE FREQUENCY= 200.1313
##.OBSERVE NUCLEUS= ^1H
##.DELAY= (6, 6)
##.ACQUISITION MODE= SIMULTANEOUS
##.ACQUISITION SCHEME= undefined
##.AVERAGES= 8
##.DIGITISER RES= 18
##SPECTROMETER/DATA SYSTEM= spect
##.PULSE SEQUENCE= zg30
##.SOLVENT NAME= CDCl3
##.SHIFT REFERENCE= (INTERNAL, CDCl3, 0, 14.3821)
##AUDIT TRAIL= $$ (NUMBER, WHEN, WHO, WHERE, WHAT)
$$ ##TITLE= Audit trail, XWIN-NMR		Version 3.5
$$ ##JCAMPDX= 5.01
$$ ##ORIGIN= Bruker BioSpin GmbH
$$ ##OWNER= Yarkov
$$ C:/Bruker/XWIN-NMR/data/yarkov2/nmr/H-C/1/audita.txt
$$ ##AUDIT TRAIL=  $$ (NUMBER, WHEN, WHO, WHERE, WHAT)
(   1,<2025-05-19 14:20:57.12 +0400>,<Yarkov>,<DPX200>,
      <created by zg, POWCHK disabled, PULCHK disabled
       configuration hash MD5:
       00 E9 B6 7A A2 85 ED C7 34 08 36 98 17 FE 4E 26
       data hash MD5: 16K
       9D 16 CA 8D F7 75 EB DF 32 39 3C 26 DE 0E A2 FE>)
$$ ##END=
$$ 
$$ hash MD5
$$ 40 60 88 09 CF 3D 00 7A DB 2E 10 5D 79 B9 BC DD
##$RELAX= 
##$RELAX= 
##$RELAX= 
##$RELAX= 
##$RELAX= 
##$RELAX= 
$$ Bruker specific parameters
$$ --------------------------
##$DU= <C:/Bruker/XWIN-NMR>
##$EXPNO= 1
##$NAME= <H-C>
##$PROCNO= 1
##$TYPE= <nmr>
##$USER= <yarkov2>
##$AMP= (0..31)
100 100 100 100 100 100 100 100 100 100 100 100 100 100 100 100 100 100 
100 100 100 100 100 100 100 100 100 100 100 100 100 100 
##$AQSEQ= 0
##$AQ_mod= 1
##$AUNM= <au_zg>
##$AUTOPOS= <>
##$BF1= 200.13
##$BF2= 200.13
##$BF3= 200.13
##$BF4= 200.13
##$BF5= 200.13
##$BF6= 200.13
##$BF7= 200.13
##$BF8= 200.13
##$BYTORDA= 1
##$CFDGTYP= 0
##$CFRGTYP= 5
##$CHEMSTR= <none>
##$CNST= (0..31)
1 1 145 1 1 1 1 1 1 1 1 1 1 1 1 1 1 1 1 1 1 1 1 1 1 1 1 1 1 1 1 1 
##$CPDPRG= <>
##$CPDPRG1= <>
##$CPDPRG2= <>
##$CPDPRG3= <>
##$CPDPRG4= <mlev>
##$CPDPRG5= <mlev>
##$CPDPRG6= <mlev>
##$CPDPRG7= <mlev>
##$CPDPRG8= <mlev>
##$CPDPRGB= <>
##$CPDPRGT= <>
##$D= (0..31)
0 0.7 0 0 0 0 0 0 0 0 0 0.03 0 0 0 0 0 0 0 0 0 0 0 0 0 0 0 0 0 0 0 0 
##$DATE= 1747650056
##$DBL= (0..7)
120 120 120 120 120 120 120 120 
##$DBP= (0..7)
150 150 150 150 150 150 150 150 
##$DBP07= 0
##$DBPNAM0= <>
##$DBPNAM1= <>
##$DBPNAM2= <>
##$DBPNAM3= <>
##$DBPNAM4= <>
##$DBPNAM5= <>
##$DBPNAM6= <>
##$DBPNAM7= <>
##$DBPOAL= (0..7)
0.5 0.5 0.5 0.5 0.5 0.5 0.5 0.5 
##$DBPOFFS= (0..7)
0 0 0 0 0 0 0 0 
##$DE= 6
##$DECBNUC= <off>
##$DECIM= 32
##$DECNUC= <off>
##$DECSTAT= 4
##$DIGMOD= 1
##$DIGTYP= 9
##$DL= (0..7)
0 120 120 120 120 120 120 120 
##$DP= (0..7)
150 150 150 150 150 150 150 150 
##$DP07= 0
##$DPNAME0= <>
##$DPNAME1= <>
##$DPNAME2= <>
##$DPNAME3= <>
##$DPNAME4= <>
##$DPNAME5= <>
##$DPNAME6= <>
##$DPNAME7= <>
##$DPOAL= (0..7)
0.5 0.5 0.5 0.5 0.5 0.5 0.5 0.5 
##$DPOFFS= (0..7)
0 0 0 0 0 0 0 0 
##$DQDMODE= 0
##$DR= 18
##$DS= 0
$$ [...]
##$SUBNAM2= <"">
##$SUBNAM3= <"">
##$SUBNAM4= <"">
##$SUBNAM5= <"">
##$SUBNAM6= <"">
##$SUBNAM7= <"">
##$SUBNAM8= <"">
##$SUBNAM9= <"">
##$SW= 18.0517328524113
##$SWIBOX= (0..15)
0 0 2 0 0 0 0 0 0 0 0 0 0 0 0 0 
##$SW_h= 3612.71676300578
##$TD= 16384
##$TD0= 1
##$TE= 0
##$TE2= 300
##$TE3= 300
##$TEG= 300
##$TL= (0..7)
0 120 120 120 120 120 120 120 
##$TP= (0..7)
150 150 150 150 150 150 150 150 
##$TP07= 0
##$TPNAME0= <>
##$TPNAME1= <>
##$TPNAME2= <>
##$TPNAME3= <>
##$TPNAME4= <>
##$TPNAME5= <>
##$TPNAME6= <>
##$TPNAME7= <>
##$TPOAL= (0..7)
0.5 0.5 0.5 0.5 0.5 0.5 0.5 0.5 
##$TPOFFS= (0..7)
0 0 0 0 0 0 0 0 
##$TUNHIN= 0
##$TUNHOUT= 0
##$TUNXOUT= 0
##$USERA1= <user>
##$USERA2= <user>
##$USERA3= <user>
##$USERA4= <user>
##$USERA5= <user>
##$V9= 5
##$VALIST= <valist>
##$VCLIST= <CCCCCCCCCCCCCCC>
##$VD= 0
##$VDLIST= <DDDDDDDDDDDDDDD>
##$VPLIST= <PPPPPPPPPPPPPPP>
##$VTLIST= <TTTTTTTTTTTTTTT>
##$WBST= 1024
##$WBSW= 4
##$XGAIN= (0..3)
0 0 0 0 
##$XL= 0
##$YL= 0
##$YMAX_a= 89337
##$YMIN_a= -96203
##$ZGOPTNS= <>
##$ZL1= 120
##$ZL2= 120
##$ZL3= 120
##$ZL4= 120
##$ABSF1= 10
##$ABSF2= 0
##$ABSG= 5
##$ABSL= 3
##$ALPHA= 0
##$AQORDER= 0
##$ASSFAC= 0
##$ASSFACI= 0
##$ASSFACX= 0
##$ASSWID= 0
##$AUNMP= <proc_1d>
##$AZFE= 0.1
##$AZFW= 0.1
##$BCFW= 1
##$BC_mod= 2
##$BYTORDP= 1
##$COROFFS= 0
##$CY= 83.5205535888672
##$DATMOD= 1
##$DC= 2
##$DFILT= <>
##$DTYPP= 0
##$F1P= 10.8118882576601
##$F2P= -7.23987719738617
##$FCOR= 0.5
##$FTSIZE= 0
##$FT_mod= 4
##$GAMMA= 1
##$GB= 0.15
##$INTBC= 1
##$INTSCL= 1
##$ISEN= 128
##$LB= 0.25
##$LEV0= 0
##$LPBIN= 0
##$MAXI= 10000
##$MC2= 0
##$MEAN= 0
##$ME_mod= 0
##$MI= 1.114404
##$NCOEF= 0
##$NC_proc= 0
##$NLEV= 6
##$NOISF1= 3.799351
##$NOISF2= 2.8
##$NSP= 1
##$NTH_PI= 0
##$NZP= 0
##$OFFSET= 14.38212
##$PC= 1
##$PHC0= -1191.366
##$PHC1= 10.33376
##$PH_mod= 1
##$PKNL= yes
##$PPARMOD= 0
##$PSCAL= 0
##$PSIGN= 0
##$REVERSE= no
##$SF= 200.129724274929
##$SI= 16384
##$SIGF1= 3
##$SIGF2= 2
##$SINO= 400
##$SIOLD= 16384
##$SREGLST= <1H.CDCl3>
##$SSB= 0
##$STSI= 0
##$STSR= 0
##$SW_p= 3205.1282051282
##$SYMM= 0
##$S_DEV= 0
##$TDeff= 0
##$TDoff= 0
##$TI= <>
##$TILT= no
##$TM1= 0
##$TM2= 0
##$TOPLEV= 0
##$USERP1= <user>
##$USERP2= <user>
##$USERP3= <user>
##$USERP4= <user>
##$USERP5= <user>
##$WDW= 1
##$XDIM= 8192
##$YMAX_p= 0
##$YMIN_p= 0
$$ End of Bruker specific parameters
$$ ---------------------------------
##NTUPLES= NMR FID
##VAR_NAME=  TIME,          FID/REAL,        FID/IMAG
##SYMBOL=    X,             R,               I
##VAR_TYPE=  INDEPENDENT,   DEPENDENT,       DEPENDENT
##VAR_FORM=  AFFN,          ASDF,            ASDF
##VAR_DIM=   8192,          8192,            8192
##UNITS=     SECONDS,       ARBITRARY UNITS, ARBITRARY UNITS
##FACTOR=    0.0002768,     1,               1
##FIRST=     0,             0,               0
##LAST=      2.2672688,     0,               0
##MIN=       0,             -96203,          0
##MAX=       2.2672688,     89337,           0
$$ Real data points
##PAGE= N=1
##DATA TABLE= (X++(R..R)), XYDATA
0@%%%%%%%%%%%%%%%%%kJ0j6J6j6J6j6K4l2L2l8M6m9N7o6P4q6R6j07J22j36J50
39G9j67J87k09K31k55K82l10L42l79M18m60N07n60O16o80P55q36R27j032J154
59F10j299J475j692J964k319K807l519M652o736J1777m6769l7564J14319j8530
73A9176n3355Q6657L6859j03568O789Q3642n1644p2580O4895K1924q7334j8647
85f7186M0485j5303N241L5380j2376M277M7371j1293k5771M1957K1196m9604j5106
98g32L1737k0297m7321J2676K3657k0462j3087J0953Q441J3716L038j3359R083
111a957K1494p760j1169J6320J2608j5658j1673O572k27o290J705n265r285m629
125a5214j2676l025K1718R739j2952M698J9464j725p040J7195J2833j2436q436
$$ plain form
0 0 0 0 0 0 0 0 0 0 0 0 0 0 0 0 0 0 0 -2 8 -8 8 -8 8 -8 16 -16 16 -22 24 -25 32 -34 40 -46 50 -57 65 -71 79
39 79 -88 99 -110 121 -134 148 -162 180 -199 219 -241 266 -294 322 -358 397 -439 488 -544 610
59 610 -689 786 -906 1058 -1261 1546 -1973 2679 -4057 7720 -39049 -76613 37706 19176
73 19176 -34179 52478 89337 -14231 -7442 76200 24556 -48024 16871 38795 -48539 -67186
85 -67186 -26701 -42004 -36763 -1383 -13759 -9482 37889 26596 825 42782 63978 14374 -732
98 -732 31005 10708 -36613 -23937 -280 -20742 -33829 -22876 -14435 -719 2319 -11040 -1957
111 -1957 19537 11777 608 16928 29536 13878 2205 8777 8550 2260 3965 -1300 -10585 -15214
125 -15214 -27890 -30915 -9197 542 -12410 -7712 11752 10027 2987 20182 33015 20579 12143
138A2143k458j5744o455O263p730m919J0721l982j1625J5076J7931o257Q83J7883
152B1730o370j8030J0046R079j3865j172M962j3718m648J0767m398p595R397J735
166b080j2204M052J4672k703l165J1543k51o586R193K675q741K649p07j5330n980
181a2963M492k288k874M475M03m315O595R984J167O923Q930p946p010L964l709
196E828m329L453m628j0202K0N74n195L274J1432r92o730O564M657o315O322J0976
212A4709n500l443M823m506n943M742J705r349n658J716m438m672P924L275n790
227a0405O422Q657k590L347J0046j129n710N45r39p266k582K943o254p528L876
242h567L70m689O485P710j852p99L152R19j87M280L311k841l532M44k112k660
$$ plain form
138 12143 9685 -6059 -12514 -6251 -13981 -18900 -8179 -12161 -23786 -8710 9221 2964 3847 21730
152 21730 15360 -2670 7376 16455 2590 1418 6380 -7338 -11986 -1219 -5617 -13212 -3815 -2080
166 -2080 -14284 -10232 4440 1737 -1428 10115 9864 3278 12471 15146 6405 9054 8347 -6983 -12963
181 -12963 -8471 -10759 -13633 -9158 -8755 -13070 -6475 3509 4676 11599 20529 12583 5573 9537 5828
196 5828 1499 4952 324 -9878 -9858 -9284 -14479 -11205 227 -765 -7495 -931 3726 -2589 3733 14709
212 14709 9209 5766 10589 6083 140 4882 6587 -2762 -8420 -6704 -11142 -15814 -7890 -4615 -10405
227 -10405 -3983 4674 2084 5431 15477 14348 8638 9183 8244 978 -1604 1339 -4915 -12443 -8567
242 -8567 -8197 -12886 -6401 1309 -543 -1342 1810 2729 2542 6822 10133 7292 3760 4204 2092 -568
258e68L010J42m721l046k518j471J158J814K402K141r6K830K084J206M527K739
274A1633k485l656k485l022k989j327J137k664l853K815K225p7N065M708j948
289C077j036K066K15j210j4O82l745k749K886j053k602M201J582m846j032K038
305a540l74k72K128J058k187K99K726J58P23M260j208n733l48L22k223r06P59
322b358r22k433M78L196J448J889M753m39k465K73J06j993j090j20k077k684j039
339e477J420N8J781L862p2k051J604J493l75M21O6j132k012o67J386o43L67J397
357A426j783k927J813N21j471O26J122q02j077J641K585N24J392K031j989k255
373A377R77k11k541o85q57k155k128P92K549O03J828K180q46k5K803N05r93P56
$$ plain form
258 -568 2442 2584 -2137 -5183 -7701 -9172 -8014 -6200 -3798 -1657 -1753 1077 3161 4367 8894 11633
274 11633 9148 5492 3007 -15 -3004 -4331 -3194 -5858 -9711 -6896 -4671 -4748 317 5025 3077
289 3077 2041 4107 4322 3112 3098 3780 35 -2714 172 -881 -3483 718 2300 -2546 -3578 -1540
305 -1540 -1914 -2186 -58 1000 -1187 -888 1838 1996 2719 6979 5771 38 -310 12 -2211 -3117 -2358
322 -2358 -3280 -5713 -5235 -2039 -591 1298 6051 5612 3147 3420 3526 1533 443 323 -1754 -4438 -5477
339 -5477 -4057 -3999 -2218 1644 1572 -479 1125 2618 2243 2664 2730 1598 -414 -1081 305 -338 29 1426
357 1426 -357 -3284 -1471 -950 -2421 -1795 -673 -1475 -2552 -911 1674 2198 3590 5621 3632 1377
373 1377 2354 2143 -398 -1083 -1940 -4095 -6223 -5431 -2882 -2279 -451 1729 883 858 3661 4166 3173 3929
391C929j119k606j439L33J41r96N93O83k212n49K432M4m12J318L89j265r1J955
409A128J228j69J440j30k916n34J982j819j672M02j412j595J75J494R79O91J541
426H13N59q81J308J616j127n09P47k070j777L37J62j55L09M14q29r61J327J382
444F65p64M33O55j839l06J181Q91L01L15l01p24o96P62M17j490K07q7j597j45
463b122P71L70J126P20o03nM15L13K48l14q5p77j641L58L89M28R81m5j071O16
483G2M16P3L95k09m63p44n33K27K87J71Q95q10m52P58K7l36J525m07r72j82j99
504d61j52M63J304K26j429k72O62q65L72P95j021j155L69Rk35J082J056J75p22
523B01P35N97p14J99Q20j381j074J03r59k11O67J161q70n80J221L88o41J189J047
$$ plain form
391 3929 2810 204 -1235 -902 -761 -1757 -1164 -481 -2693 -3242 -810 -766 -1178 140 529 -736 -827 1128
409 1128 2356 2187 3627 3497 581 47 2029 210 -1462 -1060 -2472 -4067 -3892 -2398 -1419 -728 813
426 813 1372 491 1799 3415 2288 1779 2526 456 -1321 -984 -822 -977 -668 -254 -1083 -2044 -717 665
444 665 -99 334 989 -850 -1156 25 916 1217 1532 1231 507 -189 573 990 -500 -293 -380 -1977 -2122
463 -2122 -1351 -981 145 865 262 257 672 985 1233 919 834 57 -1584 -1226 -837 -409 572 527 -544 72
483 72 488 561 956 747 284 -460 -993 -766 -479 -308 587 -223 -675 83 110 -226 1299 892 -80 -262 -461
504 -461 -613 -150 1154 1380 -49 -321 341 -524 -152 643 -378 -1533 -1164 -1155 -1390 -308 748 923 201
523 201 936 1533 819 1018 1838 457 -617 -514 -1473 -1684 -1017 144 -726 -1306 -85 303 -338 851 1898
542A898j701n48J052q52n1J597o8j410j56Q27m82r09J211k59j636P2O29r47L77
561a356K114k12n64Q04N80k28n4J008q52j736K95k95j254P79J238j331n28J110
579d82M78r8M52P14m93p62N26q0j185J102R50j284j07P51P9o75M98P89r66j298
599a091N28l19m83J193M56j266M45J072l19J57Q71K43j122p68O44n92n57J305
617C97j39j325P70O59p59L47Q50k67r14nK42n66Q7J181l71r33J166q4k92R04K11
638A159p22l54j56k42q2K58M69r68l80Q02J8k75J019J27o16p5L86l47j09N17L07
659G36q88J50L31m25KP20l30n69k10k79m7K69L52pl33M65L38J83M99K83m66j51
681F23J49q07N4J95k36l74j48q7j37M84L98L5j8mk05l37N40K98j97k2j62k1M41
$$ plain form
542 1898 197 -351 701 -151 -202 1395 1327 -83 -239 588 106 -803 408 149 -1487 -1415 -786 -1733 -1356
561 -1356 758 546 -18 786 1366 1138 1084 2092 1240 -496 -201 -496 -1750 -971 267 -1064 -1592 -482
579 -482 -4 -102 350 1064 571 -191 335 255 -930 172 1122 -162 -269 482 561 -114 384 1173 207 -1091
599 -1091 -563 -882 -1365 -172 284 -982 -537 535 216 373 1244 1487 365 -403 241 -351 -908 397
617 397 258 -1067 -297 362 -397 -50 800 533 -381 -386 -144 -710 -623 558 187 -746 420 336 44 948 1159
638 1159 437 83 -73 -315 -397 -139 330 -638 -1018 -216 -198 -473 546 673 57 -18 368 21 -88 429 736
659 736 -152 -2 329 -96 -94 626 296 -273 -483 -762 -809 -540 -188 -195 -528 -63 275 458 957 1240 774 623
681 623 772 -35 19 214 -22 -396 -544 -631 -768 -284 114 149 131 127 -78 -415 125 423 226 204 42 21 462
704D62J01j52l0j17l99n89n9L70P1l29K20O1R3M92K00K03J21l40R2n74K50L03
726D50l53m78J73K5l99O11Q4k70N9k04KP1J71M68l40p8K11m77R8O91M3k59K79
749E78m66k91m4L01J25n01o2K63l24R6M49K92k82L34m92j58j79M69J68n63K48
770c9K30m52K58N12L4n09M27m80l98O4J24L2m52L07J20k26K11P50j15j05J82j79
792B96l82L54L1j68k88Mk5j10J63K82l35J88J27n43m6N27k09Lk71M16L6J31Q8
815B69N28j80q3k7p76R1J25j26k02j40j21J85l23P21M12l6j76J79o5r8M85l34
837C08q1j65J03l00K7J87ll89L2K2k09J47K67m2j28J17Q8J62J75K86Q2l06R0j28
861C42m44J23J23m10q6j52N0R4k02N05K91l44K89J86k57K22P8k14j33j20m8N9
$$ plain form
704 462 563 411 381 264 -135 -724 -783 -413 -342 -671 -451 -390 -297 195 395 598 719 379 471 -103 147 450
726 450 97 -381 -208 -183 -582 29 113 -157 -98 -302 -300 -229 -58 410 70 -8 203 -274 -176 515 558 299 578
749 578 112 -179 -223 78 203 -298 -360 -97 -421 -325 124 416 134 468 -24 -182 -361 108 276 -287 -39
770 -39 191 -261 -3 509 543 34 461 -19 -417 -353 -229 -197 -649 -342 -222 -448 -237 513 398 293 475 296
792 296 -86 268 299 131 -157 -153 -178 -288 -125 157 -178 10 137 -406 -452 75 -134 -131 -402 14 50 181 269
815 269 797 617 534 507 -269 -178 -53 -179 -381 -521 -642 -457 -780 -59 353 317 141 320 255 157 642 308
837 308 227 62 165 -135 -108 79 76 -313 -281 -259 -468 -321 -54 -96 -224 -107 -19 143 318 604 686 380 470 342
861 342 -102 21 144 -266 -352 -504 -454 -360 -562 -57 234 -110 179 365 108 330 408 194 61 -59 -107 -48
883d8l62O16l34q7q8J63j22k7K86m35K46J18q4J47K04K24j06l79L70q2j21J40
905B39n3n61j27K02K1N9P9J46P4l8J1q9m5M35j81n55K57N8k60K39L25L9k22m7
929FK03m3j99K48j94l17J14J42l26K33L29m8j94k0J79q0r7M17l82k26J92o1J00
952b4M75j74j56k80L03r0l8p0Jk68k71N39j67J20n9K23m8K03N1J88j28N1R2j68
976C05l17K4j84j10J43K43m99RK09o3J93qK02j16o4J84L4J45K42l29j69p0j66
999a62J53L6k77j43J43r5J6o2K87J78J04j47L76o3p6L24n38j2O9q3j76K0O5M5
1023a8k01J8M5j08K79j79n4K68qj0k2L86j60lN1m16N6K13j62k2l68K20N1j37o
1048b87q6K41K45J47m06K80J21J11l67M3J03j15j65J33j77k53M68j10O6L3p9J24
$$ plain form
883 -48 -410 206 -128 -215 -303 -140 -262 -289 -3 -438 -192 -74 -158 -11 193 417 311 -68 302 220 99 239
905 239 186 -375 -502 -300 -279 -220 -141 5 79 41 52 -37 -82 353 172 -383 -126 -68 -328 -89 236 275 53 6
929 6 209 166 -33 215 21 -296 -182 -40 -366 -133 196 148 -46 -66 113 33 -64 353 -29 -255 -63 -124 -24
952 -24 451 277 121 -159 144 54 16 -54 -53 -321 -592 -53 -220 -100 -159 64 16 219 270 458 330 381 473 305
976 305 -12 12 -172 -282 -139 104 -395 -386 -177 -240 -47 -55 147 31 -33 151 185 330 572 243 74 4 -162
999 -162 -9 27 -250 -393 -250 -345 -329 -391 -104 74 178 31 407 344 268 592 54 42 111 28 -148 -128 -63 -18
1023 -18 -219 -201 -156 -264 15 -164 -218 50 42 32 10 396 236 233 284 -132 -76 137 -25 -47 -415 -195 -144 -281 -287
1048 -287 -373 -132 113 260 -146 134 255 366 -1 42 145 30 -135 -2 -179 -432 36 -74 -8 25 -54 70
1070G0p9P8Q4k12k12M90r4j88K42m7pj14J01qk90J08J43k18KL09k26j75M51j93
1094A5j1K52Rk39q6J04l43J74n8K7J20O5L21n37J69M35O4l65p0J31k66j0J26l
1118B4j18N8k45J21O4L06q1k27J65J11j83J28K06Kl73P1qm6l85L59n7k08K63j19
1142a72j0R4J37M0j46J70K69l79J91Q7j22l2m6j97j42P8N0j37J55l75L49J11j13
1165a40K95l5K3O0j0M2r3R4p9j58o0L8j94L10j20j21L8p5q9K28j07O7J56L8Qk5
1191I1K44k52R8j87J21j02k74J31k0J5krq9L3K72j24R6R6R7P9l04Q2J11j22k2
1216E9q7J34J47l55J53o5j04p8J03l4K41l53J28O5J23k40K17LK57l61J10q5kN
1240a9n9n1K07k58J14O4j71N9J37j11L69k88L2j55n5J86j00J30q9J15n8j52K51
$$ plain form
1070 70 -9 69 153 -59 -271 219 125 -63 179 132 125 11 112 104 -186 -78 65 -153 -151 158 -68 -243 208 15
1094 15 4 256 265 26 -60 44 -299 -125 -183 -156 -36 29 350 -187 -18 417 481 116 46 177 -89 -99 27 24
1118 24 -94 -36 -281 -160 -96 210 129 -98 67 178 -5 123 329 331 -42 29 21 -25 -410 -51 -108 -316 -53 -172
1142 -172 -182 -88 49 89 -57 113 382 3 194 281 159 127 81 -116 -258 -180 -130 -267 -112 -487 -138 -27 -140
1165 -140 155 120 143 203 193 235 142 236 157 -1 -61 -23 -217 93 -27 -148 -110 -185 -274 -46 -153 -86 70 108 116 91
1191 91 335 83 181 -6 115 13 -261 -130 -150 -135 -137 -146 -235 -202 70 -54 42 138 235 314 10 92 203 81 59
1216 59 -28 106 253 -102 51 -14 -118 -196 -93 -127 114 -239 -111 -46 77 -163 54 57 314 -47 63 -22 -24 -19
1240 -19 -78 -129 78 -180 -66 -2 -173 -114 23 -88 281 -7 25 -130 -185 1 -99 31 -58 57 -1 -153 98
1263I8k6j62J51K1j04l7K01l88K89j21K17J73k51j46J20Qm89O05k09K35r2k10
1285a17j7K74o2J82o2O8l13O8j46m3J96j80j55J70n3J28P0oJ78L1Q2m07K90N0
1309B26j94o3q4M0J94l77L52j40l8K30k16LJ16JKO3Q6n7j84K37L3r0o5k0j57j2
1335a14K17j91k38M5p0J58J8o2K54m0J07j3M1Q7j59K4N1mk24K48p3m4l20J67J23
1360a2p9Jn6J49K9j22Q8J16R9j02k24J25J24m7k40J70j8o5R8j12J46j84OK15l1
1385G4j73J68J79j62Jj20k2M7K11l46K10O1j86k26J74J03o7L6j60J22K12j61n2
1408g7R6k39K47l9l5P4K23k67p6J99k27P9N6k33L07j81j4J84j03K14r6Pk1j01
1432b3pK2K5k60K04Q5q9J37J03j33P1j41K45k53m2K11m77K46K0j09J25Ok29L65
$$ plain form
1263 98 72 -90 61 82 -22 -59 142 -246 43 -78 139 312 61 -85 35 43 -446 159 -50 185 93 -117
1285 -117 -134 140 78 260 198 266 -47 21 -125 -168 28 -152 -307 -137 -190 -62 8 2 180 211 293 -114 176 226
1309 226 32 -31 -115 -75 119 -258 94 -46 -84 146 -70 -67 49 50 52 115 201 144 -40 197 230 140 75 55 -102 -114
1335 -114 103 -88 -326 -281 -351 -193 -175 -237 17 -23 84 71 112 199 40 64 115 111 -113 135 62 18 -302 -135 -12
1360 -12 -91 -90 -146 3 32 -90 -2 114 213 111 -113 12 136 89 -151 19 1 -64 34 -78 68 -116 -110 105 74
1385 74 -99 69 248 86 87 -33 -55 -8 203 -143 67 128 -58 -284 -110 -7 -74 -38 -198 -76 136 -25 -77
1408 -77 19 -220 27 -12 -47 27 250 -17 -93 106 -121 -42 14 -219 88 -93 -107 77 -26 188 92 99 78 -23
1432 -23 -30 -8 17 -243 -39 46 -43 94 197 64 135 -6 239 -14 -56 155 -322 -76 -56 -165 -40 -34 -263 102
1456A02r2J06j35k55L64J19k34N8j09K9R4k13K39J76k10j79J47j84j72K05k6L13
1478A43l45j0L40j27K89k14J46k11K77j67l8j34P3J34j97j27K14j85kO8R2r8l8
1501a17j66L55J51k30J74m6j4m9q8O1J18m4j74Kn9q5q6J18J54j29J96j42Q7N2
1525C9K8J48k31J2M7n7M4j32j00q5K31N4j38l6k5K99o2M6r6L4K9j06J37R4l53
1550a79K97N3j11O1k58l8K83j40J90k55j5L08k98N3p1M4K20j2q1J29k41J79k18
1573a00J2J30q9M2j25J58n7J09M3k4m49M00j48N6J21r0j45L03j0k30L2q3K60n7
1597E9O9j58K20q1p3K98k11k33J88K5Oj29J8l0j74K36K5j80J05j10R8K2p2L16
1621B34k62K89l26M4J08%j71j03L28j70K6j10O7j82J28j11J09J12P3L2Q9k20N2
$$ plain form
1456 102 10 116 -19 -274 90 209 -25 33 -76 -47 47 -166 73 249 39 -140 7 -177 -349 -144 -170 143
1478 143 -202 -212 128 1 290 76 222 11 288 121 83 -51 22 156 -41 -168 46 -139 -141 -73 19 -79 -117
1501 -117 -283 72 223 -7 167 121 107 58 -30 31 149 105 -69 -67 -126 -211 -297 -179 -25 -154 42 -100 -13 39
1525 39 67 215 -16 -4 43 -14 30 -102 -202 -287 -56 -2 -140 -176 -201 98 36 82 -14 20 49 -57 80 174 -179
1550 -179 118 171 60 121 -137 -175 108 -32 158 -97 -112 196 -102 -49 -120 -76 144 132 51 180 -61 118 -100
1573 -100 -88 42 -47 -5 -130 28 -29 80 123 99 -350 50 -98 -42 79 -11 -156 147 137 -93 -61 -144 116 59
1597 59 128 -30 190 109 36 334 123 -110 78 103 109 -20 -2 -32 -206 30 55 -125 -20 -130 -32 -10 -82 234
1621 234 -28 261 -65 -21 87 87 -84 -187 141 -29 -3 -113 -46 -228 -100 -211 -102 10 83 115 204 -16 36
1644C6j25J04j64K00k2j30J13l4l1j24N7J46k35K75k08J54R5kj22lJ05k63L3J23
1668b2Oj93K16j48J11K2j03R0j55J46J32k2KK81k08j02j86K30n7O6k1j58K28j87
1692c2J77q5r0l8J63j84l4J46j13L3LJ02l44K82L1R4q4k2M9J7k19K34q7j02L10
1717B07j38N8o9K9o1j4pO1o2R9q5n4Q5j40J74j59J67J37k81J82j56K08k71J98
1741A08k45P6K8J07j95K4o2K80j03o4J23n9j5l1%m0J93j08J52k28n3J67r8J8J44
1766A19j33k3j14oM3J10J44k1l3k58K80n4N6j5n2j82J04m0J83j14Oq3J87l6j05
1791c7L2j60K05j2k01L45j22k53K31q9K2J48O7r1j54m7J93j35J30l1m4j44K1N9
1815f7m7J93j08K09k39k1J25Pk6Q7k28P5r2R6p6J00P7Pj42J60o7r5Q3J19J05k64
$$ plain form
1644 36 -89 15 -149 51 29 -101 12 -22 -53 -177 -120 26 -209 66 -142 12 107 105 -17 -20 85 -178 -145 -22
1668 -22 -16 -209 7 -141 -30 -8 -111 -21 -176 -30 102 80 82 363 155 53 -133 97 40 106 85 -73 155 -32
1692 -32 145 60 -30 -68 95 -89 -123 23 -90 -57 -54 48 -296 -14 17 111 27 5 54 71 -148 86 -1 -103 207
1717 207 69 127 58 87 26 12 5 66 4 103 18 -36 49 -91 83 -76 91 228 -53 129 -27 181 -90 108
1741 108 -137 -61 -33 74 -121 -97 -159 121 18 -46 77 18 3 -28 -28 -68 125 17 169 -59 -112 55 -43 -25 119
1766 119 -14 -37 -151 -157 -114 -4 140 119 86 -172 108 54 110 95 43 -139 -35 -75 108 -6 0 -83 104 68 -37
1791 -37 -5 -165 40 28 -173 172 50 -203 28 -61 -39 109 176 85 -69 -116 77 -58 72 41 -3 -147 -126 -67
1815 -67 -114 79 -29 180 -59 -80 45 52 26 113 -115 -40 -132 -36 -112 -12 65 72 -70 90 23 -72 11 130 235 -29
1841b9J89j28jJ01j38r1k97N17j16mJ61j9j50N6j5%p2rrK80j23n4K2p3O9k53R9
1868h7N8j04K16j6N8j60J40m3q5J44j76m2%r6K38M5p3j15L9m8J67J38j46J07j55
1893Dk7j5r3j39K96j04k2K5J76J08j44l51K77K43r4p1p0j97K14J27k38K75l99
1916b19J59j06K17j85o2L30l44L67q1R6k09kJ69k44O2K0p0K39j38j37J65J8J5
1939F0j55l4K35k15K82j71J60k3j80j41K06j23J05K0o0pl5M2R2J13j42j5K9o7
1963b4rJ03nm4M4J3k03J40O4K5M6rj80N4K1j32O0p1J64N3n8k96J65K07m3j77J59
1990F7J58k70J19r3q4J10J61j13j71J70K45j29Ql39O7L3PK45k17O5l8l74L90l1
2014a4J11k14j8j19J79J76j65OJ4P8r2q0J8J90j65J97q3j24o7L7L58k88R5j34
$$ plain form
1841 -29 160 32 31 132 -6 -97 -394 123 7 3 164 145 -5 51 36 36 -36 -45 -54 226 103 49 71 -2 67 -186 -87
1868 -87 -29 -133 83 67 125 -35 105 62 -23 121 -55 -97 -97 -193 45 90 17 -98 -59 -107 60 198 52 159 4
1893 4 -23 -38 -131 -270 26 -78 -100 -75 101 209 65 -286 -9 234 140 69 -1 -198 16 143 -95 180 -219
1916 -219 -60 -166 51 -134 -196 134 -210 157 76 172 -37 -39 130 -114 -52 -32 -102 137 -1 -138 27 45 60
1939 60 -95 -129 106 -109 173 2 162 139 -41 -182 24 -99 6 26 -34 -41 -76 -34 58 171 29 14 43 -24
1963 -24 -33 70 65 21 65 78 -125 15 79 104 150 141 -39 15 36 -96 -36 -107 57 110 52 -244 -79 128 85 -92 67
1990 67 225 -45 74 -19 -103 7 168 55 -116 54 299 170 178 -161 -94 -61 -54 191 -26 39 1 -373 17 -14
2014 -14 97 -117 -135 -254 -75 101 -64 -58 -44 34 -58 -138 -120 70 -95 102 19 -105 -172 -135 223 -65 30 -104
2038a04J92M6k48J04P6jj61k2J53P0k19J83k8j45J60J4N3k70J43k27J63oJ7J15
2062E8k24K81k11J40q7J6Q3j11o3J38j30k7L00N1j43M5j78K54k30k6j31K39m7
2085cJ02k54J34K33j43nj1L5p5O1j00Q7j00J17J3j44Q4L9P0q7Q5O1k37N6j7J8
2111A9K4J14j89l3j47L24j16k25K89j08J26j32L3P1R5r7j50K7J55j87J16O6r5
2134b0J47J2l6j58J2j8n3O3J41r4r3P0J28R5j26j95K96k5j64jM7O6n1Lo1l7q6
2161a38LJ3O9M3M4J13l7j42N5K88j99k09J9k4M7J85o5J19j74N8K2k44J46mJ50
2186A38j05M0o7k9R8k09J13j01J31M6o3Q4j98K30J9j66J89k28L1J04J05j56R9
2209A05J1K2l44K49j76J19lO2j01J33k43N1R6q9J16J51j19j72J84m4O8qJ83l90
$$ plain form
2038 -104 88 134 -114 -10 66 65 -96 -118 35 105 -114 69 41 -104 56 70 123 -147 -4 -231 -68 -74 -57 58
2062 58 -166 115 -96 44 -43 -27 56 -55 -118 20 -110 -137 163 214 71 116 -62 192 -38 -64 -195 44 -3
2085 -3 99 -155 -21 212 69 64 53 88 13 74 -26 61 -39 78 91 -53 31 70 140 53 138 199 -38 18 1 19
2111 19 43 157 -32 -65 -212 112 -4 -229 60 -48 78 -54 -21 50 145 48 -102 -75 80 -107 9 75 -20
2134 -20 127 139 103 -55 -43 -61 -114 -51 90 -4 -97 -27 101 196 70 -125 171 146 -18 -19 28 94 43 46 -15 -52 -138
2161 -138 -135 -122 -53 -10 34 147 110 -32 23 311 112 -97 -78 -102 -55 130 65 184 10 68 90 -154 -8 -12 138
2186 138 33 73 6 -23 75 -134 -21 -122 9 55 -8 76 -122 108 127 -39 150 -78 -47 57 162 6 105
2209 105 116 138 -206 43 -133 -14 -17 45 -56 77 -166 -115 -19 -108 8 159 40 -132 52 8 76 68 251 -139
2233a39K95j86K12j48K05l77J26j37J52L2j97L65l78M1p9J70j48J98k96K82p4
2254h1P4P2L6j12m3M20m94J0K0QNN6J54j26o9J84l7r7K27l30J89q7J72k03J8q0
2280a14Q9R9j88M23m15J23J05k12j37K99p0Q7k45L50j30J08j32J29l99K26r6J93
2302I3k74K47k27L9J33j06j3J75O4j80P3j39K23o2J87m20L38j97n3J7J46r9J79
2325A44l8r2J91k08k1J06p6j95K19J22k55l5J20Q0O2k98J09J3J14K2j20L35k97
2348BM3j75J33l9J47k92L68j46L2j27J4o1M6l0O0l2mmn5lK89k49P9j4o4J26j74
2375a30J26l8N9o2P7J4k8j2J52l20m4J99J30j29q8J18j6J49p8q2m3J43p3J35o9
2400I0l26M08j57n2k24K00O5K12k46j71J29j4K8J97j09J46j73k2j2o7J13k06J09
$$ plain form
2233 -139 156 -30 182 34 239 -138 -12 -149 3 35 -162 203 -175 -134 -213 -43 -191 7 -289 -7 -81
2254 -81 -7 65 101 -11 -54 366 -128 -118 -98 -90 -85 -29 125 -1 -70 114 77 -20 207 -123 66 -21 151 -52 -34 -114
2280 -114 -25 74 -114 309 -106 17 122 -90 -227 72 2 89 -156 194 64 172 40 169 -230 -4 -100 93
2302 93 -181 66 -161 -122 11 -95 -108 67 131 -49 24 -115 108 46 233 -187 151 -46 -99 -82 64 -35 144
2325 144 106 14 205 -3 -24 82 6 -189 30 152 -103 -138 -18 62 124 -174 -65 -52 62 84 -36 299 2
2348 2 45 -130 3 -36 111 -181 187 41 73 -54 -40 -101 -55 -85 -25 -57 -61 -65 -120 -123 166 -83 -4 -18 -82 44 -130
2375 -130 -4 -42 17 -45 32 46 18 6 158 -162 -206 -7 123 -6 -94 24 8 157 79 -3 -46 97 24 159 90
2400 90 -236 172 15 -37 -261 -61 4 216 -30 -201 -72 -86 -58 139 30 176 3 -19 -31 -98 15 -191 -82
2423h2m4p8N1J92j56j71K86M6R5j22lj94J11N8j11J33ML1j73R9n0J32j22J26J31
2448A89k88J21j9J58j52N0k43M52o8j13m4j00J78l2j47N4j21K0NJ39q4J12j57
2471i0K23Oj91QJ82j27L18p6l30m4K17N1r1J79l20J46P1j61J1o9M0P4J17r5o6
2496a7J79l32O9kJ16j18L16k05K1J3j62K17p0k8J22k0j04L9J02j71j61L11p3J0
2520E2o3j11K77l45J40P3oM9j43J30k75K36j18J34j76J91K4j16J24J39n8l2j03
2543B3k11L06J46m11J31j24J83j1j20J65r3M7L2j60K01j50j47K61j09p5J26J25
2565A35j32K2k43K72k00K8J65p8J3jQ7q8M0j07J33J3j45j10K41k61K77j8j03J07
2589D7j25J10K01l44L2K6j9P9J4J45jk39j43K84q7N0OL4lj1J11j3m04L23L0j75
$$ plain form
2423 -82 -126 -204 -153 39 -117 -288 -2 44 139 17 14 -180 -69 -11 -122 11 15 46 -127 -28 -78 54 -68 58 189
2448 189 -99 22 3 161 9 59 -184 268 200 87 43 -57 121 89 -58 -4 -125 -105 -100 39 -45 67 -90
2471 -90 133 139 -52 -44 138 11 329 253 -77 -121 96 147 56 235 -85 61 132 -29 -18 -87 -47 27 144 49 -17
2496 -17 162 -170 -101 -103 13 -105 211 6 27 40 -122 95 25 -3 119 99 -5 34 136 -35 -196 115 42 52
2520 52 -11 -122 155 -190 -50 23 17 66 -77 53 -222 14 -104 30 -146 45 69 -47 77 216 158 126 23
2543 23 -188 118 264 -147 -16 -140 43 32 -88 77 -16 31 63 -97 104 -46 -193 68 -41 -116 10 135
2565 135 3 25 -218 54 -146 -118 47 -31 -18 -19 68 -20 20 -87 46 59 -86 -196 45 -216 61 43 -60 47
2589 47 -78 32 233 -111 -79 -53 -72 7 21 166 165 -74 -217 67 -20 30 36 70 67 56 167 154 -250 73 103 -72
2615g2L7k9J34m6k5o1K13k66k9P3K8J46k21R4R0k51R8J97j20J05P0k08N1o9n7
2640a18K49j73j33O6J27k6J03o5J59k29J8N2M2j66K11K1j95K51l75J72J78j84
2662a5o6J92j61N4k8p5L6J43l2p7j08j2O0n3K2J57J08k27J6J07l2j07M4p9J83
2687E0K84k71p2l4j40k5J54K07M5r8j35J95k8k37K59k95J98o3j8k3n1N4L4O8k09
2712a51J78n5J30n5M0p0r8J52j84J53Nl04J31P3N6R5j58L65j56L5j11k49J84J36
2736A42k01J4R3k42K24J44l41L15j44j53O0K79j98nj86J14nR5j59K8j0J48k2l8
2760d8R0j01K5m2k19K24J27l02Q9M8J76j0j45j2Q1K8J02j82j4P9K67l45K77j72
2784B1j21J46Nj54K45j00nl2M3Qk76K64r1j3J17o9O0k06L81l50K8K44j61j8k3
$$ plain form
2615 -72 -35 -64 70 24 -1 -62 151 -115 -144 -71 -43 103 -118 -24 66 -185 -87 110 -10 95 165 -43 8 -61 -118
2640 -118 131 -42 -175 -109 18 -8 95 30 189 -40 -22 30 72 -94 117 138 -57 194 -181 -9 169 -15
2662 -15 -81 111 -50 4 -24 -99 -63 80 48 -29 -137 -149 -89 -142 -120 37 145 -82 -66 41 9 -98 -54 -133 50
2687 50 334 63 -9 -43 -183 -208 -54 153 198 100 -35 160 132 -105 154 -141 57 -6 -24 -47 -98 -44 -10 58 -151
2712 -151 27 -28 102 47 87 17 -81 71 -113 40 45 -259 -128 -55 1 96 -62 303 147 182 71 -178 6 142
2736 142 -59 -45 48 -194 30 174 -167 148 4 -149 -89 190 -8 -13 -199 -85 -90 5 -154 -126 -136 12 -10 -48
2760 -48 42 -59 -34 -76 -295 -71 56 -246 -157 -109 67 57 -88 -100 -19 9 111 -71 -85 -6 261 -84 193 21
2784 21 -100 46 51 -103 142 42 37 5 48 56 -220 44 -47 -60 57 -12 48 -158 223 -127 -99 145 -16 -34 -57
2809e7PL11l57RK85k65Rrj0nr2R5J46j2J55k78nj4J13J61m15K53k33J77k37J96
2835g2L94j25j77o1RK4M5L8j36K0p1q3J7L02j33j20J38k32N9L08j82J2j1M6L6
2860D5M1p7K04j09j96K84k18P4j28p1J43J44q3o4j49J62q8PJ41j56L57k54m2l6
2884f9P6M3M1k32K0Jl7P3q2J35K1J48Jk48n6L6J93P6k62J67J34o9k66N9J05l14
2910c06K28N7n1J53m6k21K94Qno5j44Q3j13K75k69J09J58j10j62J66O5j41J10
2933G3j44p3QL88l24n1n3M6J62O1k87K38O3j16K41k32K14r5r6p6rK0J84j40P3
2958G5q1L2M5j86J57j77M9R5J6J8r0j4J29j66J58r6J42m8mk23L20l23J98k01J68
2983gK10j76j80M5K77n73N92q4j67j61K19qj88L07j54O7J5p6j93K89j00J10j18
$$ plain form
2809 -57 -50 261 -96 -87 198 -67 -58 -67 -77 -82 -174 -79 67 55 210 -68 -73 -87 26 187 -228 25 -208 -31 -268 -72
2835 -72 322 197 20 -41 -32 -8 37 75 -61 -41 -112 -195 -178 124 -9 -129 9 -223 -164 144 -38 -26 -37 9 45
2860 45 86 9 213 104 -92 192 -26 48 -80 -151 -8 136 53 -11 -160 2 -86 -79 62 -94 263 9 -33 -69
2884 -69 7 50 91 -141 -121 -120 -157 -84 -166 -31 -10 138 139 -109 -165 -129 64 140 -122 45 179 110 -156 -97 8 -306
2910 -306 -78 -21 -72 81 35 -186 108 116 111 46 -98 -15 -128 147 -122 -13 145 35 -127 39 104 -37 73
2933 73 -71 -144 -136 252 -72 -123 -176 -130 32 93 -194 44 107 -9 232 0 214 119 23 -53 -62 -42 142 2 75
2958 75 -6 26 71 -115 42 -135 -86 9 25 43 -47 -61 68 -98 60 -36 106 58 54 -169 151 -172 26 -175 -7
2983 -7 203 27 -153 -108 169 -404 188 104 -63 -224 -5 -13 -201 106 -48 19 34 -42 -235 54 -46 64 -54
3006e4p1J36j68J81J06r8j11J73J72l01j21L15m9l4n1J21j93P1J72j31k04Q6P9
3029B6r8j14K38j96J04j0M51l87m5Nr2N19m54K10k09j17J34J68R7j29k19J33N5
3052G0j0j99K29r2N8o0j19KRJ95j77mK96k87K17r3K7L8j95k42M29Lp7n5l4O5O9
3079F3O6k37K68j12j51MR1l4J64j68J12q6M0k6j32k1J35J22l2q0j50J38lJ07k09
3104a31K47J02j90j53J94k8p0k0m7J63j85K64q1J8k22O8J18l8J2J34k08Jk2J30
3128E6J34r6K3j31R2j35O5k51L48j57L32l97K22nO7l53J47m5J09L2J20k64K26
3151A39J61j38j70R4k17J81J65j06Qj77P4p6kJ09j9J45k96L14l88R5J42M3q6p1
3175g6J87k0j04m5J28k8j45j23J77J19j00j14O2r5K26L7j96K92J02k39K13k07
$$ plain form
3006 -54 -125 11 -157 24 130 32 -79 94 266 -35 -156 159 110 76 25 146 -47 24 196 65 -139 -53 26
3029 26 -72 -186 52 -144 -40 -50 401 14 -31 -26 -118 401 -53 157 -52 -169 -35 133 230 101 -118 15 70
3052 70 60 -139 90 -2 56 -4 -123 -121 -112 83 -94 -98 198 -89 128 35 62 100 -95 -337 92 95 18 -37 -71 -6 63
3079 63 129 -108 160 48 -103 -99 -8 -42 122 -46 66 -20 20 -6 -138 -159 -24 98 66 -14 -164 -26 -29 78 -131
3104 -131 116 218 28 -125 69 41 -29 -49 -96 67 -118 146 65 83 -139 -71 47 9 21 155 -53 -52 -74 56
3128 56 190 94 117 -14 78 -57 8 -243 105 -52 280 -117 105 100 167 -186 -39 -84 25 57 177 -87 139
3151 139 300 162 -8 86 -131 50 215 109 117 -60 14 -62 -64 45 26 171 -125 189 -199 -104 38 81 -5 -76
3175 -76 111 91 -13 -58 70 42 -103 -226 -49 70 -30 -144 -82 -177 49 86 -110 182 284 45 258 51
3197E1k21J49J07j30L8k5j04J54qn5J94k43o3R9J4l6O7K3J04R7k2j92J39q5n2
3222@o7k5P2m4O6qj46J19J31q0P0rO3L9l09J71q7m3J4j5k0J56j60J97j76J12n4
3249c3L3J3p0Q5L3j43J64r9P8j81M38j72j56K19k27J61j96n4N2P1J40m8j55j23
3273a70K11m4J03j68J19k5j69J35j35K56Rj66j86K51P9j50P1L2j10K72j49J07
3295A73j81m4r6J21j31L14j70J18l4Q4q7r3R6m3P2P8j84O7j6k13L08k82J21mK7
3320Ak1L8j25K06QO1l90J88J1L8J9l2k61K18J48J2j34R9l6l2j35J22N4j37R6j7
3346ak7P4k0j6k12K45kj51o7J81l8n4J74n1j07l6k7K23j09N7k53L19j69K35j40
3371B8l8J3l58L51K19k31R4j08K03l36J39R4LJ7o2r9K74mk16M3m4K1n8r3J49p
$$ plain form
3197 51 -170 -21 86 -44 -6 -31 -135 19 11 -44 150 -93 -156 -57 -43 -79 -12 11 115 212 190 -2 137 52 0
3222 0 -67 -92 -20 -64 2 -6 -152 -33 98 18 88 79 142 181 -128 43 -44 -87 -73 -88 -108 48 -112 85 -91 21 -33
3249 -33 0 13 -57 28 61 -82 82 -17 61 -120 318 146 -10 209 -18 143 -53 -107 -55 16 156 108 -47 -170
3273 -170 41 -3 100 -68 51 26 -143 -8 -143 113 122 -44 -230 21 100 -50 21 53 -57 215 66 173
3295 173 -8 -52 -148 -27 -158 156 -14 104 70 154 67 -26 70 27 99 177 -7 60 44 -169 139 -143 -22 -26 1
3320 1 -20 18 -107 99 107 168 -222 -34 -23 15 34 2 -259 -41 107 119 -15 84 48 16 -119 3 57 -80 16 -1
3346 -1 -28 46 26 10 -202 43 41 -110 -177 4 -34 -88 86 35 -72 -108 -135 88 -21 36 -217 102 -67 168 28
3371 28 -10 3 -355 -4 215 -16 78 -30 173 -163 -24 70 73 90 28 -71 203 199 -17 26 -18 3 -55 -148 1 -6
3397fK0pl7M4ok06J67j77K88l18J14K79j05O5j15O1q9K5m4N9j61Q4J63j65J73
3422A06k18L11j82N3j21j27J95j36M8r4K90k30J19Q5j07lk9RJ01j69q6r0K83j2
3446dl6r1J90L0k71L77k40P7N0n8K21j44l0j83K75j78L6J6k7j31J24L06l66J03
3470D6m9j5j12J29J5j78J18O1j82K59j02O9n2K7j14J86k00R2l4j47R7J38L9J20
3494B11k68J51j71n3L0L23k22M4n0R0l8%J3o2J10r2K4j40j26k0K59j22P6j48J84
3519CJ20k33n4K61j07J6o9k4KL59l91O9L4kO4j04J55J9j99J9K4l7J06k51K94j9
3545E5k01K27o4j27R5k04J60L7n4M6J51J19l89R0J56j9j75K50L5j49M8j47Q5k8
3569cP3L7n0r5P7q7O5l1j97K53L8k9K7k70P6mJ20N5K7k08J08N5o1j88K53P4N2
$$ plain form
3397 -6 14 7 -30 14 8 -198 -31 -208 80 -238 -124 155 50 115 0 61 -28 -3 -47 12 -149 -65 98 -67 106
3422 106 -112 199 17 70 -51 -178 17 -119 -71 -165 125 -105 14 99 -8 -11 -40 -31 70 -99 -185 -275 8 -4
3446 -4 -40 -131 59 89 -182 195 -45 32 82 24 245 101 71 -112 163 -15 21 37 10 -121 3 309 -57 46
3470 46 -3 -18 -130 -1 14 -164 -46 15 -167 92 -10 59 7 34 -80 106 -94 -2 -36 -183 -86 52 91 211
3494 211 -57 94 -77 -130 -100 223 1 45 -5 85 47 47 60 -2 108 16 40 -100 -226 -246 13 -109 -33 -181 3
3519 3 123 -110 -164 97 -10 6 -63 -87 -85 274 -117 -48 -14 -16 48 -56 99 118 -81 -62 -38 -75 31 -220 74 55
3545 55 -146 81 17 -110 -15 -219 -59 -22 -76 -30 121 240 -149 -59 97 78 -97 153 188 39 87 -60 25 -3
3569 -3 70 107 57 -38 39 -48 17 -14 -211 42 80 51 78 -192 -116 -120 0 55 82 -126 -18 37 -24 -212 41 115 167
3596A67o3k42L33j24J89k16q0l1r0J08mL5R5M4j41j75J84M6k01K81k61K14j55
3619h7j1L33k05N8L2k52M7K79j21j05K47k94J34k14J37J33j49R0p0M3j54K55j75
3642d9N1qo6n1j7J83r0k6j66J71O4k2j4p9J74M3j75QL08j86j51J10O5l9J60j31
3668F7J22j52j70K12k72M42q8l08O6K6K54o3j29J77k13q0l3P0J09k7n5Lj26J6
3692a52K78k07J23j75J61q6J01j84K29j9j10J89j63J67j66K08k19P5k33J2J48
3713b3N3mJ86l80L34r8o0J05k77N3J85l38J13K60j57N6r7l2K96j40p5n1R2j65
3737a64J24J29l04L0N7J36mM4j41K02Rj45O6R6k99R0k35K01R3L16l54O3J10r0
3761C0j48J2Ql2kR3j52J6L13p9j08M19n61J85K03k45L3K51j13j28j73M30k22p
$$ plain form
3596 167 104 -138 195 71 260 44 -36 -67 -157 -49 -53 -18 77 121 -20 -195 -11 35 -166 115 -146 68 -87
3619 -87 -98 235 30 88 120 -132 -85 194 73 -32 215 -79 55 -159 -22 111 -38 52 -18 25 -129 126 -49
3642 -49 2 -6 -72 -123 -140 43 -47 -73 -239 -68 -4 -26 -40 -119 55 98 -77 -69 239 53 -98 12 77 38 198 67
3668 67 189 37 -133 79 -193 249 161 -147 -81 -55 199 136 7 184 -29 -109 -142 -72 37 10 -45 -42 -168 -152
3692 -152 126 -81 42 -133 28 -58 43 -141 88 69 -41 148 -15 152 -14 194 -25 50 -183 -171 -23
3713 -23 30 26 212 -168 166 68 8 113 -164 -111 74 -264 -151 109 -48 8 -89 -121 175 35 -40 -91 1 -164
3737 -164 -40 89 -215 -185 -128 8 4 48 -93 109 118 -27 39 135 -164 -74 -309 -108 -15 301 -53 10 120 30
3761 30 -118 -106 -98 -130 -132 -39 -191 -175 138 59 -49 370 -191 -6 197 -48 -15 236 123 -5 -178 252 30 23
3785B3q2QR3Q0j60K5J27k9r1m5J16r9k3M8n1K8J86l2k52k8M2J65j02R7m7k1L4
3812A0j18M4p2K09j99J34J30R8l8j90K9K33k96j0p2O5r3J66j74M7K37n5JJ38k31
3837gL5J3n5K6p7n4NJ46k38K48J6j12J62K27n21J30J12j34j79K90q1P6J7J03J07
3862B55k00O2j67K63m32M08k08k9oJ4k17K02N7Rj56K11J05j5M9j01q2J05n3k03
3886a29K08j21q8j51L55k62L36q6j75L69j69k11j69L29J16j79j78J08n9K25j75
3907a06m2K09m9o8M4R7j66NL1J22k18J45q0J10j78q9K62j11J18q0O2j10K30j19
3931A9J14j37k5J60j68R3J37o6j46L0j4m4J20k10J48J4p0j01J72J38j43J03l28
3954b04K54r4M6J86l25M3R5R8m8QJ28j67k3M4N3N2j89P0l6J11j9M9k9J9R4k24
$$ plain form
3785 23 -59 -51 42 122 -38 -13 114 85 -6 -51 65 -34 -57 -9 -60 -32 154 122 -130 -158 -116 49 -53 44 -3 -24 10
3812 10 -108 -64 -136 73 -126 8 138 236 198 8 37 270 -26 -36 -108 -43 -136 30 -144 -97 140 85 86 224 -7
3837 -7 28 41 -14 12 -65 -119 -114 32 -206 42 58 -54 108 335 -186 -56 56 -78 -257 33 -48 28 45 148 255
3862 255 55 117 -50 213 -219 189 -19 -48 -54 -40 -257 -55 2 11 -145 66 171 156 205 104 22 127 74 -129
3886 -129 79 -42 -130 -281 74 -188 148 62 -113 256 87 -124 -293 36 152 -27 -205 -97 -156 69 -106
3907 -106 -148 61 12 -56 -12 85 -81 -76 -45 77 -141 4 -76 34 -144 -233 29 -82 36 -44 18 -92 138 19
3931 19 133 -4 -29 131 -37 56 193 127 -19 11 -3 -47 73 -137 11 25 -45 -146 26 164 21 124 -204
3954 -204 50 -44 2 188 -137 -94 1 99 51 59 187 20 -3 41 94 146 -43 27 -9 102 83 132 103 122 216 -8
3980hM5J08j47r0j78J04J18J3J21J2O7j27Rnj70L7J76j77qJ46p6J38k03L51q2
4005A74j64n1l6Q8p4R8o0q0J17M0l6n8j63K83O1j89q8M5R7Nj08J29L2K4l1k93
4031b38K87Qo2q2J09N2J5j30O4K3k06J12r3k7J46K4K8o2N6OK3k86J21J62k1L5
4057F4nj07J17Q2j49R6j67N3j59J28M1J72k13K4j17q4L5R5kO3m9Q7M1o7J26l01
4083a96L54K5k25q7J62R3l0L5j41K2j12k2kK21o7k8o1LJ79j25P6q6R2m44L24Q
4109c2p4Q3L4R1k5N2j25O4j22J11qj18n3L27k80j3J49r2K6J21j81N7j14J01n8
4134g9J34j69Q8o5K2N2J68p6k58K13r5J11K1k71K60L1k54L18QJ2j57p5K52j88
4158CR0j46L6m6J1k1P2j0n5Q2N1k28R4J64kp8K4P1o8p5J89j80k1K58m54M87k60
$$ plain form
3980 -8 37 145 -2 -92 -270 -166 -48 -35 86 98 165 38 47 42 -128 -91 85 -92 -100 46 -30 108 -95 256 174
4005 174 10 -41 -77 11 -63 35 -25 -105 12 52 16 -42 -205 78 139 -50 -138 -93 4 9 -99 30 62 86 55 -238
4031 -238 49 57 -5 -87 22 74 89 -41 23 46 -160 -48 -141 -168 -22 2 30 -32 24 30 53 -233 -112 50 29 64
4057 64 59 -48 69 151 2 98 -69 -16 -175 -47 -6 166 -47 -23 -140 -224 -189 -94 -96 -33 -82 5 46 -21 105 -196
4083 -196 158 183 -42 -129 33 126 96 131 -10 12 -100 -122 -124 97 30 2 -59 -56 123 -2 74 -12 80 -364 -40 -32
4109 -32 -106 -23 11 102 77 129 4 68 -54 57 49 -69 -122 205 -75 -88 61 -31 -5 116 -65 -8 -122 -21 -79
4134 -79 55 -114 -26 -91 -69 -17 151 75 -183 30 -65 46 67 -204 56 87 -167 151 159 171 14 -61 191 3
4158 3 93 -53 -17 -63 -52 -73 -1 -11 -66 16 67 -161 -67 97 95 17 41 112 44 -31 158 -22 -43 215 -239 248 -12
4185a2O3J0n1m5J53k19M0J92k60Q1R2LM6J67m11K19j08mk0K9J57j19k10K77l08
4210b38K53j12L6J73k14M91l10J23L1k52j4J56n9l8j46M0q7K31O1j56l8p3J09
4233c3J03p5l4k06L78k45J06M2j21J61j74p7K18r9J02M0K2P8o9j23r4K38j84L1
4257a5j52K03J43j36kQ8k25m7K77k44K98l34L3Q8m2L86m64K88m2j59k08K62n5
4280e9J80K0m4n5j28M4K04k15N8J50k1j10j06J00k9L4J58k17J09K6j53%J59j60
4304e5m8M5j24L28k84k3k3K04m4p6P8O4m1j41J92Q2k28K6J01j05L9jN4l1j01J63
4330E1Q9n5j80J88R6k21M0J1p5LK4N2j9Oj63q8k7M48K7l50J46Q4j34M8K24l34
4356a09K36j13q3J5J31k71P2J42m7J5P8k53K01r9k7q7J98j26K10j69np7K24Oj55
$$ plain form
4185 -12 51 61 10 -35 118 -101 -61 131 -129 -48 44 47 93 260 -151 68 -40 -44 -64 -35 122 3 -207 70 -238
4210 -238 15 -97 -61 112 -102 389 79 202 233 -19 -33 123 64 26 -120 -80 -167 64 125 -31 -69 -142 -33
4233 -33 70 -5 -39 -245 133 -112 -6 36 -85 76 -98 -175 43 -56 46 86 108 186 117 -6 -100 138 -46 -15
4257 -15 -167 36 179 43 41 129 -96 -143 134 -110 188 -146 -113 -25 -67 319 -145 143 101 -58 -266 -4 -59
4280 -59 121 141 97 42 -86 -42 162 -53 5 155 134 24 -82 18 -11 23 181 -36 73 99 -54 -54 105 -55
4304 -55 -103 -58 -182 146 -138 -161 -184 20 -24 -100 -22 42 1 -140 52 134 -94 -68 33 -72 -33 -34 20 -11 -112 51
4330 51 140 85 -95 93 189 -32 8 19 -56 -53 -29 23 4 10 -153 -241 -268 180 207 -143 3 87 -47 1 225 -109
4356 -109 127 14 -69 -54 77 -194 -122 20 -27 -12 66 -187 14 -85 -112 -199 -1 -127 83 -86 -91 -168 56 62 -93
4381i3J83r9k39K64n0P4p4M5N1p6lq8J82R1m0k93Q3K29k85J03O9K85l97P0J6R2
4407A00q0p3o2K55j10k4P9j1J20k49j7O6m5R9j33N3J74p8l88K89l0n4L30m01L05
4432A15m57N97j88p8r4K00J8j40O6j21q0J70J29k40J18J2j52M8J04j09R9j31K59
4455A45k16O2Q0J19j81j04Q4p8K16n7j20P6L7K1j9o5j02o5K62MN6l09K07r7J17
4480G3j59j2n8M69k60j91K76k10K30j22j35j07P2J27Q5m2J03j38K8j11j7m7J89
4503D3N2j19J01R3K7k23J23j86O7N7J4nj42J38J41J17k36k5N9k39J40q0j03J86
4527@J34k38L5J31J05k19P7k0R7Q9j45n6J00J5L7j99j57K25j36K23k45J54J69
4550A76j0j40j11J79p2J76k33m2O6K9L04k84j55L3J88Oj00K2n0J55j19J16m11
$$ plain form
4381 -93 90 -9 -248 16 -34 40 -34 11 62 -14 -17 -105 77 168 128 -165 -82 147 -138 -35 34 319 -78 -8 8 100
4407 100 20 -53 -115 140 30 6 85 74 194 -55 -72 -6 -51 48 -85 -32 142 64 -324 -35 -65 -119 211 -190 115
4432 115 -342 255 67 -11 -105 95 113 -27 39 -82 -162 8 137 -103 15 27 -125 -77 27 -82 17 -114 145
4455 145 -71 -9 71 190 9 -95 -11 -89 127 70 -50 26 63 84 65 0 -102 -167 95 99 155 -154 53 -44 73
4480 73 -86 -98 -156 313 53 -138 138 -72 158 36 -99 -206 -134 -7 78 36 139 1 29 -82 -99 -146 43
4503 43 95 -24 77 170 197 -26 97 -89 -22 35 49 44 -98 40 181 298 62 37 96 -143 -3 -83 -186 0
4527 0 134 -104 -69 62 167 -52 25 5 102 191 46 -10 90 105 142 -57 -214 11 -125 98 -147 7 176
4550 176 166 26 -85 94 22 198 -35 -77 -11 18 322 38 -117 -84 104 110 10 32 -18 137 18 134 -277
4573b77J90J46p0J58k78J61j90K04pO6k9j1j41l8J47oq1J57j55J27l31P8J91M8
4597E9j51J91p5L5M1r1n0O4k54K45R1j63K06J2j27n1o9Q5r2L1L4j77K06M1JKj25
4624h1l6J15k6p1K08k9l9KRm2j49K81j36J22n1j50J37l41J88M40m57k6K20k4M3
4649A07j04J5n9j48O7J14l9J9R3j71J92j60O8NJ02k04J40JJ9Q7k12Q5J0k33K31
4674B5L9O1l5l41K76r5K00j41J05j33p9K65O0q8j07Lmj4k5J68J7k77pJ68Q4j19
4700Fo2K6M1k83K88j2J72r4j79Q6k2o5J15ok3J5r7K20p1Qr7J29o7j69K34k06J76
4727F3Np2J80O9l67K93m09J21J73k53J98J46k84J31K5O3j18p7K2J92o1l1K37l11
4751f5J6N2q3O0J89l29M18k25J45k69P1J0n0Q0L6j65J46m1m5q5K35j29j00J18
$$ plain form
4573 -277 -87 59 -11 147 -131 30 -160 44 37 103 74 63 -78 -116 31 25 -56 101 -54 73 -258 -180 11 59
4597 59 -92 99 24 59 100 9 -41 23 -231 14 105 -58 148 160 33 -18 -87 -2 -94 -63 -29 -206 0 41 42 44 -81
4624 -81 -117 -2 -28 -99 109 80 41 43 52 10 -139 142 6 128 77 -73 64 -277 -89 351 -106 -132 88 64 107
4649 107 3 18 -41 -189 -122 -8 -47 -28 65 -106 86 -74 -6 -1 101 -103 37 38 57 144 -68 17 27 -206 25
4674 25 64 125 90 -251 25 -70 130 -11 94 -39 -118 147 207 119 12 15 11 -3 -28 140 157 -120 -127 41 125 6
4700 6 -56 -30 11 -272 16 4 176 82 -97 -11 -33 -98 17 11 -12 3 -94 126 55 63 -34 95 28 -141 93 -113 63
4727 63 68 -4 176 245 -122 171 -238 -117 56 -197 1 147 -137 -6 19 82 -36 -113 -91 101 40 9 246 -65
4751 -65 -49 3 -80 -20 169 -160 258 33 178 -91 -20 -10 -60 20 56 -109 37 -4 -49 -134 101 -28 -128 -10
4775a0P2K37k68j55L83l47K4n8P1L4m3K35k42r1M36k25j7P9J0j68j11R5R2M5l
4800G5J1Jq8K3n6L0o8L09j53k6nj46Q1n2J31j1op9lq1J26k03NJ44rp0J30K19j51
4829G8j33Q6J47j09J5k12J63j93J02j40K64L7J57j56l09K82r2N9j0j38J88k01
4851a15K16l1k46L08p6J75j75P8j34j83q1L40K00k87K39l37J61j4nm0nj00o3K21
4875D6pP1l01J82L3qk33J27P6J2q1J58q6j32J00M0P3L9j80K19j48J14k64M3l6
4900a43K9J28J2q9Q8L1o8R1j47J0k57K33j62K59N8j46K80k17J13j11m7J50j78
4923h3K99n05M88k1k8n4k26K9J5R1K9m4j3r2J50j32j65J10L53J10k81K8l9k13
4947a94J50R2L1j91J69r0L10k19j30K6K16m40M87l93K14j93K88k3Q6j13r7n3K21
$$ plain form
4775 -10 62 299 31 -124 259 -88 -64 -122 -51 -17 -60 175 -67 -158 278 53 36 115 125 -43 -154 -59 33 78 75
4800 75 86 87 -1 22 -34 -4 -72 237 84 58 53 -93 -12 -64 67 56 50 -29 -32 -113 13 -190 -185 -41 -50 -120 10 229 78
4829 78 -55 31 178 69 84 -128 35 -158 -56 -196 68 105 262 106 -203 79 -13 46 36 -102 86 -115
4851 -115 101 70 -176 132 56 231 56 134 0 -183 -264 76 276 -11 228 -109 52 38 33 -7 -12 -112 -175 46
4875 46 39 110 -191 -9 24 16 -217 -90 -14 -2 -83 75 -11 -143 -43 -3 70 109 -71 148 0 114 -150 -107 -143
4900 -143 -114 14 26 -63 25 56 -12 79 -68 -58 -315 -82 -244 15 73 -73 207 -10 103 -8 -55 95 -83
4923 -83 216 -289 199 178 150 96 -130 -101 -86 5 34 -10 -23 -115 35 -97 -262 -152 201 311 30 58 19 -194
4947 -194 -44 48 79 -112 57 -33 277 58 -72 -46 170 -270 217 -176 38 -155 133 110 196 83 -14 -67 154
4970A54k16LJ38l26J26J74J16j42M5kj36JJ47r8J19k05J11oM7J35k30J0k9Q0r4
4995g8J42j33J13k0kK24l59J11k21r1M29j13j4J41k50J27j12K93K4j95j23J34
5017B7R9j97K14q1rm6P4o5k34K21R7PM6j66p1R0j07J58n9K9k6L1p2J1K8k6J89
5044A62j38L1j03L6O4J0P0m13L74k72K77k02J10N0j81L3J34L0q7j00K74k82J20
5067cO0L5l3p5pr7L09l9k00JO4N1k23L39p6j46K4r8n0K92r4J24k71J71L2J86j10
5094A66o6j03l2J43M1j47o5j4p6K55k3r9j42K79j45OM3j59J70k95M15j31j24L83
5118B80k61N5Q4k04j19L37j34j73J88j01j3M8n1k8L56o5l73J54K07k46n8K76q
5141A51j22J07j34J13KO7k39P9K0K1oj80J71j39N9l1j29L37Lj10j76K74l48L64
$$ plain form
4970 154 -62 -59 79 -247 -121 53 169 27 72 70 -66 -65 82 -16 103 -102 9 3 50 185 -45 -35 -64 16 -78
4995 -78 64 -69 44 24 22 246 -113 -2 -223 -314 115 2 -12 129 -121 6 -106 187 211 16 -107 27
5017 27 126 -71 143 62 53 7 81 16 -218 3 100 107 153 -13 -84 6 -101 57 -2 27 1 32 -40 -29 -1 -27 162
5044 162 24 55 -48 -12 52 62 132 -281 93 -179 98 -104 6 56 -125 -92 42 72 -15 -115 159 -123 -3
5067 -3 57 92 59 -16 -23 -120 189 150 -50 -49 15 66 -157 182 106 -40 -16 -114 -164 128 34 158 -113 58 90 276 166
5094 166 100 -3 -35 108 149 2 -63 -77 -153 102 79 -20 -162 117 -28 -22 21 -138 32 -263 152 21 -103 280
5118 280 19 74 158 -46 -165 172 38 -135 53 -48 -61 -13 -64 -92 264 199 -174 -20 187 -59 -117 159 151
5141 151 29 136 2 115 117 184 -55 24 44 65 59 -121 50 -89 -30 -61 -190 147 150 40 -136 138 -210 154
5165A54n0j28Q6j00RJ71j62j27J96N0k26J34K31l15M4j29J21K10j77ml1J60k2
5188I5l05L09j23J08j21l6O4J15O3k58m2p3Q5K32j92P7M7lj61k55M63M9k33l8
5212a33M6J63J68k72J26m7j65K8K44j49J60j63K50m39j0L49l6nJ19k56o8J26N4
5235I0NN8q3o7m5M3n1K31j08m1R6k07J13K0j23k03K24j09K35j89j18K52j47m5
5259a69M7K9nK13j53J28p0j80J64l7Q6M0j62J35M3k4j6o3L8J43j97K7k8R5j79
5284i5K41k65J59J2J41o7k66K71k06J10L2j39o5J84P2n1lj60L6P4l2m2L4%J81
5309A56k47K31o7j00J14L9l13J70J14j51J80j4P3j97J45j21r0J9J22O4o2r0j95
5332b20M42j63j58N9K03j35j87J2K4J56J8J75j54P3l55J87J0J43l8L6k52K11j51
$$ plain form
5165 154 104 -24 62 -38 -29 142 -20 -147 49 99 -127 7 238 -77 -33 -162 -41 169 -8 -12 -43 117 95
5188 95 -210 99 -24 84 -37 -73 -9 106 169 -89 -131 -204 -119 113 -79 -2 45 42 -119 -374 89 138 -95 -133
5212 -133 -87 76 244 -28 98 51 -114 -86 158 9 169 6 256 -183 -193 156 120 115 234 -22 -90 36 90
5235 90 95 153 70 3 -42 1 -50 181 73 32 128 -79 34 54 -69 -272 -48 -157 78 -111 -229 23 -124 -169
5259 -169 -122 -93 -98 115 -38 90 20 -160 4 -33 53 93 -69 66 109 85 69 6 44 187 -10 17 -11 84 -95
5284 -95 146 -119 40 52 193 126 -140 131 -75 35 67 -72 -137 47 119 68 65 -95 -59 15 -17 -59 -25 -25 156
5309 156 -91 140 73 -27 87 126 -187 -17 97 -54 126 112 185 -12 133 12 -78 -59 63 127 65 -25 -220
5332 -220 222 59 -99 -40 163 28 -159 -147 -123 33 51 226 72 145 -210 -23 -13 130 92 128 -124 87 -64
5355f4N1o6R2P3k97J24L8P1Pl19J98J7O6J10p6n4K2j47J05L8J02j27j14O0Q8l6
5381c8J26j07M9M6m3q9%J91k13J31j29N9Ok49J36P5j95K63j5r2J58p3j14R2k2
5406d7J26k11l1L11j89o3J45m6r4j1J1q6L62j87j8K2l5o1J30Q8k46P1j88K66J04
5431A23k2j26P8m6j40K42j68J35j4n1lq4O6J5j18J16k1J09kl5k36J79n5q8o3L70
5457A61q0k58K03r0J39Rk42l7J19K29j65O1j11j13K34k26J69n1q6J96k03K73R7
5480B28k57Q3J7j10K60l51j0L30j96P3P6k33L4O2N9r9K65k40q3L3J48J90k80K
5504Am0OO9j94L2J6M3Q2N9m8k10K41o7m6J96q4%n7k09O4Q3K36r5j99J26j19J66
5531E2j5J3l0P1l8j71K71k30J65k72K60j48R1J27k25J36J72l12n1K06j38R2k19
$$ plain form
5355 -64 -13 -79 13 86 -211 -87 -49 22 29 -290 -92 -75 -9 101 25 -29 -7 -154 -49 -11 91 -36 -150 -90 -2 -38
5381 -38 88 -19 30 76 33 -56 -56 135 -78 53 -76 -17 -11 -260 -124 -49 -244 19 4 -88 70 -3 -117 -25 -47
5406 -47 79 -132 -163 148 -41 -104 41 -5 -99 -110 -99 -185 177 -10 -28 -6 -41 -102 28 116 -130 -59 -247 19 123
5431 123 101 -25 53 7 -133 109 -59 76 62 11 8 -76 -10 5 -113 3 -18 91 89 54 -182 -3 -58 -146 -209 161
5457 161 81 -177 26 -64 75 84 -158 -195 -76 153 -12 49 -62 -175 59 -167 2 -49 -135 61 -142 131 228
5480 228 -29 54 71 -39 221 -130 -140 190 -6 67 143 -90 -56 6 65 -34 231 -9 -92 -59 89 279 -1 1
5504 1 -39 -33 36 -158 -126 -110 -67 15 74 26 -184 57 -10 -56 140 56 56 -1 -210 -146 -63 173 78 -121 5 -114 52
5531 52 37 50 20 91 53 -118 153 -77 88 -184 76 -72 19 146 -79 57 229 -83 -134 72 -66 26 -193
5554a93K74r1o2N3J75k57P7L5J18l57L37k15J23j03M0j53K92P9k25L62j19k5j88
5577b3N5np3j86K07k0J0J5J00j23J19j85mM03k62q4J7L9R5O0J08j63L6k95J1J30
5603a8K4J2j57K47j38o5O2J48k67J84J42q1j1L0k30K50j05j16J68k17J71p0l5
5626g2M7L9N8j05J17l2j14o4L8J81q5k10L11m3m8k34J44K63k35j04J09L4P3l1
5650C7Prj02O6k42K46j56J34O1J04p3k74K40R0k39J44O6j06J22o5n8k4r1J81j82
5675a23L43k50r7k2K20j02j73J33J85j93O8j09m8oK53J5m3l01J16J56k9m3J43
5698I3k15R6J4K49j48q9R4l1j72q4K52L1M0l36J70K00k80K05r8o1j19J75O4l8
5722A2n1K54jl30J73J74j30r6k57K46l3J64k7q0n2J80j94J36q6L9Lj47J38J9l8
$$ plain form
5554 -193 81 -10 -72 -19 156 -101 -24 11 129 -228 109 -106 17 -86 -46 -199 93 172 -53 309 190 165 -23
5577 -23 32 27 -46 -232 -25 -45 -35 -20 80 -43 76 -109 -113 290 28 -56 -39 0 95 155 263 100 136 -159 -148 -18
5603 -18 6 18 -139 108 -30 -95 -33 115 -152 32 174 93 82 112 -118 132 27 -89 79 -138 33 -37 -72
5626 -72 -25 14 72 -33 84 52 -62 -126 -88 93 8 -202 109 66 18 -216 -72 191 -44 -148 -39 -5 68 37
5650 37 44 35 -67 -1 -243 3 -153 -19 42 146 73 -201 39 129 -110 34 100 -6 116 51 -7 -31 -122 59 -123
5675 -123 220 -30 -127 -149 71 -31 -204 -71 114 -79 -11 -120 -168 -174 79 94 51 -250 -134 22 -7 -50 93
5698 93 -122 -26 -12 237 89 0 94 63 -109 -193 59 90 130 -206 -36 164 -116 89 -9 -70 -189 -14 50 12
5722 12 -39 215 214 -116 57 231 101 5 -252 -6 -39 125 98 18 -34 146 -48 88 2 41 44 -103 35 54 16
5747A6j84J26K41l23k7L45l48J08j1N4K60l05K74j81k9lK2m1kR3r4J21l10m4K41
5772aJ49j38J13n7j24P0m5P9J4l0r3K23ml1l20L14j83K7N5r1P2p6O3L7k9l3J83
5799A44j22J09j85J59j10q6m5J87K00l13J26O6j39k7N0n7J19O4j01p9M2r3J93
5822A02j52K36m8N8j92l9J29J2j81j06J92j1j17p5J60J00l6j16J39q0o4K2J45
5845G8k09J68j33lJ91l33J61O5p9p3R6J3J73l13L35k87K57M0k0p0k31J86R3j65
5869f0j21J70J30o0O5k5q3J04k67k0K15j17J72j21J08P2k32K93q1k38q9K60J39
5892B14k75P1k14J16m2k1L66j95j1QQ5k28L07l5j39J4j39K67j32M0pj97J79J9
5916E1P3q8oj13K66j34j21J33j11p6J31j1j39K27k5j14m3J69Pm4O8k45j17M23
$$ plain form
5747 16 -168 -42 199 -124 -151 194 -154 -46 -57 -3 257 -48 226 45 16 13 35 -6 -8 85 -9 112 -198 -242 -1
5772 -1 148 10 123 66 -58 12 -33 46 60 30 -63 160 156 125 -195 119 -64 -37 18 -73 -1 -77 -14 23 -6 -39 144
5799 144 22 131 -54 105 -5 -91 -136 51 251 -62 64 130 -9 -36 14 -43 76 140 39 -40 2 -91 102
5822 102 -50 186 138 196 4 -35 94 106 -75 -181 11 0 -117 -192 -32 68 32 -84 55 -25 -89 -67 78
5845 78 -131 37 -96 -99 92 -241 -80 -15 -94 -167 -71 -58 115 -198 137 -150 107 147 127 57 -174 12 105 -60
5869 -60 -181 -11 119 59 124 99 16 120 -147 -167 48 -69 103 -18 90 162 -70 223 142 -96 -185 75 214
5892 214 -61 10 -204 -88 -130 -151 215 20 9 17 102 -126 181 146 7 21 -118 149 17 57 50 -147 32 51
5916 51 124 36 30 -83 183 49 -72 61 -50 -126 5 -6 -145 82 57 -57 -100 69 76 32 100 -145 -262 161
5940A61j71j52K94j09L7j25J75o8R1n4j15J05m07K46J84n0j61M8O3Q6m2M5L3r3
5964B1j43K47p3j95J71k82K28K20M8k71J74j58p7J07O5m5L8K6oq0o1J59p9J93
5988B27j83K8N6j16qO0O2j31j00O6l6O5Kk28L64l77K79j24PM2J30j23j04J28L8
6013B4p2K4J93j73j26K10o6l5J68k22P2J16n9m9K6J1p5n3J63m0P6l27J24J15N0
6038G5j16j22K19j22J88k00M0L1J23j79K0J23N5j95K95j23p4J4n2O3j83j53J50
6061a23O3K8J14k08K57j55Qk2j20N9j0J66lj38j2J45L9k45O6K98n6j83R6r7O9
6086C6N2j37jN3mJ14r6J86l49K38k15J08o9Q7P9J2j57L3P9J20j23n4J28k4o3j3
6112B0Q8j45N1O6j39K06k87J50k3j54K17O1J45j10l15J46J9Oj31p3J59K8p2P4
$$ plain form
5940 161 -10 -162 132 23 60 -65 110 42 133 79 -36 69 -338 -92 92 42 -119 -71 -8 78 36 81 114 21
5964 21 -122 125 52 -143 28 -254 -26 194 242 -29 145 -13 -90 17 82 37 75 101 95 15 -46 113 34 227
5988 227 44 72 128 12 4 64 126 -5 -105 -39 -75 -10 -8 -236 128 -249 30 -94 -87 -45 85 -38 -142 -14 24
6013 24 -48 -24 169 -4 -130 80 14 -21 147 -75 -3 113 54 5 31 42 -33 -86 77 37 113 -214 -90 25 75
6038 75 -41 -163 56 -66 122 -78 -38 -7 116 -63 -43 80 135 -60 235 112 38 52 0 63 -120 -273 -123
6061 -123 -60 -32 82 -126 131 -24 -16 -38 -158 -99 -109 57 54 -84 -96 49 88 -157 -91 207 151 -32 64 -33 36
6086 36 88 -49 -50 3 -1 113 17 203 -146 92 -123 -15 -84 3 82 94 -63 -30 49 169 46 -8 120 96 33 20
6112 20 108 -37 14 80 -59 147 -140 10 -13 -167 50 111 256 146 -169 -23 -4 2 -129 -202 -43 -15 -87 -13
6136a3o0N4J4P8n9j20o0O9p0Q1J40j1M8n8j68K06j22j15O2J2J43M9j14R7J2o1
6162C4l1L0j10J0J52k22J73o3N7q7O0m8j71K79j65J73L6j32j95K80r0l5k5P5L1
6187A6P2j88P8J79k19J58j8n6nO4oj69j12K82j40M5K06k99L8J85k38J32J56j21
6211D0K09k81K05j52J7Kk64M33k31L4K32l57M1R5r5J17K6j56J66J4J4p6j49J55
6235C9j05j49J38k6J57N5r2q7j09K37p2N3Q4m21K72K10k46l7J95k24K73l91J95
6258e1K62k03r7K58ok42J99K6k13J53k06n9M15j14k56K04N1p7K6q2j17K35k52
6281a46K24j27j09J85P3l54J92K32m14J58l2Q0j59J83J72r6j05J5LP5j3K6J50
6304B13k23K0j13R9K06k53K00k35m0J88j16J20p2O0m3O5Qj23J99q3p4n9J68j22
$$ plain form
6136 -13 -73 -19 -5 73 14 -106 -166 -97 -167 -86 54 43 91 33 -135 71 -51 -166 -104 -92 51 100 -14 83 95 34
6162 34 3 33 -77 -67 85 -137 36 -27 30 -57 3 -45 -216 63 -102 71 107 -25 -220 60 -30 -65 -90 -15 16
6187 16 88 -100 -22 157 -62 96 78 22 17 81 75 -94 -206 76 -64 -19 187 -112 -74 111 -127 5 161 40
6211 40 249 -32 173 21 38 40 -224 209 -22 12 244 -113 -72 23 -72 45 71 -85 81 95 109 33 -116 39
6235 39 -66 -215 -77 -103 54 109 17 -70 -179 58 -14 39 123 -298 -26 184 -62 -99 96 -128 145 -246 -51
6258 -51 211 8 -89 169 163 -79 120 146 -67 86 -120 -179 236 122 -134 70 121 44 70 -12 -129 106 -146
6281 -146 78 -49 -158 27 100 -254 -62 170 -244 -86 -118 -38 -197 -14 158 62 -43 -28 -25 50 37 63 213
6304 213 -10 10 -103 -4 202 -51 149 -86 -126 62 -54 66 -6 54 11 76 84 -39 160 77 3 -56 112 -10
6328a0k8L6k9J35l8%j94J40l9k22J68J16p3j11P2K45j78N8j88J74k1lj97J75q6
6353i8J41O0j07j09Q5N4j47P1J87j72L3M1N7m0O1l1r5RJ34k40K35j53K45j22Q3
6378A82k09l0J4O2r4J38j50p2J84P6j35m5J67r2K1J52n9n6L4J03l52K18%j54J60
6403F3Pj79o3K60K9p3r3L54k90j27J26j57K07K7j49J15j19O7j41N8Q1J39Q4j02
6427A24n7n6j09L27k01p9q1pL23j70j3r0K50n8j40R2j02J08o8M8k12J43J43j36
6451b1l7K9J29o7k2j27j4J71o3oJ58j72J1K25k05k3L2M9j37K13o5j21L9L4l4P2
6477D8k40J06Q5j40K77j47mn9K27k32L4N2J14r9m0m5l1L31k90j79K55J46l89J76
6501d4J45m2j76Q4j2j9K74m4l6j75J2J13n3j07oJ27O1j48j96Q7K17Mj05j05K40
$$ plain form
6328 -10 -38 -2 -31 104 66 66 -128 12 -27 -249 -81 35 -38 -149 -77 168 -10 48 -140 34 13 10 -187 -12 -98
6353 -98 43 103 -4 -113 -28 26 -121 -50 137 -35 -2 39 96 56 117 86 -9 0 134 -106 129 -24 221 99 182
6378 182 -27 -57 -43 19 -75 63 -87 -159 25 101 -34 -79 88 -4 17 169 110 54 88 191 -161 57 57 -97 63
6403 63 70 -109 -172 88 117 44 -49 305 15 -112 14 -143 64 91 -58 57 -62 5 -136 -78 3 142 226 124
6427 124 67 11 -98 229 28 -51 -132 -139 184 14 1 -89 161 103 -37 55 -47 61 -7 41 -171 -28 115 -21
6451 -21 -58 -29 100 33 11 -116 -130 41 -22 -28 130 -42 -31 194 -11 -34 -2 47 -90 123 58 -63 -24 10 -24 48
6477 48 -192 -86 -1 -141 136 -11 -15 -74 153 -79 -45 7 121 22 -18 -63 -94 237 -53 -232 23 169 -220 -44
6501 -44 101 59 -117 -33 -45 -64 210 166 130 -45 -33 80 27 -80 -86 41 102 -46 -242 -155 62 66 -39 -144 96
6526I6n8P8Q9k38J54P2k73j53R2J08j94J75R4n0O0j73M5k7L8J5P8l4M1p6l7R0
6552A2N2q1J11k38M35k24j97K39l22K88k3l6NL7P1j13j15O3R4M0r6o1M81m67K96
6577B51m05J25O4k5j41Q1K2R5j69L25l17N4n4Q4m9j96LJ88K45l66L13j82J8k4
6601f0K7K2Ok4p3K82j8j30Q9j83Oo2J13j13k4J46O4n6j36Q4k7k6J05J70k54L94
6627C22l41pJ99k59K7N9j6r2Q3J03L4Q2p5j00j49K5N4O0m4J06r2Nq0J39l5r5j58
6654b45K00J12P2m8M0j77K47k87O9N9k01K25J8k36K87j02m4M5O5K0k20R9Mk5j23
6679a46J71J2q8M1J5j30q2L0R8J39k63L38Mn8PM5j80N6P3k64K53j89L1K20N5j63
6705B5k44L02O5j24l18K01J66J52j78N5oj44M1M1l8R0Kj99J97K8j20o3K62j50
$$ plain form
6526 96 38 116 205 -33 121 193 -80 -233 -141 -33 -227 -52 42 -8 52 -121 -76 -103 -65 -50 28 -6 35 -41 -78 12
6552 12 64 -17 94 -144 291 67 -130 109 -213 75 52 16 21 58 129 16 -99 -36 58 98 2 -59 422 -45 251
6577 251 -154 -29 35 10 -131 -50 -28 67 -102 223 -94 -40 -94 -10 -59 -255 -252 -64 181 -185 128 -54 -36 -60
6601 -60 -33 -11 -5 -29 -102 180 162 32 121 -62 -56 -118 -5 -118 -142 4 68 12 -124 -40 -67 -93 12 182 -72 322
6627 322 -19 -26 173 -86 -59 0 -16 -108 -25 78 112 194 119 19 -130 -105 -51 9 -35 71 -21 -16 -96 43 8 -87 -245
6654 -245 -45 67 139 91 131 -46 201 -86 -17 42 -159 66 84 -152 135 33 -11 34 99 119 -101 -2 2 -23 -146
6679 -146 25 37 -51 -10 5 -125 -207 -177 -79 60 -203 135 139 81 88 133 -47 9 82 -182 71 -118 -87 133 188 25
6705 25 -219 83 148 24 -294 -93 73 225 47 102 96 -48 -7 34 -4 86 88 -111 86 114 -6 -69 193 43
6729D3J01j06J20m7on5q1qP0M1k70JL5L93m00K55m9l3l34L50m2N1K4L9n0PJ7p4
6757hN3O0j14m4K4r4J48J35j85J2JN6K6Nj50Q2J03o0O1n3K22k76J17j21lj0J60
6784A47j24L3j08p1J47q1m2R2l1j8P1J01l63M08k38N0k10M27j04j8O4R0l02o6
6808a46J88q1J8M8k50J48J17k7J10j71J49k37K12k33L16j38k3P3K09l10K5K15
6830B12j62O9j70P6j36K58m4j5o9k59J39M5Q8r7M8j15O5oL43l74K50k57L83k03
6854F9l66M38j2n9k7O1j36K36j65j43r3Q9K89l5q7k51L52k76O0p2P3P5j46J92
6878F6Qo1Q3p9J40k6R3m43K72q5L5l38K58O2K2O5j74J12J59j70L9J39k79L44k97
6903e5P3P8k47J61o8N3m5Q6k50K73r4l53L18m2N5lO0Q5p6l8P3J58j56O7p7j3n0
$$ plain form
6729 43 144 38 158 111 105 50 -31 -39 31 72 -198 -197 -162 231 -169 86 37 4 -330 20 -22 29 53 92 42 49 66 -8
6757 -8 45 105 -9 -53 -29 -123 25 160 -25 -13 -12 44 70 75 -75 7 110 50 111 58 280 4 121 0 -3 -13 147
6784 147 23 56 -52 -123 24 -57 -99 -7 -38 -56 15 116 -247 161 -77 -27 -237 190 86 68 132 222 -80 -146
6808 -146 42 -39 -21 27 -223 -75 42 15 125 -46 103 -134 78 -155 161 23 0 73 282 -28 -3 212
6830 212 50 119 -51 25 -111 147 103 88 19 -240 -101 -56 32 -65 -17 -132 -67 -73 270 -104 146 -111 272 69
6854 69 -297 141 129 70 43 104 -32 204 39 -104 -197 -108 181 146 59 -192 160 -116 -56 -128 -55 20 -126 66
6878 66 74 13 96 17 157 131 224 -219 53 -32 3 -335 -77 -15 7 72 -102 10 169 -1 38 177 -102 242 -55
6903 -55 18 96 -151 10 -58 -5 -50 36 -214 59 -35 -388 -70 -112 -57 -60 0 85 9 -29 44 202 46 113 36 23 -27
6930b7o9J13M2J7P4L9l9l91K78j12R2Q1k79j65K22M9M0j09o6J5J65K5J67m19K72
6955A5j0M5N4n4q9j97J52J1K32j01Ln3l62M29J2k61l7J11K6j9M5J48q3J69p2k52
6981a38p5K16J41j23j79J34N5j04J16l5l2J81k05J05j75L9J1J76k49L8K79l22
7003a46L4l1J26j28RJ19J8J3N6k45M24k84J79q4l6J29j42PQ0r7q9P0j77M46m87
7028b36K40L2L5j35J8J12r7n6k3J59j12j09R3N6J7J03k31k09J47P4J69q7q4L5
7052h9J51L7j97M3J28Q5m0j39O8J53m2j52j34J09OJ38j68MK56m8j66L7p7L7l6
7077c6k7J2J3J94k30K20k04j6n4J29L4j11J41J3J60l21J47j23Q2J23j32j58K22
7100G8J6o7n7l6m0J13j60r7M84j81J6j04R4q3N7R8k45M0J44o1P0k7l3r3J29J43
$$ plain form
6930 -27 -96 17 59 76 150 189 150 -241 37 -75 17 98 -181 -346 -124 -75 -35 -144 -210 -195 -30 -5 162 -257 15
6955 15 5 50 104 50 -39 -236 -84 -73 159 58 61 8 -354 75 87 -174 -211 -100 -74 -93 -48 100 17 186 114 -138
6981 -138 -213 3 144 21 -158 -24 31 -73 43 8 -24 157 -48 57 -118 -79 -68 108 -141 -103 176 -146
7003 -146 -112 -143 -17 -145 -136 -17 1 14 70 -175 249 -35 144 60 24 153 11 18 98 1 -88 -18 -195 251 -236
7028 -236 4 36 71 -64 -46 66 -31 -87 -110 49 -63 -172 -79 -23 -6 97 -134 -343 -196 -122 47 -40 -124 -89
7052 -89 62 99 -98 -55 73 158 118 -21 47 200 158 6 -128 -19 -13 125 -43 -39 217 169 3 40 -37 0 -36
7077 -36 -63 -51 -38 156 -74 146 -58 -74 -128 1 35 -76 65 78 238 -83 64 -59 23 146 14 -144 78
7100 78 94 27 -30 -66 -106 7 -153 -250 234 53 69 -35 59 -24 33 131 -114 -74 70 9 79 52 19 -74 55 198
7126A98j88j79J57jj9j10J77LJ11j06O5k47J74j66L51k11M6M2J0k3R4j10k8N5
7150I5m2M0j86K7J49L8k70K55l94L69o2j49J45L8j68L9k5Q4p1j44M59J1m22J39
7174d5l20N01k17q5J34j9K29j21k61K70q5K27k66M5M1rk58K61J19k99J80j91Q0
7197h9P3J13j29R8j76J05l4J52p4q7K66j37J1Pj36qN9J32j31j06J1j0q2M30k59
7222aR1j14n8k0N4J72j14N8m3j57K37Lj7k33j0J1j3QJ56J85j15j76K24k27J06
7247Gj40j4J60j19K79l29K33j43J7K1j1l5N0p7J62LJ7j69J53Q5l83K09J03j69
7271i0J7J1%R0j12N7J42o0j32N6J63l56J58j9r1K46j20o6R7O4m5K1k4P5q0j39
7297a37K73j34j13K73j27k07J89l2J17p7k14J9L12k03o7OK14L7k31K49Q3l60M2
$$ plain form
7126 198 10 -169 -12 -13 -32 -142 35 38 149 43 108 -139 35 -131 220 9 55 97 107 84 178 68 40 95
7150 95 53 93 -93 -66 83 121 -149 106 -288 81 19 -130 15 53 -115 -76 -101 -17 -88 -232 227 238 -184 -45
7174 -45 -365 136 -81 -166 -32 -51 178 57 -204 66 -19 208 -58 -13 28 19 -239 22 141 -158 22 -169 -89
7197 -89 -16 97 -32 66 -110 -5 -39 113 39 -48 218 81 92 99 -37 -45 14 146 15 -91 -80 -90 -172 258 -1
7222 -1 90 -24 -82 -102 -48 124 10 68 25 -132 105 108 91 -142 -152 -141 -154 -146 10 195 80 -96 128 -99 7
7247 7 -133 -147 13 -106 173 -156 77 -66 -49 -28 -39 -74 -24 -101 61 64 81 -88 65 150 -233 -24 79 -90
7271 -90 -73 -62 -62 28 -84 -27 115 55 -77 -21 142 -214 -56 -75 -166 80 -40 -106 -9 55 10 31 7 82 2 -137
7297 -137 136 2 -111 162 35 -172 17 -15 102 25 -189 -170 142 -61 -128 -122 92 129 -102 147 230 -130 -88
7320h8J7j11J16l8K0mL10l58J56P1R9k82P3j17N2K49k69J88q5q5j61L26k76K69
7344G2N1j69m6m0K78q9N4j45oJ12k39K62j53j0m3j2J81l0o1l7K0j43K71J97k99
7369b4J84j56Q0mk13K6R1p0M8M7j81J36J85j52l9m1J04N2k69L15j64k2J37j30
7393f0J77j57K3P7l31L12j58R0J67j65o0P8J33r1Jo3Q0o7o5R7k22L14j04j56J91
7418D1k26K49j25m1j98J04L86j86pq6J15l5k7O4r8N1P1j20K97k33j8o2P9o8J67
7443I4j01O3o4P6J82j40O3k06k7K0P2j37R6p1j37L64k18N0J62o5l13N0K31J12
7467A56j82J34q0J02q9J12k13J31k34P6o5j9K73k12K53P7j79k8n8j47K08r4Q2
7490Dj81K56j27P4L4m6L1K8j91J6P8Q6J51k15J41j45j20K02j96J04j08K10k48
$$ plain form
7320 -88 -71 -182 -66 -104 -84 -88 222 -136 20 91 190 -92 -19 -136 -84 165 -104 84 -1 -86 -247 79 -197 72
7344 72 123 -46 -92 -132 146 57 111 -34 -40 72 -167 95 -58 -68 -111 -123 58 28 -33 -70 -50 -193 78 275 -24
7369 -24 160 4 84 80 -133 -107 -16 -86 -38 9 -172 -36 149 -3 -42 -83 21 73 -196 119 -45 -67 70 -60
7393 -60 117 -40 -17 60 -271 41 -117 -27 140 -25 -85 -7 126 35 36 -27 53 -14 -79 18 -204 110 6 -150 41
7418 41 -185 64 -61 -102 -300 -196 190 4 -3 -89 26 -9 -36 28 -70 -19 52 -68 229 -4 -22 -84 -5 -73 94
7443 94 -7 56 -8 68 250 110 173 -33 -60 -40 32 -105 -9 -80 -217 147 -71 -21 141 76 -237 -187 44 156
7467 156 -26 108 28 130 41 153 -60 71 -163 -87 -152 -171 102 -110 143 220 41 13 -45 -192 16 -78 4
7490 4 -177 79 -48 26 60 14 45 73 -118 -102 -24 62 213 -2 139 -6 -126 76 -120 -16 -124 86 -162
7513a62J55j58K66p4RM6j34j31lM71j65p6r0Pm3L4J5j21N05m02j58K24k20J58
7537d7j54M1J40O2j41J65j06L2J27k71Q7L86k55j79K50j43k1M0J53k01QM9j80
7560a58K94k26N3O1K03j89l0J6l0l9j06L16p1J9k35K32K4j27P2n9P7p6Q8q3J1
7585C7o7L6J05j50k4J62o2LK0k05J09J80j79j91J89k2J56r1j22L23k30l1K37j96
7609a3R7k2n5N2j48O9Np1K77k87O7K22j26k14J31l3n2K78j72k8j8J28O9j64J30
7634A22j58J53k48L31k52P5j35J40P3k70J08j14M8J03no7L9J06J16k07R7p3M6
7657B8j30J90j42J13k4J32q2K90k79Q0k27j12J58M0j0O4k34J68Q3j70P5pj58K91
7681A37j71m0m5J6J13K6r7L9N1M3k7J6q7Q7J28k3m93M15r6q5J27M4p8q8L00m09
$$ plain form
7513 -162 -7 -165 101 27 36 82 -52 -183 -186 285 120 44 -46 -39 -82 -48 -33 -154 351 -51 -209 15 -205 -47
7537 -47 -201 -160 -20 42 -99 66 -40 -8 119 -152 -65 321 66 -113 137 -6 -27 13 166 -35 -27 22 -158
7560 -158 136 -90 -37 24 227 38 8 24 -6 -45 -151 165 94 113 -122 110 134 7 79 20 97 21 109 26 37
7585 37 -30 6 111 -39 -63 99 37 40 60 -145 -36 144 -35 -226 -37 -59 97 6 -116 207 -23 -54 183 -13
7609 -13 84 62 7 59 -89 -20 -15 -86 191 -96 -29 193 67 -147 -16 -49 -101 177 5 -23 -41 87 156 -8 122
7634 122 -36 117 -131 200 -52 23 -112 28 101 -169 -61 -175 -127 -24 -29 -96 -57 49 165 -42 55 -18 28
7657 28 -102 88 -54 59 35 167 85 375 96 176 -51 -163 -5 35 25 89 -145 23 106 -64 11 4 -154 137
7681 137 -34 -74 -119 -103 10 36 -61 -22 29 72 45 61 -26 61 189 166 -327 88 -8 -93 34 78 0 -88 212 -197
7707a97L84k59O7n8P4o6k7k7J28n0O4p6Q0R8K09m99R6J76m1j7j26J04j37J56l05
7732b49K1K04p5J31m0P8%k06J91N7k31J98Nj69QJ05K0J25j62k2kJ45l88K60k9
7757b5J75l12P2l0K89k82J39n4j18O6R0OK89j59j67p1Q7K01k74Q9l7Q7l0q7K93
7782B37l29L07j16n9K24j11j5k42K0R3j18Q4k20R7J40J42q9K0r5O4j48J60j02
7805e6j93L83k43J79l7j3o9Q0R5Jq7O0k71K83Lq9j76K35k15J35j60J7J53m5K57
7830B27l75K27k4j21K8L8K42k93R4m9O5Rj83L43k71J00j26P1j46K90j64Q2nJ7
7854G6q9m8K5j04L1J38j44J38q1j9N7Q9j48j41K73J80jp0j39L8j67J96M2j13j
7879A8J7J3J74j68q8MJ59o7k25j40K87JJ28j95K15m8j83K09j71J40o3J57j9N1
$$ plain form
7707 -197 187 -72 -5 -63 11 -55 -82 -109 19 -31 33 -43 37 135 344 -155 -59 117 76 59 -67 37 -100 56 -249
7732 -249 -228 -24 -99 32 -8 70 70 -136 55 112 -119 79 84 -85 -77 28 48 173 11 -11 -13 132 -256 4 -25
7757 -25 150 -162 -90 -120 169 -113 26 -28 -146 -80 10 16 305 146 -21 -92 -5 196 -78 11 -26 61 31 -56 237
7782 237 -92 215 99 40 264 153 138 -104 -84 9 -109 -25 -245 -148 -8 134 45 65 -30 34 -114 46 -56
7805 -56 -249 134 -109 70 33 20 -49 31 126 127 40 100 -171 112 115 26 -150 85 -130 5 -155 -138 15 -30 227
7830 227 -148 79 55 -66 -38 0 242 -51 43 -6 59 68 -115 228 -43 57 -69 2 -144 146 -18 64 59 76
7854 76 -13 -61 -36 -140 -109 29 -115 23 -58 -77 -20 69 -79 -220 53 233 232 162 23 61 -106 90 132 19 18
7879 18 35 48 222 54 -34 -30 129 62 -163 -303 -16 -15 113 -82 133 85 -98 111 -60 80 17 174 155 206
7903B06j05O5l01J24j66J88k8M5j54K02k3j99L61k13j04M4J27L9l6J9j90N1m2
7926i0K3l7K87k52m9l1J8J69NJ9L4k0q7j70J60K0Jn1R1p9N7o1j32J20N7o5m0R2
7954a1j10Q2l5L56j84l07Q5J81q3J70j45N0Q1j81q6J95j87J31j30J15M9j33J72
7977G5j29K19l07J66p1J15j92K70k1k60K06J64k27n2O5K3O6mn8qj7j74J99R1l03
8002a64K14J06j51j32J36j6O9o3j73K43M5l5j18p2j16J29P6j66l4J22O1J04J39
8025B04k44L3j10m0L03j73l0r9K07k11L02j48K72k03O1m8J05k93Q8J53j68j46
8047a85M9J92O1l48K66R2l12K65r9J08o7l8n2J68k07J21l6J67m9j08j34L7K01
8070I2r3nJ69k39j37J12K01j74K39k07N8L7j83M2K18j69J94J11l75Q4o9M3J20
$$ plain form
7903 206 101 166 -135 -11 -177 11 -17 28 -126 76 53 -146 215 2 -102 -58 69 108 72 91 -99 -48 -90
7926 -90 -67 -104 183 -69 -118 -149 -131 38 43 62 96 76 -11 -181 -21 -1 0 -51 40 -39 18 -43 -175 -55 2 -63 -103 -11
7954 -11 -121 -39 -74 282 98 -209 -124 57 -26 144 -1 49 130 -51 -137 58 -129 2 -128 -13 36 -97 75
7977 75 -54 165 -142 24 -47 68 -124 146 125 -135 71 235 8 -44 21 44 110 106 48 40 23 -151 48 139 -164
8002 -164 50 156 5 -127 9 -7 62 -1 -174 69 114 79 -39 -111 -227 -98 -22 -188 -222 -100 -39 65 204
8025 204 -40 -7 -117 -157 146 -27 -57 -156 51 -160 142 -6 266 63 124 76 181 -112 -24 129 -39 -185
8047 -185 -136 56 117 -231 35 127 -185 80 -19 89 22 -16 -68 100 -107 14 -22 145 96 -12 -146 -109 92
8070 92 -1 -6 163 -76 -213 -101 100 -74 165 -42 16 53 -130 -88 130 -39 155 266 -109 -25 -94 -51 69
8093F9r0J65k30J50J27j88j2%J7L2j48O3J09j33O2rJ09m7j66J36M5J77j15j53
8117c0j4o7K21j44j07K30j40J18j09J96j48pN7j6J04k64P9j38J0J56Q7j24oOJ2
8142c8K5O4j76Q1n9q1J85M4J03j01Q6o6j30J90r2o4J49J06l52K3K14J40k81j44
8166a74M91j63j48k6J92l54J28LJ58r9j04K63k64Q3Q5j62J8n3rR4k7kK12k39P6
$$ plain form
8093 69 -21 144 -86 64 191 3 -9 -9 8 40 -108 -45 64 -69 -7 -16 93 46 -120 16 61 238 123 -30
8117 -30 -44 -111 110 -34 -141 89 -51 67 -42 154 6 -1 56 40 144 -120 -41 -179 -169 -13 74 -50 -56 -50 -38
8142 -38 -13 51 -125 -44 -103 -184 1 45 148 47 133 67 -63 127 35 -29 120 226 -126 -103 111 251 -30 -174
8166 -174 317 154 6 -20 172 -182 -54 -51 107 8 -96 167 -97 -14 71 -91 -73 -126 -135 -41 -68 -70 142 -97 -21
8191b1
$$ Imaginary data points
##PAGE= N=2
##DATA TABLE= (X++(I..I)), XYDATA
0@%%%%%%%%%%%%Qj6J6j6J6k4L2l2M0m8N6p2Q6j00J16j34J52j74K00k26K58k96
34a58L35l75M20m71N29n92O59p32Q15r03R98j105J220j344J480j632J799j983
52a040K184k407K659k941L261l625M048m543N129n844O731p870R397j1556J4862
67H445k0628L3557j17577K5238J49559j30575r657P8439J2953l1222L1360j0177
79A9715R996M2479l0921q5682M4562N1436p5349l2788Q5921j1495p6836J9474
91c9488M6264k4428j1586K0072Q649L919Q559j2375M110L8491L136m0612N380
104A0091K5546k6263k7450J1720n611k4344p04J4771Q432K855J700P633J5466
117A3842Q117n576N822J5797j3563k8359R41O169j4187k738Q437o307p960L952
$$ plain form
0 0 0 0 0 0 0 0 0 0 0 0 0 0 8 -8 8 -8 8 -16 16 -16 24 -24 32 -40 46 -54 62 -72 80 -94 106 -120 138 -158
34 -158 177 -198 222 -249 280 -312 347 -385 430 -473 525 -580 640 -704 776 -856 943 -1040
52 -1040 1144 -1263 1396 -1545 1716 -1909 2139 -2404 2725 -3119 3612 -4258 5139 -6417 8445
67 8445 -12183 21374 -96203 -70965 78594 -51981 -61638 16801 29754 -1468 29892 19715
79 19715 29711 72190 41269 -44413 149 51585 -23764 -56552 29369 17874 -58962 -39488
91 -39488 6776 -17652 -29238 -9166 -517 3402 11961 -414 3696 42187 45323 4711 10091
104 10091 35637 9374 -18076 -6356 -11967 -36311 -37015 -22244 -13812 -10957 -9257 -1624 13842
117 13842 21959 16383 22205 38002 24439 -3920 -2979 3190 -10997 -13735 -5298 -11605 -19565 -15613
131a5613K382M227J4435N977r091K196O604j1735Q42K2368k531j9328L490L547
145G770j4959j949R836p777q980O201k574r552J4847J4739p978O007J6297r556
159A2372p618J5442j025j7231o44R74j5089o386J0508r32o622P337K857k418J3652
174E177Q600q236L383O720j0805m737R422N7r244k883j212n700r4M386k318O17
190f867N578o383m882J1345N765r28Q452K592p633k11L301m109j932K663p545
205g94j3923K0M884o162L328J1656l009l131J1456M094k927P059M900p211o193
220D047K181l129p772K996R62r791m08O181m570k29R338J74n333L689N827m35
236C728J796O532j942p099L158K499p158r27K308q175o980J589L67j58L849M318
$$ plain form
131 -15613 -13231 -9004 5431 11408 2317 4513 11117 -618 224 22592 20061 733 4223 7770
145 7770 -7189 -9138 698 -7079 -16059 -9858 -12432 -21984 -7137 7602 -376 5631 21928 12372
159 12372 4754 20196 19171 1940 1296 2270 -12819 -19205 -8697 -9629 -16251 -8914 -6057 -8475 5177
174 5177 13777 5541 8924 15644 4839 102 9524 9581 337 -2546 -3758 -9458 -9552 -5166 -7484 -6867
190 -6867 -1289 -7672 -12554 -1209 4556 3628 12080 14672 7039 6828 10129 6020 4088 6751 -794
205 -794 -14717 -14697 -9813 -15975 -12647 -991 -4000 -7131 4325 8419 5492 12551 17451 10240 4047
220 4047 6228 3099 -4673 -1677 -715 -10506 -10914 -4733 -9303 -9532 -194 -20 -5353 -1664 4163 3728
236 3728 5524 12056 10114 3015 6173 8672 1514 587 2895 -5280 -12260 -10671 -10304 -10462 -6613 -2295
252b295M99K35N292L651L61L883J451n806m704k444k454o60k21j139j418k628
268h397R47L180J493L529K362k086j128J558J417Q27K77J589j228l879J108J024
284B593l862N2J423m536l730K141J197J45K291L596j26k72M543K086k353J779
300F967j47p084l312J930j039k415L57M68r97R73M446K043O7L403r6n153L89K012
318B812k141j013N42j036k418n96K910J064m45K258j037l980R03K587k03K29J266
335A702n31j120M99K274N73j209K33k081m060K00J054j254O7J300N42L51J519
352E9L164J370K44J194j916l744L46N90k956j262j24j581p66J468L072Q00M75
369D33J623n81j254K441J416k148m36K44j482j385Q05J022m77j075L81k139j464
$$ plain form
252 -2295 -1796 -1561 3731 7382 7743 11626 13077 7271 2567 123 -2331 -2991 -3212 -4351 -5769 -8397
268 -8397 -7450 -4270 -2777 752 3114 1028 -100 1458 2875 3702 3979 5568 4340 461 1569 2593
284 2593 -1269 -1217 206 -4330 -8060 -5919 -4722 -4577 -2286 1310 1184 912 5455 7541 5188 6967
300 6967 6820 -264 -3576 -1646 -2685 -5100 -4743 -4275 -5272 -4299 147 2190 2257 5660 5564 411 800 2812
318 2812 671 -342 200 -836 -3254 -3850 -940 124 -321 1937 900 -3080 -2177 410 207 436 1702
335 1702 1171 51 550 2824 3397 2188 2421 340 -3720 -3520 -2466 -3720 -3653 -2353 -1811 -1460 59
352 59 3223 4593 4837 6031 4115 371 717 1307 -1649 -2911 -3035 -4616 -5382 -3914 -842 -42 433
369 433 2056 1475 221 2662 4078 1930 1494 1738 256 -1129 -324 698 221 -854 -473 -2612 -4076
386d076J859J132j183J191R49o42P49K546K168n58k16k76k573j903J522q68k989
403c168R6n2j400M31K603J534K67R33J316j383j04K566p03k271Q60m91k490N10
421i46J025Q1r85q0m80j431O60K173q31n67J491m41m43J911J647j17m45l15q17
440A090j277J78M84j722j066R48j201k33J817J361L47L23Q9n28j46Q03M92j133
458F26o63K62j487l70J775J21J78j92o81k53N85N40Q6o48k16j93n86P46J212k22
478F20K85k38j081P4O46l10J86j45n90l04j27Q81Q37L60L80j006j109P76J34q52
498e83N34l76j425K78P16M20M80R09M59q53m65J181n02l02M97r26j411L74L70
517f25l85N39J059m43r72Q8J122l13R7J036j256r55J443K85m73J018N75j196j096
$$ plain form
386 -4076 -2217 -1085 -2268 -1077 -128 -770 -21 2525 4693 4135 3919 3643 1070 -833 689 -179 -3168
403 -3168 -3072 -3124 -4524 -4093 -1490 44 311 1244 2560 1177 1073 3639 2936 665 1525 1034 -1456 -946
421 -946 79 160 -825 -905 -1385 -2816 -2156 17 -814 -1381 110 -331 -774 1137 2784 2667 2222 1907 1090
440 1090 -187 -9 475 -1247 -2313 -1365 -2566 -2799 -982 379 726 1049 1138 610 464 1267 1759 626
458 626 -37 225 -1262 -1632 143 264 442 250 -431 -684 -99 441 527 -121 -337 -530 -1116 -370 842 620
478 620 905 667 -414 -340 306 -4 182 37 -553 -857 -984 -103 734 1094 1474 468 -641 135 269 -583
498 -583 -49 -425 -1850 -1572 -856 -436 44 953 1412 559 94 1275 773 471 968 42 -1369 -995 -625
517 -625 -1010 -471 588 145 -827 -739 383 70 167 1203 -53 -1008 435 720 247 1265 1840 644 -452
536d52P33Q1j276j74J132j765o68J632J98k6J609P20j050k09J036M3q28N83n01
555H18j866n33J244o70l8J548o23q85M28R52k29r3O79k60j300N66Q08q02N25J479
575A748r09j135P71J53q29l9L76q50j393P37O48k21J019J198j036l09J151K64
593A344m15n1J52j030j219N92M39m71N27O88j450J77J244l26l51O64J8j748R1
612a125J139l7l85J163J91j370M92J202p92j48P62p67j148J0O00j64l56R43l84
631a74p61J047M05l69K0N23n45p55M31L70j06N9N25n22o63P07L44m79Q4k5q47
652g31l54L60P9N2O57J24m34n3J098K4j79M57l76q30J9L04p01N84q7j82l59J11
674d17M29n2K8L24l34l17L28m01L08O48J8j76l8l7J89J03l06k15m06l06Nm43P41
$$ plain form
536 -452 281 362 -914 -1088 44 -1721 -2389 -757 -559 -585 1024 1744 694 485 1521 1564 736 1319 818
555 818 -1048 -1581 -337 -1007 -1045 503 -120 -1005 -577 375 146 53 732 472 -828 -262 546 -256 269 1748
575 1748 839 -296 475 628 -201 -240 136 -714 -2107 -1370 -722 -943 76 1274 238 -71 1080 1344
593 1344 929 878 1030 0 -1219 -627 -188 -659 -132 556 -894 -717 527 201 -150 514 532 -1216 -1125
612 -1125 14 -23 -408 755 946 -424 68 1270 478 330 1092 325 -823 -813 -213 -377 -733 210 -174
631 -174 -935 112 517 148 168 691 146 -609 -178 192 86 145 670 148 -515 192 536 57 141 116 -731
652 -731 -1085 -725 -646 -594 63 187 -247 -300 798 822 643 1100 724 -106 -87 217 -484 100 13 -169 -528 -417
674 -417 12 -40 -12 312 -22 -339 -11 -412 -104 544 562 386 348 311 500 603 297 82 -324 -630 -625 -1068 -327
697c27q8p8J57L30R4L97J62k4J8k41k83m23J72J97K79o03K3m5k76K14M41k81M0
720a45J5j58l0J06N45J29n89P75J87p00M73J00o04m13L98n09j13L7N69j89l41
741d57K50R6k17Q54J33n35K36m38j54J07K80K69m00k40K58j10Q6K36O5n96M33
762A56m59k24J71L55j76r3j50O06L9q4L54o0l46p1j97j51L03K75J17n40O7K33
784A25j32PR0pn58k1J81m19N81K54k92O1M37Q7j41L83L08r25J58l9j30m02L80
807a4j20l14k39K92N5L15J92J04j19l31M37k67J72L84k99j25r5n2L13l61J88J28
829B44o49r8J13k39J20L39r4N4J12L56K09R6J56K81p20k85J63j99j28M5k81l71
851g76J92J76J55K37J49M4j51J34K45pj54J93l28J26k47M4j37nR0l1l58K1Q3l06
$$ plain form
697 -327 -415 -493 -336 -6 88 485 647 623 641 400 117 -306 -134 63 342 -261 -238 -283 -559 -345 96 -185 -145
720 -145 -130 -288 -318 -212 333 462 -127 648 835 135 608 708 104 -309 89 -420 -533 -496 73 -116 -457
741 -457 -207 -111 -328 526 659 124 360 -78 -232 -125 155 424 24 -216 42 -68 18 254 319 -277 156
762 156 -303 -527 -356 -1 -177 -270 -420 186 225 141 495 435 89 18 -179 -330 -27 248 365 -175 -108 125
784 125 -7 0 90 83 -475 -496 -315 -734 -153 101 -191 -130 307 394 253 636 944 19 177 138 8 -394 -14
807 -14 -134 -448 -687 -395 -340 -25 167 271 152 -179 258 -9 163 547 248 123 28 -24 289 -72 116 244
829 244 -405 -503 -390 -629 -509 -170 -264 -210 -98 258 467 563 719 1000 280 -5 158 -41 -169 -124 -405 -776
851 -776 -584 -408 -253 -16 133 177 26 160 405 398 244 437 109 235 -12 32 -105 -110 -20 -51 -409 -388 -305 -611
875f11L18K29j96p3L46M19p5L1K09j08l61j45L07m86J45J84n24k40N46J08k90
896b67M35r0J29m28L30J09k7O7j62j04k57K19J72J00j76Q3q1p1P4Mj81j03K21
919dl59J55L86Kk14J94J51l50j42L13k28o8J91k1l22L54J19k01K29Q1k1l75j24
942b54K76lj39j4l2l05M09k00J22M74k11K09j63J77j95O4k45K17k68j54J90k3
964f8m4J28pl27J22Q4J47j51P6J70j30L03J29O2k30K41k64k47j4j58Q3o4l51J13
988c97n4k2J79J50n2M53J45j67L3J63o7J59m18m2j38j29J0J18J46l89J53l52K51
1011b67J33N4R2j37J60K01L5j00M02j73Jk35J01k52j55l4k26q1N3J08P0K18m8
1034h0J58J42j7o0K4j16K27nj90j03L14m32K28n1q1j28j6K9J88r6J22j58m1K93
$$ plain form
875 -611 -293 -64 -260 -333 13 432 357 388 597 489 128 -17 290 -196 -51 133 -391 -631 -85 23 -267
896 -267 168 78 207 -221 109 218 191 258 96 -8 -265 -46 126 226 50 133 52 -19 55 59 -122 -225 -4
919 -4 -363 -208 178 180 -34 160 311 -39 -181 132 -96 -164 27 6 -316 38 157 -44 185 266 245 -130 -254
942 -254 22 19 -120 -134 -166 -471 -62 -262 -140 334 123 332 169 346 151 215 -30 187 -81 -235 -45 -68
964 -68 -112 16 9 -318 -196 -112 35 -116 -40 130 0 303 432 494 264 505 241 -6 -20 -178 -95 -159 -510 -397
988 -397 -451 -473 -294 -144 -196 257 402 235 268 431 364 523 105 63 -75 -204 -194 -76 70 -319 -166 -518 -267
1011 -267 -134 -80 12 -125 35 236 271 171 573 400 401 166 267 15 -140 -174 -400 -481 -428 -320 -250 -32 -80
1034 -80 78 220 203 143 167 51 278 273 83 -20 294 -138 90 39 -42 -170 -186 -157 31 -65 57 -101 -142 151
1058A51j43K2O2OP6J24k12N2j50O0N2l61jm6J74n4J63j7q5K80j23L8J76n9n3l13
1084a81j55N20l21r4L76q3q0J50M1k93K40P4j79m31M95p3j84k4K96k04%j1J35
1107A4J46k08j31j31N03j2j39K0P3J85k87KR6j60k99L73k54j61L82k01m7P3K80
1130A17l6rJ36J3l2j3K67l32j19pj09Q3J09j25j33J92j54j0R0j54M25r6l82N41
1154B62M3j63j17J77j13N0K7j41N0j99J52k53p3M5J04R4q5J42J68Lo3L39r8r2
1178B59L36m86k82o4L36m00L08k08Q5j15R9Q2KMJ29j05N1m8k9K64Oj05k64QJ91
1203E4k54O8M6j60J32m9J5M6L8J97j53K77l02K6N8K54l25L03n9k31L4n8J52j28
1227a9q7j5J53j80K05j36J99j11K9o6R2N5j58K01l7p5k25J83L52k95q9J33j66
$$ plain form
1058 151 8 30 92 98 174 298 86 138 -12 48 100 -261 -262 -308 -134 -188 -25 -42 -127 153 30 68 244 185 132 -181
1084 -181 -336 184 -137 -231 145 62 -18 132 173 -120 120 194 15 -416 79 6 -178 -202 94 -110 -110 -121 14
1107 14 160 -48 -179 -310 193 181 42 62 135 320 33 35 131 -29 -328 45 -209 -370 12 -189 -236 -163 117
1130 117 81 72 208 221 189 176 443 111 -8 -15 -124 -41 68 -57 -190 2 -152 -162 -72 -226 199 103 -279 262
1154 262 305 142 25 202 89 139 166 25 75 -124 28 -225 -298 -253 -149 -55 -140 2 170 173 110 449 351 259
1178 259 595 109 -173 -237 99 -301 7 -201 -116 -231 -132 -50 -48 -44 85 -20 31 -17 -46 218 224 119 -145 -137 54
1203 54 -200 -132 -86 -246 -114 -163 -148 -102 -64 133 -20 257 -45 -19 39 293 -32 271 212 -19 15 -43 109 -19
1227 -19 -106 -121 32 -148 57 -79 120 9 38 -28 64 119 -39 162 125 50 -175 8 360 65 -24 109 -57
1250e7J0n6J94j02J24j48O5O1k9J42m2j35M2m6j59N5P0J69k10J22q7K37j15oj09
1275a0J60n5o0L1k56R4o3M4k10K67k1K55j96j02K49j4k11R3J49j71J3K27k14Q6
1299H5j02j66n3K00JJ72l45L08k0J6n2N1r8R9M3k2o4k23J27J8N4m84M92l63J76
1324a50l1N1K38j15J19Kj03J82j8j2k2k08J71K2j62k6O5p6j94K25J9j10r7K8M2
1349a60L06k05j20M13j08n2q2K19j02j06K26j91p7P8j06k81J33J17k7J13K50j48
1371I0j71J17J01K9j14K03n0k73K98j36j85M3O6P6k62J52J34q9L6J23k96l5L48
1394B05J8j38J92j95j66K48n6M1q6k36k7R5J3J19o6Nn3K6qj12K10j06M0Q0P8k78
1420a57J18o4k2J73J4J14k10K66k21J98k52J2J09k92L47K5j67m4n1J78j04K29
$$ plain form
1250 -57 -47 -103 91 -11 113 -35 30 91 62 204 162 27 69 23 -136 -81 -11 158 -52 70 -17 220 105 99 -10
1275 -10 150 95 35 66 -190 -96 -159 -115 -325 -58 -79 176 -20 -122 127 113 -98 -5 144 -27 -14 213 -1 85
1299 85 -17 -183 -236 -36 -35 137 -208 100 80 96 44 95 -3 96 139 117 53 -170 -43 -25 29 -455 37 -326 -150
1324 -150 -181 -130 108 -7 112 114 11 193 175 163 141 -67 104 126 -36 -62 3 -73 -267 -42 -23 -133 -230 -202 -160
1349 -160 146 -59 -179 234 126 74 -8 211 109 3 229 38 -39 39 -67 -348 -215 -98 -125 -12 238 90
1371 90 -81 36 137 166 52 255 205 -68 230 94 -91 -48 18 94 -168 -16 118 29 65 188 -108 -143 205
1394 205 223 85 277 82 -84 164 108 149 63 -173 -200 -105 -92 27 -39 -34 -87 -61 -69 -181 29 -77 -37 43 121 -157
1420 -157 -39 -103 -125 48 62 176 -34 232 11 209 -43 -31 78 -214 133 158 -9 -53 -104 74 -30 199
1442A99j76j8k51J56P9K5m5J10o5J01J33k1k71n0N6l2M7k03J28Nj8K3L5j16R7
1467g2K65j98K16k82K2J23L3k17J0K27j77m2j24L74j5j35r0OJ46L3j24j11K19
1490H7oJ42l93J40J43j88J26j19r1J5k6K0L6j1Q3N6J07r9mJ48l19L26k38O6K9
1515C0O4K6j82L3K48k22K1j17%p0J87j87J99n7Q0P2j51K32k47N3J24K4j31K15
1539B44rk56J63m9k19J27r5P2l7p8J24J1J99k33J32j3m3j36K23j74j35j04O2J80
1563d4r3J32L9j78P5%Q6m9j79Q6J96o6J04j98O8J67j91l1K80k13K6Q5j97n9L31
1588A77o3j83k27K50l5N4j68k6K48j70J1Q2K9L0j25J17JJ15q4j78K97j32l3j72
1612a85R3m0J23k65K81k76M76j30j62O2r6R5q5JJ07Q4J00j82J6N9j14R4j52Pj34
$$ plain form
1442 199 23 5 -246 -90 -11 14 -31 79 14 115 248 227 -44 -94 -38 -70 -23 -226 -98 -93 -111 -88 -53 -169 -72
1467 -72 193 -5 211 -71 -49 74 107 -110 -100 127 -50 -92 -216 158 143 8 -82 -76 70 103 -21 -132 87
1490 87 81 223 -170 -30 113 -75 51 -68 -159 -144 -170 -150 -114 -125 -42 14 121 22 18 166 -153 173 -65 1 30
1515 30 94 120 -62 -29 219 -3 18 -99 -99 -169 18 -169 30 -27 53 125 -26 206 -41 12 136 160 29 244
1539 244 235 -21 142 93 -126 1 -94 -22 -59 -137 -13 -2 197 -36 96 83 40 -96 127 -47 -182 -286 -224 -44
1563 -44 -137 -5 34 -144 -69 -69 17 -32 -211 -125 71 5 109 -89 -21 146 -45 -76 204 -9 17 102 -95 -154 177
1588 177 114 -69 -296 -46 -81 -27 -195 -221 27 -143 -132 -50 -21 9 -116 1 2 117 33 -145 152 20 -13 -185
1612 -185 -92 -132 -9 -274 7 -269 207 77 -85 -23 -119 -24 -109 -108 -1 83 183 1 17 76 -38 56 -96 -89 -223
1637b23K62j66m0q8J88K9J17m4R4n8k03J21Q0K0k05N9N3J6j9O3k12J99K03k73
1661b7q6N6J04l0O9Oj56J5n2J14n5L4qm8J85j69k0j42N8J73K4j28K5J10n3o3J17
1688E3J49k98J39j94J47n9m3k44K33K6L56l24j55K02m0K75j30k0j32K05J5k80
1710a19mp8J60l6m0Q9j04J08p0j31J17J99k9j21P2l5M5j7j16l3K16k0J11K7q6
1735A05k11L77l42J41j49o1M2RK16p3P1p3N2l14J95L8j09j34J00q0K2K59j01n3
1759g3Q8l2J12N8j48j2JR9k31M9R2L8l8j05J98Mj02k08Q4K44j8rk3O0r9R1j24
1786doP6j58J80m9K07l50Q3m9O4M9j0N7j54J73k50K05l1R8k65L24k54k8J7j2R7
1812A0J10r5j33J44J5j75R8l1j38O8J76m03M12j04J10K01k84l6k09J48R2m2R7
$$ plain form
1637 -223 39 -127 -167 -255 -67 -38 79 35 129 71 -132 -11 69 89 -116 -57 -4 12 -7 56 -156 43 246 -27
1661 -27 -113 -57 47 17 86 92 -64 -49 -101 13 -42 -8 -16 -64 121 -48 -68 -210 -152 21 45 -83 -58 52 -1 -64 53
1688 53 202 -96 43 -151 -4 -63 -106 -350 -117 -91 265 -59 -214 -12 -52 223 93 73 -59 146 161 -119
1710 -119 -123 -201 -41 -77 -117 -28 -132 -24 -94 -225 -108 91 62 -59 13 -22 23 6 -110 -143 73 53 164 191 105
1735 105 -106 271 -71 70 -79 -140 -98 -89 127 54 125 52 104 -210 -15 23 -86 -220 -120 -200 -178 81 -20 -73
1759 -73 15 -17 95 153 5 -7 -6 93 -138 -89 3 41 3 -102 96 100 -2 -210 -126 118 100 91 68 128 29 120 -4
1786 -4 -10 66 -92 88 39 246 -104 -21 -70 -6 43 33 90 -64 109 -141 64 33 131 -134 190 -64 -92 -75 -87 10
1812 10 120 25 -108 36 51 -124 -26 -57 -195 -127 49 -354 58 -46 64 265 -19 -55 -264 -116 -24 -66 31
1835C1K54k20k71L03j49R3k2L1M3k08j1J49k4l8O5k91J57r2K51R4M8j63j61Rn3
1860a75K07k37J36J66J28l14j5M5j22K71q0j20Q5k7J53j92K29k87l2Q7M3J87m5
1883I1K2qj64P1j57J00j5P6Q6o9j01r8J02M5O1p1MJ58K81m37j7L5q8J35o3M0j3
1910FJ01j11kJ30k06K44j17p0r4M3K06j16o6j06K07k07J43Q2n9r5LP0j53K94k8
1935I9q0j48K03j17O0j31M5J6k8J81j92L28l10J8j27J88P3r1n7J97j66J7j09J60
1959B9R3rj51J40k39P9j13l5K69j34Q4m3q6K57k78J10J6o6J51k75J37L9J69l04
1983a60J18j1L6o3J4L2M3j59O4K14l4k3L6j29r8J17o9J57l2j31RJ41k12j4J72
2008A8J01j05J23n1l7k3m2j89L13p4P6k44K47j55J25j01J26j41J99j55K10l68
$$ plain form
1835 31 285 65 -206 97 -52 41 19 50 93 -115 -126 23 -1 -39 26 -265 -108 -200 51 145 193 30 -131 -122 -175
1860 -175 32 -205 -69 97 225 -89 -104 -59 -181 90 10 -110 -25 -52 101 -91 138 -149 -181 -94 -51 136 91
1883 91 113 105 -59 12 -145 -45 -60 16 102 33 -68 -166 -64 -19 42 -29 -25 133 414 -23 -40 -5 -93 42 -21 19 6
1910 6 107 -4 -6 124 -82 162 45 -25 -119 -76 130 14 -52 -158 49 -158 -15 67 8 -87 -84 -14 -167 127 99
1935 99 19 -129 74 -43 17 -114 -69 -53 -81 100 -92 236 -74 -56 -183 5 78 -13 -70 127 -39 -22 -131 29
1959 29 122 113 -38 102 -137 -58 -171 -206 63 -71 13 -30 -116 141 -137 -27 -11 -77 74 -201 -64 -25 144 -160
1983 -160 -42 -53 -17 -80 -66 -34 9 -150 -86 128 94 71 107 -22 -120 -3 -72 85 53 -78 -69 72 -140 -154 18
2008 18 119 14 137 86 49 26 -16 -205 108 34 110 -134 113 -42 83 -18 108 -33 166 11 221 -147
2030a47K13J60k99K50k26kO9L1J9l2j22J57j11K51k73o4K53j42j18K8K49j02L8
2053H0j92K90k06J75k37r1J41N2n2Qj33K03j32M0m1M1o9J6J71k2K8L94n42J48
2077G0o3J13kj5r6J29p6l4k02J30o0K33k10J11j39K84k21j04K34j39J99k95J99
2100D6j28Q7N8k72K63j31J31k34J25j42J0J74J2J82j46nJ71n7k90L8J81k59j02
2123b88L39n7o0J02n1l9Q3R8M2j74N1j49Q4L3p6J59k62J43P3l0j86J56P1k75L9
2148a74Q3L9K6lJ40j78N9k1o0K24n9J48k62o2J06Q1kj11j55q5K51q1J80p3J2R
2174C2o3P7K06k95m6Q3K07k59L2N2r6j6K67j56k19K02j57L47j47j75J19K4n3O7
2198C3l00K99j99O7O6n3J13k1qP0k57K33N2J4p5k05Q1K83p5k10J95j38N9j62M04
$$ plain form
2030 -147 66 226 -73 177 -49 -51 18 49 68 36 -86 71 -40 211 -62 -126 127 -15 -133 -105 144 42 80
2053 80 -112 178 -28 147 -90 -181 -40 12 -40 -32 -165 38 -94 -54 -95 -54 -123 -107 64 42 70 464 -78 70
2077 70 7 120 118 103 7 136 60 26 -176 -46 -106 127 -83 28 -111 173 -48 -152 82 -57 142 -153 46
2100 46 -82 5 63 -209 54 -77 54 -180 -55 -197 -187 -13 -1 181 35 30 201 144 -146 -108 73 -186 -288
2123 -288 51 -6 -66 36 -15 -54 29 127 169 -5 46 -103 -19 14 -62 97 -165 -22 51 21 -165 -9 62 -213 -174
2148 -174 -91 -52 -26 -29 111 -67 -8 -29 -89 135 76 224 -38 -100 6 87 85 -26 -181 -266 -15 -96 84 11 23 32
2174 32 -31 46 252 -43 -89 -6 201 -58 -26 26 -70 -86 181 25 -194 8 -149 198 51 -124 -5 19 -34 33
2198 33 -267 32 -167 -100 -34 -87 26 5 -3 67 -190 43 95 109 34 -171 -90 193 118 -92 103 -35 24 -138 266
2223B66l0k44k43K08J92k93J26K46q7o8J55j14j77N5M8j49J19P4m2P9j76K9N9
2246C3N0J05j51J9j32J2J0R1j95OJ50r7lLk19K46L3Q9j00M1O5k65J68J65k17o1
2272a54J98M9Jk4j32lM8L3j59J68J35j58n8J29J66k55rO4Kk78K01n0O5J29j34
2297b6j34J58P8N2k80J80j32oL6J27p3j40K48k44J46J28k12J39K2k53L06rk28
2320a17L8k7M9j9q9P8Q0R7J93l45K77J6j92j72J24K4r4Q6K05m2k69R0k3K27k70
2345g5l2J39lqK53k26M9l2j67q7Q8N2J95p9p2Q5R6k50J57j59P1j02K6K01n7k07
2371a44K00j52J5J62k92K67j38nJ44k3k36L2J67J62j10j42k9m8M7K06o0J61L6
2394B20j89j13K20j34O7l9k3j99K56m6k49M25kk51O7r6P7l4J19p6k19N0J14Q7
$$ plain form
2223 266 236 -8 -251 -43 149 -144 -18 228 141 73 228 114 -63 -8 40 -109 10 84 42 121 -55 -26 33
2246 33 83 188 37 56 -76 -64 -54 37 -158 -152 -2 -99 -102 -99 -318 -72 -39 50 -50 -9 56 -209 -41 124 -93 -154
2272 -154 44 93 94 70 -62 -65 -17 16 -143 25 160 2 -56 73 239 -16 -25 39 41 -237 -36 -86 -21 108 -26
2297 -26 -160 -2 76 128 -152 28 -104 -110 -74 53 -20 -160 88 -156 -10 118 -94 45 67 -186 120 111 -117
2320 -117 -79 -106 -57 -76 -165 -87 -7 90 283 -62 215 231 39 -133 -9 15 -79 7 212 170 -99 -9 -32 195 -75
2345 -75 -107 32 29 21 274 48 97 65 -102 -189 -101 -49 146 67 -5 80 176 -74 83 -76 -5 -107 -81 120 63 -144
2371 -144 56 -96 -81 81 -211 56 -82 -87 57 34 -202 -170 -3 159 49 -93 -122 -170 -123 83 23 184 220
2394 220 31 -82 138 4 71 32 9 -190 66 20 -229 196 194 -57 10 -86 -9 -43 76 0 -219 -169 -55 32
2418C2J5J13j59J91k66J12j0MN1j37J49j19Jj05J60j20j0R8J19j59K5n5j18J36
2442e2J81p6m7m6j3m7Q4K5L3N6k57K89j26N1j8P0R2j19k19J23p1J2J4K07j79k4
2468e7J26m3L4P3J1l17K08n1L4P5p4Rj59J37Qj8J48l44J8K49j06K4o2R8O3J99
2494B83k63j23J20J6j34M4K43L0k75O2J61k40J64N6n3k60L17j03m8Jr2K06k79
2517a67q3P3k5J32j21J51n8K9J50k0k29K5O6K3m4Q0j4K7j69J04J24L7o9j77J45
2542a0L3J45k49j5j03K34K0J10j44N9n6k9j3QJ6Q0k40J02J70r7J18k10K45l5j96
2567e7j78K98k31J32j06J07M1M3J07k61J4m4P6L0j9J63r3k7L4r2o8J38J04q3J03
2592A31k33j0J54Jl9K41k03r7J48j69n2L9k6J93j49L06l06oJ4J41j40K36m0j72
$$ plain form
2418 32 47 160 1 192 -74 38 28 32 83 -54 95 -24 -23 -128 32 -88 -98 0 119 -40 -15 -70 -188 -52
2442 -52 129 53 6 -40 -53 -100 -16 9 42 98 -159 130 4 55 37 107 199 80 -139 -16 -87 -75 -61 146 -33 -57
2468 -57 69 26 60 133 144 -173 35 -16 18 93 19 28 -131 6 14 -4 144 -200 -182 67 -39 -15 -77 21 84 283
2494 283 20 -103 17 33 -101 -57 186 216 -59 3 164 -76 88 144 91 -169 148 45 -3 -2 -94 112 -167
2517 -167 -250 -177 -202 -70 -191 -40 -98 -69 81 61 -168 -143 -77 -54 -98 -18 -32 -5 -174 -70 54 91 22 -155 -10
2542 -10 23 168 -81 -96 -199 35 55 165 21 80 24 -5 -18 -10 6 86 -154 -52 118 21 139 -71 174 139 -57
2567 -57 -235 63 -168 -36 -142 -35 6 49 156 -105 -91 -135 -59 -29 -48 115 22 -5 29 -63 -131 7 111 28 131
2592 131 -102 -112 42 43 4 245 42 -55 93 -76 -128 -89 -115 78 -71 235 -71 -77 -63 78 -62 174 134 -38
2616c8N7K3m4P7o5p6K62k00J36l7o2J06k94K74j18qJ71l51Q8Q9q5R0J01p3N2j01
2642b6K88l33J56j02P3j57jk3K67r0n8K17k8l09Q1Q5J89k04j42J7N7n3O6P9J8
2667F7m4p2K03k73K51j09j2L6K3j30j88K78n4j12P4P9m0O4j38J70O2k25J49q2
2691b3J5j62J7k8j4J50N6J31k59k3j4J31j73L25j2k23L79m53J98j77L06j40j03
2714i6J76k89K54M5j88q2R3p3K06M3l3k15J69j2j34J30R8K4k51M0O1J8N9j89L83
2739B37l50K77k58j71O4K61j64n3K09k3J18k08p1K93p2k53L35l8O5o7p8j22R9
2762C0j40J80r4J02k11L14l30K32J8k1k24j4K53k92J95K38j92m4Kk04J27J12J41
2785A78j33q2mo2O6r2R9K34l25pK58o2r6j02K34K28l09M5N6k11K5J46q3l0j30
$$ plain form
2616 -38 19 42 -2 75 10 -66 196 -4 132 95 33 139 -155 119 1 -7 164 -187 -99 -10 -95 -5 96 23 75 -26
2642 -26 262 -71 85 -17 56 -101 -102 -125 142 52 -6 211 183 -126 -45 40 229 25 -117 -100 -43 -96 -30 49 67
2667 67 23 -49 154 -119 132 23 11 47 70 -60 -248 30 -24 -136 -62 17 -23 41 -97 73 135 -90 59 -23
2691 -23 -8 -170 -153 -181 -195 -45 11 142 -117 -140 -154 -23 -196 129 117 -106 273 -180 18 -159 147 7 -96
2714 -96 80 -209 45 90 -98 -180 -87 -160 46 89 56 -159 10 -2 -136 -6 92 116 -135 -95 -34 -16 43 -146 237
2739 237 -113 164 -94 -265 -201 60 -104 -157 52 29 147 -61 -132 161 89 -164 171 133 198 131 53 -69 30
2762 30 -110 70 -24 78 -133 181 -149 83 101 80 -144 -158 95 -197 -2 236 44 0 2 -202 -75 37 178
2785 178 45 -37 -41 -103 -37 -129 -30 204 -121 -128 130 68 -28 -130 104 332 23 68 124 -87 -62 84 1 -29 -159
2810a59K42m11L04m7M4J55k29J5J03k6m1L9Rj20n3K52r4k0k7p9K7K08k20J81n6
2835cN1l5J35k24O5Rk2L1k52L04J33j16o6J4J21k08k8NJ07l1j19K7K50k9j75K7
2861b9j09K44l61J77P0K6L4J16l02m2L01p6l87K81J06k1k2j4k4Q9p5J4O7n1J57
2886A69k13o1K13j40P8Q2j86L0L3j67L00j34J30j19j72Q5J41j29J80l13J53k3
2908f3J09M1Lr4r4j65MK16q5L9k4K49k81J83o1K38j41j65k1j1J34q9P8k10M16
2933B06k66J37j4p8N5j27qM6k2J01Q5Q1q9j37j29K16J24k46m7j1K89rj23J29l05
2958a42J96j74J67k78M4K19Q8q4q5R5K16k31m4M8m9J48k89R9N3K34l9l00J26j24
2982a06J43k23L80k80j7J96j07J3J35q6p4J95k81J72j27o4K46j55R1o7k04N4J27
$$ plain form
2810 -159 83 -328 -24 -71 -27 128 -101 -86 17 -9 -50 -11 -2 -122 -175 77 -17 -37 -64 -143 -116 92 -128 53 -3
2835 -3 48 13 148 -76 -11 -2 -24 7 -245 59 192 76 10 24 145 -63 -91 -86 21 -10 -129 -102 148 119 -56 -29
2861 -29 -138 106 -255 -78 -8 18 52 168 -134 -176 125 49 -338 -57 49 28 6 -8 -32 57 -18 -4 63 12 169
2886 169 -44 -105 108 -32 46 128 -58 -28 5 -162 138 4 134 15 -157 -72 69 -60 120 -193 -40 -63
2908 -63 46 87 90 -4 -98 -263 -259 -43 -128 -89 -113 136 -145 38 -23 215 74 -91 -112 -123 11 -78 0 -210 206
2933 206 -60 77 63 -15 40 -87 -95 -49 -71 30 115 196 107 -30 -159 57 181 -65 -112 -123 166 157 34 163 -142
2958 -142 54 -120 47 -231 -187 32 120 36 -49 46 262 31 -13 35 -14 134 -155 -56 -3 231 192 -108 18 -106
2982 -106 37 -186 194 -86 -103 93 -14 -1 134 48 -26 169 -112 60 -67 -131 115 -40 51 -16 -220 -166 -39
3005c9N9kR0n1J70l33J14r0J53j26K09k71m3J01J46j3%l08J38J64k61J46l2O2
3029a7r2J68q0J14j34o4O4j56K51p6Rl6q5K21J09k01M6mk34L42j03K19l32L5j82
3054b18L77j48q2J16k1r7mJ07K90k71J3k44J98n2k15M02j42M5q9j4j9Jj1J13r4
3079e9Q6J32j4o7j10K0O5J05Rk10J01j29J17l7o7M1l9J1n9J36p6P3R4R9o4l06
3105a48J83J7q5O6K1Kj30J69k11K36q0j50K25M5j91J07j25J0q7J68o8K99k67Q1
3129H7j32K22j31Q7j56k0J59p4l7mJ61j28j22N5M6J69m25K35QL5K00k00k8k7L8
3154A8j35K08q1pj85L43k42J51r1j25m1J20K21Q4l55L15l98K00k32J92j7K0J80
3177A43j27J33j09L3k7n5p4O4M4p5l2J71o0R4j59N2O1l08J63J0J36o4L7l5j0r4
$$ plain form
3005 -39 20 18 108 57 227 -106 8 -82 71 -55 154 -117 -160 -59 87 74 74 -234 -96 68 -193 -47 -79 -17
3029 -17 -109 59 -21 93 -41 -105 -41 -197 54 -22 -13 -49 -134 87 196 -5 41 37 -197 145 42 261 -71 -36 -218
3054 -218 159 11 -71 45 24 -73 -77 30 320 49 62 -182 16 -36 -251 151 9 54 -35 -49 -68 -67 -78 35 -59
3079 -59 27 159 145 78 -32 -12 53 158 167 -43 58 -71 46 9 -58 -17 -56 -45 -104 32 -44 29 123 222 158 -148
3105 -148 35 52 -33 33 54 56 -74 95 -116 120 40 -110 115 160 -31 76 -49 -39 -126 42 -26 273 6 87
3129 87 -45 177 46 133 -23 -43 116 42 5 1 162 34 -88 -33 13 182 -243 -8 0 35 235 35 7 -20 18
3154 18 -117 91 10 3 -182 161 -81 70 -21 -146 -187 -67 154 238 -117 198 -200 0 -232 -40 -57 -37 143
3177 143 16 149 40 73 46 -9 -83 -19 25 -50 -82 89 29 123 -36 16 77 -231 -68 -58 78 14 51 16 6 -88
3203h8J39k52L64k4j36j86K20L4J20o8r1k56K80M6k07J16l8L3M7p2K7J9R4q9k8
3228DJ57q7j37N0J91j17J22r5j57J10J40k89J50J34j77m6l8j39L42k77K15r8k41
3251b83K86j71R3J59j95RJ76k13J37j56J44J05n4J8L8l47K81j31J52j2j74p6M18
3274B04j93M3o2n3N6J5m2M8j12nK47k80O3j06m3K75J43m33K13J27j54P3N8q1M7
3299D8k7j76K45J4r3j03J38k9j28J51L7j2j11q5J75Q7k33J99j23j77K98j23J30
3322A02j81n6L9L8P8J83k45K21q0j05J62k25l7J13j05N9P4j54K12l9L4K8j56K18
3346A78j52j9Nj58J22K10k4j09j44r3K31k7q3J39j60p0J14k19K50N9qQ8j37k5
3370c2K81l9j14q6j77K11j56J55P5j03o8r0R6m4k2Q0J7Jl3j75K12j85K38j89K0
$$ plain form
3203 -88 51 -201 163 139 3 -183 37 71 191 123 32 -224 56 102 -105 11 -27 6 53 -19 8 27 121 32 4
3228 4 161 74 -63 -13 178 61 183 88 -69 41 181 -108 42 176 -1 -47 -85 -224 118 -159 56 -42 -283
3251 -283 3 -168 -75 84 -111 -102 74 -139 -2 -158 -14 91 37 55 93 -254 27 -104 48 36 -138 -214 204
3274 204 11 54 -8 -61 -5 10 -32 16 -96 -101 146 -134 -71 -177 -220 55 198 -235 -22 105 -49 24 82 1 48
3299 48 21 -155 90 104 11 -92 46 17 -111 40 77 65 -46 -131 44 131 -102 97 -26 -203 95 -28 102
3322 102 -79 -135 -96 -58 20 203 -42 179 99 -6 156 -69 -106 7 -98 -39 35 -119 93 54 88 116 -40 178
3346 178 26 7 12 -146 -24 186 162 53 -91 -184 47 20 -63 76 -84 -154 -40 -259 -9 50 42 130 -7 -32
3370 -32 249 210 96 10 -167 44 -112 43 118 15 -53 -143 -47 -91 -113 -33 -16 -15 -48 -223 -11 -196 42 -147 -127
3395a27J07k8nK06k06J28J02k97l5K32J1j99K18P5k36k7O8J36m7k24J28j09j07
3418b36J18K86j41P4p9J43j64n5j16O3RQ0j4J17jP7m03J15kJ1K30j1j24l2RJ78
3444A32p7l81K79J72q6J37k85L41l48J62j21KpO4P3k52L50j08P0j10M1J02l45
3467a95J82J39k55K29k13J01N8m1r6P5J20k98J40l2J53l0q2kj07O3r2N5K07j27
3491d8j8J14r1J05j46jJ07n2J72k46J22k00J26p5R9j9J03k19J95J15l55K83q4
3514a3N9N5j58J50p1Q3m7j15K21k06m8J34M8n0N1j37m2J26j14K05k55m0J80j77
3538a61J09M0P3l0Q5j9Oj2j3j70N9p2K46j82p4J8p4J44N3k14L11Rj5o7k43M31
3564B38m63K25l6N9Q8p9l31L18j27L4j52K25K87r4j92l6k6L6m4J30P2k93J32j0
$$ plain form
3395 -127 -20 -48 -53 153 -53 75 177 -120 -155 77 88 -111 107 182 -54 -81 -13 123 76 -148 -20 -129 -236
3418 -236 -118 168 27 101 22 165 1 -54 -170 -107 -98 -18 -32 85 84 161 -242 -127 -129 -118 112 101 -23 -55 -46 132
3444 132 55 -326 -47 125 39 176 -109 232 -116 46 -75 -73 -80 -16 57 -195 155 47 117 7 48 150 -195
3467 -195 -13 126 -129 100 -113 -12 46 5 -91 -16 104 -194 -54 -86 67 37 -45 -47 -154 -91 -183 -128 79 -48
3491 -48 -66 48 -43 62 -84 -85 22 -30 142 -104 18 -182 -56 -131 -32 -51 52 -167 28 143 -212 71 -13
3514 -13 46 101 -57 93 22 105 58 -57 164 -42 -90 44 92 42 93 -44 -86 40 -74 131 -124 -164 16 -161
3538 -161 -52 -12 61 31 116 97 103 91 78 -92 -33 -105 141 -41 -115 -97 -171 -27 26 -188 123 132 117 50 -193 238
3564 238 -225 0 -36 23 111 32 -299 19 -108 -74 -226 -1 286 192 0 -36 -62 -26 -70 60 132 -161 -29 -39
3588c9k6J9K81o3j62o6M5R5L3p2p7M2j71K44k10j26L08l0q2j4J21L0k89%K59K
3614E2j51L5J43j28J48J6m9M6j62k4L8k0k9K3j88L87k27kO6L3p7M4J30j21q2n2
3640a51K95k71K9L4N4l1L4k04P7J58p7P9o4q0J8J45n6o8J83j36L0O9J92k20Q5
3665A24j82O5n0K8n8O8k9O9L2K6j11J03j22mJ18r8R3r1R0Kj6r3j7J22j73K79p2
3692A03j21N9J6j17q3R6J69j95P0M2j65J05O4P9l67J65J43o7j43L96j86j96K57
3715A24j34J15j32M7Q0n4j82K54o3q5K09k80J12J48N3j82j44J42m2M1k3Q6p3O4
3739H1l2p3J41n8l6k00J82j75L33P7k61L0k66M88l66J34j05J67p0q5L05j99j97
3762a85M0R9O2N5r2J21k29J44J35j99o1J47k7J05L7k63j0J40j42n3J50N8Qn0j12
$$ plain form
3588 -39 -65 -46 235 172 10 -56 -11 84 117 45 -32 10 -161 83 -127 -253 55 25 -57 -71 50 80 -209 -209 50 52
3614 52 -99 -64 79 -49 99 115 66 112 -50 -74 -36 -56 -85 -62 -250 137 -90 -92 -26 7 -70 -26 104 -17 -99 -151
3640 -151 144 -127 -98 -64 -10 -41 -7 -211 -134 24 -53 26 -38 -118 -100 45 -11 -79 104 -32 -2 67 259 39 124
3665 124 -58 7 -43 -15 -73 -5 -34 35 67 93 -18 85 -37 -41 77 -21 72 -19 71 73 57 -36 -53 69 -104 175 103
3692 103 -18 41 57 -60 -143 -47 122 -73 -3 39 -126 -21 43 122 -245 -80 63 -4 -147 249 63 -133 124
3715 124 -10 105 -27 20 100 46 -136 118 55 -30 179 -101 11 159 212 30 -114 28 -14 27 4 90 17 81
3739 81 49 -24 117 59 23 -177 5 -170 163 240 -21 9 -257 231 -135 -1 -106 61 -9 -94 211 12 -185
3762 -185 -145 -46 16 71 -21 100 -129 15 150 -49 -110 37 10 115 152 -111 -121 19 -123 -176 -26 32 40 -10 -122
3787a22Q5n2j03L90j04n6K1m4O4%j38n8J15J35p3o3J01j94L9K24o1n9l2J87l73
3812a71K88k02j6m3Q8J06p0J38n9k71K62j52j9J95n0K05j76p6J84m1K5k30J07
3835B2J56l8q5j67L3K13m6l24J90Q1M5j60J87j7r7J03j12n7lM6J81M4j72p7K07
3860A53j29j32J75j74J1Q4m8K28N6l58J05o9K92l00J19j2rP4n8j75N7N5J1J74
3884A30k54N6K12k37K39k94K85j60J2mM9rK45r9o7j93r6K38J34k22m0J59j37L0
3908b3o2K60k05Q8o8K09j11Lq8j5K18j85J56r8k37J22J90j56L1P9m9o1Q0k62J97
3933A3p6p6l6J81J97l56N3O2J70k45j04K78M2j39K08q0j49N6m0j34K07L2j04R4
3957E4r2P8J3k06M5R6J0j36K31j52J6L1J2%k51J83O6R5k54L1o4J65l1J63k77L39
$$ plain form
3787 -122 -37 -89 -192 198 94 38 59 15 79 79 -59 -117 -2 133 60 -3 98 -96 -57 167 106 47 15 202 -171
3812 -171 117 -85 -101 -144 -56 50 -20 118 59 -212 50 -102 -121 74 24 229 53 -23 161 120 145 -85 22
3835 22 178 140 55 -112 -79 134 88 -236 -46 35 80 -80 107 90 -7 96 -16 -73 -76 -30 151 195 23 -54 153
3860 153 24 -108 67 -107 -96 -12 -60 168 224 -134 -29 -98 194 -106 13 1 -8 66 8 -167 -110 -55 -44 130
3884 130 -124 -68 144 -93 146 -148 137 -23 -11 -15 34 25 270 171 104 -89 -185 53 187 -35 -75 84 -53 -23
3908 -23 -85 175 -30 58 -10 199 88 91 3 -12 206 21 177 79 -158 -36 154 -2 29 108 59 -2 78 -184 13
3933 13 -63 -139 -175 6 203 -153 -100 -38 132 -113 -217 61 103 -36 172 92 -57 -1 -41 -175 32 64 -40 54
3957 54 -38 40 53 -153 -108 -12 -2 -138 93 -59 -43 -12 0 0 -251 -68 -2 93 -161 -130 -194 -29 -60 103 -174 165
3983A65j86l1m0J40m9P9k32N4J10j89K30m6k30K52j08j7J21j27J20L3j24M8J84
4006A57j66Q0K4M9k70m1J46j61J55K28j77J25j73o2K84j22j30M4N0ql32K14J95
4029A09o9j45N6J04J26k51K46k31R6J64l32N3N7j21J64N6j53J37k3j19m3O0L1
4052b8J69j66l8k0j53K93n3n0r7J41K99k68O8K1k32Q5OJ4J02pO9j49O3J20l54
4077a65Q0O9j6l06N27n4j64M7J08m9O8j64J50j12j14P8L1J62o2ok09J76k9j48
4101a02O4Q6j51K64j66r1J92o9J1j32K06m7Rj31K47j79Nj04L61l46K28j50PN1
4125F3n8J2j38J12L6P1j38j22R1K89k50j21M4K61k35j66K88p2N0p2J47M8o9M1
4149A12M0k64L16j28j3pp7J17j4m5m6j15j9J93k9J6N5p8Q8Kj48J01j30r8q9M87
$$ plain form
3983 165 -21 -52 -92 48 -1 78 -154 -100 10 -179 51 5 -225 27 -81 -98 23 -104 16 49 -75 -27 157
4006 157 -9 71 95 144 -126 -167 -21 -182 -27 201 24 149 -24 -86 198 76 -54 -10 40 32 -300 -86 109
4029 109 40 -105 -49 55 181 -70 176 -55 41 205 -127 -74 -17 -138 26 82 -71 66 43 -76 -119 -59 -28
4052 -28 141 -25 -63 -83 -236 57 4 -46 -143 -2 297 29 97 118 -114 -29 -23 -9 93 86 155 6 69 189 -165
4077 -165 -85 -16 -32 -338 189 135 -29 18 126 77 145 -19 131 19 -95 -17 14 176 114 108 -101 75 46 -102
4101 -102 -38 48 -103 161 -5 -96 96 27 38 -94 112 65 74 -57 190 11 16 -88 273 -73 155 5 12 63
4125 63 5 17 -121 -9 27 98 -40 -162 -71 218 -32 -153 -109 152 -83 -249 39 -33 17 -55 92 140 71 112
4149 112 152 -112 204 76 63 56 -21 96 82 37 -9 -124 -143 50 21 37 92 14 102 104 -44 57 -73 -171 -260 227
4175B27m16K09o4J8j26m7J49j2l0R4J8L2r3K65k81k8J50N2j15oJ37l12R7J94J03
4200B15k08R7R6j51kq3N3q2J00k3Kj55K36k81J30r2RK68M3l70L15j54K06K5k70
4225g6j93L04k9j44J4K24q0j4q0K85l11J38j24o0J18j01J2J02M1j63k3J38NJ07
4249I0N9j93J72j16j4L8j40O1K03j44p5J60o9J7j10J1Q1l9R9J84m37K21k31M7
4273a25m6K00N3m0m0Lj25R5M8J18k95J56Q0k70J04l5O1O6m7j11Q8R7K9q1L5P0
4299H8j30J52p3k38M21k95J85j90K30o0j55O4J78j59o9J34n5N5J90l64j77J73
4321i5J40l2j16K42j15r8J54J06j92K30k06k34K81J41k83p7J96j99j0K36l6j16
4343h3O4O3l5o7O8J86q1j76KL9N6k4j5Q3j91J09J22j6j89J95j44rK06j06j61N2
$$ plain form
4175 227 -189 20 -44 -26 -152 -199 -50 -62 -92 2 20 52 -41 224 -57 -85 65 117 2 -4 133 -179 -82 112 215
4200 215 7 104 200 49 47 -36 17 -65 35 12 14 -141 95 -186 -56 -148 -139 129 172 -198 117 -37 169 194 -76
4225 -76 -269 35 6 -138 -124 100 20 6 -74 211 -100 38 -86 -146 -28 -129 -117 -15 26 -137 -160 -22 -17 90
4249 90 149 -44 128 12 -2 36 -104 -43 160 16 -59 101 32 49 -61 -50 31 -8 91 275 -162 59 -172 -125
4273 -125 -171 29 82 42 2 5 -120 -25 23 141 -154 2 82 -188 -84 -119 -58 8 -39 -150 -62 35 64 -17 18 88
4299 88 -42 110 37 -201 220 -75 110 -80 150 90 -65 -1 177 18 -51 83 28 83 273 -91 -268 -95
4321 -95 45 13 -103 139 24 -74 80 186 -6 224 18 -216 65 206 -77 -154 42 -157 -167 69 33 -83
4343 -83 -19 44 9 -58 10 196 115 -61 -59 -20 36 12 -3 80 -111 -2 120 104 -85 110 -34 -43 163 57 -104 -52
4369e2J7J53j7j07r0o7J73J07m9O2k43K18k27r6L02k46K27K4j70N8m7o9J10J42
4393A13j05r1P7j34Prl8Q2K43k13K5J23k11J73k10m6L6J44J19j99q8K65O9m2P0
4418A60j20r5J43m6q9m7J1K74l10M1j16OJ58R2o2J2j50Q8K14j30j89K1J31K46
4442B43k36n4P1j1n2j31R5K9J03K18k68j2j62P9J89q0L0k04L8j21K29n9J9K39
4466A92L1l00n0J10p7K05k5j54J78l45K71J0l5Q5r9l4N8J47j08k40K98m6j91n
4490a24J84j0QJ54r3j44K8O9j98L43k30Mq1N9J86l05K42J0jj04L6n7nj05K96k43
4516h1q0J30J8l3j7O0P3p6mN3j38J47j60J87Nol8p9k2K3k61K94q2J35k41J72n0
4543g1l7K93k77Q2J0j8j3R9p2J10m74N34k65K04m8o4o4R1R0k96J10K45m5J74m77
$$ plain form
4369 -52 -35 118 101 -6 -96 -163 10 117 68 130 -113 105 -122 -218 84 -162 65 89 -81 -23 -70 -139 -29 113
4393 113 8 -83 -6 -140 -133 -142 -180 -98 145 -68 -43 80 -131 42 -168 -214 -178 -34 85 -114 -202 63 132 90 160
4418 160 40 -55 88 42 -47 -94 -83 191 -119 -78 -194 -188 -30 62 0 12 -138 -50 164 34 -155 -134 -3 243
4442 243 7 -47 24 13 -39 -170 -75 -46 57 275 7 -5 -167 -88 101 21 51 -153 -115 -236 -7 -66 -47 192
4466 192 223 -77 -127 -17 -94 111 86 -68 110 -235 36 46 11 96 -3 -37 21 168 60 -180 118 72 -119 -124
4490 -124 60 50 58 212 119 -25 3 72 -126 217 -13 -9 -90 -31 155 -150 92 102 101 -3 33 -24 -29 -134 162 -81
4516 -81 -161 -31 -13 -46 -63 -3 70 -6 -10 43 -95 52 -108 79 84 78 40 -39 -61 -38 -299 -5 -87 48 -193 -21 -71
4543 -71 -108 185 -92 -10 0 -18 -31 68 -4 106 -368 166 -99 105 57 -7 -71 20 110 -186 -76 169 124 298 -179
4568a79R3J46k77J47K0J28j01N3K4N8j09k01J1J08j28K16j15J88j44O0M9r7K32
4591A82M3k56j6J66k17m3J46l4L0k6J49j89J15j31N3j07K12J09j74J02rJ43k3
4614B25k98P5j0O9P1k24PJ70j46J3j2R6q0oK1J40k32R4j21J36J49r0p3j5R2m3
4640Hp2J55j61J01O4j2j8q4j30J75J55j81n4p7K36P0j13J29l22K99k34o8J83L0
4664G9j21k12L04k87K16L7j27J03m7J29j84K98j86J29l09L54j09J15k39m5K43
4685A41Lm9j72J24o5M1Ok0k12K06j99K65j05QJ06J69j69N4j4j75M5n7J67l9%n3
4711FQ4j51K10q9j41Q3L4Qk48K36j58L31j82m5P0j25J38l07J93MN2J00k39J38
4735BK20j35j49n7k1K4L02j45J12j94M2P6jr2j95J84Nq6O4J21l8N4j91k5K12N4
$$ plain form
4568 -179 -86 60 -217 -70 -50 78 -23 30 54 112 3 -198 -187 -79 -207 9 -106 82 -62 -2 47 -50 182
4591 182 225 -31 -47 119 -98 -141 5 -29 1 -25 124 -65 50 -81 -28 -135 77 186 12 114 105 248 225
4614 225 -73 2 -8 61 132 -92 -85 85 -61 -48 -60 36 -44 -50 -29 111 -121 -27 -148 -12 137 47 -26 -41 51 8
4640 8 -64 91 -70 31 95 83 65 -19 -149 26 181 0 -54 -131 105 175 62 191 -131 168 -66 -134 49 79
4664 79 -42 -254 50 -237 -21 16 -111 -8 -55 74 -110 188 2 131 -178 176 67 182 -57 -102 141
4685 141 144 95 -77 47 -18 23 29 9 -203 3 -196 69 -36 -28 78 247 78 132 118 -57 -12 -69 98 59 59 6
4711 6 90 -61 149 60 -81 2 36 44 -204 32 -126 205 23 -22 48 -77 61 -246 -53 -49 3 103 -136 2
4735 2 222 87 -62 -119 -140 -116 186 41 153 -41 1 77 76 -16 -211 -27 -22 -108 -44 77 39 93 -98 -123 89 143
$$ [...]
8191B2
##END NTUPLES=NMR FID
##END=
