##TITLE=1H_DE-80H_X3
 200.13MHz, d2o
 8 sc
 
 19ns.26.2.2025
##JCAMPDX= 6.0         $$ Bruker NMR JCAMP-DX V2.0
##DATA TYPE= NMR FID
##DATA CLASS= NTUPLES
##ORIGIN= UXNMR, Bruker Analytische Messtechnik GmbH
##OWNER= pz
$$ XWIN-NMR		Version 3.5
$$ Mon May 12 17:10:36 2025 Russian Standard Time (UT+4h)  Yarkov@DPX200
##.OBSERVE FREQUENCY= 200.1313
##.OBSERVE NUCLEUS= ^1H
##.DELAY= (6, 6)
##.ACQUISITION MODE= SIMULTANEOUS
##.ACQUISITION SCHEME= undefined
##.AVERAGES= 8
##.DIGITISER RES= 18
##SPECTROMETER/DATA SYSTEM= spect
##.PULSE SEQUENCE= zg30
##.SOLVENT NAME= CDCl3
##.SHIFT REFERENCE= (INTERNAL, CDCl3, 0, 14.3821)
##AUDIT TRAIL= $$ (NUMBER, WHEN, WHO, WHERE, WHAT)
$$ ##TITLE= Audit trail, XWIN-NMR		Version 3.5
$$ ##JCAMPDX= 5.01
$$ ##ORIGIN= Bruker BioSpin GmbH
$$ ##OWNER= Yarkov
$$ C:/Bruker/XWIN-NMR/data/yarkov2/nmr/H-C/1/audita.txt
$$ ##AUDIT TRAIL=  $$ (NUMBER, WHEN, WHO, WHERE, WHAT)
(   1,<2025-05-12 17:09:47.01 +0400>,<Yarkov>,<DPX200>,
      <created by zg, POWCHK disabled, PULCHK disabled
       configuration hash MD5:
       00 E9 B6 7A A2 85 ED C7 34 08 36 98 17 FE 4E 26
       data hash MD5: 16K
       63 CB 12 15 6E 50 95 3A B6 98 B3 28 C3 79 64 F8>)
$$ ##END=
$$ 
$$ hash MD5
$$ D5 F1 7F A7 A2 30 E6 1E 88 51 5B BB 1D 17 C1 E5
##$RELAX= 
##$RELAX= 
##$RELAX= 
##$RELAX= 
##$RELAX= 
##$RELAX= 
$$ Bruker specific parameters
$$ --------------------------
##$DU= <C:/Bruker/XWIN-NMR>
##$EXPNO= 1
##$NAME= <H-C>
##$PROCNO= 1
##$TYPE= <nmr>
##$USER= <yarkov2>
##$AMP= (0..31)
100 100 100 100 100 100 100 100 100 100 100 100 100 100 100 100 100 100 
100 100 100 100 100 100 100 100 100 100 100 100 100 100 
##$AQSEQ= 0
##$AQ_mod= 1
##$AUNM= <au_zg>
##$AUTOPOS= <>
##$BF1= 200.13
##$BF2= 200.13
##$BF3= 200.13
##$BF4= 200.13
##$BF5= 200.13
##$BF6= 200.13
##$BF7= 200.13
##$BF8= 200.13
##$BYTORDA= 1
##$CFDGTYP= 0
##$CFRGTYP= 5
##$CHEMSTR= <none>
##$CNST= (0..31)
1 1 145 1 1 1 1 1 1 1 1 1 1 1 1 1 1 1 1 1 1 1 1 1 1 1 1 1 1 1 1 1 
##$CPDPRG= <>
##$CPDPRG1= <>
##$CPDPRG2= <>
##$CPDPRG3= <>
##$CPDPRG4= <mlev>
##$CPDPRG5= <mlev>
##$CPDPRG6= <mlev>
##$CPDPRG7= <mlev>
##$CPDPRG8= <mlev>
##$CPDPRGB= <>
##$CPDPRGT= <>
##$D= (0..31)
0 0.7 0 0 0 0 0 0 0 0 0 0.03 0 0 0 0 0 0 0 0 0 0 0 0 0 0 0 0 0 0 0 0 
##$DATE= 1747055386
##$DBL= (0..7)
120 120 120 120 120 120 120 120 
##$DBP= (0..7)
150 150 150 150 150 150 150 150 
##$DBP07= 0
##$DBPNAM0= <>
##$DBPNAM1= <>
##$DBPNAM2= <>
##$DBPNAM3= <>
##$DBPNAM4= <>
##$DBPNAM5= <>
##$DBPNAM6= <>
##$DBPNAM7= <>
##$DBPOAL= (0..7)
0.5 0.5 0.5 0.5 0.5 0.5 0.5 0.5 
##$DBPOFFS= (0..7)
0 0 0 0 0 0 0 0 
##$DE= 6
##$DECBNUC= <off>
##$DECIM= 32
##$DECNUC= <off>
##$DECSTAT= 4
##$DIGMOD= 1
##$DIGTYP= 9
##$DL= (0..7)
0 120 120 120 120 120 120 120 
##$DP= (0..7)
150 150 150 150 150 150 150 150 
##$DP07= 0
##$DPNAME0= <>
##$DPNAME1= <>
##$DPNAME2= <>
##$DPNAME3= <>
##$DPNAME4= <>
##$DPNAME5= <>
##$DPNAME6= <>
##$DPNAME7= <>
##$DPOAL= (0..7)
0.5 0.5 0.5 0.5 0.5 0.5 0.5 0.5 
##$DPOFFS= (0..7)
0 0 0 0 0 0 0 0 
##$DQDMODE= 0
##$DR= 18
##$DS= 0
$$ [...]
##$SUBNAM2= <"">
##$SUBNAM3= <"">
##$SUBNAM4= <"">
##$SUBNAM5= <"">
##$SUBNAM6= <"">
##$SUBNAM7= <"">
##$SUBNAM8= <"">
##$SUBNAM9= <"">
##$SW= 18.0517328524113
##$SWIBOX= (0..15)
0 0 2 0 0 0 0 0 0 0 0 0 0 0 0 0 
##$SW_h= 3612.71676300578
##$TD= 16384
##$TD0= 1
##$TE= 0
##$TE2= 300
##$TE3= 300
##$TEG= 300
##$TL= (0..7)
0 120 120 120 120 120 120 120 
##$TP= (0..7)
150 150 150 150 150 150 150 150 
##$TP07= 0
##$TPNAME0= <>
##$TPNAME1= <>
##$TPNAME2= <>
##$TPNAME3= <>
##$TPNAME4= <>
##$TPNAME5= <>
##$TPNAME6= <>
##$TPNAME7= <>
##$TPOAL= (0..7)
0.5 0.5 0.5 0.5 0.5 0.5 0.5 0.5 
##$TPOFFS= (0..7)
0 0 0 0 0 0 0 0 
##$TUNHIN= 0
##$TUNHOUT= 0
##$TUNXOUT= 0
##$USERA1= <user>
##$USERA2= <user>
##$USERA3= <user>
##$USERA4= <user>
##$USERA5= <user>
##$V9= 5
##$VALIST= <valist>
##$VCLIST= <CCCCCCCCCCCCCCC>
##$VD= 0
##$VDLIST= <DDDDDDDDDDDDDDD>
##$VPLIST= <PPPPPPPPPPPPPPP>
##$VTLIST= <TTTTTTTTTTTTTTT>
##$WBST= 1024
##$WBSW= 4
##$XGAIN= (0..3)
0 0 0 0 
##$XL= 0
##$YL= 0
##$YMAX_a= 59328
##$YMIN_a= -66184
##$ZGOPTNS= <>
##$ZL1= 120
##$ZL2= 120
##$ZL3= 120
##$ZL4= 120
##$ABSF1= 10
##$ABSF2= 0
##$ABSG= 5
##$ABSL= 3
##$ALPHA= 0
##$AQORDER= 0
##$ASSFAC= 0
##$ASSFACI= 0
##$ASSFACX= 0
##$ASSWID= 0
##$AUNMP= <proc_1d>
##$AZFE= 0.1
##$AZFW= 0.1
##$BCFW= 1
##$BC_mod= 2
##$BYTORDP= 1
##$COROFFS= 0
##$CY= 83.5205535888672
##$DATMOD= 1
##$DC= 2
##$DFILT= <>
##$DTYPP= 0
##$F1P= 10.8118882576601
##$F2P= -7.23987719738617
##$FCOR= 0.5
##$FTSIZE= 0
##$FT_mod= 4
##$GAMMA= 1
##$GB= 0.15
##$INTBC= 1
##$INTSCL= 1
##$ISEN= 128
##$LB= 0.25
##$LEV0= 0
##$LPBIN= 0
##$MAXI= 10000
##$MC2= 0
##$MEAN= 0
##$ME_mod= 0
##$MI= 1.114404
##$NCOEF= 0
##$NC_proc= 0
##$NLEV= 6
##$NOISF1= 3.799351
##$NOISF2= 2.8
##$NSP= 1
##$NTH_PI= 0
##$NZP= 0
##$OFFSET= 14.38212
##$PC= 1
##$PHC0= -1339.786
##$PHC1= 1.533751
##$PH_mod= 1
##$PKNL= yes
##$PPARMOD= 0
##$PSCAL= 0
##$PSIGN= 0
##$REVERSE= no
##$SF= 200.129724274929
##$SI= 16384
##$SIGF1= 3
##$SIGF2= 2
##$SINO= 400
##$SIOLD= 16384
##$SREGLST= <1H.CDCl3>
##$SSB= 0
##$STSI= 0
##$STSR= 0
##$SW_p= 3205.1282051282
##$SYMM= 0
##$S_DEV= 0
##$TDeff= 0
##$TDoff= 0
##$TI= <>
##$TILT= no
##$TM1= 0
##$TM2= 0
##$TOPLEV= 0
##$USERP1= <user>
##$USERP2= <user>
##$USERP3= <user>
##$USERP4= <user>
##$USERP5= <user>
##$WDW= 1
##$XDIM= 8192
##$YMAX_p= 0
##$YMIN_p= 0
$$ End of Bruker specific parameters
$$ ---------------------------------
##NTUPLES= NMR FID
##VAR_NAME=  TIME,          FID/REAL,        FID/IMAG
##SYMBOL=    X,             R,               I
##VAR_TYPE=  INDEPENDENT,   DEPENDENT,       DEPENDENT
##VAR_FORM=  AFFN,          ASDF,            ASDF
##VAR_DIM=   8192,          8192,            8192
##UNITS=     SECONDS,       ARBITRARY UNITS, ARBITRARY UNITS
##FACTOR=    0.0002768,     1,               1
##FIRST=     0,             0,               0
##LAST=      2.2672688,     0,               0
##MIN=       0,             -66184,          0
##MAX=       2.2672688,     59328,           0
$$ Real data points
##PAGE= N=1
##DATA TABLE= (X++(R..R)), XYDATA
0 0 0 0 0 0 0 0 0 0 0 0 0 0 0 0 0 0 0 0 0 0 0 0 0 -7 8 -8 8 -8 8 -8 13 -16 16 -16 22 -24 25 -32 32 -39 41 -48 50 -58
44 -58 64 -71 77 -85 94 -105 114 -127 139 -153 167 -186 207 -227 253 -280 313 -352 399 -453 519
65 519 -600 695 -783 684 719 58377 -12567 -66184 16677 11181 -45241 -9095 21040 -18364
79 -18364 -5820 28141 -1818 -12677 28610 17239 -7020 24799 25164 -12282 1833 11379 -20875
92 -20875 -21459 -3303 -13658 -15193 -5180 -10020 -5299 11767 7033 -1149 14099 18231 2027 5705
106 5705 10676 -4530 -254 8736 -9941 -8281 10192 -7535 -19631 2691 819 -19121 -4472
119 -4472 10844 -6185 -7959 13452 8157 -4020 12099 15397 -483 6699 11616 -7035 -9179
132 -9179 1118 -7890 -15260 -4947 -1064 -7578 -4434 3892 2428 1114 7234 6918 3046 4483 3638
147 3638 872 499 -1214 -1017 327 -2224 -2638 -1965 -4272 -3313 -1147 -3337 -3278 754 1719 -918 1304
164 1304 6700 4396 1318 5940 4810 -1776 177 875 -5807 -5004 -1107 -3764 -5520 -1629 1033 -1213
180 -1213 -356 4186 2953 970 4189 3181 -703 1366 1809 -1297 -1632 91 -179 -2343 -2509 -299
196 -299 -1256 -2902 -503 -41 -1388 760 1881 800 1607 3095 3106 1122 440 2118 44 -2917 -1224
213 -1224 -1310 -3727 -2483 -1129 -1596 -983 865 1540 726 1308 3047 1342 13 1873 985 -1197 433
230 433 488 -1694 -932 406 -1109 -2329 -951 482 -1780 -1863 1057 291 -658 1690 1944 835 2058
247 2058 2009 705 313 640 -242 -1910 -1667 -584 -1853 -2137 -379 -424 -332 819 509 623 1131 921 778
266 778 471 382 748 -58 -277 437 -179 -611 -184 -444 -754 -951 -809 -540 -1136 -786 825 138 -157 1581
286 1581 1431 674 1102 926 305 67 -261 -608 -1298 -806 -263 -1290 -873 724 -81 -591 630 417 -38
305 -38 381 289 162 136 306 560 -79 373 830 -305 -335 289 -553 -826 -411 -682 -787 -591 -48 248 -163
326 -163 435 1049 409 413 886 340 2 -76 -138 -268 -290 -294 -290 -434 2 227 -463 -235 285 -94 -325 -30 17 120
350 120 1 300 505 340 569 560 -106 56 306 -464 -639 12 -264 -587 -354 -109 31 -124 325 439 -116
371 -116 286 565 -41 -138 331 -18 -155 21 25 106 -173 -86 32 -359 -122 22 -538 -195 20 -201 -18 268
393 268 289 300 170 171 220 -62 -52 109 -254 -144 159 -305 -116 -30 45 74 -49 94 169 -118 84 90 -214 90
417 90 157 -137 11 63 143 -2 -144 30 -27 -325 -52 -48 -241 24 109 -150 105 86 3 -21 26 -7 -82 -199 -13
442 -13 83 -156 18 29 -162 93 204 -78 26 76 103 -24 -52 32 -69 -91 19 -38 -173 -36 44 11 -242 -140
466 -140 -7 -175 -135 74 227 -76 84 169 -47 85 -54 -32 35 -11 -157 -217 -64 239 -63 -195 160 83 -12
489 -12 83 108 41 96 136 36 -26 -58 124 68 -118 -44 -63 -109 -38 -69 -63 -115 -7 -14 -17 98 162 18 48 204 113 -22
517 -22 119 -56 -29 -186 -141 -41 -183 46 -58 45 -56 134 108 -95 105 36 90 64 25 16 -43 28 26 70 -48
542 -48 31 -3 -149 -74 -170 -156 -52 -51 -51 -16 38 128 175 -24 46 152 -86 -23 -85 -108 -23 -29 23 -128 -36 69 14 -12 105
571 105 65 -10 117 23 -33 -13 -15 147 64 -26 44 -40 17 66 -94 -99 -7 -192 -216 63 25 29 -12 -129 183 46 3 113
599 113 -56 20 34 58 20 -148 -116 -7 13 -86 150 100 4 32 -60 41 48 -13 -13 96 -7 56 47 44 -12 15 -62 -20 -58
628 -58 -119 -9 -96 -5 54 46 39 108 -5 -116 41 39 6 11 41 -97 82 -93 15 -109 70 59 11 133 17 72 34
655 34 -4 -49 -58 -67 14 12 -1 -37 18 65 21 72 -39 -53 -108 105 76 -19 44 -12 -12 75 72 -21 -26 -87 35 7 -71 58 84 -25
687 -25 -64 30 91 33 -26 -71 -33 -22 71 -66 -39 65 -37 -80 66 58 -75 76 111 -56 110 26 -32 -32 -54 71 152
714 152 30 59 71 41 24 -128 17 5 -55 -12 53 -121 3 11 -69 -67 37 1 4 33 16 -54 14 -9 -8 59 94 -158 47
743 47 -6 -39 -56 75 11 -107 45 -17 -18 -51 10 -114 -41 67 28 -32 -80 -74 5 29 38 -67 24 1 -35 -42 -4 -13 -71 10
773 10 -16 -81 -56 19 15 -7 92 53 -10 -47 -53 67 -66 -42 -115 109 -18 -111 105 -2 -46 -108 -20 31 19 57 -12 -97 -7
802 -7 48 -1 -5 11 -67 9 112 -28 63 -72 -98 -145 107 -47 30 -47 9 19 11 101 23 23 40 -101 -93 63 6 114 0
831 0 25 -30 -54 -19 -32 -77 92 -3 -11 -3 32 18 122 -20 83 -56 -11 55 34 88 47 86 -61 -82 51 -21 -66 -43 23
860 23 12 56 -3 -33 94 -36 70 -53 72 0 107 26 36 -52 -7 82 67 -79 5 -46 -74 -65 -61 -32 111 -6 -77
887 -77 30 26 41 -37 40 -64 -24 40 -24 -55 52 -34 95 -16 -50 -27 26 111 53 -32 -100 43 -103 14 71 0 105
914 105 76 -10 18 -12 13 -51 49 -3 -24 47 -12 -110 -31 54 -13 -69 -32 61 -3 -70 -24 -108 -75 3 76 -81 1 -57 36
943 36 17 1 -23 -50 -50 2 -41 26 68 -15 -31 112 28 27 68 59 113 120 46 15 9 73 72 -12 -31 -16 8 -12 -74 -97 36 -74
975 -74 16 30 47 116 38 -9 -11 24 25 80 1 39 -15 -47 24 20 -23 23 -95 5 46 -54 -57 65 42 49 7 49 45 9 -36 -38
1007 -38 82 -18 95 -13 65 55 -96 21 65 -118 9 -31 -168 -83 68 4 -76 -135 -35 -52 15 -49 15 -29 -81
1032 -81 32 73 106 -51 93 -44 -61 -76 -18 -44 52 81 -90 -52 -3 -122 -70 -42 -54 13 -25 -18 49 67 16 19 154 42
1060 42 -62 26 38 88 5 67 77 -122 16 15 60 -27 -135 66 -77 9 -102 -36 14 45 28 -60 31 -80 -90 -31 -70
1087 -70 -18 -29 -60 -14 -7 116 -9 72 -72 89 -59 -101 -6 -62 11 -24 99 25 -4 15 89 23 -106 61 -40 -69
1113 -69 -1 67 139 17 -140 -19 41 18 -3 -11 -53 84 83 -65 44 -70 51 -34 5 -75 -57 -6 -115 8 59 -60
1139 -60 -59 10 23 42 -147 1 35 92 77 -49 60 24 -15 15 24 -31 49 19 43 -53 22 -98 -176 23 -117 11 84
1166 84 -32 -26 -41 4 -112 -49 16 -101 50 55 -9 -32 -48 -1 64 -92 81 -26 -84 5 71 42 45 -74 -28 2 -72 -25
1194 -25 -246 116 -37 -12 54 45 -47 9 -41 -70 75 -31 90 57 -35 11 7 -16 50 70 66 103 5 -70 -39 116 53 -36
1222 -36 75 87 -9 -40 -57 -41 -23 32 89 -46 -25 71 -16 -20 23 -17 -48 153 18 30 75 34 99 67 -56 22 -78 83
1250 83 -8 17 8 5 53 54 -9 87 -68 -79 5 -75 45 -9 87 -48 22 67 35 -18 -55 4 -4 -22 3 80 70 -34 141 16
1280 16 -29 37 38 -41 -31 -27 13 90 -42 88 -22 39 31 -40 53 17 -23 17 43 -7 43 -23 61 -138 -32 -6 4 -45 -21
1309 -21 92 -24 10 48 133 -7 86 -42 -47 21 -38 -11 91 -48 -23 153 -20 10 -57 67 58 31 -5 -26 -56 -78 10
1336 10 53 -24 65 -81 31 9 -67 -108 -46 108 -30 -148 31 55 74 -5 -10 -68 40 -32 20 15 -53 39 30 11 -11 39
1364 39 38 -58 93 119 64 -6 -5 -73 16 -75 -48 -108 34 -34 -85 43 -52 -65 -25 -65 -32 -38 78 -81 -2 -56 52 32 27
1393 27 17 -21 -9 65 -28 94 17 -13 95 79 -52 -36 -5 -38 87 29 -99 -43 16 14 -76 -25 44 -36 84 -12 1 -28
1421 -28 11 6 -109 28 -29 -27 13 -48 7 -84 -99 -1 -5 57 35 -74 -74 -51 17 -15 54 34 47 -56 48 -64 15 0 -122
1450 -122 66 27 5 -27 -23 -54 -54 -17 86 59 30 68 33 -15 33 25 59 -149 9 35 26 0 79 16 126 -73 151 12
1478 12 37 -15 13 50 37 -15 109 122 -43 -34 44 91 -64 34 -61 -6 -51 24 -31 -52 -55 -36 -45 -3 21 -86 -83 39 90 76
1508 76 1 -61 -1 85 56 125 32 -8 -41 76 51 47 62 -47 -95 24 7 31 12 23 -12 10 31 56 10 -47 6 87 -68
1537 -68 42 -7 -26 -87 0 40 -19 62 30 -95 -135 21 -6 -31 -22 3 -31 104 32 -55 -1 -88 -52 -101 26 -39 81 -42
1565 -42 88 -18 -15 -25 9 -108 -96 45 -56 4 34 13 -21 -22 -13 -22 -22 17 34 -82 -117 -95 -39 88 -10 39 42 44 -14 158
1595 158 -22 -24 42 -59 64 29 -21 42 -3 -119 62 -8 3 61 14 -64 -28 54 -6 -40 -9 21 85 14 -15 8 -91 21
1623 21 62 -80 -15 -119 -19 36 79 -13 -32 28 -41 -68 3 9 38 29 6 -102 -71 38 -28 34 -9 -5 -53 121 39 -34 108
1652 108 89 -5 83 63 64 -11 -41 36 -10 10 -7 -5 -99 9 -87 -91 -6 97 29 31 77 16 -56 -56 63 116 -41 97 89 -123
1682 -123 -105 -38 -70 2 71 89 103 36 -67 -20 42 28 33 -2 -39 37 119 -10 -56 -7 36 23 49 37 57 -63 94 -16
1710 -16 12 -96 -33 134 75 86 -20 -11 -102 -52 101 46 26 -1 120 115 28 48 24 66 -27 75 100 34 -52 33 105 -8
1738 -8 53 -6 -71 -56 39 -69 -4 114 -49 -28 4 -73 -13 -170 -18 -112 -25 112 -59 17 12 14 -70 -31 53 -93 65
1765 65 -25 -16 62 -5 -23 75 36 95 21 34 -43 37 97 -37 -119 17 -83 42 -4 -133 -8 21 -27 -18 117 -47 2
1792 2 33 -24 -91 101 -9 -52 70 56 -84 -75 -132 63 43 -97 8 55 54 -17 -44 -37 66 -117 31 56 -16 -75 33
1819 33 15 -47 -35 -16 60 -49 62 -44 -20 116 115 -64 -15 37 15 -20 -24 46 33 68 -33 51 -24 83 79 133 -6 -25
1847 -25 74 -79 -46 50 84 -31 -22 -19 54 68 142 49 -83 -94 -37 -28 -134 6 -53 -88 -35 19 -39 -4 34 134 33 -48
1875 -48 -20 -58 -39 -15 -82 -88 23 23 12 -94 2 13 27 70 -2 26 50 -43 25 -33 -39 6 0 -33 3 -56 111 -19 -38 10
1905 10 51 9 69 31 -27 57 -44 -69 16 81 36 -53 -74 154 -85 11 -23 8 -169 -1 -91 -22 36 63 8 78 86 19
1933 19 139 -32 -17 144 -36 13 -66 -9 19 19 -23 75 7 20 18 -100 80 -99 13 80 26 -25 64 107 -24 -14 20
1960 20 -63 -56 -64 -19 73 37 68 -10 18 -2 -16 7 -52 -103 -34 -43 -40 25 -20 -33 -216 16 -5 27 87 89 -5 45 -63 -15 7
1991 7 39 75 103 2 16 -164 14 27 51 -88 -51 -17 35 6 32 -46 -80 -16 9 -17 20 12 89 36 -53 -29 -14 56 -14
2020 -14 -126 42 -60 38 48 4 -83 57 -36 -32 162 143 -52 -44 -24 -57 103 64 5 54 -15 -12 112 23 80 2 -40 -14
2048 -14 66 44 83 -53 -34 25 -97 -41 94 6 -46 67 -95 52 -6 -36 -172 -83 40 -64 -145 60 25 21 -9 -49
2074 -49 -14 158 106 31 -23 62 4 85 -65 5 -68 -191 -10 38 -90 9 -59 -11 68 -10 -24 -55 -2 25 -11 80 46 -21
2102 -21 39 -111 18 -35 98 -42 -10 98 -112 -24 -2 0 107 -157 -12 -65 31 2 -30 -41 -37 -84 -61 -32 30 33 -93
2129 -93 -24 -4 -44 -77 -24 -27 -43 15 68 43 37 10 112 -177 -82 105 -4 46 152 -50 84 3 27 -200 71 -114
2155 -114 71 12 179 30 47 -69 32 -48 -93 -78 65 -20 -63 89 24 -96 -16 32 -67 33 -73 134 89 28
2179 28 14 21 -39 74 0 44 0 -77 -57 34 -13 23 -136 -26 -19 -29 -78 -7 82 -32 84 -17 -12 25 -5 -48 -21 26 -68
2208 -68 -98 -16 -15 7 -13 -53 -17 -53 1 -4 -75 50 168 69 -89 -133 13 28 -5 69 -16 57 37 47 -78 -15 -4 38 -22
2237 -22 -60 -44 -20 145 -85 -41 81 -52 -10 10 -9 13 88 10 9 7 -98 -90 -22 -35 -8 -3 -10 -54 24 25 -88 -73 1 54
2267 54 -84 -48 -48 24 13 48 -92 -38 27 -50 27 44 -35 55 -25 -93 49 -105 -40 29 60 78 51 24 -6 -35 12 -83 27
2296 27 -80 38 -100 -38 82 43 5 110 0 65 61 -66 66 90 -61 0 75 -46 56 82 -90 -35 -13 71 -38
2321 -38 26 76 12 14 -5 -36 -4 -81 -44 -23 -47 3 -73 -37 75 64 7 90 78 -74 152 100 7 138 -41 -96 13 130
2349 130 63 -54 58 -49 -39 -73 -16 20 -13 -85 -44 29 88 -58 -35 -41 34 13 66 20 -3 -41 -7 13 54 -30 6 -22
2377 -22 -48 46 28 79 -130 22 129 43 -8 58 63 7 -7 80 50 -52 -121 24 -45 -5 -156 -78 38 10 -3 14 6 -27
2405 -27 -48 -97 50 -95 18 37 -112 -145 -26 -91 -44 60 -31 29 -69 -8 104 30 -85 44 -1 83 49 24 77 80
2431 80 95 13 7 97 194 67 95 17 18 -21 -59 -3 36 -88 -4 -77 17 106 -11 -5 40 60 -9 -35 -32 -10 12 44 -105 7
2461 7 -20 -10 96 -18 70 47 -34 -14 -2 -29 31 103 21 18 -24 47 42 31 22 -5 -73 -41 -43 106 -23 43 -129 -46 -49 7 -99
2492 -99 71 -106 72 40 -54 -58 -47 -58 -76 48 27 -22 -2 82 30 -42 -2 -50 72 -72 -67 55 63 47 0 85 30 111
2520 111 31 11 -198 -58 -55 -8 75 17 -77 -3 23 19 55 103 18 52 -134 -7 -57 -14 23 33 -68 -6 57 7 12 -91
2548 -91 -32 -50 84 -145 -44 -18 55 71 104 44 60 33 90 79 -31 26 -57 7 -82 -61 -45 -76 58 -30 53 -47 83
2575 83 -18 -125 10 25 28 68 18 -82 16 56 46 -20 68 -71 41 -132 9 35 83 98 -13 -24 -20 -25 40 6 42
2602 42 -16 -51 83 37 4 67 55 26 74 -55 -88 16 34 23 -52 -37 -73 -49 -44 44 32 44 134 39 -16 -14 44 95 29 17
2632 17 -78 35 -48 -13 4 61 -8 -30 -11 76 97 -27 -35 -17 -19 84 -13 25 194 59 -80 27 33 -14 71 30 43 33
2660 33 -101 38 67 29 -33 41 21 10 69 65 -85 -42 3 -97 -110 -77 38 43 60 63 -14 -17 27 -6 65 19 142 -3 25
2689 25 -134 77 21 -51 8 -35 -2 51 51 -8 79 -12 56 58 -58 -146 -94 -37 2 -18 -18 3 72 117 10 -104 -82 19 69
2718 69 59 95 -27 -14 -75 82 47 3 -18 15 38 -26 47 -153 63 -42 15 22 35 -17 -14 -44 61 -17 46 42 -57 -106 -14
2747 -14 83 22 -63 55 6 92 -6 0 127 -48 106 -27 -5 -3 65 67 -25 44 44 114 -123 48 -132 95 29 -3 5 26
2775 26 9 -1 -99 8 8 -16 48 12 118 9 14 25 53 75 10 -42 72 -4 49 -54 75 -130 -37 -30 31 -21 83 29
2803 29 53 28 -21 38 59 -110 20 -31 23 62 11 -35 -55 3 -14 -20 -71 -34 -75 81 -32 -14 7 42 54 43 62 52 2
2832 2 29 147 -8 -37 68 -46 -68 41 85 62 45 49 61 60 -55 3 47 23 18 7 91 -22 88 23 15 -27 -42 44 66
2861 66 -77 -46 3 -60 -2 -56 -42 -86 -2 44 43 -31 -70 -14 -7 50 101 137 31 51 -157 44 -28 49 -16 -120 -8 67
2889 67 28 -76 51 6 73 30 -5 12 -13 -28 -14 -40 -28 -92 -49 109 -88 15 76 28 3 19 21 -29 -74 -62 -84 63
2917 63 74 -7 -36 -127 -10 -17 -18 -45 -74 -78 62 -44 10 4 1 34 -20 -74 -39 -48 22 34 38 70 62 10 4 -78 -67 10 -114 48
2949 48 60 -1 0 45 77 -36 19 23 -79 -52 37 -43 68 27 20 -12 1 37 -4 76 -7 114 -4 17 -47 14 37 -52 41
2978 41 34 37 34 11 -11 5 50 -33 -32 44 -43 1 -80 -48 -53 72 30 -158 44 52 118 -3 -41 -59 3 -4 -48 15 -59 -41 10 -35
3010 -35 35 -21 -10 77 -9 35 0 6 -178 -73 4 37 58 -63 83 -24 49 -43 -36 -60 55 71 27 -21 -94 16 -84
3037 -84 38 -19 31 -39 14 27 46 11 39 50 18 18 -80 90 98 -63 -10 -5 56 6 49 46 -45 -50 0 53 -7 33 84 49 64
3068 64 -30 -20 105 102 -249 33 22 -6 35 23 -74 -21 -74 -128 25 40 6 -158 -21 11 46 14 -54 -142 111 41 131
3095 131 -91 56 -36 -38 -32 13 24 -55 24 -59 -114 27 -8 -105 -65 -61 -42 8 28 -45 17 -41 -42 -59 -85 -5 -91 -35 10 187
3125 187 -26 44 -81 23 29 -28 29 9 -39 29 -46 64 38 -34 2 -24 98 84 33 -10 60 -102 97 -20 -20 18 -166
3152 -166 26 -44 53 12 10 -110 -90 -49 51 -65 -29 -95 -4 29 -23 3 -20 38 53 181 -112 -22 19 61 151 78 24
3179 24 -23 118 -11 4 -3 -35 -78 39 -84 -89 -13 -23 67 -47 -89 -17 -59 87 -19 42 40 -32 -14 -11 -25 -16 -51 -54 -57 -156
3209 -156 4 -40 7 -39 46 72 60 87 44 11 35 32 73 -17 36 -32 6 85 -20 -8 -40 -114 25 5 13 -4 56 -72 -24
3238 -24 -29 136 -145 -26 -50 -57 152 -12 170 -20 41 -79 33 -146 70 50 -20 7 108 65 36 -6 -87 -65 -77
3263 -77 -52 3 -34 -13 -82 93 75 -2 -7 -26 -16 153 -48 83 -52 -112 100 18 20 -35 27 114 87 -59 23 -3 -18 -50
3291 -50 91 24 61 77 -9 27 116 53 5 -79 -40 16 26 52 -51 -38 -47 19 -50 -147 -61 9 91 19 139 22 36 53 -55
3320 -55 -54 -53 104 64 125 3 102 -11 -16 11 40 50 73 75 1 -44 5 -95 -31 -59 -129 -33 122 26 10 -44 33 91 105 -36
3350 -36 28 -27 -5 7 -25 -17 -69 -4 -95 -19 -54 -22 46 20 1 -65 33 22 10 23 47 -62 -75 113 -21 -69 -1 1 12 77
3380 77 -64 129 104 76 20 -35 -23 46 9 -74 42 43 -13 104 33 -27 -49 35 27 -16 91 2 -80 22 -119 92 9
3407 9 -46 -51 -31 -14 -169 67 87 94 16 20 15 -37 -14 59 -43 -43 8 49 87 -15 -49 11 -11 -58 5 -17 -68 -112 -87 -140 40
3438 40 122 -47 -15 0 56 -12 -102 -67 53 -50 -66 89 -23 -43 0 13 1 -52 -30 12 -7 74 -37 -60 22 -50 -43 99
3466 99 -31 -158 166 59 -35 181 -76 -36 -115 75 93 25 45 -128 -88 -57 -3 -72 11 -80 18 71 3 -107 66
3491 66 16 34 137 -83 -100 -34 38 -71 -52 61 -12 46 17 47 -30 77 -59 46 42 13 -90 23 -57 2 -12 -36
3517 -36 22 -60 -33 -39 9 -47 -1 -14 57 80 -65 153 35 37 114 39 -25 -64 25 120 -46 -10 -5 -55 -56 -28 -77 26 -76
3546 -76 33 127 38 47 -55 31 -119 27 57 -30 75 -42 -25 10 67 6 -5 37 23 52 41 22 5 -116 -163 -62 8
3573 8 113 -77 60 39 64 20 95 -37 27 47 -6 49 128 43 29 11 -32 112 -34 198 -77 -28 -73 -2 -69 -56 -2
3600 -2 72 32 1 8 -28 198 -36 57 -3 57 -1 3 -17 -120 36 -52 -1 -82 1 21 -22 38 18 -39 49 77 -102 69 -93
3629 -93 -12 107 1 -48 -70 -40 -51 33 4 -14 -77 6 -26 -53 -49 34 29 -71 -67 59 -3 5 5 -25 35 -38 -55 -33 31 51 29
3660 29 -3 15 -13 -47 -4 -123 50 -13 5 56 155 42 36 -12 3 114 42 54 -125 -13 -10 64 -32 70 -90 -38 -93
3687 -93 36 11 41 -50 31 1 31 60 72 -54 38 -11 30 32 39 17 -20 47 62 -26 -98 110 32 -3 -7 161 -58 -17 95
3716 95 13 69 5 -24 -60 52 62 -21 5 48 49 -21 -58 -53 -24 21 87 87 -14 -2 4 -56 -76 56 100 0 -24 -109 -9 -5
3746 -5 21 34 -38 -15 -28 110 22 42 -50 -70 60 140 18 62 69 33 -6 -133 -10 -61 -36 -1 55 -82 -46 -109 -109 16
3774 16 -40 6 -21 10 -9 -89 102 -32 131 -72 15 42 33 50 4 -55 -3 -39 15 15 14 -40 31 33 53 24 38 -21 48 66
3804 66 -18 -24 131 81 -99 -37 -55 37 64 12 -48 66 -38 -13 -32 -17 -44 -17 6 -148 28 -40 58 -20 -69 -79 22
3831 22 -28 -17 37 45 97 -32 -22 71 -44 -17 1 -30 87 28 -77 9 63 72 59 55 50 -8 66 -41 -109 139 70 3 80
3860 80 -101 -74 -51 -4 2 -77 50 82 -52 -123 -42 110 -57 -63 -32 -12 1 -31 79 -72 33 -24 -25 72 61 -60 87
3887 87 78 -19 22 37 -25 11 -23 41 72 -55 36 -22 46 -33 30 62 -81 -59 116 -69 -42 132 -111 -96 55 38 -90
3914 -90 4 27 54 107 12 13 -42 24 -26 -17 -66 -61 91 104 -55 -49 68 -33 -24 -77 35 -69 114 -15 -48 -22 5 2 -96
3943 -96 56 -49 86 61 -8 23 -33 11 100 -48 -101 -67 -41 24 64 -130 -12 27 69 59 95 137 13 39 40 -97 36
3970 36 -86 -75 90 46 50 -132 71 25 3 -71 15 -64 -134 63 -17 -113 -62 -28 -59 113 47 21 -6 -90 14 37 113
3997 113 84 0 108 -63 148 -64 -71 -60 48 54 71 12 -23 -47 -59 -55 -122 -22 -52 40 43 30 -72 -67 15 -9 66 55 143
4026 143 30 -24 45 -18 55 35 -49 -27 15 -119 18 -46 59 -31 135 46 -71 -10 -79 -11 59 -19 63 34 128 -37
4052 -37 70 11 28 67 -39 97 43 -7 -45 70 22 -40 -114 -32 73 -121 96 163 -18 -4 4 -74 -35 -20 -74 26
4078 26 -119 -5 -42 58 28 95 -73 42 -23 -38 -49 14 109 36 43 52 -41 -84 67 -27 24 -90 18 13 50 0 56 -53
4106 -53 21 -32 -32 -35 -24 -96 -25 -7 -57 -27 65 46 -1 -15 3 49 14 -77 -44 80 -75 60 -7 -69 60 13 34 -46 -36
4135 -36 32 75 -96 -79 -70 14 -116 -25 -24 -121 -53 -2 -58 8 32 9 -30 -33 23 11 -55 45 42 -64 119 88 -89 -5 74
4164 74 -29 -28 5 5 -24 -27 -16 3 86 27 -45 -66 -17 11 56 -46 77 -49 142 51 53 -14 -172 -182 -32 -3 -137 27
4192 27 9 65 55 -12 -38 33 40 -55 87 55 3 120 47 72 -3 5 41 28 67 -93 -100 -90 -86 -90 -46 23 -31 -76 38 23 -121
4223 -121 -40 26 9 20 -18 40 -39 -144 -20 -63 59 28 -44 93 -117 52 -39 -30 30 -5 106 -5 -83 12 84 149
4249 149 -4 44 -59 78 99 55 22 79 31 -128 57 22 21 19 31 15 -89 -57 43 -44 -75 58 2 -20 -27 -111 51
4276 51 -89 14 153 -35 73 -26 111 -47 56 27 -44 70 10 105 76 128 -66 146 96 0 -67 -122 -15 -34
4300 -34 15 31 -42 -2 46 25 13 -9 -38 77 -19 -22 -38 61 8 51 34 80 30 -50 -49 100 1 -45 -7 32 86 -18 -10 194
4330 194 -41 63 -121 77 -32 -72 -22 -29 92 -5 11 -38 156 -49 43 65 19 51 64 10 65 169 -55 30 13
4355 13 -38 -65 62 -9 159 18 31 -72 92 41 -4 -84 -22 -14 -49 -20 -16 -108 17 129 -33 -82 37 77 39 -145
4381 -145 -7 43 -19 2 9 -105 91 -13 -20 -37 61 -9 26 -50 -59 118 -8 91 -35 -9 105 6 16 27 70 30 -37
4408 -37 -7 -38 -30 -65 88 -81 71 45 91 -9 85 16 -14 -47 -12 17 82 -25 25 66 -13 102 0 162 108 49 -83
4435 -83 -28 110 28 -32 -66 -29 -3 4 -101 50 4 51 54 -24 7 28 59 7 52 58 -20 -53 38 -24 -109 25 -131 -31 59
4464 59 10 14 -22 82 34 107 66 -64 45 -18 -71 -10 -66 2 55 -67 20 -4 -46 121 -147 11 62 97 -58 23 21
4491 21 -57 1 -20 94 13 -19 16 -22 33 -15 20 40 36 54 64 -38 45 -133 10 45 69 78 25 6 -43 54 -109 -150 30
4520 30 -52 -146 -45 -26 19 19 36 -38 69 -10 78 59 -27 -10 -22 -31 -5 -44 -24 -79 -28 -50 47 47 105 10 103 -2 61 -94
4550 -94 106 -48 36 22 -33 -40 36 33 23 20 -4 -52 -55 71 -45 80 28 -44 30 -30 22 3 20 77 -37 -92 -10 70 19
4579 19 -172 -38 37 43 -28 13 -36 62 56 -40 -7 -24 -75 22 -62 41 -27 -62 -25 31 -53 -45 -47 133 -96 -20 -72 -69 26 -130
4609 -130 -172 -137 5 -17 59 -53 -7 -20 -63 138 -87 -35 -29 -50 16 -10 -14 -23 68 -35 -16 5 -8 44 41 97 -9 -76 -138
4638 -138 -86 43 -93 -85 52 -101 14 92 76 -32 67 -9 -86 12 -76 -3 40 -30 -28 148 -39 135 33 -3 48 -5
4664 -5 99 2 -13 13 -45 -34 -6 69 -75 31 -161 0 -4 -25 -104 -67 -36 64 -25 -32 -46 -74 24 58 12 23 -73 -5 -19
4693 -19 -23 16 -37 -4 83 91 93 63 -14 -56 -11 -147 29 -16 28 3 -38 -23 43 53 -67 -7 -66 9 18 -34 -74 27 59 121
4723 121 -44 -15 -60 56 4 -61 6 112 9 -15 49 -24 -132 -78 87 3 -77 -11 -35 55 48 -34 23 45 12 41 -130
4750 -130 -9 57 -5 29 -54 51 -17 -14 -36 12 3 -94 -92 -28 -84 -94 30 -150 -29 -63 -89 -22 49 25 -6 23 -24 -44 -33
4779 -33 -22 -19 -10 -47 117 -78 -11 -134 -79 -43 -56 24 -32 37 61 -21 41 64 95 111 -9 8 7 -48 8 52 -84 109 -37
4808 -37 -35 -58 0 126 -130 -21 -13 51 14 49 -25 149 -117 -4 43 -13 -13 -92 16 -72 51 24 22 -15 75 49 -57 -41
4836 -41 42 -89 -103 36 -2 100 17 11 29 -71 101 1 -64 -17 43 39 -11 -39 -39 -85 8 -14 -31 -2 52 31 0 -49 -33
4865 -33 -103 60 -31 47 2 -21 -56 30 116 5 -48 -16 37 -55 -67 -22 46 -2 -31 -69 -86 121 37 -81 18 -30 51 14
4893 14 -68 62 -48 150 2 71 91 -36 11 61 92 -62 8 -31 40 -34 -8 16 201 79 -31 -44 51 48 -56 -64
4919 -64 -109 12 79 -19 123 -25 -26 -67 -18 -51 -49 -44 -41 -71 154 -63 -155 87 -43 42 89 43 167 -5 28 -68 -45 -64
4947 -64 -16 -45 20 -31 50 45 -53 -17 -119 -71 -39 79 3 57 -28 79 10 -21 -73 39 48 15 -81 -94 -36 2 -31 59 18
4976 18 -12 -20 -64 -129 -30 -55 7 -83 -126 135 -73 86 -88 -8 55 -73 35 -95 30 51 -32 -33 -40 -24 -71 107 16
5003 16 98 -42 101 -62 42 -101 -59 118 -41 -45 4 -105 13 -93 -10 1 -31 -50 -95 133 -1 26 50 75 -46
5028 -46 21 49 -107 29 23 64 -19 -12 95 115 -16 10 -145 132 -24 -15 -16 -51 105 48 38 -34 -10 -36 -42 70 -11 -3 -28
5057 -28 -4 -22 -27 49 -90 -67 -89 -147 -60 56 -8 37 22 77 -43 7 -5 -16 83 -20 -18 78 -11 -120 115 76 2 95
5085 95 12 96 -38 67 -67 72 -63 -26 37 -2 -90 29 -88 -35 -98 -7 63 106 -59 123 -128 17 0 -16 21
5110 21 -58 100 -95 54 -17 9 -7 62 26 -8 51 33 -38 -159 42 55 36 24 -26 13 -18 57 13 -19 -46 24 36 -40
5138 -40 -83 -33 -66 -30 -36 -31 25 69 43 -56 11 1 21 28 -64 -16 -90 6 -65 -39 48 -17 8 21 83 -110 25 54 27 134
5168 134 -44 87 -156 -102 38 -23 62 -121 -65 -82 80 -17 -66 -35 95 25 2 8 85 7 16 30 31 -3 -11 -8 74 -87
5196 -87 46 -12 -7 22 -42 -36 -17 -28 -63 26 13 5 65 103 2 126 16 58 -44 31 -132 -41 -35 -7 -45 13 -13 -63 -191
5225 -191 -74 23 139 56 -61 -38 101 27 -68 -31 -87 28 11 32 42 -26 28 27 -83 115 -55 20 20 65 46 58 -126
5252 -126 -112 4 -13 -1 -6 -56 -96 -52 -40 95 -88 -50 -31 61 28 -40 14 -26 -47 71 42 -25 -51 -11 -37 41 -178 22
5280 22 12 55 90 -19 -28 1 -91 6 61 162 56 -76 58 -116 -20 -38 -4 73 -50 -91 163 -34 55 9 -18 36
5306 36 -133 1 37 -80 -65 -10 -91 36 -12 -46 -63 84 74 10 -90 -1 -42 -50 -102 60 -25 -14 -3 7 -27 -90 83
5333 83 41 -36 67 -107 77 47 -71 -74 121 82 41 -26 -28 -18 -67 -142 13 103 -50 -11 -39 21 -11 -8 57 67 -104 -10
5361 -10 79 15 -18 98 -20 127 -47 32 -6 63 -3 36 40 -11 21 -10 72 51 26 93 38 13 29 48 -122 8 -44 29
5389 29 5 -42 -28 61 -26 81 -89 -120 -24 54 52 -34 41 52 14 -12 -29 -99 33 38 82 -32 25 97 -27 0 44 -10 -61
5418 -61 -146 -25 -64 -56 7 57 24 -51 -78 -122 39 84 91 123 77 83 82 35 -37 -41 15 -2 90 59 -34 18 41 -23 46 25 -43 -84
5450 -84 -16 -1 -5 9 102 88 78 -4 112 -48 -4 -14 11 18 -88 10 5 -8 137 -67 -45 -25 -97 -19 -38 8 41 49 -63
5479 -63 -56 7 45 -128 -87 35 17 -110 -40 18 14 -11 1 94 32 -2 21 -16 -55 86 15 -67 9 -22 16 27 10 3 77 9
5509 9 -108 62 120 -38 42 38 -2 -3 -5 -39 56 30 32 37 -70 3 -92 -27 -109 63 33 115 68 35 -37 13 10 -63 8 63 56 -54
5541 -54 20 -8 -17 -138 77 14 15 10 -51 -137 -35 -78 81 -42 -67 105 -4 76 49 -119 40 -12 -26 60 -56 43 23
5568 23 81 56 -14 -27 13 -53 80 26 -21 -61 28 69 22 -33 37 30 -14 -17 -62 -12 -102 94 -30 22 -43 12 -37 -164 -60
5597 -60 115 -14 -20 65 -89 5 5 -45 30 -105 72 30 51 67 4 132 6 62 9 -20 -78 -51 40 -107 72 -23 -65
5624 -65 133 -20 -41 13 -68 14 -42 62 -30 62 -55 -48 73 -104 -61 -13 13 2 -16 49 -4 -41 65 -43 88 126
5650 126 -79 66 -42 -62 -8 -64 24 60 -19 -19 -172 -35 54 -20 65 76 -25 13 -35 15 119 -45 42 5 -24 -16 -52
5677 -52 33 74 -38 37 -21 -46 -15 -23 -2 -18 9 -26 -15 67 -37 84 13 79 154 -42 36 115 98 37 66 25 -6 -72 87
5706 87 64 -17 15 5 -43 55 11 -23 22 -13 68 -34 -33 -32 34 22 -3 -34 -23 9 49 -31 -28 15 32 -35 -27 -6 38 -59 -163
5737 -163 -87 -34 38 25 -76 5 19 68 -26 51 11 -95 -42 -34 53 97 66 -5 2 -43 -2 40 -68 31 -6 64 -127 40
5765 40 91 1 42 66 -33 -21 90 45 48 -89 -34 -76 -2 -36 2 63 13 -3 41 20 65 -14 59 25 61 11 16 -101 -19 32
5795 32 -22 15 -39 34 -140 -118 -30 -61 -25 -53 -10 -36 -11 10 61 58 80 83 39 15 12 -132 -18 -29 52 109 32 -64 -18 30
5825 30 -23 2 -86 -53 -17 70 -8 -16 16 69 -68 -147 27 3 -165 25 37 -2 23 -53 -25 -11 -109 14 8 56 -72 85
5853 85 82 -73 -45 56 -1 21 -3 91 60 61 -21 36 59 53 136 52 45 97 53 63 41 -198 40 42 37 -56 -15 24 36 -98 -29
5884 -29 3 -79 -65 21 73 66 -39 68 36 -1 33 29 -47 -115 -43 -30 -29 3 -35 157 13 49 45 -13 52 -3 -79 -88 -6 -121
5914 -121 -78 9 -36 -140 31 -38 5 0 -43 -17 118 -56 9 -47 -23 -87 6 106 -18 -1 -84 3 34 -139 -38 -73
5940 -73 30 -119 41 86 -50 -57 50 4 21 2 10 -55 74 -38 80 -4 54 15 60 -2 -74 -66 -20 6 -28 1 9 99
5968 99 -25 18 -52 -8 13 -55 -69 56 57 -71 37 10 -29 42 -116 9 107 -67 -94 30 -4 35 0 -43 -12 2 114
5995 114 21 -88 -25 13 1 -82 -47 -54 -110 -65 -112 167 58 -55 -67 47 1 -62 -9 -36 -124 -13 16 48 83 79 12 -81
6023 -81 81 -48 14 121 22 -21 -30 3 102 71 -18 -49 -30 7 -11 25 -37 -18 -80 -19 -4 -48 -108 84 4 51 17 20 81
6052 81 11 -12 -11 -45 17 -43 -37 4 -84 -27 85 -182 115 76 62 -25 57 17 81 47 73 56 -2 -83 39 -50 -11 -54 -19
6081 -19 -31 -89 40 14 -26 48 -57 -169 180 -38 64 -73 -77 16 -29 -14 9 22 -15 -1 -69 -60 5 110 6 64 -8
6108 -8 3 28 -31 118 33 2 -37 -85 28 83 -24 -66 72 -34 79 -31 93 -22 -12 -25 -30 -18 -57 33 17 -35 -30
6135 -30 40 -43 -46 -140 30 10 -31 -37 -2 22 104 40 40 11 175 -55 15 68 -32 -4 50 58 27 41 20 71 -65 -9 -77 22
6165 22 -73 -3 11 -42 148 14 -97 -54 61 22 2 -35 -4 -37 -95 24 44 74 -70 -3 -7 -127 -48 -18 -26 -3 78 -8
6193 -8 23 70 113 30 100 57 -48 -123 -99 78 62 -133 -103 -3 -2 -100 -17 69 40 29 -17 -11 50 47 -75 9 -1 8 89 2
6223 2 -28 -72 -69 -29 -27 -77 -21 -3 -3 -39 -44 146 11 -61 -24 72 27 34 -28 63 17 -59 37 32 43 21 -41 -3 -12 -37 -35 7 -47 -74
6257 -74 117 22 -6 30 0 -108 -66 40 84 -89 -64 -59 7 24 53 23 -8 70 -24 -42 6 30 83 -1 -61 12 25 23 -51
6286 -51 36 -33 6 83 -16 33 -42 55 61 -8 -66 31 -129 38 -87 92 43 41 -43 -21 89 -34 64 130 -70 -38 56 91
6314 91 19 32 -34 34 69 -75 -11 -58 -44 47 39 -36 -53 -18 -5 -32 -51 142 -110 -33 -8 -29 -2 -30 -85 -77 -110 45 54 -55
6344 -55 101 31 -54 -18 -84 23 -111 43 100 -6 -9 19 -73 -9 -53 -58 59 52 9 19 57 49 -36 -82 -1 -68 8 85 -13
6373 -13 4 24 -150 2 22 16 -134 -19 -28 63 24 -9 -12 -36 -138 50 -5 20 117 87 -75 127 -117 -18 -26 64 75 7
6401 7 60 -78 -31 84 44 -115 -87 62 90 -102 -140 -39 15 -34 -84 61 43 -41 -13 -58 -28 69 44 -13 -41 -45 -33 -68
6429 -68 -13 68 245 123 56 92 -34 24 42 134 -47 -207 47 -10 -9 -27 -9 -88 -22 2 36 64 -8 17 -45 110 122
6456 122 -36 -107 44 -60 -17 -1 40 -44 -38 47 -113 137 -30 -71 13 -85 74 49 -95 -10 126 110 52 51 -26 9
6482 9 -43 0 131 94 -79 -81 131 44 -82 -82 -47 -44 -95 -33 24 -18 -37 16 -54 -11 -80 9 -92 -83 -154 62 56 -62 1 87
6512 87 -11 -90 -53 -4 -143 38 -11 38 -9 0 -22 -9 77 116 87 29 32 -28 16 41 72 -6 83 -31 -1 -37 -93 31 -64
6541 -64 -36 54 -67 -7 38 4 -68 27 -69 6 -2 -80 39 149 -49 -34 -62 44 -27 -25 10 18 -77 42 68 -4 37 92 69
6570 69 65 89 -57 -25 59 41 -12 68 21 -11 -51 24 43 71 44 54 58 -9 49 -129 61 71 3 8 44 -72 16 14 20 -138
6600 -138 -23 -46 -12 -12 -27 24 -17 -111 -44 -79 42 -26 -65 -23 39 -23 48 48 -23 -56 -50 134 72 -7 -112 -28 110 -12
6628 -12 -92 -6 -27 -125 23 -84 51 61 -48 -133 -29 18 -61 6 -53 27 2 43 -112 -33 -44 31 -69 59 50 -16 -70
6655 -70 -67 21 90 81 22 -67 13 -47 -32 -116 6 -63 -45 30 63 -167 -59 -6 62 -34 -16 41 -27 50 -102 17 6 -85 -39
6684 -39 72 -21 6 51 -13 -122 44 -41 -71 -23 -62 -4 -144 58 -12 14 101 87 123 74 88 1 -29 -32 33 -16 -65 -65 6
6713 6 -24 -91 34 30 -70 -120 -25 -3 26 -39 -4 -41 -115 40 48 82 -91 51 53 109 59 -33 3 10 0 -96 -55 66 -6 -2
6743 -2 -60 50 -27 -13 14 42 -42 -127 -10 1 107 132 116 -47 13 -45 -44 30 63 -133 37 30 6 147 65 20 -69 46
6771 46 -25 -77 46 16 13 -23 91 -36 13 -20 1 -51 -77 75 72 13 16 91 19 40 12 -89 97 66 1 84 -73 54
6799 54 101 -46 44 -100 -77 44 -6 -25 26 -22 -83 2 -26 -113 19 3 -113 -16 125 -53 36 -2 -41 51 -68 46
6825 46 -19 -122 1 -130 41 24 -49 1 -69 -66 66 53 42 8 -4 -67 -13 88 -57 11 -18 -93 171 56 -79 -58
6851 -58 -57 40 -39 46 2 -46 -54 -66 50 17 -12 -170 78 6 -53 -140 -1 19 -48 -62 -6 -87 -91 -55 -36 25 -15 -74 26
6880 26 -39 25 -29 -113 -62 2 -5 -152 -34 183 0 -17 -27 20 50 -10 -70 -108 138 -23 70 -64 -4 4 94 20 -51 51
6908 51 -21 47 14 -5 -23 15 159 -101 84 -87 -136 -67 12 13 -78 -70 -52 36 -23 -35 -94 -42 56 -68 -10 74 63 -23 -65
6937 -65 14 -10 -8 138 -26 13 75 -4 37 -25 -115 3 80 37 99 -29 11 -68 -11 -43 -12 -15 -53 -26 40 101 -13 -62 -47
6966 -47 -63 50 87 112 -8 111 79 5 79 -112 3 -24 25 -63 86 26 -107 50 -35 29 -9 -9 -2 15 -84 -2 137
6993 137 -169 91 -48 11 -59 74 -5 -7 90 -31 -92 -7 4 -100 -70 -67 -51 9 75 17 -55 45 30 -80 57 -24
7019 -24 -1 20 -39 -7 132 153 -40 -51 104 -65 -47 -11 35 -9 -74 -61 -1 141 3 -3 83 -51 -32 44 85 29 -44
7046 -44 -22 64 72 -23 47 98 24 40 -157 -61 -1 -53 34 61 32 -1 49 34 84 -45 24 -70 -39 99 -148 -39 -58 68
7074 68 29 -57 134 -9 28 126 -81 42 -78 -130 -22 -10 6 -35 -87 -32 -4 72 123 -11 68 76 -50 -25 67 36 -48
7101 -48 -1 -89 19 -25 64 29 -30 -84 -71 57 60 -51 9 46 -36 10 30 -68 -50 -3 -58 -8 -20 53 151 -46 -8 26 85
7130 85 97 39 -50 6 -54 -108 65 -72 -23 -25 113 1 79 36 37 27 51 59 84 42 65 -47 -8 9 -34 106 -78 -40
7158 -40 68 -76 70 9 -21 -28 -47 -45 -26 -120 -64 87 30 29 94 -53 -12 3 28 -38 35 11 13 103 -122 -96 -60 9 -57
7187 -57 87 -3 87 33 4 -119 -16 -12 -23 -108 11 -15 -90 -41 48 -68 -19 -27 -43 68 40 -70 53 14 126 46 -35
7214 -35 112 -22 -55 19 33 98 33 11 7 59 -11 28 39 -27 -12 -42 -6 13 -61 -65 17 -1 -6 71 53 54 -2 36 -11 -12 -14 -35
7246 -35 40 74 -86 -53 -34 24 -68 -55 47 31 -5 -25 14 72 -32 13 35 -43 44 -94 -74 16 -105 -21 69 178 -14
7273 -14 17 47 113 29 11 -2 -4 4 -83 36 -34 -88 -30 -22 16 1 58 -21 2 15 -79 10 -92 46 39 8 82 -130 -27 -50
7303 -50 24 17 55 60 -3 -33 -110 102 -104 -59 -98 3 64 -117 -14 51 -177 8 -30 -19 -120 -94 -114 39 -34 -39 3
7330 3 17 59 -74 51 -16 31 -18 1 -62 62 51 -62 -48 -42 -44 16 -58 -8 -15 6 54 6 75 14 -58 -36 63 11 -47 48
7360 48 -136 -81 -1 25 86 -57 142 3 40 31 -51 -65 -144 34 38 32 -68 -116 136 5 5 -30 1 140 8 17 14 25
7388 25 105 33 -34 -25 -13 -71 -122 -11 4 12 84 -47 22 1 -29 -49 134 113 -90 -112 -35 -134 -36 22 51 79 -55 -130 -138
7417 -138 -37 16 -62 119 35 40 11 9 88 1 -50 132 -7 0 -46 134 -102 40 13 -77 -62 -35 -58 -17 35 36 -129 35
7445 35 -27 48 85 -18 -14 -17 23 111 76 107 26 -40 39 0 43 -33 -18 45 10 -71 -18 72 15 -77 55 16 -46 52 180 -57
7475 -57 -46 -40 22 -1 -3 39 -47 -45 24 -9 33 -9 -17 -3 72 -2 -79 39 106 -118 2 42 65 -4 -8 45 70 -57 -79 -82 -75 31
7507 31 1 81 -73 66 -122 -41 27 39 -37 15 26 -41 -1 10 53 119 -38 20 -32 167 -104 7 76 -104 -23 27
7533 27 -3 -40 3 -45 30 30 -25 -102 5 -48 33 -24 -12 -32 4 -58 -92 7 -59 -11 -39 -37 -80 -17 44 45 -60 82 46 63
7563 63 -22 108 105 64 123 -67 -25 51 -104 -79 32 -2 103 -14 73 1 48 -57 -48 -52 -57 -83 33 -49 13 55 -32 -39 -30
7592 -30 11 -54 -34 18 -14 2 46 -1 3 48 7 103 -15 12 33 19 74 47 -172 -34 -71 -139 -33 68 36 -71 90
7619 90 134 -57 -6 95 -29 -34 -25 -28 16 123 41 -30 -68 50 -7 -28 -16 2 -4 -4 41 -66 28 44 -18 -26 38 -89 38
7648 38 -33 -16 -63 87 -41 -46 -29 -4 -159 3 -39 -69 -63 -27 -32 -9 89 -41 -8 -57 82 39 -68 -15 178 94 -150
7675 -150 -117 -34 -19 7 53 -63 27 116 -57 102 -31 -76 -46 -116 14 106 57 -59 1 -29 -150 -10 7 -17 -16 3
7701 3 -3 -65 43 -25 -73 -127 -12 9 -44 -42 -7 59 11 11 26 8 -56 129 43 82 31 -1 24 -57 44 -4 -5 -15 46 32 16
7732 16 23 14 41 56 -29 -70 -27 -25 55 -3 -92 5 45 19 40 28 -157 -26 0 39 -56 100 -11 -21 -56 45 31 36 1 -6
7762 -6 -44 10 -137 27 -5 -67 -7 74 -61 5 -5 -66 -7 50 -19 -47 21 -82 90 97 17 132 -57 7 85 -19 80
7789 80 17 -118 32 25 -100 113 93 145 151 15 -3 6 59 12 -142 -5 94 -87 -79 4 -74 -134 -29 81 7 -44 59
7816 59 19 -72 -138 67 44 -6 13 2 2 -97 23 25 -127 -13 -7 15 30 46 -2 28 -20 25 26 -94 -31 -34 -46 35 -60 -47
7846 -47 82 -2 -7 -14 28 15 109 47 6 -9 3 -12 -27 24 12 -95 -19 -15 65 164 -7 68 97 -95 -36 10 71 -63 -6
7875 -6 -68 -20 19 69 -96 97 20 -162 -171 -102 80 -80 55 -5 -1 -33 -46 73 70 -44 38 -69 -21 -7 73 -77 -58
7902 -58 14 -74 52 -38 -32 66 28 -6 11 79 93 -4 -41 -36 73 64 65 21 -112 -106 60 -76 39 175 42 37 -77 -77 -53
7931 -53 27 85 -55 -66 -39 -82 33 -78 52 -125 6 21 73 -67 92 47 -68 -5 102 93 64 56 29 114 -92 -124
7957 -124 -2 2 41 -1 4 27 87 -32 15 14 32 147 44 -17 -5 38 -29 -66 -29 -132 49 121 -13 33 -122 28 13
7984 13 62 -59 -127 17 -86 11 -9 -7 112 53 3 -5 -54 84 37 -110 17 138 52 -57 -32 -11 -47 -83 -68 115
8010 115 57 -32 64 -12 -50 -40 -27 58 -21 -71 6 78 2 -37 -5 -3 -60 -97 -54 -24 36 -15 -102 -29 -7 79 34 48 48 1 45
8041 45 -7 21 88 10 -42 -38 -5 15 -118 19 -9 -30 -2 56 -59 -139 -7 -93 0 106 58 7 20 -11 46 70 112 34
8069 34 40 16 69 69 40 53 -13 125 -110 49 -67 -22 14 85 31 -17 85 -42 80 166 142 -47 -80 -120 -7 75 -65
8096 -65 -70 -159 126 -13 53 -28 36 -66 -112 -20 -62 -9 25 59 -63 -28 27 -42 -86 -115 19 -58 26 13 7 47 -16 125
8124 125 -31 42 -29 -7 27 113 25 -2 48 -82 109 -42 -57 33 -101 -63 -79 -40 -92 22 26 -25 31 -62 -69 45 57
8151 57 -44 13 -164 -64 -75 -51 -115 -91 -65 -70 -67 133 9 -80 10 -116 48 68 -54 22 15 -10 -146 101 -86 -10
8177 -10 -27 150 20 106 -20 53 10 -17 -44 100 92 32 -50 30
8191C0
$$ Imaginary data points
##PAGE= N=2
##DATA TABLE= (X++(I..I)), XYDATA
0 0 0 0 0 0 0 0 0 0 0 0 0 0 0 0 0 8 -8 8 -8 8 -16 16 -16 24 -24 32 -33 40 -48 56 -64 72 -80 89 -104 116 -129
37 -129 145 -161 182 -201 225 -249 277 -305 337 -373 410 -453 497 -550 606 -666 734 -812 899
56 899 -997 1113 -1245 1400 -1592 1822 -2114 2496 -3020 3782 -5005 7272 -12909 59328 53706
71 53706 -50299 30727 31220 -43811 -31946 14367 -29725 -31931 7173 -9343 -31323 13245 14962
84 14962 -14683 10235 27124 -9492 824 25301 631 -5950 19453 8957 -4350 1955 -3845
97 -3845 -10655 -807 -7557 -20722 -9598 -301 -13633 -9543 6432 894 4109 20565 9564 4767
111 4767 22999 9907 -10726 6286 7529 -17857 -11820 4712 -12414 -20694 967 1607 -12969
124 -12969 1664 12771 -1772 2080 14135 422 -3500 11158 5925 -4534 3784 6966 -3737
137 -3737 -5898 58 -3137 -8350 -4158 -2798 -6642 -3542 62 -110 2772 4903 5869 7955 5750 3330
153 3330 3355 229 -1834 -1101 -4377 -6282 -3464 -2859 -5366 -3556 2085 1550 -1893 3022 4943 -638
169 -638 1296 5211 -61 -252 4338 1479 -2271 46 1353 -2500 -3983 -670 -1645 -4726 -1368 26
185 26 -2804 306 3706 1612 1796 4542 3794 1392 274 1274 -200 -3392 -2140 -1521 -3648 -2434
201 -2434 -651 -1558 -773 1296 1766 701 658 2785 2106 -571 1167 2103 -584 -325 1001 -510 -1186
218 -1186 -648 -763 -2045 -2178 -586 -1170 -2204 440 1453 -201 1904 3212 1197 1431 2802 858
234 858 -975 -316 321 -2066 -3174 -604 -590 -2591 -553 713 -560 523 1509 312 560 1397 1153
251 1153 34 396 1573 292 -582 669 61 -1223 -669 -1014 -1710 -1078 -1040 -1005 -465 -131 752 915 913 1847
271 1847 1714 837 1111 537 -280 -500 -646 -684 -1305 -1248 -32 -410 -1152 282 495 -438 64 503 104 268
291 268 451 426 290 610 1161 39 -226 887 -36 -1229 -376 -464 -1308 -979 -552 -500 -178 311 722 501
311 501 624 1394 408 56 846 192 -584 -46 -125 -602 -407 -59 -28 -397 -267 426 -398 -590 240 -85 -316
332 -316 98 251 270 620 465 577 384 360 391 -371 -601 8 -527 -899 -236 -171 -279 -100 111 319 293 201
354 201 474 -5 34 536 -178 -341 362 97 -175 -4 165 39 -108 -95 28 -473 -384 282 -286 -320 224 254
376 254 73 254 429 338 218 132 188 -178 -195 30 -426 -343 77 -114 -310 62 33 60 -75 -66 160 25 44 167
400 167 -27 45 331 85 -35 139 113 -92 -189 -120 6 -290 -347 107 -194 -57 272 -80 -70 246 227 36 -122
423 -122 65 184 -221 -77 33 -216 -17 132 -124 20 239 -33 -38 71 96 -80 -156 39 144 -93 64 223
445 223 -69 82 51 -37 -57 -128 -57 15 -144 48 67 -62 148 260 -16 101 149 -83 -86 -35 16 -47 -124 18 208
470 208 -190 -50 259 48 77 109 -8 20 75 135 -37 -4 205 82 -149 89 39 -244 -128 -46 -61 -42 -68 48
494 48 80 117 162 119 -42 101 134 -139 35 -189 -44 118 13 -178 -25 44 15 32 -91 109 187 14 -46 102
518 102 39 -29 70 133 54 114 85 -73 -127 -8 -41 -286 -139 -21 -182 -57 -26 32 132 129 -16 96 67 259 123
543 123 -98 127 8 -88 -29 -23 -122 -85 -102 22 -8 -110 71 40 -93 23 174 140 122 159 94 172 -30 18 -47 -128
569 -128 23 -228 -100 -41 -3 -123 -36 22 102 105 124 72 51 100 14 93 -82 76 -39 -145 85 55 -29 43 -83 -228
595 -228 146 -77 -14 -13 -65 65 -10 20 170 77 -64 92 107 3 53 -69 -42 -57 13 -113 -74 -123 7 135 -31
620 -31 -15 15 -84 -107 6 100 51 -58 11 -107 -6 -5 -68 -61 -48 -39 -33 -83 9 -30 27 -5 74 -94 -16 -28 -64 -75 60 -22
650 -22 -46 74 -101 -1 -183 -45 170 -12 -120 8 -11 -84 11 -33 36 129 89 66 30 -90 29 29 81 89 -85 -6
676 -6 87 53 39 -55 42 -39 27 -16 63 27 -83 18 -34 -17 39 -74 -16 22 27 -95 -40 24 47 -12 65 -68 -89 132 7
705 7 10 33 57 -41 34 -15 38 26 23 -83 -45 -12 79 85 8 -116 -63 29 -4 36 124 202 -51 67 43 -74 -25 29 -80 39
735 39 -6 -64 -34 54 63 7 -63 32 -52 1 167 -22 -97 -117 -58 -119 89 60 -39 -130 -27 3 54 -25 79 12 -140 44
763 44 -23 1 -7 121 -80 43 13 -74 32 92 15 -14 -78 -10 -72 53 21 82 -126 14 -10 0 7 -100 38 -107 -93
790 -93 30 98 27 81 -54 5 -2 -165 -72 56 16 70 170 8 -12 27 -34 32 -24 -60 107 70 -104 2 -26 -2 -32
817 -32 17 20 -90 7 15 69 -13 -30 0 -81 64 57 -74 -55 35 -33 27 32 -40 4 -72 -5 -31 -15 102 -83 -11 -37 -8 24
847 24 28 -8 53 40 -81 -54 23 -40 -33 -61 1 -2 -8 57 6 -11 -29 61 69 47 82 -49 141 19 -12 -84 -45 -24 -47 -35 -46
878 -46 -43 150 -72 27 26 -34 -89 52 19 47 15 -95 5 147 16 6 71 -100 -25 5 -31 -79 32 -51 38 -144 13
905 13 -122 -62 38 132 -72 -41 4 -50 -15 -40 -90 68 -40 80 -74 -26 -13 -78 -82 -5 33 80 -3 38 19 40 -21 129
933 129 -22 -32 -4 134 -32 46 -16 20 -81 -43 -5 60 26 87 -106 36 65 -58 -3 -96 57 -128 -59 -29 -105 -6
959 -6 10 -48 19 -125 0 -50 -86 -114 29 -126 153 83 28 25 -37 26 29 -25 49 53 -128 12 -15 -31 65 -15 76 4 -26
988 -26 11 109 24 13 82 14 -42 99 -38 -45 -22 18 63 63 6 76 90 -97 -3 32 -40 -35 -26 -101 4 89 -8 -46 -77 -15 25
1019 25 44 -123 -42 147 6 -20 -38 22 -168 -18 83 33 -16 -12 -26 29 -74 -28 36 -109 -41 12 62 -22 -43 -92 74
1046 74 19 -23 -102 12 35 -75 -12 -72 20 -41 -59 34 15 -42 11 73 32 5 92 21 65 51 21 14 -5 -42 60 -38 -30 3
1076 3 -31 -85 28 50 -44 -52 72 -4 -31 -105 -16 140 30 59 -7 40 -99 -60 -14 -4 44 55 49 -87 65 105 -38 -37
1104 -37 -38 129 74 -48 117 27 115 48 42 -156 -86 203 -14 44 -55 -58 29 -83 -35 42 -78 81 -55 -19 64 -6 30
1131 30 -4 4 -13 39 -47 -58 -36 105 -16 23 -40 -9 12 40 67 99 -24 22 76 -73 67 -26 -88 29 37 21 82 -8
1159 -8 5 -15 -48 -54 -28 -111 58 -28 -48 -32 3 2 14 35 8 -100 72 49 62 -38 -100 61 75 148 8 -45 -76 10 88
1188 88 -17 -80 25 -3 54 9 -12 7 45 12 14 -58 0 -79 -29 -5 25 -61 -66 37 18 82 -59 112 69 142 -29 6
1216 6 -77 -54 -50 -14 -43 15 -13 37 -32 111 -3 75 -156 -65 -44 -27 -59 36 44 -57 91 6 -41 -23 39 -66 -5 -100 48
1245 48 14 127 21 -71 -89 -116 14 -58 -72 66 63 -40 -85 -46 -65 15 50 34 58 -36 44 112 -39 -44 62 -4 60 71
1273 71 2 15 51 30 -31 -70 -139 18 43 28 19 -29 128 49 7 8 12 49 53 40 -30 10 -1 8 -109 62 52 30 -24 -47 2
1304 2 45 47 247 92 -3 79 -16 0 28 -41 3 23 84 -120 -49 -133 -21 -31 24 28 -64 -21 78 29 -19 43 -1 5 -35 108
1334 108 -17 -56 -6 65 -15 -31 8 -47 -54 -19 -18 110 0 129 61 1 -23 28 16 29 27 72 64 -68 -91 96 51 115 35
1363 35 38 -48 0 -80 136 -3 13 47 52 69 47 -25 45 80 -68 -102 12 -11 132 -55 4 77 -193 30 47 17 -92
1390 -92 143 26 31 -25 -63 -12 -1 -61 68 54 -84 87 38 -34 36 50 10 20 -27 44 22 32 83 -37 0 -25 -56 161
1418 161 -41 45 -7 1 55 -79 -1 -59 51 -63 66 -15 -14 78 -53 -12 -132 -32 13 38 -43 58 24 24 15 -23 14
1445 14 54 89 -26 176 -50 -99 -103 36 -13 112 -24 39 -30 43 -103 -40 -97 67 28 59 -37 71 -87 33 1
1470 1 119 16 50 31 8 152 20 1 -39 -49 -52 50 -20 14 -5 -107 30 47 11 10 -89 -7 5 52 2 -67 46 -19
1498 -19 69 46 -6 75 68 84 -24 -22 24 -37 57 162 -88 -2 -43 -69 -79 11 -50 58 -59 6 26 45 106 17 78 -31
1526 -31 -62 -35 81 -22 0 19 -39 55 -66 94 -47 53 124 -13 -21 -130 15 -65 57 92 -6 169 127 -59 -28
1551 -28 -11 -40 -29 23 57 15 69 9 -3 4 41 63 32 -50 8 -111 -36 -17 -51 -44 -7 -25 -58 -51 -39 -104 -27 171 -47 -34
1581 -34 49 62 35 -28 -1 -64 -9 -44 -86 44 82 -17 -38 -80 -24 -139 4 -72 -53 45 -31 -62 -24 78 65 15 -27 38
1609 38 -98 -111 -16 27 -49 -47 46 -53 -111 -121 -7 -35 28 48 -54 -12 -42 57 -58 59 49 120 54 -147 -33 39 66
1636 66 -48 -6 54 -87 57 49 -87 16 -59 71 -44 18 -94 -113 -150 -7 -54 -27 -81 -47 12 26 0 -40 22 -38
1662 -38 30 -59 16 -8 -89 44 39 -64 89 14 21 38 -119 76 35 68 25 -5 87 96 46 65 22 40 -8 -53 36 -39 37
1691 37 -46 -8 -6 -10 -70 -1 -106 -15 -18 -6 44 -61 37 -68 -55 44 -147 191 16 -24 10 -5 -106 -18 -5 -11 35 2 17
1720 17 107 11 -27 -116 13 -98 -65 -44 11 27 -36 78 -49 -12 80 -211 -7 18 1 88 56 -68 53 -87 81
1745 81 34 74 29 -40 -5 -42 -4 -44 103 -35 -6 -71 25 -44 71 -127 19 -51 20 91 94 61 -46 -128 -17 -6 -50
1772 -50 -33 4 -123 8 31 -1 -26 -18 -75 -16 48 7 -74 -62 6 74 4 -11 -31 51 140 132 33 -14 10 -43 123 60 95 41
1802 41 29 -42 80 112 -2 -52 -15 87 -48 -101 -36 9 17 13 57 -54 -6 32 119 94 31 -32 131 4 126 -29 -60
1829 -60 -44 -77 -75 -47 87 26 102 -41 -15 64 41 -15 85 54 17 -34 -73 -33 46 119 83 -63 -119 -69 -16 28 79 -51
1857 -51 -97 -74 16 -83 59 -37 7 -21 55 78 33 -30 -68 -56 51 -51 8 -28 -42 109 8 -17 12 182 -3 -57 106
1884 106 -34 -32 -5 20 -2 72 44 40 36 -4 1 -46 42 111 -73 -21 -11 50 7 -30 -27 -84 -18 -43 10 51 -6 13 -119 64
1914 64 -19 106 40 9 -167 113 -128 144 49 4 -37 -8 -1 -14 8 16 90 -68 70 38 -57 5 28 -95 128 44 128
1941 128 33 -9 -16 -39 24 78 -133 5 15 18 -84 -24 65 23 -60 16 -34 37 -88 -31 4 -68 -18 33 -24 -66 -7 -15 105
1970 105 -116 18 -6 81 -75 5 10 12 37 52 -46 -42 66 49 -75 70 -81 -66 2 -28 -87 -1 -38 -134 67 -7 56
1997 56 36 -131 8 -17 -30 21 28 -7 -14 -26 44 38 -3 -33 16 -50 76 -70 85 -47 107 127 -16 -2 -36 -51 18 10
2025 10 -14 51 47 -2 -68 75 -136 -13 -1 -36 94 25 -2 -38 -126 -8 -22 79 48 29 6 76 59 -16 27 36 18 -26
2053 -26 19 -6 -129 16 -24 159 -50 9 0 14 50 -71 18 -33 -19 -24 59 42 -35 3 81 48 79 -2 66 53 -132 120
2081 120 -9 20 48 -120 39 20 -4 -52 27 -46 64 7 -51 51 -116 -123 18 112 -55 -97 15 8 -57 81 83 -15
2107 -15 -202 -75 33 -26 2 3 14 -45 27 -29 -115 -51 61 -94 -118 -25 -32 -60 48 83 -52 48 49 18 -12 -95 -70 39
2135 39 10 -46 -31 4 -15 -87 -67 30 -23 45 -147 -22 18 -9 -56 36 37 -6 84 -48 25 49 -13 -90 -2 68 -94 12
2163 12 -96 -194 14 -26 67 54 58 71 -77 15 54 -122 85 64 17 48 -35 -10 32 74 -4 -124 -68 36 46 -87 -87
2190 -87 -18 -118 99 -3 -10 -44 -26 18 88 65 88 45 129 21 24 57 17 30 -2 -69 37 -92 66 111 -16 77 62
2217 62 111 -156 -40 -77 77 120 -83 41 -12 101 11 -27 -15 36 -79 29 22 -31 84 -1 -28 46 -23 34 39 -5 65
2244 65 -23 55 -1 82 -30 110 11 -16 52 -8 -25 108 82 -30 2 1 -48 31 -60 54 -33 -71 -41 76 -39 23 16 -17
2272 -17 39 -34 71 -207 -34 -8 31 -3 79 -66 -94 -23 66 48 -12 -51 10 -78 6 -12 93 84 -6 -80 -53 5 129 -97
2300 -97 -99 18 13 -13 -22 -43 -15 26 -86 76 76 -47 34 45 38 51 -18 -35 47 6 -104 -29 -81 62 57 13 -97 63 125
2329 125 20 3 36 30 17 8 -47 -27 -21 -5 -7 25 -75 29 76 44 -33 115 102 98 -33 39 102 -9 -100 72 -62 69
2357 69 -26 7 -46 -46 33 -86 33 -104 62 -78 78 27 -20 -61 61 -45 3 -53 20 0 39 2 -15 -39 -65 -40 35
2384 35 44 80 95 -80 -16 63 -12 33 35 46 -112 -6 -7 -27 -106 138 5 -48 5 19 -10 2 59 -108 74 -22 22 -16
2412 -16 44 4 102 -48 -30 -40 -43 -38 -5 21 3 55 -17 28 31 -35 -37 -121 -58 24 85 -34 3 59 52 20 -67 28 -38 -80 -2 -75
2444 -75 116 -61 60 -18 122 -67 -57 -74 23 -17 28 74 -12 -49 -59 88 11 2 -59 150 88 9 134 -40 -2 53
2470 53 32 -96 64 5 40 132 -28 35 95 -103 53 -38 6 -4 146 58 86 48 -217 -52 -25 7 -59 31 -6 26
2496 26 54 -40 -101 -40 23 -11 -77 -18 16 35 152 -74 137 -47 117 95 -46 -25 -11 131 29 -63 -4 -82 -18 71
2522 71 23 71 -39 -18 -38 6 -60 22 164 63 -64 -4 -22 59 119 107 28 -70 62 -42 24 14 -35 45 118 101 -36
2549 -36 50 2 27 -167 -26 21 50 104 79 -82 34 -25 -24 57 -47 -24 -45 72 -126 -59 24 83 38 -30 -35 4 106
2576 106 3 75 24 65 76 -49 96 68 46 11 -2 -53 66 -43 -46 17 108 -42 -1 -40 67 -10 -28 57 -7 48 -37
2603 -37 -38 -53 -8 -15 20 39 20 42 22 68 -92 -38 17 -95 -19 61 -52 -18 55 -34 24 89 39 -102 70 -52 93 -2
2631 -2 -44 -51 47 -53 -14 -29 2 125 -37 -9 -15 -19 -26 -14 -94 -137 -4 -32 -67 6 -54 -79 43 -12 -11 7 31 -117 75 94
2661 94 -84 137 -47 9 11 -34 -1 32 -37 -12 19 -19 60 -7 2 90 -112 -86 57 10 -11 -3 -79 79 87 -7 -28 -85 -35
2690 -35 17 -101 -70 52 -38 16 -37 3 -82 34 -93 -97 31 65 27 83 -46 -38 -18 107 -80 52 2 -90 25 101
2716 101 1 14 25 -59 16 -52 -30 -32 -32 -130 29 -59 -54 -1 85 41 -74 11 101 23 7 3 -135 -154 -10 30 -49 12 22
2745 22 40 51 4 -70 -38 30 -171 -54 -4 -28 54 -32 28 1 -21 -87 -38 26 90 40 42 -21 79 -29 -5 48 -13 -118
2773 -118 24 -14 16 88 86 18 43 -6 132 -51 -38 154 -26 68 -58 -46 -66 1 10 23 82 43 25 80 13 85 -3 -14
2801 -14 -17 -82 -89 80 -64 -94 -66 -44 88 31 -54 -91 58 122 23 15 -11 -72 34 105 14 -6 38 -4 34 -52 -120 -6 17
2830 17 79 40 -23 22 17 71 -31 38 -6 51 9 3 49 118 42 27 -16 -82 16 -129 -8 2 -55 -26 2 -74 -62 40 63
2859 63 33 -102 -84 -127 75 -102 -70 30 51 25 -80 49 90 15 -16 -45 30 -59 26 34 115 57 82 14 -60 -16 46 -8
2887 -8 -18 60 62 -86 -33 -34 -6 66 -69 -12 -43 60 106 -89 -9 87 -17 18 0 2 142 4 20 -48 25 31 18 -84 47
2916 47 6 41 -107 -71 31 -32 0 -57 -44 85 58 -32 -112 75 -3 72 -95 -13 -11 38 -118 -82 -90 41 69 -7 -27 -69
2944 -69 -14 -165 2 19 50 85 -73 93 -46 -16 36 19 52 -55 -28 39 -32 158 60 54 23 -28 116 -55 -3 7
2970 7 -14 -22 -23 -78 6 -111 -37 -135 104 -75 4 60 132 -82 10 -17 -70 -56 30 -67 9 -77 -40 6 -71 -74 -46 6 -59 -37
3000 -37 -35 153 -87 -41 17 -19 -64 -5 -107 -105 87 6 33 -93 -113 135 -81 -17 15 81 1 3 34 -78 2 21 -51 -119
3028 -119 -108 -56 29 3 -25 -47 42 75 -38 -44 -68 56 90 1 -31 -35 -59 -24 43 2 -50 46 -98 -50 54 48 -147 13
3056 13 -22 -126 6 -71 -73 95 -92 -91 -41 -32 -2 23 -43 126 19 -6 22 -49 -56 57 155 162 97 65 37 -96 30 18
3084 18 64 -44 -2 -56 -67 -30 -87 -21 10 4 -82 -23 51 -67 -5 -94 -70 12 15 -26 3 -62 33 -7 -65 -47 -123 -43 3 -32
3114 -32 70 -57 16 45 46 -86 -29 12 -56 4 43 -2 -100 -24 -56 -106 27 50 10 94 22 129 48 130 -9 32 75 -6
3142 -6 18 48 -16 93 -27 -16 35 31 122 -15 95 -43 -193 -5 93 82 81 -64 20 -60 9 -120 -41 -53 -33 42 -37
3169 -37 -70 144 100 -88 72 109 -36 -32 99 101 -37 -66 18 -122 43 -64 39 47 -5 -22 -37 -63 -25 -14 -61 77
3195 77 -54 -3 77 -9 11 97 -20 -52 -65 -52 -19 10 107 -83 -97 84 26 51 72 43 142 54 10 -29 21 13 -51 -119 -28
3224 -28 -38 -53 -41 66 -39 -56 99 -57 -12 56 -2 39 -9 -37 87 -2 -9 84 55 56 52 14 54 92 -21 27 137 -22
3252 -22 -70 2 148 57 57 -52 25 -166 32 -9 -30 -74 57 -90 -85 126 75 -15 21 87 -24 71 18 68 38 -85 60
3279 60 -58 19 -150 -54 151 -85 21 -34 63 -38 -56 57 -101 -3 -68 23 77 -66 12 -105 -94 -22 -30 17 51 -54
3305 -54 48 -42 31 21 -21 19 -56 26 172 -42 -16 -88 91 1 25 20 37 90 -19 18 102 -9 -69 65 -56 30 117
3332 117 10 57 19 -64 17 -45 -43 99 -94 46 32 -92 20 50 -85 18 -68 -65 97 -36 -7 -13 26 42 -10 99
3358 99 -38 -45 -13 -75 -12 -43 -28 89 24 -94 30 -12 31 29 -27 -37 -1 -48 -12 19 22 -41 21 67 5 -54 74 -41 26
3387 26 -36 -11 -36 20 -47 -82 24 47 52 -4 3 91 19 15 91 -14 -6 -37 42 29 25 58 3 -91 -21 -54 47 118 -45 -31 8
3418 8 49 -61 -6 53 96 -25 -73 124 -48 -55 87 -63 -6 74 -15 -23 68 47 -8 97 36 -74 33 -56 98 -180
3444 -180 -8 -27 -14 -5 -13 92 23 59 -62 29 127 46 -46 101 55 4 88 -15 -29 43 -43 -74 -4 -6 -28 64 -112 96
3472 96 -42 -16 21 -70 50 -14 -92 -30 92 -21 44 15 99 -5 -16 45 -46 88 -7 22 -140 66 -7 72 42 -28
3498 -28 69 -23 88 21 -58 44 -105 90 89 6 -94 63 -31 46 -44 59 69 -116 62 -126 -40 -7 19 -22 -12 -3
3524 -3 6 -14 17 7 -11 72 44 3 67 -68 -37 -110 -7 -19 12 34 -86 -90 -124 -1 5 -16 10 5 7 -65 -13 32 83 -34 24
3555 24 110 -39 -63 -120 5 51 -19 -7 143 99 -57 -86 -55 0 -71 -66 110 -8 -102 -52 -43 -100 5 81 -46 6 31
3582 31 21 18 -69 52 1 53 10 -132 -27 -71 -56 -16 3 -1 107 -52 -79 -72 -70 50 46 -13 -44 27 -23 -13 -128 -18 26
3611 26 -132 -11 -45 31 4 -4 -122 -11 -42 120 -48 -51 -38 -21 67 42 91 38 -80 -11 -39 -80 -105 -2 -7 -30 43 61
3639 61 -79 8 16 -56 -43 46 32 23 54 -79 -25 -2 -32 70 -45 5 18 -15 42 85 -59 52 -80 -20 -40 -113 47
3666 47 42 -26 -12 -30 2 6 90 6 -61 -12 -47 -13 14 -31 32 40 57 10 -77 -6 -1 -24 46 -60 5 1 -113 17 20 10 75 51
3698 51 -19 -72 109 29 -9 -10 -16 -7 -47 44 37 -60 14 1 -43 -116 34 51 -100 -46 38 3 18 19 92 45 -1 72 5 140 -79
3729 -79 5 -84 -6 -8 24 34 -49 -37 -25 41 150 -64 -20 -9 100 -46 18 -10 47 33 -17 -63 -21 51 62 -97 -16 123
3757 123 47 -161 38 -69 25 -77 -99 9 13 -65 27 12 -38 -2 -128 25 -37 112 -71 -7 14 -24 -3 -72 12 130
3783 130 -34 -11 29 39 9 53 -122 -56 110 93 -9 -2 74 24 29 51 -23 43 -39 -102 64 11 47 15 -16 -12 -42 -24 90
3812 90 2 104 4 -97 -8 -86 -20 -42 -83 56 -128 50 101 -34 42 2 4 5 -23 -6 20 68 81 -46 -43 -48 90 92
3840 92 -13 17 5 94 -33 -44 -133 -61 -20 41 -59 -55 10 53 42 13 8 32 35 65 -56 35 6 -94 60 38 54 56 101
3869 101 2 93 -42 -17 -81 10 21 10 25 -26 -58 43 -52 -32 108 4 -104 50 -48 6 -48 -18 84 -71 -1 -7
3895 -7 -32 22 54 -23 45 -4 125 -13 -23 -11 -58 55 -56 -54 -92 11 25 -21 32 -48 -1 24 46 -46 52 2 -112 -38
3923 -38 56 79 -3 46 5 63 -45 -44 -27 -23 5 71 -11 95 29 -93 26 -71 93 -46 -49 -64 98 -33 -13 -38 -44 151
3951 151 -51 -51 -35 150 8 113 -1 -9 41 28 -89 -45 -76 39 45 19 -48 -38 8 -83 63 -79 144 -92 -50 -36
3977 -36 -76 8 32 -53 -61 -67 -59 -10 57 156 11 41 -28 -101 -21 25 18 -3 -23 -76 -35 -30 -7 110 75 -8 -45 -179 -64 83
4007 83 -32 25 30 38 -23 -87 25 -11 47 8 -33 -115 63 6 -61 -84 -35 55 9 -22 -46 40 14 -46 -78 91 -63 26 -41
4036 -41 91 58 -103 33 -22 18 -18 -51 61 12 6 102 -21 8 48 -70 -37 -119 66 -37 -53 -70 -71 -100 41 -15 -83
4063 -83 -84 74 122 -66 28 54 -44 -2 12 -73 -15 18 -81 -59 28 75 39 -14 89 59 35 25 89 -59 -61 50 -15 -13 53
4092 53 138 -66 -53 -48 -20 57 -33 -53 45 20 58 82 -44 -18 -43 -23 -58 57 -20 60 10 13 29 52 86 30 -57 -48 80 15
4122 15 -115 41 85 47 -5 15 53 -46 -49 -60 51 11 -23 12 -43 -34 -21 10 -40 -27 -11 -32 -87 64 16 24 39 -14 -56 50
4152 50 67 18 -44 116 -42 -80 44 -5 -34 72 -49 -70 58 -60 65 85 -23 -114 -67 -63 21 18 85 -11 -116 -15
4178 -15 -28 -24 -19 90 8 -31 -67 66 -48 6 -75 -51 -20 -42 -43 -116 31 18 73 -108 23 126 13 -32 -71 52 50 -33
4206 -33 41 -78 -18 -48 122 41 29 40 -32 -9 -21 -19 -2 -171 40 103 -65 67 -30 19 2 -20 -36 16 87 -40 -117
4233 -117 -14 123 -86 45 110 -17 10 15 -89 -1 43 2 70 25 29 38 82 -3 -28 24 -44 -1 -140 0 -7 -194 87
4260 87 -38 37 4 7 -56 -113 -77 -72 -98 81 59 -33 94 51 -74 26 -89 121 -31 -56 46 -130 -30 71 107
4285 107 26 16 29 15 -18 102 28 -57 50 46 -15 23 -88 -70 119 -109 -57 20 -14 39 43 38 12 2 29 136 64 14
4313 14 74 -57 -64 0 -9 -7 32 62 44 104 44 -42 -95 33 -54 55 -45 3 30 -49 -44 46 -47 -104 20 -60 -11 -14 -2 -7 83
4344 83 15 -11 55 -23 18 112 42 23 20 67 -20 38 31 -108 63 -40 -6 31 -58 42 -31 15 -14 23 149 2 18 101
4372 101 33 -59 102 -82 46 -74 -80 -109 -91 -1 3 -15 60 88 78 66 7 -55 -121 -69 7 -43 5 -108 72 -55 -53 -10
4400 -10 31 62 -126 202 63 28 -7 -12 -40 -35 9 45 48 -70 21 -94 -75 69 -100 11 9 56 24 15 -8 -9 51 85 101
4429 101 132 148 -27 -130 28 18 -105 -82 -9 -42 31 46 92 -42 61 49 77 15 -39 -10 -72 42 37 5 -7 -73 16
4456 16 -1 26 99 56 16 -84 60 15 -8 -144 39 15 34 -14 -71 -1 30 -40 52 58 -2 -65 -72 -37 -42 -3 -63 -93 77
4485 77 57 -61 87 -14 93 11 -26 4 -4 39 16 -4 -111 -29 -28 -36 -141 -14 -8 -23 -3 49 -20 23 -2 51 -56 -97
4513 -97 -14 -93 17 6 -46 -68 -106 -14 39 -56 -37 33 -88 24 -66 -47 -58 75 -6 15 34 -17 26 65 -27 -21 36 -149
4541 -149 -132 67 17 -33 111 7 20 6 75 5 -115 48 -3 -9 -65 -57 18 -53 -112 -114 63 27 -123 81 -39 67
4567 67 -88 2 -25 -119 41 -29 132 -36 15 9 -39 -32 3 -33 27 12 -72 -23 -60 -37 72 -77 -45 78 -22 -21 77 -45
4595 -45 -74 -44 52 -51 43 -58 27 -30 -28 43 -59 -13 -10 34 -50 21 -43 113 -51 67 -32 -49 33 -12 30 23 -109 69
4623 69 52 71 66 -122 -98 -37 67 -14 126 27 23 -42 -77 -36 28 0 -33 -55 41 157 -74 7 -43 -52 18 39 -57 -92 -17
4652 -17 -48 -146 66 -38 35 27 -26 30 -70 43 29 51 -79 133 116 -142 29 -23 -29 -11 -34 -52 75 -56 41 31
4678 31 -5 -52 -69 -34 37 -38 73 -48 66 -136 25 12 43 -52 24 53 -107 -3 -32 -15 -141 32 -2 75 29 -96
4704 -96 -18 -31 20 98 64 26 -6 35 -38 53 -110 -35 41 4 0 4 15 51 36 54 -77 -22 50 -19 60 3 57 45 18 27 66
4735 66 24 29 -84 35 83 36 8 -27 -85 -14 -12 -11 -74 8 94 -53 18 10 99 24 -13 -44 -19 41 -1 -78 108 -45 4 9
4765 9 28 -10 37 107 -42 6 20 -57 28 -100 106 8 -169 -103 46 60 -62 68 18 -14 85 -66 72 38 39 15 -54
4792 -54 -56 123 24 -38 -121 3 -12 57 81 -32 81 -39 24 83 -13 32 -50 94 53 -17 117 -122 -32 128 70 -30
4818 -30 57 -32 115 71 -2 59 22 -19 19 81 -32 1 14 9 -76 -50 -67 -146 -16 -61 -28 8 63 -29 -77 -25 -32 15 -2 -29
4848 -29 22 52 54 28 -61 -47 -6 -44 -40 -72 100 -103 27 -73 126 109 -17 36 -10 -9 58 -38 -70 -23 2 22 38 -51 -29
4877 -29 8 10 118 101 -25 86 32 -39 -50 64 -82 -31 52 -52 -26 -37 23 -15 22 -4 63 -16 35 -50 19 -32 83
4904 83 -97 58 92 109 23 -27 1 73 7 -76 -46 73 49 2 78 -18 49 -71 -18 -59 50 18 28 81 -18 -23 12 91
4932 91 -155 27 -13 -23 41 2 -36 34 16 -66 -106 40 -44 -2 -115 -42 56 83 50 -7 81 -50 42 -2 27 -168 7
4959 7 -4 41 33 94 75 -37 85 -136 -1 -132 60 -12 7 9 -72 -4 70 49 18 18 -7 -52 53 -35 9 -66 -14 65 -73
4988 -73 -109 -54 4 -99 -45 52 -57 -11 43 -131 63 -17 -55 -32 115 23 -96 -42 30 59 11 -103 -109 -2 -29 -2 -34
5015 -34 98 50 -106 8 91 -81 50 67 4 -137 -21 16 -45 -88 -25 71 64 36 19 -47 35 39 2 9 141 47 -49 26
5043 26 -70 25 131 57 32 -6 -122 -120 45 82 42 82 -30 15 13 49 4 -171 7 47 -18 -28 -82 -73 28 3 -34 12
5071 12 23 -5 -74 107 40 -19 39 81 -7 -83 -70 20 62 51 29 24 -65 -24 -42 34 -42 5 -79 33 -73 7 19 -2 -96
5100 -96 6 -16 27 54 -76 -31 -52 -126 -46 21 -59 82 25 27 -15 29 -36 -47 8 -51 -82 20 -76 -100 -118 -15 -10 -95 36
5129 36 45 -203 51 33 -34 -112 -2 10 -11 -84 -30 15 -25 -42 -63 -34 -47 84 -19 9 -45 18 22 -27 -7 25 52 79 4
5158 4 -65 2 -49 -141 -81 82 14 111 24 87 -55 4 -2 -45 -11 -57 -6 19 97 14 -71 50 13 -111 -72 41 -96 19
5186 19 8 123 69 -57 -74 -57 1 66 -65 77 -83 19 92 1 -70 8 2 -119 87 8 48 36 -64 -23 -60 -1
5212 -1 6 -30 74 12 46 -59 0 29 -105 -39 -11 -55 -19 -6 -67 -25 -64 34 -68 -47 -33 -22 -45 95 -40 14 34 25 -39
5241 -39 96 -4 76 -39 -141 21 83 -133 -31 41 -118 -8 31 -31 -14 -16 -10 -90 4 -116 82 -84 -20 -54 -71
5266 -71 -32 -52 -36 9 32 58 17 -6 51 -24 -35 -11 22 -99 -102 -13 -16 22 -9 62 109 48 30 57 -74 -86 82 -99 44
5295 44 -43 -53 7 -23 54 -23 48 -100 -34 -86 -29 29 85 15 -10 -19 -118 -58 -118 -40 64 81 6 28 18 7 69 15 48 11
5325 11 -1 19 -86 -83 -10 58 19 -83 127 -32 20 6 11 57 17 -73 -42 111 -39 -58 -20 -64 48 -13 -5 -16 -34 127
5353 127 -80 -128 65 11 55 186 -137 -3 -12 5 13 -96 -53 -51 90 -13 -68 25 62 8 4 -71 -34 89 -46 -3 178
5380 178 -4 16 -18 1 -17 -76 -31 -10 53 63 -35 1 -26 -41 33 24 92 23 49 -43 81 119 39 -56 -19 -69 -21 -77 13
5409 13 35 -86 85 84 -8 20 -43 -65 23 38 -16 39 98 103 93 -67 7 -92 -17 21 18 40 23 -18 53 -30 -28 10 110 -26
5439 -26 9 -36 -47 -84 -28 -29 -134 79 -19 57 26 -58 11 -34 -9 -19 42 -39 -9 25 -16 -19 -58 -72 -63 -22 39 23 102 -65
5469 -65 -18 84 22 18 1 61 34 -52 -53 38 76 -4 100 17 -117 52 10 54 7 -96 0 132 28 -52 120 -5 -36
5496 -36 25 51 58 -18 -121 54 1 -44 -95 -58 -115 54 43 56 -51 -83 96 49 24 48 -11 -141 -8 90 -33 -13 59
5523 59 -49 26 85 -46 126 -3 -19 -28 31 153 39 -40 -67 -5 51 69 -101 126 -41 -56 -68 -3 -15 -94 82 10
5549 10 78 6 132 -115 11 -62 -87 -12 14 13 93 63 62 -35 6 -55 -27 51 -11 63 34 0 117 -10 -51 64 2 13
5577 13 -14 80 6 47 84 -75 -40 -71 -7 15 16 -16 34 87 -27 -10 19 -94 -36 72 18 -60 48 -13 44 13 5 38 7
5606 7 2 16 86 12 -121 82 39 60 -81 -57 100 -53 61 64 -103 -42 82 50 -68 16 44 26 -17 -65 25 21 13 85
5634 85 13 8 59 -107 26 -7 41 44 30 -36 6 -103 2 -21 -55 108 -16 78 -28 165 8 28 20 73 27 -8 -58
5661 -58 -52 16 -109 42 2 -31 -25 -38 44 6 74 -18 106 -21 -46 23 71 96 -21 -61 -26 -43 145 4 -52 -86 -12 -29
5689 -29 -69 60 -59 60 -47 12 38 -4 48 93 -89 68 37 -73 -125 28 -46 134 44 -41 -5 -54 -33 -23 52 -38
5715 -38 -36 -1 26 -56 -62 -30 40 -155 -85 9 52 -4 112 89 78 24 28 -29 97 46 -61 19 38 35 -22 -20 68 40 -97 -148
5745 -148 -71 32 -58 51 -29 -39 0 -16 -77 -80 34 29 39 -43 -54 44 -39 45 33 1 53 -53 -74 53 -30 70 -14 32
5773 32 4 -23 16 72 101 52 69 -140 105 15 63 -70 -168 18 -62 20 30 81 -2 19 31 20 -47 12 2 -3 -42 18 -42
5802 -42 -33 -189 30 -68 -84 -123 22 108 17 63 -56 63 20 -101 81 -46 -86 65 -45 -24 70 -72 -36 24 -137
5827 -137 -5 23 -13 3 47 -22 35 -27 -17 -24 -6 11 84 -114 -59 18 -23 -6 -99 -25 -9 -95 41 20 -86 -33 -24 68 47
5856 47 42 62 -65 33 24 61 -51 -26 -82 -25 -41 33 52 -30 -25 26 78 -107 10 127 65 -29 51 -10 116 123 -107 33
5884 33 -72 -108 -16 -31 23 -73 9 9 -58 -24 -1 -27 145 -21 0 -75 -26 41 -31 13 -37 102 -61 -33 -50 -55 -27 61 40
5913 40 81 -3 -66 38 -19 -19 3 -64 -48 -30 9 3 135 62 -95 -34 -30 -29 -35 39 17 64 103 -21 48 35 19 -87 0 94
5943 94 -69 70 30 21 11 -32 27 60 -25 -83 -40 55 108 -49 -80 25 -1 -55 -38 57 -98 -125 121 111 -14 31 -74
5970 -74 28 -69 46 -23 -84 -78 -30 -90 -5 -15 -65 -38 -10 41 75 -5 9 -44 -125 -46 -80 -4 -104 -56 -131 19 -12 -13 -31
5999 -31 68 7 11 -73 -15 4 57 -55 -4 -38 -36 -48 6 -66 25 -4 -6 -41 -7 -3 39 83 34 -12 -63 -108 73 60 65 26 23 91
6031 91 -2 43 -51 33 21 28 18 54 -103 18 -47 -19 -25 73 6 -80 -52 17 27 -24 -153 32 -5 -96 74 89 -112 -4
6059 -4 98 -22 87 -61 -17 63 -2 -118 -62 -76 -88 67 7 -1 42 -72 -56 -53 -44 -43 -88 78 -63 24 -2 44 -41 -48 -31
6088 -31 -30 -49 -178 -13 29 2 -10 30 -62 24 0 -10 57 -116 -48 -80 -43 29 -1 -73 75 -40 -81 -10 -42 -95 -2 68
6116 68 -35 74 -26 45 -48 -66 -9 -11 97 97 -43 12 -4 91 -28 -124 54 -83 12 -100 66 56 -104 -36 -131 -70
6142 -70 87 -75 -10 -8 -60 27 9 -85 -52 -37 -63 -25 89 -36 -122 33 -46 54 -41 20 -40 -98 -32 -71 -19 -12 33 -49
6170 -49 -19 -135 38 52 -34 128 11 -33 7 63 27 -58 -86 17 75 9 -10 106 -37 -104 -2 11 69 38 2 -21
6196 -21 -69 101 29 36 -101 -67 19 30 -5 -6 20 -18 -95 -3 -17 -54 -47 68 35 18 -5 -93 -78 -90 34 36 -141 100 -25
6225 -25 28 -91 -43 -113 -133 -107 -124 90 73 27 -97 -65 2 -40 -13 -29 63 -15 53 -47 -17 92 -105 -62 53 -31 -59
6252 -59 44 29 69 84 27 34 21 14 -21 -139 35 41 133 -31 19 -31 16 35 -75 22 15 16 -10 -13 -82 5 58 -103 13 33
6282 33 31 -5 42 -16 60 -124 100 22 -3 8 -15 62 68 -88 1 -22 42 -41 18 -67 -10 -23 -37 52 102 -28 92 9 -52
6311 -52 9 99 -21 5 -25 -73 42 -84 32 -23 84 -15 -104 -11 -27 -3 -46 61 71 15 39 -44 68 49 57 -144 -54
6338 -54 -28 40 24 -86 -109 -40 -67 9 -56 26 37 -25 -80 6 30 56 -2 -30 -85 99 -59 -20 74 -78 11 92 57 -4
6366 -4 -44 6 -28 -93 -8 -78 -9 -87 16 -113 0 -44 -27 -33 20 43 68 1 -11 -41 25 -23 -22 -5 -34 -74 -16 41 -66 30
6396 30 38 0 -64 -8 -26 -21 29 27 -81 45 11 -58 -15 6 -37 12 32 45 -6 4 57 2 -150 80 -1 3 11 26 -46 -73 -146
6427 -146 114 35 42 139 -86 -28 65 7 7 7 -8 37 -41 70 29 -84 -5 -29 54 -31 -91 -22 -39 8 -13 -27 142 100 71
6456 71 -118 -2 8 70 -37 -41 -94 28 82 21 -18 -24 17 52 23 34 -48 -122 -57 32 71 23 -91 -50 38 6 54 120 45
6485 45 8 135 -87 3 -154 62 -3 -15 104 13 -46 4 53 4 -83 -59 -19 78 41 5 -8 -78 27 -78 137 170
6511 170 20 55 73 84 88 -69 7 26 -72 -5 -18 40 60 10 -99 -18 46 -65 -52 46 -109 38 -39 24 -7 -22 10
6538 10 -31 -122 -35 2 84 -69 129 76 30 -51 -21 26 48 85 -53 -1 83 92 155 71 72 -144 -6 -3 68 -11 135 -75
6566 -75 12 83 6 22 -41 74 -25 -154 -128 -9 -11 -25 -43 -12 -62 135 14 -25 -84 -26 -19 52 165 4 -72 -112 -78 -108
6594 -108 -14 117 -88 -17 -7 0 -13 108 126 21 24 27 30 -133 118 81 53 -61 -20 -33 -92 -55 -8 -98 26 75 43 -13
6622 -13 8 51 -4 116 -2 -5 -38 -33 18 70 -24 28 63 -43 -3 30 56 -10 110 11 -27 29 -115 11 90 97 -30 62
6650 62 -56 -100 -70 72 -23 -56 25 60 50 -4 -18 128 -1 50 -114 -12 21 7 20 -33 46 -30 41 40 -48 25 -58 2
6678 2 -1 3 -34 -11 67 -31 29 105 150 -18 71 40 -23 -84 13 -25 -121 -6 -12 59 27 -79 -72 2 -29 -12 -66 -27 41 -80 -39
6709 -39 -83 42 -27 -9 -47 -179 97 -1 56 31 -8 1 24 58 90 36 -69 40 19 -48 10 59 -74 33 -7 40 -23
6736 -23 56 33 142 32 -12 -17 -84 -64 -80 76 -5 -21 -5 -100 -23 -34 -105 -33 -18 10 -36 -124 81 2 11 17 84 -43 -22
6765 -22 -83 -21 75 -120 23 -70 -132 105 -89 11 44 25 -109 -15 34 -60 59 -2 62 -74 45 -10 83 88 5 8 -3
6792 -3 43 -120 31 16 -49 -19 -84 -48 83 39 -36 100 8 2 22 131 74 67 76 -26 -43 32 18 -9 -83 68 -91 -3
6820 -3 40 -38 -75 26 -13 -69 55 73 20 -10 -33 -37 -58 -63 -36 80 -12 38 -17 -30 37 122 -70 -70 73 80 -21 -14 14 6 -59
6851 -59 -76 12 31 32 -50 51 -63 -8 57 -68 -27 21 -80 -89 -89 -90 -124 -84 -31 -4 -13 86 15 45 50 -42 129 -11 119 -11
6881 -11 120 31 -2 97 124 15 8 40 38 -93 -24 30 -21 115 4 -90 -73 -44 -116 40 8 -22 75 26 27 -48 31 -17 5
6910 5 -118 70 92 3 -12 4 26 16 -91 114 -136 12 8 46 -33 17 -28 33 56 106 -67 -10 3 -43 -44 18 70 45
6938 45 79 -9 77 -5 -5 61 -13 -60 -34 12 -29 117 -90 116 -122 -154 71 15 51 8 -4 -64 -40 81 -71 64 28
6965 28 106 -45 50 60 -35 11 42 -97 -44 52 -15 67 56 135 -2 -14 -51 -18 19 -5 34 102 8 -28 -14 -56 109 -18
6993 -18 -67 73 -24 7 -9 -29 -7 -62 12 198 1 -86 9 -1 8 34 33 56 60 2 49 7 -29 -5 -3 -9 -71 -64 -11 -112 13
7024 13 93 28 21 -9 -49 -21 -81 -35 -167 20 -34 -3 44 16 -90 15 -33 29 -3 -45 52 -60 25 -84 20 -113 12
7051 12 56 -77 14 -24 29 46 -125 -4 38 -38 20 -4 -54 67 -73 103 61 -68 -42 -39 -17 -110 35 -6 -56 41 -2
7078 -2 13 131 26 66 28 24 -33 -24 -6 100 12 3 25 -5 69 -11 -128 84 -98 11 -76 19 -21 118 59 -3 -28 -75
7106 -75 14 -13 -19 25 -58 4 -16 87 -11 7 -17 -100 47 32 -2 -17 29 36 -71 26 -48 -99 -26 -82 6 71 119 -92 15
7135 15 104 -61 74 -43 65 22 -32 19 85 -4 -18 80 -65 20 2 -17 16 -43 3 88 -21 -36 27 21 -9 -8 -1 32 -100
7164 -100 28 51 18 -3 18 -5 -8 -36 10 52 24 59 -6 -86 80 3 51 28 94 51 -3 -58 23 122 32 41 5 42 -36 107
7194 107 -16 56 -161 22 -74 40 4 -29 -54 26 -25 64 -76 34 13 12 -84 4 5 -38 64 -38 -86 79 47 -50
7220 -50 -65 79 2 36 25 26 22 119 28 54 0 16 -25 -33 -1 -45 -43 60 -72 -23 47 30 -23 -47 -54 44 87 -59 3 30 -45
7251 -45 55 76 -52 39 -10 34 -29 49 6 21 70 9 3 25 23 26 39 -38 -11 19 -31 27 -20 -11 38 104 -4 7 34 -17 136
7282 136 29 56 -89 29 -23 -6 -66 -61 -1 -66 -26 82 -51 -37 55 19 52 23 -21 56 -50 -79 -24 10 -29 -11 -43
7309 -43 80 -24 150 26 132 87 -71 -58 -8 53 -17 -90 74 0 -65 116 -7 89 35 -1 -18 -30 -122 26 34 36
7335 36 59 -9 -53 -91 48 52 -60 -125 14 -4 -16 63 -30 183 -2 65 -39 -15 41 26 87 -51 -17 58 -8 -64 8
7362 8 0 70 22 44 0 -25 37 -38 30 61 -1 -9 -31 -2 16 -30 26 -2 15 37 -31 57 57 -15 24 85 -33 -65 -18 -35 -86 -5
7394 -5 -13 37 -20 -4 124 -69 -3 -22 88 36 -42 -67 -7 92 -163 34 87 -32 -92 16 110 32 15 -57 27 130 52
7421 52 -30 -79 -59 14 101 -149 90 38 -34 -4 10 -13 46 -53 -104 -71 86 -119 -57 86 -56 8 -15 -129 -38 -63 -40
7448 -40 -83 55 -24 -5 115 18 -50 19 56 -29 33 56 53 129 79 0 -44 17 77 36 26 29 47 52 13 9 -10 -53 45 -91 52
7479 52 3 -83 -11 33 -70 17 -74 9 -19 -143 -85 31 11 13 15 127 26 38 12 28 -126 105 64 37 -21 3 24 12
7507 12 20 -44 -36 -24 43 -5 102 -65 -32 -55 93 -19 -125 -1 59 -84 5 -65 14 -44 -90 -2 4 -10 -61 -73 31 -89
7535 -89 -49 -10 -9 30 -63 7 -84 -23 11 4 -54 104 19 0 -115 -35 -69 73 -40 -39 3 -78 3 -6 -32 1 52 -68 -94 2
7565 2 -18 -12 -60 -4 19 -7 -60 58 7 -15 -95 -71 -41 -70 -104 -127 72 -76 21 -14 26 80 -47 13 26 18 35 40 82 66
7595 66 60 -4 0 171 -73 -55 94 -88 15 -44 -77 27 82 -17 -10 16 7 -16 37 -12 68 -45 -11 -1 36 -55 -52 -172 43
7624 43 90 1 -132 35 86 29 33 -3 -26 -111 53 -24 -24 47 -42 -16 116 17 57 -25 -13 12 -27 139 -13 -48 -97 -80
7652 -80 -5 -77 57 27 -20 -34 -76 -36 54 73 -9 4 34 -28 -2 -118 -47 -93 11 34 90 31 47 18 -27 -65 -52 -51 75
7681 75 -33 -5 -10 -47 148 8 122 73 -61 -16 -15 2 -69 -29 14 -27 51 -71 98 62 18 -16 -30 26 48 98 -110
7708 -110 8 64 49 97 -18 75 3 -89 -49 -90 31 -16 -128 -13 -2 -40 -66 20 60 26 -160 -19 -16 -4 -31 -35 2
7735 2 108 29 57 -96 -58 41 -31 -80 -80 83 12 -96 -73 -17 -2 -26 -68 -23 94 -24 59 -5 -35 1 3 -3 -89 -33 19
7764 19 38 -38 -50 -62 -167 6 22 -56 120 -9 14 -73 -40 30 -151 54 -6 71 -76 52 -46 22 6 29 -64 24
7790 24 -3 -45 -9 14 -9 -55 14 -1 -10 -127 63 -52 -28 24 -57 14 100 -69 -45 64 37 -30 -3 -25 22 81 -150 49
7818 49 27 -124 50 93 -19 41 77 -64 34 14 -21 181 1 11 -27 46 38 41 -45 -40 -71 -24 164 3 -21 75 36 13
7846 13 37 -20 -18 20 -115 1 -110 74 59 22 -30 29 100 47 11 -18 -3 98 62 102 -10 -8 -64 37 -18 -37 58 55
7874 55 29 -54 -7 -26 -59 91 33 -30 37 23 13 95 -23 -11 30 -21 42 -96 -10 26 62 -49 -2 58 5 -88 36 38
7902 38 19 -88 55 -7 -29 -60 -95 3 -46 59 -84 -28 -130 25 -13 -38 60 11 45 -122 51 -3 -37 39 141 -13
7928 -13 98 -8 -124 70 6 87 -21 55 -3 53 -98 162 -22 -12 -1 -9 20 10 -97 123 0 58 62 2 -5 -108
7954 -108 1 -73 -3 -50 111 -53 -2 -75 -48 45 -29 26 2 -85 32 18 32 -48 -90 34 23 -23 -37 25 152 -46
7980 -46 -5 3 -44 18 56 34 16 4 -13 51 -75 -14 -14 -99 -17 -47 3 -125 13 -94 -56 50 -2 46 78 204 -127 -58
8008 -58 12 -49 -23 40 64 -5 -56 -19 22 99 -34 -64 75 -82 19 -14 -77 38 -12 87 1 -41 31 81 -22 101 8
8035 8 -43 100 -19 121 15 82 -12 80 -23 -43 -12 46 -64 56 50 -110 -90 -26 -65 -62 -32 106 29 -93 -7 -49 28
8062 28 87 -2 -194 -94 80 -105 48 19 41 -60 -96 -9 75 -11 162 106 -53 52 -59 18 -5 2 -55 -40 -40 -110
8088 -110 74 -111 -64 -74 6 -10 -70 -14 119 39 7 5 50 -3 -11 43 -7 43 43 -95 -18 -81 -72 -42 -43 82 77 -3 -28 -5
8118 -5 45 -67 -2 -46 -90 54 -71 -87 32 123 118 2 -81 20 -41 -12 -9 8 3 22 73 -28 -10 106 -98 53 -6
8145 -6 102 -85 22 -67 -32 -22 -44 51 -85 -82 -14 -12 69 96 -46 -17 83 -61 -56 -26 -135 -123 -20 36 -43 122 -33
8172 -33 -90 109 15 -82 69 73 -23 -110 43 -58 -57 -74 -16 146 -71 75 79 -15 -73
8191g3
##END NTUPLES=NMR FID
##END=
