##TITLE=1H_DE-80H_X3
 200.13MHz, d2o
 8 sc
 
 19ns.26.2.2025
##JCAMPDX= 6.0         $$ Bruker NMR JCAMP-DX V2.0
##DATA TYPE= NMR FID
##DATA CLASS= NTUPLES
##ORIGIN= UXNMR, Bruker Analytische Messtechnik GmbH
##OWNER= pz
$$ XWIN-NMR		Version 3.5
$$ Mon May 12 15:50:47 2025 Russian Standard Time (UT+4h)  Yarkov@DPX200
##.OBSERVE FREQUENCY= 200.1313
##.OBSERVE NUCLEUS= ^1H
##.DELAY= (6, 6)
##.ACQUISITION MODE= SIMULTANEOUS
##.ACQUISITION SCHEME= undefined
##.AVERAGES= 8
##.DIGITISER RES= 18
##SPECTROMETER/DATA SYSTEM= spect
##.PULSE SEQUENCE= zg30
##.SOLVENT NAME= CDCl3
##.SHIFT REFERENCE= (INTERNAL, CDCl3, 0, 14.3821)
##AUDIT TRAIL= $$ (NUMBER, WHEN, WHO, WHERE, WHAT)
$$ ##TITLE= Audit trail, XWIN-NMR		Version 3.5
$$ ##JCAMPDX= 5.01
$$ ##ORIGIN= Bruker BioSpin GmbH
$$ ##OWNER= Yarkov
$$ C:/Bruker/XWIN-NMR/data/yarkov2/nmr/H-C/1/audita.txt
$$ ##AUDIT TRAIL=  $$ (NUMBER, WHEN, WHO, WHERE, WHAT)
(   1,<2025-05-12 15:48:32.89 +0400>,<Yarkov>,<DPX200>,
      <created by zg, POWCHK disabled, PULCHK disabled
       configuration hash MD5:
       00 E9 B6 7A A2 85 ED C7 34 08 36 98 17 FE 4E 26
       data hash MD5: 16K
       2B 28 FF E2 44 DF CF D8 3C B5 F5 85 96 D2 56 07>)
$$ ##END=
$$ 
$$ hash MD5
$$ 73 B7 B0 0C 0F 4A 0A 72 6F BA 43 80 0B 94 F5 96
##$RELAX= 
##$RELAX= 
##$RELAX= 
##$RELAX= 
##$RELAX= 
##$RELAX= 
$$ Bruker specific parameters
$$ --------------------------
##$DU= <C:/Bruker/XWIN-NMR>
##$EXPNO= 1
##$NAME= <H-C>
##$PROCNO= 1
##$TYPE= <nmr>
##$USER= <yarkov2>
##$AMP= (0..31)
100 100 100 100 100 100 100 100 100 100 100 100 100 100 100 100 100 100 
100 100 100 100 100 100 100 100 100 100 100 100 100 100 
##$AQSEQ= 0
##$AQ_mod= 1
##$AUNM= <au_zg>
##$AUTOPOS= <>
##$BF1= 200.13
##$BF2= 200.13
##$BF3= 200.13
##$BF4= 200.13
##$BF5= 200.13
##$BF6= 200.13
##$BF7= 200.13
##$BF8= 200.13
##$BYTORDA= 1
##$CFDGTYP= 0
##$CFRGTYP= 5
##$CHEMSTR= <none>
##$CNST= (0..31)
1 1 145 1 1 1 1 1 1 1 1 1 1 1 1 1 1 1 1 1 1 1 1 1 1 1 1 1 1 1 1 1 
##$CPDPRG= <>
##$CPDPRG1= <>
##$CPDPRG2= <>
##$CPDPRG3= <>
##$CPDPRG4= <mlev>
##$CPDPRG5= <mlev>
##$CPDPRG6= <mlev>
##$CPDPRG7= <mlev>
##$CPDPRG8= <mlev>
##$CPDPRGB= <>
##$CPDPRGT= <>
##$D= (0..31)
0 0.7 0 0 0 0 0 0 0 0 0 0.03 0 0 0 0 0 0 0 0 0 0 0 0 0 0 0 0 0 0 0 0 
##$DATE= 1747050512
##$DBL= (0..7)
120 120 120 120 120 120 120 120 
##$DBP= (0..7)
150 150 150 150 150 150 150 150 
##$DBP07= 0
##$DBPNAM0= <>
##$DBPNAM1= <>
##$DBPNAM2= <>
##$DBPNAM3= <>
##$DBPNAM4= <>
##$DBPNAM5= <>
##$DBPNAM6= <>
##$DBPNAM7= <>
##$DBPOAL= (0..7)
0.5 0.5 0.5 0.5 0.5 0.5 0.5 0.5 
##$DBPOFFS= (0..7)
0 0 0 0 0 0 0 0 
##$DE= 6
##$DECBNUC= <off>
##$DECIM= 32
##$DECNUC= <off>
##$DECSTAT= 4
##$DIGMOD= 1
##$DIGTYP= 9
##$DL= (0..7)
0 120 120 120 120 120 120 120 
##$DP= (0..7)
150 150 150 150 150 150 150 150 
##$DP07= 0
##$DPNAME0= <>
##$DPNAME1= <>
##$DPNAME2= <>
##$DPNAME3= <>
##$DPNAME4= <>
##$DPNAME5= <>
##$DPNAME6= <>
##$DPNAME7= <>
##$DPOAL= (0..7)
0.5 0.5 0.5 0.5 0.5 0.5 0.5 0.5 
##$DPOFFS= (0..7)
0 0 0 0 0 0 0 0 
##$DQDMODE= 0
##$DR= 18
##$DS= 0
$$ [...]
##$SUBNAM2= <"">
##$SUBNAM3= <"">
##$SUBNAM4= <"">
##$SUBNAM5= <"">
##$SUBNAM6= <"">
##$SUBNAM7= <"">
##$SUBNAM8= <"">
##$SUBNAM9= <"">
##$SW= 18.0517328524113
##$SWIBOX= (0..15)
0 0 2 0 0 0 0 0 0 0 0 0 0 0 0 0 
##$SW_h= 3612.71676300578
##$TD= 16384
##$TD0= 1
##$TE= 0
##$TE2= 300
##$TE3= 300
##$TEG= 300
##$TL= (0..7)
0 120 120 120 120 120 120 120 
##$TP= (0..7)
150 150 150 150 150 150 150 150 
##$TP07= 0
##$TPNAME0= <>
##$TPNAME1= <>
##$TPNAME2= <>
##$TPNAME3= <>
##$TPNAME4= <>
##$TPNAME5= <>
##$TPNAME6= <>
##$TPNAME7= <>
##$TPOAL= (0..7)
0.5 0.5 0.5 0.5 0.5 0.5 0.5 0.5 
##$TPOFFS= (0..7)
0 0 0 0 0 0 0 0 
##$TUNHIN= 0
##$TUNHOUT= 0
##$TUNXOUT= 0
##$USERA1= <user>
##$USERA2= <user>
##$USERA3= <user>
##$USERA4= <user>
##$USERA5= <user>
##$V9= 5
##$VALIST= <valist>
##$VCLIST= <CCCCCCCCCCCCCCC>
##$VD= 0
##$VDLIST= <DDDDDDDDDDDDDDD>
##$VPLIST= <PPPPPPPPPPPPPPP>
##$VTLIST= <TTTTTTTTTTTTTTT>
##$WBST= 1024
##$WBSW= 4
##$XGAIN= (0..3)
0 0 0 0 
##$XL= 0
##$YL= 0
##$YMAX_a= 29431
##$YMIN_a= -28584
##$ZGOPTNS= <>
##$ZL1= 120
##$ZL2= 120
##$ZL3= 120
##$ZL4= 120
##$ABSF1= 10
##$ABSF2= 0
##$ABSG= 5
##$ABSL= 3
##$ALPHA= 0
##$AQORDER= 0
##$ASSFAC= 0
##$ASSFACI= 0
##$ASSFACX= 0
##$ASSWID= 0
##$AUNMP= <proc_1d>
##$AZFE= 0.1
##$AZFW= 0.1
##$BCFW= 1
##$BC_mod= 2
##$BYTORDP= 1
##$COROFFS= 0
##$CY= 83.5205535888672
##$DATMOD= 1
##$DC= 2
##$DFILT= <>
##$DTYPP= 0
##$F1P= 10.8118882576601
##$F2P= -7.23987719738617
##$FCOR= 0.5
##$FTSIZE= 0
##$FT_mod= 4
##$GAMMA= 1
##$GB= 0.15
##$INTBC= 1
##$INTSCL= 1
##$ISEN= 128
##$LB= 0.25
##$LEV0= 0
##$LPBIN= 0
##$MAXI= 10000
##$MC2= 0
##$MEAN= 0
##$ME_mod= 0
##$MI= 1.114404
##$NCOEF= 0
##$NC_proc= 0
##$NLEV= 6
##$NOISF1= 3.799351
##$NOISF2= 2.8
##$NSP= 1
##$NTH_PI= 0
##$NZP= 0
##$OFFSET= 14.38212
##$PC= 1
##$PHC0= -1349.006
##$PHC1= 13.13375
##$PH_mod= 1
##$PKNL= yes
##$PPARMOD= 0
##$PSCAL= 0
##$PSIGN= 0
##$REVERSE= no
##$SF= 200.129724274929
##$SI= 16384
##$SIGF1= 3
##$SIGF2= 2
##$SINO= 400
##$SIOLD= 16384
##$SREGLST= <1H.CDCl3>
##$SSB= 0
##$STSI= 0
##$STSR= 0
##$SW_p= 3205.1282051282
##$SYMM= 0
##$S_DEV= 0
##$TDeff= 0
##$TDoff= 0
##$TI= <>
##$TILT= no
##$TM1= 0
##$TM2= 0
##$TOPLEV= 0
##$USERP1= <user>
##$USERP2= <user>
##$USERP3= <user>
##$USERP4= <user>
##$USERP5= <user>
##$WDW= 1
##$XDIM= 8192
##$YMAX_p= 0
##$YMIN_p= 0
$$ End of Bruker specific parameters
$$ ---------------------------------
##NTUPLES= NMR FID
##VAR_NAME=  TIME,          FID/REAL,        FID/IMAG
##SYMBOL=    X,             R,               I
##VAR_TYPE=  INDEPENDENT,   DEPENDENT,       DEPENDENT
##VAR_FORM=  AFFN,          ASDF,            ASDF
##VAR_DIM=   8192,          8192,            8192
##UNITS=     SECONDS,       ARBITRARY UNITS, ARBITRARY UNITS
##FACTOR=    0.0002768,     1,               1
##FIRST=     0,             0,               0
##LAST=      2.2672688,     0,               0
##MIN=       0,             -28584,          0
##MAX=       2.2672688,     29431,           0
$$ Real data points
##PAGE= N=1
##DATA TABLE= (X++(R..R)), XYDATA
$$ plain form
0 0 0 0 0 0 0 0 0 0 0 0 0 0 0 0 0 0 0 0 0 0 0 0 0 0 0 0 2 -8 8 -8 8 -8 8 -8 10 -16 16 -16 17 -22 24 -25 30 -32 34 -39
46 -39 42 -47 51 -58 64 -71 78 -86 95 -104 114 -128 142 -160 181 -203 234 -272 324 -393 498 -674
68 -674 1042 -3772 7024 -1103 -12326 1560 -6700 -12978 3754 3070 -15163 -409 19453 1259
82 1259 -11231 12971 17051 -4267 -177 13176 2625 -6132 -2985 -3161 -5930 -8965 -10804 -3836
96 -3836 1563 -3445 -5084 5110 10032 3242 2749 9724 6851 529 1112 199 -2630 -3575 -6271 -5024
112 -5024 -700 -3817 -5966 1174 3754 -1840 -933 6019 4593 -1325 1654 4922 95 -1076 1994
127 1994 -235 -2193 -326 -681 -1883 -1371 -1749 -2108 -845 81 -701 -437 2311 2683 566 1786 3206
144 3206 1155 -35 551 93 -1120 -2280 -2207 -1550 -2045 -1842 -443 213 526 1213 1494 1900 1719 1082 1004
$$ packed form
0@%%%%%%%%%%%%%%%%%%%%%%%%%%Kj0J6j6J6j6J6j6J8k6L2l2L3l9M6m9N5o2O6p3
46c9Q1q9R8j09J22j35J49j64J81j99K18k42K70l02L41l84M37n06N96p17Q91j172
68f74J716m814J0796q127j1223J3886q260o278J6732o84j8233J4754J9862j8194
82A259j2490K4202M080k1318M090J3353j0551q757L147j76k769l035j839O968
96c836N399n008j639J0194M922o790m93O975k873o322N83r13k829r45k696J247
112e024M324l117k149P140K580n594R07O952j426n918K979L268m827j171L070
127A994k229j958J867l55j202N12l78l59J263R26p82K64K748L72k117J220J420
144C206k051j190N86m58j213j160P3O57m95K03J399O56L13O87K81M06j81o37p8
$$ plain form
163 1004 593 37 -419 -1196 -1211 -793 -1402 -1205 -204 -444 -480 230 716 583 348 759 1040 399 385 805 155
184 155 -231 79 -238 -520 -564 -681 -719 -701 -580 -297 -250 236 586 421 769 1153 588 337 654 235 -369 -491
206 -491 -469 -667 -930 -625 -274 -517 -210 373 215 380 620 522 373 394 343 77 -62 29 -142 -419 -219 -106
228 -106 -437 -342 -50 -185 -221 54 62 65 68 357 370 108 350 389 26 4 105 -214 -288 -325 -307 -327 -271 -53 -88 0
254 0 248 370 165 279 372 124 107 131 -17 -138 -152 -68 -162 -157 -63 17 -21 56 130 59 53 138 58 22 14 63 60 -1 -4 14
284 14 -52 47 5 -131 -94 6 -69 -67 -16 38 22 89 181 59 37 111 88 18 9 -29 -94 -52 -69 -31 -1 -32 77 31 115 83
314 83 68 67 32 47 18 7 -14 -57 -39 -54 -51 -46 6 15 72 -56 -9 4 0 19 42 24 -14 48 56 41 42 63 3 -70 -18 -28 26 -44
348 -44 -8 4 32 -4 46 -17 48 22 -4 -11 -6 -17 19 -49 -1 -42 -41 18 59 7 31 53 -3 -33 9 -55 -1 47 -10 -5 9 42 73
$$ packed form
163A004m11n56m56p77j5M18o09J97J001k40l6P10M86j33k35M11K81o41j4M20o50
184A55l86L10l17k82m4j17l8J8J21K83M7M86L50j65L48L84n65k51L17m19o04j22
206d91K2j98k63L05L51k43L07N83j58J65K40r8j49K1n1k66j39R1j71k77K00J13
228a06l31R5K92j35l6K75QLLK89J3k62K42L9l63k2J01l19p4l7J8k0N6K18l5Q8
254@K48J22k05J14R3k48j7K4j48j21j4Q4r4NR4Q0l8P7P4p1oQ5q0l6qM9lo1lJ8
284A4o6R9m2j36L7J00p5KN1N4j6O7R2j22k2P4k3p0rl8o5M2j7L8L0l1J09m6Q4l2
314H3j5jl5J5k9j1k1m3J8j5LNN2RN7j28M7J3mJ9K3j8l8O2Qj5JK1o0p3N2j0N4p0
348d4L6J2K8l6N0o3O5k6k6pNj1L6o8M8m1JN9M1n2K4K2n6l0M2o4N4M8n7NJ4L3L1
$$ plain form
381 73 50 -4 -31 30 15 -27 21 -21 45 44 75 3 0 15 40 34 72 -6 28 -23 32 2 -4 -52 16 -44 -9 5 -57 28 -28 -9 47
414 47 33 2 -7 -2 24 -8 25 28 -15 -28 17 55 4 -28 62 -13 8 69 -22 -12 28 57 -7 6 36 62 45 30 -44 -16 -1 -23
446 -23 37 -43 -10 23 40 -20 49 7 27 -36 31 16 45 -6 -3 1 -59 -12 34 27 -20 22 11 33 -3 49 18 31 -16 12 28 -17
478 -17 -25 25 33 3 -11 32 40 15 -60 -31 -16 -9 -39 -20 17 -23 3 -28 -59 -5 4 -10 -15 -40 -58 3 14 15 -20 63 26 47 68 1
512 1 -11 -31 96 -13 -25 6 2 -58 -50 26 -17 16 -10 46 23 0 5 -11 26 9 1 -20 -3 -39 5 57 -24 24 19 -44 -23 62 9
545 9 -27 -28 -24 67 -15 20 29 -14 44 44 -41 9 11 -29 14 -12 -18 12 16 -20 18 -41 -36 31 16 2 32 16 10 -36 -33 -61 2 -25 -20 55 -21
582 -21 11 -5 2 20 -36 -8 43 7 82 17 6 30 18 15 31 -34 -14 7 0 3 73 -55 25 32 37 -18 15 -3 17 19 -45 20 -16 6
616 6 -14 -28 -25 -47 -27 16 -34 -33 34 8 11 -29 39 7 -8 -23 4 1 -1 -9 -8 6 12 5 -9 30 34 -41 27 -7 -11 0 18 -8 72 -22 32
$$ packed form
381G3k3n4k7O1j5m2M8m2O6jL1p2lJ5K5oL8p8L4n1N5l0om8O8o0L5J4o2Q5n6J9N6
414D7j4l1rNK6l2L3Lm3j3M5L8n1l2R0p5K1O1r1J0M0K9o4J3L0K6j7j5p4K8J5k2
446b3O0q0L3L3J7o0O9m2K0o3O7j5K9n1LMo0M7M6pm7M2j1K2l6N2l1J3m7K8J6m5
478a7qN0Ql0j4M3Qk5p5K9J5Pl0J9L7m0K6l1l1N4Rj4nk5j8O1J1Jl5Q3l7K1K1o7
512Aj2k0J27j09j2L1mo0QP6m3L3k6N6k3k3Nj6L7j7qk1J7l6M4N2q1M8no3K1Q5n3
545Il6jMR1q2L5Rm3N8%q5N0Km0M3k6oL0Ml6L8n9NO7j5j4L0j6om6Lk8O3k7NP5p6
582b1L2j6PJ8n6K8N1l6P5o5j1K4j2lJ6o5K0K1pLP0j28Q0PNn5L3j8K0Ko4O5l6K2
616Fk0j4Lk2K0M3n0JO7k6Lm0O8l2j5j5K7lkqJJ4Opj4L9Mp5O8l4mJ1J8k6Q0r4N4
$$ plain form
653 32 21 67 5 -34 66 -41 2 -61 30 21 -26 38 -7 25 -20 -2 51 -20 -18 -40 54 45 -16 2 -29 -5 -2 18 -43 -9 35 -48
685 -48 23 46 4 1 44 16 -2 22 -53 44 2 -35 -67 -1 22 -76 27 31 -29 43 -24 -7 15 -20 -56 -26 -10 -4 -1 -32 -3 42
717 42 23 -38 18 -16 17 -6 -72 18 15 -24 -71 -8 -22 -25 -18 -40 -15 4 -33 -28 -102 16 -33 -23 14 -29 5 -2 3 34 15 -23 32
750 32 7 21 39 -13 3 4 -11 37 10 18 -38 13 -25 22 -27 10 -21 25 12 5 2 55 -39 -31 26 17 -16 44 31 -13 7 37 -16 -31
784 -31 12 -13 -23 -26 8 -16 10 8 19 -8 9 7 30 3 27 5 7 53 1 49 38 8 -20 -7 7 36 -9 -19 35 -2 -67 -21 -8
817 -8 -20 18 -11 0 23 -11 36 -2 -4 -3 -49 11 -21 49 -4 -18 15 -16 -14 22 11 20 -18 10 35 22 52 54 31 -14 70 21 3 -3
851 -3 1 43 36 -37 -7 18 21 -43 -37 48 25 33 -38 22 9 -16 5 0 39 -8 -34 38 -21 -18 -37 -64 5 14 22 1 59 -9 25 -70 21 -13
887 -13 -38 8 12 -5 -4 10 -15 1 4 -13 3 -18 23 -28 0 24 42 18 58 11 63 38 -19 -29 -6 -21 -42 -70 5 15 -61 59
$$ packed form
653C2j1M6o2l9J00j07M3o3R1rm7O4m5L2m5J8N3p1Kk2R4ro1J8l1K4LK0o1L4M4q3
685d8P1K3m2lM3k8j8K4p5R7m2l7l2O6K3r8J03Mo0P2o7J7K2l5l6L0J6OLl1K9M5
717D2j9o1N6l4L3k3o6R0ll9m7O3j4lPk2K5J9l7Np4J18m9J0L7m3L4pNL1j9l8N5
750C2k5J4J8n2J6Jj5M8k7Qn6N1l8M7m9L7l1M6j3plN3r4QN7rl3O0j3m4K0L0n3j5
784c1M3k5j0lL4k4K6kJ1k7J7kK3k7K4k2KM6n2M8j1l0k8J3J4K9m5j0N4l7o5M6J3
817hj2L8k9J1K3l4M7l8kJm6O0l2P0n3j4L3l1KL6j1Rl8K8K5j3L0Kk3m5Q4m9j8o
851cMM2pp3L0K5Lo4OQ5k3Qp1O0j3k5K1nL9m7k6P2n9Lj9k7O9RQk1N8o8L4r5R1l4
887a3k5M6Mj7JJ4k5J6Lj7J6k1M1n1K8K4J8k4M0m7N2k5n7j0K3j5k1k8P5J0p6J20
$$ plain form
919 59 -56 -22 26 -12 -42 -31 35 -13 -14 -21 2 -36 14 40 23 -8 9 7 -19 -90 -8 -49 -23 -8 22 -11 -51 -25 -1 -25 -24 29
951 29 -48 12 -65 -22 -8 -18 -8 -8 -15 5 -24 -13 -13 -1 -38 33 7 -16 -38 -19 -9 -13 22 12 -16 -61 -23 -7 10 7 9 5 28 20 23
986 23 -19 -15 -16 0 -4 -29 30 -12 4 -4 -20 45 -2 -68 37 -13 14 2 2 28 54 51 54 20 -4 -11 -4 35 -4 -25 12 14 -17 -8 39 38
1022 38 -1 15 -45 -15 31 21 -51 -40 29 0 54 -57 0 36 -2 -30 -20 19 -46 -28 -33 25 16 -21 -34 -12 29 7 28 6 38
1053 38 12 79 51 14 -13 65 41 -30 -29 44 -10 -26 -8 -2 1 39 14 12 -23 1 6 -32 25 24 33 26 37 3 4 24 -16 -27 26 40 9
1088 9 25 2 39 -4 65 -52 -8 13 22 5 -19 37 41 11 30 -28 -8 -19 -22 -23 2 13 -15 -68 -22 -25 -17 -18 -20 22 43 -53 -17 32
1122 32 -37 -29 -29 -2 62 9 -39 14 -2 10 -41 -6 25 29 -50 69 44 17 -10 4 24 -58 -9 -28 -36 22 -22 -29 24 33 25 -7 30
1155 30 -5 -62 -8 -7 18 -37 -5 -12 -39 -36 1 1 -15 29 -10 -14 -14 -23 12 -35 75 71 -31 28 32 -40 -43 -5 -23 36 -52 -15 -6 -22 -27
$$ packed form
919E9j15L4M8l8l0J1O6m8jpK3l8N0K6j7l1J7kk6p1Q2m1K6J5L0l3m0K6K4k4JN3
951B9p7O0p7M3J4j0J0%pK0k9J1%J2l7P1k6k3k2J9J0mL5j0k8m5L8J6J7lKmK3qL
986B3m2MjJ6mk5N9m2J6qj6O5m7o6J05n0K7j2%K6K6lLl4k4pPL9l9k1L7Kl1RM7j
1022C8l9J6o0L0M6j0p2J1O9k9N4j11N7L6l8k8J0L9o5J8nN8rl7j3K2M1k2K1k2L2
1053C8k6O7k8l7k7P8k4p1JP3n4j6J8OLL8k5kl5K4Nl8N7jRpJ1l4JK0m0j1N3J4l1
1088IJ6k3L7m3O9j17M4K1Rj7k4N6Ml0J9n8K0j1ljK5J1k8n3M6lQjkM2K1r6L6M9
1122C2o9Q%K7O4n3m8N3j6J2n1L5L1Mp9J19k5k7k7J4K0q2M9j9qN8m4pN3Rql2L7
1155C0l5n7N4JK5n5L2pk7LL7%j6M4l9m%rL5m7J10mj02N9Mp2lL8j8N9q8L7Rj6n
$$ plain form
1190 -27 50 -17 -39 10 4 -6 50 21 14 0 -31 -40 -17 7 20 -19 35 -28 42 8 -29 -32 67 -13 -16 36 19 18 41 22 15 19 29 -12
1224 -12 -11 -20 13 20 29 1 20 49 -29 -17 -23 -18 -7 31 15 77 36 30 25 27 16 -17 -37 54 -5 -9 39 9 -33 12 17 42 0 -36 -1 -20
1260 -20 -3 -12 68 5 -21 29 13 57 -23 -25 63 4 -20 50 -8 58 -37 22 -49 28 -6 -40 -26 -9 -8 -21 1 27 -10 -23 -1 15
1292 15 8 -31 18 5 -21 -8 25 -1 22 -4 -33 27 75 37 -8 12 -25 58 -13 -69 -73 -14 19 -8 2 -36 5 6 38 -1 19 0
1324 0 17 8 -10 -14 -25 -27 -25 -35 23 51 11 37 9 -57 6 25 -32 19 -1 37 5 -12 -9 27 -37 5 41 36 -15 19 79 42 53 -10
1358 -10 -20 40 5 4 -7 -28 -9 30 -55 44 -35 -6 -14 -49 28 6 19 24 -42 -14 5 3 33 -12 -3 -12 11 7 13 -15 22 -4 28 17
1392 17 35 -16 37 56 -13 25 -30 -34 14 35 5 -6 6 19 5 39 -26 -18 17 1 6 0 -30 -8 44 -17 2 20 -27 20 -9 -18 -49
1425 -49 -2 5 -6 26 -4 -17 3 34 5 23 -1 1 45 77 -9 20 24 -25 -12 -2 -19 22 45 -31 19 -15 -39 34 37 54 8 1 3
$$ packed form
1190b7P7o7k2M9oj0N6k9pj4l1rK3K4J3l9N4o3P0l4l7lR9q0lN2j7jK3j9pMJ0m1
1224a2JrL3PRk8J9K9p8J2oNJ1L8j6O2m1onKj1l3k0R1n9mM8l0m2M5NK5m2l6L5j9
1260b0J7rQ0o3k6N0j6M4q0kQ8n9k4P0n8O6r5N9p1P7l4l4J4J7Jj3K2K6l7j3K2J6
1292A5pl9M9j3k6J3L3k6K3k6k9O0M8l8m5K0l7Q3p1n6mN9L3k7J0l8M1JL2l9K0j9
1324@J7rj8mj1kKj0N8K8m0K6k8o6O3J9n7N1k0L8l2j7LL6o4M2L6nn1L4O0l7J1o3
1358a0j0O0l5jj1k1J9L9q5R9p9K9ql5P7k2J3No6K8J9kL0m5RrK3mOk8L7k6L2j1
1392A7J8n1N3J9o9L8n5mM8K1l0j1J2J3j4L4o5QL5j6Nol0K2N2o1J9J8m7M7k9rl1
1425d9M7Pj1L2l0j3K0L1k9J8k4KM4L2q6K9Mm9J3J0j7M1K3p6N0l4k4P3LJ7m6pK
$$ plain form
1458 3 -23 6 43 -1 54 -6 34 29 16 -45 33 5 -1 7 -4 -38 1 -30 -5 17 -4 74 0 1 34 -20 18 49 2 -4 20 22 15 -14
1492 -14 -22 -15 -74 -8 -15 32 3 9 -10 31 37 -56 -17 7 -34 -12 37 55 -23 17 31 20 -4 11 11 -4 -2 19 51 -8 1 -11 -18 29 -44
1527 -44 -23 17 -26 18 -15 -10 14 17 79 17 -35 -33 2 -20 -44 3 35 -9 -36 -15 3 0 1 -33 11 24 18 14 -43 30 14 1 -5 -23
1561 -23 -37 9 18 65 13 1 3 -2 11 -37 -26 2 -51 24 65 26 -6 -21 18 17 4 25 -9 35 0 1 -66 39 6 2 35 15 9
1594 9 10 26 -7 18 10 19 -25 38 -17 9 -2 12 -2 -47 14 29 -33 -14 2 1 -46 13 56 5 -28 -22 -43 38 15 43 -55 -7 -52
1627 -52 32 -16 -17 16 -44 17 -22 -16 2 47 28 17 -18 24 -10 4 40 -29 14 -25 -3 -59 14 13 5 -13 -37 -7 -13 30 -42 -9 27
1660 27 34 -1 -14 -20 -18 -14 13 -37 -32 -11 -14 25 46 -9 -45 66 52 -38 43 -58 -28 -7 -23 30 15 -32 39 -29 -2 -31 27 38
1692 38 -6 -6 26 -2 -63 -14 -21 -58 -13 -26 -58 -37 27 -7 3 -1 -13 -51 12 -22 25 -18 26 2 29 -36 -26 -6 45 24 2 -7
$$ packed form
1458Ck6K9L7m4N5o0M0nj3o1P8k8oQj1l4L9l1K5K2k1P8p4JL3n4L8L1m7oK4Kpk9
1492a4qPn9O6pM7k9Oj9M1Or3L9K4m1K2M9J8p8M0J4j1k4J5%j5KK1L2n9Rj2pM7p3
1527d4K1M0m3M4l3NK4LO2o2n2KL5k2k4M7L2m4k7K1J8lJl4M4J3omn7P3j6j3oj8
1561b3j4M6RM7n2j2KnJ3m8J1K8n3P5M1l9l2j5L9jj3K1l4M4l5Jo7J05l3mL3k0o
1594IJJ6l3K5qRm4O3n5K6j1J4j4m5O1J5o2J9J6jm7N9M3n1l3Ok1Q1k3K8r8M8m5
1627e2Q4m8jL3o0O1l9OJ8M5j9j1l5M2l4J4L6o9M3l9K2n6P3jqj8k4L0oM3p2L3L6
1660B7Pl5j3oKMK7n0NK1lL9K1n5l6J11j4r0Q1j01L0K1j6N3j5m7P1o8K7k9N8J1
1692C8m4%L2k8o1M9pl7M5j3l2K1O4l4J0mj2l8O3l4M7m3M4k4K7o5J0K0N1k1k2r
$$ plain form
1724 -7 -5 -28 39 71 -13 6 16 18 -57 56 -53 -46 -19 10 -28 9 -12 4 56 -24 11 -29 -29 42 11 2 -25 -65 -10 -14 -8 -34 -1
1757 -1 -3 -30 -59 -2 -35 -6 25 8 45 41 47 29 28 25 51 -55 35 28 -1 -15 21 -16 25 -22 -2 53 8 -4 -33 -16 29 -53 -9
1790 -9 -26 -11 -25 -19 41 31 25 -23 -29 -31 -3 46 33 -36 24 -17 47 27 6 -17 33 17 15 -1 13 1 40 -1 27 -1 -32 -11 8
1823 8 -39 -21 -17 -3 70 -10 31 -32 -8 -9 -34 0 38 26 -14 16 -18 7 -30 1 47 -13 -25 -14 23 -5 19 -18 24 26 -7 -13 -8
1856 -8 -11 25 36 -5 22 40 -10 44 19 -9 1 4 43 10 -33 -49 28 -60 -16 28 -13 -2 -4 -26 2 47 47 14 -19 -19 -36 59 31
1889 31 -23 5 39 20 68 -8 -2 4 -1 42 -5 -19 22 4 -37 -26 14 -24 -17 4 9 -30 19 17 -38 56 47 -5 -16 -3 29 19 70 10
1923 10 2 14 22 -30 38 41 2 0 -12 35 -40 28 9 30 7 28 -12 21 44 21 -3 -45 -24 76 5 -12 42 -20 18 -25 53 -43
1955 -43 -23 15 25 44 45 7 4 -17 38 13 16 -20 9 33 -67 40 14 17 41 2 -12 -6 -62 -15 -9 2 -1 -20 19 4 -21 -20 28
$$ packed form
1724gKk3O7L2q4J9J0Kp5J13j09PK7K9l8L7k1J6N2q0L5m0%P1l1rk7m0N5mOk6L3
1757akk7k9N7l3K9L1j7L7mOj8jlK6j06R0pk9j4L6l7M1m7K0N5m5j2k9J7M5q2M4
1790ij7J5j4OO0j0om8okK8M9j3o9O0m1O4k0k1k3N0j6kj6J4j2L9m1K8k8l1K1J9
1823Hm7J8MJ4P3q0M1o3K4jk5L4L8j2m0L0l4K5l7L1M6o0j2J1L7k8K4l7M2Kl3oN
1856hlL6J1m1K7J8n0N4k5k8J0LL9l3m3j6P7q8M4M4m1J1kk2K8M5%l3l3%j7R5k8
1889C1n4K8L4j9M8p6OOnM3m7j4M1j8m1J1M0l8PK1Nl9M9kn5R4rn2j1J3L2j0N1o0
1923A0qJ2Qn2O8Ll9kj2M7p5O8j9K1k3K1m0L3K3k3k4m2K1J00p1j7N4o2L8m3P8r6
1955d3K0L8J0J9Jl8lk1N5k5Ll6K9K4j00J07k6LK4l9j4On6M7OJ1lj9L9j5k5JM8
$$ plain form
1988 28 56 -24 -11 11 -19 -98 -13 59 30 -3 13 -22 10 44 -53 -28 20 -3 41 1 12 5 24 69 -34 22 21 -15 -8 26 -18
2019 -18 7 -45 -13 51 37 -35 -17 -31 -28 -29 19 -53 -22 -3 -3 -21 10 -10 -49 27 41 -14 15 -58 2 9 11 23 20 -46 -3 -26 45
2052 45 55 -43 -13 -29 17 5 34 -41 17 -14 14 -7 53 7 44 -86 -29 52 -21 11 -50 -2 49 12 -2 10 -19 16 17 0
2082 0 26 -20 -34 -34 27 -2 -2 9 -2 11 -14 -6 10 10 -10 30 38 1 77 -9 19 17 17 -15 7 9 46 26 44 9 49 53 -16 -30 35
2117 35 34 1 13 -56 13 -10 9 59 -27 -7 1 -10 -20 -37 -1 31 60 -5 -6 4 29 7 23 6 -15 23 -11 43 13 20 35 -25
2149 -25 -33 7 41 -10 19 -20 -13 49 23 14 12 -26 -34 23 51 -11 -21 -27 35 -43 46 0 4 6 -20 5 -9 34 20 -32 61 -4 37 -4
2183 -4 -13 39 -12 0 -15 15 -22 4 13 43 5 5 7 -7 18 33 -54 1 9 57 -27 -26 18 -17 7 -22 -14 -4 41 0 -34 -36 -5 -40 -69
2218 -69 -7 -23 -18 -35 -41 25 27 0 57 22 -40 -28 -54 -47 1 13 -31 30 37 -2 2 6 -20 -25 -17 17 -54 19 17 -2 2 -22 23 -31 -19 63
$$ packed form
1988B8K8q0J3K2l0p9Q5P2k9l3J6l5L2L4r7K5M8k3M4m0J1pJ9M5j03N6jl6PL4m4
2019a8K5n2L2O4j4p2J8j4LjM8p2L1J9%j8L1k0l9P6J4n5K9p3O0PKJ2lo6M3k3P1
2052D5J0r8L0j6M6j2K9p5N8l1K8k1O0m6L7j30N7Q1p3L2o1M8N1l7j4J2k9L5Jj7
2082@K6m6j4%O1k9%J1j1J3k5QJ6%k0M0Ql7P6q6K8k%l2K2KL7k0J8l5M0Mo9j4O5
2117C5jl3J2o9O9k3J9N0q6K0Qj1j0j7L6L2K9o5jJ0K5k2J6j7k1L8l4N4l0PJ5o0
2149b5qM0L4n1K9l9PO2k6rkl8qN7K8o2j0oO2p8Q9m6MKk6K5j4M3j4n2R3o5M1m1
2183drN2n1J2j5L0l7K6RL0l8%Kj4K5J5q7N5QM8q4JM4l5K4k9QJ0M5m1l4kL1l5k9
2218f9O2j6Nj7oO6Kk7N7l5o2J2k6PM8J2m4O1Pl9MMk6nQL4p1P3kj9Mk4M5n4J2Q2
$$ plain form
2254 63 74 -21 -26 -1 -5 66 15 4 -10 0 38 -14 12 31 24 -21 36 -27 -20 -7 -13 -5 -37 3 19 6 -41 -13 -23 -11 -38 -38 22 -58
2288 -58 -24 -33 47 -10 -13 -5 17 -23 21 18 -80 59 -15 -14 14 16 47 17 -20 -5 92 36 -18 -16 -19 23 -13 -13 -3 -20 5 -10 -9 20 5
2323 5 26 14 53 37 24 51 13 -37 -67 21 -2 20 -46 -4 80 6 -25 17 3 -41 45 -3 21 11 -38 -45 -33 -19 -21 38 -23 0
2355 0 -31 21 -38 13 -55 14 8 -6 29 -49 -42 16 -13 0 101 -52 21 -7 52 34 14 39 -25 19 50 31 -5 30 36 -51 16
2386 16 -16 48 8 20 -3 -14 12 45 -15 47 44 -4 55 -21 13 18 -40 -4 -9 -12 37 12 -35 -44 -51 -21 -28 4 1 13 -80 -19 -19 3 -8
2421 -8 -18 18 15 23 41 -9 -62 -15 1 10 92 27 1 44 -1 -3 2 -43 2 -50 -25 -14 6 -23 28 -1 -17 4 -28 32 -31 -34 -1 9
2455 9 27 18 22 17 -40 10 -27 -30 10 32 63 1 33 17 6 30 49 17 46 -15 19 53 0 -5 4 -18 -62 -11 34 41 7 8 35 -8 -61
2490 -61 -13 14 -12 -41 34 12 0 25 -33 -60 57 -3 9 56 -24 3 -3 7 -19 4 -22 20 25 18 -17 -7 -6 -20 1 -9 -2 31
$$ packed form
2254F3J1r5nK5mP1n1j1j4J0L8n2K6J9pm5N7o3PJ3oQl2M0J6j3m7K8j0J2k7%O0q0
2288e8L4rQ0n7lQK2m0M4lr8J39p4JK8KL1l0l7J5R7n6n4KlM2l6%J0j7K5j5JK9j5
2323EK1j2L9j6j3K7l8n0l0Q8k3K2o6M2Q4p4l1M2j4m4Q6m8K4j0m9pJ2J4kN9o1K3
2355@l1N2n9N1o8O9oj4L5p8PN8k9J3J01j53P3k8N9j8k0K5o4M4L1j9l6L5Oq7O7
2386A6l2O4m0J2k3j1K6L3o0O2lm8N9p6L4Nn8L6nlM9k5m7rpL0pL2lJ2r3O1%K2j1
2421hj0L6lQJ8n0n3M7J6RQ2o5k6M3m5kNm5M5n2K5J1K0k9N1k9j6K1l2O0o3lL3J0
2455IJ8rMnn7N0l7lM0K2L1o2L2j6j1K4J9l2K9o1L4L4n3nRk2m4N1M5Pl4JK7m3n3
2490f1M8K7k6k9P5k2j2K5n8k7J17o0J2M7q0K7oJ0k6K3k6M2Npl5J0Jj4K1j0PL3
$$ plain form
2522 31 18 -2 -22 8 36 -31 20 19 16 -7 82 -5 -22 -11 0 -45 2 -51 -3 0 -12 -9 31 -26 -35 -12 -27 32 2 -8 81 6 -7
2555 -7 70 40 -50 17 19 -25 3 33 60 -5 9 -29 30 32 -6 19 8 -21 9 20 -17 -9 12 -19 -37 -96 35 -39 -26 -29 -57 40
2587 40 1 35 -68 -32 -41 -29 -23 -8 -6 6 -9 -33 21 2 21 22 -31 26 77 33 51 37 52 -34 -8 -61 45 -16 -30 3 -9
2618 -9 34 -3 -46 -37 -27 -6 -45 -68 -40 52 -17 0 -2 -74 7 -57 55 -24 -59 51 8 -3 17 17 -23 -56 -26 -12 7 -5 -34
2649 -34 13 31 -78 -43 -43 26 15 -14 -35 -37 0 -31 -10 -11 -19 56 -17 -36 26 17 -13 18 39 8 -2 -21 20 -45 -7 -5 -48 -6 -9
2682 -9 31 -25 -3 27 4 59 14 27 13 -18 53 -35 33 76 -12 -44 37 -42 35 2 0 32 -18 -47 -26 -50 23 39 20 9 -1
2713 -1 34 -20 13 -37 11 47 -4 -6 -31 31 -33 64 4 10 49 52 -30 28 -47 -11 -36 -33 6 -22 4 -1 58 55 42 -29 13 -30 38 -22
2747 -22 -31 -36 49 -18 -1 1 1 45 -13 11 10 17 31 31 -16 -17 40 21 -9 -15 43 1 -23 61 38 3 56 5 33 31 48 -34 13 59 60 39
$$ packed form
2522C1j3k0k0L0K8o7N1jlk3Q9q7j7J1J1m5M7n3M8Lj2LM0n7rK3j5N9l0j0Q9p5j3
2555gP7l0r0O7Km4K8L0K7o5J4l8N9Kl8K5j1k9L0J1l7QK1l1j8n9J31p4J3lk8R7
2587D0l9L4j03L6rJ2OJ5KJ2j5k4N4j9J9Jn3N7N1m4J8j4J5q6K6n3J06o1j4L3j2
2618iM3l7m3RJ0K1l9k3K8R2o9J7kp2Q1o4J12p9l5J10m3j1K0%m0l3L0J4J9j2k9
2649c4M7J8j09L5%O9j1k9k1kL7l1K1jqP5p3j9O2rl0L1K1l1j0j9M1o5L8Km3M2l
2682iM0n6K2L0k3N5m5J3j4l1P1q8O8M3q8l2Q1p9P7l3kL2n0k9K1k4P3J6j9j1j0
2713aL5n4L3n0M8L6n1kk5O2o4R7o0OL9Lq2N8p5L6k5LL9k8K6nN9lj3p1M2m3O8o0
2747b2rnQ5o7J7K%M4n8K4jPJ4%m7jN7j9l0oN8m2k4Q4k3l5N3n1K8kJ7q2M7M6Jk1
$$ plain form
2783 39 22 -3 -10 -2 -9 -31 -9 14 -15 1 16 34 -28 44 -30 -10 5 5 10 4 16 31 15 30 17 23 -15 -16 15 7 60 30 -31 -11 14
2818 14 -36 1 -3 22 -28 21 -52 -31 -26 -26 22 42 -52 -4 36 -9 -9 -29 16 -13 34 -50 12 63 38 25 33 3 18 7 19 22 14 -22
2852 -22 18 -13 38 49 16 -18 42 11 -3 2 -16 -75 7 -65 -70 12 7 16 -34 -10 -35 -19 -21 10 6 -8 22 3 -29 12 6 12 -7 26
2886 26 23 9 32 -8 -6 8 -11 85 52 38 23 21 -21 -16 -11 -2 -24 68 -47 14 33 7 -4 -3 48 9 -27 21 25 21 -26 -13 -11 -26 20
2921 20 15 -10 -28 -2 20 21 -32 -38 -1 49 18 1 4 -11 9 88 40 -48 -46 -30 -14 -3 13 -36 0 -18 -20 -13 13 -23 1 6 2 -35 28
2956 28 -28 -15 -28 29 -42 -12 -35 -7 -27 -15 8 -89 1 -33 1 -93 -8 34 15 -52 -19 -16 -5 16 -50 20 -10 -14 -29 -49 13
2987 13 20 -53 7 3 -20 -22 -63 20 -3 -61 -1 -22 -23 -64 -15 -5 5 19 2 2 33 -14 44 -26 -3 33 -5 7 -14 -23 64 -14 24
3020 24 -19 9 3 -11 15 -19 25 43 -22 14 -45 31 -11 5 -36 -66 -24 -75 13 -6 -25 -25 -46 -44 51 10 -3 -26 -6 -21 18 12
$$ packed form
2783C9j7k5pQpk2K2K3k9J6J5J8o2P2p4K0J5%NoJ2J5j6J5j3Ol8jL1qN3l0o1K0K5
2818A4n0L7mK5n0M9p3K1N%M8K0r4M8M0m5%k0M5k9M7q4O2N1k5j3Ql0J5j1J2Lql6
2852b2M0l1N1J1l3l4O0l1j4Nj8n9Q2p2nQ2nRn0K4k5J6kL1mj4L0j9l2M1oOj9L3
2886B6lj4K3m0KJ4j9R6l3j4j5km2NNRk2R2j15O1J9k6j1JN1l9l6M8Mmm7J3Kj5M6
2921B0nk5j8K6K2Jn3oL7N0l1j7Lj5K0P9m8q8KJ6J6J1J6m9L6j8kPK6l6K4Nml7O3
2956B8n6J3j3N7p1L0k3K8k0J2K3r7R0l4L4r4Q5M2j9o7L3LJ1K1o6P0l0mj5k0O2
2987A3Pp3O0mk3km1Q3k3n8O0k1jm1M9J0J0J4j7%L1m7N8p0K3L6l8J2k1rQ7p8L8
3020B4m3K8oj4K6l4M4J8o5L6n9P6m2J6m1l0M2n1Q8j9j9%k1KR5m1j3k3K0j5L9o
$$ plain form
3052 12 35 22 -24 -8 -14 29 -19 75 -1 44 -17 -28 25 50 -5 -29 -1 19 20 16 -28 25 47 -24 21 35 -18 -31 77 -4 39
3083 39 -29 3 -29 -69 45 -32 -16 13 -12 -11 61 -23 -9 16 -15 -13 15 65 0 -24 -9 -5 74 1 5 26 2 12 -42 -102 -5 13
3115 13 15 13 5 -49 -62 -36 1 -8 -11 -46 -32 7 -7 -18 -4 -34 -41 15 -5 14 -22 -40 0 32 -4 23 -15 50 20 -6 35 35 47 -57
3149 -57 -6 -58 -1 -12 7 18 -13 -30 -4 -4 10 19 5 8 -22 43 -3 -18 5 -7 -14 -25 20 18 -27 -10 63 8 -34 -6 -35 5 3
3182 3 32 -25 20 -18 -27 -8 10 -18 13 72 -2 48 19 68 8 -22 -7 -19 12 -42 -46 -38 -16 -37 -19 -30 -9 34 -32 52 -23 -36
3214 -36 12 52 -31 -36 10 -14 22 -9 -1 -4 18 27 7 -17 8 19 -6 -89 -17 -21 8 -5 -68 -14 50 11 -39 -7 -44 -8 -9 -34 -27 -4
3248 -4 -39 -20 -50 24 -43 3 -25 4 23 26 25 -37 -2 -20 11 4 8 37 -19 -6 42 0 10 -47 21 45 -13 -39 85 22 21 52 -43
3281 -43 17 17 -19 -33 -32 -13 -42 50 -49 28 5 2 -7 38 -60 21 8 -15 52 3 38 -21 60 -9 22 30 -15 -28 -18 43 52 -37 26
$$ packed form
3052A2K3j3m6J6oM3m8R4p6M5o1j1N3K5n5k4K8K0Jmm4N3K2p1M5J4n3j3J08q1M3
3083C9o8L2l2m0J14p7J6K9k5JP2q4J4K5l1KK8N0o5k4J5MP9p3MK1k4J0n4o0R7J8
3115A3Kkqn4j3K6L7rll5J4L9j4j1J4l0pN6k0J9l6j8M0L2l6K7l8O5l0k6M1%J2j04
3149e7N1n2N7j1J9J1l1j7K6%J4Rj4Ll0O5m6j5K3j2pj1M5km5J7P3n5m2K8k9M0k
3182CK9n7M5l8rJ9J8k8L1N9p4N0k9M9o0l0J5j2L1n4mQK2k1J8j1K1M3o6Q4p5j3
3214c6M8M0q3nM6k4L6l1QlK2Rk0k4K5J1k5q3P2mK9j3o3N4O4l9n0L2l7L6jk5PK3
3248dl5J9l0P4o7M6k8K9J9Ljo2L5j8L1pMK9n6J3M8m2J0n7O8K4n8k6J24o3jL1r5
3281d3O0%l6j4JJ9k9R2r9P7k3lrM5r8Q1j3k3O7m9L5n9Q1o9L1Qm5j3J0O1Rq9O3
$$ plain form
3314 26 -2 -13 63 6 -29 -19 24 -11 -11 -19 -4 -32 -56 17 -10 -11 -8 2 -71 3 -35 3 -30 41 31 4 -31 -30 24 -8 7 -56 -15
3347 -15 -11 45 45 -41 32 -9 -61 -55 50 -66 10 23 1 38 22 1 -26 64 -12 17 6 -16 3 -43 -45 50 13 10 26 13 -19 -6
3379 -6 -7 45 -38 -1 -47 27 27 -43 20 8 -16 -18 -67 -44 40 -3 18 12 -20 -97 -21 -5 -36 -4 -68 34 -19 -28 -23 -14 32 32 -17 11
3413 11 -15 -65 -12 26 -6 -56 -15 -48 62 -26 9 5 -42 10 14 -38 51 25 -35 24 -21 28 -4 11 52 -9 4 -27 -10 -54 11
3444 11 -49 64 -6 -48 -40 -15 -17 9 9 -40 -37 -33 -16 -23 17 11 -38 29 24 -67 -45 18 11 7 25 -27 -31 4 -9 8 -5 -6 52 44 -24 27
3480 27 -2 -25 39 -11 41 27 -58 33 20 -56 17 91 -12 48 -49 13 16 -26 -9 -52 34 31 9 -17 -5 3 -17 32 -1 -8 -6 37
3512 37 -45 2 -22 5 6 47 -19 9 46 11 -9 -9 43 17 -47 -44 -50 21 27 4 27 -1 5 17 45 -19 -42 2 20 0 0 22 32 -22
3546 -22 -2 40 -6 -70 29 -37 43 16 28 -12 -43 -10 34 -52 -29 -19 41 32 45 11 38 -14 0 -44 -10 2 -5 -3 -18 -19 59 58 -30
$$ packed form
3314B6k8j1P6n7l5J0M3l5%qJ5k8k4P3k7jLJ0p3P4l8L8l3P1j0k7l5JN4l2J5o3M1
3347a5MN6%q6P3m1n2OJ05j16P6J3k2L7j6k1k7R0p6K9j1k2J9m6kR5l7lJ6j3l2J3
3379fjN2q3L7m6P4%p0O3j2k4km9K3Q4m3K1ol2p7P6J6l1L2o4J02n3rNRM6%m9K8
3413A1k6n0N3L8l2n0M1l3J10q8L5mm7N2Mn2Q9k6o0N9m5M9l2J5M1o1J3l1J7m4O5
3444A1o0J13p0m2QK5kK6%m9LMJ7pM0om9O7nr1K2O3pmJ8n2mL5j3J7j3jN8qo8N1
3480B7k9k3O4n0N2j4q5R1j3p6P3P4j03O0r7O2Lm2J7m3Q6lk2k6J2Qk0M9l3pKM3
3512C7q2M7k4K7JM1o6K8L7l5k0%N2k6o4LoP1Ok3K3k8OJ2K8o4k3M4J8k0%K2J0n4
3546b2K0M2m6o4R9o6Q0k7J2m0l1L3M4q6K3J0O0rJ3l4K7n2J4m4L4J2pKj5jP8jq8
$$ plain form
3579 -30 13 -37 22 -28 -36 -71 -17 -10 -26 -24 -71 32 32 19 -66 -13 30 1 5 -60 -85 -5 -28 10 60 17 -12 -3 8 49 -19 28 -41
3612 -41 14 -34 -18 -27 26 -10 -36 -21 38 18 -23 14 12 29 -5 0 22 21 49 10 24 40 -40 -9 7 30 78 30 -4 -45 -3 59
3644 59 2 -2 0 24 29 -22 6 -27 5 17 -23 25 2 16 -12 -43 63 -20 -27 -11 -2 -19 26 25 1 4 -8 -6 -31 12 7 0 15 -17 -44
3679 -44 64 -12 -5 31 -24 -1 -13 -38 74 58 4 27 37 -22 -13 -72 -29 8 35 -28 1 28 9 3 24 36 -23 -13 -43 0 34
3710 34 -30 -13 -48 -26 48 -76 18 -21 -13 -6 -14 8 -35 -52 31 2 -48 0 -3 5 23 46 -5 -90 11 27 -38 -36 26 -34 -41 11 -8
3743 -8 10 0 13 -49 -24 24 55 1 -1 -14 -6 -29 -26 -51 22 17 47 35 41 -17 31 -23 15 20 12 23 -32 -40 -6 -15 37 45 11 28 32 4
3779 4 56 16 -38 9 30 -92 24 -13 -12 -48 -35 -5 -38 -15 43 35 -5 -1 -21 19 52 -15 19 -38 -14 18 -23 -38 41 -15 16
3810 16 -23 3 10 -4 -7 33 -4 23 17 -19 -23 -24 -17 -60 -36 23 -22 -24 18 35 -28 -21 -51 -65 17 -32 0 -17 -15 -27 -34 -21 6 31 -32
$$ packed form
3579c0M3n0N9n0ql5N4Pj6Km7J03%j3q5N3M3k9Mo5k5Q0k3L8N0m3k9RJ1M1o8M7o9
3612d1N5m8J6rN3l6k6J5N9k0m1L7kJ7l4NK2jK8l9J4J6q0L1J6K3M8m8l4m1M2O2
3644E9n7mKK4Nn1K8l3L2J2m0M8k3J4k8l1J06q3pJ6Rj7M5jk4Lj2Kk5M3npJ5l2k7
3679d4J08p6PL6n5K3j2k5J12j6n4K3J0n9Rn9M3L7K7o3K9K7j9oK1J2n9J0l0M3L4
3710C4o4J7l5K2P4j24R4l9QPqK2m3j7Q3k9n0M8lQJ8K3n1q5J01J6o5KO2o0pN2j9
3743hJ8j0J3o2K5M8L1n4kj3Qk3Lk5P3nL0j2On8M8n4L8NqJ1n5qL4rN2Ql4J7Mk8
3779DN2m0n4M7K1j22J16l7Jl6J3L0l3K3N8qm0Mk0M0L3o7L4n7K4L2m1j5P9n6L1
3810A6l9K6Pj4lM0l7K7ol6mjPm3K4N9m5kM2J7o3Pl0j4Q2m9L2j7Kj2pJ3K7K5o3
$$ plain form
3845 -32 15 -40 -6 -13 36 11 75 22 41 27 -8 13 23 -44 -24 15 -18 -33 45 1 11 -20 -53 -34 -65 -10 -8 -20 -13 76 -40
3876 -40 8 38 9 12 22 -40 40 -30 -10 53 -25 -33 -31 -29 28 -27 30 5 24 -1 -17 69 18 2 -23 5 7 5 4 -10 15 -66 -22 18
3910 18 32 13 -18 -13 15 -50 -4 -24 -5 -18 7 -18 8 -12 -28 9 13 -18 23 -10 29 -11 2 -18 43 38 10 39 -6 53 10 40
3942 40 6 4 52 21 -8 48 -7 17 -6 12 -46 -45 -16 55 35 67 10 -12 -10 -9 -23 8 9 -27 -11 31 -35 7 16 12 -19 -43 21 52
3976 52 53 13 12 8 23 32 15 0 3 -39 2 34 23 20 0 -9 -9 -27 -15 -2 -46 63 66 -43 33 11 -66 9 -10 32 32 -4 25 -41
4010 -41 12 -15 10 8 -19 -5 -28 6 -25 -46 50 23 94 11 25 29 45 -1 10 14 -42 -7 -8 -4 13 -22 -1 17 -5 1 -27 4 31
4043 31 35 -19 -18 -7 35 7 -15 -44 -15 -54 6 40 -14 44 -39 2 8 -22 21 10 13 38 19 0 42 37 -21 32 20 7 15 28 -28
4076 -28 37 40 4 -44 -10 -3 -4 -3 -46 18 23 -25 -29 -34 -26 -20 -25 16 23 10 -16 3 41 8 52 14 38 -45 -12 -10 27 1 38 11 10 13 -13
$$ packed form
3845c2M7n5L4pM9k5O4n3J9j4l5K1J0o7K0L9l3j5P8m4J0l1l3J9l1N5Kj2PQ9j16
3876d0M8L0k9LJ0o2Q0p0K0O3p8qKKN7n5N7k5J9k5j6Q6n1j6k5K8Kkjj4K5q1M4M0
3910A8J4j9l1NK8o5M6k0J9j3K5k5K6k0j6L7Ml1M1l3L9m0J3k0O1nk8K9m5N9m3L0
3942D0l4kM8l1k9N6n5K4k3J8n8JK9P1k0L2n7k2KJj4L1Jl6J6M2o6M2Rml1k4O4L1
3976E2Jm0jmJ5Rj7j5Lm2M1L2j1lk0r%j8J2J3m4J09Lj09P6k2p7P5j9M2%l6K9o6
4010d1N3k7K5kk7J4k3L4l1k1R6k7P1q3J4MJ6m6J1Mn6L5jMJ7l5K1J8k2Ok8L1K7
4043C1Mn4JJ1M2k8k2k9K9l9O0L4n4N8q3M1Ol0M3j1LK5j9j9M2nn8N3j2j3QJ3n6
4076b8O5Ll6m8L4PjJm3O4Nm8mnQOnM1Pj3k6J9L8l3M4l8K4q3L3KL7k6L7k7jLk6
$$ plain form
4113 -13 22 -15 31 -22 20 -37 -54 -6 2 81 4 52 -40 3 18 -55 51 24 -35 -27 21 -36 -11 -23 49 13 16 -2 33 -3 11
4144 11 -8 5 49 19 4 5 49 18 35 11 -43 4 22 -15 -15 25 2 -22 0 13 -8 -6 29 -30 -53 -32 -12 31 42 -18 -7 12
4176 12 -20 -1 -10 95 7 -6 4 30 -25 51 14 -6 -19 -17 -12 -7 -24 -24 25 42 44 -7 9 -25 24 23 7 -29 56 14 -28 15 28
4209 28 6 -12 -6 -19 18 -34 50 -10 7 -13 -13 7 16 13 7 -27 -10 23 37 29 -17 23 -38 -30 23 11 28 4 -11 48 9 -25 -11 51
4243 51 2 68 8 52 -15 15 -59 -31 43 -25 -66 -23 39 -60 -17 10 48 -3 25 10 -3 -7 -52 5 -9 29 -35 27 -20 29 38
4274 38 2 -17 -47 75 22 46 -23 -27 -58 53 4 16 4 -40 -27 -1 2 -73 -20 23 26 4 23 -50 19 -33 -18 -19 -15 19 -4 -3
4306 -3 10 7 -3 25 23 7 -1 -10 2 -12 17 -6 1 17 -82 -33 36 17 -39 -31 35 51 26 15 10 15 29 -14 55 -17 4 31 3 38 12
4341 12 38 -1 -24 -47 -37 -47 1 16 22 -15 17 27 102 -19 -27 -7 34 -6 14 -13 7 81 29 -47 34 36 11 55 45 24 6
$$ packed form
4113a3L5l7M6n3M2n7j7M8QP9p7M8r2M3J5p3J06k7n9QM8n7K5j2P2l6Lj8L5l6J4
4144A1j9J3M4l0j5JM4l1J7k4n4M7J8l7%M0k3k4K2J3k1KL5n9k3K1K0M3J1o0J1J9
4176A2l2J9rJ05q8j3J0K6n5P6l7k0j3KNNj7%M9J7Kn1J6l4M9jj6l6Q5m2m2M3J3
4209B8k2j8Oj3L7n2Q4o0J7k0%K0Rlol4J7L3J4qm6M0o1QN3j2J7k4j5N9l9l4J4O2
4243E1m9O6o0M4o7L0p4K8P4o8m1M3O2r9M3K7L8n1K8j5j3mm5N7j4L8o4O2m7M9R
4274C8l6j9l0J22n3K4o9ml1J11m9J2j2m4J3K6Lp5N3M3Lk2J9p3O9n2J5jML4k3J
4306cJ3lj0K8kj6qrJ2j4K9k3PJ6r9M9O9j9n6QO6J6k5j1nNJ4m3O9p2K1K7k8L5k6
4341A2K6l9k3k3J0j0M8J5Ol7L2J0P5j21qK0M1m0K0k7K0P4n2p6Q1Kk5M4j0k1j8
$$ plain form
4372 6 -36 -4 -43 -6 -18 29 2 20 -3 -49 -17 -22 2 -21 37 -11 -47 49 7 -26 -41 -51 -3 23 3 15 1 62 22 21 30 46
4404 46 11 -36 0 14 40 -25 22 44 -41 -3 32 -11 2 27 -6 -45 -38 -11 31 41 -4 18 59 16 26 51 1 -17 -35 -5 40
4435 40 0 -6 36 67 11 58 -2 -34 -5 -2 -11 -24 -4 1 -37 46 -15 -10 -35 -16 -1 16 38 -1 -23 -49 21 48 -2 -26 -26 -10 -17 -6
4469 -6 -6 21 0 39 2 -8 56 26 17 -11 68 -6 11 0 -18 -56 -21 21 -25 39 -20 48 -1 -9 -30 -30 11 -88 -38 37 -16 -7 -20
4502 -20 25 -13 11 10 -17 -20 -15 -28 -6 12 -22 43 2 -25 50 0 25 -54 -47 26 4 -19 -72 12 51 -28 17 23 -22 21 -1 -60 19
4535 19 -45 -5 -2 32 -10 -44 33 14 -7 23 -27 -12 29 -45 -49 -18 -32 -11 -29 38 25 -6 -31 -55 -29 -8 -45 63 42 20 1
4566 1 -3 72 38 36 -16 -52 -30 -17 26 11 41 15 6 2 5 -38 -30 -8 -21 -65 -80 -60 4 6 -29 -20 2 -5 -18 39 35 42 -11 -10 34 15 7
4603 7 -57 -2 33 21 -3 -23 16 -12 0 1 50 -3 18 8 -17 -4 11 -19 -9 97 52 -41 2 -29 -31 -27 -17 -29 -44 13 14 0
$$ packed form
4372Fm2L2l9L7j2M7k7J8k3m6L2nK4k3N8m8l6R6m2l3j5j0M8K6k0J2j4O1m0jRJ6
4404D6l5m7L6J4K6o5M7K2q5L8L5m3J3K5l3l9PK7M2J0m5K2M1m3J0K5n0j8j8L0M5
4435D0m0oM2L1n6M7o0l2K9Lrj3K0Nl8Q3o1Nk5J9J5J7K2l9k2k6P0K7n0k4%J6pJ1
4469f%K7k1L9l7j0O4l0rk8P9p4J7j1j8l8L5M2m6O4n9O8m9qk1%M1r9N0P5n3Rj3
4502b0M5l8K4jk7lNj3K2J8l4O5m1k7P5n0K5p9PP3k2k3n3Q4L9p9M5Om5M3k2n9P9
4535A9o4M0LL4m2l4P7j9k1L0n0J5M1p4mL1j4K1j8O7j3l1k5k4K6K1l7J08k1k2j9
4566AmP5l4kn2l6K2J3M3j5L0k6rmLm3QK2j3m4j5K0O4Kl5RK2pj3N7mPn3JM4j9q
4603Go4N5L5j2k4k0L9k8J2JM9n3K1j0k5J3J5l0J0J06m5r3M3l1kMJ0j2j5N7Jj4
$$ plain form
4635 0 -10 8 -8 24 21 24 73 -7 -35 0 42 15 -32 9 -2 3 9 16 52 -10 -23 45 -42 -13 24 -76 100 -23 0 -12 -14 -43
4667 -43 29 -23 -7 11 6 -1 32 17 -9 -18 52 17 41 19 -5 2 -56 -31 -20 -38 -20 -1 15 -9 5 7 96 -36 38 -10 48 -1
4699 -1 14 36 -61 -11 6 49 11 30 45 11 1 -6 -14 -11 17 -1 19 -7 -55 15 19 18 16 -19 15 -12 -54 26 33 -22 -1 27 17 -55
4733 -55 13 23 -24 33 -1 35 -8 1 0 14 26 -29 31 15 -25 -36 47 -44 -10 5 -34 -42 6 -60 0 47 29 -57 57 -24 4
4764 4 48 -8 37 40 12 12 49 -10 -33 -21 14 1 -4 -10 16 57 100 -6 22 -44 -41 -51 11 -9 -30 -37 9 -18 -29 35 15 35 -73
4797 -73 58 9 28 -13 12 -40 -3 13 22 19 13 20 22 60 -2 -2 33 38 37 -9 6 30 13 41 -5 19 -18 -4 -7 15 78 -9 20 1
4831 1 -38 -58 -5 -34 15 -36 4 3 8 15 13 -31 4 -14 11 1 69 -33 9 18 24 9 48 -10 -23 -8 12 49 34 12 -31 25 16 28
4865 28 6 -20 16 -5 5 -25 50 23 -9 1 12 0 17 33 -15 15 22 50 -13 7 15 -27 19 2 -36 11 30 -29 7 29 64
$$ packed form
4635@j0J8j6L2lLM9q0k8L5M2k7m7M1j1NOPL6o2j3O8q7K9L7j00J76j23K3j2kk9
4667d3P2n2J6J8npL3j5k6rP0l5K4k2k4Pn8K5J1j8J8J9J6k4J4KQ9j32P4m8N8m9
4699aJ5K2r7N0J7M3l8J9J5l4j0pqLK8j8K0k6m8P0Mjkl5L4k7m2Q0Pn5K1K8j0p2
4733e5O8J0m7N7l4L6m3RjJ4J2n5O0j6m0j1Q3r1L4J5l9qM8o6O0M7j8q6J14q1K8
4764DM4n6M5Lk8%L7n9k3J2L5j3noK6M1M3j06K8o6Lj0O2k0k1pM6k7j1O4k0K0j08
4797g3J31m9J9m1K5n2L7J6RloPKL8o2%L5Njm6J5K4j7K8m6K4l7J4lK2O3q7K9j9
4831Al9k0N3k9M9n1M0jNPkm4L5j8K5j0O8j02M2ROj5L9n8j3J5K0L7j5k2m3N6rJ2
4865B8k2k6L6k1J0l0P5k7l2J0J1j2J7J6m8L0PK8o3K0Qm2M6j7l8M7J9n9L6K2L5
$$ plain form
4896 64 15 14 -11 -28 -18 13 48 19 12 28 37 -37 30 25 -6 0 -31 7 5 -15 -25 15 -32 36 -21 27 -17 -27 21 4 9 18 -2 -2 23
4931 23 -4 -12 33 24 -27 39 -52 0 18 1 43 66 45 42 16 25 32 24 47 74 -6 -33 -28 -10 -18 13 2 -34 -59 -12 -41 -2 68 16
4965 16 -29 -17 -16 -7 6 8 -22 -49 34 19 -18 38 2 18 -51 -2 43 2 36 -5 11 24 -34 5 17 22 32 35 19 -26 0 -18 70
4998 70 -25 -15 -23 13 -16 -12 46 -29 27 24 26 2 5 7 22 -18 -4 -2 8 -27 28 -42 -50 54 24 14 -27 25 45 33 16 0 36 3
5032 3 -26 76 8 6 24 -20 -16 15 -5 -8 24 -34 -28 41 -46 46 -4 -8 26 -35 -51 -31 -20 -14 3 -10 -3 17 -32 -35 51 42 -19 -19 54
5067 54 -82 -14 1 11 46 -35 40 18 36 14 -59 34 0 46 26 -29 19 5 14 -7 -2 -9 -85 -4 -24 7 14 -33 -37 -12 -5 -32 19
5100 19 -20 5 7 -5 56 -33 39 6 -11 31 -10 15 -22 36 -19 16 -63 -17 19 19 -34 30 5 37 16 -5 102 -20 4 -6
5130 -6 -21 22 8 -2 -25 26 -11 -44 51 -2 3 34 40 1 -5 20 17 44 -16 18 29 -26 24 7 -23 -7 5 -27 20 17 43 3 -11
$$ packed form
4896F4m9jk5j7J0L1L5k9pJ6Rp4O7nl1Ol1L8kk0j0M0m7O8n7M8m4j0M8j7NRk0%K5
4931B3k7qM5rn1O6r1N2J8j7M2K3k1lk6RPqK3K7q0k7NJ8qL1j1l6k5M7k9L9P0n2
4965A6m5J2JRJ3Kl0k7Q3j5l7N6l6J6o9M9M5m1L4m1J6J3n8L9J2NJ0Lj6m5K6j8Q8
4998G0r5J0qL6k9MN8p5N6lKk4LKJ5m0J4KJ0l5N5p0qJ04l0j0m1N2K0j2j7j6L6l3
5032Ck9J02o8kJ8m4ML1k0lL2n8OO9q7R2n0mL4o1j6K0J1OJ7j3PK0m9lQ6ro1%P3
5067E4j36O8J5J0L5q1P5k2J8k2p3R3l4M6k0n5M8j4Rk1Npp6Q1k0L1Pm7mK5Pk7N1
5100A9l9K5Kj2O1q9P2l3j7M2m1K5l7N8n5L5p9M6L6%n3O4k5L2k1k1J07j22K4j0
5130fj5M3j4j0k3N1l7l3R5n3NL1Ol9oK5lK7o0L4J1n5N0j7l0J6J2l2M7lK6m0j4
$$ plain form
5163 -11 11 -16 6 28 47 33 -16 17 6 -13 -50 -33 39 25 -30 15 33 14 -5 9 47 25 -38 28 51 3 -57 39 2 6 38
5194 38 -52 6 32 59 -10 41 43 32 -27 39 -19 -13 43 1 -22 -63 11 -7 -6 52 -10 -62 -9 9 -43 3 -42 -35 21 -3 52 -10
5226 -10 -37 66 -19 29 -36 -36 -17 -24 2 16 29 28 55 24 32 -16 38 15 17 45 22 26 24 5 24 -17 -66 36 28 -22 -31 8 2 -9
5260 -9 -24 -69 -38 5 -6 -8 -20 -35 -16 6 22 -43 -31 11 -13 -54 6 -19 16 72 -24 -2 19 -30 49 -2 20 27 44 23 14 13 -22
5293 -22 22 -58 -24 7 19 -2 -28 14 -36 -37 -41 50 13 -22 -22 -36 0 13 -10 50 60 9 -18 13 -7 58 4 -1 -10 -34 3 -51 14
5326 14 -20 43 -56 3 -9 -24 10 32 -9 56 -14 19 -24 -49 -12 -63 -1 -6 -21 32 -49 4 10 39 16 -5 -49 6 52 70 -9
5357 -9 33 40 -6 -17 -2 0 -15 -9 30 0 2 46 -1 27 -33 -29 12 -8 45 -1 14 9 -29 -44 -35 -58 -42 -24 -30 -31 12 -20 -11 -49 41 39
5393 39 32 3 16 -45 -7 6 -10 -32 47 -45 -38 -8 58 38 10 -45 -30 4 -24 -29 -4 11 63 -41 -47 14 3 37 -28 -1 0 2 7
$$ packed form
5163a1K2k7K2K2J9j4m9L3j1j9l7J7P2j4n5M5J8j9j9J4L8k2o3O6K3m8o0R6l7ML2
5194C8r0N8K6K7o9N1Kj1n9O6n8ON6m2k3m1P4j8JN8o2n2N3J8n2M6m5PN6k4N5o2
5226a0k7J03q5M8o5%J9pK6J4J3jK7l1Qm8N4k3KK8k3Mkj9J9m1m9J02qn0rL9oj1
5260ij5m5L1M3j1kj2j5J9K2J6o5J2M2k4m1O0k5L5N6r6K2K1m9P9n1K2PJ7k1rjl5
5293b2M4q0L4L1J2k1k6M2n0jmR1l7l5%j4L6J3k3O0J0n1k7L1k0O5n4nrk4L7n4O5
5326A4l4O3r9N9j2j5L4K2m1O5p0L3m3k5L7n1O2nj5N3q1N3OK9k3k1m4N5M6J8p9
5357iM2Pm6j1J5Kj5OL9l0KM4m7K8o0MM1k0N3m6J5nl8j5Rk3J6J8ojM3l2Rl8R0k
5393C9pk9J3o1L8J3j6k2P9r2PL0O6k0k8n5J5L4k8nK5J5N2j04oO1j1L4o5K7JKN
$$ plain form
5426 7 5 0 16 -66 -46 22 -10 -9 27 28 82 24 18 25 3 73 -13 5 10 -22 7 28 4 -5 20 -21 -11 39 -30 -11 -2 49 -65 -16 39
5461 39 -22 3 -26 -41 -19 -31 -27 -40 9 9 -24 53 -21 -31 -27 -22 43 16 -9 -1 49 -31 7 39 13 -3 -16 -21 3 -19 12 9 -58 -25
5495 -25 35 -16 -61 -42 -15 0 -32 21 32 -38 -2 50 -71 -1 -37 -2 2 -6 -7 47 15 -11 -16 21 5 1 3 44 14 -62 -11 25 17
5528 17 7 32 59 -2 -14 8 -3 38 23 -2 5 11 -12 40 -16 4 -31 -21 -28 -19 21 -23 -33 -24 -53 -49 -21 -4 19 41 29 -13 -24
5561 -24 5 22 -22 -2 -19 -8 17 5 29 22 19 30 20 -18 27 28 -30 -43 7 66 23 -3 -24 37 32 -39 -7 -17 7 -17 8 71
5593 71 -7 -19 -16 51 -4 40 50 18 9 28 -25 36 65 23 -33 25 55 25 -22 -6 33 23 37 -8 23 62 -17 27 3 -58 -14
5624 -14 -7 24 -52 53 -45 -16 -30 -77 -42 -8 2 16 -52 6 -89 4 -51 17 -53 -12 11 8 8 -38 1 23 1 24 13 26 54
5655 54 2 3 -22 -34 -15 27 37 19 27 -43 -38 -4 -3 35 -20 -20 -15 17 -34 -53 20 -16 -1 -16 20 -2 -59 -48 19 -32 -44 -4 -19
$$ packed form
5426GknJ6q2K0O8l2JL6JN4n8oPk2P0q6J8Nl2K9K1k4rK5m1J0N0o9J9RN1j14M9N5
5461C9o1K5k9j5K2j2Mj3M9%l3P7p4j0MNO5k7k5QN0q0L8L2k6j6j3nK4k2L1lo7L3
5495b5O0n1m5J9K7J5l2N3J1p0L6N2j21P0l6L5MqjN4l2k6nL7j6mKM1l0p6N1L6q
5528A7j0K5K7o1j2K2j1M1j5k5POk3N2n6K0l5J0pRM0m4j0Rk9MK8J7K3K2j2m2j1
5561b4K9J7m4K0j7J1K5j2K4plJ1j0l8M5Jn8j3N0N9m3k6k1O1np1L2j0K4k4K5O3
5593G1p8j2LO7n5M4J0l2rJ9n3O1K9m2n6N8L0l0m7J6L9j0J4m5L1L9p9M4k4o1M4
5624a4PL1p6J05r8K9j4m7L5L4J0J4o8N8r5R3n5O8p0M1K3l%m6L9K2k2K3j1J3K8
5655E4n2Jk5j2J9M2J0j8Qp0NL4JL8n5%NL2n1j9P3l6J5j5L6k2n7J1O7n1j2M0j5
$$ plain form
5688 -19 11 0 -24 -61 -48 -7 35 -17 11 29 5 9 -18 -35 41 -36 25 -16 -5 18 16 56 -23 -12 31 72 3 29 -23 -7 14
5719 14 0 -15 -57 50 31 -7 -46 -22 -57 -2 -20 -8 12 60 -51 -9 -15 4 3 20 61 6 31 -27 12 44 25 -54 -81 -15
5749 -15 -39 10 21 16 45 42 -13 -23 2 -51 22 -27 17 -51 -40 -25 -20 5 -45 27 -25 3 -11 -7 16 -18 -15 -20 -28 -53 14 21 -30 -1
5783 -1 39 13 -17 3 13 -32 69 -18 -19 85 13 26 -19 -12 -28 -50 9 -10 -52 63 78 35 18 -31 5 -9 5 -53 -68 -17
5813 -17 46 -2 -20 8 -16 39 7 -2 -7 -27 -26 60 -33 -1 55 -7 -12 -34 -37 -2 -62 -15 13 -3 -76 -29 37 -45 2 6 1 6 -4 -7 -5
5848 -5 31 -11 -46 65 -36 -2 -26 13 56 27 2 18 -50 -30 15 -64 -27 -14 -33 4 -15 13 -60 17 -28 -6 24 16 -25 7
5878 7 20 17 -4 30 22 10 44 49 28 34 -12 27 -8 -1 10 -52 32 60 -26 15 -66 56 61 -3 25 -2 -12 53 29 42 -12 -27 21
5911 21 -32 12 40 -14 15 11 -10 36 28 31 -12 -60 -21 22 -38 20 7 -9 49 9 -5 -3 -20 -18 23 -5 -31 -11 -22 -25 26 9 -25
$$ packed form
5688a9L0j1k4l7J3M1M2n2K8J8k4Mk7j7P6p7O1m1J1K3kM0p9J1M3M1o9K6n2J6K1
5719A4j4j5m2J07j9l8l9K4l5N5j8J2K0M8j11M2oJ9jJ7M1n5K5n8L9L2j9p9k7O6
5749a5k4M9J1nK9ln5j0K5n3P3m9M4o8J1J5NK5n0P2n2K8j4MK3l4Lnqk5O7Pn1K9
5783aM0k6l0K0J0m5J01q7jJ04p2J3m5Pj6k2N9j9m2J15J5m3j7m9L6j4J4n8j5N1
5813a7O3m8j8K8k4N5l2rnk0JQ6r3L2N6o2nk2lL5o0M7K8j6p3M7O6q2M7MnNj0lK
5848eL6m2l5J11j01L4k4L9M3k9k5J6o8K0M5p9L7J3j9L7j9K8p3P7m5K2L0qm1L2
5878GJ3lk1L4qj2L4Nk1Om6L9l5PJ1o2Q4K8q6M1q1J22No4K8k7j0O5k4J3n4j5M8
5911B1n3M4K8n4K9mk1M6qLm3m8L9M3o0N8j3j6N8m0j4Kj7KM1k8k6K0j1lN1j7l4
$$ plain form
5944 -25 -42 -72 16 -31 36 -13 -13 -13 8 40 17 -74 8 38 -45 -16 -25 -21 -3 -42 -50 4 -19 -13 -17 -7 -2 -25 42 12 -28 -24 13 7 -13
5979 -13 27 12 -7 -11 23 13 18 -3 46 -25 5 -4 -13 -21 16 6 -15 -16 4 -31 -28 28 -4 21 -6 2 -22 25 71 63 -10 11 0 -14 -24
6014 -24 -25 29 15 10 29 -44 17 44 -10 33 -37 20 -1 21 5 -10 5 -23 -8 7 -10 27 -44 -23 -18 17 12 -7 -3 -17 7 -26 73
6047 73 -12 -20 -7 8 35 -41 5 -5 -11 33 6 -35 58 5 33 5 -28 -12 16 18 -28 -7 -12 28 -27 28 55 41 -9 30 30 31 -68
6080 -68 -26 -1 -47 -7 -21 -18 25 -87 -2 25 -92 -8 38 31 7 21 -5 -87 -49 -32 -59 7 -15 -17 -6 23 0 -31 -24 29 24 -7
6112 -7 -16 -25 12 3 -33 12 -25 9 -46 5 21 5 21 -9 31 9 -61 9 50 -14 41 -34 39 35 -6 25 -40 16 21 8 -2 -8 67 -37
6146 -37 20 3 -55 -12 -19 52 -24 -14 -5 29 24 -2 -54 -5 -17 -13 36 -17 19 13 10 -59 51 51 -39 6 -29 -14 24 -37 -48 -3 -23
6179 -23 -4 -9 -6 -29 -51 -26 -25 19 -42 27 -19 -20 0 30 -4 5 -10 21 14 -21 8 -42 -13 38 -15 53 14 7 58 50 11 -19 2 -5 -4
$$ packed form
5944b5j7l0Q8m7O7m9%%K1L2k3r1Q2L0q3K9rMJ8l9qN4k3OmJ0Nk3O7l0m0ML7ok0
5979a3M0j5j9mL4j0Nk1M9p1L0rrqL7j0k1jK0l5LN6l2K5k7Qk4M7M6qp3K1j1j4j0
6014b4jN4j4nJ9p3O1K7n4M3p0N7k1K2j6j5J5k8J5J5j7L7p1K1NL5nj9Mj4K4l3R9
6047G3q5qJ3J5K7p6M6j0oM4k7m1R3n3K8k8l3J6K8Km6K1nM0n5N5K7j4n0L9%Jr9
6080f8M2K5m6M0j4LM3j12Q5K7j17Q4M6pk4J4k6q2L8J7k7O6k2kJ1K9k3l1PN3nl1
6112grrL7rl6M5l7L4n5N1J6j6J6l0M0k2p0P0M1o4N5p5P3mm1L1o5N6Nj3j0oP5j04
6146c7N7j7n8M3pP1p6J0RL4nk6n2M9j2MM9n3L6olo9J10%r0M5l5J5L8o1j1M5k0
6179b3J9nLk3k2K5JM4o1O9m6jK0L0l4Rj5L1pl5K9n0K9N1n3O8l9pN1ql9l0K1pJ
$$ plain form
6214 -4 -24 -63 -11 -17 -33 10 -12 -14 48 -2 19 1 -29 9 -12 54 8 29 15 90 -2 -9 16 20 2 -29 12 -42 -30 23 -22 26 42
6247 42 13 48 9 47 2 -25 -34 22 -35 16 0 47 17 17 -47 -52 36 5 4 -3 -23 12 -35 45 -36 -29 -10 25 42 -2 12 -14 42
6280 42 46 36 -34 21 22 -34 45 0 63 13 -32 23 24 -45 -32 -4 -2 -12 13 -15 24 -31 47 18 -10 -10 2 -33 37 33 19 20 -61 -8
6314 -8 28 -37 -35 18 12 -6 -19 7 -65 33 -27 -32 -81 28 4 -27 50 -9 0 37 -29 55 -6 22 -15 -29 -71 -31 12 -9 42 -7
6346 -7 36 -4 -6 48 -31 -4 13 -34 -50 16 -24 11 28 -6 13 19 22 41 54 -4 66 14 22 21 10 46 -32 3 13 14 15 -3 15 -36
6380 -36 7 18 -7 -2 -43 -35 37 -22 42 -15 -8 -24 20 6 29 -16 -48 -20 21 -11 -15 4 48 16 30 5 33 -28 -20 31 -22 -15 -8 35
6414 35 -7 12 -34 28 -28 23 -31 -46 16 14 -1 16 -8 -23 23 40 -16 -1 31 -6 47 -65 -9 -24 -37 -17 -34 18 52 -4
6444 -4 -18 10 -6 4 31 -29 -15 65 29 24 4 -25 -9 66 6 -35 89 -52 -22 -48 -12 2 2 24 -3 -40 -2 -4 -22 2 1 21
$$ packed form
6214dk0l9N2oj6M3k2kO2n0K1j8l0L8k1O6m6K1j4P5r2pK5Mj8l1M1n4J2N3m5M8J6
6247D2k9L5l9L8m5k7rN6n7N1j6M7l0%o4nQ8l1jpk0L5m7Q0q1PJ9L5J7m4J4k6N6
6280D2Mj0p0N5Jn6P9m5O3n0m5N5Jo9J3K8Kj0K5k8L9n5P8k9k8%J2l5P0mj4Jq1N3
6314hL6o5KN3oj8j3K6p2R8o0nm9J09k4l1P7n9RL7o6Q4o1K8l7j4m2M0M3k1N1m9
6346gM3m0kN4p9K7J7m7j6O6m0L5J7l4J9OLJ9J3n8P0n2Qjj1L6p8L5J0JJj8J8n1
6380c6M3J1k5Nm1QP2n9O4n7Pj6M4j4K3m5l2K8M1l2mJ9M4l2J4k5K8o1QN1n3PPM3
6414C5m2J9m6O2n6N1n4j5O2kj5J7k4j5M6J7n6J5L2l7N3j12N6j5j3K0j7N2L4n6
6444dj4K8j6J0K7o0J4Q0l6nk0k9J6P5o0m1J24j41L0k6L6J4%K2k7l7L8kj8K4jK0
$$ plain form
6476 21 4 -26 -46 12 -23 76 25 61 1 -19 -33 6 38 -16 1 0 -6 -37 30 -5 71 7 21 5 -2 -27 -32 -54 -7 2 16 -6 -19
6509 -19 -9 -65 25 10 -14 11 -14 -29 -3 6 37 -10 17 31 -5 8 0 29 10 21 -15 34 67 -21 26 -1 75 14 26 -33 10
6540 10 -34 15 -22 8 38 29 6 -12 29 -42 -41 29 -21 -64 -14 4 5 -17 -28 32 -16 31 -69 -62 14 -3 54 -24 7 4 1 15 -16
6573 -16 54 19 -25 -11 3 36 -14 -9 47 32 12 -2 -19 -30 -8 8 34 -19 38 35 -38 3 -33 -25 -40 -5 -40 -9 17 2 -23 28
6605 28 -1 22 -9 -28 11 -22 51 -8 -18 12 30 35 -8 14 4 27 39 16 20 0 -19 23 19 -3 -26 21 -8 1 -34 -30 -11 29 -12
6638 -12 -17 -17 2 47 26 -12 -19 12 31 -32 -22 27 -49 11 -64 -37 -30 16 11 -25 30 -23 -96 -7 40 -41 -19 -8 39 -52 -29 35 0
6671 0 23 -15 -6 18 -32 -25 0 -51 -12 -37 -43 -21 -9 -8 26 -55 -17 69 55 33 29 -15 -62 -30 6 -54 11 8 -20 3 5 -43 -11 10
6705 10 0 -51 -37 -4 -31 30 14 -5 20 13 33 27 3 -32 -16 -12 -27 17 53 -22 26 -37 36 30 -25 -22 -2 1 43 -46 34 -26 44
$$ packed form
6476B1j7l0k0N8l5R9n1L6o0k0j4L9L2n4J7jol1O7l5P6o4J4j6pk5nk2M7RJ4k2j3
6509a9J0n6R0j5k4K5k5j5K6RL1m7K7J4l6J3qK9j9J1l6M9L3q8M7k7P6o1J2n9M3
6540A0m4M9l7L0L0rk3j8M1p1JP0n0m3N0J8Jk2j1O0m8M7j00PP6j7N7p8L1llJ4l1
6573a6P0l5m4J4J4L3n0NN6j5k0j4j7j1K2J6K6n3N7lp3M1l6Qj5L5l5L1K6j5k5N1
6605B8k9K3l1j9L9l3P3n9j0L0J8Nm3K2j0K3J2k3Mk0j9M2mk2k3M7k9Rl5MJ9M0m1
6638a2n%J9M5k1l8pL1J9o3J0M9p6O0p5K7PM6nl6N5n3p3Q9M7q1K2J1M7r1K3O4l5
6671@K3l8RK4n0PK5n1L9k5oK2J2JL4q1L8Q6j4k2mm4m7L2L6o0O5lk8K3Km8L2K1
6705A0j0n1J4L3k7O1j6j9K5pK0ok4l5J6Mj5M4L6p5M8o3P3on5LK0LM2q9Q0o0P0
$$ plain form
6738 44 6 8 -30 -27 24 -14 1 35 -43 5 -10 -12 -27 -4 13 28 61 -24 32 -18 -12 -46 14 -32 -7 29 59 -45 23 -9 8 -38
6770 -38 -4 1 0 36 -26 -29 -57 -12 -22 14 -31 35 -10 -21 21 -13 -5 49 9 32 30 -46 -9 -39 28 -4 10 47 20 -3 15 2 -46
6803 -46 -10 21 4 -34 -35 50 19 -15 7 16 12 -26 -8 -5 8 -28 27 -40 36 7 -8 -42 -9 23 -24 -35 14 22 -34 -94 1 43 -7
6836 -7 -20 -37 16 3 -33 -57 -5 35 32 -2 -33 -40 7 5 27 -17 24 35 7 15 -19 28 27 -27 -17 56 28 6 -19 13 1 13 -47
6869 -47 -21 18 6 20 -11 2 23 8 4 19 -47 -9 1 -8 -80 46 -13 -42 -9 33 14 34 -17 11 -14 1 -5 24 47 -41 -2
6900 -2 27 14 -30 -17 24 11 32 4 -25 -33 16 8 -27 -22 -50 -25 -48 -21 17 -8 27 -86 -41 -35 -70 -16 31 -87 -52 0 -16 -31
6932 -31 -49 56 45 13 1 -9 -5 -9 11 -47 -42 5 -12 40 32 3 -24 -27 6 38 -4 -32 -36 -28 -29 -10 -26 30 -20 22 26 27 -30 -29 37
6967 37 27 30 -96 -20 75 -16 11 5 -21 21 6 -10 -40 27 0 15 -35 -25 18 0 21 13 38 -36 -11 27 -31 -27 26 -23 -2 43
$$ packed form
6738D4l8Kl8LN1l8J5L4p8M8j5kj5K3J7J5L3q5N6n0Ol4O0m6K5L6L0j04O8l2J7m6
6770c8L4NjL6o2lk8M5j0L6m5O6m5j1M2l4QN4m0K3kp6L7l0O7l2J4L7k7k3J8j3m8
6803d6L6L1j7l8jQ5l1l4K2Rml8J8LJ3l6N5o7P6k9j5l4L3L2m7j1M9Qn6o0R5M2n0
6836gj3j7N3j3l6k4N2M0ll4l1pM7kK2m4M1J1k8Ql4M7jn4J0P3k8k2k5L2j2J2o0
6869d7K6L9j2J4l1J3K1j5mJ5o6L8J0rp2J26n9k9L3M2j9K0n1K8k5J5oK9K3q8L9
6900bK9j3m4J3M1j3K1k8k9qM9ql5Nk8K5k3K7L8k5L5j13M5Ol5N4M7j18L5N2j6j5
6932c1j8J05j1l2j2j0MmK0n8NM7j7N2qk9k7lL3L2m2k8mQjJ9j6N6n0M2MJn7JO6
6967C7j0Lj26P6R5r1K7ok6M2j5j6l0O7k7J5n0J0M3j8K1qK5p4K5L8n8MN3m9K1M5
$$ plain form
6999 43 27 21 12 56 -26 26 8 12 -5 0 9 -16 54 -3 26 -19 30 7 -22 -48 3 -52 13 51 -7 18 13 -27 4 14 -37 -25 -30 23
7033 23 38 13 -34 -9 -6 -29 -26 -45 -32 -21 48 39 -33 31 11 18 -33 -19 -25 5 -12 -3 30 -48 5 -3 33 26 18 -22 -31 19 -1 -15 39
7068 39 37 -10 30 53 17 8 -11 -57 15 29 11 3 36 10 -2 -7 28 -21 6 -27 -29 -7 -20 20 -44 -56 -72 -75 -38 -29 28 -52 13 39
7102 39 31 -13 -39 -15 -2 0 -3 -35 -3 1 28 8 -27 13 10 50 5 42 20 -16 15 -33 40 33 61 -28 -8 24 37 48 11 -21 11
7135 11 -3 91 -53 34 78 -63 42 -23 -18 -13 9 -3 -53 -48 -34 -23 24 18 45 -3 9 68 -28 -6 -10 13 -51 14 -33 10 29
7166 29 17 4 8 -56 -3 23 -26 4 2 -22 -30 23 -33 -13 -20 33 18 19 -63 -7 -1 41 -9 26 16 -45 75 1 -11 23 -47 -20 -16
7199 -16 -40 20 -52 -4 -1 63 54 32 -20 -35 20 14 -10 -16 -12 -3 21 44 -30 38 72 -64 -4 -4 -12 -58 -25 -21 7 18 24 21 16 35 -49 6
7235 6 -5 0 49 -29 9 -10 24 42 5 32 41 -28 -15 17 -27 5 3 6 -40 7 8 37 -25 -16 29 1 21 4 -51 25 4 -19 -33 -6
$$ packed form
6999D3j6orM4q2N2j8Mj7NRk5P0n7K9m5M9k3k9k6N1n5O5L8n8K5nm0L1J0n1J2nN3
7033B3J5k5m7K5Lk3Lj9J3J1O9rp2O4k0Pn1J4oL0j7RL3p8N3qL6pqm0rN0k0j4N4
7068C9km7M0K3l6rj9m6P2J4j8qL3k6j2nL5m9K7l3kK2j3M0o4j2j6lL7RN7q0O5K6
7102C9qm4k6K4J3Kll2L2MK7k0l5M0lM0m5L7k2l6L1m8P3pK8q9K0L2J3J1l7l2L2
7135A1j4R4j44Q7M4j41J05o5NNK2j2n0NJ4J1M7oK7m8J2N9r6K2mK3o4O5m7M3J9
7166B9j2j3Mo4N3K6m9L0kk4qN3n6K0pN3j5Jq2N6OM2n0L5j0o1J20p4j2L4p0K7M
7199a6k4O0p2M8LO4rk2n2j5N5ok4oMRK4K3p4O8L4j36O0%qm6L3MK8J1OlnJ9q4N5
7235Fj1NM9p8L8j9L4J8l7K7Ro9J3L2m4L2kLm6M7JK9o2RM5k8K0j7n5P6k1k3j4K7
$$ plain form
7269 -6 17 -34 -16 19 -40 -18 -38 11 2 47 32 -40 -23 24 -12 3 -29 -58 27 25 -5 -14 -15 -13 42 -25 15 -36 -25 -38 16 4 -4 28
7303 28 -16 -47 -37 37 9 0 -53 30 63 -2 16 27 -7 -25 7 34 -5 3 24 -18 7 -17 -50 21 8 38 -15 16 -22 -4 -32
7334 -32 14 35 -7 6 30 37 44 -8 -19 29 24 -3 14 15 -10 9 -32 -13 -53 2 -38 -16 -36 23 11 -21 -3 18 -1 30 -41 11
7366 11 0 -6 33 26 7 4 1 26 -5 -23 32 -57 34 -8 -84 -28 -51 -9 -32 -36 -3 -11 -5 -3 -23 -12 -14 10 28 -8 34 -11 35 23 28
7401 28 -36 56 84 2 44 -16 24 -1 -9 23 -44 -43 55 3 -25 -25 36 68 -19 -36 -8 -13 -65 18 -38 -54 -54 6 8 29 -31 -49 1
7434 1 18 23 -52 -6 7 38 8 -15 -28 -17 0 -37 -7 51 51 27 -1 32 -15 4 -14 -24 63 -12 32 23 -7 35 -4 -4 21 13 -23
7467 -23 14 10 -27 -1 13 -39 -6 -74 25 36 0 -20 36 -23 -17 3 33 -24 0 29 4 54 68 -39 -51 4 -72 54 11 -34
7497 -34 46 -27 -21 11 -22 -15 -33 6 23 31 -14 -18 -2 -13 1 -13 24 19 -1 -4 -41 -40 -24 30 -8 -25 -24 15 -7 -21 7 -54 -1 62
$$ packed form
7269fK3n1J8L5n9K2k0M9rM5j5p2J7M7l6J5l2k9Q5kl0rjKN5o7M0n1J1j3N4j2qL2
7303B8m4l1J0P4k8rn3Q3L3o5J8J1l4j8L2K7l9QK1m2K5k4l3P1j3L0n3L1l8J8k8
7334c2M6K1m2J3K4PPn2j1M8nk7J7Jk5J9m1J9m0N5m0K2k0N9j2l2J8K1j9L1p1N2
7366A1j1oL9pj9llK5l1j8N5q9R1m2p6N6k3M2k3mL3qOKk0J1kK4J8l6M2m5M6j2N
7401B8o4R2K8q2M2o0M0k5qL2o7JR8n2k8%O1L2q7j7K8nn2Q3n6j6%O0KK1o0j8N0
7434AJ7Np5M6J3L1l0k3j3J1J7l7L0N8%k4k8L3m7J9j8j0Q7p5M4rl0M2l9%K5ql6
7467b3L7ml7K6J4n2L3o8R9J1l6k0N6n9OK0L0n7K4K9k5N0J4j07j2N5p6J26m3m5
7497c4Q0p3OL2l3Pj8L9J7Qm5mJ6j1J4j4L7nk0ll7JJ6N4l8j7JL9k2j4K8o1N3O3
$$ plain form
7531 62 -1 28 12 -38 -45 -30 -9 -64 -5 -15 -23 38 68 31 5 -2 9 -29 10 13 67 1 19 -53 -12 -2 21 6 8 -60 8 22 23
7564 23 45 4 20 -2 84 -6 -6 24 13 32 -35 -41 -24 -2 -35 -21 4 -8 11 3 46 -44 29 19 -34 30 -25 14 -27 8 73 -14
7596 -14 -16 -42 5 20 24 27 8 -6 -68 -50 -5 -6 20 51 34 -2 -1 8 -37 -12 -29 -22 -47 -15 -33 -8 -25 -39 33 22 26 -13 -11 2 -16
7631 -16 -47 -14 5 21 21 -7 30 37 28 -28 -13 -12 11 34 -21 9 20 10 34 -20 13 -28 27 12 -16 -14 1 11 -32 -3 17 3 8
7664 8 -9 32 30 -31 -36 11 18 10 -1 4 -9 3 45 53 43 -18 -27 -55 -6 -4 29 7 -34 -9 -37 -32 -33 6 1 10 -23 15 35 6 16 -24 7
7701 7 0 48 -11 9 6 -21 20 24 4 5 28 -17 10 21 39 -21 6 29 -7 -6 -4 5 -42 -19 -7 -13 -16 2 32 -32 -36 14 22 30 -22 21 -47
7738 -47 -37 28 35 -11 53 -24 -27 12 26 40 26 -25 -13 -20 3 27 -55 15 9 5 27 -47 22 -3 -12 -57 -67 -35 -21 11 -1 -64 11
7771 11 -14 -5 33 46 -34 20 34 -37 -12 -28 -3 28 17 -63 7 25 -3 1 4 25 -36 -9 -18 -51 12 -4 42 22 4 -38 0 -21
$$ packed form
7531F2o3K9j6n0pJ5K1n5N9j0qO1L0l7k6pJ1l8L9LN4o6J8p2M1J0K3j5Ko8O8J4J
7564B3K2m1J6k2Q6r0%L0j1J9o7oJ7K2l3J4K5j2J9qM3r0P3j0n3O4n5L9m1L5O5q7
7596a4kk6M7J5MLj9j4o2J8M5jK6L1j7l6JRm5K5j7Pk5L2j8K5j7j4P2j1Ml9KJ3j8
7631a6l1L3J9J6%k8L7Prn6J5JK3K3n5L0J1j0K4n4L3m1N5j5k8KJ5J0m3K9K0j4N
7664Hj7M1ko1nM7Pqj1Nj3J2M2Qj0o1rk8M9KL3k2m1K5k8NjL9nRl3L8K0k9J0m0L1
7701GpM8n9K0lk7M1Mk0JK3m5K7J1J8o0K7K3l6JKRm7K3J2olJ8L0o4mN0QQn2M3o8
7738d7J0O5Pm6O4p7lL9J4J4j4n1J2pK3K4q2P0omK2p4O9k5rm5j0L2J4L2j2o3P5
7771A1k5RL8J3q0N4J4p1K5j6K5L1j1q0P0J8k8MLK1o1K7rl3O3j6M6k0j8m2L8k1
$$ plain form
7803 -21 33 24 -47 10 4 0 4 -4 -1 -57 19 -96 37 -16 -58 21 -33 -24 -4 26 11 22 -12 10 3 -4 3 23 24 10 19 39 -43 -19 42
7838 42 -10 -4 22 44 6 -1 -10 5 11 19 -37 -28 -16 44 -10 24 15 0 -1 25 -50 33 -58 7 -21 -21 44 -9 1 38 17 30 30 12 18 -20
7874 -20 -10 -24 -2 -36 -69 17 4 13 3 -24 -51 -21 -12 -22 -23 9 -23 -77 26 28 -5 -19 -6 -37 -121 0 -5 -15 10 -26 10 5
7906 5 39 44 2 -37 -6 49 -34 64 -46 -41 31 -23 19 26 -25 11 -15 -21 2 -12 19 -21 -51 -4 -65 -32 -27 -4 66 45 45 19 29
7939 29 0 -4 35 -7 13 23 12 -24 35 3 42 -45 3 15 -19 -4 13 4 36 22 -12 -17 4 8 4 42 -7 -16 4 -25 -56 15 16 -68
7973 -68 1 9 -46 -4 29 -13 31 11 -15 3 58 22 -61 -22 26 -39 34 53 -10 -24 43 22 54 -18 22 34 24 24 -25 4 -36
8004 -36 -35 -47 24 28 -16 -61 -16 15 -39 19 -28 14 -45 22 8 -22 -5 -24 17 44 34 -42 28 1 9 -23 -25 -10 19 -28 1 25
8036 25 -16 28 -26 -9 55 -6 -1 1 51 5 21 6 -5 -70 -28 14 -28 -9 25 2 -28 -24 16 29 -17 -24 -46 -26 18 -1 7 -3 -36
$$ packed form
7803b1N4rp1N7omMqLn6P6j15J33n3m2P9n4RK0L0j5J1l4K2ppPK0Jj4RK0q2K4O1
7838D2n2OK6K2l8prJ5OQn6RJ2O0n4L4rj5jK6p5Q3r1O5k8%O5n3J0L7k1J3%j8Ol8
7874b0J0j4K2l4l3Q6j3Rj0k7k7L0Rj0jL2l2n4J03Kl3j4J3l1q4J21nj0K5l6L6n
7906EL4Nm2l9L1N5q3R8j10NP2n4M2Pn1L6k6oK3j4L1m0l0M7o1L3NK3P0k1%k6J0
7939B9k9mL9m2K0J0j1l6N9l2L9q7M8J2l4J5J7rL2j4l4nK1MmL8m9rK0k9l1P1Jq4
7973f8O9Qn5M2L3m2M4k0k6J8N5l6q3L9M8o5P3J9o3j4O7k1L2p2M0J2j0%m9K9m0
8004c6Jj2P1Mm4m5M5L1n4N8m7M2n9O7j4l0J7j9M1K7j0p6P0k7Ql2kJ5K9m7K9K4
8036B5m1M4n4J7O4o1NKN0m6J6j5j1o5M2M2m2J9L4k3l0MM0J3m6pk2K0M4j9Qj0l3
$$ plain form
8069 -36 -14 -34 -9 49 -7 -59 42 -24 19 -50 -19 -25 3 16 -22 -8 -12 14 3 16 41 10 -35 6 -43 -7 34 63 -7 12 4
8100 4 -17 0 -22 45 -8 -15 -11 -48 56 1 -22 -9 19 29 -37 -19 -11 62 91 -11 -23 58 0 -51 7 -34 47 -14 -33 28 28 -81
8132 -81 -35 49 -70 35 -20 -50 -36 -46 -62 11 -20 -11 -35 -14 -27 -34 -19 1 1 -29 -32 1 -28 -16 5 -32 41 -30 17 9 32 -5
8164 -5 -38 -18 -76 33 -22 -50 -5 57 -3 12 2 4 47 -19 -40 -12 -14 -6 70 17 23 55 2 34 6 59 47
$$ packed form
8069c6K2k0K5N8n6n2J01o6M3o9L1oK8J3l8J4mK6j1J3K5l1m5M1m9L6M1K9p0J9q
8100Dk1J7k2O7n3pMl7J04n5k3J3K8J0o6J8QP3K9j02j2Q1n8n1N8m1Q1o1j9O1%j09
8132h1M6Q4j19J05n5l0J4j0j6P3l1Rk4K1j3pJ5K0%l0lL3k9J2K1l7P3p1M7qK3l7
8164el3K0n8J09n5k8M5O2o0J5j0KM3o6k1K8kQP6n3OL2n3L2k8N3j2
8191D7
$$ Imaginary data points
##PAGE= N=2
##DATA TABLE= (X++(I..I)), XYDATA
$$ plain form
0 0 0 0 0 0 0 0 0 0 0 0 0 0 0 0 0 0 0 0 -8 8 -8 8 -8 8 -16 16 -16 24 -24 24 -32 35 -40 48 -54 56 -64 72 -80
39 -80 92 -104 112 -127 139 -155 171 -190 207 -230 253 -278 306 -338 373 -410 457 -505 562 -632
59 -632 712 -806 923 -1072 1264 -1525 1910 -2520 3652 -6456 29431 23459 -28584 15566 24687
74 24687 -14792 -23061 5580 -3773 -19013 -10191 -56 -6078 -1789 1522 2387 10888 12091 -1743
88 -1743 4094 13543 61 -8269 3761 3509 -7004 -6337 -10 -2757 -6163 -3136 246 -936 -1681
103 -1681 -1247 2220 4619 -235 -1101 7176 5738 -1447 1882 4663 -1356 -3081 -828 -2968 -5471 -3626
119 -3626 -2389 -3345 -1294 747 -541 2195 6058 2467 1134 5637 3878 -1503 -618 831 -2232 -4274
135 -4274 -2565 -1285 -2485 -1999 7 8 274 1644 1680 1742 2074 1093 990 1178 119 -492 -579 -515 -610 -1268
$$ packed form
0@%%%%%%%%%%%%%%%%%%qJ6j6J6j6J6k4L2l2M0m8M8n6O7p5Q8j02J10j20J36j52
39h0J72j96K16k39K66k94L26l61L97m37M83n31N84o44P11p83Q67r62J067j194
59f32J344j518J729j995K336k789L435m430O172j0108L5887n972n2043M4150R121
74B4687l9479q269K8641r353j5240Q822J0135o022M289L311Q65Q501J203j3834
88a743N837R449j3482q330J2030k52j0513O67O327k747l406L027L382j182p45
103a681M34L467K399m854q66Q277j438p185L329K781o019j725K253k140k503J845
119c626J237r56K051K041j288K736L863l591j333M503j759n381Q85J449l063k042
135d274J709J280j200M86K006JK66J370L6O2L32r81j03J88j059o11q7O4r5o58
$$ plain form
155 -1268 -1094 -503 -1181 -1422 -310 180 -88 -66 770 1532 875 689 1647 1091 -15 256 123 -872 -1177 -1303
175 -1303 -1183 -1138 -1091 -397 -142 179 875 841 881 1389 899 328 478 232 -370 -752 -706 -666 -948 -747 -197 -373
197 -373 -284 361 253 150 590 511 347 499 570 309 39 88 147 -353 -340 -90 -571 -701 -318 -283 -422 -148 107
220 107 134 286 521 717 441 417 496 98 -142 6 -289 -542 -397 -455 -440 -282 -73 51 50 302 490 171 217
243 217 457 201 -31 71 24 -146 -200 -100 -108 -246 -146 3 -157 -96 7 -56 -85 77 125 126 217 161 163 84 64 30
269 30 -145 -150 -66 -238 -265 -57 -95 -139 37 85 150 159 142 203 67 99 82 -107 -87 -6 -113 -89 -85 -9 -79 -30 42 92 16
298 16 27 107 1 48 34 41 -40 28 36 23 16 0 47 -34 -19 6 -15 -67 -14 -13 -14 54 73 14 51 23 88 29 9 24 -38 -69 -32
331 -32 3 -32 -15 -1 26 71 73 98 78 47 31 -27 -23 21 -26 -9 7 -2 -53 -32 4 22 28 18 34 18 35 8 -34 -12 -21 -21 -1 80
$$ packed form
155a268J74N91o78k41J112M90k68K2Q36P62o57j86R58n56j106K71j33r95l05j26
175a303J20M5M7O94K55L21O96l4M0N08m90n71J50k46o02l82M6M0k82K01N50j76
197c73Q9O45j08j03M40p9j64J52P1k61k70M9N9n00J3K50m81j30L83L5j39K74K55
220A07K7J52K35J96k76k4P9l98k40J48k95k53J45n8J5J58K09J24jK52J88l19M6
243B17K40k56k32J02m7j70n4J00qj38J00J49j60O1J03o3k9J62M8JR1n6Kp9k0l4
269C0j75nQ4j72k7K08l8m4J76M8O5Rj7O1j36L2j7j89K0Q1j07K4MP6p0M9P2N0p6
298A6J1Q0j06M7j4Pq1O8Qj3pj6M7q1J5K5k1n2N3JjO8J9n9L7k8O5n9k0J5o2l1L7
331c2L5l5J7J4K7M5KK5k0l1j6n8MM4m7J7J6rn1K1L6J8Oj0J6j6J7k7m2K2r%K0Q1
$$ plain form
365 80 50 58 46 -13 -32 -11 -42 -28 38 14 12 5 27 57 58 44 35 31 20 -24 -44 -44 -17 -12 -52 -31 -94 -59 26 10 -39 -40 19 16 -15 -1
401 -1 42 -18 53 7 18 28 -19 17 -18 22 2 -30 13 6 -42 21 0 17 -2 -9 31 24 39 11 -4 19 6 -33 52 10 -52 -52 -6
434 -6 81 -17 6 36 21 27 -30 59 40 13 26 10 16 -45 -14 54 -7 1 -4 2 42 14 1 -12 26 30 17 -2 -12 41 -51 -7 -32 -13
468 -13 -9 -72 -17 31 -9 40 -43 2 42 60 -27 -3 -30 35 1 37 -10 6 20 8 22 19 15 -38 23 -11 30 -35 -10 52 25 -38
500 -38 25 32 52 8 -27 -25 19 -3 -43 -14 -5 -24 6 21 44 0 13 -1 -24 -22 56 55 -35 -13 57 15 -13 20 57 -4 -18 24 22 -54
534 -54 41 -30 21 -7 7 17 -21 36 -1 12 -5 -1 74 -27 -44 40 -26 28 -13 6 17 -32 -42 -5 -48 24 53 11 -18 22 11
565 11 -18 33 78 5 -7 -10 23 25 -1 -11 11 45 -11 48 -42 44 33 26 8 12 -7 32 -26 -5 -23 18 -18 14 5 -35 44 59 5
598 5 -23 38 -14 10 38 -22 45 4 -21 66 21 5 29 -6 -14 -13 39 -11 4 -36 -16 -15 2 51 12 13 -15 24 -47 26 -3 6 12 -31
$$ packed form
365H0l0Qj2n9j9K1l1J4O6k4kpK2L0Jj4rmj1m4k0%K7Nm0K1o3L5Q5j6m9jN9ll1J4
401aM3o0P1m6J1J0m7L6l5M0k0l2M3pm8O3k1J7j9pM0pJ5k8j5K3j3l9Q5m2o2%M6
434fQ7r8K3L0j5On7Q9j9k7J3j6Oo1L1O8o1QnOM0k8j3j3L8Mj3j9j0N3r2M4k5J9
468a3Mo3N5M8m0M9q3M5M0J8q7K4k7O5l4L6m7J6J4j2J4lmn3O1l4M1o5K5O2k7o3
500c8O3PK0m4l5KM4k2m0K9Rj9L0J5K3m4J3j4k3KP8jr0K2P0m2k8L3L7o1j4M2kp6
534e4R5p1N1k8J4J0l8N7l7J3j7MP5j01j7Q4o6N4m1J9J1m9j0L7m3P2K9m2k9M0j1
565A1k9N1M5p3j2lL3Kk6j0K2L4n6N9r0Q6j1pj8Mj9L9n8K1j8M1l6L2rm0P9J5n4
598Ek8O1n2K4K8o0O7m1k5Q7m5j6K4l5qJN2n0J5m0K0JJ7M9l9Jk8L9p1P3k9ROm3
$$ plain form
632 -31 55 -12 -9 7 25 17 21 -15 23 -34 14 -24 6 -32 14 -23 -50 21 -25 -45 0 -1 0 -28 -53 16 21 18 3 -4 11 2 -12 34 29 7
668 7 -39 6 29 -16 -16 13 -21 59 11 0 -8 39 -21 14 16 1 -30 -28 8 -1 65 -35 57 -6 13 41 27 22 -19 -14 8 42 16 38
702 38 -39 -29 3 33 8 9 -2 -24 27 -40 4 -1 2 2 -16 -2 2 42 -14 12 32 -25 8 3 -6 42 58 12 46 -67 -9 44 34 -10
736 -10 -30 -24 -21 -32 -23 -36 8 -24 43 -1 -1 37 0 26 -1 51 -49 -19 16 25 -43 -18 31 34 9 -18 -47 5 -14 -32 -13 2 -6 9
770 9 -10 -20 -17 -23 18 32 -28 -42 38 57 40 5 70 -21 24 8 57 -2 13 20 -11 -33 -69 -61 32 11 24 2 45 39 -23 15 -25 -36
804 -36 14 -28 24 -19 47 14 -10 -30 27 28 4 -16 19 5 -3 54 -58 56 13 42 -11 -43 51 10 -23 -28 37 -80 -26 9 -5
835 -5 41 -12 21 -16 44 -32 30 -9 -1 -29 1 9 49 19 -37 -1 12 -13 9 40 2 82 17 28 -36 6 -16 6 -4 12 25 19 -5
868 -5 15 26 18 35 -26 6 0 8 29 16 -27 34 28 -20 -34 -15 48 6 30 -17 -33 -8 -23 36 -27 -10 -34 -30 -6 -7 0 -30 5 -23 28
$$ packed form
632c1Q6o7LJ6J8qMl6L8n7M8l8L0l8M6l7k7P1m6k0M5jJk8k5O9Nlj5pJ5rj4M6nk2
668Gm6M5K3m5%K9l4Q0m8j1qM7o0L5Kj5l1KL6rO6j00R2o3J9K8j4nm1NK2L4k6K2
702C8p7J0L2L0k5Jj1k2N1o7M4nL%j8J4MM0n6K6K0n7L3nrM8J6m6L4j13N8N3j0m4
736a0k0OLj1Rj3M4l2O7m4%L8l7K6k7N2j00L0L5Ro8K5M9Lk5k7k9N2j9j8J9J5qJ5
770Ij9j0LoM1J4o0j4Q0J9j7l5O5r1M5j6M9n9J5Pl1k2l6QR3k1J3k2M3oo2L8m0j1
804c6N0m2N2m3O6l3k4k0N7Jk4k0L5j4qN7j12J14m3K9n3l2R4m1l3nO5j17N4L5j4
835eM6n3L3l7O0p6O2l9Qk8L0QM0l0n6L6J3k5K2L1l8Q0o5J1o4M2k2K2j0J6J3ok4
868eK0J1qJ7o1L2oQK1j3m3O1om8j4J9O3m2K4m7j6K5j5N9o3J7k4MK4jPl0L5k8N1
$$ plain form
903 28 5 -11 5 7 54 31 35 -7 -25 -20 16 -33 23 -38 -32 16 57 52 -20 -11 13 34 -40 8 18 23 12 -8 12 -7 -2 -43 -11 68 12
938 12 2 14 -16 9 -13 -50 24 4 47 -46 0 -14 18 -7 11 -14 -54 19 14 -16 -11 36 -3 -29 24 14 -39 1 -74 -46 -16 -29
970 -29 -64 -1 1 54 22 -25 -6 -16 26 33 -7 3 -4 9 -38 -37 -24 26 7 47 -22 50 -9 9 -6 -8 13 -16 -16 -16 20 39 31 -10 -22
1005 -22 53 14 -22 -5 -12 -14 -9 -28 -1 -32 -30 -39 -40 -7 2 64 7 11 -29 50 5 10 10 -21 -18 -19 -42 14 -19 38 1 -18 -23 -17 -21 -14 -41 -27
1043 -27 -47 13 62 -8 -3 23 30 -18 25 25 -39 -7 -10 -41 -13 5 -18 -47 -13 -19 11 -5 -13 29 8 10 9 20 71 0 66 54 -45 41
1077 41 31 45 72 18 24 37 -32 22 -42 -27 -15 -10 44 48 21 -10 10 -25 -23 -8 -29 -26 -12 -56 35 -14 -34 -23 -40 -36 22 41 -4
1110 -4 -12 10 7 24 52 -17 -25 -22 -23 -33 0 3 -34 37 0 -10 36 22 -8 17 15 18 -32 45 7 -11 22 -7 -7 -26 80 -43 -46 35 13
1145 13 -7 -7 12 9 18 -11 -5 -12 22 29 -12 -14 48 60 -72 15 20 41 45 -47 46 53 53 -19 -18 60 -53 -21 53 41 61 -13 24 26 4 -23
$$ packed form
903B8k3j6J6KM7k3Mm2j8NL6m9N6o1OM8M1np2RK4K1p4M8J0Nj1k0K0j9Nm1L2P9n6
938A2j0J2l0K5k2l7P4k0M3r3M6j4L2k5J8k5m0P3nl0NM7l9k6N3j0n3M0p5K8L0j3
970b9l5O3KN3l2m7J9j0M2Pm0J0pJ3m7JJ3N0j9M0o9P2n9J8j5kK1k9%%L6J9qm1j2
1005b2P5l9l6J7pkNj9K7l1KrjL3RO2n7Mm0P9m5N%l1Ljk3N6l3N7l7j9nOmPk7J4
1043b7k0O0M9p0NK6Pm8M3%o4L2ll1K8J8k3k9L4oL0j6qM2k1KjJ1N1p1O6j2r9Q6
1077D1j0J4K7n4OJ3o9N4o4J5J2NN4Mk7l1K0l5KJ5k1LJ4m4R1m9k0J1j7MN8J9m5
1110dqK2lJ7K8o9qLjj0L3Ll7P1l7j0M6j4l0K5kLn0P7l8j8L3k9%j9J06j23lQ1k2
1145A3k0%J9lRk9OpL4Pm1kO2J2j32Q7NK1Mr2R3P%p2JP8j13L2P4j2K0p4L7Kk2k7
$$ plain form
1181 -23 2 2 -9 16 4 -28 35 2 33 -6 51 -1 -3 -12 -7 -16 26 -23 12 33 -28 34 -18 -16 -6 -17 -15 0 49 2 -40 62 -8
1214 -8 17 -30 30 60 -55 -33 34 9 16 -1 -8 63 37 60 -63 6 -40 -5 20 -24 -53 -37 -7 53 31 35 24 30 -13 86 -16
1245 -16 34 -8 19 60 11 25 85 30 58 -71 -1 -28 -37 30 17 28 -20 35 28 24 38 23 -13 -29 -34 -29 26 20 0 -8 16 5 -1 19
1279 19 19 23 -29 36 -31 -24 -26 -32 44 52 40 29 17 22 23 27 -28 6 -31 -84 15 10 11 -11 -24 21 -20 -6 75 -87 -42 -67 22 -15 -74
1314 -74 -9 32 -54 -9 -14 53 41 27 31 -32 -42 12 19 3 39 -39 -29 -11 -5 31 -10 -5 -77 -6 0 -100 7 6 23 -10 -2 9 1 -6
1348 -6 8 6 -13 -48 -4 -2 16 21 13 0 1 3 -60 -65 7 -3 9 -7 -14 -7 -79 28 11 21 12 -50 30 -45 38 15 9 35 -23 3 -55 -3
1384 -3 14 37 -14 -17 -46 -26 11 11 -42 -15 22 45 -28 11 22 43 34 30 15 -25 -39 -72 -11 6 -15 -15 -9 -6 -13 -8 -19 -24 1 11 13 37
1420 37 -31 17 -19 53 -31 -10 -40 -24 -26 63 49 45 -63 15 -1 25 32 -37 -10 -78 1 72 -34 -8 -1 -6 -3 7 14 28 2 -11 27
$$ packed form
1181b3K5%j1K5j2l2O3l3L1l9N7n2krNrM2m9L5K1o1O2n2KJ0j1KJ5M9m7m2J02p0
1214hK5m7O0L0j15K2O7k5Pj7pP1k6K3j23O9m6L5K5m4k9J6L0O0k2Mj1Om3R9j02
1245a6N0m2K7M1m9J4O0n5K8j29P0k7rO7j3J1m8N5pmJ4j5l6j6nNN5ok0qK4j1oK0
1279A9%Mn2O5o7PkoP6Qj2j1j2NJMn5L4l7n3R9nJk2j3M5m1J4Q1j62M5k5Q9l7n9
1314g4O5M1q6M5nO7j2j4Mo3j0N4Pj6L6p8J0J8OL6m1Np2P1Oj00J07jJ7l3QJ1qp
1348fJ4kj9l5M4KJ8Nqj3JKo3nP2j0J2j6pPp2J07j7J0ro2Q0p5Q3k3oK6n8K6n8N2
1384cJ7K3n1lk9K0L7%n3K7L7K3p3L9J1K1rmj5m0j4l3O1J7k1%OLpNj1nK5J0KK4
1420C7o8M8l6P2q4K1l0J6kQ9j4mj08P8j6K6Po9K7o8P9P1j06K6PnLJ0PJ4k6j3L8
$$ plain form
1453 27 -41 46 -26 2 11 0 -70 18 14 44 32 5 9 -26 12 18 -30 27 -40 -6 -3 1 -31 -5 14 -2 35 -39 -19 -2 17 23 0 53
1487 53 5 39 18 -16 -4 35 22 28 9 -39 -15 5 36 25 10 46 46 29 42 -39 -1 -77 39 34 -59 -3 28 32 20 -10 22 -5
1519 -5 3 36 -24 44 30 30 -23 17 51 -42 -46 30 -36 7 13 17 34 12 -16 -68 -8 23 -20 7 45 -19 8 -6 10 7 41 41 54 18
1553 18 13 2 37 38 -34 7 31 7 -49 -33 14 48 4 -33 7 40 32 -12 -65 10 8 12 -5 -21 27 -12 -12 0 46 -48 1 -57 37
1586 37 30 21 -7 0 -11 38 26 58 26 33 -35 -41 -25 8 -45 -19 26 12 24 -11 -1 19 38 -14 -18 -27 66 46 37 -53 -29 -65 8 9 0
1621 0 57 29 2 13 53 -63 17 0 -28 -10 -15 -49 48 25 20 39 36 16 38 -24 73 -12 -57 1 15 10 24 -28 14 -53 62 58
1653 58 16 11 -51 -38 19 -41 -26 10 17 -59 -86 -18 -13 25 4 10 -10 -30 18 13 -23 9 -55 -51 25 -20 -9 -16 14 -4 31 -15 28 -21
1687 -21 70 26 23 -20 -39 -4 -60 -1 1 -7 -16 17 61 -32 -35 1 -1 -40 -13 25 7 27 9 16 30 19 23 26 21 5 -10 5 8 16 -41 74
$$ packed form
1453B7o8Q7p2K8Rj1p0Q8mL0j2k7Ml5L8Om8N7o7L4LMl2K6J9j6L7p4K0J7J9Ok3N3
1487E3m8L4k1l4J2L9j3Oj9m8K4K0L1j1j5L6%j7J3q1L8p6J16nr3N6L1Mj2l0L2k7
1519eQL3o0O8j4%n3M0L4r3mP6o6M3OMJ7k2k8n2O0L1m3K7L8o4K7j4J6lL4%J3l6
1553A8nj1L5Jp2M1K4k4n6J6M7L4m4l7M0L3qm4n3P5kMj7j6M8l9%J2M6r4M9n8R4
1586C7prk8Pj1M9j2L2l2Po8oJ6L3n3K6M5j4J2l5J0K0J9n2mrR3k0rr0K4l6P3Jr
1621@N7k8k7J1M0j16Q0j7k8J8nl4R7k3nJ9lk0K2o2R7q5m5N8J4nJ4n2M2o7J15m
1653E8m2no2J3N7o0J5L6Pp6k7O8NL8k1Ok0k0M8nl6L2o4MP6m5J1pL0j8L5m6M3m9
1687b1R1m4lm3j9L5n6N9KqrL3M4r3lL6kl9K7L8j8K0j8PJ4j1MLnj6j5J5LQn7J15
$$ plain form
1723 74 -17 38 26 -37 12 8 26 -35 -28 18 4 34 -1 -28 24 18 72 -27 -40 18 50 31 -8 65 -4 -26 -40 40 -77 39 18
1754 18 48 26 13 55 -2 7 17 18 42 -60 18 25 42 24 18 59 64 -24 23 9 43 71 34 -21 33 -40 -1 11 -12 4 16 57
1786 57 46 17 -26 39 37 -34 -40 51 -7 12 -32 24 4 -13 -8 18 -60 15 28 -24 -6 22 44 -15 9 -15 -28 27 10 -29 29 -1
1818 -1 11 14 0 5 -20 4 -12 -26 6 36 32 -54 16 -6 42 51 -1 10 16 20 -26 -26 -4 12 18 -7 54 29 33 40 -2 14 -27 23 -33 -28
1854 -28 -33 -13 -8 -1 -8 -17 -13 -27 52 -29 6 39 12 15 1 28 17 3 -40 12 38 25 -51 1 -6 31 19 24 4 35 -46 -24 25 11 -32
1889 -32 17 2 -29 13 26 27 31 20 -5 44 -42 10 -25 0 33 32 31 11 -5 -8 -49 -36 -9 41 -3 39 12 15 -13 4 27 36 -29 36
1923 36 104 -32 -17 -6 27 -9 16 11 -1 -22 -9 1 38 -59 -42 20 33 8 21 28 -24 2 8 6 32 24 -20 5 52 43 15 19 -13
1956 -13 -26 36 21 -43 5 -35 -1 -55 -24 33 -40 -35 -10 36 -37 4 33 -18 13 48 61 -4 -44 11 -80 -31 15 -7 11 -18 -66
$$ packed form
1723G4r1N5j2o3M9mJ8o1PM6j4L0l5k7N2oN4r9j3N8L2j9l9P3o9k2j4Q0j17J16k1
1754A8L0k2j3M2n7RJ0JK4j02P8PJ7j8oM1Nq8M7j4L4K8l7n5N4p3L9J2k3J6J2M1
1786E7j1k9m3O5kp1oR1n8J9m4N6k0j7NK6p8P5J3n2J8K8K2n9K4k4j3N5j7l9N8l0
1818aJ2Lj4Nk5K4j6j4L2L0mq6P0k2M8Rn2J1OMm6%K2J6Ok5O1k5MPm2J6m1N0n6N
1854b8nK0NPprMj4P9q1L5L3k7Lj4K7j1j4m3N2K6j3p6N2pL7j2Nk0L1q1K2M9j4m3
1889c2M9j5l1M2J3JMj1k5M9q6N2l5K5L3jjk0j6lm1J3K7N0m4M2k7Lk8J7K3Ro5O5
1923C6O8j36J5J1L3l6K5nj2k1J3J0L7r7J7O2J3k5J3Pn2K6OkK6qm4K5M7rk8Ml2
1956a3j3O2j5o4M8m0L4n4L1N7p3NK5M6p3M1K9n1L1L5J3o5m0N5r1M9M6k2J8k9m8
$$ plain form
1987 -66 -8 3 13 -24 -38 32 77 11 21 0 6 0 16 21 -18 4 57 -43 30 16 6 34 -23 -14 43 23 48 -5 6 11 15 53 -41
2020 -41 -40 -11 0 21 -22 -20 41 13 51 14 16 15 -14 -26 33 10 -4 21 -59 0 13 -11 17 10 13 -16 32 8 -13 -7 7 45 19 25
2054 25 -81 19 -19 1 -58 -39 -10 -9 11 -5 -28 -43 28 -43 -10 -17 35 -18 -14 -15 26 20 44 -4 4 -5 -18 2 6 -21 40 -54 -46 10
2088 10 18 -9 17 41 20 -12 -51 28 33 -34 -1 -15 -25 -15 18 3 -35 14 -29 12 32 -53 -44 -11 -63 15 18 -30 21 21 -9 -23 26
2121 26 9 7 42 21 51 -23 -11 -2 22 0 13 22 26 10 0 31 35 5 -45 8 26 -15 -11 -37 21 27 -38 -1 -12 12 14 -22 -39 -3
2155 -3 20 5 20 -2 20 -14 -37 -38 40 7 14 4 -27 30 26 0 21 38 -32 38 -63 -26 40 2 -14 0 -13 19 -56 13 8 -55
2187 -55 17 -17 -20 -43 -17 -22 -27 24 26 21 -3 35 3 -38 -16 46 23 -35 19 12 -16 -12 15 35 29 1 19 69 50 40 15 -22 1 -40
2221 -40 7 5 38 -41 1 48 42 -21 -27 26 -30 -9 9 26 50 -10 17 3 -51 44 61 9 -1 -12 1 -10 34 38 0 -53 -11 -35
$$ packed form
1987f6N8J1J0l7j4P0M5o6J0k1OoJ6Nl9K2N3j00P3j4j0K8n7RN7k0K5n3J1NML8r4
2020d1JK9J1K1m3KO1k8L8l7Kjk9j2N9k3j4K5q0N9J3k4K8pLk9M8k4k1OJ4L8k6O
2054B5j06J00l8K0n9J9K9JK0j6k3j5P1p1L3pN2n3MjM1oK4m8Qrj3K0Mk7O1r4QN6
2088A0Qk7K6K4k1l2l9P9No7L3j4j0J0L3j5l8M9m3M1K0q5RL3n2P8Lm8N1%l0j4M9
2121B6j7kL5k1L0p4J2RK4k2J3RMj6j0L1Ml0n0N3J8m1Mk6N8Oo5L7j1K4Kl6j7L6
2155cK3j5J5k2K2l4k3jP8l3Pj0l1N7mk6K1J7p0P0j01L7O6l8j6J4j3L2p5O9no3
2187e5P2l4lk3K6nnN1Knk4L8l2m1K2O2k3n8N4pk8MK7K0ok8J8N0j9j0k5l7K3m1
2221d0M7kL3p9M2M7oo3oN3n6K1J8J7K4o0K7j4n4R5J7n2j0j1J3j1M4Ml8n3M2k4
$$ plain form
2253 -35 21 9 74 -30 -5 -32 -21 26 -6 57 -8 8 -1 -47 -29 -49 19 -40 -59 3 -48 -11 -31 26 24 54 18 -28 28 -5 36
2284 36 5 35 23 -35 15 -20 -26 -20 -21 -6 -49 2 31 -12 -32 75 11 -25 54 34 -92 -22 17 -57 47 37 -5 -17 -6 -5 -5
2315 -5 7 -25 60 57 -15 34 30 36 -5 7 53 5 38 23 -4 13 -33 -10 31 -9 -10 7 0 -36 -43 -26 -19 -18 58 35 16 -17 -44 20 -1
2350 -1 4 -14 -23 0 3 -13 47 -54 -24 15 -42 27 13 -7 -52 -4 75 -33 -18 11 19 -20 -14 -54 47 28 3 -50 25 -19 -7 -48
2382 -48 -37 36 46 -31 -33 17 23 22 15 37 -8 40 -35 -42 -53 26 24 29 17 -5 -57 38 65 10 -1 -14 14 19 -29 -61 3 38 9 34
2416 34 54 23 -14 45 62 21 -38 -15 68 -15 0 -44 6 -5 -2 43 18 -8 12 12 -2 41 -3 26 12 -3 26 7 -57 -20 28
2447 28 -6 24 -21 45 64 -38 2 -72 -14 18 0 -4 40 -20 -25 72 -4 -15 0 -57 6 11 -33 39 11 -5 -23 -28 -22 -18 67 48 -10
2480 -10 -28 -28 22 26 41 28 -64 -40 -7 68 15 -29 9 6 -38 -1 -15 19 -3 23 45 56 17 36 37 -11 -58 8 -20 -34 -74 39
$$ packed form
2253c5N6j2O5j04K5k7J1M7l2O3o5J6rm6J8k0O8n9j9O2n1L7k0N7kL0l6m6N6l3M1
2284C6l1L0j2n8N0l5oOjJ5m3N1K9m3k0J07o4l6P9k0j26P0L9p4J04j0m2j2J1J%
2315eJ2l2Q5lp2M9mOm1J2M6m8L3j5k7J7m6K3M1m0jJ7pl6pJ7PJP6k3j9l3k7O4k1
2350aNj8rK3Lj6O0j01L0L9n7O9j4k0m5M8P9j08J5K9Ql9Om0J01j9k5n3P5m4J2m1
2382d8J1P3J0p7kN0OjpK2m5M8p5pj1P9kNj2k2n2R5K7n5j1j3K8Nm8l2O4L5k9K5
2416C4K0l1l7N9J7m1n9K3Q3q3J5m4N0j1LM5k5k6K0%j4M3m4K9j4j5K9j9o4L7M8
2447B8l4L0m5O6J9j02M0p4N8L2j8mM4o0nR7p6j1J5n7O3Nm4P2k8j6j8nOMQ5j9n8
2480a0j8%N0MJ5j3r2K4L3P5n3m4L8lm4L7j4L4k2K6K2J1l9J9Jm8m7O6k8j4m0J13
$$ plain form
2512 39 10 26 -43 7 -49 -32 -3 1 11 5 -20 -57 -45 35 26 -26 0 -31 6 9 2 -22 21 -38 17 22 7 45 48 1 73 -40 -38 -10
2546 -10 -11 -14 42 -1 -52 15 -39 -31 -48 10 -33 6 -50 11 9 13 -43 7 3 -56 -17 -75 -19 9 35 16 19 29 19 -21 12 22 -17 -78
2580 -78 32 0 -19 39 3 -12 -46 23 -54 -18 -8 19 -1 -13 -37 6 21 30 3 -15 -28 -11 -47 -20 -44 -32 -52 -7 31 10
2610 10 -46 10 2 -9 -5 -11 -4 33 -35 -39 -6 3 51 8 3 1 12 4 23 -9 -12 -22 -7 6 39 -41 -28 -12 21 -65 17 -22 11 34 14
2645 14 9 0 -49 13 -35 -38 -14 48 26 -1 3 -34 -53 42 9 39 13 -1 -7 -44 14 -21 11 -21 -12 20 8 -4 -10 -15 9 -8 -1 4 -27
2680 -27 -25 22 -50 7 -28 -52 55 42 -33 -16 -11 23 19 -52 -20 9 26 -8 -14 -37 14 -15 -5 -51 15 17 66 -22 -32 51 -46 -5
2712 -5 -5 -37 -1 4 -6 38 8 42 -7 -13 -6 -56 5 -12 5 -25 -28 -14 13 30 2 -22 38 21 -9 42 -3 -24 -27 -28 42 26 -3 23
2746 23 -16 -4 -1 37 -9 1 79 10 45 6 35 -52 5 27 38 40 -19 -29 8 18 6 46 -35 -14 -32 -13 11 -56 48 -22 -34
$$ packed form
2512C9k9J6o9N0n6J7K9MJ0ok5l7J2Q0rn2K6l1L7Lpk4M3n9N5Nj5L8Lm7P2j13KK8
2546a0jlN6m3n1O7n4Qj7N8m3L9n6O1kMn6N0mn9L9n8N6K8K6j9LJ0j0m0L3J0l9o1
2580g8J10l2j9N8l6j5l4O9p7L6J0K7k0j2k4M3J5Rk7j8j3J7l6K7k4J2k0M5L8k1
2610A0n6N6qj1MoPL7o8mL3RM8m3nkJ1qJ9l2lj0J5J3L3q0J3J6L3q6Q2l9L3K3k0
2645A4nrm9O2m8lK4O2k2k7Ml7j9R5l3L0k6j4ol7N8l5L2l2RL2j2j2onK4j7PNl1
2680b7KM7p2N7l5k4J07j3p5J7NL4mp1L2K9J7l4ok3N1k9J0m6O6KM9q8j0Q3r7M1
2712e%l2L6Nj0M4l0L4m9oPn0O1j7J7l0lJ4K7J7k8k4O0j7l0N1m5k1ljP0j6k9K6
2746B3l9J2LL8m6J0P8o9L5l9K9q7N7K2J1Kn9j0L7J0j2M0q1K1j8J9K4o7J04p0j2
$$ plain form
2777 -34 15 -43 -61 -12 23 -17 7 15 -43 56 -23 23 56 49 -4 -17 -17 -18 -30 8 16 -48 -19 48 -33 -23 24 20 3 33 34 -3 -13 -38
2811 -38 -47 -12 10 10 29 -43 19 6 39 27 1 21 -19 20 71 -19 7 72 18 30 44 4 2 -23 58 -7 -34 35 53 -3 34 -21
2843 -21 -6 -1 6 -9 -49 26 16 -20 -12 -18 -33 16 -2 10 11 -71 -16 11 8 -7 -20 42 8 -58 -36 -7 -1 15 -32 -31 30 24 -13 23 36
2878 36 -13 -5 14 41 -14 -6 69 -19 -12 -1 21 16 -1 -33 -52 32 -37 55 -39 -18 -20 9 25 52 -20 -16 35 -16 0 28 32 -35 -47 4
2912 4 -50 -71 34 -10 5 -23 26 -3 17 -15 -4 -6 41 4 11 3 14 6 -15 39 40 -36 32 31 0 -27 12 -11 -8 33 -43 16 -37 -1
2946 -1 24 2 49 4 31 37 -10 0 24 -19 46 3 12 74 19 -2 32 -4 -54 54 56 50 23 80 23 47 2 21 -32 -30 19 10 17 -7
2980 -7 35 -39 -48 -10 32 -35 -7 10 33 -13 28 -3 39 29 -36 3 -21 -36 0 31 34 -10 10 49 -2 21 -77 -1 -1 -22 61 5
3012 5 -1 -13 -8 -25 63 16 -39 -16 -51 -28 50 -26 -37 8 28 41 -2 -18 1 -42 47 14 -12 -27 -24 7 -26 -33 -80 21 -40 26
$$ packed form
2777c4M9n8j8M9L5m0K4Qn8R9p9M6L3pn3j3%jj2L8Qo4K9O7q1J0M7mj7L0Jl7j0k5
2811c8rL5K2%J9p2O2j3L3j2k6K0m0L9N1r0K6O5n4J2J4m0kk5Q1o5k7O9J8n6L7n5
2843b1J5NPj5m0P5j0l6Qoj5M9j8J2Jq2N5K7lj5j3O2l4o6K2K9OJ6m7JO1ol7L6J3
2878C6m9QJ9K7n5QP5q8PJ1K2nj7l2j9Q4o9R2r4K1kK9J6K7p2MN1n1J6K8Mo7j2N1
2912Dn4k1J05m4J5k8M9k9K0l2J1kM7l7PqJ1qk1N4Jp6O8jl1k7L9k3LM1p6N9n3L6
2946aK5k2M7m5K7Om7J0K4m3O5m3RO2n5k1L4l6n0J08Kok7N7n7K4m5J9n3KM9rPk4
2980gM2p4rL8M2o7K8J7K3m6M1l1M2j0o5L9k4j5L6L1Lm4K0L9n1K3r8P6%k1Q3n6
3012Eoj2Nj7Q8m7n5K3l5K3P8p6j1M5K0J3m3j6J9m3Q9l3k6j5LL1l3pm7J01o1O6
$$ plain form
3044 26 1 10 28 -15 -54 -7 -34 0 -13 7 4 -22 23 35 0 -4 8 33 57 -34 52 -11 -8 7 48 -36 32 -10 17 -17 -24 28 -13
3077 -13 32 7 9 29 13 -15 -10 -22 10 15 19 -49 -3 -2 -36 4 22 25 -2 29 -19 -2 20 -40 35 20 17 -39 -28 -31 -35 48 -37 -38 18
3112 18 27 11 -13 16 -38 -15 -26 1 52 9 10 -73 -42 7 10 7 -40 1 4 -21 -1 13 -7 -36 -5 17 2 -5 -48 2 5 -36 -14 -5
3146 -5 -35 30 -2 -36 -64 -44 -4 31 -5 -1 33 -14 17 -11 -5 27 42 18 25 -2 -1 -21 -24 39 15 15 34 -74 -12 -42 -27 2 1 -33
3180 -33 -60 1 3 1 -50 6 -12 10 -14 25 -29 -26 -8 -19 -107 -22 -4 -51 20 -3 21 -31 -17 -15 -36 -24 14 7 -4 44 3 -39 4
3213 4 62 -14 2 17 -18 37 41 42 -22 8 12 -8 -5 -53 23 19 18 12 -8 -16 -55 -5 -82 8 25 10 -13 8 1 -22 33 22 -17 -12 -51 33
3249 33 29 -22 50 15 2 65 19 70 -9 15 23 64 -1 -39 11 17 -44 -10 21 18 -75 30 33 -16 36 22 -1 -45 20 -51 -43 33 -20
3282 -20 30 -1 -45 -32 14 -21 -5 -58 -17 5 14 -9 14 -40 29 10 36 -5 24 -26 -11 51 -48 -16 -15 -1 -21 46 -17 54 76
$$ packed form
3044B6k5RJ8m3l9M7k7L4j3K0lk6M5J2l5mJ2K5K4r1Q6o3LJ5M1q4O8m2K7l4pN2m1
3077a3M5k5KK0j6k8Nj2L2NMo8M6Jl4M0J8Lk7L1m8J7K2o0P5j5ln6J1lmQ3q5jN6
3112A8Rj6k4K9n4K3j1K7N1m3Jq3L1M9Llm7M1Lk5K0J4k0k9L1K2j5pm3N0Lm1K2R
3146el0O5l2l4k8K0M0L5l6ML4m7L1k8OL2J5k4Pk7Jk0lO3k4%J9j08O2l0J5K9jl4
3180c3k7O1Kkn1N6j8K2k4L9n4LJ8j1q8Q5J8m7P1k3K4n2J4Kk1J2L8pj1M8m1m2M3
3213DN8p6J6J5l5N5MJo4L0Mk0Lm8P6mjok0ql9N0p7R0J7j5k3K1pk3N5j1l9Nl9Q4
3249C3mn1P2l5j3O3m6N1p9K4QM1o5l8N0Oo1L4L1lr3J05Lm9N2j4k3m4O5p1QP6n3
3282b0N0l1m4J3M6l5J6n3M1K2Rk3K3n4O9j9K6m1K9n0J5O2r9L2JJ4k0O7o3P1K2
$$ plain form
3313 76 -33 33 -1 10 25 -17 22 13 -8 -11 -1 8 -11 -66 14 -3 -58 -16 -11 -36 -24 -5 24 35 -18 -15 21 28 -29 -51 -41 -14 -24
3346 -24 -4 -57 -64 113 -54 -33 16 -42 30 1 9 6 -76 -62 8 39 -37 34 0 -7 24 68 28 -18 -71 -5 47 -6 20 -66 -75 -10
3378 -10 -9 20 -6 -5 15 -20 -37 13 14 -43 21 11 51 10 17 -29 37 57 3 -20 15 -43 -5 -46 -12 10 36 34 -23 17 10 29 33 49
3412 49 -52 -3 21 18 21 -1 36 23 28 39 -4 -4 30 -5 -6 -11 -17 -18 -36 35 -24 -33 28 -26 8 -56 -35 8 18 50 -19 3 30 -14
3446 -14 -46 -10 -18 -2 10 13 16 12 -5 -1 38 4 17 -37 7 21 -36 53 -12 19 3 -27 2 -17 39 12 -53 25 5 -26 1 -4 -36
3479 -36 -7 6 7 2 -20 12 -13 -6 8 -25 21 -33 29 -15 42 3 43 36 -9 42 43 -36 37 -1 10 -33 -11 -6 -48 3 46 25 -20
3512 -20 0 -27 4 7 -8 -23 -16 9 -25 -71 -10 11 -56 -14 -12 2 24 -22 -40 -27 -34 -14 -25 -33 17 -7 -6 -2 40 13 19 3 -52 -31
3546 -31 8 39 34 -20 -35 -18 -53 -56 -14 -13 42 5 -2 -14 -42 47 -6 1 13 0 -46 16 11 -11 3 23 26 12 -50 -9 41 -38 38 -65
$$ packed form
3313G6j09O6l4J1J5m2L9rk1lJ0Rj9n5Q0j7n5M2Nk5J2J9K9J1n3LL6Pn7k2J0K7j0
3346b4K0n3pJ77j67K1M9n8P2k9Qlq2J4P0L1p6P1l4pL1M4m0m6n3O6N2n3K6q6rO5
3378a0JK9k6JK0l5j7N0Jn7O4j0M0m1Pm6O6K0n4k3L5n8L8m1L4K2K6kn7M0pJ9MJ6
3412D9j01M9K4lLk2L7j3NJ1m3%L4l5jnojj8P1n9rO1n4L4o4K1M3J0L2o9K2K7m4
3446a4l2L6qJ6J2LLmj7ML9l4J3n4M4J4n7Q9o5L1j6l0K9j9N6k7o5P8k0l1K7nl2
3479c6K9J3Jnk2L2k5PJ4l3M6n4O2m4N7l9M0pm5N1Jp9P3l8J1m3K2Nm2N1M3k1m5
3512b0K0k7L1Lj5j5PK5l4m6O1K1o7M2KJ4K2m6j8J3pK0j1qN0k4JMM2k7Oj6n5K1
3546c1L9L1nn4j5J7l5lM2JN5l7pj2k8Q9n3PJ2j3m6O2nk2J4K0Lj4o2M1N0p9P6j03
$$ plain form
3580 -65 -64 5 39 39 -2 -20 22 9 -6 -37 18 -12 -28 86 50 -34 50 -6 0 20 -45 1 -53 -25 22 48 -22 -12 -22 14 67
3611 67 20 27 -24 3 -4 -5 -5 21 18 17 2 -18 23 20 -41 8 -31 28 -16 27 2 -10 -17 20 -46 84 6 36 18 11 8 17 -17 -11 29 38
3647 38 46 -1 1 -12 31 -47 -35 48 39 -46 9 9 17 3 11 15 14 -10 55 24 42 -15 -2 78 0 31 27 20 -52 -31 9 11 2 -13 -15 23 23
3684 23 52 69 15 -22 41 36 -20 15 -35 -12 -42 -43 56 21 -25 9 25 -49 -39 13 43 -43 -12 -38 -39 0 -21 2 3 19 19 -3 2
3717 2 9 39 32 -31 65 -51 -1 22 -8 30 64 17 -38 24 -59 -52 2 2 -30 -64 42 -31 29 9 -55 -30 -19 -28 -7 -8 6 -17 -18
3750 -18 17 22 -58 24 35 -22 -34 -41 -5 28 -3 -6 -13 16 4 19 41 -7 28 -9 -10 52 32 -4 67 29 -17 -37 -14 39 6 -21 -15
3783 -15 -14 1 -53 24 8 -17 -5 -16 -10 23 -2 7 -2 3 12 45 -8 -1 52 23 -28 28 -6 18 -29 51 -3 38 19 -73 -27 -35 -36 -47 25
3818 25 -24 3 -27 -12 -33 -27 27 -46 3 55 -47 31 42 43 24 9 4 41 42 80 44 -69 -8 -47 45 17 -35 -18 2 -2 -39 52
$$ packed form
3580f5JO9L4%m1j8M2j3j5l1N5l0j6J14l6q4Q4n6OK0o5M6n4K8M7K6p0J0j0L6N3
3611F7m7Pn1K7pj%K6ljj5k0M1lo1M9l9N9m4M3k5j2pL7o6J30p8L0j8plRl4OM0R
3647C8Qm7Kj3M3p8J2Q3rq5N5%Qj4QMjk4O5l1J8n7J3Q0p8L1mpp2K1M0Krj5kL8%
3684B3K9J7n4l7O3nn6L5n0K3l0jR9l5m6L4J6p4J0N2L0q6L1k6jL9k1K3JJ6%k2N
3717BPL0po3R6j16N0K3l0L8L4m7n5O2q3PN4%l2l4J06p3O0k0o4K5J1rK1jJ4k3j
3750a8L5Nq0Q2J1n7j2pL6L3l1lpK9j2J5K2m8L5l7jO2k0l6P1l8m6k0K3N3l3k7O
3783a5JJ5n4P7j6k5J2j1OL3k5RrNRL3n3PN3k9n1N6l4K4m7Q0n4M1j9r2M6qjj1P2
3818B5m9K7l0J5k1ON4p3M9N2j02P8J1Jj9j5nL7JL8l6j13O1l9R2k8n2J7K0ml7R1
$$ plain form
3850 52 -18 11 -59 -48 -51 6 10 10 -40 43 -28 -11 -2 -29 -1 10 32 -18 -51 -41 38 -10 -49 -42 69 31 -52 22 -3 -24 40 -24
3882 -24 -18 8 11 -3 11 13 -21 -2 10 18 -32 16 56 -11 42 29 -8 -24 11 -20 -23 -25 21 -11 3 36 -15 -18 -1 49 -53 13 21 28
3916 28 22 16 5 15 8 -13 22 -31 -13 15 3 23 16 13 -30 13 32 -31 -34 36 37 46 -9 -4 1 16 -33 21 0 -29 12 23 -19 -6 -33
3951 -33 -52 61 -2 64 6 27 23 18 4 -15 7 53 30 -2 9 34 0 28 14 31 -10 -16 -19 46 -8 8 0 5 -30 17 -10 -9 35
3984 35 -14 -8 7 -45 -31 30 43 7 -63 -18 25 -25 -8 -4 -49 10 -23 20 -19 27 15 6 19 -34 -12 42 38 -7 93 18 -5 -48
4016 -48 -12 4 -15 37 -32 57 -25 16 -16 -2 25 -7 -6 27 5 11 -25 17 21 62 -1 1 -28 63 23 -2 26 25 15 -41 -14 20 24
4049 24 32 8 -14 -8 43 2 39 -11 -41 24 -19 -25 2 -52 33 13 -4 -32 9 3 -2 -41 4 36 -2 2 -2 -27 10 -2 39 -23 3 16
4083 16 48 23 37 -38 14 26 -18 -8 37 -5 -40 44 -46 14 11 -23 17 26 -10 32 -36 -64 -20 -37 37 29 -8 -14 -2 20 10 22
$$ packed form
3850E2p0K9p0J1lN7M%n0Q3p1J7Rk7K8J1K2n0l3J0P9m8l9PJ11l8q3P4k5k1O4o4
3882b4OK6Lj4J4Kl4J9J2Qn0M8M0o7N3j3l7j6L5l1lkM6l2J4L3n1lJ7N0j02O6QP
3916B8ooj1J0pk1L5n3J8K8j2K0plm3M3J9o3lP0JRn5NNJ5m9N4k1k9M1J1m2J3k7
3951c3j9J13o3O6n8K1mnj4j9K2M6k3l2J1K5l4K8j4J7m1olO5n4J6qNl5M7k7JM4
3984C5m9OJ5n2J4O1J3l6p0M5M3n0J7Mm5N9l3M3l9M6j2rJ3n3K2N4mm5J00p5k3m3
4016d8L6J6j9N2o9Q9q2M1l2J4K7l2JL3k2Ol6M2MM1o3Kk9R1m0k5K8jj0n6K7L4M
4049B4Qk4k2ON1m1L7n0l0O5m3oK7n4Q5k0j7k8M1onl9M5L2l8Mmk5L7j2M1o2K6J3
4083A6L2k5J4p5N2J2m4J0M5m2l5Q4r0O0ll4M0Rl6M2o8k8M4j7P4ql7oJ2K2j0J2
$$ plain form
4115 22 -19 14 -18 80 25 -10 -5 -2 -8 -26 20 6 0 -11 -12 -50 14 -1 2 18 -18 -36 -2 -41 32 7 0 -33 47 -12 -16 -1 33 -11
4149 -11 36 5 -10 29 -15 -47 49 44 -5 7 12 -75 -55 -31 -3 6 54 -36 -13 21 -20 38 -22 -1 0 -23 -44 -12 40 33 15 13 -26
4182 -26 12 33 -14 -26 8 -39 36 31 -21 -25 34 -3 30 -39 -14 -56 -37 18 19 -8 -66 11 -21 -12 67 -7 -13 -19 -8 -64 25 21 49 -12
4216 -12 -18 38 15 33 -15 54 -10 1 21 25 -9 5 -5 -17 -62 -15 44 26 12 -7 31 -5 -7 4 11 -27 9 -4 -61 27 50 -7
4248 -7 -59 -46 55 -5 9 -24 -20 3 -15 49 5 -5 18 6 -7 -63 -44 17 -45 45 6 -39 38 14 14 -35 -14 -46 -21 40 -50
4279 -50 -19 56 -3 -15 -51 36 18 37 -69 -13 -53 -33 -5 -21 36 -41 50 44 -16 -50 -25 22 18 22 19 -9 6 -11 4 -7 -12 26
4311 26 14 -9 -21 44 56 34 74 1 16 -7 -37 -10 21 -6 13 -28 59 45 -6 -23 17 28 -30 48 -45 -17 63 -12 17 -6
4341 -6 22 3 1 15 -41 2 -10 39 3 -33 33 2 58 35 22 -34 -27 -4 -30 33 -50 31 -13 15 -22 -36 -29 -19 -27 -28 -29 0 31 40
$$ packed form
4115B2m1L3l2R8n5l5NLoj8M6j4oj1jl8O4j5LJ6l6j8L4l9P3k5pl3Q0n9mJ5L4m4
4149a1M7l1j5L9m4l2R6nm9J2Nq7K0K4K8RM8r0K3L4m1N8o0K1Jk3k1L2N2pj8kl9
4182b6L8K1m7j2L4m7P5nn2mN9l7L3o9K5m2J9N5Jk7n8P7l2RP9p4ooJ1n6Q9mK8o1
4216a2oN6k3J8m8O9o4J1K0Ml4J4j0j2m5M7N9j8j4j9L8l6kJ1Pl8L6j3n7Q8K3n7
4248gn2J3J01o0J4l3MK3j8O4m4j0K3j2j3n6J9O1o2R0l9m5P7k4%m9K1l2K5O1r0
4279e0L1P5n9j2l6Q7j8J9j06N6m0K0K8j6N7p7R1oo0l4K5M7mMlk8J5j7J5j1nL8
4311B6j2k3j2O5J2k2M0p3J5k3l0K7L1k7J9m1Q7j4n1j7M0J1n8P8r3K8Q0p5K9k3
4341fK8j9kJ4n6M3j2M9l6l6O6l1N6k3j3n6PK3k6O3q3Q1m4K8l7j4PJ0qjjK9L1R
$$ plain form
4375 40 -25 -5 -22 -37 -10 18 -24 -3 -29 7 9 4 29 18 5 -7 13 -7 4 14 -58 36 20 -33 27 -41 -17 30 0 -65 15
4406 15 39 67 -36 47 8 -39 11 39 37 0 -7 38 -15 38 -53 -29 17 -38 -46 0 3 4 8 23 33 13 -40 43 3 -21 1 3 -8
4439 -8 -50 -42 -12 66 13 -1 27 17 5 57 -28 34 36 -1 -36 27 -4 42 8 22 -2 26 27 -46 -20 17 -35 -21 -4 -63 -12 -2
4471 -2 27 -6 -16 -7 14 -13 -5 -15 15 -27 -7 16 8 -10 -22 31 -5 -72 -14 -10 17 11 29 8 -17 -5 -20 -6 -22 -36 16 -11 -27
4504 -27 -37 -30 -40 -63 -19 -35 -1 -56 -28 1 16 -35 41 -17 -10 39 33 6 43 28 33 17 50 -15 -19 -11 -20 33 19 11 -20 -26 9 -31 -49
4539 -49 15 -36 -33 13 12 3 -48 26 -10 61 -2 22 13 6 1 19 23 3 8 2 61 -47 -28 -2 14 -12 -38 -39 20 -53 -45 -2 38 -38 -35 -1
4575 -1 18 -27 33 63 -40 -5 -7 17 29 -32 -42 -13 9 13 16 10 17 -9 22 39 -23 -3 -11 44 -5 -58 100 31 38 -2 -39 -46 6 -9
4609 -9 -37 -14 12 41 -17 20 -72 -28 13 19 -9 11 2 36 6 -6 40 -28 1 -30 -45 28 6 15 -62 -41 9 -40 26 -21 -9 -8 -27
$$ packed form
4375D0o5K0j7j5K7K8m2K1k6L6KnK5j1j3j2K0k0J1J0p2R4j6n3O0o8K4M7l0o5Q0
4406A5K4K8j03Q3l9m7N0K8kl7pM5n3N3r1K4M6n5qM6LJMJ5J0k0n3Q3m0k4K2Kj1
4439hm2QL0P8n3j4K8j0j2N2q5O2Kl7l5O3l1M6l4J4k4K8Jp3K6L7n2J4J7n9N1J0
4471bK9l3j0RK1k7Qj0L0m2K0K3qj8j2N3l6o7N8MK7oJ8k1k5J2j5J4j6j4N2k7j6
4504b7j0Pj0k3M4j6L4n5K8K9J5n1P6n8PM9ok7L7j5Nj6L3o5mQrN3j4ql1oL5m0j8
4539d9O4n1LM6jrn1P4l6P1o3K4rpnJ8Mk0NoN9j08J9K6J6k6k6jN9p3QM3M0p6LL4
4575aJ9m5O0L0j03L5kK4J2o1j0K9K2MLoPk6L1J7o2K0qN5m9n3J58o9Pm0l7pN2j5
4609ik8K3K6K9n8L7r2M4M1Ok8K0rL4l0j2M6o8K9l1j5P3k2Rp7K1N0m9O6m7J2Jj9
$$ plain form
4642 -27 33 -9 -18 -39 24 -21 19 8 -36 -21 -40 -30 38 -36 22 23 -6 -9 5 59 -9 4 -78 18 28 11 -2 -20 -29 -52 6 -5
4674 -5 27 -5 -25 -19 19 4 9 -30 35 16 49 -35 -11 -17 11 -34 24 37 -41 -49 -32 4 44 8 18 18 -45 7 10 97 -42 30 17
4707 17 42 12 -4 -37 -19 1 -44 -30 -10 -16 -9 -29 14 -22 39 12 3 -39 15 -13 15 22 -18 24 0 9 -38 10 15 -27 20 -29 -52
4740 -52 -28 -13 29 10 35 8 -33 -6 -13 -44 -26 18 49 13 51 -73 20 31 -16 -20 20 -14 -19 -3 -9 21 -57 -9 -4 29 20 15 -55
4773 -55 5 23 -5 -18 -15 28 -16 -35 29 12 -27 36 -18 -31 -10 72 1 31 -41 -95 -7 13 16 43 -30 -9 16 -10 34 1 -11
4804 -11 -82 -44 27 28 -54 52 9 26 -40 -15 22 -14 -8 22 -27 4 -40 -80 0 -12 51 0 -13 9 -7 -38 -38 -17 -46 -7 -13 13
4836 13 52 -23 32 0 -21 -44 -58 12 -20 -25 53 -21 -49 17 -2 0 13 22 29 -6 42 -28 18 46 17 -29 -43 -16 -9 -42 42 -48 -21
4869 -21 41 -31 6 82 -9 -19 4 19 -47 -27 -35 21 -17 17 59 -28 -23 -20 -21 -50 -44 -44 -28 -5 -49 -9 21 6 30 17 4 37 -52
$$ packed form
4642b7O0m2rk1O3m5M0j1m4J5j9J0O8p4N8Jk9lJ4N4o8J3q2R6J0j7j3j8rk3N8j1
4674eL2l2k0OL8j5Nl9O5j9L3q4K4oK8m5N8J3p8qJ7L6M0l6J0%o3N2LQ7j39P2j3
4707A7K5l0j6l3J8K0m5J4K0oPk0M3l6O1k7rm2N4k8K8Pm0M2k4Rm7M8Nm2M7m9k3
4740e2K4J5M2j9K5k7m1K7pl1J8M4L1l6L8j24R3J1m7mM0l4nJ6oL0p8M8NL3rnp0
4773e5O0J8k8j3LM3m4j9O4j7l9O3n4j3K1Q2p1L0p2n4Q8K0LK7p3K1K5k6M4l3j2
4804a1p1L8P1Jq2J06m3J7o6K5L7l6OL0m9L1m4m0Q0j2O3n1j3K2j6l1%K1k9L9oK6
4836A3L9p5N5l2k1k3j4P0l2nP8p4k8O6j9KJ3RPl5M8p0M6K8k9m6j4K7Pl3Q4r0K7
4869b1O2p2L7P6r1j0K3J5o6K0qN6l8L4M2q7NLjk9O%J6K3m4M0L0j5K4j3j3L3q9
$$ plain form
4902 -52 -7 20 -28 -7 -15 -34 -17 -28 -26 17 6 -53 -2 -28 -27 -23 -2 -27 -3 46 53 20 53 21 -27 -24 -44 -39 -15 3 20 19 -5 -21
4936 -21 29 4 -38 -2 -10 23 -45 -33 -2 19 -16 -30 18 -14 -50 19 40 0 37 13 -41 -19 -38 20 -50 -29 -29 8 -28 -68 12
4967 12 16 49 -52 18 17 3 5 -29 1 -54 32 7 32 16 12 -1 14 -30 20 -46 -10 28 46 25 11 -18 -17 -53 -15 2 45 24
4999 24 6 -3 18 -21 14 -2 -13 74 -56 22 -7 1 16 -10 -20 -25 -26 -13 -22 -33 20 55 -36 18 57 -30 0 43 -26 -13 41 -1
5031 -1 -47 3 -11 -28 24 0 4 -6 -2 2 42 -1 -11 -7 -13 -10 70 26 -15 -32 -44 -2 -6 47 26 -25 5 -9 66 -21 8 7 35 -4 -36
5066 -36 19 20 -7 -3 -34 -2 -23 -37 73 -12 -17 -32 9 2 41 3 -51 10 10 8 27 -11 17 -34 56 27 -11 6 4 50 -11 -6 27 9
5100 9 40 -6 -24 -11 -42 -1 2 -38 20 -28 4 15 -18 -17 -29 10 69 -16 -25 -22 -17 15 -36 21 4 46 -3 -4 16 5 15 -16 5 9
5134 9 -16 -13 -19 -32 12 -22 -2 -34 -5 3 -6 19 18 13 6 -54 -22 1 -42 13 -5 10 -58 -25 -44 31 37 25 28 -6 -35 -49 15 -16 -29
$$ packed form
4902e2M5K7m8K1qj9J7j1KM3j1n9N1k6JMK1k5K4M9Pl3L3l2m8Lk0NK4J8J7jk4j6
4936b1N0k5m2L6qL3o8J2L1K1l5j4M8l2l6O9K1m0L7k4n4K2j9N8p0K1%L7l6m0Q0
4967A2ML3j01P0jj4Kl4L0n5Q6k5K5j6mj3J5m4N0o6L6L8J8k1j4k9Jl6L8J7M3k1
4999B4j8rK1l9L5j6j1Q7j30P8k9QJ5k6j0njJ3rj1N3L5r1N4L9q7L0M3o9J3N4m2
5031am6N0j4j7N2k4Mj0MMM0m3j0MoLQ0m4m1j7j2M2mN3k1n1L0j4P5q7K9jK8l9l2
5066c6N5Jk7Ml1L2k1j4J10q5nj5M1pL9l8n4O1%kJ9l8K8n1R0k9l8J7kM6o1NL3j8
5100IL1m6j8J3l1M1Lm0N8m8L2J1l3Jj2L9N9q5rLNL2n1N7j7M2m9jK0j1J0l1K1M
5134Ik5Loj3M4l4K0l2K9QrK5jnpo0L2K3m3N5j8J5o8L3j9P5Oj2Ll4k9j4O4l1j3
$$ plain form
5169 -29 30 -7 43 30 46 -22 66 65 63 -52 -17 -31 4 -55 33 8 -9 -14 25 -34 -35 -33 38 38 -2 -13 31 46 -19 -11 27 33 66 4
5203 4 28 21 -11 40 40 30 11 43 -68 15 -12 -5 -13 17 -33 17 -27 22 19 -17 -15 20 8 37 -3 12 -37 -64 42 31 -23 -36 -17
5236 -17 -6 47 -21 44 -6 20 56 27 -59 -17 4 65 5 52 17 -16 -12 15 35 -45 -7 2 13 -42 1 -4 20 -1 22 17 -40 -20
5268 -20 22 -25 -15 -58 -25 -26 10 66 -26 -17 12 78 49 -29 -68 4 -16 13 9 34 -41 5 -18 -11 -58 0 7 58 59 0 7 -37 -28 -7
5302 -7 -20 -36 23 -10 -3 -32 -25 44 -42 28 4 0 21 -64 1 -25 -33 33 10 -18 -6 16 -6 10 30 7 21 -48 -27 -73 0 0 -49
5335 -49 -58 3 7 -19 -33 -2 -51 3 11 6 -13 -32 10 17 -1 0 30 -8 -38 -77 -67 17 -17 -49 -1 44 26 -54 22 53 -4 -38 -16
5368 -16 8 -14 -5 10 3 -24 -38 -35 -9 -34 9 1 15 5 -43 20 -47 14 -13 -62 70 11 -25 -11 -13 -28 -72 -4 -2 2 -7 25 -9 41
5402 41 -10 -48 -84 5 -39 3 37 -6 -14 6 53 -31 -16 6 7 -13 26 -6 28 -74 46 19 32 -48 31 33 -21 -2 5 -24 -37
$$ packed form
5169b9N9l7N0j3J6o8Q8jkj15L5j4L5n9Q8k5j7nL9n9jKP1%m0j1M4J5o5QL8OL3o2
5203DK4pl2N1%j0j9L2j11Q3k7PqL0n0N0m4M9ll6KL5j2K9m0J5m9k7J06j1n4j3J9
5236a7J1N3o8O5n0K6L6k9q6M2K1O1o0M7l5l3MK7K0q0L8RJ1n5M3nK4k1K3nn7K0
5268b0M2m7J0m3L3jL6N6r2RK9O6k9p8l9P2k0K9mK5p5M6k3Pm7N8PN1Jn9Pm4RK1
5302gj3j6N9l3Pk9PO9q6P0k4mK1q5O5k6qO6k3k8J2K2k2J6K0k3J4o9K1m6P3%m9
5335d9rO1Mk6j4L1m9N4Qnj9j9M2Pj8JL0l8l0l9J0Q4l4l2M8M5j8q0P6L1n7l4K2
5368a6K4k2RJ5pk7j4LK6k5M3qJ4j0m8O3o7O1k7m9J32n9l6J4kj5m4O8KMrL2l4N0
5402D1n1l8l6Q9m4M2L4m3qK0M7q4J5K2Jk0L9l2L4j02J20k7J3q0P9Kn4J9Pk9j3
$$ plain form
5433 -37 -25 -12 52 2 11 -6 8 -25 38 -11 -7 -6 6 -2 25 36 -57 -43 -9 3 14 -14 30 -7 -25 58 -42 -18 34 49 23 -23
5465 -23 -5 26 45 51 19 4 12 -9 -44 10 -8 -1 45 -28 40 -49 -57 -13 -10 36 -24 53 8 -1 -34 44 24 32 -29 -40 31 -1 -43 -28
5499 -28 19 0 -4 -45 16 30 -16 15 44 -22 15 21 17 -7 1 -12 38 -22 19 -19 35 -4 38 5 -33 54 43 15 -8 -6 -24 -25 6
5532 6 -63 3 47 -4 39 30 24 -26 107 -2 1 -34 4 18 41 -22 -8 22 35 -32 -3 26 -20 29 14 63 25 -18 -22 -25 -38 5
5564 5 5 44 -36 -42 -53 -59 -58 19 -23 -4 0 -47 1 14 9 40 -21 -22 -29 -5 49 -45 18 3 -39 -2 10 6 -15 32 7 -16 45 -55 -32
5599 -32 -2 1 38 -34 42 -22 66 -18 29 12 -14 17 42 14 25 -5 37 -37 -6 14 -43 -24 29 33 -2 3 -6 4 -70 25 -25 42
5631 42 -2 13 24 27 -19 -12 -16 20 -2 -22 39 -44 -16 -16 17 -16 34 -19 2 -4 -23 13 -33 -44 25 1 4 7 -17 -21 -11 -66 -2 -18
5665 -18 -56 -42 -6 19 61 -5 -29 -2 -10 23 -46 3 -45 -19 -28 -40 67 54 -18 -22 11 -1 14 31 -20 12 -35 -3 25 38 10
$$ packed form
5433c7J2J3O4n0Rj7J4l3O3m9MJJ2qK7J1r3J4L4J2J1k8M4l7j8Q3j00K4N2J5k6m6
5465b3J8L1J9Ol2j5Qk1l5N4j8PM6p3O8q9qM4LM6o0P7m5rl3P8k0Qo1j1P1l2m2J5
5499b8M7j9mm1O1J4m6L1K9o6L7Omk4Qj3N0o0M1l8N4l9M2l3l8Q7j1k8k3Kj8jL1
5532Fo9O6M4n1M3ron0J33j09Ll5L8J4K3o3J4L0J3o7K9K9m6M9j5M9l8m3mlj3M3
5564E%L9q0oj1oJP7m2J9Mm7M8J3nL1o1jpK4N4r4O3j5m2L7J2mk1M7k5k3O1j00K3
5599c2L0LL7p2P6o4Q8q4M7j7k6L1K5k8J1l0M2p4L1K0n7J9N3Ml5NrJ0p4R5n0O7
5631D2m4J5J1Lm6PmL6k2k0O1q3K8%L3l3N0n3K1oj9L6m6j1O9k4LLk4mJ0n5O4j6
5665a8l8J4L6K5M2o6k4K7qL3o9M9m8K6rj2J07j3p2mL3j2J5J7n1L2m7L2K8J3k8
$$ plain form
5696 10 21 -42 -54 -11 21 -7 23 7 -53 47 1 -18 -45 14 -35 17 -38 -49 24 -22 5 38 -9 3 37 -15 -16 10 8 -27 -30
5727 -30 -15 -93 -18 14 -48 -3 -8 -46 8 -41 27 8 12 30 25 -12 -14 19 57 -2 -11 -52 -40 16 64 -9 -40 -12 24 -19 31 41 2
5760 2 47 19 16 -7 0 1 30 20 41 -59 -33 -65 58 12 -28 7 -25 -15 -29 14 13 -26 -51 31 -18 19 6 -7 -21 27 -10 11
5792 11 12 -67 -9 6 -61 34 -48 -40 51 -4 -14 28 22 1 -14 -6 -4 21 36 7 65 -35 -12 1 -22 19 -49 26 -23 -12 -69 -40
5824 -40 -2 -14 22 5 15 54 22 -5 -27 -23 -25 9 10 19 0 42 22 28 17 -79 -10 -34 -10 -29 -89 27 -8 -1 20 -13 -22 -12 12
5857 12 25 2 -10 26 16 -51 -24 36 -12 16 14 14 24 -41 -24 15 -40 -42 -52 13 41 -33 5 -13 -36 18 -7 12 17 56 24 0
5889 0 53 11 -14 -7 15 -10 1 15 -19 -61 -39 51 52 -43 -10 22 -1 -12 9 -23 1 8 -43 1 -41 -31 17 25 3 4 5 34 -45 -28
5923 -28 -46 33 33 -59 -38 20 -2 -72 -7 -5 -10 -8 -32 68 -12 36 -1 26 -15 -18 -43 -64 8 -15 28 -47 14 16 -5 -33 35 14 -33
$$ packed form
5696A0J1o3j2M3L2k8L0j6o0J00m6j9k7N9m9N2n5j1P3m6K7L3m7J2L4n2jK6kl5l
5727c0J5p8P5L2o2M5nl8N4m9O8j9MJ8nl7kL3L8n9rm1J2N6M8p3l1K8L6m3N0J0l9
5760BM5k8lk3PJK9j0K1j00K6l2J23m6m0L5l2J0j4M3jl9k5Q2m9L7j3j3j4M8l7K1
5792A1Jp9N8J5o7R5q2QR1n5j0M2ok1j5QKK5J5k9N8j00K3J3k3M1o8P5m9J1n7K9
5824d0L8j2L6j7J0L9l2k7k2MkL4JRj9M2k0Oj1r6O9k4K4j9o0J16l5PK1l3rJ0K4
5857A2J3k3j2L6j0o7K7O0m8K8k%J0o5J7L9n5kj0O5K8p4L8j8k3N4k5J9NL9l2k4
5889@N3m2k5PK2k5J1J4l4m2K2R0Jr5L3L2k3j1K1l2K4Pn1M4m2J0M8Qk2JJK9p9J7
5923b8j8P9%r2K1N8k2p0O5KnKk4J00q0M8l7K7m1lk5k1P2k3M3p5O1Kk1k8O8k1m7
$$ plain form
5956 -33 25 34 11 -52 15 -11 69 -39 -48 14 47 -8 -48 -10 -30 6 -10 -20 54 -16 -11 -3 7 23 10 34 42 11 -38 1 26 26 -30
5989 -30 29 0 42 9 -10 0 14 18 -56 5 33 -53 -14 -12 21 -42 -5 21 -37 9 -10 3 28 -52 39 -26 -18 46 -50 57 -20
6020 -20 58 -14 -43 65 -35 -30 4 -21 11 3 -1 -66 9 38 44 -14 -82 42 8 20 -65 -19 32 -22 -28 -2 -16 7 -28 -72 -47
6051 -47 28 -19 3 12 -19 7 -7 -24 34 -45 36 51 -39 -85 -23 -3 14 27 -15 -7 -39 0 -16 47 19 -15 20 -38 -36 -54 -23 -17
6083 -17 -16 -36 9 -23 -16 1 -23 -27 -4 -21 27 7 -5 7 -1 -17 -16 15 -25 -32 -21 17 1 -6 -7 -15 52 -31 -14 -6 23 -7 -6 14 -45 19
6119 19 13 13 -51 40 10 75 4 -17 -35 1 27 0 45 -5 7 -56 7 -39 -31 -7 -11 -17 23 -56 6 6 -32 -46 -3 -44 53 -12 26
6152 26 -51 -48 2 15 -7 10 -16 10 -78 -13 58 45 -14 -9 -34 -9 -27 34 -41 -40 -29 -4 8 -16 34 -31 -8 1 4 -2 35 7 0 24
6186 24 -18 21 22 -12 15 24 -47 -57 -1 -7 7 -31 15 -19 50 20 -21 -33 36 -33 -5 2 36 27 38 -46 -22 21 -21 17 16 27 23 3
$$ packed form
5956c3N8Rk3o3O7k6Q0j08rO2L3n5m0L8k0L6j6j0P4p0NQJ0J6j3K4Ql1m9L9K5%n6
5989c0N9k9M2l3j9J0J4Mp4O1K8q6L9KL3o3L7K6n8M6j9J3K5q0R1o5QO4r6J07p7
6020b0P8p2k9J08j00NL4k5L2qmo5P5K9On8o8J24l4J2q5M6N1n4oK6j4K3l5m4K5
6051d7P5m7K2Rl1K6j4j7N8p9Q1J5r0m6O2K0J7J3m2Ql2L9j6O3k8l4L5n8Kj8L1O
6083a7Jk0M5l2PJ7k4mK3j7M8k0j2J2qj6JL1m0pJ1L8j6pjqO7q3J7QK9l0JK0n9O4
6119A9o%o4R1l0O5p1k1j8L6K6k7M5n0J2o3O3m6QK4moM0p9O2%l8j4M3m1R7o5L8
6152B6p7LN0J3k2J7k6K6q8O5P1j3n9Nk5K5j8O1p5JJ1K5J2k4N0o5K3RLoL7k8pK4
6186B4m2L9Jl4K7Rp1j0N6oJ4l8M6l4O9l0m1j2O9o9K8PL4rJ1q4K4M3m2L8jJ1mk0
$$ plain form
6220 3 21 3 -24 -81 0 4 -1 -3 -2 -50 -7 15 -20 -44 43 -20 -28 3 38 -16 -13 3 21 -5 47 -36 -82 -31 -38 10 16 15 40 50 -2
6255 -2 -8 -48 26 -21 -20 -15 -37 -9 -16 -21 -44 -34 10 -11 -21 8 1 45 24 29 -17 0 18 -57 18 9 -31 15 -53 32 45 62 58 21 -9
6290 -9 -31 -9 -2 21 37 -38 -14 -9 -51 -1 43 33 -14 -17 32 24 20 9 -24 33 15 -26 15 6 21 14 0 -14 18 -13 -10 -13 39 -43 -11
6325 -11 -47 -6 -62 38 30 -16 -13 8 -1 -29 38 29 70 -40 -13 -12 12 -41 -43 -25 38 -32 30 11 0 10 28 -5 11 4 -24 5 36
6358 36 -58 -33 -16 9 14 -15 -6 5 -45 -20 -98 -40 -1 48 34 -86 11 55 -15 -8 37 -7 -1 -17 -60 -19 -31 -6 15 7 -7 21
6390 21 53 -9 0 32 25 50 -15 -8 10 8 -49 -42 -66 -13 -48 -6 -26 6 -14 3 -36 60 -28 -17 35 -41 -5 -10 -10 -33 22 -2 28 12
6424 12 -19 35 20 5 -49 33 -32 34 5 -39 15 13 39 -3 12 -42 -16 6 22 -75 35 37 27 45 -3 65 23 -22 -24 -37 23
6455 23 9 2 -7 -75 17 -3 18 -10 3 -29 -18 32 46 42 31 -12 40 11 -47 12 -38 21 -24 -19 52 -18 0 -61 -15 -2 -45 -19
$$ packed form
6220CJ8j8k7n7Q1MnkJm8M3K2l5k4Q7o3qL1L5n4LJ6J8k6N2q3m6N1pM8OjK5J0n2
6255bom0P4m7JNk2K8pnk3J0M4k1j0K9pM4k1Nm6J7J8p5P5rm0M6o8Q5J3J7ml7l0
6290ik2K2PK3J6p5K4Nm2N0M4j0m7lM9qmj1l3N7j8m1M1rJ5pj4j4L2l1LlN2q2L2
6325a1l6M1n6J00qm6LK1rk8O7rM1j10K7JK4n3kJ8O3p0O2j9j1J0J8l3J6pk8K9L1
6358C6r4K5J7K5Nk9RJ1n0K5p8N8L9M9j4j20R7M4p0PM5m4Oj6m3M1j2K5K1qj4K8
6390B1L2o2RL2pK5o5PJ8kn7Pk4N3l5M2k0L2k0J7l9R6q8J1N2p6L6n%k3N5k4L0j6
6424A2l1N4j5j5n4Q2o5O6k9m4N4kK6m2J5n4K6K2J6r7J10Kj0J8m8O8m2m5kj3O0
6455B3j4pro8R2k0K1k8J3l2J1N0J4mj1m3N2k9n8N9n0N9m5NP1p0J8o1M6J3m3K6
$$ plain form
6487 -19 -31 41 -4 67 48 14 11 -59 -23 62 3 10 3 30 27 10 9 33 47 -61 2 19 -30 1 -15 38 -78 21 2 -40 56 -16
6519 -16 38 -39 10 7 3 11 -12 -24 8 27 3 -43 -26 17 -39 -52 19 -14 -37 -44 -5 -32 20 57 38 -38 15 4 56 10 49 27
6551 27 -11 -16 -60 41 -47 44 -52 80 -27 3 -39 -14 29 19 -28 -2 4 -33 -36 -48 -12 -21 12 8 -24 5 -17 19 -1 -13 -10 -12
6583 -12 -12 -41 45 21 33 -8 -38 7 9 -33 18 -28 -8 1 8 24 49 33 36 -43 23 -5 -17 -52 -53 -4 -19 -28 -2 26 -1 7 -11 -27
6617 -27 -4 -39 44 23 -20 -19 16 -9 -73 14 13 25 51 22 22 28 12 9 13 -10 -9 20 6 -20 70 17 21 18 -48 -60 -9 21 28 3 49
6652 49 -23 -23 -26 3 -65 -12 31 -36 -28 83 27 -16 19 -9 -82 -22 20 -47 32 16 56 21 -22 23 11 -22 -1 -20 30 -20 10
6683 10 -32 23 -34 -7 -18 23 9 13 4 -14 -21 -33 -33 -28 -56 -19 -25 -25 38 -5 37 1 -48 40 49 1 48 9 -2 -11 -38 11 -33 -23 -22
6718 -22 -57 -39 2 26 50 32 14 3 13 9 -17 -3 -25 -30 -37 6 37 -37 -28 0 -53 3 -2 -18 7 -9 -12 -4 -5 30 20 28 -19 5 36
$$ packed form
6487a9j2P2m5P1j9l4lp0L6Q5n9PpK7lj7jK4J4j08O3J7m9L1j6N3j16R9j9m2R6p2
6519a6N4p7M9lmQk3j2L2J9k4m6J7M3n6j3P1l3k3pL9k7N2L7j9p6N3j1N2m6L9k2
6551B7l8nm4J01q8R1r6J32j07L0m2K5M3j0m7K6Ol7lj2L6rL3ml2K9k2L6k0j2Lk
6583a2%k9Q6k4J2m1l0M5Km2N1m6K0RPJ6K5j6Lp9O6k8j2l5jM9j5rK6K8k7Qj8j6
6617b7K3l5Q3k1m3JL5k5o4Q7jJ2K6k9%Oj6lMk3JK9j4k6R0n3Mlo6j2N1L0Pk5M6
6652D9p2%lK9o8N3M3o7QJ11n6m3L5k8p3O0M2o7P9j6M0l5m3M5j2l3K1j9N0n0L0
6683A0m2N5n7K7j1M1j4Mrj8pj2%Nk8L7o%O3m3M2l6m9Q8Rm8M7l9j1rk7M9m4J0J
6718b2l5J8M1K4K4j8j8j1J0mk6J4k2npM3L1p4RK8n3N6nj6K5j6lQjL5j0Qm7K4L1
$$ plain form
6753 36 -50 -1 -51 -11 16 19 14 -53 10 0 3 -16 17 4 18 9 46 5 59 8 31 -30 -20 -15 -10 -18 43 21 58 -31 -11 -14 0 4 8
6788 8 7 7 -15 -30 23 20 -42 10 -15 17 -2 69 -57 -11 -29 -7 -28 -27 20 -20 49 28 87 29 74 9 -59 -14 -13 -18 -21 43 17 7
6822 7 -24 -13 27 12 21 -10 -11 -18 44 10 17 -45 16 35 -23 -24 10 32 -36 -17 20 25 32 -32 -37 -39 -25 53 -16 -62 -1 25 15 7 -58 -1
6858 -1 -22 -44 -27 -24 11 -5 -44 -17 -28 24 52 13 -24 16 -10 -30 17 -10 35 67 43 -10 -25 -19 -32 56 43 -42 -14 48 -29 -15
6890 -15 -4 -15 -4 36 88 -32 43 -5 49 -48 -9 25 2 13 -23 -1 8 41 8 -10 -22 -19 54 14 23 -22 9 -19 36 23 2
6921 2 -29 0 17 -17 25 18 10 -40 -22 38 31 29 -38 -5 4 -51 48 -24 21 12 -52 -21 -49 -39 83 14 -11 8 -18 6 83 -3 8
6954 8 -3 -34 -35 31 -2 24 -1 24 44 26 -10 35 8 5 -6 37 14 -1 5 -26 -27 43 -1 -30 -35 -59 12 -41 -24 -22 10 2 12 -29
6988 -29 -2 -11 67 -56 15 -38 18 16 -9 -34 0 17 5 28 -1 93 47 37 -24 20 -32 -1 -30 -65 -15 38 47 -24 7 -6 5
$$ packed form
6753C6q6M9n0M0K7Lno7O3j0Lj9L3j3J4rL7m1N4n1K3o1J0NNqO1k2L7q9K0lJ4MM
6788Hj%k2j5N3lo2N2k5L2j9P1j26M6j8K2k1JM7m0O9k1N9n8M5o5o8M5JnlO4k6j0
6822Gl1J1M0j5Rl1jpO2l4Po2O1J9n8jL4K2o8J9L7NPo4nkJ4P8o9m6O1K6j0qo5N7
6858ak1k2J7LL5j6l9K7j1N2K8l9l7M0k6k0M7k7M5L2k4n3j5Oj3Q8j3q5K8O2p7J4
6890a5J1j1J1M0N2j20P5m8N4r7L9L4k3J1l6K2RL3l3j8j2LP3m0Rm5L1k8N5j3k1
6921Bl1K9J7l4M2pqn0J8O0pko7L3Rn5R9p2M5ro4L1k8J0J22o9k5J9k6K4P7q6J1
6954Hj1l1jO6l3K6k5K5K0j8l6M5k7lj1M3k3j5Ol1jP0m4k9nk4P1n3J7KL2qJ0m1
6988b9K7rP8j23P1n3N6kk5k5L4J7j2K3k9R4m6j0o1M4n2L1k9l5N0N3Rp1L1j3J1
$$ plain form
7019 5 7 2 8 -18 31 -7 45 14 68 -9 -49 -53 -57 -55 11 -23 -15 4 3 -15 -3 -17 22 28 -19 -18 0 -9 -34 -4 -49 -15 32 -3 33 2
7055 2 24 20 -16 56 -1 -2 22 15 -31 -34 2 36 -24 -12 -32 -19 -59 -18 15 -11 2 12 -17 14 -18 -10 -58 -58 -21 14 17 -53 -18 -15 4
7090 4 29 -9 -1 50 -15 12 15 -7 -29 -26 14 -19 0 -85 24 -26 -75 -11 -9 -17 -33 1 27 12 9 1 11 41 -64 -4 44 33 25 -31
7124 -31 80 -8 43 -3 -15 34 -15 -41 35 -4 -13 -22 -8 -21 49 -31 15 -47 -58 -62 -36 -16 18 -18 -11 27 -30 -73 -12 13 -26 -27
7156 -27 21 -12 -38 -6 -18 16 2 -4 0 -32 38 3 6 -11 -18 20 -24 5 -16 -41 -4 53 26 39 57 -37 34 16 2 -2 22 -49 11
7189 11 -17 32 59 30 -3 -52 -25 46 0 -19 5 0 -44 33 1 -33 -51 69 8 15 1 -19 19 9 66 10 -24 -1 -30 -14 -23
7220 -23 -1 -3 7 40 17 -12 16 1 0 -16 0 13 -23 27 -37 63 42 -38 -11 -13 -19 -7 4 6 -26 -40 -14 12 13 -42 73 -35
7252 -35 10 15 -5 5 -14 -29 68 -15 -5 24 14 21 27 59 7 -6 2 -6 -16 -13 1 17 -30 -2 84 22 -19 12 -1 -50 -27 -9 -50
$$ packed form
7019EKnOk6M9l8N2l1N4p7m0mmKO6l4QJ9jj8J2j4L9Om7JJ8rk5L0m5L4M7l5L6l1
7055BK2ml6P2n7jK4pm6lL6L4o0J2k0J3m0M1L3k6J3J0k9L1l2Qm8%L7L5Lp0L5LJ9
7090DK5l8QN1o5K7Lk2k2LM0l3J9q5J09n0m9O4Kqj6L4K6j5lqJ0L0j05O0M8j1qn6
7124c1J11q8N1m6j2M9m9k6P6l9rrJ4j3P0q0M6o2j1mK6K0L4l6PL8n7m3O1K5l9j
7156b7M8l3k6L2j2L4j4oMl2P0l5Lj7pL8m4K9k1k5L7N7k7J3J8r4P1j8j4mK4p1O0
7189A1k8M9K7k9l3m9K7P1m6j9K4nm4P7l2l4j8J20o1Pj4k0L8j0N7n6l4K3k9J6r
7220b3K2kJ0L3k3k9K8j5jj6J6J3l6N0o4J00k1q0K7koJ2J1Kl2j4K6K6Jn5J15j08
7252c5M5Nk0J0j9j5R7q3J0K9j0POL2n2j3Qqj0LJ4J6m7K8Q6o2m1L1j3m9K3J8m1
$$ plain form
7285 -50 -21 3 30 -25 -8 -44 16 34 7 -33 -36 7 -17 -20 20 -50 -48 14 -73 -12 -9 14 -34 -12 18 12 2 39 8 -11 10 38 8
7318 8 5 -21 44 28 -4 14 23 -26 0 -26 -4 10 41 -34 -16 4 -27 26 -36 9 31 1 -5 11 48 -2 -33 -34 7 10 -31 13 -36
7351 -36 -12 38 -3 -47 32 -13 62 -7 18 -21 -18 -6 72 42 -14 -1 -51 -45 -38 -41 25 -58 -26 57 -7 30 29 -56 -1 -52 11 -32 55
7384 55 -18 -24 34 -15 -15 -65 -27 -54 20 68 38 -35 -10 12 -3 2 38 37 -2 7 -36 -19 34 59 1 6 -21 10 32 -26 19 -29 -66
7417 -66 -53 -26 -32 10 -9 8 0 -17 -12 -10 29 18 9 -14 -20 -49 -38 -54 7 -25 -17 -15 9 17 7 -25 -4 -4 44 7 -34 -60 1 -3 -28 -72
7453 -72 -18 33 -30 -51 17 61 16 86 54 -23 -23 21 -15 -1 -20 -18 2 43 -32 10 -48 5 -10 4 41 -41 45 -27 6 -20 5
7484 5 -24 39 -66 -6 -18 77 -13 -52 48 -10 2 6 16 36 26 38 17 16 30 -41 -38 -61 10 8 -38 -16 17 31 5 -29 -11 20
7516 20 -15 -1 48 60 59 0 8 -19 0 -16 11 -29 -39 15 -46 9 -16 -26 23 -23 -16 -3 19 -12 54 20 -22 24 -30 26 17 35
$$ packed form
7285e0K9K4K7n5J7l6O0J8k7m0lM3k4lM0p0KO2q7O1LK3m8K2L0oj0L7l1j9K1K8l0
7318Hlk6O5j6l2J8Rm9K6k6K2J4L1p5J8K0l1N3o2M5K2l0oJ6L7n0l1jM1Lm1M4m9
7351c6K4N0m1m4P9m5P5o9K5l9LJ2P8l0n6J3n0OPlO6q3L2Q3o4L7jq5N5n1O3m3Q7
7384E5p3oN8m9%n0L8k7P4M8l0p3K5K2j5NL6jl9Rm3J7N3K5n8Nk7L1K2n8M5m8l7
7417f6J3K7oM2j9J7qj7NKL9j1rk3ok9J1j6O1l2QKK4Qj0l2K1%M8l7m1k6O1mk5m4
7453g2N4N1o3k1O8M4m5P0l2p7%M4l6J4j9KK0M1p5M2n8N3j5J4L7q2Q6p2L3k6K5
7484Ek9O3j05O0j2R5r0l9J00n8J2MJ0K0j0J2k1jJ4p1Lk3P1km6K2L3J4k6l4J8L1
7516B0l5J4M9J2jn9Qk7J9j6K7m0j0N4o1N5k5j0M9m6PJ3K2l1O6l4m2M6n4N6rJ8
$$ plain form
7548 35 -13 34 -15 -31 -18 37 15 -59 -26 4 8 -5 -39 5 42 -12 12 16 20 9 -4 -31 7 -15 34 19 -7 -1 -12 10 -37 -13
7580 -13 -35 18 -42 -7 -45 -2 -29 -25 15 -11 43 -21 -34 -25 -5 23 -24 -52 -39 -14 -31 0 -5 -12 -58 -7 10 7 -23 19 11 4 -28 -2
7614 -2 -5 -18 9 -33 -42 36 -11 -11 -36 -12 43 -27 18 -1 40 -12 -16 -9 18 13 18 51 22 27 6 -51 15 11 3 22 4 -25 2 26 27 15
7650 15 32 -22 31 -37 -17 44 -23 -25 -9 -40 -21 -47 -18 -72 -58 -7 -30 -12 12 -76 27 -45 54 -29 -23 -21 -6 19 27 24 -65 40
7682 40 -53 41 -61 -14 20 -6 -54 12 24 -10 -11 25 -20 -62 -28 12 8 0 26 -41 -36 -39 13 7 -9 1 23 47 44 13 29 37 51 9
7716 9 -13 -30 -12 -23 12 -1 72 57 73 65 -6 -61 -17 -57 41 -49 -43 -22 -31 10 39 -12 -35 38 -16 -22 -5 -32 -16 20 -2 12 16
7749 16 -44 -38 50 0 -17 -6 -1 -5 -44 -14 -28 13 3 -29 36 15 -40 -4 -29 38 -5 19 23 1 -25 42 -13 19 -37 -12 -36 -5
7781 -5 -7 3 3 -35 16 -69 43 -5 4 38 42 18 8 32 -65 9 8 -7 -8 42 -19 -15 -15 -11 58 0 25 5 70 6 28 20 0 -90 -67
$$ packed form
7548C5m8M7m9j6J3N5k2p4L3L0Mj3l4M4L7n4K4MMj1j3k7L8k2M9j5k6Oj1K2m7K4
7580a3k2N3o0L5l8M3k7MM0k6N4o4j3RK0K8m7k8J3K5j7L1npm6N1J7ll0M2qpl2K6
7614blj3K7m2rP8m7%k5K4N5p0M5j9M1n2mPK7nNL3k9Nk1n7O6mqJ9j8k9K7K4Jj2
7650A5J7n4N3o8K0O1o7kJ6l1J9k6K9n4J4N1k3J8K4q8J03p2R9q3OKJ5K5Qlq9J05
7682D0r3R4j02M7L4k6m8O6J2l4jL6m5m2L4M0mqK6o7NlN2oj6J0K2K4ll1J6QJ4m2
7716Ik2j7J8j1L5j3P3j5J6qp1n5M4m0R8r0OK1rM1K9n1k3P3n4oJ7k7J6L6k2J4M
7749A6o0OQ8n0j7J1Nml9L0j4M1j0l2O5k1n5L6k5O7m3K4Mk2k6O7n5L2n6K5k4L1
7781ekJ0%l8N1q5J12m8RL4Mk4j0K4r7P4jj5jN0o1M%MO9n8K5k0O5o4K2qk0r0K3
$$ plain form
7816 -67 -17 -47 5 5 -57 -10 -9 -68 1 -33 -2 67 -16 5 5 40 2 -18 -36 12 37 -26 -31 27 4 13 4 14 22 -39 21 -14 -8 5
7850 5 33 -19 12 23 -18 24 23 -17 33 -12 17 -64 28 22 -37 15 4 -23 -11 5 66 -25 22 3 -12 33 27 17 15 -6 11 2 4 63
7884 63 -2 3 -15 38 7 11 -29 -31 15 39 -11 -22 63 -4 8 -34 -6 -10 -4 -8 23 36 -39 -31 49 -6 11 19 2 61 -24 -57 28 23 41
7919 41 24 -24 0 11 -16 50 -51 19 3 -18 -20 52 23 -67 34 68 54 1 -48 7 60 15 12 -9 2 -3 -35 59 -2 36 -13
7950 -13 -36 -10 5 -5 -6 -15 -6 34 -38 12 -59 14 -20 2 -59 -1 25 -30 36 14 1 15 7 26 19 -37 -19 -2 60 38 -24 17 29
7983 29 23 27 -1 20 83 53 -35 -22 33 -13 5 -35 -20 -28 -15 -13 35 32 29 -22 -26 -25 13 -6 -21 37 9 -16 -32 77 -24 28 53
8016 53 24 1 -22 3 34 43 10 19 10 -5 -72 -10 -25 65 11 -29 -70 -86 35 12 33 4 12 27 -7 15 -4 70 72 -27 -27 0 -30
8049 -30 25 24 39 10 2 50 -32 43 13 24 -44 38 -24 -4 24 -46 33 14 10 13 7 -37 -4 27 3 -42 24 -5 -15 -46 69 14
$$ packed form
7816f7N0l0N2%o2M7Jn9O9l4L1O9q3K1%L5l8k0j8M8K5o3nN8k3RrJ0Qo1O0l5OJ3
7850EK8n2L1J1m1M2jm0N0m5K9q1R2on9N2j1k7J2J6O1r1M7j9j5M5oj0kk1J7rKN9
7884F3o5Nj8N3l1Mm0kM6K4n0j1Q5o7J2m2K8mOmL1J3p5QQ0n5J7Qj7N9q5l3Q5nJ8
7919D1j7m8K4J1k7O6j01P0j6k1kP2k9r0J01L4j4n3m9N5N3m5lk1J1nl2R4o1L8m9
7950a3k3K6J5j0jrRM0p2N0p1P3l4K2o1N8K6n5O6k2j3J4qJ9pn6J8J7O2k2o2M1J2
7983B9oMk8K1O3l0q8J3N5m6J8m0J5qJ3KM8lln1mJL8j9j5N8k8k5j6J09j01N2K5
8016E3k9k3k3K5L1Rl3Rrj5o7O2j5R0n4m0m1j6J21k3K1k9QJ5l4K2j9P4Kr9%K7l0
8049c0N5jJ5k9qM8q2P5l0J1o8Q2o2K0K8p0P9j9mLom4L3L1k4m5O6k9j0l1J15n5
$$ plain form
8081 14 4 30 -49 -29 -15 7 54 -19 25 -26 -22 -15 -14 -8 -1 -3 0 -20 -11 43 9 36 12 -22 -15 84 13 73 -13 -12 -61 -24 -29 -23 -22 -38 0
8118 0 11 -20 9 -16 -48 3 -67 8 -13 -53 -13 -11 -11 21 -9 36 -30 1 34 31 20 -10 35 -27 35 2 -39 18 5 8 11 -28 -22 48
8152 48 -2 13 -9 -14 51 23 -65 30 -14 -10 -37 -7 5 -17 -11 7 6 21 -22 42 15 44 -31 17 30 25 -10 -2 22 -22 -17 -3 1 22
8186 22 13 25 16 3 -27
$$ packed form
8081A4j0K6p9K0J4K2M7p3M4n1MPJOPkLk0RN4l4K7k4l4PR9p1O0q6Jm9L7nOJj6L8
8118@J1l1K9k5l2N1p0P5k1m0M0K%L2l0M5o6L1L3lj1l0M5o2O2l3m1N7j3LLl9OP0
8152D8n0J5k2nO5k8q8R5m4Mk7L0J2k2OJ8jJ5m3O4k7K9p5M8J3nl5QK4m4NJ4MK1
8186B2rJ2rj3l0
8191b7
##END NTUPLES=NMR FID
##END=
