##TITLE=1H_DE-80H_X3
 200.13MHz, d2o
 8 sc
 
 19ns.26.2.2025
##JCAMPDX= 6.0         $$ Bruker NMR JCAMP-DX V2.0
##DATA TYPE= NMR FID
##DATA CLASS= NTUPLES
##ORIGIN= UXNMR, Bruker Analytische Messtechnik GmbH
##OWNER= pz
$$ XWIN-NMR		Version 3.5
$$ Tue Apr 29 10:44:21 2025 Russian Standard Time (UT+4h)  Yarkov@DPX200
##.OBSERVE FREQUENCY= 200.1313
##.OBSERVE NUCLEUS= ^1H
##.DELAY= (6, 6)
##.ACQUISITION MODE= SIMULTANEOUS
##.ACQUISITION SCHEME= undefined
##.AVERAGES= 8
##.DIGITISER RES= 18
##SPECTROMETER/DATA SYSTEM= spect
##.PULSE SEQUENCE= zg30
##.SOLVENT NAME= D2O
##.SHIFT REFERENCE= (INTERNAL, D2O, 0, 14.3821)
##AUDIT TRAIL= $$ (NUMBER, WHEN, WHO, WHERE, WHAT)
$$ ##TITLE= Audit trail, XWIN-NMR		Version 3.5
$$ ##JCAMPDX= 5.01
$$ ##ORIGIN= Bruker BioSpin GmbH
$$ ##OWNER= Yarkov
$$ C:/Bruker/XWIN-NMR/data/yarkov2/nmr/H-C/1/audita.txt
$$ ##AUDIT TRAIL=  $$ (NUMBER, WHEN, WHO, WHERE, WHAT)
(   1,<2025-04-29 10:42:38.17 +0400>,<Yarkov>,<DPX200>,
      <created by zg, POWCHK disabled, PULCHK disabled
       configuration hash MD5:
       00 E9 B6 7A A2 85 ED C7 34 08 36 98 17 FE 4E 26
       data hash MD5: 16K
       78 EE B0 92 01 21 BC EC 31 95 CA DF 64 9C 3A 7B>)
$$ ##END=
$$ 
$$ hash MD5
$$ 91 F5 B7 2F 4A D1 45 ED 7D 5A B6 9A 3B 31 0B 75
##$RELAX= 
##$RELAX= 
##$RELAX= 
##$RELAX= 
##$RELAX= 
##$RELAX= 
$$ Bruker specific parameters
$$ --------------------------
##$DU= <C:/Bruker/XWIN-NMR>
##$EXPNO= 1
##$NAME= <H-C>
##$PROCNO= 1
##$TYPE= <nmr>
##$USER= <yarkov2>
##$AMP= (0..31)
100 100 100 100 100 100 100 100 100 100 100 100 100 100 100 100 100 100 
100 100 100 100 100 100 100 100 100 100 100 100 100 100 
##$AQSEQ= 0
##$AQ_mod= 1
##$AUNM= <au_zg>
##$AUTOPOS= <>
##$BF1= 200.13
##$BF2= 200.13
##$BF3= 200.13
##$BF4= 200.13
##$BF5= 200.13
##$BF6= 200.13
##$BF7= 200.13
##$BF8= 200.13
##$BYTORDA= 1
##$CFDGTYP= 0
##$CFRGTYP= 5
##$CHEMSTR= <none>
##$CNST= (0..31)
1 1 145 1 1 1 1 1 1 1 1 1 1 1 1 1 1 1 1 1 1 1 1 1 1 1 1 1 1 1 1 1 
##$CPDPRG= <>
##$CPDPRG1= <>
##$CPDPRG2= <>
##$CPDPRG3= <>
##$CPDPRG4= <mlev>
##$CPDPRG5= <mlev>
##$CPDPRG6= <mlev>
##$CPDPRG7= <mlev>
##$CPDPRG8= <mlev>
##$CPDPRGB= <>
##$CPDPRGT= <>
##$D= (0..31)
0 0.7 0 0 0 0 0 0 0 0 0 0.03 0 0 0 0 0 0 0 0 0 0 0 0 0 0 0 0 0 0 0 0 
##$DATE= 1745908957
##$DBL= (0..7)
120 120 120 120 120 120 120 120 
##$DBP= (0..7)
150 150 150 150 150 150 150 150 
##$DBP07= 0
##$DBPNAM0= <>
##$DBPNAM1= <>
##$DBPNAM2= <>
##$DBPNAM3= <>
##$DBPNAM4= <>
##$DBPNAM5= <>
##$DBPNAM6= <>
##$DBPNAM7= <>
##$DBPOAL= (0..7)
0.5 0.5 0.5 0.5 0.5 0.5 0.5 0.5 
##$DBPOFFS= (0..7)
0 0 0 0 0 0 0 0 
##$DE= 6
##$DECBNUC= <off>
##$DECIM= 32
##$DECNUC= <off>
##$DECSTAT= 4
##$DIGMOD= 1
##$DIGTYP= 9
##$DL= (0..7)
0 120 120 120 120 120 120 120 
##$DP= (0..7)
150 150 150 150 150 150 150 150 
##$DP07= 0
##$DPNAME0= <>
##$DPNAME1= <>
##$DPNAME2= <>
##$DPNAME3= <>
##$DPNAME4= <>
##$DPNAME5= <>
##$DPNAME6= <>
##$DPNAME7= <>
##$DPOAL= (0..7)
0.5 0.5 0.5 0.5 0.5 0.5 0.5 0.5 
##$DPOFFS= (0..7)
0 0 0 0 0 0 0 0 
##$DQDMODE= 0
##$DR= 18
##$DS= 0
$$ [...]
##$SUBNAM2= <"">
##$SUBNAM3= <"">
##$SUBNAM4= <"">
##$SUBNAM5= <"">
##$SUBNAM6= <"">
##$SUBNAM7= <"">
##$SUBNAM8= <"">
##$SUBNAM9= <"">
##$SW= 18.0517328524113
##$SWIBOX= (0..15)
0 0 2 0 0 0 0 0 0 0 0 0 0 0 0 0 
##$SW_h= 3612.71676300578
##$TD= 16384
##$TD0= 1
##$TE= 0
##$TE2= 300
##$TE3= 300
##$TEG= 300
##$TL= (0..7)
0 120 120 120 120 120 120 120 
##$TP= (0..7)
150 150 150 150 150 150 150 150 
##$TP07= 0
##$TPNAME0= <>
##$TPNAME1= <>
##$TPNAME2= <>
##$TPNAME3= <>
##$TPNAME4= <>
##$TPNAME5= <>
##$TPNAME6= <>
##$TPNAME7= <>
##$TPOAL= (0..7)
0.5 0.5 0.5 0.5 0.5 0.5 0.5 0.5 
##$TPOFFS= (0..7)
0 0 0 0 0 0 0 0 
##$TUNHIN= 0
##$TUNHOUT= 0
##$TUNXOUT= 0
##$USERA1= <user>
##$USERA2= <user>
##$USERA3= <user>
##$USERA4= <user>
##$USERA5= <user>
##$V9= 5
##$VALIST= <valist>
##$VCLIST= <CCCCCCCCCCCCCCC>
##$VD= 0
##$VDLIST= <DDDDDDDDDDDDDDD>
##$VPLIST= <PPPPPPPPPPPPPPP>
##$VTLIST= <TTTTTTTTTTTTTTT>
##$WBST= 1024
##$WBSW= 4
##$XGAIN= (0..3)
0 0 0 0 
##$XL= 0
##$YL= 0
##$YMAX_a= 179565
##$YMIN_a= -191595
##$ZGOPTNS= <>
##$ZL1= 120
##$ZL2= 120
##$ZL3= 120
##$ZL4= 120
##$ABSF1= 10
##$ABSF2= 0
##$ABSG= 5
##$ABSL= 3
##$ALPHA= 0
##$AQORDER= 0
##$ASSFAC= 0
##$ASSFACI= 0
##$ASSFACX= 0
##$ASSWID= 0
##$AUNMP= <proc_1d>
##$AZFE= 0.1
##$AZFW= 0.1
##$BCFW= 1
##$BC_mod= 2
##$BYTORDP= 1
##$COROFFS= 0
##$CY= 83.5205535888672
##$DATMOD= 1
##$DC= 2
##$DFILT= <>
##$DTYPP= 0
##$F1P= 10.8118882576601
##$F2P= -7.23987719738617
##$FCOR= 0.5
##$FTSIZE= 0
##$FT_mod= 4
##$GAMMA= 1
##$GB= 0.15
##$INTBC= 1
##$INTSCL= 1
##$ISEN= 128
##$LB= 0.25
##$LEV0= 0
##$LPBIN= 0
##$MAXI= 10000
##$MC2= 0
##$MEAN= 0
##$ME_mod= 0
##$MI= 1.114404
##$NCOEF= 0
##$NC_proc= 0
##$NLEV= 6
##$NOISF1= 3.799351
##$NOISF2= 2.8
##$NSP= 1
##$NTH_PI= 0
##$NZP= 0
##$OFFSET= 14.38212
##$PC= 1
##$PHC0= -832.6194
##$PHC1= 15.13371
##$PH_mod= 1
##$PKNL= yes
##$PPARMOD= 0
##$PSCAL= 0
##$PSIGN= 0
##$REVERSE= no
##$SF= 200.129724274929
##$SI= 16384
##$SIGF1= 3
##$SIGF2= 2
##$SINO= 400
##$SIOLD= 16384
##$SREGLST= <1H.CDCl3>
##$SSB= 0
##$STSI= 0
##$STSR= 0
##$SW_p= 3205.1282051282
##$SYMM= 0
##$S_DEV= 0
##$TDeff= 0
##$TDoff= 0
##$TI= <>
##$TILT= no
##$TM1= 0
##$TM2= 0
##$TOPLEV= 0
##$USERP1= <user>
##$USERP2= <user>
##$USERP3= <user>
##$USERP4= <user>
##$USERP5= <user>
##$WDW= 1
##$XDIM= 8192
##$YMAX_p= 0
##$YMIN_p= 0
$$ End of Bruker specific parameters
$$ ---------------------------------
##NTUPLES= NMR FID
##VAR_NAME=  TIME,          FID/REAL,        FID/IMAG
##SYMBOL=    X,             R,               I
##VAR_TYPE=  INDEPENDENT,   DEPENDENT,       DEPENDENT
##VAR_FORM=  AFFN,          ASDF,            ASDF
##VAR_DIM=   8192,          8192,            8192
##UNITS=     SECONDS,       ARBITRARY UNITS, ARBITRARY UNITS
##FACTOR=    0.0002768,     1,               1
##FIRST=     0,             0,               0
##LAST=      2.2672688,     0,               0
##MIN=       0,             -191595,         0
##MAX=       2.2672688,     179565,          0
$$ Real data points
##PAGE= N=1
##DATA TABLE= (X++(R..R)), XYDATA
0 0 0 0 0 0 0 0 0 0 0 0 0 0 0 0 0 0 0 0 0 0 8 -8 8 -8 8 -8 13 -16 16 -19 21 -24 28 -31 36 -39 44 -50 55 -61 69
41 69 -75 82 -95 103 -112 125 -138 152 -167 184 -203 225 -247 272 -305 337 -377 426 -480 548 -634
62 -634 740 -891 1098 -1420 1968 -3100 6398 -38975 -180055 -191595 -88271 54574 126356
75 126356 98153 13885 -36252 -16579 38912 53909 -5130 -101480 -146917 -88053 48803 166669
87 166669 179565 75752 -68124 -152306 -128498 -33794 50330 66117 25888 -12026 -1076 48173
99 48173 78447 40990 -52969 -136338 -137570 -45434 81071 155558 130006 30875 -66828 -100800
111 -100800 -66123 -10511 15811 2941 -16148 -2599 46207 89250 79431 7121 -85067 -132816
123 -132816 -100341 -10011 79040 111508 79010 16622 -30471 -40997 -30782 -25056 -33836 -39374
135 -39374 -19008 29678 79205 91608 51282 -21977 -83331 -97152 -60626 -1941 44186 59703
147 59703 50658 33633 17256 -1672 -28527 -56682 -68135 -47231 2441 55405 81546 66781
159 66781 21630 -25455 -53016 -55156 -41475 -22455 -667 25196 52164 66307 51878 6917
171 6917 -48381 -81981 -73260 -27918 25698 56965 55880 33662 11199 -2015 -11541 -28348 -49729
184 -49729 -57820 -34208 18864 73362 92413 58766 -8913 -68748 -84188 -52138 -1594 31558
196 31558 33538 19292 13698 24807 35390 20008 -25686 -75606 -88395 -43758 34540 95828
208 95828 98905 41858 -32702 -74111 -61702 -18189 15254 14599 -5553 -10673 15427 56090 69214
221 69214 29712 -45150 -103311 -98382 -28935 57935 103082 79224 12162 -44451 -54172 -23689
233 -23689 7571 7047 -20599 -39707 -18262 38880 87217 81644 14819 -70608 -113420 -83068 -1953
246 -1953 70015 86121 44817 -10838 -35261 -17773 11107 13943 -19106 -57218 -57344 -4584 68099
259 68099 104619 71713 -10678 -86099 -101390 -52264 20260 61732 51119 11393 -15166 -6384
271 -6384 20314 28780 -1998 -51934 -78056 -49413 20692 85192 96220 45268 -29508 -76898
283 -76898 -69563 -23385 20638 31787 14123 -3020 3546 28138 42559 22279 -28204 -72988
295 -72988 -74829 -27160 39461 80233 70417 21069 -29698 -49440 -35819 -10670 1579 -3250 -8592
308 -8592 2542 30054 51266 43272 2509 -47094 -71928 -54667 -7375 38244 56302 42029
320 42029 13407 -8910 -16168 -16312 -19511 -26649 -26515 -9290 21644 48824 52269 26282 -14223 -45734
334 -45734 -51129 -32071 -3480 17927 26918 27247 25180 19550 5397 -17226 -39252 -46359 -29649
347 -29649 4569 37002 49200 36080 8633 -15765 -26552 -25611 -21893 -17642 -9364 8115 31276
360 31276 46761 39715 7899 -31776 -55107 -47765 -15688 19219 36429 31299 15290 3986 1492
373 1492 -84 -10914 -29969 -40877 -28965 7066 47178 63035 41513 -4210 -44843 -55123
385 -55123 -32946 676 20901 19588 8115 4478 15043 26289 18780 -11849 -47739 -59872 -33173
398 -33173 18668 61157 65477 29009 -19465 -46684 -39139 -11114 9629 8242 -5752 -10041 7654
411 7654 36184 47192 23213 -25392 -65361 -64962 -22173 33660 64121 51759 10263 -25626 -32824
424 -32824 -15036 4205 3286 -14431 -26543 -12861 23601 55675 54081 12962 -41232 -70574 -54154
437 -54154 -5334 39885 52321 29212 -3544 -18484 -9571 6657 6770 -13611 -36768 -36426 -3529
450 -3529 41570 65410 47084 -3199 -49995 -62616 -35167 7123 33561 30290 9361 -5025
462 -5025 -565 13846 16694 -2978 -33379 -48917 -31332 11925 51581 59546 30360 -13913 -44255
475 -44255 -42793 -17968 7098 15318 8082 1107 6253 20372 26970 12452 -18747 -45452 -46340 -17790
489 -17790 22354 47585 43137 15899 -13624 -26803 -22078 -10588 -4620 -6318 -5748 5151 23029
502 23029 34330 27110 61 -29690 -44211 -33333 -5849 21041 32136 25869 11533 -210
514 -210 -6029 -10149 -16449 -22133 -20050 -5213 16903 34014 34308 16000 -9949 -28480 -30798 -19290
528 -19290 -3925 7396 13365 17275 19702 18273 7249 -11449 -29548 -34665 -21056 4591 27071
541 27071 33789 22754 3808 -10462 -15022 -14032 -13372 -14062 -11190 1067 20376 34767 31370 8425
555 8425 -21917 -39878 -34955 -10933 14617 25997 20421 8057 1041 1917 3090 -4379 -19856 -30814
569 -30814 -24051 1711 32328 45888 31671 -1270 -30988 -39266 -23284 1178 15020 13011 3605
582 3605 1085 9877 19591 15738 -6206 -32992 -43259 -25295 11137 42486 46627 21413 -12773
595 -12773 -32201 -27312 -7641 6851 5171 -5087 -8110 4422 25394 33792 17142 -16857 -45251
608 -45251 -45507 -16080 22824 44024 35596 7373 -17124 -21605 -9531 2491 1359 -11305 -19505
621 -19505 -8749 17293 38914 37071 8866 -28371 -47973 -36634 -3655 26219 34262 19308
633 19308 -1419 -10556 -4740 4232 2768 -11671 -26144 -23941 -856 29649 44070 30476 -2530
646 -2530 -32681 -40361 -22892 3928 20123 18539 6621 -889 3127 10495 9493 -5492 -25237
659 -25237 -32764 -19081 9890 34852 38975 19465 -8959 -27491 -26932 -12514 1475 6695 4064
672 4064 2921 8112 16570 17668 5367 -15670 -31087 -29293 -9753 15580 30425 27107 10431
685 10431 -6512 -14687 -13990 -9701 -7651 -7802 -3135 7126 19473 24576 16182 -3095 -21741 -28501
699 -28501 -20223 -2426 12613 19259 15895 9193 3292 -1688 -7718 -14879 -19138 -15037 -1434 15280
713 15280 25602 22739 8565 -8752 -19212 -18967 -11403 -3153 2374 6970 11820 16123 15721 6287
727 6287 -9765 -23775 -26335 -14158 5827 21387 23864 14413 867 -7533 -9150 -8035 -8855 -11859
741 -11859 -10449 -172 15547 26816 23691 5484 -17731 -30399 -25374 -6516 12118 19137 13793
754 13793 4388 88 1965 3400 -2240 -14921 -23626 -18515 1545 24443 34471 23290 -2016
767 -2016 -23928 -28726 -16242 1965 11817 9307 2113 580 7553 14995 11688 -5103 -24992 -32273
781 -32273 -18553 9054 31657 33963 15405 -9445 -23598 -19444 -5050 4759 3253 -4061 -5890
794 -5890 4042 19017 24991 12069 -13463 -33516 -32915 -11200 16975 31860 25503 5337 -11775
807 -11775 -14771 -6444 1699 -253 -9409 -14300 -5446 13631 28857 26747 5502 -21267 -34453 -25792
821 -25792 -2456 18440 23948 13696 -129 -6239 -2199 3197 508 -10423 -19976 -16421 922
834 922 22255 31667 20847 -2460 -23483 -27678 -15799 2092 12810 11750 5127 1613 4578 8695
848 8695 5557 -6002 -19847 -23654 -12072 8356 25067 26673 12903 -6007 -17787 -17338 -9095
861 -9095 -800 1940 1809 3162 8740 13836 12853 1861 -13662 -23126 -19684 -5721 11206 20288 18000
876 18000 7693 -2753 -8138 -8392 -8136 -8601 -7631 -2427 7349 16475 18829 10097 -4343 -16803 -19600
891 -19600 -12651 -1255 8079 11605 10475 8117 5477 1539 -5312 -12996 -16421 -12417 -136 13290
905 13290 19928 15916 4717 -7305 -13295 -12027 -7317 -3036 -277 3158 8573 13580 13994 5642 -7764
920 -7764 -19604 -20619 -10462 5066 16331 17266 9615 47 -4916 -5040 -4468 -6224 -9894 -9378 -1102
935 -1102 11744 21124 18633 4674 -13506 -23351 -18732 -4345 9084 13950 9784 2628 628 2617
949 2617 3912 -1116 -11189 -18254 -14610 604 17961 25383 17464 -768 -17381 -21184 -12239 1095
963 1095 7987 6149 1375 526 6105 11553 8845 -3363 -18667 -23851 -14060 6015 22691 24596
977 24596 11605 -6022 -16160 -13781 -4060 2675 1731 -3368 -3973 3816 14328 18302 8856 -9335
991 -9335 -23904 -24064 -8897 11266 22170 18113 4598 -7016 -9422 -4483 332 -1397 -7590 -10366
1005 -10366 -3762 10130 20940 18898 3888 -14472 -24334 -18561 -2883 11741 16223 9968 1216
1018 1216 -2719 -848 2203 -518 -8514 -14483 -11736 1168 15642 22371 15214 -1341 -15610 -19372
1032 -19372 -11224 216 7283 7432 3846 2765 5034 6852 3267 -5462 -15058 -16855 -8178 6041
1046 6041 17454 18339 9004 -3560 -11267 -11235 -6888 -2267 -558 425 2887 8095 11378 9155 439
1061 439 -10662 -16998 -13731 -3362 7866 13497 12043 5695 -491 -3790 -5074 -6757 -8167 -7496 -2065
1076 -2065 6547 13491 14284 6925 -4197 -12476 -13829 -8201 -486 4790 6469 6494 6485 6043 3052 -3352
1092 -3352 -10668 -14054 -10264 88 10831 15485 11735 2614 -6046 -9241 -7510 -4451 -2770 -1809 605
1107 605 5577 10936 12147 5769 -6101 -14938 -16377 -8330 3983 12291 12613 6508 -440 -3404 -2739
1122 -2739 -2022 -4464 -8178 -8192 -2052 8417 16523 15549 4088 -9999 -17740 -14395 -3564 6433 9781
1137 9781 6813 1747 596 2735 4132 -94 -8239 -14184 -11887 -382 13339 19314 13646 144
1151 144 -12196 -15395 -9144 28 5353 3958 788 381 4846 9223 7321 -2063 -13404 -17967 -11362
1166 -11362 3268 15807 18226 9399 -3377 -11081 -9786 -3732 1203 389 -2832 -2936 2825 10954
1180 10954 13735 6696 -6181 -17015 -17798 -7098 6638 15019 13157 4389 -3676 -5905 -3147 -513
1194 -513 -2029 -5924 -7600 -2596 7550 15305 14345 3564 -9925 -16934 -13708 -3113 7118 10876
1208 10876 7446 2225 -662 431 1524 -1111 -6723 -10664 -8618 600 11124 15950 11124 -335
1222 -335 -9887 -12986 -8499 -1221 3478 3953 3083 3323 5014 5801 2560 -4602 -11068 -12485 -6022 4251
1238 4251 12154 12599 6767 -1270 -6728 -7146 -5155 -3204 -1753 -511 2503 7006 9475 7449 502
1253 502 -8168 -12263 -9847 -2739 4921 8456 7773 4226 1004 -1202 -2850 -5221 -7157 -6824 -2057 4631
1269 4631 10899 11146 5641 -2847 -9082 -10014 -5937 -818 2392 3523 3987 4934 5766 3946 -1705 -7731
1285 -7731 -11619 -8550 -765 7770 11937 9269 1858 -4051 -6231 -4927 -3223 -2551 -2815 -926 3503
1300 3503 8634 10204 5555 -3285 -11411 -12780 -7149 2389 9025 9491 5062 -60 -2092 -1264 -1067 -2669
1316 -2669 -6093 -7262 -2754 5853 12479 12178 4316 -6431 -13028 -11405 -3572 4412 6870 4829 1583
1331 1583 572 2384 3543 929 -5643 -10709 -9571 -1366 8993 14410 11015 1179 -8332 -11235 -7017
1346 -7017 -728 3384 2445 200 246 3969 7201 5966 -810 -9406 -13232 -8511 1476 10724 13112 7451
1362 7451 -1617 -7110 -6820 -2842 -51 -494 -2644 -2296 2156 8116 10506 5383 -3747 -11992 -12910 -5904
1378 -5904 3853 9768 9596 3708 -1560 -3364 -1966 -965 -2095 -4877 -5865 -2198 5214 11116 10140 3210
1394 3210 -6153 -11516 -9992 -3438 3759 6644 4784 2158 1084 1387 1143 -1259 -5400 -8313 -6634
1409 -6634 242 7653 11313 8426 654 -6172 -8909 -6271 -2267 1367 2011 2075 3390 4554 5006 1997
1425 1997 -3572 -8476 -8930 -4429 2590 7941 8819 5090 -98 -3429 -4280 -3846 -3114 -3002 -1418 1557
1441 1557 5732 7826 5857 715 -5762 -9182 -7275 -2157 3203 5685 5524 3207 1547 624 -1407
1456 -1407 -3844 -6247 -6195 -2452 3273 8186 8951 4585 -1616 -6640 -6974 -4147 -886 957 1797 2152
1472 2152 3551 5033 3947 -605 -5852 -9208 -7424 -1535 5593 9219 7226 2007 -2510 -4533 -3549
1487 -3549 -1999 -2080 -2471 -1779 1965 6125 8211 5346 -1502 -8179 -10352 -6197 894 6346 7250 3783
1503 3783 255 -1076 -775 -106 -1737 -4932 -6198 -2904 3498 9249 9984 4512 -3572 -9303 -8627 -3454
1519 -3454 2176 5062 3327 1219 846 1856 3477 970 -3691 -8227 -8038 -1756 5673 10526 9065
1534 9065 2337 -4939 -7853 -5867 -1259 1604 1470 33 475 2944 5694 5016 30 -6449 -10197 -7371
1550 -7371 -217 7014 9777 6432 0 -4475 -4727 -2431 -687 -964 -2702 -1931 1315 6067 8126 4884
1566 4884 -2262 -8117 -9399 -5269 1713 6510 6674 3567 -214 -1594 -1010 -634 -1940 -4417 -4822 -1559
1582 -1559 3631 8003 7790 3253 -3744 -7640 -7430 -3188 1699 3953 3548 1948 1324 2002 1243 -1031
1598 -1031 -4225 -6758 -5253 -237 5242 7985 6111 1237 -3481 -5575 -4350 -2017 -228 929 1226
1613 1226 3019 4485 4507 1909 -2845 -6617 -6990 -3228 1332 5717 6202 4090 714 -1329 -2431 -2559
1629 -2559 -3063 -3283 -1938 777 4498 6157 5025 968 -4033 -6420 -5442 -1732 1818 3740 3421 2735
1645 2735 1970 1229 150 -2817 -5070 -5783 -2610 2064 6171 7124 4001 -798 -4108 -4874 -3399 -1185
1661 -1185 59 790 1462 2893 4129 4033 801 -4322 -7183 -6351 -1641 3703 6871 5695 1973 -1504
1677 -1504 -2862 -2305 -1456 -1510 -2434 -1812 794 4453 6320 4767 -198 -5613 -7760 -5329 -102 4371
1693 4371 5375 3356 703 -318 -78 105 -1518 -3788 -5117 -3200 1716 6582 7682 4090 -1695
1708 -1695 -6228 -6738 -3153 1017 2981 2614 1152 811 1717 2672 1152 -2475 -6150 -5900 -2329 3256
1724 3256 7232 6853 2428 -2769 -5160 -4159 -1255 717 583 -19 26 1878 4341 4124 643 -4157
1740 -4157 -7236 -5943 -737 4555 6519 4915 1003 -2380 -2770 -1442 -920 -1295 -2434 -1544 1333 4415
1756 4415 5839 3643 -1100 -5692 -6744 -4424 299 3935 4488 2742 486 -485 -441 -264 -1605 -3662
1772 -3662 -3601 -1722 2481 5612 5773 2677 -2216 -5015 -4989 -2508 518 2286 2275 1646 1816 1980 1364 -707
1790 -707 -3571 -5095 -3795 -404 3574 5482 4403 1028 -1948 -3295 -3072 -1930 -680 -383 420 2361
1806 2361 3584 3644 1581 -2160 -4798 -5154 -2700 988 3470 4027 2863 1091 -150 -1162 -1846 -2404
1822 -2404 -2772 -2063 494 3386 4888 4010 754 -2728 -4546 -3882 -1109 960 2101 1927 1800 1514 1590
1839 1590 402 -1723 -3892 -4628 -2314 1045 4227 5471 3126 -196 -2983 -3493 -2255 -839 -488 -188
1855 -188 595 2305 3496 3114 1052 -2638 -5459 -4849 -1731 2474 4489 4170 1756 -472 -1689 -1455
1871 -1455 -940 -1240 -2029 -1706 261 3073 5010 3729 376 -3556 -5692 -4050 -656 2299 3552 2436
1887 2436 634 -191 143 562 -787 -2722 -3676 -2591 963 4447 5503 3098 -604 -4327 -4972 -2559
1903 -2559 -9 1710 1402 869 562 1555 2111 1079 -1809 -4453 -4724 -1921 2162 5355 5126 1803 -1465
1920 -1465 -3533 -2966 -1383 -319 403 -22 344 1740 3230 3024 523 -3076 -5038 -4074 -1221 2550
1936 2550 4499 3089 1079 -826 -1855 -1320 -1071 -1338 -1810 -1292 991 3064 4203 2920 -327 -3482
1952 -3482 -4966 -2926 -168 2249 3070 2246 712 385 216 -212 -1422 -2773 -2759 -1400 1480 4130 4044
1969 4044 2235 -1050 -3467 -3625 -1997 -320 987 1094 1194 1678 2053 1323 -466 -2301 -3768 -2954 -539
1986 -539 2161 3622 2811 1434 -696 -2047 -1869 -1394 -1037 -757 144 1615 2933 2960 1537 -910 -3144
2003 -3144 -3753 -2178 309 2443 2771 1916 882 120 -214 -939 -1750 -2501 -2011 -90 2363 3603 3365
2020 3365 779 -1693 -3356 -2796 -1284 473 1249 1210 1339 1287 1624 910 -915 -2552 -3421 -1933 652
2037 652 3215 3589 2614 37 -1726 -2203 -1737 -942 -664 -432 107 1598 2634 2647 1112 -1562 -3437 -3568
2055 -3568 -1413 1254 2930 3062 1445 -432 -661 -579 -514 -1273 -1780 -1584 -165 2128 3768 3036 647
2072 647 -2646 -3720 -3142 -760 1783 2260 1817 756 189 386 351 -724 -1882 -2901 -1989 375 2952
2089 2952 3973 2541 -6 -2677 -3245 -1835 -563 1052 1028 686 542 1598 1871 782 -999 -2881
2105 -2881 -3538 -1883 1168 3190 3457 1692 -502 -2080 -1903 -867 -576 -578 -577 108 1241 2486 2362 418
2123 418 -1666 -3643 -3103 -1014 1592 2693 2637 994 -72 -567 -847 -871 -1114 -1669 -894 251 2132 2907
2141 2907 2001 -154 -2132 -3114 -2229 -298 1196 1766 1218 721 519 202 -317 -1224 -2070 -2457 -1191 1156
2159 1156 2665 2770 1831 -754 -1929 -2344 -1556 -344 278 858 878 1364 1705 1343 -266 -1778 -2544 -2339
2177 -2339 -575 1242 2622 2216 716 -441 -1118 -1428 -1281 -962 -697 -172 1114 1795 2270 1317 -808
2194 -808 -2288 -2797 -1854 46 1383 1618 1431 632 287 30 -893 -1453 -1834 -1407 -200 1582 2923 2551
2212 2551 838 -1177 -2221 -2213 -924 -104 593 783 967 1130 1405 866 -542 -1681 -2797 -1581 128
2229 128 2148 3001 1937 336 -962 -1488 -1111 -660 -614 -662 98 1020 1856 2266 759 -908 -2832 -2827 -1516
2248 -1516 588 2243 2308 1216 -18 -456 -481 -350 -750 -1373 -1189 -112 1498 2783 2464 599 -1657
2265 -1657 -2732 -2327 -726 1056 1575 1260 820 187 396 206 -347 -1446 -2157 -1486 372 1936 2984
2282 2984 1967 27 -1543 -2462 -1613 -380 265 611 553 814 1006 1404 634 -814 -2211 -2382 -1182 721
2300 721 2186 2351 1525 78 -1531 -1054 -951 -452 -444 -153 125 1163 1927 1554 599 -1409 -2599 -2263 -766
2319 -766 719 1867 1549 687 16 -605 -644 -657 -906 -1110 -727 176 1543 2032 1775 -104 -1583 -2198 -1564
2338 -1564 -525 792 1108 760 763 702 279 61 -882 -1839 -1883 -861 797 2063 1995 1323 -525 -1202 -1556
2357 -1556 -1005 -483 -178 217 664 1212 1399 854 -394 -1396 -1913 -1542 -348 1391 1981 1410 640 106
2375 106 -572 -749 -789 -868 -920 -381 957 1681 1754 1094 -494 -1410 -1954 -1167 -108 630 1044 1063 337 370 -25
2396 -25 -511 -1138 -1710 -1433 -230 846 1964 1708 523 -771 -1627 -1419 -937 189 170 229 531 989 940
2415 940 754 -569 -1503 -1796 -1461 0 1408 2338 1560 210 -561 -960 -1218 -601 -362 -306 -100 832 1337
2434 1337 1308 975 -677 -1997 -2184 -1127 226 1055 1695 876 -146 -194 -236 -480 -757 -946 -1000 -436 1302
2453 1302 1896 1676 531 -1144 -1859 -1798 -925 529 1140 880 620 442 408 254 -259 -1241 -1585 -879 -58
2472 -58 1295 1958 1485 257 -1029 -1702 -982 -457 11 221 362 469 686 1198 585 -427 -1623 -1832 -818
2491 -818 285 1231 1943 1029 110 -642 -810 -728 -353 -388 -38 -21 936 1159 1446 531 -811 -1811 -1415 -783
2511 -783 642 1291 1391 432 296 -282 -200 -377 -855 -825 -393 326 1163 1543 1156 68 -1044 -1600 -1128 -168
2531 -168 110 585 631 514 440 574 161 -556 -1160 -1186 -774 604 1321 1636 876 -344 -391 -1017 -918 -603 -158
2552 -158 49 394 714 947 926 97 -904 -1236 -1048 -190 580 1120 1022 803 28 -90 -644 -538 -683 -745 -561
2573 -561 521 1138 1405 803 -66 -1157 -1379 -1052 -64 344 934 504 576 80 134 -266 -773 -1139 -873 -117
2593 -117 713 1297 1248 700 -375 -996 -1122 -587 -163 188 336 482 642 950 615 -244 -881 -1158 -933 -75
2613 -75 999 1359 1008 353 -116 -618 -438 -440 -133 -376 -148 296 1069 1065 553 34 -1213 -1296 -915 109 709
2634 709 1208 612 342 -202 -146 -192 -524 -623 -700 -473 631 1387 1269 295 -336 -933 -986 -603 42 249 653
2655 653 391 333 224 193 -274 -903 -930 -732 -156 754 1372 858 206 -429 -950 -520 -498 -27 25 288 380 564
2677 564 818 312 -169 -836 -1071 -799 48 795 1058 904 103 -291 -272 -462 -304 -655 -222 88 633 981
2697 981 873 390 -424 -1102 -1041 -368 179 668 801 608 668 181 -219 -351 -781 -513 -391 114 849 881 753
2718 753 223 -574 -544 -814 -251 56 264 155 238 482 530 257 -299 -847 -745 -459 90 879 818 519 -21
2739 -21 -381 -619 -216 -108 -295 -230 320 518 763 661 304 -335 -891 -701 -382 236 678 673 460 146 -134
2760 -134 -151 -276 -371 -604 -129 401 769 1016 677 229 -746 -715 -642 -438 315 456 446 348 304 221 151 -553 -1098
2783 -1098 -567 -328 405 894 910 580 -169 -751 -791 -466 23 -126 109 386 243 907 297 146 -751 -849 -966
2804 -966 -471 365 565 550 349 -215 -136 -415 -443 -394 -406 -97 -2 585 944 464 -74 -659 -656 -588 -175 232 506
2827 506 438 311 140 265 26 -84 -475 -527 -198 280 729 597 348 -210 -485 -969 -361 162 328 334 562
2848 562 438 119 255 -95 -33 -551 -508 -244 -31 659 899 342 -72 -524 -323 -255 -223 88 84 350 197 244
2870 244 255 229 -501 -403 -658 -306 60 726 464 321 -18 -34 40 -130 -104 -332 -547 189 318 28 271 98
2892 98 -174 -739 -625 114 265 283 206 345 206 126 197 -310 -529 -337 -246 241 817 462 165 121 -405 -493 -485
2915 -485 40 75 -205 161 375 -6 71 -162 -330 -585 -162 -107 87 586 362 282 40 -341 -55 140 -121
2936 -121 -109 125 314 323 66 120 -57 -177 -534 -484 -82 279 295 278 130 92 -41 -365 -307 -436 -528 -168 396
2959 396 434 237 308 -150 -413 -490 -434 -67 -120 166 419 147 200 281 -255 -219 -749 -222 49 216 535 317 228
2982 228 -196 -261 -129 -269 -288 95 185 -211 215 141 134 -136 -110 -532 -243 61 463 236 99 156 -70 -190 -15
3005 -15 -31 16 -188 -59 110 192 541 222 211 -363 -206 -153 -22 -17 146 314 173 151 -113 66 -234 -85 -177
3028 -177 -207 311 486 269 -70 -106 -93 -534 -65 -19 15 80 -91 -142 256 169 80 -149 -317 -316 -211 131 371 259
3052 259 -61 -187 -105 -188 20 34 -268 -141 -87 246 412 471 -127 -116 -500 -435 -113 2 86 346 311 93 36
3075 36 -204 -188 -210 -187 -222 -166 421 427 614 170 222 -231 0 -126 222 296 151 19 140 48 139 -190 -265 -301 -73
3100 -73 51 92 459 140 246 -206 -153 -36 -38 -131 115 168 55 60 320 67 -212 -268 -393 1 5 256 529 511
3124 511 201 51 -151 8 -282 -322 -134 -76 207 399 580 278 -276 -227 -187 -503 -112 181 342 215 183 186
3146 186 -153 -58 -134 -113 -239 -2 177 239 513 -50 -236 -206 -209 -183 -248 24 1 208 352 257 276 -159 -520 -491
3170 -491 -316 165 291 356 223 -61 -120 -107 -14 -269 -36 -188 66 112 498 48 3 -30 -496 -531 -284 313 -47
3193 -47 282 339 -120 154 -223 -204 -274 -540 -99 152 183 724 175 68 -156 -241 -237 -117 -43 -101 -71 131 195 203 28
3218 28 -115 -9 -669 -355 -105 276 179 63 184 -422 -191 -197 -129 -358 -133 89 438 317 360 31 -46 -410
3240 -410 -471 -200 -324 460 449 162 202 157 -194 -282 -227 -423 -168 -249 293 567 313 -110 -87 -417 -225 -333 142
3263 142 146 -25 111 438 598 -42 -180 -518 -175 -284 13 326 327 361 109 -151 -256 -369 -194 -442 142 199
3285 199 251 560 133 285 -28 -343 -647 -143 -68 402 263 369 324 220 -63 -72 -211 -295 -128 272 244 289 286
3308 286 -54 -373 -527 -398 -186 46 197 229 391 306 285 202 -140 -321 -348 -79 21 542 550 323 -18 -115 -24
3331 -24 -741 -123 -217 85 132 296 299 189 -20 -33 -326 -493 -396 53 347 248 207 70 -302 -174 -29 -153 -125
3354 -125 7 162 646 643 156 43 -491 -497 -491 -213 91 498 500 512 267 79 -375 -262 -316 -464 -366 269 254 418
3378 418 753 95 -352 -657 -399 -656 177 210 7 399 27 128 -251 -235 -387 -378 -304 84 717 527 365 -26
3400 -26 -365 -392 -486 -355 136 -35 270 511 322 620 -100 -449 -768 -689 -133 178 500 305 239 159 78 -390
3422 -390 -560 -308 -455 9 406 545 600 396 -33 -473 -550 -434 -240 138 479 207 111 217 177 -219 -558
3443 -558 -438 -529 -108 204 602 711 197 -226 -536 -759 -537 -403 -198 131 414 311 322 76 -188 -452 -819
3464 -819 -460 127 101 414 675 301 197 -57 -314 -342 -331 -76 110 485 438 582 505 -165 -340 -628 -213 -74
3486 -74 456 669 517 196 249 -42 -463 -240 -356 -272 33 303 750 773 179 -69 -434 -923 -447 -133 346
3507 346 112 312 345 338 126 -236 -338 -551 -512 142 549 939 632 410 -94 -594 -414 -532 -143 129 203 412
3529 412 791 564 498 -204 -360 -790 -748 -112 720 783 579 79 28 -217 -247 -425 -197 41 -244 625 716 751
3551 751 502 -204 -868 -925 -548 58 354 504 394 212 18 -50 -211 -622 -813 -268 18 462 768 524 7
3572 7 -415 -671 -740 -488 19 299 327 259 180 337 151 -349 -703 -785 -499 27 517 772 417 225 77 -286
3594 -286 -534 -281 -335 90 277 658 561 406 42 -428 -677 -1010 -646 19 610 771 623 184 -229 -414 -360
3615 -360 -404 -203 -358 137 377 655 639 16 -678 -598 -595 -212 -12 446 501 623 496 95 -339 -364 -763 -722 -533
3638 -533 301 718 796 328 -80 -572 -850 -553 -401 -251 132 554 217 556 307 12 -629 -529 -638 -99
3658 -99 417 577 923 290 68 -299 -391 -539 -512 -425 263 346 517 904 741 246 -344 -1179 -576 -234 426 573
3680 573 670 422 330 -235 -176 -493 -648 -484 -360 276 794 734 346 -111 -378 -525 -542 -17 -36 302 422 680
3702 680 429 16 -240 -644 -846 -495 -156 336 816 617 300 -248 -236 -753 -222 -35 -230 -149 451 396 367
3723 367 480 -205 -797 -1060 -803 58 423 910 804 238 -51 -204 -478 -655 -479 -247 -230 623 959 614
3743 614 172 -317 -938 -958 -385 70 382 659 483 569 441 143 -324 -670 -592 -497 97 635 788 817 307 -250
3765 -250 -537 -803 -627 -147 71 87 495 387 224 62 -192 -983 -1036 -567 -255 547 812 773 393 -123 -288
3786 -288 -380 -484 -506 19 304 660 843 831 80 -419 -822 -837 -352 180 521 865 409 401 -305 -327 -546 -545 -478
3809 -478 -216 216 600 792 422 193 -510 -752 -874 -467 179 512 610 193 484 226 -8 -581 -588 -776 -494
3830 -494 172 786 669 563 341 -557 -375 -393 -353 -176 -9 251 573 558 406 -69 -702 -854 -721 -284 291
3851 291 317 625 478 204 -163 -350 -321 -554 -281 -181 -32 716 899 603 -164 -577 -1018 -661 -154 293 298
3872 298 473 403 181 93 -334 -506 -583 -641 147 500 798 860 325 52 -791 -867 -698 -324 64 307 613 750
3894 750 477 -60 -311 -800 -819 -911 -105 763 574 842 352 -24 -423 -906 -439 -343 -93 249 243 832 837 404
3916 404 -165 -577 -1238 -723 30 434 823 665 414 46 -117 -604 -399 -790 -282 26 661 872 520 386
3936 386 -230 -896 -817 -704 -47 152 511 814 410 205 96 -361 -616 -728 -669 5 583 1041 590 380 -228
3957 -228 -962 -762 -622 -215 -57 178 515 642 469 196 -398 -950 -715 -765 60 454 631 657 474 -177 -324
3978 -324 -624 -678 -460 -164 371 540 438 643 148 -141 -812 -542 -590 190 509 651 747 503 -347 -377 -394 -484
4000 -484 -561 -68 173 664 887 594 -27 -272 -742 -938 -421 -78 422 495 670 382 174 -56 -258 -628 -755
4021 -755 -145 225 726 898 726 87 -289 -762 -762 -390 -157 192 513 611 602 426 19 -504 -919 -920 -332 190
4043 190 770 899 664 187 -91 -564 -540 -634 -559 -39 434 835 838 512 61 -463 -835 -516 -653 180 321 580
4065 580 614 486 23 -320 -365 -710 -623 -209 374 1056 1164 324 -128 -651 -571 -611 -324 -9 272 508 395 358
4087 358 335 -500 -624 -859 -846 -377 155 845 652 577 -118 -498 -732 -420 -401 -350 241 430 798 730 476 -88
4109 -88 -526 -892 -672 -227 476 1055 566 147 171 -218 -576 -685 -724 -269 14 526 782 897 24 -446 -925
4130 -925 -1205 -452 -397 294 429 676 702 119 -7 -325 -707 -821 -509 18 300 660 973 481 -307 -758 -797
4151 -797 -675 -204 286 341 413 641 432 126 -386 -715 -1102 -585 -25 716 856 658 319 76 -355 -865 -901
4172 -901 -524 -326 190 697 763 438 158 -582 -1058 -1015 -599 235 524 731 76 423 106 -112 -649 -745 -864
4193 -864 -234 470 1096 999 676 192 -338 -687 -912 -608 -358 490 655 457 373 434 -144 -631 -802 -651 -613
4214 -613 159 709 1180 415 240 -421 -549 -442 -397 -246 49 260 705 845 588 74 -886 -1141 -954 -138
4234 -138 192 369 965 574 231 -28 -517 -722 -477 -179 -306 187 594 839 532 162 -530 -770 -448 -507
4254 -507 -53 184 590 680 553 31 -164 -347 -544 -576 -140 402 830 1009 536 -26 -647 -884 -939 -359 -143
4275 -143 371 551 551 476 189 -203 -730 -801 -687 -130 195 678 952 407 -29 -427 -622 -557 -211 -126 212 374
4297 374 705 723 261 53 -614 -839 -764 -223 455 689 722 377 -20 11 -734 -460 -822 -271 159 467 910
4318 910 992 368 -166 -620 -1053 -452 -79 -82 545 843 604 646 30 -564 -837 -799 -572 34 768 793 788 409 -144
4341 -144 -418 -783 -552 -173 -35 645 516 820 800 139 -277 -938 -805 -729 -13 567 1013 701 351 -19 -403
4362 -403 -769 -794 -510 -422 226 691 784 588 152 -564 -957 -559 -607 47 221 543 615 669 174 -228 -340 -546
4384 -546 -947 -221 198 751 965 786 298 -393 -744 -697 -253 -328 357 463 673 820 374 88 -449 -810 -894
4405 -894 -360 131 772 582 658 100 85 -455 -626 -664 -565 -30 290 628 905 501 -189 -408 -693 -714 -390 229
4427 229 491 462 558 407 -73 -648 -687 -702 -326 11 667 409 832 540 39 -469 -867 -513 -395 93 213
4448 213 660 447 473 274 -124 -664 -779 -864 -160 537 657 970 760 393 -313 -803 -684 -291 -322 243 343
4469 343 797 653 144 -342 -444 -795 -467 -356 350 687 903 568 292 -117 -616 -722 -508 -520 237 529
4489 529 722 868 446 -40 -813 -685 -764 -473 -91 531 863 798 444 100 -409 -734 -405 -559 64 259 839
4510 839 966 642 117 -248 -1018 -657 -245 158 363 702 638 504 197 -374 -805 -845 -633 -169 549 862 832
4531 832 439 -66 -465 -814 -731 -391 -121 363 553 667 424 108 -338 -807 -684 -319 206 662 474 887
4551 887 614 -224 -147 -672 -803 -597 -208 138 809 554 762 362 -12 -590 -1064 -439 -295 315 332 568 410
4572 410 178 -55 -170 -713 -733 -334 236 331 882 601 217 -206 -526 -945 -876 -210 39 294 637 394 243
4593 243 205 -594 -996 -551 -394 -195 768 934 839 410 -164 -237 -704 -622 -463 -29 165 692 832 665 -108
4614 -108 -473 -639 -830 -575 -238 492 495 668 638 -32 -271 -409 -536 -600 -109 127 637 978 547 158 -399
4635 -399 -764 -816 -686 -378 577 232 602 675 194 -24 -422 -653 -601 -569 191 672 856 602 74 -348 -614
4656 -614 -878 -372 -121 -24 295 569 630 596 128 -313 -755 -783 -544 109 562 1059 674 224 13 -425 -550
4677 -550 -703 -679 -367 454 529 704 527 214 -340 -593 -640 -259 62 210 818 553 613 -185 -239 -420 -894 -602
4699 -602 -145 315 884 697 482 40 -430 -502 -784 -395 40 155 578 497 682 292 80 -636 -814 -512 -476
4720 -476 394 812 869 589 177 -119 -673 -631 -317 17 -146 482 334 535 271 -209 -560 -913 -950 -151 128
4741 128 557 624 615 330 -247 -401 -549 -863 -766 325 436 467 791 580 -146 -617 -595 -718 -234 -154 433 686
4763 686 364 211 -81 -536 -530 -769 -367 -42 527 436 665 238 16 -393 -569 -743 -578 -108 382 441 675
4784 675 741 356 -356 -786 -674 -438 -54 374 694 650 409 -151 -130 -558 -574 -198 -351 81 602 723 563
4805 563 23 -180 -578 -892 -852 34 401 328 624 468 78 -141 -524 -704 -721 -257 75 145 737 382 405 -254
4827 -254 -298 -818 -479 -342 176 525 669 499 296 142 -188 -415 -614 -543 134 588 897 512 352 -28 -415
4848 -415 -486 -536 -366 66 311 536 416 428 257 -98 -668 -541 -716 -270 479 581 859 532 242 -464 -475
4869 -475 -642 -303 -112 393 424 621 477 204 -449 -543 -845 -377 -119 267 177 436 184 27 -353 -487 -464
4890 -464 -795 -140 229 454 629 271 196 -322 -771 -714 -382 -139 262 190 617 762 461 119 -538 -822 -699
4911 -699 -411 33 340 701 609 265 -76 -479 -694 -548 -286 199 452 492 456 253 -167 -443 -749 -626 -405
4932 -405 86 455 883 522 364 80 -204 -446 -778 -306 -154 286 537 535 521 62 -226 -470 -669 -413 170
4953 170 424 558 756 383 141 -264 -580 -538 -601 -149 189 381 714 404 233 -86 -592 -586 -649 -190 117 511
4975 511 585 662 205 -43 -656 -593 -473 -361 298 531 657 468 300 -227 -203 -613 -546 -283 27 352 644 586
4997 586 409 -162 -598 -447 -603 -312 147 418 444 559 493 195 -343 -873 -697 -250 -270 375 491 811 437
5018 437 43 -345 -782 -595 -266 -79 562 558 493 493 -41 -285 -914 -712 -597 115 261 636 678 311 189 -267
5040 -267 -387 -592 -416 -392 297 426 647 543 513 -29 -666 -556 -428 -9 230 644 314 348 213 -118 -662
5061 -662 -504 -523 -232 144 587 595 409 363 -278 -446 -598 -502 -342 208 307 342 468 351 260 -335 -652 -752 -544
5084 -544 -100 531 746 693 168 -215 -306 -748 -550 -491 -141 391 742 513 364 255 -615 -699 -607 -426 -313 457
5106 457 389 396 428 80 -310 -525 -470 -406 15 323 511 488 250 -28 -573 -842 -634 -443 -120 462 553 499 570
5129 570 69 -198 -451 -626 -832 -622 -5 524 472 677 145 -345 -514 -652 -660 -251 189 400 685 652 182
5150 182 -99 -457 -566 -606 -539 104 510 488 451 232 -300 -309 -561 -482 -197 -178 136 471 527 517 22 -837 -495
5173 -495 -610 -300 -74 511 422 248 449 -2 -319 -344 -724 -565 -7 71 535 644 471 3 -272 -626 -505
5194 -505 -407 -100 272 197 638 408 42 -181 -851 -528 -181 -4 32 483 468 763 346 -130 -361 -647 -567 -233
5216 -233 141 651 403 478 306 -142 -330 -712 -570 33 113 532 287 516 229 -328 -246 -467 -500 -28 229
5237 229 592 665 339 249 86 -535 -672 -709 -40 267 139 636 567 426 274 -329 -406 -446 -463 69 594 866
5259 866 824 559 131 -293 -647 -520 -502 218 420 290 624 337 -104 96 -752 -559 -531 -73 -16 543 912
5280 912 291 -112 -480 -553 -487 -163 -8 105 582 771 548 296 -16 -543 -607 -595 -227 400 962 797 395
5301 395 -48 -238 -558 -547 -451 8 225 495 633 936 308 -95 -566 -718 -415 -272 100 540 277 369 485
5322 485 -325 -408 -567 -614 -261 -72 419 635 424 372 -205 -371 -301 -454 -247 -76 375 781 298 234 -55 -389
5344 -389 -536 -540 -396 143 639 616 729 443 232 -411 -581 -445 -143 -261 284 492 802 567 -59 -206 -459
5365 -459 -839 -652 -49 345 683 477 556 369 -148 -521 -586 -365 -208 106 584 347 174 177 -187 -522 -823
5386 -823 -436 -205 -38 170 516 602 417 -85 -339 -764 -564 -160 221 520 691 439 178 -73 -714 -874
5406 -874 -605 -322 55 494 468 832 422 173 -484 -604 -529 -204 88 734 398 628 298 62 -283 -309 -523
5427 -523 -639 -108 558 870 605 468 -106 -448 -672 -623 -355 83 550 609 761 235 143 -259 -670 -508 -684
5448 -684 -237 204 875 669 634 90 -398 -536 -464 -258 92 143 297 371 492 385 -339 -640 -826 -860 -37 136
5470 136 747 459 451 -161 -451 -555 -523 -492 31 339 502 619 693 220 -76 -370 -648 -409 -316 68 376 640
5492 640 643 228 -210 -335 -524 -730 -239 410 269 627 823 441 -183 -341 -557 -644 -326 -48 454 427 430 463
5514 463 -88 -284 -885 -774 -494 -217 272 307 393 333 126 -376 -606 -487 -195 -78 387 479 512 457 164 -423
5536 -423 -514 -650 -645 302 359 771 585 340 -63 -432 -265 -328 -538 -126 -112 506 322 544 468 -286 -546 -824
5558 -824 -689 -230 194 606 753 443 281 -152 -265 -848 -772 -171 210 373 772 484 -43 -80 -705 -573 -302
5579 -302 -156 14 524 662 972 499 69 -260 -602 -583 -402 -113 191 926 679 390 2 -322 -483 -669
5599 -669 -21 -27 340 506 559 663 359 -653 -403 -552 -326 102 436 399 589 292 96 -280 -457 -427 -237
5620 -237 -78 403 666 590 344 -102 -345 -769 -654 -373 -213 57 400 611 371 162 -306 -456 -581 -421
5640 -421 62 441 449 776 504 275 -300 -591 -531 -332 -205 31 441 417 417 89 -274 -348 -270 -657 -310 30 274
5663 274 878 575 393 -187 -598 -583 -660 -250 -92 425 929 386 468 -268 -150 -438 -595 -346 163 476 616
5684 616 102 514 -66 -545 -348 -565 -607 -152 157 563 557 421 143 -331 -647 -423 -471 168 215 482 659 173
5706 173 113 -121 -528 -941 -513 102 569 613 365 453 15 -353 -501 -516 -302 -321 341 709 641 485 195 -366
5728 -366 -382 -638 -590 -78 341 355 469 526 69 -95 -522 -739 -625 -146 -91 573 688 643 236 -287 -443 -547
5750 -547 -332 -211 349 574 732 478 310 -317 -378 -594 -480 -442 54 515 658 464 512 81 -178 -549 -584
5771 -584 -57 121 398 737 801 104 -144 -469 -642 -592 -348 -81 422 562 383 526 -36 -464 -646 -745 -250
5792 -250 -241 101 384 416 387 -47 -593 -572 -738 -341 -77 322 586 691 456 163 -139 -631 -398 -637 -124 217
5814 217 350 584 202 288 -131 -580 -544 -388 -52 293 575 584 528 365 -122 -594 -360 -648 -162 -116 594 626
5836 626 677 175 -390 -477 -598 -263 -417 83 376 761 426 175 50 -450 -540 -334 -452 3 538 460 449 353
5858 353 132 -311 -318 -440 -456 -3 246 346 538 426 0 -259 -647 -562 -494 -48 64 685 421 514 -87 -483
5880 -483 -494 -594 -188 -54 347 678 397 515 125 -310 -716 -443 -289 -108 52 387 562 411 502 -152 -414
5901 -414 -441 -205 -23 156 396 531 315 365 -121 -572 -775 -448 -126 160 171 547 632 201 -81 -471 -350
5922 -350 -420 -252 142 662 208 542 42 -177 -469 -438 -74 -197 -54 251 700 798 396 -125 -134 -549 -365 -252
5944 -252 217 113 554 468 414 -319 -348 -440 -609 -382 133 260 414 469 233 107 -188 -516 -565 -328 -84 260
5966 260 358 467 376 300 -35 -555 -621 -397 -237 139 580 553 235 252 -602 -404 -340 -309 -337 248 431 370 618
5989 618 203 27 -555 -459 -292 92 145 414 703 307 189 -202 -361 -568 -560 -158 -91 641 408 550 394 -210
6011 -210 -320 -696 -466 -63 172 531 407 464 305 -50 -282 -377 -475 -370 135 292 795 800 228 -208 -340 -567
6033 -567 -416 -265 -72 282 529 685 322 -48 -408 -610 -488 -146 -300 471 656 757 449 -159 -323 -429
6053 -429 -673 -348 -174 222 465 407 690 183 -275 -718 -428 -343 28 304 388 414 380 -200 -34 -395 -510 -339
6075 -339 -238 122 433 615 192 -75 -436 -661 -591 -324 -55 450 454 429 440 224 -287 -429 -515 -443 -341 82
6097 82 663 488 95 139 -763 -415 -675 -457 -470 236 434 545 607 165 106 -237 -356 -279 189 208 357 706
6119 706 501 360 -81 -145 -691 -859 -119 242 134 760 722 222 59 -424 -535 -440 -135 -107 271 364 544 227
6141 227 260 -253 -577 -663 -325 -131 219 283 552 397 232 -342 -465 -590 -389 -114 293 587 655 443 426 -24
6163 -24 -442 -346 -645 -304 165 414 630 433 170 11 -429 -389 -502 -107 216 294 617 486 476 -93 -280 -373
6185 -373 -739 124 18 331 571 617 -128 -136 -379 -358 -489 -215 167 211 317 626 103 -128 -370 -378 -316 -566 493
6208 493 485 353 437 367 -200 -536 -576 -523 -321 96 323 493 462 355 -223 -321 -655 -557 -369 49 343 397 582
6231 582 383 -94 73 -549 -408 -188 -89 237 458 439 174 -52 -358 -334 -598 -414 69 169 526 818 499
6252 499 36 -347 -549 -555 -474 157 136 234 418 528 130 -79 -260 -598 -361 -251 158 585 632 582 275 -167
6274 -167 -401 -497 -373 71 73 380 500 412 279 -253 -518 -469 -610 -343 -19 289 564 401 131 14 -467 -377
6296 -377 -431 -341 191 205 416 380 552 -109 -349 -366 -421 -98 -6 525 623 347 410 -10 -208 -730 -529 -219 -3
6319 -3 208 496 543 562 0 -192 -491 -403 -469 205 28 212 304 328 156 -166 -464 -476 -103 92 207 474 484
6342 484 130 201 -40 -180 -801 -295 -190 58 391 534 506 18 -201 -341 -653 -496 -274 262 442 418 215
6363 215 48 -169 -247 -580 -16 -174 152 173 474 648 416 -104 -265 -473 -455 39 -282 524 593 541 217 108
6385 108 -210 -447 -273 -411 -79 179 521 250 214 19 -387 -263 -324 -416 -205 96 383 362 547 96 -158
6406 -158 -350 -467 -656 -88 90 580 199 386 -21 -293 -341 -525 -380 164 238 356 459 180 188 -231 -359
6427 -359 -577 -519 -168 310 335 440 412 -159 -284 -295 -527 -222 -33 186 391 369 81 91 -30 -294 -359 -450 -226
6450 -226 -62 413 536 370 8 24 -462 -349 -342 -431 -149 511 390 582 411 -14 -369 -249 -393 -318 -77 498
6472 498 469 337 201 -108 -528 -416 -518 -356 238 515 443 466 158 -22 -122 -409 -318 -271 350 43 323 264
6494 264 283 -8 -144 -341 -229 -336 -51 128 184 398 371 57 80 -417 -323 -283 -51 398 400 270 555 400 -206
6517 -206 -347 -256 -458 222 76 257 287 354 459 -290 -390 -347 -413 -196 -83 278 488 404 329 -159 -321 -91
6539 -91 -598 -280 112 321 353 429 214 -264 -359 -432 -458 78 225 410 287 302 170 20 -321 -326 -207 -282 168
6562 168 434 160 505 122 -266 -205 -426 -255 -169 119 453 440 503 82 -7 -317 -162 -376 -300 -263 52 602
6584 602 477 281 78 -299 -674 -325 -355 -190 49 237 169 312 -152 -305 -252 -118 -186 -150 139 462 135 165
6606 165 63 -9 -192 -122 -90 10 287 150 235 189 20 -113 -240 -565 -135 -226 101 307 419 -56 -6 -191
6628 -191 -225 -278 -398 -174 491 347 441 408 -1 -41 -311 -74 -240 -99 -79 291 371 203 30 167 -380 -491
6650 -491 -5 50 3 316 198 571 334 -67 -420 -385 -80 142 -183 210 94 423 60 -313 -280 -610 -394
6671 -394 15 -82 -2 350 272 668 4 -397 -192 -230 -149 27 49 482 594 378 54 -176 -523 -195 -307 -46
6693 -46 231 22 276 -42 -44 -173 -321 -468 -206 -39 179 188 552 381 -71 -56 -444 -180 7 -107 189 111
6715 111 405 309 46 -229 -227 -372 -260 -228 59 228 145 53 113 -160 -183 -280 -105 -89 -315 189 293 392 62 -129
6739 -129 167 -449 -572 -215 -8 103 261 356 -5 148 -312 -105 -596 -118 -86 27 225 155 -28 45 -3 -329
6761 -329 -272 -84 -287 131 197 349 207 -338 -306 -226 -236 -184 -287 68 232 421 175 -48 -38 -161 -303 -64
6783 -64 120 -43 215 238 20 -79 -119 -121 -88 -107 -136 158 195 313 361 261 -288 100 -45 -183 34 36 261 193 272
6808 272 68 -207 -300 -630 -81 10 23 74 217 430 31 -150 -443 -419 -248 -40 60 -78 132 111 157 -168
6830 -168 -267 -453 -364 120 77 43 200 84 135 204 35 -133 -198 -334 -152 207 198 179 72 15 -223 -264 -27 -255
6854 -255 40 356 108 496 -10 -54 -142 -314 -253 -380 97 -39 129 -38 217 -41 11 -51 -118 -27 52 264 438
6877 438 211 317 42 -209 -40 41 -343 -354 152 251 119 150 -38 56 62 -206 -44 -39 281 102 424 -7 120
6900 120 -122 -384 -413 -322 -7 231 152 44 -113 226 -106 -210 -323 -377 80 153 208 270 150 -40 79 -49
6922 -49 -296 -181 -149 303 158 -60 328 94 204 -464 -356 -227 40 225 48 104 352 -112 189 -12 -25
6943 -25 -345 -133 7 135 187 302 -7 -41 -21 -169 -291 -509 -59 -37 -154 77 188 47 77 41 -276 24
6965 24 110 144 7 -81 410 324 221 33 -90 -95 7 145 1 403 40 -31 -31 -63 -527 -355 63 -27 237 41
6989 41 136 8 -74 -36 5 143 -192 -168 -25 146 405 170 38 -142 -333 -209 -14 226 241 162 -92 147 -252
7012 -252 -194 -144 -424 -238 -113 146 227 84 130 -51 -246 -136 -314 134 -104 -85 12 131 242 5 28 40 -422
7035 -422 25 172 263 323 6 47 14 -92 228 -56 -31 122 145 164 59 114 140 13 -286 -259 -26 107 -89
7058 -89 326 237 -87 177 -98 -93 -410 -166 0 -264 139 136 221 -106 136 -4 169 19 -89 -64 326 221 133
7081 133 -102 -3 69 -372 -27 130 -113 -10 196 307 289 -110 80 -41 -158 68 -39 161 281 318 112
7102 112 -1 -141 -65 -130 80 116 350 129 -79 -19 -35 4 -171 -70 -8 156 171 -58 114 166 103 54 97 24
7126 24 -171 -267 168 66 -13 -213 78 -15 -74 -78 -60 -246 -138 151 76 126 -132 -318 -245 -60 -83 -130 5 183
7150 183 86 111 25 -43 -213 -8 -9 171 -63 -84 262 170 31 -84 54 -179 -226 -101 89 135 -125 73 -252
7173 -252 -217 7 -328 -14 -87 79 191 148 251 222 196 9 -290 -199 -152 -19 -81 -70 32 117 11 -174 -131 -85
7197 -85 -102 -218 192 212 128 -16 138 204 -129 36 -399 48 93 134 248 375 91 30 -153 -2 -210 -13 211
7220 211 118 -16 55 34 -29 -80 -194 -297 -140 73 -50 -114 17 -199 -148 24 -22 -237 77 324 245 109 41
7243 41 -19 73 179 -200 31 -41 -26 128 249 -219 149 43 -41 8 165 90 -81 68 93 12 54 -250 98 -394
7267 -394 -309 26 -229 -217 -93 -144 -49 -265 -52 -192 -9 111 135 96 -129 60 -81 -13 -166 -82 -63 -149 -21
7290 -21 286 -204 5 -130 -199 -202 55 -296 -189 95 72 -40 374 -111 -85 43 46 51 -73 -170 -21 17 -20 -206
7314 -206 203 55 38 214 -215 -79 17 215 -109 -80 -94 -281 -32 168 -35 -232 -53 -63 -57 62 35 113 19
7337 19 17 -154 308 -3 -31 -21 -102 55 208 -290 -25 -153 -43 -31 106 -142 -155 -85 -57 5 -45 -129 -92 -37 -216
7362 -216 26 -21 199 346 12 -89 -152 -46 -362 -396 66 -34 -1 200 -79 242 214 -80 -51 71 -59 -31
7384 -31 171 -242 146 -4 -1 -270 -146 -86 -105 106 9 -41 -18 -87 -22 110 -85 -327 45 -63 64 -72 98
7407 98 -36 -135 -24 -26 169 126 90 126 -245 349 158 94 34 -213 42 -29 59 62 11 32 66 -454 11 -214 186
7432 186 57 106 98 10 -99 64 -216 121 -226 -220 -126 262 49 118 -60 66 -39 -193 -51 -247 -39 -280 -31
7455 -31 -113 171 -87 29 29 -10 -126 -107 115 36 -148 32 266 -132 121 -54 123 243 -259 -226 198 177 -151
7478 -151 -48 -263 75 -144 163 -81 -135 -4 -84 -128 98 40 13 30 259 83 220 76 -229 89 26 213
7500 213 -127 199 -261 -278 51 -58 210 178 -166 262 -1 60 129 -29 86 -154 223 -100 246 -30 -108 219
7522 219 -60 -240 -40 -181 23 53 189 136 94 -19 54 129 -247 80 31 -159 -70 169 7 -29 -526 -36 -45
7545 -45 -19 140 -44 172 -252 -147 41 -181 -221 124 -32 242 -57 2 67 -318 -127 -393 -89 -8 84 168 98
7568 98 20 160 12 81 -3 -60 -229 98 -100 -150 313 132 -36 -232 178 70 156 -151 181 173 -128 239 -66
7591 -66 44 -50 -211 -130 -7 121 -54 230 6 -161 -108 31 28 -270 265 94 251 144 -71 42 -97 -333
7613 -333 21 43 123 84 -278 290 1 -82 -150 96 -212 -257 -80 -245 138 68 2 -4 -237 139 -195 -146 -6 -219
7637 -219 132 -48 256 162 157 138 -58 -141 3 29 171 -13 -22 -65 -52 -98 23 3 -99 391 -18 -450 126 235
7661 235 232 115 67 -107 18 121 -24 -116 193 -84 79 116 -302 -138 -196 -164 283 294 -105 298 270 -234 -97
7684 -97 -203 -392 -80 90 -23 -24 -211 -16 -71 -258 82 9 -67 -57 -19 -44 184 216 -29 12 10 -277 92 27 -54
7709 -54 7 -126 -106 -25 107 119 -198 -269 -121 -117 -30 192 148 9 97 31 30 -152 67 143 -158 116 146 -227 8
7734 8 -227 -318 39 31 -44 21 243 -120 96 57 -90 -368 207 178 -220 186 -30 260 16 37 73 -288 -101 -128
7758 -128 266 369 19 179 60 -43 85 -43 -411 -101 63 8 30 37 146 33 -289 -266 -142 -131 -35 154
7780 154 121 -97 230 196 196 -300 -104 -13 161 -73 -29 136 -121 70 25 -109 17 -97 -275 -212 210 -155 72
7803 72 133 35 -196 63 -53 -15 150 -108 105 160 25 -234 91 -112 24 -259 -4 79 -155 72 166 -131
7825 -131 192 -10 140 -156 237 -47 27 124 185 115 -9 188 -182 -240 -170 127 62 50 92 19 -66 71 22 30 -2
7850 -2 -86 103 75 -43 109 -153 -322 12 -113 -31 -117 -87 122 191 -261 -337 -1 -186 -192 -45 -2 127 303 126
7874 126 -87 -210 -305 60 -15 -102 170 56 127 -77 109 -51 28 -214 -5 72 32 -80 206 -69 119 243
7896 243 -249 29 -215 84 187 281 -39 -70 125 -246 -87 335 -436 -143 116 148 -66 90 444 26 2
7917 2 -60 -139 126 -97 78 146 256 196 122 -39 -90 -79 0 252 -134 -16 196 -23 -4 -24 -289 -16 8 -87 417
7942 417 -27 280 294 -47 232 -17 -315 -1 -120 -373 114 146 113 -5 -167 30 20 93 -9 110 137 45
7964 45 226 -273 243 -224 -36 -282 -178 272 -121 179 197 5 52 -99 -203 143 -110 44 -10 196 85
7985 85 89 19 -45 -46 -412 9 -147 109 326 123 -94 -168 -16 -22 -351 -214 302 -39 359 89 216 61 -149
8008 -149 -256 -222 -294 -39 174 183 5 27 -108 108 -67 -120 -116 210 -26 156 233 39 11 26 -159 -112 -264 65
8032 65 -93 85 37 211 -116 -22 -192 -468 -129 -78 -36 58 -128 -62 -120 -40 53 -30 54 14 -119 321 128 -149
8056 -149 222 -116 -110 -95 -20 -11 172 145 191 -70 99 -269 -156 -53 -308 -78 -15 293 65 -93 85 177 -47
8079 -47 -151 -333 60 294 141 29 230 157 43 -102 43 -154 -206 -252 -171 391 367 -122 150 60 57 -109 -144
8102 -144 -78 395 126 57 190 -81 70 -206 32 -167 -122 -259 10 -18 -10 134 -238 -336 11 -447 -142 194
8124 194 -87 -51 334 134 -51 -120 -265 -19 -104 36 122 85 -91 -78 -341 -187 -303 -60 228 89 417 38
8146 38 202 331 -13 -198 -111 -410 88 -80 10 82 175 19 102 44 -111 -116 -383 62 130 247 -36 -79 -22 -274
8170 -274 -300 -380 240 -2 158 -139 15 -21 213 -20 -151 107 -204 -89 141 191 603 227 64 -49 -8
8191h
$$ Imaginary data points
##PAGE= N=2
##DATA TABLE= (X++(I..I)), XYDATA
0 0 0 0 0 0 0 0 0 0 0 0 0 0 3 -8 8 -8 8 -10 16 -16 20 -25 30 -34 41 -49 57 -65 74 -84 98 -109 125 -142 159
35 159 -181 204 -227 254 -283 315 -351 390 -431 478 -527 580 -642 706 -778 857 -943 1041
53 1041 -1149 1269 -1404 1561 -1738 1945 -2189 2483 -2843 3298 -3893 4711 -5903 7823 -11436
68 -11436 20661 -102262 -137004 61097 152924 159644 48744 -44714 -78996 -26290 21035 19997
80 19997 -47341 -98023 -78418 29916 141816 175282 85908 -61894 -171334 -163027 -58600
91 -58600 64157 115108 81654 9484 -26972 -8899 30597 30196 -26548 -99006 -115889 -47008
103 -47008 71359 154802 141650 38940 -79816 -136454 -103278 -20295 44862 54286 25704 3412
115 3412 16454 47662 52681 5380 -70404 -119376 -96502 -8844 87524 129652 93928 11920
127 11920 -58747 -80178 -55897 -20456 -1301 198 5200 29220 60925 70951 37717 -28438
139 -28438 -87828 -101579 -59399 11249 67928 82455 57352 17842 -13673 -30717 -40029 -46768
151 -46768 -45548 -24862 15789 60007 80371 60710 9526 -44205 -72587 -64875 -32943 2525
163 2525 27579 41807 48675 47020 29054 -7957 -52188 -78636 -66903 -19364 39049 73932 68678
176 68678 31642 -8994 -32673 -35986 -31971 -31000 -29313 -12540 24204 64844 80260 50785 -13701
189 -13701 -75270 -94514 -59875 3598 53123 62264 37127 6900 -4760 540 1096 -19391 -51994
202 -51994 -65276 -34511 31518 91360 100096 46285 -35639 -90820 -85772 -32337 25449 47027
214 47027 29681 2933 -550 21401 40222 22747 -31123 -83766 -89251 -31193 54679 109913
226 109913 94347 21800 -54936 -84190 -54966 -2366 27887 17939 -8734 -14224 16457 57669
238 57669 65461 18616 -57131 -106599 -87714 -9167 74596 105918 67253 -5642 -56772 -55758
250 -55758 -16996 14192 8998 -21100 -36804 -10176 46385 86404 69459 -3203 -81902 -109658
262 -109658 -66140 16572 78562 80710 32907 -20034 -36849 -15769 10369 8012 -23889 -52364
274 -52364 -41791 12242 73896 93600 50781 -27363 -87043 -88315 -35828 26973 57701 43596
286 43596 9793 -9754 -1563 16367 14503 -16175 -53863 -62566 -25938 36828 81948 76778 24557
299 24557 -37771 -69706 -56039 -15948 17033 24129 13293 6414 15175 30048 28691 644 -41076
312 -41076 -65774 -52103 -4675 46149 68175 50615 9663 -26275 -38898 -30220 -16729 -9206
324 -9206 -5874 2798 21925 40758 42663 19830 -19030 -50682 -55147 -30644 6187 33985 40714
337 40714 30199 14168 312 -11030 -22938 -33400 -35217 -19000 11332 41152 51675 35363
349 35363 1854 -28789 -40532 -32996 -15845 -553 8516 17103 27073 33559 26509 1079 -32389
362 -32389 -53887 -46575 -12772 27231 49513 42310 16193 -8749 -19195 -16798 -13644 -17505 -22442
375 -22442 -15770 8826 40233 55307 38170 -5492 -48291 -62540 -39603 2640 35148 39596
387 39596 21288 1268 -3988 3182 6054 -8449 -32915 -45846 -27857 16152 58027 66878 33767
400 33767 -19922 -57206 -55605 -21428 15525 29394 17297 -146 -1699 14436 28316 18213
412 18213 -17278 -53837 -59800 -23990 31536 69140 62480 17449 -31718 -51683 -35252 -3094
424 -3094 15578 9664 -6780 -9836 10236 37221 43423 14164 -33888 -67230 -57364 -9570 43524
437 43524 65735 44222 792 -31619 -32983 -12196 5553 2833 -14641 -23119 -6087 29480 54522
450 54522 44670 548 -48734 -67616 -43092 6054 44659 49104 23182 -7467 -18620 -8706 4401
463 4401 1355 -17618 -33874 -25777 7839 45783 58080 33002 -13900 -50736 -54187 -25669 11613
476 11613 31741 26570 9401 -1220 2483 10378 6568 -13083 -35412 -39213 -15781 22436 49965
489 49965 47697 17539 -19432 -39627 -34282 -13456 4639 10590 7610 7501 14595 21534 17825 -2160
503 -2160 -27989 -42222 -31942 -2769 27838 40665 31276 8390 -11459 -20163 -18768 -14481 -11855
516 -11855 -8004 1997 17659 30232 29156 11801 -14185 -33339 -34263 -18619 3626 19024 23453
529 23453 18574 11911 5418 -3001 -14648 -25936 -28118 -15713 8427 30250 36587 23764 -222
542 -222 -19941 -25978 -18912 -8527 -1671 2012 7296 17130 25168 22690 4141 -22131 -39911 -35190
556 -35190 -10512 19567 35525 29720 10191 -7471 -13114 -9154 -6375 -10884 -17061 -15107 2682
569 2682 27238 40700 29783 -1314 -33630 -45394 -29250 1462 25147 28191 14104 -331
581 -331 -3278 3260 6378 -3809 -22271 -33636 -22086 9151 40230 48075 25538 -12817 -39601
594 -39601 -39199 -15209 10536 20421 11793 -825 -1649 10357 21060 13768 -11455 -37669 -42521 -17758
608 -17758 21016 47718 43303 12523 -21113 -34711 -23476 -1798 9625 5249 -5717 -6647 7790
621 7790 26763 30130 9413 -24139 -46126 -39491 -6436 28984 43762 29977 1286 -19690 -20603
634 -20603 -7603 1964 -677 -11733 -15423 -2145 21357 37439 29106 -954 -33402 -44952 -28266
647 -28266 4091 28761 31380 15276 -2645 -9275 -4182 1806 -2210 -14987 -23503 -15559 7874
660 7874 31786 37899 20176 -10166 -32849 -34342 -16515 5759 18479 15978 7386 2925 5349
673 5349 7435 1369 -12686 -25619 -25446 -7821 16572 33043 30133 10584 -11809 -24255 -21294
686 -21294 -10119 -175 3750 4817 8200 14203 16902 10488 -5530 -22365 -28495 -19059 765 19059
700 19059 25672 19077 5812 -4998 -10521 -12044 -12601 -12139 -7584 2685 15959 23946 20153 5502
714 5502 -13064 -24059 -22100 -10261 3451 11832 13772 12215 10247 6896 -170 -11320 -21504 -22718
728 -22718 -11183 7704 23896 26745 15253 -2736 -15406 -17353 -11639 -4949 -1715 -511 3904
741 3904 12547 20443 18058 3385 -17581 -30695 -26690 -6525 15805 26957 21037 5757 -6571
754 -6571 -8895 -5255 -3316 -7554 -13761 -12152 1763 20424 30608 21902 -1665 -25924 -33790 -20746
768 -20746 1949 19037 20507 9488 -809 -2202 2974 5549 -2625 -17128 -25273 -16409 6970
781 6970 30094 35117 17957 -10028 -29652 -28638 -10775 7994 14334 7819 -445 -300 8572 15701
795 15701 9609 -9333 -28281 -31125 -12730 16074 34686 31002 8669 -15330 -24929 -16604 -1421
808 -1421 6441 2897 -4061 -4078 7239 20367 21943 5664 -18543 -33881 -28114 -4375 21001 31291
822 31291 21059 1115 -13277 -13718 -5089 689 -1864 -9498 -10535 105 17444 27474 20092 -2081
836 -2081 -24661 -31579 -19485 2749 19442 20779 10805 -291 -4451 -1088 703 -4017 -13153 -17305
850 -17305 -9854 7601 24084 26465 13297 -7886 -22773 -23251 -11205 3297 10723 10193 6290 4822
864 4822 6586 6011 -648 -11640 -20105 -17681 -4120 12892 23357 20012 6672 -7628 -15089 -13818
878 -13818 -7683 -3061 -220 3230 8237 13445 14085 6933 -6335 -17878 -20604 -12318 1711 13319
892 13319 16737 12285 4565 -1090 -4840 -8044 -10346 -11378 -7308 2327 14137 19719 15140 2642
906 2642 -11241 -17968 -15038 -6042 2592 6939 7830 8171 9049 7766 1865 -8581 -17506 -18318 -8745 6935
922 6935 18997 20098 10776 -2993 -11604 -12041 -7360 -3155 -2008 -2373 1838 9218 16709 15261 2805
937 2805 -13604 -23714 -20346 -4711 12073 19482 15211 3640 -4855 -6216 -2983 -1644 -5789 -10974
951 -10974 -9920 659 15470 23226 17242 -801 -18902 -24961 -15799 902 13445 14385 6906 -619
965 -619 -1096 3238 4507 -1955 -13008 -18849 -12491 4760 21579 25872 13709 -6412 -20786 -20570
979 -20570 -8595 4705 9473 5285 -211 -94 6893 11628 7416 -6637 -20448 -22429 -9355 10831
993 10831 24535 22705 6651 -9975 -17053 -11871 -2345 3579 1329 -2918 -2340 5983 15169 15729 4634
1008 4634 -12752 -24004 -20299 -3546 13882 21159 15134 1850 -7919 -8854 -3932 -625 -2774 -7042
1022 -7042 -7323 748 13043 19816 14057 -1171 -16781 -22102 -13871 826 12323 14052 8025 1250
1036 1250 -1457 289 83 -3877 -10649 -12640 -6151 6219 17271 18401 8788 -5470 -15038 -15807 -8266
1051 -8266 653 5649 6175 5230 5209 6310 4832 -1082 -9781 -14971 -12384 -1922 9711 16312 13448
1066 13448 4420 -4587 -9229 -8943 -6247 -3825 -2031 1365 6774 11445 11581 4881 -5518 -13770 -14958
1081 -14958 -8252 1922 9064 10650 7325 3742 730 -1760 -4848 -8845 -10610 -6908 1572 11200
1095 11200 15852 11626 1174 -8822 -13264 -10375 -3821 1466 4055 4419 5348 7187 7473 3172 -5814
1110 -5814 -14007 -14958 -7565 4983 14784 15403 7714 -2347 -8564 -8349 -4644 -1949 -2509 -3205 -329 6909
1126 6909 13093 12782 3677 -9741 -18082 -15804 -4355 8758 14743 11128 2755 -3508 -3877 -1368 -611
1141 -611 -4505 -9242 -8653 -280 11313 17992 13862 275 -13302 -18448 -12111 -197 9213 10429
1155 10429 5071 -107 -222 2874 4010 -1109 -9572 -14593 -10131 2752 15645 19289 10876 -3552
1169 -3552 -14356 -15190 -6852 2333 6003 3470 232 826 5638 8827 5193 -4643 -14842 -16516 -7652
1184 -7652 7018 17362 16579 6089 -5856 -11191 -8571 -2601 1076 -159 -2343 -1097 4761 11430
1198 11430 11608 3208 -9237 -16856 -14832 -3419 8935 14628 11029 2467 -4339 -5212 -2956 -1482
1212 -1482 -3339 -6033 -5448 510 9984 14243 10285 -84 -11440 -15317 -10293 -269 7387 9242
1226 9242 5983 2078 626 1003 -26 -4142 -8575 -9815 -4558 4725 12599 13612 6763 -3042 -9817
1241 -9817 -10718 -6382 -641 2582 3558 3562 5000 6417 4346 -1169 -7700 -11713 -9391 -1324 7089 11364
1257 11364 9661 3399 -2471 -5344 -5995 -4843 -4411 -3032 320 5163 9642 9371 4383 -3959 -10444
1272 -10444 -11301 -5702 1194 5987 7157 5287 2924 1396 76 -3007 -6774 -9086 -6739 185 8500
1287 8500 12445 9884 1474 -6544 -9740 -7831 -2852 1020 2138 2035 3182 5588 6737 3773 -3411
1302 -3411 -10564 -12224 -6728 3168 11065 12026 6327 -1057 -5791 -5766 -3048 -1415 -2205 -3248 -1293 4426
1318 4426 9970 10417 3969 -6318 -13387 -12609 -4160 5546 10703 8283 2450 -2022 -2640 -654 -512 -3299
1334 -3299 -6915 -6886 -1590 7818 13439 11232 1457 -9072 -13699 -9588 -1029 5839 7075 3865 421
1349 421 172 2489 3328 -526 -7041 -11148 -8090 964 10829 14326 8584 -1475 -9237 -10685 -5632
1364 -5632 695 3457 2406 6 1073 4520 6735 4299 -3296 -10540 -12343 -6188 4150 11799 11799
1379 11799 5215 -3018 -7197 -5982 -2464 -480 -1202 -1943 -975 3814 8446 8411 2812 -6235 -11736 -10564
1395 -10564 -3568 5717 9770 7814 2885 -1607 -2813 -2037 -1825 -3361 -5093 -4131 839 6906 10654
1410 10654 7761 673 -7031 -10691 -7715 -1274 4010 5757 4612 2557 1621 1531 43 -3502 -6918
1425 -6918 -7489 -3556 3456 9074 9474 5327 -1417 -6294 -6790 -4638 -1879 335 1328 2750 4658 5282
1441 5282 3725 -700 -6049 -9093 -6873 -1341 4836 7718 6815 2819 -906 -2933 -3098 -3696 -4096 -3795
1457 -3795 -656 3756 8038 8180 4012 -2754 -7925 -8470 -4804 780 4086 4551 3518 2433 2030 1119
1473 1119 -1691 -4987 -7566 -6026 -721 6158 10028 7884 1965 -4498 -7219 -5558 -2042 469 1008
1488 1008 612 2205 4240 5616 3904 -1974 -7638 -10029 -6434 1178 7841 9272 5318 -538 -4186
1503 -4186 -3973 -2165 -1062 -1936 -3026 -1515 2654 7664 8645 3965 -3758 -9813 -9991 -4422 3141 7262
1519 7262 6487 2687 -675 -1369 -386 114 -2400 -5555 -5922 -1589 4983 10083 9281 2547 -5582 -9740
1535 -9740 -7680 -1476 3528 4945 3245 696 618 2165 2727 -187 -5162 -8548 -6636 -154 7556 10490
1551 10490 7318 241 -6191 -7520 -4727 -349 1853 1290 47 879 3638 5684 3775 -1803 -7645
1566 -7645 -9265 -5457 1973 8139 8621 4693 -863 -4119 -3786 -1894 -1234 -1615 -2321 -663 3035 6569
1582 6569 6740 2280 -3928 -8464 -8071 -2713 3079 6610 5634 2729 198 -1199 -1233 -1858 -3382 -4517
1598 -4517 -3686 457 5033 7903 6088 753 -4699 -7349 -5363 -1537 1704 3183 3147 2455 2628 2016
1614 2016 365 -2839 -5458 -6031 -3056 1960 6082 6924 4217 -506 -3655 -4505 -3353 -1849 -965 228
1630 228 1979 4048 5234 3566 -154 -4328 -7003 -5768 -1312 2962 5378 4845 2376 26 -1407
1645 -1407 -1780 -2916 -3650 -3563 -1761 2059 5979 6737 3517 -1407 -5520 -6487 -3926 284 2654 2845 2324
1662 2324 2082 2271 1718 -117 -3756 -6282 -5196 -993 3853 7404 6352 1900 -3108 -4927 -4166 -1750
1678 -1750 -109 300 63 1155 3285 4755 3674 -591 -5241 -7494 -5395 -154 5283 6735 4727
1693 4727 548 -2680 -3203 -1761 -622 -1778 -2834 -1812 1373 5251 6536 3817 -1901 -6538 -7358
1708 -7358 -4081 1221 4769 4828 2240 -212 -503 124 101 -1686 -4126 -4772 -1882 3289 7115 7053 2329
1725 2329 -3266 -6574 -5919 -2426 1797 3163 2325 680 890 1989 2249 148 -3520 -6037 -5205 -579
1741 -579 4403 7376 5735 1005 -3715 -5197 -3166 -597 775 565 132 953 3140 4086 2908 -912
1757 -912 -5416 -6626 -4351 932 5007 6065 3520 -1 -2474 -2493 -1235 -1244 -1670 -1716 -605 2086 4794
1774 4794 4976 2086 -2301 -5663 -5780 -2573 1338 3847 3646 2363 767 -162 -388 -1401 -2482 -4038
1790 -4038 -2836 -66 3724 5860 4188 770 -3013 -5038 -3878 -1608 551 1685 1787 2048 2364 2048
1806 2048 573 -1925 -4411 -4682 -2558 1413 4462 4836 2630 -301 -2140 -2784 -2476 -1515 -1271 -815 1067
1823 1067 2860 4363 3626 59 -3311 -5019 -4049 -1375 2040 3506 3080 1752 613 -437 -892 -1794
1839 -1794 -3059 -3153 -1650 1450 4301 4945 2878 -844 -4091 -4544 -2726 -255 1395 1887 1330 1559 1920
1856 1920 1505 349 -2316 -4621 -4297 -1602 2550 5319 4848 1970 -1800 -3708 -3123 -1705 -226 -164
1872 -164 -339 756 2434 3778 3125 -37 -3571 -5708 -4402 -533 3042 4880 3719 686 -1271 -1911
1888 -1911 -1186 -737 -1389 -2211 -1488 1114 3654 4961 3069 -952 -4757 -5269 -3056 365 3074 3441 1764
1905 1764 364 -52 428 91 -1017 -3117 -3755 -1545 2054 5015 5241 2144 -1757 -4263 -4560 -2167
1921 -2167 760 1865 1581 1110 980 1802 1681 -22 -2547 -4482 -3655 -979 2751 4779 4277 1262 -1988
1938 -1988 -3254 -2577 -932 -92 -173 -178 549 2520 3236 2240 -428 -3645 -4711 -3240 -31 3012 4129
1955 4129 2800 561 -1104 -1457 -1175 -1189 -1444 -1644 -325 1949 3551 3979 1627 -1563 -4072 -4050 -2038
1972 -2038 563 2434 2328 1386 867 93 -22 -745 -2522 -2863 -2085 -171 2624 4060 3362 524 -1713
1989 -1713 -2899 -2679 -1263 -386 597 919 1661 2413 2132 927 -1502 -3423 -3596 -1876 457 3026 3772
2006 3772 2151 472 -1008 -1542 -1386 -1492 -1177 -828 385 2224 3029 2984 537 -1708 -3707 -3345 -1322
2023 -1322 1074 2083 2237 1233 340 23 -371 -1147 -2123 -2646 -1489 891 3271 3679 2568 -272 -2618
2040 -2618 -3460 -2223 -388 806 1263 719 1157 1711 1616 525 -1689 -3351 -3457 -1481 1353 3753 3439
2057 3439 1637 -703 -2204 -2055 -1364 -444 -507 -680 261 1753 2974 2349 125 -2358 -4020 -3118 -824
2074 -824 1987 3427 2502 757 -849 -1344 -702 -713 -979 -1932 -1164 607 2728 3858 2587 -240 -3226
2091 -3226 -3667 -2454 105 2107 1951 1235 488 122 440 -59 -1004 -2413 -2597 -1382 1293 3295 3650
2108 3650 1983 -684 -2732 -2940 -1568 76 1027 1099 796 865 1368 1451 239 -2070 -3160 -2861 -823 1829
2126 1829 3371 3106 1296 -1033 -2093 -1774 -962 -528 -376 97 513 1690 2358 1605 -312 -2295 -3058
2143 -3058 -2391 -447 1855 2665 2138 627 -344 -767 -1028 -1042 -1250 -1576 -173 1067 2334 2943 1575 -839
2161 -839 -2455 -2875 -1719 30 917 1424 1064 1122 546 375 -653 -1645 -2326 -2054 -370 1687 2730 2508
2179 2508 568 -960 -1910 -2059 -1118 -492 303 682 1320 1811 1594 584 -1043 -2433 -2771 -1640 186
2196 186 1733 2450 1229 550 -243 -972 -869 -1138 -1275 -1089 361 1405 2506 2260 545 -1413 -2537
2213 -2537 -2309 -921 720 1380 1394 886 617 335 -7 -633 -1531 -2209 -1245 406 2286 2749 2275 -128
2231 -128 -1682 -2281 -1542 -189 223 625 686 744 1220 1534 289 -667 -2269 -2665 -1238 893 2696 2316
2249 2316 1624 -278 -1366 -1377 -956 -379 -329 -62 -158 1280 2286 2164 425 -1767 -2757 -2590 -743 1105
2267 1105 2006 2192 656 -350 -654 -524 -423 -926 -1265 -1114 -26 1839 2599 2028 -22 -2079 -2480 -1800
2285 -1800 -362 1053 1223 1047 442 469 162 -16 -724 -1709 -2181 -898 798 2605 2943 1784 -622 -1565
2303 -1565 -2158 -1198 -203 242 543 527 1179 1336 1245 274 -1222 -2377 -1980 -618 1213 2412 2314 1069 -363
2322 -363 -1353 -1070 -613 -550 -266 -170 550 1624 1891 1267 -239 -1569 -2402 -1531 -390 1393 1890 1470 857
2341 857 -360 -257 -554 -976 -1286 -1582 -282 886 1869 1965 960 -686 -1741 -2096 -1113 87 826 868
2359 868 857 782 631 389 -533 -1112 -1726 -1505 -404 1396 2142 1846 614 -364 -1285 -1358 -856 -326 -125 246
2379 246 849 1351 1422 569 -492 -1760 -2127 -1572 51 1308 1674 1117 337 -176 -510 -611 -1080 -1141 -785
2398 -785 0 939 1633 1555 702 -905 -1844 -1802 -706 361 1077 778 1039 313 302 79 -460 -1066 -1818 -1148
2418 -1148 177 1264 2149 1529 -125 -1064 -1315 -934 -559 41 128 426 752 1094 947 361 -583 -1758 -1749
2437 -1749 -1233 455 1819 1880 1057 -256 -809 -1120 -340 -222 -578 -405 195 864 1759 1347 522 -796 -1716
2456 -1716 -1506 -558 793 1535 1353 634 87 -128 -159 -447 -729 -1010 -469 151 1377 1791 1314 -78 -1058
2475 -1058 -1761 -1543 29 519 947 961 516 172 216 221 -426 -1402 -1436 -848 500 1321 1837 1042 -405 -848
2495 -848 -1192 -899 -182 55 217 274 778 1040 857 -34 -1004 -1703 -1312 -567 892 1688 1471 789 -159 -741
2515 -741 -713 -839 -623 -592 -375 361 1112 1456 1209 129 -934 -1574 -991 -50 675 1100 982 501 -31 86
2535 86 -488 -908 -892 -997 -369 755 1330 1645 735 -582 -965 -1094 -787 36 471 417 823 774 695 377 -287
2556 -287 -1053 -1510 -1424 150 1018 1068 1477 573 -205 -772 -763 -140 -372 -388 284 666 949 961 500 -176 -1457
2577 -1457 -1324 -1023 -274 634 869 915 141 156 -216 -460 -569 -653 -726 -250 594 1529 1519 709 -436 -1381 -921
2598 -921 -533 158 727 651 515 596 404 162 -350 -614 -1290 -1014 59 1121 1476 1130 255 -614 -843 -950
2618 -950 -512 -333 352 199 323 661 859 348 -532 -1166 -1349 -965 260 986 1129 777 -38 -717 -444 -408
2638 -408 -317 -511 -401 82 661 1155 1065 327 -837 -1242 -1281 -524 618 593 758 440 166 -130 -330 -301 -629
2659 -629 -828 -518 -131 727 1168 1222 249 -599 -1275 -1114 -228 240 473 432 176 346 220 166 -99 -984 -1057
2680 -1057 -312 109 1171 1289 983 112 -653 -483 -752 -66 -231 76 216 427 589 578 -277 -203 -960 -1087
2700 -1087 -771 306 1207 813 398 215 -280 -546 -491 -449 -485 -53 310 739 974 691 116 -648 -1192 -534
2720 -534 -203 526 275 843 448 300 250 -391 -402 -945 -492 -365 449 794 1116 437 23 -793 -767 -629 -83
2741 -83 64 62 252 468 479 275 -198 -776 -731 -989 -113 618 831 995 311 149 -306 -445 -339 -537 -209 -112
2763 -112 114 372 716 627 -60 -630 -1105 -701 -217 558 591 472 305 272 -56 -116 -251 -542 -520 -115 427 1106
2785 1106 905 378 -344 -809 -578 -502 -215 -57 100 369 520 448 264 5 -412 -906 -717 -323 435 715
2805 715 794 202 -130 -638 -70 -463 -235 324 37 245 521 663 391 -456 -305 -1027 -617 29 516 486 982
2826 982 225 145 -381 -180 54 -421 -187 -132 580 690 963 211 -118 -657 -789 -440 88 461 788 326 225
2847 225 254 -94 -79 -154 -290 -492 -9 364 857 554 368 -150 -530 -592 -444 -157 236 323 122 179 324 184
2869 184 -244 -512 -997 -510 -308 257 633 538 125 -123 -492 -257 7 -300 -145 -199 288 465 432 293 38
2890 38 -520 -350 -186 120 -83 621 562 233 63 -141 -143 -297 -416 -407 -167 390 452 461 -59 -195 -240 -472 -453 172
2914 172 229 257 242 90 132 -25 -81 -637 -297 -381 -164 600 410 216 159 -173 -100 -168 -280 -169 6 12 496 350
2938 350 421 253 -262 -133 -579 -154 -63 536 591 154 116 -14 -398 -234 -341 24 -82 265 -192 347 330 379
2960 379 -363 -259 -325 -169 -29 177 504 39 139 143 110 -188 -370 -192 -73 112 160 427 528 112 176 -381
2982 -381 67 -243 184 -135 -62 255 7 22 58 -117 -315 -327 -227 -161 253 205 626 259 -89 -348 -370 91
3004 91 72 -270 -98 224 465 396 100 -207 -347 -280 -281 -166 63 321 -145 329 -118 165 -266 -32 -63 -275
3026 -275 -144 -68 590 712 154 -17 -369 -494 -192 240 322 205 53 306 -211 -51 148 -241 -139 -202 -9
3047 -9 222 613 602 100 36 -118 -188 -80 -31 98 -181 366 403 -87 92 -196 -333 -344 -468 -151 70 366 368
3070 368 213 159 -114 -182 -155 -262 -344 -174 119 237 150 329 111 -292 -437 -185 -142 151 262 134 305 -66
3092 -66 -35 84 47 -55 -375 -118 37 98 432 231 -20 -396 -158 63 -516 -20 122 196 247 129 218 -236
3114 -236 -108 -285 -356 -206 20 174 50 77 76 2 -241 -195 -263 -333 -111 364 495 254 396 -146 -165 -497 -72
3137 -72 -223 81 390 331 206 110 -68 -373 -311 -160 -360 161 44 345 405 359 -60 119 -174 -468 -152 83
3159 83 175 -5 437 233 284 27 -362 -381 -447 -329 129 303 413 264 80 -178 -241 -290 166 -152 170 46
3181 46 111 261 299 -16 -76 -283 -840 -333 306 302 315 187 -67 5 -103 -384 144 -169 -51 160 408 572 179
3204 179 137 -588 -559 -294 -585 -70 412 119 -13 -45 202 -197 -168 -100 -205 -135 -166 236 388 268 42 -182
3226 -182 -449 -461 -34 83 151 -75 230 -47 215 172 -73 -408 -602 -298 103 624 420 255 -33 -253 -203
3247 -203 -198 -363 -325 37 197 290 392 294 -102 -138 -477 -359 -343 -108 319 431 286 164 -188 -9 -312 -250 -43
3270 -43 -131 84 485 258 383 -177 -306 -245 -468 -374 -95 -79 163 216 605 296 -13 -58 -150 -152 0 229 384
3293 384 559 445 -228 -54 -48 -204 -215 -164 -37 116 274 67 566 -163 -117 -544 -367 -174 446 197 376 273
3315 273 232 88 -7 -46 12 -124 -157 150 396 349 148 -433 -186 -713 -707 -98 24 147 367 259 45 67 -43
3338 -43 -292 -535 -272 -591 147 745 676 365 -320 -166 -442 -652 48 -30 453 -1 431 394 221 38 -79
3359 -79 -588 -637 -170 152 658 600 326 75 -533 -207 -364 -139 -227 -278 280 593 651 374 28 -612 -536 -332
3381 -332 -448 347 441 -60 467 148 -63 -358 -118 -453 -236 18 257 656 720 709 205 -528 -675 -337 31
3402 31 203 181 139 188 126 -134 -269 -400 -387 -535 -108 144 423 659 266 64 -281 -484 -424 -325 -81 -144 270
3425 270 360 250 294 -91 -285 -503 -509 -43 425 545 378 134 54 -271 -306 -447 -253 -46 190 138 585 767
3447 767 282 -211 -436 -475 -484 -138 34 852 599 423 381 -51 -285 -568 -585 -455 -173 411 685 426 307 -116
3469 -116 -604 -560 -334 -283 -36 380 237 300 312 38 -430 -416 -771 -289 123 541 787 648 -62 -121 -452 -651
3491 -651 -387 -237 -190 1 528 461 530 10 -545 -447 -501 -211 111 138 520 626 226 221 97 -68 -508 -118 -233
3514 -233 -84 512 710 542 165 -203 -536 -592 -431 -35 126 353 280 589 559 120 3 -603 -457 -469 15
3535 15 531 816 781 -92 -417 -708 -427 -126 118 -44 96 513 517 484 249 -29 -656 -663 -326 488 463 408 506
3558 506 58 -127 -188 -73 -303 -361 -174 312 672 437 410 163 -572 -894 -655 -14 61 479 387 452 468 -3
3580 -3 -277 -836 -520 -581 -319 -30 641 937 748 -89 -302 -711 -762 -324 79 142 593 706 362 167 -107 -376
3602 -376 -767 -531 -187 169 757 771 594 -99 -352 -394 -439 -301 -340 140 206 544 765 744 -155 -513 -1112 -815
3624 -815 -121 371 811 758 612 75 -236 -359 -369 -827 -410 1 270 751 644 385 71 -482 -612 -600 -147
3645 -147 -46 466 421 147 159 339 -129 -743 -809 -578 -56 204 640 579 159 -221 -492 -507 -563 -332 -51 102
3667 102 316 401 530 337 -509 -513 -1046 -702 25 446 972 522 453 31 -481 -632 -526 -359 -243 -31 190
3688 190 789 886 224 -294 -629 -926 -626 -104 564 743 604 434 215 -82 -485 -578 -426 -308 -71 605 943
3709 943 827 266 -330 -979 -760 -277 -316 66 307 572 424 241 7 -523 -841 -957 -592 60 500 657
3729 657 483 -97 -235 -512 -651 -185 -30 46 355 137 697 498 221 -323 -816 -833 -516 25 512 671 528
3750 528 91 42 -329 -427 -462 -165 104 237 739 959 720 63 -514 -746 -713 -60 33 436 378 489 125 203
3772 203 38 -128 -325 -523 -533 93 635 928 421 -22 -577 -1060 -508 -462 112 309 671 749 645 738 34
3793 34 -543 -425 -637 -662 107 685 1081 551 167 -241 -547 -839 -221 -224 270 547 636 617 469 -272 -717 -858
3815 -858 -815 -129 295 602 700 459 -49 -262 -460 -404 -294 -362 1 217 752 840 489 -103 -677 -611 -473 -317
3837 -317 452 698 643 689 664 145 -180 -926 -666 -628 -94 464 962 864 236 -30 -521 -746 -675 -367 -117 135
3859 135 462 764 448 183 -441 -520 -898 -748 126 588 673 536 422 35 -206 -607 -665 -428 -605 268 479
3880 479 748 722 167 -228 -927 -816 -618 -399 305 588 232 511 365 17 -266 -710 -621 -380 -99 566 769
3901 769 861 365 -377 -558 -730 -471 -218 32 188 663 674 447 270 -590 -701 -862 -821 189 606 1091 816
3922 816 469 -610 -182 -439 -345 -478 -118 160 462 705 580 145 -444 -989 -964 -412 315 373 864 476 488
3943 488 15 -154 -528 -503 -638 -146 275 742 765 898 205 -267 -661 -919 -476 64 685 601 369 664 141
3964 141 -235 -320 -723 -650 -280 566 594 936 658 156 -334 -910 -822 -472 52 223 345 834 657 249 -67
3985 -67 -692 -956 -709 -366 107 543 840 640 25 -24 -675 -426 -630 -457 11 314 729 710 343 -161 -922
4006 -922 -1138 -853 -222 204 712 679 585 258 -13 -545 -540 -855 -574 67 302 1124 869 528 -102 -488 -764
4027 -764 -610 -138 48 291 295 560 509 176 -330 -155 -852 -764 -363 496 776 628 333 117 -634 -876 -651
4048 -651 -620 -9 355 397 917 854 179 -439 -663 -1030 -517 195 423 1009 777 534 150 -411 -405 -707 -381 -240
4070 -240 -27 608 780 716 399 -167 -744 -1045 -728 94 367 549 618 502 251 89 -386 -643 -996 -674 -189
4091 -189 725 959 694 671 -243 -741 -712 -731 -66 235 716 600 500 547 353 -540 -765 -1009 -748 132 465
4112 465 972 672 335 -293 -550 -763 -645 -196 160 275 724 950 554 177 -251 -1010 -1134 -672 411 299
4132 299 663 667 499 114 -323 -516 -629 -753 -482 303 491 785 760 -159 -612 -835 -828 -411 -79 302 297 647
4154 647 398 -44 -40 -368 -845 -988 -276 427 1028 1007 564 486 -560 -401 -736 -604 -372 198 489 696 809
4175 809 -3 -45 -610 -852 -864 -328 259 527 1101 484 -31 -71 -415 -646 -543 -463 -141 362 599 848 761 -132
4197 -132 -637 -629 -711 -457 -21 669 633 778 259 -164 -335 -704 -798 -555 -104 390 1053 686 492 -64 -360 -873
4219 -873 -583 -204 65 384 507 979 176 233 -126 -919 -711 -547 -105 179 884 1265 553 145 -251 -585
4239 -585 -615 -526 -232 299 295 773 928 185 -190 -778 -1055 -970 -191 250 645 875 426 180 -159 -418 -934 -624
4261 -624 -520 66 673 908 660 152 -502 -866 -845 -567 -55 202 710 582 327 229 -191 -430 -746 -700 -525
4282 -525 -280 278 746 890 448 -25 -357 -916 -849 -328 -72 291 611 630 620 -37 -370 -976 -841 -582 102
4303 102 723 550 653 426 -24 -465 -625 -600 -703 -182 14 560 1075 556 404 -160 -758 -784 -573 -155 497
4324 497 426 754 633 125 -147 -507 -555 -764 -348 160 577 837 829 497 -310 -990 -638 -449 -326 236 530
4345 530 751 525 495 -99 -361 -676 -571 -480 70 663 1114 697 632 -184 -773 -749 -403 -49 -103 574 365 642
4367 642 672 -25 -221 -838 -812 -611 174 840 878 538 334 -92 -501 -733 -657 -502 181 201 752 995 611 -61
4389 -61 -721 -643 -802 -266 -192 508 722 823 328 145 -75 -448 -898 -667 -197 509 665 735 721 -68 -395 -952
4411 -952 -672 -200 29 310 181 909 770 247 -16 -868 -899 -1148 -321 82 599 777 505 86 -401 -458 -426
4432 -426 -197 -188 168 489 874 620 438 -186 -700 -867 -743 -334 247 546 674 324 406 -143 -629 -586 -630 -410
4454 -410 -7 213 562 897 386 104 -308 -693 -573 -211 -6 442 613 676 523 58 -287 -798 -614 -683 -177
4475 -177 590 433 868 552 -99 -370 -989 -781 -717 33 391 767 721 637 254 -158 -698 -1043 -625 -13 743
4496 743 725 613 530 164 -229 -423 -756 -617 -331 65 284 801 830 254 -210 -475 -800 -840 -59 245 575
4517 575 769 394 260 -213 -439 -806 -603 -535 86 497 779 786 -7 -173 -469 -650 -451 -217 156 507 694
4538 694 624 238 -54 -444 -699 -775 -600 250 524 682 886 252 -258 -217 -531 -623 -205 374 460 706 494 508
4560 508 66 -599 -684 -792 -428 3 626 711 713 450 -170 -336 -538 -718 -302 -223 507 716 899 715 87 -285
4582 -285 -767 -546 -410 40 428 618 556 163 134 -353 -379 -808 -508 -152 181 777 469 758 -113 -322 -419
4603 -419 -609 -693 159 305 561 816 624 384 -25 -732 -777 -612 -304 209 613 358 631 23 -68 -591 -722
4624 -722 -758 -275 49 427 722 466 420 -168 -477 -616 -818 -528 228 546 501 571 131 15 -383 -773 -700 -363
4646 -363 37 255 846 786 515 121 -778 -963 -809 -445 -188 450 608 686 360 305 -178 -721 -712 -597 -263 268
4668 268 584 479 619 113 -527 -704 -546 -569 -149 177 615 659 596 202 -182 -550 -643 -739 -155 114 629 519
4690 519 496 -16 -202 -410 -646 -598 -414 -69 673 879 756 105 -104 -228 -467 -440 -146 232 578 620 548 410
4712 410 36 -261 -539 -802 -399 -25 589 978 760 503 -214 -615 -789 -584 -259 90 203 382 676 414
4732 414 43 -453 -845 -862 -620 197 364 643 728 592 326 -189 -319 -748 -701 -107 224 723 650 602 221 -307
4754 -307 -678 -766 -727 76 392 465 757 328 -180 -314 -401 -522 -169 -341 14 651 528 429 117 -322 -621 -989
4776 -989 -521 -98 -234 621 640 555 384 -103 -541 -748 -887 -653 -229 483 608 852 336 -38 -570 -736 -479
4797 -479 -243 -271 469 606 516 452 -45 -261 -805 -778 -568 -15 345 715 634 492 -287 -393 -642 -680 -433 -100
4819 -100 104 373 669 542 299 -557 -681 -446 -479 -287 366 562 573 378 284 -425 -293 -391 -567 -287 215
4840 215 550 550 373 257 -161 -532 -744 -470 -272 174 540 645 656 325 -140 -731 -683 -861 -247 165 576
4861 576 477 646 26 -96 -512 -732 -408 -205 -68 522 761 551 581 139 -643 -714 -695 -147 31 449 605
4882 605 576 391 -134 -436 -692 -461 -389 -168 289 820 680 359 162 -495 -728 -641 -393 -268 265 556 457
4903 457 664 193 -195 -620 -726 -593 67 450 422 781 522 -142 -339 -462 -725 -643 -200 231 671 631 599
4924 599 103 131 -666 -316 -530 -302 158 464 762 511 183 -225 -648 -471 -670 -571 175 546 739 718 473
4945 473 -275 -678 -742 -569 -469 245 374 737 678 508 -324 -510 -649 -461 -101 24 555 448 596 615 -91
4966 -91 -375 -564 -733 -328 32 324 612 536 97 17 -317 -780 -571 -514 14 585 667 683 350 -21 -506 -791
4988 -791 -320 -320 -179 274 527 512 778 195 -290 -588 -564 -278 -259 273 526 752 253 -22 -41 -609 -274 -624
5010 -624 -252 18 361 766 572 462 -68 -648 -791 -280 -21 167 504 786 523 -40 65 -217 -485 -550
5030 -550 -206 5 480 606 705 439 -331 -584 -819 -565 -300 -71 635 487 858 192 135 -229 -689 -589 -291
5051 -291 4 375 486 1002 427 -69 -406 -721 -346 -437 -282 227 593 625 326 286 -56 -340 -590 -354 -230
5072 -230 234 580 650 309 -44 -266 -626 -408 -445 -388 181 662 781 825 400 -37 -886 -807 -505 -76 209 189
5094 189 569 149 86 -117 -620 -516 -685 7 176 589 774 252 36 -458 -425 -595 -315 -395 84 363 894
5115 894 493 262 -298 -245 -668 -593 -516 118 306 700 654 303 -230 -683 -796 -528 -516 -73 429 591 598 373
5137 373 202 -289 -678 -557 -423 246 483 669 208 436 264 -148 -636 -604 -506 -244 122 417 491 674 136
5158 136 -62 -609 -808 -668 -140 345 678 716 555 289 -261 -533 -850 -557 -345 309 631 509 552 166 -235
5179 -235 -595 -574 -601 -353 -115 365 814 617 229 -96 -478 -814 -902 -699 420 281 474 638 251 -52 -361
5200 -361 -723 -453 -209 44 419 773 736 313 -140 -721 -943 -581 -230 122 486 528 586 308 -68 -370 -367 -676
5222 -676 -150 26 379 559 762 288 207 -145 -529 -431 -635 81 250 529 763 382 -33 -479 -612 -779 -477
5243 -477 -90 298 528 656 388 205 -165 -584 -442 -359 -119 333 511 531 447 208 -312 -386 -597 -619 -395 147
5265 147 546 638 494 399 82 -215 -477 -511 -317 125 332 486 423 266 -419 -502 -406 -551 -267 -87 372 413
5287 413 357 291 65 -538 -640 -679 -511 -180 504 789 747 483 -183 -386 -521 -461 -299 -85 327 709 569 448
5309 448 199 -292 -508 -875 -509 -4 488 796 380 130 89 -516 -509 -413 -380 -370 266 840 720 406 160 -191
5331 -191 -438 -882 -412 -237 284 649 546 483 425 223 -401 -599 -642 -250 230 479 553 594 30 -170 -352 -521
5353 -521 -441 -54 111 663 401 743 239 -221 -577 -763 -564 -334 81 241 674 320 -8 -97 -570 -517 -553
5374 -553 18 4 36 530 407 288 161 -475 -501 -465 -371 -42 414 365 443 370 280 -246 -656 -733 -303 10 37 663
5398 663 508 374 200 -205 -509 -758 -323 -19 -33 357 694 527 246 -425 -570 -490 -446 -59 192 156 571
5419 571 701 1 -331 -612 -576 -416 -145 188 395 397 400 9 -58 -467 -760 -302 -445 277 419 699 391 183
5441 183 -306 -344 -333 -697 -206 -51 705 722 422 223 26 -407 -666 -290 -441 57 473 500 554 323 174 -650
5463 -650 -324 -719 -537 -66 582 511 389 728 -68 -247 -719 -708 -575 82 455 689 603 506 430 -422 -677 -820
5485 -820 -266 212 328 936 697 422 355 -185 -434 -638 -637 -168 4 470 765 317 312 -303 -486 -595 -664 -78
5507 -78 292 453 661 545 266 -205 -424 -593 -455 -154 -70 580 713 623 183 -164 -588 -530 -698 -106 248
5528 248 600 592 619 195 -407 -123 -649 -513 -373 52 435 681 524 298 -2 -399 -829 -528 -534 53 455 612
5550 612 593 169 26 -371 -489 -493 -437 222 363 712 370 305 41 -377 -509 -436 -251 173 138 496 450 579 54
5573 54 -572 -528 -737 -518 -176 317 441 570 483 74 -33 -685 -590 -687 -57 361 194 754 194 234 -67 -474
5595 -474 -556 -431 -163 44 746 588 536 510 -64 -466 -792 -614 -213 158 878 621 623 96 -134 -597 -689 -696 -250
5618 -250 154 456 780 601 361 -347 -443 -745 -472 -536 27 501 656 584 91 -250 -469 -585 -614 -295 -16
5639 -16 579 682 559 297 -145 -112 -720 -534 -158 -95 381 385 691 438 176 -216 -363 -469 -347 25 235 424
5661 424 851 292 46 -60 -501 -866 -603 -6 103 251 678 639 39 -112 -893 -406 -364 -373 160 685 642 353
5683 353 130 -167 -291 -485 -315 -438 223 547 638 456 149 -162 -357 -616 -591 -155 268 698 268 802 290
5704 290 -33 -591 -417 -519 -360 44 387 770 481 482 -167 -719 -595 -491 -92 225 424 599 720 218 32
5725 32 -371 -533 -638 -396 47 553 671 662 498 -91 -352 -728 -403 -467 19 370 511 745 317 47 -45 -630
5747 -630 -444 -532 -36 72 415 675 60 -13 -455 -245 -550 -513 -234 47 374 712 976 259 -105 -681 -635
5768 -635 -573 -71 240 473 501 368 48 -31 -676 -911 -334 -146 113 557 940 303 136 -437 -447 -706 -496
5789 -496 -34 -39 436 809 228 182 8 -562 -627 -635 -353 17 353 729 651 139 102 -610 -396 -670 -155 81 406
5812 406 485 509 366 97 -243 -658 -702 -211 -3 220 606 452 62 49 -226 -522 -591 -350 233 228 560 274
5834 274 288 363 -463 -638 -652 -192 -319 299 702 428 46 44 -49 -763 -555 -549 -110 35 440 573 414 326 -322
5857 -322 -505 -496 -567 -10 312 384 510 437 221 -41 -464 -760 -597 -93 152 623 616 535 253 -108 -731 -750 -377
5880 -377 -503 383 398 499 500 -25 190 -472 -654 -269 -67 87 409 793 701 211 -150 -372 -633 -600 -373 4
5902 4 457 615 623 292 -34 -219 -621 -724 -269 -229 96 779 435 320 -46 -374 -546 -830 -415 10 227 395
5924 395 641 218 255 -342 -778 -375 -552 295 80 251 444 468 80 -215 -889 -581 -434 -290 134 662 591
5945 591 244 213 -143 -524 -454 -386 -53 146 159 465 420 14 -103 -688 -439 -389 -235 449 443 600 179 -116 -38
5968 -38 -278 -522 -561 -179 -40 477 752 713 222 111 -274 -564 -191 -143 166 317 623 226 164 99 -324 -612
5990 -612 -626 -367 -61 275 562 287 299 -153 -132 -576 -317 -521 199 204 617 355 -87 283 -416 -537 -576 -383
6012 -383 -29 146 635 423 449 -73 -531 -723 -764 -525 -75 295 369 560 235 45 -361 -654 -370 -286 -149
6033 -149 39 582 444 475 -25 -75 -323 -581 -479 -480 272 189 390 375 78 -216 -254 -304 -384 -58 152 430 544
6056 544 619 211 -39 -166 -526 -519 -402 91 413 739 514 221 -121 -439 -665 -413 -317 -137 136 227 544 207
6078 207 -64 -276 -630 -611 -219 166 481 534 323 388 65 -46 -635 -582 -458 -142 149 769 519 363 108
6099 108 -243 -384 -396 -387 41 123 393 649 296 203 -152 -455 -279 -531 -208 193 583 517 208 -54 -405 -481
6121 -481 -662 -381 -5 212 336 328 362 63 16 -558 -441 -522 -148 214 601 401 269 123 -131 -173 -528 -539
6143 -539 -222 17 171 424 396 -5 -48 -282 -488 -371 -14 63 195 343 625 85 -235 -472 -335 -452 -199
6164 -199 110 546 662 209 199 -94 -168 -534 -364 -176 57 319 559 605 218 -49 -444 -600 -699 -471 -31
6185 -31 36 455 616 108 78 -35 -490 -352 -376 -34 81 700 492 164 269 -340 -690 -670 -340 -313 139 398
6207 398 439 73 -162 -105 -366 -725 -809 -343 309 584 543 609 49 -320 -380 -689 -194 -189 198 363 564 475 -52
6230 -52 -46 -255 -615 -668 -176 73 389 670 351 202 -264 -324 -647 -336 -519 26 440 693 503 222 -150 -288
6252 -288 -540 -712 -59 170 237 522 652 199 -96 -497 -358 -597 -276 -187 279 295 331 354 -53 -137 -331 -564
6274 -564 -490 259 626 380 641 362 69 -385 -487 -548 -507 23 391 575 584 633 -99 -686 -384 -392 -488 -230 153
6297 153 504 528 205 142 -587 -326 -623 -473 -29 573 455 454 483 5 -246 -669 -532 -509 -215 144 391 381
6319 381 355 294 -52 -445 -396 -327 -22 -35 294 562 437 419 53 -297 -186 -348 -359 78 228 653 503 347
6341 347 -395 -531 -334 -191 -182 26 558 591 420 231 284 -215 -425 -581 -420 72 370 695 627 347 74 -342
6363 -342 -294 -92 -171 11 544 530 461 131 87 -257 -425 -321 -367 113 571 434 396 348 333 -197 -81 -420 -424 -62
6387 -62 284 473 458 273 66 23 -426 -564 -523 155 359 435 239 58 -94 -245 -126 -396 -436 -47 268 185
6409 185 638 467 43 -342 -221 -308 -591 -198 -201 392 573 482 115 -184 -401 -671 -296 -120 92 227 474
6430 474 310 56 55 -249 -514 -229 -232 -111 384 247 217 15 24 -429 -307 -628 -273 -67 197 404 393 -44 -156
6453 -156 -128 -367 -581 -343 -49 511 255 265 111 -183 -314 -207 -444 -285 195 162 325 545 363 -152 -125
6474 -125 -295 -471 -543 -56 21 213 453 65 293 -137 -167 -361 -229 20 144 484 145 358 118 -556 -378
6495 -378 -217 -184 -150 40 507 603 209 141 -55 -388 -575 -522 -124 83 132 153 539 229 -90 -304 -746 -432
6517 -432 -377 99 163 728 362 -72 59 -405 -607 -378 -488 137 13 264 419 412 0 -14 -607 -513 -23 155
6539 155 329 426 482 133 -191 -377 47 -450 -101 44 202 449 379 139 290 -171 -376 -281 -200 11 211 429
6561 429 88 193 -75 -278 -493 -349 -282 -15 -167 469 303 133 153 -410 -372 -272 -61 -104 26 306 321 343
6583 343 8 -133 -88 -271 -258 -38 -6 363 261 425 147 26 -99 -375 -286 -60 36 24 584 80 263 -52
6605 -52 -321 -379 -271 -247 -88 355 17 280 109 55 -233 -437 -426 -266 -75 310 350 438 201 4 -277 -80
6627 -80 -172 -231 129 104 301 198 254 70 -319 -121 -140 -334 138 97 296 426 246 28 -408 -88 -221 -280 -37
6650 -37 65 335 269 493 -13 -158 -379 -319 -403 72 -8 180 215 -3 354 -200 -238 -413 -452 -356 -93 338 329 93
6674 93 124 -371 -289 -276 -121 -141 74 310 489 372 86 -60 -282 -158 -360 -244 46 241 437 155 327 -102
6696 -102 14 -249 -396 -182 -201 205 58 348 182 18 -562 -228 -287 -137 246 416 421 278 133 96 -263 -245
6718 -245 -176 -309 -105 216 59 768 289 -221 -286 -479 -228 -114 -234 142 340 350 151 114 -194 -344 -158
6739 -158 -382 -92 -4 140 204 493 124 112 -548 84 -260 180 154 474 204 51 20 -341 -219 -220 -251 -137 283
6762 283 -59 -48 144 201 1 -226 -134 -342 -169 -132 187 285 297 309 -18 -382 -324 -323 6 24 77 -43 337 252
6786 252 103 -318 -627 -386 -251 192 407 206 211 302 185 53 -260 -377 171 30 147 526 137 362 -39
6807 -39 -206 -455 -49 -17 -37 240 289 241 -48 175 -273 48 -340 -189 -167 217 222 352 88 71 -94 -105 -373
6830 -373 -224 -14 -1 368 6 138 -51 -13 -135 -92 -218 -91 113 -10 62 261 164 -170 -347 -341 -7 -14 -34
6853 -34 238 148 276 56 -117 43 88 16 -47 -114 243 442 148 492 -205 -34 -127 1 -225 -33 -15 428 -31
6876 -31 45 -86 -211 -464 -372 -242 105 296 304 383 153 -62 -183 -200 -264 -203 23 16 37 363 56 7 -57 -125 -314
6901 -314 -6 -56 78 362 505 339 -13 -290 -164 -102 -216 81 149 307 43 25 27 -53 -373 24 -280 -9
6923 -9 285 174 80 162 -329 -88 -218 -422 -205 104 216 217 251 240 243 -308 28 -117 -237 -82 117 23 349 -72
6947 -72 198 -105 -136 -140 42 29 173 -190 136 33 102 19 -256 -26 -216 -247 320 369 16 339 -4 -1 -267 -264
6971 -264 -356 -7 45 -146 -47 -74 -110 188 -295 -78 -481 -405 -390 -50 31 18 263 141 -20 -176 -119 -230 16
6994 16 140 408 240 312 -153 -35 -230 -215 -163 294 158 87 77 147 -120 115 -330 -242 49 -182 -55 133 -37
7017 -37 -15 118 -81 -181 217 -133 260 260 168 118 -74 65 88 106 -66 -21 -321 89 50 79 141 171 66 -225
7041 -225 -27 -162 -151 89 85 177 76 319 105 -218 -280 -97 27 -132 256 205 228 14 -21 -324 -255 -140 -267
7064 -267 14 -307 6 362 359 17 109 -345 53 -40 -165 61 242 86 47 108 -201 -255 21 -252 -149 124
7086 124 361 212 -12 -115 51 -338 -195 -204 -138 140 457 -21 120 -56 166 -69 -475 -33 -221 116 -102
7107 -102 -115 190 258 26 -380 -226 -97 -62 71 504 -159 -110 183 -17 -95 30 -114 -171 348 -131 41 18
7129 18 339 -62 29 -31 -144 -3 -160 104 249 151 44 43 -68 -312 -182 0 182 -15 -42 322 179 25
7151 25 -165 -70 -136 -19 37 360 380 -17 321 325 49 -213 110 -97 -249 114 152 -179 74 -115 -344 -318 122
7174 122 18 -55 71 266 313 15 142 54 -110 233 -6 79 75 99 284 200 -79 202 62 7 37 128 394 15
7198 15 152 -6 36 78 200 -422 -109 -95 -239 37 60 169 -35 50 -236 -194 -31 179 -200 44 -105 335
7220 335 -111 -65 103 46 -5 6 -114 217 235 -63 52 -268 -25 -72 -299 287 74 -248 65 27 -183 156
7242 156 22 16 -243 -215 -180 -222 78 -233 7 67 283 -34 -49 -129 -77 -134 -205 180 162 38 188 40 -182 -128
7266 -128 -144 97 250 90 -143 87 186 57 73 -30 221 28 277 91 82 -152 -177 -6 -197 132 -179 201
7288 201 -184 -76 61 136 141 -7 -10 -239 35 -183 28 42 270 43 9 82 -22 -92 -52 -182 -190 -190 87 -42 -68
7313 -68 -13 -139 -136 -119 -40 32 150 33 -79 -124 74 6 110 -97 -92 -285 189 -103 155 107 16 -63 249 116 -59
7338 -59 -63 -26 247 -70 -46 287 203 253 36 -236 -189 137 -181 -232 -77 68 63 -131 -110 -259 -245 252 -80 104
7362 104 -33 217 -164 -136 -116 -150 -58 97 86 -90 49 -16 3 -30 70 -94 119 152 -53 279 -264 157 208
7385 208 12 218 -180 -72 270 14 45 173 -16 -69 -118 -221 0 -154 -51 -32 -112 -7 65 129 -13 -336
7407 -336 -159 -96 -32 117 -163 400 -83 -87 -123 -137 193 326 -34 150 3 208 264 0 38 25 101 -94 32
7430 32 218 -6 -150 146 96 124 -136 -232 250 20 186 137 187 225 165 215 159 134 31 62 -117 -17 71 214
7454 214 161 91 -25 51 98 -131 -77 -127 49 110 48 -17 -34 147 215 73 69 80 -12 93 117 -52 -28 -67 -109 32
7480 32 55 -33 -98 168 -11 -90 -62 -126 -172 -215 21 -207 120 81 -224 100 -115 25 -95 -16 -275 33 225 20
7504 20 -150 203 -62 105 -149 -134 -96 -461 29 -87 52 38 -77 53 192 109 -22 -1 -114 1 15 -2 127
7527 127 176 -81 239 -175 -143 222 93 190 253 -36 10 45 50 -44 -140 23 -152 -164 -213 -160 -66 -39 173 -95 -173
7552 -173 46 -125 161 -38 -9 78 12 -385 -101 -109 -148 68 147 14 47 230 0 246 84 -158 -133 -146 -110 12
7576 12 -229 271 -115 -408 -104 153 -53 -62 23 162 8 173 -15 -37 161 -164 -19 71 47 125 355 -14 23
7599 23 -43 191 -168 -64 -83 -132 -175 -22 57 142 98 -141 -260 88 209 3 57 300 131 54 93 -41 -150 -258
7623 -258 -92 -258 -103 122 66 -76 33 -24 -46 -209 145 -129 186 -6 193 201 134 -97 -224 104 -238 56
7645 56 -248 -96 -97 14 -222 -51 -177 -146 128 7 237 129 -13 226 124 71 54 -24 -59 82 -227 -25 -46
7668 -46 -120 -103 30 32 76 34 151 -60 -176 39 17 -104 -20 -124 -199 240 -36 15 150 32 -363 -27 -128 -168
7692 -168 -10 -74 297 225 155 -17 -82 -195 -193 -57 -58 -86 -86 167 69 31 142 228 211 45 -193 -214 -43 15 421 95
7718 95 -40 125 30 -110 -244 262 261 168 63 264 -13 -120 48 93 -113 21 216 -214 -82 115 343 115
7740 115 -37 -60 -148 56 32 -17 -57 -175 154 -191 -127 89 -49 -23 -242 15 -10 216 102 136 177 104 220 -6
7764 -6 -67 -300 -52 99 77 193 106 37 -193 42 -177 -34 -8 49 50 185 294 -218 18 141 -296 66 260
7787 260 73 128 165 241 -36 -43 -224 57 12 73 56 351 158 282 46 -259 -177 -261 53 40 156 -14 171 -53
7811 -53 56 -219 -15 265 -226 -151 -139 -144 193 102 129 -115 70 1 119 198 -95 61 -22 291 -40 12 -179 -129
7835 -129 -128 118 -290 123 252 353 106 -16 -22 -273 -18 105 129 118 64 38 -66 -36 -39 -304 -162 -122 8 61
7859 61 -3 247 102 -162 -161 -163 -126 -89 161 -60 467 198 -67 55 -88 -69 -133 -62 -49 -118 351 105 -21 108
7883 108 -142 -75 -32 -109 44 -39 207 119 283 -115 -252 -321 -200 -83 -75 52 233 -28 129 -272 315 165 -160
7906 -160 37 13 -17 150 19 300 -22 7 -177 -137 -219 132 -2 128 137 434 -18 -214 -44 -206 21 34 210
7929 210 -118 147 93 -409 -269 -98 128 18 -127 -66 27 20 84 165 226 -145 -179 57 194 -33 278 332 121
7952 121 9 131 -20 -262 15 177 47 106 283 98 11 269 -125 -203 -105 -231 -179 116 242 16 273 181
7974 181 -266 -14 31 -177 53 -296 -14 236 194 160 -88 59 169 -47 13 -48 25 141 17 225 169 -58
7996 -58 84 -136 123 71 327 221 135 314 -147 15 -146 -64 -125 -26 184 335 -36 -271 57 -265 -43 -236
8018 -236 88 222 -13 184 198 99 -178 -218 -195 -304 -393 -26 170 226 -25 -55 -50 11 -163 -128 82 -57 139 41
8042 41 221 177 11 -12 -195 -166 241 -102 -75 227 186 89 -5 -36 43 -223 -52 49 270 150 284 110 0
8065 0 7 -185 -130 -103 33 7 297 260 384 -62 42 -438 -117 -245 125 166 84 93 185 -47 -35 -121 -126 -23 90 87
8091 87 -175 -244 431 333 -14 -51 -301 -440 -122 69 91 49 226 409 48 -58 -455 -160 4 -52 144 52 209
8114 209 83 66 71 39 -279 169 93 -47 78 108 218 -147 -278 -92 -90 -333 -70 80 172 238 56 227 -335
8137 -335 -227 -171 -26 123 -78 194 99 214 68 -163 -72 -359 -81 189 -168 68 192 -113 44 48 -316 -158
8159 -158 -106 -69 71 105 150 134 160 -8 -28 9 -362 24 153 2 0 165 -163 -16 -387 154 -66 -71 -72 112 16
8184 16 77 268 107 -43 -176 -252 -209
8191b09
##END NTUPLES=NMR FID
##END=
