##TITLE=1H_DE-80H_X3
 200.13MHz, d2o
 8 sc
 
 19ns.26.2.2025
##JCAMPDX= 6.0         $$ Bruker NMR JCAMP-DX V2.0
##DATA TYPE= NMR FID
##DATA CLASS= NTUPLES
##ORIGIN= UXNMR, Bruker Analytische Messtechnik GmbH
##OWNER= pz
$$ XWIN-NMR		Version 3.5
$$ Mon Apr 21 14:18:59 2025 Russian Standard Time (UT+4h)  Yarkov@DPX200
##.OBSERVE FREQUENCY= 200.1313
##.OBSERVE NUCLEUS= ^1H
##.DELAY= (6, 6)
##.ACQUISITION MODE= SIMULTANEOUS
##.ACQUISITION SCHEME= undefined
##.AVERAGES= 8
##.DIGITISER RES= 18
##SPECTROMETER/DATA SYSTEM= spect
##.PULSE SEQUENCE= zg30
##.SOLVENT NAME= CDCl3
##.SHIFT REFERENCE= (INTERNAL, CDCl3, 0, 14.3821)
##AUDIT TRAIL= $$ (NUMBER, WHEN, WHO, WHERE, WHAT)
$$ ##TITLE= Audit trail, XWIN-NMR		Version 3.5
$$ ##JCAMPDX= 5.01
$$ ##ORIGIN= Bruker BioSpin GmbH
$$ ##OWNER= Yarkov
$$ C:/Bruker/XWIN-NMR/data/yarkov2/nmr/H-C/1/audita.txt
$$ ##AUDIT TRAIL=  $$ (NUMBER, WHEN, WHO, WHERE, WHAT)
(   1,<2025-04-21 14:18:00.28 +0400>,<Yarkov>,<DPX200>,
      <created by zg, POWCHK disabled, PULCHK disabled
       configuration hash MD5:
       00 E9 B6 7A A2 85 ED C7 34 08 36 98 17 FE 4E 26
       data hash MD5: 16K
       09 C6 B1 9E 11 F2 4D 41 3D 22 9A 0F 50 AC 7E 11>)
$$ ##END=
$$ 
$$ hash MD5
$$ 68 5A 87 FC EF 7B 08 C5 23 EC D1 B0 BB 95 35 4D
##$RELAX= 
##$RELAX= 
##$RELAX= 
##$RELAX= 
##$RELAX= 
##$RELAX= 
$$ Bruker specific parameters
$$ --------------------------
##$DU= <C:/Bruker/XWIN-NMR>
##$EXPNO= 1
##$NAME= <H-C>
##$PROCNO= 1
##$TYPE= <nmr>
##$USER= <yarkov2>
##$AMP= (0..31)
100 100 100 100 100 100 100 100 100 100 100 100 100 100 100 100 100 100 
100 100 100 100 100 100 100 100 100 100 100 100 100 100 
##$AQSEQ= 0
##$AQ_mod= 1
##$AUNM= <au_zg>
##$AUTOPOS= <>
##$BF1= 200.13
##$BF2= 200.13
##$BF3= 200.13
##$BF4= 200.13
##$BF5= 200.13
##$BF6= 200.13
##$BF7= 200.13
##$BF8= 200.13
##$BYTORDA= 1
##$CFDGTYP= 0
##$CFRGTYP= 5
##$CHEMSTR= <none>
##$CNST= (0..31)
1 1 145 1 1 1 1 1 1 1 1 1 1 1 1 1 1 1 1 1 1 1 1 1 1 1 1 1 1 1 1 1 
##$CPDPRG= <>
##$CPDPRG1= <>
##$CPDPRG2= <>
##$CPDPRG3= <>
##$CPDPRG4= <mlev>
##$CPDPRG5= <mlev>
##$CPDPRG6= <mlev>
##$CPDPRG7= <mlev>
##$CPDPRG8= <mlev>
##$CPDPRGB= <>
##$CPDPRGT= <>
##$D= (0..31)
0 0.7 0 0 0 0 0 0 0 0 0 0.03 0 0 0 0 0 0 0 0 0 0 0 0 0 0 0 0 0 0 0 0 
##$DATE= 1745230679
##$DBL= (0..7)
120 120 120 120 120 120 120 120 
##$DBP= (0..7)
150 150 150 150 150 150 150 150 
##$DBP07= 0
##$DBPNAM0= <>
##$DBPNAM1= <>
##$DBPNAM2= <>
##$DBPNAM3= <>
##$DBPNAM4= <>
##$DBPNAM5= <>
##$DBPNAM6= <>
##$DBPNAM7= <>
##$DBPOAL= (0..7)
0.5 0.5 0.5 0.5 0.5 0.5 0.5 0.5 
##$DBPOFFS= (0..7)
0 0 0 0 0 0 0 0 
##$DE= 6
##$DECBNUC= <off>
##$DECIM= 32
##$DECNUC= <off>
##$DECSTAT= 4
##$DIGMOD= 1
##$DIGTYP= 9
##$DL= (0..7)
0 120 120 120 120 120 120 120 
##$DP= (0..7)
150 150 150 150 150 150 150 150 
##$DP07= 0
##$DPNAME0= <>
##$DPNAME1= <>
##$DPNAME2= <>
##$DPNAME3= <>
##$DPNAME4= <>
##$DPNAME5= <>
##$DPNAME6= <>
##$DPNAME7= <>
##$DPOAL= (0..7)
0.5 0.5 0.5 0.5 0.5 0.5 0.5 0.5 
##$DPOFFS= (0..7)
0 0 0 0 0 0 0 0 
##$DQDMODE= 0
##$DR= 18
##$DS= 0
$$ [...]
##$SUBNAM2= <"">
##$SUBNAM3= <"">
##$SUBNAM4= <"">
##$SUBNAM5= <"">
##$SUBNAM6= <"">
##$SUBNAM7= <"">
##$SUBNAM8= <"">
##$SUBNAM9= <"">
##$SW= 18.0517328524113
##$SWIBOX= (0..15)
0 0 2 0 0 0 0 0 0 0 0 0 0 0 0 0 
##$SW_h= 3612.71676300578
##$TD= 16384
##$TD0= 1
##$TE= 0
##$TE2= 300
##$TE3= 300
##$TEG= 300
##$TL= (0..7)
0 120 120 120 120 120 120 120 
##$TP= (0..7)
150 150 150 150 150 150 150 150 
##$TP07= 0
##$TPNAME0= <>
##$TPNAME1= <>
##$TPNAME2= <>
##$TPNAME3= <>
##$TPNAME4= <>
##$TPNAME5= <>
##$TPNAME6= <>
##$TPNAME7= <>
##$TPOAL= (0..7)
0.5 0.5 0.5 0.5 0.5 0.5 0.5 0.5 
##$TPOFFS= (0..7)
0 0 0 0 0 0 0 0 
##$TUNHIN= 0
##$TUNHOUT= 0
##$TUNXOUT= 0
##$USERA1= <user>
##$USERA2= <user>
##$USERA3= <user>
##$USERA4= <user>
##$USERA5= <user>
##$V9= 5
##$VALIST= <valist>
##$VCLIST= <CCCCCCCCCCCCCCC>
##$VD= 0
##$VDLIST= <DDDDDDDDDDDDDDD>
##$VPLIST= <PPPPPPPPPPPPPPP>
##$VTLIST= <TTTTTTTTTTTTTTT>
##$WBST= 1024
##$WBSW= 4
##$XGAIN= (0..3)
0 0 0 0 
##$XL= 0
##$YL= 0
##$YMAX_a= 106599
##$YMIN_a= -158817
##$ZGOPTNS= <>
##$ZL1= 120
##$ZL2= 120
##$ZL3= 120
##$ZL4= 120
##$ABSF1= 10
##$ABSF2= 0
##$ABSG= 5
##$ABSL= 3
##$ALPHA= 0
##$AQORDER= 0
##$ASSFAC= 0
##$ASSFACI= 0
##$ASSFACX= 0
##$ASSWID= 0
##$AUNMP= <proc_1d>
##$AZFE= 0.1
##$AZFW= 0.1
##$BCFW= 1
##$BC_mod= 2
##$BYTORDP= 1
##$COROFFS= 0
##$CY= 83.5205535888672
##$DATMOD= 1
##$DC= 2
##$DFILT= <>
##$DTYPP= 0
##$F1P= 10.8118882576601
##$F2P= -7.23987719738617
##$FCOR= 0.5
##$FTSIZE= 0
##$FT_mod= 4
##$GAMMA= 1
##$GB= 0.15
##$INTBC= 1
##$INTSCL= 1
##$ISEN= 128
##$LB= 0.25
##$LEV0= 0
##$LPBIN= 0
##$MAXI= 10000
##$MC2= 0
##$MEAN= 0
##$ME_mod= 0
##$MI= 1.114404
##$NCOEF= 0
##$NC_proc= 0
##$NLEV= 6
##$NOISF1= 3.799351
##$NOISF2= 2.8
##$NSP= 1
##$NTH_PI= 0
##$NZP= 0
##$OFFSET= 14.38212
##$PC= 1
##$PHC0= -838.1483
##$PHC1= 20.53372
##$PH_mod= 1
##$PKNL= yes
##$PPARMOD= 0
##$PSCAL= 0
##$PSIGN= 0
##$REVERSE= no
##$SF= 200.129724274929
##$SI= 16384
##$SIGF1= 3
##$SIGF2= 2
##$SINO= 400
##$SIOLD= 16384
##$SREGLST= <1H.CDCl3>
##$SSB= 0
##$STSI= 0
##$STSR= 0
##$SW_p= 3205.1282051282
##$SYMM= 0
##$S_DEV= 0
##$TDeff= 0
##$TDoff= 0
##$TI= <>
##$TILT= no
##$TM1= 0
##$TM2= 0
##$TOPLEV= 0
##$USERP1= <user>
##$USERP2= <user>
##$USERP3= <user>
##$USERP4= <user>
##$USERP5= <user>
##$WDW= 1
##$XDIM= 8192
##$YMAX_p= 0
##$YMIN_p= 0
$$ End of Bruker specific parameters
$$ ---------------------------------
##NTUPLES= NMR FID
##VAR_NAME=  TIME,          FID/REAL,        FID/IMAG
##SYMBOL=    X,             R,               I
##VAR_TYPE=  INDEPENDENT,   DEPENDENT,       DEPENDENT
##VAR_FORM=  AFFN,          ASDF,            ASDF
##VAR_DIM=   8192,          8192,            8192
##UNITS=     SECONDS,       ARBITRARY UNITS, ARBITRARY UNITS
##FACTOR=    0.0002768,     1,               1
##FIRST=     0,             0,               0
##LAST=      2.2672688,     0,               0
##MIN=       0,             -158817,         0
##MAX=       2.2672688,     106599,          0
$$ Real data points
##PAGE= N=1
##DATA TABLE= (X++(R..R)), XYDATA
$$ [...]
1619E0q8po9O6n4J30n4n2K98k81L4R0j2j73J34J7j48K00j37p4K2j0J39L7j63J72
$$ 50 -38 -45 -114 -48 -102 28 -26 -78 220 -61 -27 63 51 -122 12 29 -119 81 -56 -130 -108 -118 21 58 -105 67
1645F7P9r3m6K11j75j17O9J05R8n4k57O7m4L7O1K0q6K0K02k49L2l7K07K2k45M3
$$ 67 146 53 7 218 43 -74 -5 100 198 144 -113 -46 -90 -53 8 28 -58 -38 164 -85 -53 -90 117 139 -106 -63
1671f3M1j61J16m3Q6j87L80m0k46J29L6J71l71L77l01J06J7l59L07j46qJj36K44
$$ -63 -22 -183 -67 -110 -24 -211 169 129 -117 12 48 219 -152 225 -76 30 47 -312 -5 -151 -159 -158 -294 -50
1695e0N3p5M2j3J59N5k18Q3j49N4jK41k32J19l48M10Oq1r1j01jO7L5j44K68n0
$$ -50 3 -72 -30 -43 116 171 -47 36 -113 -59 -60 181 -51 68 -280 130 136 55 -36 -137 -138 -71 -36 -180 88 38
1721C8L1N4J11k83q8J66l8m6j0j54J64KJ53j56km4K71r6j15N8k1j6N0l4O2k25
$$ 38 69 123 234 -49 -137 29 -9 -55 -65 -219 -55 -53 100 -56 -58 -102 169 73 -42 16 -5 -21 29 -5 57 -168
1747a68K27j98QL11M3l47K05j38j77J37Q1R4M8j00j33L1m5l5J22J33j22J06O4
$$ -168 59 -139 -131 180 223 -124 81 -57 -234 -97 -16 78 126 26 -107 -76 -121 -156 -34 99 -23 83 147
1770A47j76J22j71P5Q4J10k70J56k56R1P4qJ3rJ60m1Q7k87lm3J46J17m4j15p2
$$ 147 -29 93 -78 -3 81 191 -79 77 -179 -88 -14 -22 -9 -18 142 101 188 -99 -102 -145 1 118 74 -41 -113
1795a13J54k10R7L64k08m9j63K6L85k80O4N1ro5j83J94j54MK16l16K16J24j49
$$ -113 41 -169 -72 292 84 35 -128 -102 283 3 67 118 109 44 -139 55 -99 -95 121 -195 21 145 -4
1818dM7n4rR1r9l7M5K6K9o2K47l20J87k18N2J75k12m9L23l13J01KL39n2j43qk25
$$ -4 43 -11 -20 71 -28 -65 -20 6 35 -27 220 -100 87 -131 -79 96 -116 -165 158 -155 -54 -52 287 235 92 84 -141
1845a41M21l28K9J3J36j51k1l1N0J06l17K72J53n09L86P2j84N9J34k77K64m5k19
$$ -141 280 -48 -19 -6 130 -21 -42 -73 -23 83 -234 38 191 -318 68 140 -44 15 149 -128 136 91 -128
1868a28k5K8m2K65j31j16J65j33J39q9K6J7K3n9J31l6j16k5n5J19P9J80j47o2
$$ -128 -153 -125 -167 98 -33 -149 16 -117 22 -67 -41 -24 -1 -60 71 35 -81 -106 -161 -42 37 217 70 8
1892HJ64l69K47j56J28k3r0n5J35lJ28Lj85K51k54r9K39M2p3M5j78r4J66m5M3
$$ 8 172 -197 50 -106 22 -1 -91 -146 -11 -14 114 117 -68 183 -71 -170 69 111 38 83 -95 -189 -23 -68 -25
1917b5j03K64P2j29j26J18K8o8l7P8M1j43j58L40k63J67j00Q5J8O2k30K5J70j17
$$ -25 -128 136 208 79 -47 71 99 31 -6 72 113 -30 -188 152 -111 56 -44 41 59 121 -109 -84 86 -31
1941c1M7L6j3J41j28k02J53k05J68j41J81Mm9j3j9j12K53k1J52k96j16L06n9o5
$$ -31 16 52 39 180 52 -150 3 -202 -34 -175 6 10 -39 -52 -71 -183 70 49 201 -95 -211 95 36 -29
1965b9P7n9j6J97k10k24M06p6J29r0j11J44r7P0O9j84K5j23R4N7L6J4k03N0p3
$$ -29 48 -11 -27 170 -40 -264 142 66 195 105 -6 138 41 111 180 -4 21 -102 -8 49 85 99 -104 -54 -127
1990a27L28k00k47K95k32n3J52O2J64k37J48J8p6K20k49J62j09j64K26n0l0R7
$$ -127 201 1 -246 49 -183 -236 -84 -22 142 -95 53 71 -5 215 -34 128 19 -145 81 31 1 98
2012I8K33n88K17J30k36J53Q4q8K1J09k68K54p6J2L8p2L0m9M7M0j83J2K09J4j46
$$ 98 331 -257 -40 90 -146 7 91 3 24 133 -135 119 43 55 93 21 51 2 49 89 -94 -82 127 141 -5
2037eL9j52J53o7K17j90J85k63K0KO8N6k28N7J76j08R6K25j16k95K41P1k64Np4
$$ -5 34 -118 35 -32 185 -5 180 -83 -63 -61 7 63 -165 -108 68 -40 56 281 165 -130 111 182 -82 -77 -151
2062a51K38j18K75m22K56p3o2l2l6K82R9l80J17O7M0k6q3J17k06L53m83K93J41
$$ -151 87 -31 244 -178 78 5 -57 -89 -125 157 256 -124 -7 60 100 74 -9 108 -98 255 -228 65 206
2085B06k37K04k21Q1j10K3J7m0J10m6K6k16K77k30J13j14L06k31J49M4l24R3L43
$$ 206 -31 173 -48 33 -77 -54 -37 -77 33 -13 13 -203 74 -156 -43 -157 149 -82 67 111 -213 -120 223
2108B23k6k44l0J78k84J48k9M8J42j14k4M5Pj19k1L82m37Q7J46k9l7j23n6J52
$$ 223 197 -47 -77 101 -183 -35 -64 -16 126 12 -12 33 40 -79 -100 282 -155 -68 78 49 12 -111 -167 -15
2132a5j49K30J82k98n3j11P4M4o9K05J33J8k53q7R3l6MN8j27j1J99R0l61J74L6
$$ -15 -164 66 248 -50 -103 -214 -140 -96 -165 40 173 191 -62 -149 -56 -92 -88 -30 -157 -168 31 121 -240 -66 -30
2157c0J69q8j5j91J29o7r8K58k00N1m9k8J68J28j59k2K8l4k25M12l4k32K9p1K19
$$ -30 139 51 36 -155 -26 -93 -191 67 -133 -82 -131 -159 9 137 -22 -44 -16 -50 -275 137 103 -129 -100 -171 48
2182D8k66M4NL66k26j78K83k94J15J26J5m6o6p2K3R7j86M57l65J29m4M6L1J38
$$ 48 -218 -174 -169 197 -29 -207 76 -218 -103 23 38 -8 -74 -146 -123 -26 -212 245 -120 9 -35 11 42 180
2206A80k66J86r2JJ36n1k0jL5o4L2J7p3j9l0M0rJ30j82Q6n4J26m3O3k36N1J27
$$ 180 -86 100 8 9 145 94 74 73 108 44 76 93 20 1 -29 11 2 132 -50 36 -18 108 65 128 -108 -57 70
2233G0k48M29k61K08k23J27k24J47K2MLj44R6n5K4K7Q6j2o3o0k3K20j19K1j08
$$ 70 -178 251 -10 198 -25 102 -122 25 47 51 54 -90 6 -49 -25 2 88 76 13 -47 -70 150 31 52 -56
2258e6J84J57k54k02K76j57n3Q3n4N8K25r7n3q9k8j9J49n3j92J72k3J49k49N4
$$ -56 128 285 31 -171 105 -52 -105 -22 -76 -18 207 110 57 -32 -60 -79 70 17 -175 -3 -26 123 -126 -72
2282g2M6j5Q3j26K62j57l4p5M6J30k46J90J57k36J85j56L0j46O2K16j55j8j44
$$ -72 -26 -41 42 -84 178 21 -13 -88 -42 88 -158 32 189 -47 138 -18 12 -134 -72 144 -11 -29 -173
2305a73J57j11kK06J2Q3j20j3Ll1j50K94k99K37q4l3J38J55j99q9r7K4J94k90
$$ -173 -16 -127 -129 77 89 172 52 39 42 11 -139 155 -144 93 9 -24 114 269 70 -19 -116 -92 102 -188
2329a88K59m2J65j56k09J50N3j42L01k60P1N3L8j86M27k71j26N4j03J56o0O9j45
$$ -188 71 29 194 38 -171 -21 32 -110 191 -69 2 55 93 -93 334 63 -63 -9 -112 44 -16 53 -92
2352i2N9j37J2K11M0j88Q8j73j8J52m4J72j26rJ97Mj60n4L3P4L5m7r7j35J16L0
$$ -92 -33 -170 -158 53 93 -95 -7 -180 -198 -46 -90 82 -44 -53 144 148 -12 -66 -33 41 76 29 -68 -203 -87 -57
2378e7R0o6N3k05m6M16l42L3J29J00o7j35K81j14j02L4o5P7J12j18m4J23r4k53
$$ -57 33 -33 20 -185 -231 185 -157 -124 5 105 38 -97 184 70 -32 2 -63 14 126 8 -36 87 -7 -260
2402b60L12o2L2R7k91J80j57K11r1m8K92k34n7J43j52J0O7j01J15j07N0o4J33
$$ -260 52 -10 22 119 -172 8 -149 62 -29 -77 215 -19 -76 67 -85 -75 -8 -109 6 -101 -51 -115 18
2425A8J79j40j4k06J96r3Q5k6j81J85K42j74K03l43l2J49L7k39J30n1k9K82l80
$$ 18 197 57 43 -163 33 -60 25 -1 -182 3 245 71 274 -69 -101 48 85 -154 -24 -75 -104 178 -202
2448b02J84j68R7rJ50j8j36K96k03K08k05Ol3R4L9J40k06L4j9o3l6J51N4Q8j86
$$ -202 -18 -186 -89 -98 52 34 -102 194 -9 199 -6 0 -33 61 100 240 34 68 49 -14 -50 101 155 243 57
2473E7j33J97j77K00j52J85r4j2N4k06o6mJ16l1N5j14O4PJ86l05kJ51k30K17K27
$$ 57 -76 121 -56 144 -8 177 83 71 125 -81 -147 -151 -35 -66 -11 -125 -61 -54 132 -173 -175 -24 -254 -37 190
2498A90j32O6r3J0J79l47q4o7L23j03K70l29J95J1M1j52j74L68k85j2R1k7K31
$$ 190 58 124 31 41 220 -127 -211 -278 45 -58 212 -117 78 89 130 -22 -196 172 -113 -125 -34 -61 170
2521A70M3j74j53K65j37j62J41j18K3P7o0J18Q9j84j65J03J87k92M08j86K00l35
$$ 170 213 39 -114 151 14 -148 -7 -125 -102 -25 -85 33 122 -62 -227 -124 63 -229 179 -7 193 -142
2543a42K77p6m8QM2P2l22k3L47j38j3m0K5R7k4J53K1r8q3m1k49K91q9J27k2j35
$$ -142 135 59 11 19 61 133 -189 -212 135 -3 -16 -56 -31 66 42 195 216 118 35 -6 -255 36 -53 74 52 -83
2569h3J01j48K44p5l13L52j28k8J13p4J69m01M06m00K81J6k44K18l8K6J37j87
$$ -83 18 -130 114 39 -274 78 -50 -78 35 -39 130 -271 135 -265 16 32 -212 6 -32 -6 131 -56
2591e6j46K43L8p3J81q3j09m9K18k06m7O7o2k4M9J48j61l7J45j24J46k86L59j26
$$ -56 -202 41 79 6 187 104 -5 -54 164 -42 -89 -22 -84 -108 -59 89 -72 -109 36 -88 58 -228 131 5
2615ElN9K3j55Mn9J65J16k47J84j44R3N2r3k7m7L02k24J40n1o4J45k71J04l4J01
$$ 5 2 61 84 -71 -67 -126 39 155 -92 92 -52 41 93 0 -27 -74 228 4 144 93 29 174 -97 7 -27 74
2641G4K2j65J16M4k88K48J2j63K48k70L4m2J46N9Q8k96n8J03P9l6J1j41J85n0
$$ 74 96 -69 47 91 -197 51 63 -100 148 -122 -88 -130 16 75 163 -133 -191 -88 -9 -45 -34 -175 10 -40
2665d0N0J95j71j51K34j20mk5k0L64j43M8k69J04j22oJ70j70P7K0l6L8J43n9j16
$$ -40 10 205 34 -117 117 -3 -7 -32 -52 312 169 217 -52 52 -70 -76 94 -76 1 21 -15 23 166 107 -9
2690iM6jj16m3N2k77K05J08J32o0mrL6K90m23K31o6j26j37J46j4M6Q4q6J86k36
$$ -9 37 36 -80 -123 -71 -348 -143 -35 97 37 33 24 60 350 -73 158 92 -34 -171 -25 -39 7 91 5 191 -45
2716d5K01l3l4j50k4J13N4MQ0J25m15J07N4k7j28P0J26r7j4L9R7j93L3j11J72
$$ -45 156 123 89 -61 -85 28 82 86 166 291 -124 -17 37 10 -118 -48 78 -19 -33 6 103 -90 -57 -168 4
2741DlO3j72j40K32Rp2q8OJ76J0k36L01J25k54J39q3m5J13p5J74p0J1jm0J12k89
$$ 4 1 64 -108 -248 -16 -7 -79 -167 -161 15 25 -211 90 215 -39 100 17 -28 85 10 184 114 125 124 84 196 -93
2768i3J10QJ65l06m1L17k58Q4Q6Q4k40m3j78K65L1q9Rl7J2OJ76j40l4J48k4o6
$$ -93 17 25 190 -116 -157 160 -98 -14 72 156 -84 -127 -305 -40 -9 -98 -89 -126 -114 -108 68 -72 -106 42 18 -48
2794d8K14j03o2J21m0L6qK0k20J0L00o6k41J34p3n0J61n3j60K25j2l6Q4r2r0J50
$$ -48 166 63 1 122 82 118 110 130 -90 -80 220 154 -87 47 -26 -76 85 32 -128 97 85 49 133 41 -49 101
2820A01k81J79O3r6J2r0K5J54j5j47J34j20k2J1M4K26Jj00JQ6k01l2l8K03q5j96
$$ 101 -180 -1 62 -34 -22 -112 -87 67 52 -95 39 -81 -103 -92 -48 178 179 79 80 166 -35 -67 -105 98 13 -183
2846a83J09m9k1K06k27N8J18p9J57n6k44L79n7l85J04L37j59R7j84k4o6L05l09
$$ -183 -74 -123 -144 62 -165 -107 11 -68 89 33 -211 168 111 -274 -170 167 8 105 -79 -103 -169 136 -173
2869a73rK38j04K0j52L58q9k17J18j15K57j82K7J00j16K3J2n6J57L8j66K5j33
$$ -173 -182 56 -48 -28 -180 178 89 -128 -10 -125 132 -50 -23 77 -39 -16 -4 -60 97 135 -31 -6 -139
2892a39J39k13J49o9J48j09L60r7k15N9J0j45K29j04o0J75j94k5p6L4o3N2P0J59
$$ -139 0 -213 -64 -133 15 -94 266 169 -46 13 23 -122 107 3 -57 118 -76 -101 -177 -143 -206 -154 -84 75
2916G5j09j46J17J34j34J74k0j18K22j29o7N9P2k48K61j29J24j42k8m2K2K55j15
$$ 75 -34 -180 -63 71 -63 111 91 -27 195 66 -1 58 130 -118 143 14 138 -4 -32 -74 -52 203 88
2939H8M4k05J4K5J08M0j08J51k63K03r2k1K3j4jn7J41J2M0q7j08j2J45K5J81k85
$$ 88 132 -73 -59 -34 74 114 6 157 -106 97 5 -16 7 -7 -8 -65 76 88 128 41 -67 -79 66 91 272 -13
2965a3L4O1l06J77j36M48j76q0j2j3j34j13K43J53k4k63K24q6J14r1P8l73K48
$$ -13 21 82 -224 -47 -183 265 89 9 -3 -16 -150 -263 -20 133 109 -154 70 -16 98 7 85 -288 -40
2988d0R7j23l8J76l7N7j22o4J4k9l2J69Lj24K63j64K60k59K7L0j00J61p6q1N8
$$ -40 57 -66 -104 72 35 92 -30 -94 -80 -109 -141 28 31 -93 170 6 266 7 34 64 -36 125 49 -32 26
3013B6r2R4Lj75mJ68k47K02q2K82q4Ol63R9K47r0o3R9j15j19L44k84K21k0L3j42
$$ 26 -66 28 31 -144 -148 20 -227 -25 -107 175 91 97 -266 -167 80 -10 -73 26 -89 -208 136 -148 73 53 86 -56
3039e6J15o9J07k4O6j04L9r5l9R4j4q1k3J64jj29K0k49K74J60j73m1M5K1J3J59
$$ -56 59 -10 97 73 139 35 74 -21 -60 34 20 -61 -84 80 79 -50 -30 -279 -5 155 -18 -59 -14 7 20 179
3065A79m40L02o6Q7o2K2j01L29j61l1P7j46j38J61N1q5k08K78m9J45j54J11j61
$$ 179 -261 41 -25 62 0 22 -79 250 89 58 135 -11 -149 12 63 -22 -230 48 -1 144 -10 101 -60
3088f0J73o3j6J37k21K56j57j32K7J91nj22p3o2J35Q0l12J78K07j85J71p5k1j75
$$ -60 113 50 34 171 -50 206 49 -83 -56 135 130 8 -65 -127 8 88 -224 -46 161 -24 147 72 51 -124
3112a24N7j03N31n26J1L07r2q4L5p8K31l03l8J42K05k52J59j81p8j05L20k91J97
$$ -124 -67 -170 361 -165 -154 153 61 -23 12 -66 165 -138 -176 -34 171 -81 78 -103 -181 -286 34 -257 -60
3135f0j74J51n5J75o3J24p7M4k6r2K21k27m0J02J65k81K53k83J92J45j32j36l3
$$ -60 -234 -83 -138 37 -26 98 21 65 39 -53 168 -59 -99 3 168 -113 140 -143 49 194 62 -74 -107
3158a07Q6K0O2n9l0J43mJ30k48r8j7K35j62K5J5L02k09q2j8o4P2J88j64k53R3
$$ -107 -21 -1 61 2 -28 115 111 241 -7 -105 -122 113 -49 -24 -9 293 84 2 -16 -80 -8 180 16 -237 -144
3183a44J27J10k25J75o9N1l0K19j79k8K9K2O6j26J82n9j56J29j24j38J72n3j70
$$ -144 -17 93 -132 43 -26 25 -5 214 35 7 36 58 124 -2 180 121 -35 94 -30 -168 4 -49 -219
3206b19K07k58K57N8K16j25j68j51L93k35n7R8K7QO8o6m9J53k5k26J86k8L0m6
$$ -219 -12 -270 -13 45 261 136 -32 -183 210 -25 -82 16 43 51 119 53 4 157 132 -94 92 64 94 48
3230D8q4l8J2K9J93j17J07j95J4J00r2K68o0k04q2q7Q2N9j36J03R9Q7j08P7N8
$$ 48 -36 -74 -62 -33 160 43 150 -45 -31 69 -23 245 185 -19 -101 -188 -106 -47 -183 -80 19 106 -2 75 133
3255A33k73J16J12K9k09J72pl7J05j86K51r1j19j03J21K00r5k64L08J43m02J68
$$ 133 -140 -24 88 117 -92 80 73 36 141 -45 206 115 -4 -107 14 214 119 -145 163 306 -96 72
3277G2m7K72k19k91K02p7M8L95k53m2P2l13J25J42p7J73k8n1k30p4J25K85k55
$$ 72 25 297 78 -213 -11 -88 -40 355 102 60 132 -181 -56 86 9 182 154 103 -127 -201 -76 209 -46
3300d6L9K01k23RQ0l61L70r7L6J91l97K22q1O8k60L65k73J30j2Q6R5J0j84J68
$$ -46 -7 194 -29 -20 60 -301 69 -28 8 199 -198 24 -57 11 -249 116 -157 -27 -39 47 142 152 -32 136
3324A36n5r4l9p5r0K17J70o5qr5l0K09j97k0j14K29l19k9K64Mk5M8q0q0L45j80
$$ 136 81 -13 -52 -127 -217 0 170 105 97 2 -28 181 -16 -36 -150 79 -240 -269 -5 -1 -26 22 -58 -138 207 27
3350B7j89R1J40j51J11j84J42J59o4lJ26n7l60J37R4j6n6qJ54o0n5K5L36k40k80
$$ 27 -162 -71 69 -82 29 -155 -13 146 82 79 205 148 -212 -75 19 3 -53 -61 93 33 -22 3 339 99 -181
3375a81K25p4K25j13l17K58j0J42j99LP9j52J31K68k09n3P7j23r8O0j13R1K05
$$ -181 44 -30 195 82 -235 23 13 155 -44 -41 38 -114 17 285 76 23 100 -23 -121 -61 -174 -83 122
3398A22J68l37j5J08jNk95M40j64o3j60K17k8nj23K6J92j07j22L6R9j48J9L7J4
$$ 122 290 -47 -62 46 45 50 -245 195 31 -32 -192 25 -3 -8 -131 -105 87 -20 -142 -106 -7 -155 -136 -99 -85
3423h5P9q5J81p2l9j8m0RJ1J45j52o8M9j8K07k07OK06N3k45J85p1K3l0oj84J18
$$ -85 -6 -91 90 18 -21 -39 -79 -70 -59 86 -66 -134 -85 -103 104 -103 -97 109 162 -83 102 31 54 24 18 -166 -48
3450d8k3J34n3k32L75q7J8j62j40J26K04k30N5J40j07J47j14j43MP9k8J1r6J63
$$ -48 -71 63 10 -222 153 66 84 -78 -218 -92 112 -118 -63 77 -30 117 3 -140 -136 -57 -85 -74 -170 -7
3474gO1q2N1L8l11K09K14l27K14N4l27K88j14J2J41k04K16k29r9K42o6L9J13j6
$$ -7 54 -28 23 61 -250 -41 173 -154 60 114 -213 75 -39 -27 114 -90 126 -103 -202 40 -26 13 126 110
3498A10j37M4q2j55N7k5M26k29J39p6m1j22J88K5j90L50k62j6J77p3q8n3j07J47
$$ 110 -27 17 -65 -220 -163 -188 238 9 148 72 31 -91 97 122 -68 282 20 4 181 108 20 -33 -140 7
3522GM5j03K50k35k5J01j27M3j62P5J73l2R8j66j13J29k19J96L3O1k47J25J77
$$ 7 52 -51 199 -36 -61 40 -87 -44 -206 -131 42 10 108 -58 -171 -42 -261 -65 -32 29 -218 -93 84
3545H4q4R7j48o9J52N8j06j11J35r5J1J6J05O7J40j79k1J8J03j66K8M4j56QJ64
$$ 84 0 97 -51 -120 32 90 -16 -127 8 -87 -76 -60 45 112 252 73 52 70 173 7 35 79 -77 -69 95
3570I5k08o8J36K2K17j46k00J69Q7L4k45J81N6j99m4n2J84j01J47oJ27j74J36
$$ 95 -113 -181 -45 -23 194 48 -152 17 104 138 -107 74 130 -69 -113 -165 19 -82 65 59 186 12 148
3593A48j15M8k90J15J16j14J32j09j47M11O1o0j13pq9K3J62k11J64j35K5j25K51
$$ 148 33 81 -209 -94 22 -92 40 -69 -216 195 256 196 83 76 -13 10 172 -39 125 -10 15 -110 141
3616A41j59J57k32J76k95K80j04K4k2j6m8J40P9p2j24oK29p3j46Q2o7P8J14k3
$$ 141 -18 139 -93 83 -212 68 -36 -12 -34 -50 -98 42 121 49 -75 -81 148 75 -71 11 -56 22 136 113
3640A13j25K0k05K32J82k72J49k46J94k03N29m81R5Rl7K79l42L7M2j43j20J12
$$ 113 -12 8 -197 35 217 -55 94 -152 42 -161 368 -113 -18 -9 -46 233 -109 -72 -30 -173 -293 -181
3662a81K36p7Q5J12r7j72k3N5J17p7J45j14j47O5J13k22K67l30K99or5R7q8J78
$$ -181 55 -22 63 175 78 -94 -117 -62 55 -22 123 9 -138 -73 40 -182 85 -245 54 48 -47 50 -38 140
3686A40%n5qk50O04k53k59O6q4p7R4J11j10j8P0N6J6J29k19m9K31N3k58R9jJ81
$$ 140 140 85 77 -173 431 178 -81 -15 -99 -176 -82 29 -81 -99 -29 27 43 172 -47 -96 135 188 -70 29 28 209
3712B09k15K4r3J78j95J61k24J15J2K16l12N3M1J60k13J21k7M7k2j93L05j15N1
$$ 209 -6 18 -75 103 -92 69 -155 -40 -28 188 -124 -71 -30 130 -83 38 11 58 36 -157 148 33 84
3735H4j23J10J82l06m5k4J88q7M6j91m4K35J63l18J8J86o0j15k0P6NJ19m2n8j9
$$ 84 -39 71 253 -53 -98 -122 66 -21 25 -166 -210 25 188 -130 -112 74 14 -101 -121 -45 -40 79 37 -21 -40
3760d0n3J34k50K3J12L1R1j38J06J2j14Q7J85r8j02K5O9j61J6K64k12N2j04QK23
$$ -40 -93 41 -209 -186 -74 -43 48 -90 16 28 -86 1 186 88 -14 11 80 -81 -65 199 -13 39 -65 -57 166
3785A66k13P0l6N9j62n3J82O2N4l88J20J9J23n1K36k93K42k56J0M8O1J69k99K29
$$ 166 -47 23 -13 46 -116 -169 13 75 129 -259 -139 -120 3 -48 188 -105 137 -119 -109 -61 0 169 -130 99
3809I9l62J76Q0kk3Q8k1MO3M8j69O7P4j92P5J21p4K21m49P8j0J40J17j96O4j36
$$ 99 -263 -87 -7 -9 -32 56 35 39 102 150 -19 48 122 -70 5 126 52 273 -176 -98 -108 32 149 -47 17 -119
3835a19J84J74r8J6l83L19n2O5j10m4J37j26J7l5J36j27K4P4p1o6J35J24j22J8
$$ -119 65 239 141 157 -226 93 41 106 -4 -48 89 -37 -20 -55 81 -46 -22 52 -19 -85 50 174 52 70
3859G0j10J7o2J80j53N8J37j21r6m1R0j87K77j71j2J13k2K50j52j85J07J48j77
$$ 70 -40 -23 -85 95 -58 0 137 16 -80 -121 -31 -218 59 -112 -124 -11 -33 217 65 -120 -13 135 -42
3882d2J99k59M5K08R1j36l1j85n2J62J63j14l0j31L8r0K51L1J11k33k2J33M6j61
$$ -42 157 -102 -57 151 242 106 75 -110 -162 0 163 49 19 -112 -74 -164 87 118 229 -4 -26 107 153 -8
3906hp7N7MQ6j32J60k2j08Q3L6n9J21J68l61K3O6k02K33j96K26Pl10K73j6j61
$$ -8 -85 -28 -24 62 -70 90 68 -40 43 79 20 141 309 -52 -29 37 -165 68 -128 98 105 -205 68 52 -109
3931a09J10Ln6j34M57k08J4k16K62O5k05P9k41R7j32K89M6j60J08M1J00k74M7
$$ -109 1 4 -52 -186 271 63 77 -139 123 188 -17 62 -179 -82 -214 75 121 -39 69 110 210 -64 -17
3954a7N9j28N5n2J22R7l8l9L7j34m3N5P0P3L1j55j97M9J03J26N7j35n5O5j83J57
$$ -17 42 -86 -31 -83 39 136 98 59 96 -38 -81 -26 44 117 148 -7 -204 -155 -52 74 131 -4 -59 6 -177 -20
3980b0j68K44%J15k05L5O1j42J24JM0J57k21N7m1o2J13l1p0Q8j48j41M21k44J71
$$ -20 -188 56 56 171 -34 1 62 -80 44 45 85 242 21 78 37 -25 88 57 -13 75 -73 -214 207 -37 134
4005A34k70l1K14L74m72r9L02P0j76j02J72k70L00j6k39J5J7LJ17J54j40p0j09
$$ 134 -136 -167 47 421 -51 -150 152 222 46 -56 116 -154 146 130 -109 -94 -77 -74 43 197 57 -13 -122
4028a22K45K3K7k98J17J01j33l5%J47k01L32j99j10j38L10L5j30N1l1q2K4j47
$$ -122 123 146 173 -125 -8 93 -40 -75 -75 72 -129 203 4 -106 -244 66 101 -29 22 -9 -91 -67 -214
4051b14L39k22J27l2J17j4m7j81K12J65j83j01j2Mj0p7K4J98m1J12j96K08j99
$$ -214 125 -97 30 -2 115 101 54 -127 85 250 67 -34 -46 -42 -52 -129 -105 93 52 164 -32 176 -23
4074b3J51j95K7K12k1k1Jn6o0q3R2J08j71J67m3j29q4J56k11m3K53j79J63J8m2
$$ -23 128 -67 -40 172 151 130 131 75 15 -68 24 132 -39 128 85 -44 -128 28 -183 -226 27 -152 11 29 -13
4099a3j50J04K4O2l7%lN0j05j5j6K60l68J93M1N7J32j95K1J5p6N4J70o20M80p8
$$ -13 -163 -59 -35 27 -10 -10 -13 37 -68 -83 -99 161 -207 -14 27 84 216 21 42 57 -19 35 205 -415 65 -13
4125a3j36L28j91j7L5k33k40M98r7j34L06o7qO8k68j24L24m1K25q0k16p5R2J18
$$ -13 -149 179 -12 -29 6 -227 -467 31 -66 -200 106 39 31 99 -169 -293 31 -10 215 135 -81 -156 -64 54
4149E4j62M9o5o2J87j60L6R5J0J77n9j3K1j72Nj7J47k0k0j05J3J12k1j88M2j2
$$ 54 -108 -59 -124 -186 1 -159 -123 -28 -18 159 100 87 108 -64 -59 -76 71 51 31 -74 -61 51 30 -158 -116 -128
4175a28L13j35j83n7J70j53L35k02q1J75j54R2j27J90R0j63j6p2J34P9k16N3R7
$$ -128 185 50 -133 -190 -20 -173 162 -40 -121 54 -100 -8 -135 55 145 -18 -34 -106 28 107 -109 -56 41
4198D1j3j27M8P7j00MJ34M8j79J53LN4l8j58j09L36l70J60Nj19J75o8R7j43n8
$$ 41 28 -99 -51 26 -74 -70 64 112 -67 86 89 143 105 -53 -162 174 -196 -36 -31 -150 25 -43 54 -89 -147
4223a47J18pr2k2K93k12M1j14QK9p6%j6K35l3J2j44L89l77J72kq8J53j55K38j58
$$ -147 -29 -36 -128 -150 143 -69 -28 -142 -134 -105 -181 -181 -197 38 5 17 -127 262 -115 57 55 -33 120 -35 203 45
4249D5j22K89r0o5N1O7j50n6J65k31J24Q1ll49J27J46j42O1M7J87j99J18p3L1
$$ 45 -77 212 122 57 108 175 25 -31 134 -97 27 108 105 -244 -117 29 -113 -52 -5 182 -17 101 28 59
4273E9k16L34k84P0J73j53J51K9j54p3J9J42j94J0J49L8j01j6L6p3K6R8N5k99
$$ 59 -157 177 -107 -37 136 -17 134 163 9 -64 -45 97 -97 -87 62 100 -1 -17 19 -54 -28 70 125 -174
4297a74L75j37n6j11pJ13K7j10P3P8k28O3L0L0K50o1k45J74K3L4k08J15R3l32
$$ -174 201 64 8 -103 -110 3 30 -80 -7 71 -157 -94 -64 -34 216 155 -90 84 107 141 -67 48 141 -191
4321a91j18K45N4K76k39K9j30KJ77o8p1J61Oj18J5K05q1k64L28k46P3k83N50k02
$$ -191 -309 -64 -10 266 27 56 -74 -72 105 37 -34 127 133 15 30 235 154 -110 218 -28 45 -238 312 110
4345A10k45J51R2j63n6J64J80r5j58p5j94J33rJ81K04l58L0K54j81j53J65J10
$$ 110 -135 16 108 -55 -111 53 233 138 -20 -95 -289 -156 -165 16 220 -138 -108 146 -35 -188 -23 87
4367H7j82L5j47M57q5r0K9j9K12l50K22k64J44j33k8K69j01M7j44J2K6j03K00
$$ 87 -95 -60 -207 250 165 75 104 85 297 -53 169 -95 49 -84 -112 157 56 103 -41 -29 -3 -106 94
4390I4K7k91P7J46m0J32r1o9J19j45o1p7M9L7j2K75j42m5n5J01N0l6L1p4J59l38
$$ 94 121 -170 -93 53 13 145 54 -15 104 -41 -102 -179 -130 -93 -105 170 28 -17 -72 29 79 43 74 0 159 -179
4416a79J80n9Q9p1P0q2L3N7Q0j20j97K04k26L22j86N9K4L5p5j85K21P6l68M56
$$ -179 1 -58 31 -40 30 -52 -19 38 118 -2 -199 5 -221 101 -85 -26 -2 33 -42 -227 -6 70 -298 158
4440A58j46R4j04J29j07J64o2l54J99K1k51K17N0n6p8K19j33K04j95N8J66j17
$$ 158 12 106 2 131 24 188 126 -228 -29 -8 -259 -42 8 -48 -126 93 -40 164 -31 27 193 76
4462G6J57k22mj69K03n2P2k03K54k62K57r6Q3q0r7J93k99O8K45j25j25J27Q7p5
$$ 76 233 11 7 -162 41 -11 61 -142 112 -150 107 11 94 14 -83 110 -189 -121 124 -1 -126 1 88 13
4486A3R8j30j0M4Q2R5k14J41j80L3M5k2Q4j26j20J96O2l18M11m34K97K6j06J75
$$ 13 111 -19 -29 15 97 192 -22 119 -61 -28 17 -5 79 -47 -167 29 91 -227 184 -250 47 73 -33 142
4510A42l56K68j00J71j96M5lj43J8J86P3j28k2PK3m3k2j1K1K01k7j43R4l5O5o1
$$ 142 -214 54 -46 125 -71 -26 -29 -172 -154 32 105 -23 -45 -38 -15 -58 -80 -91 -70 131 104 -39 55 20 85 24
4536B4k10J97j67M4k8jK19n8j59K49m7j9J95k03M6j69K55j87k7Q5j12Q8J7PM6
$$ 24 -186 11 -156 -112 -140 -141 78 20 -139 110 63 44 239 36 82 -87 168 -19 -46 39 -73 15 32 39 85
4561H5Mk9O8P1l80K00J7m1Q9j95J82p4p6j73L66rn0q3j39J21K11m4j37j20L13
$$ 85 89 60 128 199 -181 19 36 -5 84 -111 71 -3 -79 -252 114 105 55 -28 -167 -46 165 121 -16 -136 177
4586A77j71K28j82L6q7j56J91j41K26n6J18j48q9L58k87o8j2P7k5k96N02j51J62
$$ 177 6 234 52 88 1 -155 36 -105 121 65 183 35 -54 304 17 -51 -63 14 -11 -307 195 44 206
4609B06k12J5P8j77N5J81j28j54K11R5j48l9J47l06K5L55j30n0J33j6k9j6j83
$$ 206 -6 9 87 -90 -35 146 18 -136 75 170 22 -17 130 -176 -151 204 74 24 157 141 112 96 -87
4632h7Q1K91m57K07j14j38K10j02l1J63l3j0J4o3KP5m0j24P4Q0J77j58Q4k0k92
$$ -87 -6 285 -172 35 -79 -217 -7 -109 -140 23 -10 -20 -6 -69 -67 8 -32 -156 -82 -2 175 17 101 81 -211
4657b11K18j9Rj10j09J53m7m7L94j03K46m13O6J15m2J62j73k5Q8k03J46m0k69
$$ -211 7 -12 -3 -113 -222 -69 -116 -163 231 128 374 -39 27 142 100 262 89 64 152 -51 95 55 -214
4680b14J24j85J04K08n2J2K2L6J9k4r4J0j1j30L75j82L1J02j13K6n9M5j05j0Q2
$$ -214 -90 -275 -171 37 -15 -3 19 55 74 50 -44 -34 -45 -175 200 18 49 151 38 64 5 50 -55 -65 17
4705A7j34o8R1M7K27j98j40J1J57p9K00J22j33M6j04j0o2o9O2J12j69q9L5j2K2
$$ 17 -117 -185 -94 -47 180 -18 -158 -147 10 -69 131 253 120 166 62 52 -10 -79 -17 95 -74 -163 -128 -140 -118
4730a18K41q2NJ23K2k57j76L28k43J08p1M4J79r9r4q8J60%J63j7j96L19k49K12
$$ -118 123 41 46 169 191 -66 -242 86 -157 -49 -120 -76 103 4 -90 -178 -18 -18 145 128 -68 251 2 214
4754B14j38j40l0J17K6N4j74K20q6N5J01j50k35J79m2N9m2J87k61%J88N3k40J42
$$ 214 76 -64 -94 23 49 103 -71 149 63 118 219 69 -166 13 -29 30 -12 175 -86 -86 102 155 -85 57
4778E7n0J03j36J41j67J04k09q5K32Pj32k2J36K26j52K8j04j9J59k12J42k35J48
$$ 57 7 110 -26 115 -52 52 -157 -242 -10 -3 -135 -157 -21 205 53 81 -23 -42 117 -95 47 -188 -40
4801d0N6j55R4J91o7k08K15L7j65J22l5J1k22K84q5O5O6j63j05L65k60j9o6o3
$$ -40 16 -139 -45 146 79 -129 86 123 -42 80 45 56 -166 118 33 98 164 1 -104 261 1 -18 -84 -147
4825a47K55l6K06j36j31Q9j59J45j78L22m12J67O9J2j51K7K30k42M7J02l3J97
$$ -147 108 72 278 142 11 100 -59 86 -92 230 -182 -15 54 66 -85 -58 172 -70 -23 79 46 243
4847B43l81K88l5j23j74J56J37l07L34k5j57P1J9n8L5j96J66j55K29j43j26K04
$$ 243 -138 150 115 -8 -182 -26 111 -196 138 113 -44 27 46 -12 23 -173 -7 -162 67 -76 -202 2
4869BMJ82k60M0J05J8k09K32k63K99j04j32K91k7j75O8J1L1l6OL0j18M7M5q6j7
$$ 2 6 188 -72 -32 73 91 -118 114 -149 150 46 -86 205 178 3 71 82 113 77 83 113 -5 42 87 1 -16
4895a6j8P6P3j07J7o3J59j10o7J06M5j22j71K02R0k16r9K94l22J33J35j14J91
$$ -16 -34 42 115 8 25 -38 121 11 -56 50 95 -27 -198 4 94 -122 -221 73 -249 -116 19 -95 96
4918I6k2j95K5K62k02mJ46k36O4O4q8K80k43J8ok03M32q1Pj10P3k3p7J16j58J08
$$ 96 74 -121 -96 166 -36 -40 106 -130 -66 -2 -90 190 -53 -35 -41 -244 188 107 114 4 77 54 -23 93 -65 43
4944D3j69J99K4k06J6K49j60L5L4q7L2N9k82J60O6J4j04P7m0q6J45m0J31p5j40
$$ 43 -126 73 97 -109 -93 156 -4 31 65 -22 10 69 -213 -53 13 27 -77 0 -40 -126 19 -21 110 35 -105
4969a05j4N0J50L0j03M3M0n2K9p5q1J72k61P7J25J00j20L04k40j59m0K19j07K1
$$ -105 -119 -69 81 111 8 51 91 39 68 -7 -88 84 -177 -100 25 125 5 309 69 -90 -130 89 -18 3
4993CnJ3o1L7p7K31j80o4J53o7J18k01J52J25j88K6K45j88q2L9J59k77K8J21j17
$$ 3 -2 11 -50 -13 -90 141 -39 -103 50 -17 101 -100 52 177 -11 15 260 72 -10 29 188 -89 -61 60 -57
5018e7R1O9PK7j49O6J19j42P6k02j9J76j87N1j9Q8j29J91j01m8m3K45Q8j16n1
$$ -57 34 103 110 137 -12 54 173 31 107 -95 -114 62 -125 -74 -93 -5 -134 57 -44 -92 -135 110 198 82 31
5043C1J79l59M5M0J55L9n2k86K34J51l22M5J09m2K34l69K10LJ15j6j24j6L20k39
$$ 31 210 -149 -104 -64 91 130 78 -208 26 177 -145 -100 9 -33 201 -168 42 45 160 144 20 4 324 85
5067H5k62L52m87J83K15q9oJ32k12j40K93L9j77J71j74J47j54J54j51R4l8L8q5
$$ 85 -177 175 -312 -129 86 -3 -9 123 -89 -229 64 103 -74 97 -77 70 -84 70 -81 13 -25 13 -72
5090g2J02k41L43j27j0n0J41m4J26j53J20p0j16J62j66J27p1j28J53q9l7J5M6
$$ -72 30 -211 132 5 -5 -55 86 42 168 15 135 65 -51 111 -55 72 1 -127 26 -63 -100 -85 -39
5113c9j37J95J83k65M1OP5J9q2L0j99N8L75k52j33J62j88l5j7K44k7RK7j09O6
$$ -39 -176 19 202 -63 -22 -16 59 78 -4 26 -173 -115 260 8 -125 37 -151 -186 -203 41 14 23 50 -59 7
5138Gj98J84P6K6j24o3J89m6j2o9J67j14j77L3o3P0M9O3NL2j02P0L4k4k36K78
$$ 7 -191 -7 69 95 -29 -92 97 51 39 -30 137 23 -154 -121 -184 -114 -65 -2 3 35 -67 3 37 13 -223 55
5164E5j28j13L41Qj82M0K31k12j14J73k31m1M33m70L37l49L78j39K4K72j78j23
$$ 55 -73 -186 155 163 -19 21 252 40 -74 99 -132 -173 260 -210 127 -222 156 17 41 313 135 12
5186A2j97J05J62q5J31j64k5p9K17n7m7K29j25pj47J89j65J94R1k66r1J69k49
$$ 12 -185 -80 82 -3 128 -36 -61 -140 77 20 -27 202 77 70 -77 112 -53 141 232 -34 -125 44 -205
5209b05lL60j52n3J53k47M9J27k12J22K08j97%Q9qn3n9J67o8J46k50M1P9jq7R3
$$ -205 -208 152 0 -53 100 -147 -98 29 -183 -61 147 -50 -50 39 31 -22 -81 86 18 164 -86 -45 34 33 -54 39
5235C9p2k8K2k03K31n5K4R1J25k95L35l53Q7j07K98l4j09KM7j13K5N2k01J32J18
$$ 39 -33 -61 -39 -242 -11 -66 -42 49 174 -121 214 -139 -52 -159 139 105 -4 -2 45 -68 -43 9 -192 -60 58
5260E8J27k29O6Q1j53N3J2J71l36J50J8k32K90qK9o9j10LJ75J02j28k7K06k35
$$ 58 185 -44 22 103 -50 3 15 186 -150 0 18 -214 76 68 97 28 -82 -79 96 198 70 43 249 14
5284A4P3o5RL8M8j58k13J80Q3Q8%J2m25K69O5K1J66j02k15j27K02R4K3M7j15J03
$$ 14 87 22 31 69 117 -41 -254 -74 9 97 97 109 -316 -47 18 39 205 103 -112 -239 -37 57 80 127 12 115
5310A15k65M54k75l2J35l8j34n0k4J25j94K81J8j02j08J67o1Pl0k1J0M8N1j03
$$ 115 -150 304 29 -3 132 94 -40 -90 -114 11 -183 98 116 14 -94 73 12 19 -11 -32 -22 26 77 -26
5334b6j29MK5m6L38j59k0J69k59M6L03k59J2p2N6J03%k4Lq4J10j18K28k28n0K25
$$ -26 -155 -151 -126 -172 166 7 -13 156 -103 -57 246 -13 -1 -73 -17 86 86 62 65 -19 91 -27 201 -27 -77 148
5360A48k21J21K56m08J31N5j23J37j09J32K17n02J42J78l19J37n9J18O5j63J97
$$ 148 -73 48 304 -104 27 82 -41 96 -13 119 336 -166 -24 154 -165 -28 -87 31 96 -67 130
5381A30k14L72k47J4p3q7L0p3J87K3Lj88nj7J42J14k99O8K05k67K91j7l04m2K44
$$ 130 -84 288 41 55 -18 -105 -75 -148 39 62 65 -123 -128 -145 -3 111 -188 -120 85 -182 109 92 -212 -254 -10
5406a0j03K59p4j07N1Q5r3J2j19j7N2M6J19q4M8J38j43m7j14P4J74p8o2q6K28
$$ -10 -113 146 72 -35 16 101 8 20 -99 -116 -64 -18 101 17 65 203 60 13 -101 -27 147 69 7 -79 149
5431A49j60K6j16K9k5J67R3K7m65N00k48j05K72k30J06k0J84Jj36j68K27j17l5
$$ 149 -11 15 -101 -72 -97 70 163 190 -275 225 -23 -128 144 -86 20 0 184 185 49 -119 108 -9 -44
5454d4j06LJ68j05J04j11J54r1Q6j49J64P6j70j36J16J39k62K73j77J36n5j19
$$ -44 -150 -147 21 -84 20 -91 63 -28 58 -91 73 149 -21 -157 -41 98 -164 109 -68 68 13 -106
5476a06R8N7l02P7J24p4L4J43n8J79j74k92J85J36Q7j39k25L21r0L8K1Kj47N1
$$ -106 -8 49 -253 -176 -52 -126 -92 51 -7 172 -2 -294 -109 27 114 -25 -250 71 -19 19 40 42 -105 -54
5500e4m1J43l4K2L0k10R2Q4n7n2K4m1K8K13k47K71j20p7n0j50L75k06J23M7j08
$$ -54 -95 48 14 36 66 -144 -52 32 -25 -77 -53 -94 -66 147 -100 171 51 -26 -76 -226 149 -57 66 113 5
5525Ek09L32j52n9L1j06Q2O4j14r0R3K95m0r2l48K06J68j55k0k33M18l50L37K48
$$ 5 -204 128 -24 -83 -52 -158 -76 -12 -126 -216 -123 172 132 40 -308 -102 66 -89 -109 -342 76 -274 63 311
5549C11l73J87j36J87j23k56K43J7J30q7k33K67j03o4p2K37k30OO4m1Q5j79K10
$$ 311 -62 125 -11 176 53 -203 40 57 187 100 -133 134 31 -33 -105 132 -98 -92 -28 -69 16 -163 47
5572D7p5J97j45J5p8O8M1j95R0R1J51J4l59K6J24k4K00j30qr8J56j68j39K85k10
$$ 47 -28 169 24 39 -39 29 70 -125 -35 56 207 221 -138 -112 12 -12 188 58 50 -48 108 -60 -199 86 -124
5597a24J05p7K19J41j98k26J37J76l47K19P6J0j24J01l4j53PJ97k35K32m9J13
$$ -124 -19 -96 123 264 66 -160 -23 153 -194 25 101 111 -13 88 54 -99 -92 105 -130 102 53 166
5619A66k62K46j05J00j70j05Q3r2K84j16j29j29K67N6j15K80j47k23p7K04j34
$$ 166 -96 150 45 145 -25 -130 -47 -139 145 29 -100 -229 38 94 -21 259 112 -111 -188 16 -118
5640a18N3j3L8J49o2K1J2jj25J74j54o4L71k47q1j16%K71j60J24l44K34JJ68k4
$$ -118 -65 -78 -40 109 47 68 80 79 -46 128 -26 -90 281 34 -47 -163 -163 108 -52 72 -272 -38 -37 131 107
5665A07j70o6jL0J47k3K40l32J01j02M9Q4q4J74l29L87k63k4k1J45j0q3K8JJ08
$$ 107 -63 -129 -130 -100 47 24 264 -68 33 -69 -20 64 -20 154 -175 212 -51 -75 -96 49 39 -44 -16 -15 93
5690I3j38J22J48j19j09L9J28j87k0k20N57j99q5j77J34N6j18K13J7j79k8R9j36
$$ 93 -45 77 225 106 -3 36 164 -23 -43 -263 294 95 10 -167 -33 23 -95 118 135 -44 -72 27 -109
5713a09k0m6J93j02j13L47j29M8j64K28l5j56J51nL00l47O2k5p0o7K9J2j27j7
$$ -109 -129 -175 18 -84 -197 150 21 69 -95 133 98 -58 93 88 388 41 103 78 8 -59 -30 -18 -145 -162
5737a62J61J24L8l4Rj15j21jJ53o4P4N5j5P6k3J9j95O4k5N3j29P0l6J23k57J55
$$ -162 -1 123 161 127 136 21 -100 -101 52 -12 62 117 102 178 155 174 -21 43 18 71 -58 12 -24 99 -158 -3
5763cM2J0k2j51K67k37J35j1p9q4Q3o3K17j62J6K5k3j60K10K5r4O0J6k33K94k
$$ -3 39 49 27 -124 143 -94 41 30 -49 -133 -50 -113 104 -58 -42 -17 -40 -200 10 35 -59 1 17 -216 78 76
5789G6l05J15P3J47k29J45K02j76N3j07N9j98J01NJ28j34j46K33k8J81j72q6J44
$$ 76 -229 -114 -41 106 -123 22 224 48 101 -6 53 -145 -44 -39 89 -45 -191 42 14 195 23 -63 81
5812H1j34J90l49K42J57l30L7QJ20Q5j75J71j07k14K77r1l8J6k3j5O7j63J66j85
$$ 81 -53 137 -212 30 187 -143 -106 -98 22 107 -68 103 -4 -218 59 -32 -70 -54 -77 -92 -25 -188 -22 -207
5836b07J74J4R1R9n4j58K5P6lj0j47L3M2j1KJ22p1r8J64o1k9L8r7jr1K09j99J51
$$ -207 -33 -19 72 171 117 -41 -16 60 57 47 -100 -67 -25 -36 -34 88 17 -81 83 22 -7 31 -66 -67 -158 51 -148 3
5864CJ02j47N7j66K67k86R4lk1J92N8r7k1j13O0R1J19q3j34J42j72q7R8jq2K46
$$ 3 105 -42 15 -151 116 -170 -76 -79 -100 92 150 53 32 -81 -21 70 189 106 -28 114 -58 -145 -47 -48 -130 116
5890A16k00J15j6J51j25K2j04J88O1k21QrJ73j3j83J36j94J63k07L17j70Q7N5
$$ 116 -84 31 15 166 41 63 -41 147 208 -13 -5 -14 159 146 -37 99 -95 68 -139 178 8 95 150
5913A50k14Oj71K80k79L35o4o2j67O7J57k5L7M1q6j3r2J40O1m34K22J17j75L42
$$ 150 -64 -58 -229 51 -228 107 43 -19 -186 -119 38 13 50 91 5 -8 -100 40 101 -333 -111 6 -169 173
5937A73j6j95j19M9J69J71k09l9P1Q4oj10K0j59P0P3j14L7K72l18J14J1k7k17
$$ 173 157 -38 -157 -108 61 232 23 -16 55 139 133 23 43 -116 -46 27 -87 -50 222 -96 18 29 2 -215
5961b15L59l05L22l9q4o2R0r2J12j26K8n6O7N4J9k95L70p0J00m1k40m3N9J33O0
$$ -215 144 -161 161 122 38 -24 66 -26 86 -40 -12 -68 -1 53 72 -223 147 77 177 136 -104 -147 -88 45 105
5986A05j52J5k0N1J18k49P3j33O3J42n7J02k7P8o5k23K60n9RJ41o2k85K12j29
$$ 105 -47 -32 -52 -1 117 -132 -59 -192 -129 13 -44 58 31 109 44 -179 81 22 31 172 110 -175 37 -92
6010i2k5K81k31j16M9J28r9j7K18k28J80n5p3K0J95k42J02j52J70r3P3J46j00
$$ -92 -117 164 -67 -183 -134 -6 -105 -122 96 -132 48 -7 -80 -60 135 -107 -5 -157 13 -80 -7 139 39
6033C9Jo1K30k58J08j42L7Q1r1k16L47j42K51j34M2j29J32q7K9j23P4R2k36K8
$$ 39 40 -21 209 -49 59 -83 -46 35 -56 -272 75 -67 184 50 92 -37 95 8 37 -86 -12 80 -156 -128
6057a28O3J73q7k2j02J70k98J31K55M6j38n8K21j91J88j55j20K33j00n9k3L5j7
$$ -128 -65 108 21 -1 -103 67 -231 -100 155 201 63 5 226 35 223 68 -52 181 81 22 -1 34 17
6080A7Kq5L93l73M0M9J64j75o2j96j00J19K07J14j44K4j0K07j90J74k77K08j60
$$ 17 19 -66 327 -46 -6 43 207 32 -30 -226 -326 -207 0 114 -30 -6 -16 191 1 175 -102 106 -54
6103e4k6J10n3q6J14O3j47J85k23mL76m28L66j29m5O0j60J89l22K51j02m9K7K17
$$ -54 -80 30 -23 -109 5 68 -79 106 -117 -121 255 -173 193 64 19 79 -81 108 -214 37 -65 -114 -87 130
6127A30J3J6k39K3j5J19p2p5mK04Q3j04j05K22m02J59J33L8m5nr4j01n7L55j43
$$ 130 143 159 -80 -57 -72 47 -25 -100 -104 100 183 79 -26 196 -206 -47 86 124 79 74 -20 -121 -178 177 34
6152C4p1M1O6m8O4p0j06J40j10q8J36j8j54K73l41K22P6J25j73Q4J15k14P3o7
$$ 34 -37 4 70 22 86 16 -90 50 -60 -148 -12 -30 -184 89 -252 -30 46 171 -2 82 197 -17 56 -11
6176a1J70n4j87RJ11K17k39j65K62j74P1j66K54l1k83OL03m2l4O4j10M1J49j23
$$ -11 159 105 -82 -73 38 255 16 -149 113 -61 10 -156 98 67 -216 -210 93 51 17 81 -29 12 161 38
6200C8k70Q0K00j58M9J55k47K32p4MKK7J12j11j03J85k50K48l14K82P7l37J09
$$ 38 -232 -152 48 -110 -61 94 -153 79 5 9 11 38 150 39 -64 121 -129 119 -195 87 164 -173 -64
6223f4j0q7J10m3J58O1j28q7K29p0jJ05p0r8pK50l27P5j04M5n3L12k30M5PL01
$$ -64 -74 -161 -51 -94 64 125 -3 -90 139 69 68 173 103 5 -2 248 -79 -4 -108 -63 -116 196 -34 11 18 319
6249C19k60O6k98L5J90mJ07j30j31K22j01M0j78L1j6L45k19m3j87K60l5K6N0j48
$$ 319 59 125 -173 -138 52 48 155 25 -106 116 15 55 -123 -92 -108 237 18 -25 -212 48 13 39 89 -59
6273e9J13L3j27n0J03p5qn2J41j75J56q0J50j04Q7p8j12J72J64l40K44Q0l12M9
$$ -59 54 87 -40 -90 13 -62 -70 -122 19 -156 0 -80 70 -34 53 -25 -137 35 199 -141 103 183 -129 -80
6297h0J52M1k20n3L3J25Q1l08J79J18l9J1l1k59K26j26P2J8R2j05J62k13j2QJ92
$$ -80 72 113 -107 -160 -127 -2 79 -229 -50 68 29 40 9 -250 -24 -150 -78 -60 32 -73 89 -124 -136 -128 64
6322F4p3j19P4l7P0n9J92j55P1k83L71lJ8k33J05j07J37k78J75K0p1l4K59j83
$$ 64 -9 -128 -54 -91 -21 -80 112 -43 28 -255 116 113 131 -102 3 -104 33 -245 -70 -50 -121 -155 104 -79
6346g9K02p2L2J79k57k07J13J58r5j03J86j56p3R6rK5P1R1j03J46j86q3O5M9R5
$$ -79 123 51 83 262 5 -202 -89 69 -26 -129 57 -99 -172 -76 -85 -60 11 102 -1 145 -41 -124 -59 -10 85
6371H5p3J61j01r2Q7r2K96k86K7%j98K82J0j1j85J06j6J48j60J46J5k13J00k32
$$ 85 12 173 72 -20 67 -25 271 -15 12 12 -186 96 106 95 -90 16 0 148 -12 134 149 -64 36 -196
6395a96M20k54J6J58Kk75J47k8j02K29j76m9L7j43M10p2l02Q6N6K42k79J00n3
$$ -196 224 -30 -14 144 146 -129 18 -10 -112 117 -59 -108 -71 -214 196 124 -178 -92 -36 206 -73 27 -26
6418b6N6j05M9J18Kk07l9J70m5O2P3l16K35m6n5N6P6j34n6J63j0K07k07J62l42
$$ -26 30 -75 -26 92 94 -113 -152 18 -27 35 108 -208 27 -19 -74 -18 58 -76 -132 31 21 228 21 183 -159
6443a59J36k35K65j14K49p1j7j42N7j26M41l47J58k31K0J60n2j3M02l10k20J49
$$ -159 -23 -258 7 -107 142 71 54 -88 -31 -157 284 -63 95 -136 -116 44 -8 -21 381 71 -149 0
6465@k1R6j41R9j27J80l8k56N3L41j71j2k32K36O3n9O8m2J06J64j22q9l54K97
$$ 0 -21 75 -66 33 -94 86 48 -208 -155 186 15 3 -229 7 70 11 79 37 143 307 185 96 -258 39
6489C9P0k57J10N1J95q6j66Pj32Q8L6O3K15k78J38j66j31K28kp4M7l6K6q6n6K51
$$ 39 109 -148 -38 13 208 122 -44 -37 -169 -81 -45 18 233 -45 93 -73 -204 24 22 -52 -5 -41 -15 -101 -157 94
6515I4k43J53P2J5k22J08o2P3J08k74K12J22n2l03R3N1lJ56j01R3j67P5K9j09
$$ 94 -149 4 76 91 -131 -23 -85 -12 96 -178 34 156 104 -199 -106 -55 -58 98 -3 90 -77 -2 27 -82
6539h2J04%L5L3q4K7J8j62J2j39J33J71L0N9k79J28j88K90j14j22p3K23j8k53
$$ -82 22 22 57 90 6 33 51 -111 -99 -238 -105 66 96 155 -124 4 -184 106 -8 -130 -203 20 2 -251
6563b51P4K52k77K15j36J27J97j20r5J31j06k3q2J53j20R0J1p4L9m7j6J65l8j31
$$ -251 -177 75 -202 13 -123 4 201 81 -14 117 11 -12 -94 59 -61 29 40 -34 5 -42 -58 107 69 -62
6587f2M0j39K55m6N9j83R9j43K09k5l6J34k88K87o6KO1k96R3o9n6K44J21j08k0
$$ -62 -22 -161 94 48 107 -76 23 -120 89 64 28 162 -126 161 95 97 158 -138 -45 -114 -170 74 195 87 67
6612F7j6l0j36o5L83j74K8pk72J84m7p7R3l3K80o7j9p8k3r1L84n51K19%J00j95
$$ 67 51 21 -115 -180 203 29 57 50 -222 -38 -85 -162 -69 -102 178 111 92 14 -9 -100 284 -267 -48 -48 52 -143
6638a43K46k46J70J59k63J29n0J18k94K38m1o3j32R3J86m5j33K59j36q9k41L19
$$ -143 103 -143 27 186 -77 52 2 120 -174 64 23 -40 -172 -79 107 62 -71 188 52 -37 -278 41
6660D1l24K96R4k31p8K21O4j56R0o5q2L6r7L60j55k88K51j6q9mQ9l1J23m8l5M3
$$ 41 -283 13 107 -124 -202 19 83 -73 17 -48 -130 -94 -191 169 14 -274 -23 -39 -128 -132 -43 -74 49 1 -34 9
6686Ik95o8M53n1k65L88M8l52k0J57r5J01Pj39p1L12o9j06lJ30j06%N9J7k71K49
$$ 9 -286 -354 99 48 -217 171 219 -133 -153 4 -91 10 17 -122 -193 119 50 -56 -59 71 -35 -35 24 41 -230 19
6712A9o8K69m53K40J11j42o5QK40l99J30M5p3J33J2Mj29k2K03j09j7j65L62Nk31
$$ 19 -49 220 -233 7 118 -24 -89 -81 159 -240 -110 -65 -138 -5 7 11 -118 -140 63 -46 -63 -228 134 139 -92
6737i2OJ99r4p6R3p7m5o2K33O5r8k32J24R3j41K63N9k85J34j08O8k7m9R6j23N0
$$ -92 -86 113 19 -57 36 -41 -86 -148 85 150 52 -180 -56 37 -104 159 218 -67 67 -41 27 0 -49 47 -76 -26
6763b6J3kk32J17P5j65M40l09O4J40j84K53j62j40J23M0M1k36J56j75K39K9j07
$$ -26 -13 -15 -247 -130 -55 -220 220 -89 -25 115 -69 184 22 -118 5 45 86 -150 6 -169 70 99 -8
6786hnJ03k60N4J84j5O9l5j17j67J60J4J04r6P2J64P7l01K2P6j41K86o5k21r4
$$ -8 -13 90 -170 -116 68 53 122 87 -30 -197 -37 -23 81 -15 57 221 298 -3 19 95 -46 240 175 -46 -140
6811a40N5N6l5K6K01P8j78j19J82q4j93J11L6J41k98J45jJ93j17j14J95q2J28
$$ -140 -85 -29 -64 -38 163 241 63 -56 126 42 -151 -40 -4 137 -161 -16 -17 176 59 -55 140 58 186
6834A86o1j17j16K07j9j99J5k6Nj4K27k90K14o1K65j75J1q3Jm8N4j05K30l1K7
$$ 186 125 8 -108 99 80 -119 -104 -130 -125 -139 88 -202 12 -49 216 41 52 -31 -30 -78 -24 -129 101 70 97
6859I7J34j16j37L35k11j99k55L92q9j6K53k01O8k39R3J8j18R3R4j20L21j14k9
$$ 97 231 115 -22 313 102 -97 -352 40 -49 -65 188 -13 55 -184 -91 -73 -191 -98 -4 -124 197 83 54
6882E4N4p6N3J53j70k22K88m5j68K54k27L9k4q2J64n7J06j74K7K47l83J18j2k01
$$ 54 108 32 85 238 68 -154 134 89 -79 175 -52 -13 -37 -119 45 -12 94 -80 -53 194 -189 -71 -83 -284
6906b84J42J37L4m9O3r8J28o3m4J7K6J49j21k7J31J5m48K89l4J10j50K21o4j4
$$ -284 -142 -5 29 -20 43 -55 73 10 -34 -17 9 158 37 10 141 156 -292 -3 -37 73 -77 144 80 66
6930F6Nj1j35l2K42k03P4M2k31R4J00pO1pj25KP1p5Q7N3O3k06Q5j34L16l27J63
$$ 66 71 60 -75 -107 135 -68 6 48 -183 -89 11 4 65 58 -67 -65 6 -69 18 71 134 -72 13 -121 195 -132 31
6957C1r0k81K66P3J51j46L2mQ0j48L4k71J2L54L2j26o7O4K01k40N4J23l26L24
$$ 31 -59 -340 -74 -1 150 4 36 32 112 -36 -2 -273 -261 93 125 -1 -68 -4 197 -43 11 134 -192 132
6981A32l06o0L36j76K53j86J42O7j84j17K98k37kP3j17P9j2j27qK12O9q9m7M9
$$ 132 -174 -234 102 -74 179 -7 135 202 18 -99 199 -38 -40 33 -84 -5 -17 -144 -152 60 129 40 -7 42
7005D2j77J32J94n55L84p3M9p4j07K09k7j0J07O0Q2j60Q1n8j53J03q6o0r1K1J10
$$ 42 -135 -3 191 -364 20 -53 -4 -78 -185 24 -3 -13 94 154 236 76 157 99 -54 49 -37 -97 -188 -167 -57
7030e7L6j00J33m7j9j6j2J51j4Q1j65M5n9n9j36Q7n6Q0J89L4j75J17R6j66m5K8
$$ -57 -21 -121 12 -35 -54 -70 -82 69 55 136 -29 16 -43 -102 -238 -151 -207 -127 62 96 -79 38 134 -32 -77 -49
7056d9J68M5L0k75L04j53Q2j0l41L30n9k15N5j1K65j25r7Q9p3l14K68J49k88K
$$ -49 119 164 194 -81 223 70 152 142 -199 131 72 -143 -88 -99 166 41 -56 33 -40 -354 -86 63 -225 -223
7080b23M85k12k2l8rk94K56q6J20J2K4L4k21J49J61K6l5J57m28k6K7J25j76J28
$$ -223 262 50 28 -10 -19 -313 -57 -143 -23 -11 13 47 -174 -25 136 162 127 284 -144 -170 -143 -18 -194 -66
7104f6J0J99m7l8m9Q4O8k29J26k03K27k76K90j12j27J85n4q2R5l0j82J67J09l05
$$ -66 -56 143 96 58 9 93 161 -68 58 -145 82 -194 96 -16 -143 42 -12 -94 1 -29 -211 -44 65 -240
7128b40K55M7R9j95J45p4N9o8R5o8j35J44rlk55K89q8rJ91k84Q9k22K0K46q3J0
$$ -240 15 62 161 -34 111 37 96 28 123 55 -80 64 55 52 -203 86 -2 -11 180 -104 -15 -237 -217 29 -54 -44
7154d4J71K7j54J12j72j02J15o0K1N3O0j6o7J11Mj10J20N4m1m1R3j10o4N3nPl1
$$ -44 127 154 0 112 -60 -162 -47 -107 -86 -33 27 11 -56 55 59 -51 69 123 82 41 134 24 -40 13 8 15 -16
7181a6J97q3k4p1J43j05N3o3p7P2p6Q3J2K8j83P4J16J3j6k21J80m5P7j16Qj84
$$ -16 181 98 74 3 146 41 94 31 -46 26 -50 33 45 73 -110 -36 80 93 77 -144 36 -9 68 -48 -40 -224
7207b24J29l2J10K81k27l7rR8m3r1j10L5j47M71j01k47K57l5j87o1J99j47Q9J38
$$ -224 -95 -127 -17 264 37 0 -9 89 46 -45 -155 -120 -267 204 103 -144 113 78 -109 -170 29 -118 -29 109
7231A09j28O4n2J96j60k73K22K15k58MQ4qK4n3j33K11j81N4J04j21Q6k48K62j64
$$ 109 -19 45 -7 189 29 -244 -22 193 -65 -61 23 15 39 -14 -147 64 -117 -63 41 -80 6 -242 20 -144
7255a44L8J65J7%j03N2j3p6O5J3j96J17L06l2k01M6J03k21Q5r3j9J92k36L7J60
$$ -144 -106 59 76 76 -27 25 12 -64 1 14 -182 -65 241 209 8 54 157 -64 21 -72 -91 101 -135 -98 62
7280F2m4q5P3Nj6n9J89m9l70L07m5j98K74O5k75J00J82k25OJ29P0J5k43K69j21
$$ 62 18 -67 6 11 -5 -64 125 76 -294 13 -32 -230 44 109 -166 -66 116 -109 -103 26 96 111 -132 137 16
7305A6ok8Q3J9J52j36j8j66l7o0K59M1m8K3N0l3j97J63m8O0l50O5M3J91l25L49
$$ 16 10 -18 65 84 236 100 82 -84 -121 -181 78 119 71 94 144 111 -86 77 29 89 -261 -196 -153 38 -287 62
7331F2kMq5n9O6j96L47j38q8k5K7R0k69K49n0p3K35L9j08Rk40M1J79k6J02J2k13
$$ 62 60 64 -21 -80 -14 -210 137 -1 -89 -114 -87 3 -266 -17 -67 -140 95 134 26 35 -205 -164 15 -11 91 103 -110
7358a10J05PJ70j87j21K59q7r8J87k9J3j25j23Q8N2r5J14J76k9k10j5o7J53N6
$$ -110 -5 2 172 -15 -136 123 36 -62 125 96 109 -16 -139 -51 1 -94 20 196 167 -43 -58 -125 28 84
7382H4o6K05n2o0k5k62pK38J3j02M5m9K24j82K1J64q0n1l5k36K67n1K31k27K73
$$ 84 18 223 171 111 86 -176 -183 55 68 -34 11 -38 186 4 25 189 109 58 23 -213 54 3 234 7 280
7407B80k17k9r2J2j06o3L67q9rr6m2K66k41Q2j46K2Q0r5L84j26j57J59Q4j68K53
$$ 280 63 34 -58 -46 -152 -215 152 63 54 -42 -84 182 -59 23 -123 -101 -21 -116 268 142 -15 144 228 60 313
7432C13k17k60J86P9K8p8m9J37j50K5Rl8Q0P6j92K3n4j7O5J68j04m0R8k7j83k1
$$ 313 96 -164 22 101 129 51 2 139 -11 14 23 -15 65 141 -51 -28 -82 -99 -34 134 30 -10 88 61 -122 -143
7458a43J90j50K33p8o8j8k07L46N4k55K23N9r8k00J08J42qk16K13j34M9j20J03
$$ -143 47 -103 130 52 -16 -34 -241 105 159 -96 127 186 88 -112 -4 138 130 -86 127 -7 42 -78 25
7481B5k84J65P8J38j71o5O3Q9k6K08l12J19O1O6lj44j4j23R6J22k80K27l0J91
$$ 25 -259 -94 -16 122 -49 -114 -51 38 12 220 -92 27 88 154 151 7 -7 -130 -34 88 -192 35 5 196
7505A96n1j16n2j13K56N9j2k01JM9n2j0J96L7r6P8jk94L67k58N0N2k6k01K34r0
$$ 196 145 29 -23 -136 120 179 167 -34 -33 16 -36 -46 150 187 91 169 168 -126 241 -17 33 85 59 -142 92 2
7531BJ16j7kk72K47k28K4K09j85n0K32J07j0j72j80NK22j62L16k39o8J52K23j57
$$ 2 118 101 99 -173 74 -154 -130 79 -106 -156 76 183 173 1 -179 -174 48 -114 202 -37 -105 47 270 113
7555A13k97J64K3l5L8Lj79J49j49K58j25j74K47K0j27J90j47r6K01j33J6Q7J23
$$ 113 -184 -20 3 -32 6 9 -170 -21 -170 88 -37 -211 36 56 -71 119 -28 -124 77 -56 -40 47 170
7578A70qJ2j69l3P1N8k58K78j13j71L27p5j18J49j57p0O6j44P0QJ43m2P8J85m6
$$ 170 162 174 5 -28 43 101 -157 121 8 -163 164 89 -29 120 -37 -107 -41 -185 -115 -107 36 -6 72 257 211
7603B11k03NL1J36k10M9O0k01P0O1K7j65K52j98k61L40l0J32j50j77K57R7j87
$$ 211 8 13 44 180 -30 19 79 -122 -52 9 36 -129 123 -75 -336 4 -26 106 -44 -221 36 133 -54
7626e4k2j54K34q8n0N8J18j03j18Q5k9J86j37k5R8J86Q0j85k1Km7r7L11L9l14
$$ -54 -76 -230 4 -84 -134 -76 42 -61 -179 -94 -123 63 -74 -99 -1 185 265 80 59 61 14 -83 228 267 -47
7651d7k9J42K8k76L36k70J92j64J18K28k46k27P6J20M3K4j40O2j44L28j06L0j95
$$ -47 -76 66 94 -182 154 -116 76 -88 30 258 12 -215 -139 -19 24 48 -92 -30 -174 154 48 78 -117
7674a17K05J21m52J91J04Kj0m2J10J44j68k61J63rq0J57j44J11j32N3J36M3o5
$$ -117 88 209 -243 -52 52 54 44 2 112 256 88 -173 -10 -19 -99 58 -86 25 -107 -54 82 125 60
7697F0q7q8J1J16L5n8P8JM9k30J25L6q9K46j92J09j03p4o7L6J59j62J21l8r0J15
$$ 60 -27 -115 -104 12 47 -11 67 68 117 -113 12 48 -41 205 13 122 19 -55 -122 -86 73 -89 32 -6 -96 19
7723A9j25O0m6j33J83J90mj53J22j92J35k4k22K52J02l3o9k2j30J33J33j50L7
$$ 19 -106 -46 -92 -225 -42 148 144 -9 113 -79 56 32 -190 62 164 131 62 40 -90 43 176 26 63
7746F3L9Q6k59M5P2J84k66J06j15R9j00j77L46N5j90K75j24l04q9L30Q9oj44K14
$$ 63 102 188 -71 -26 46 230 -36 70 -45 54 -46 -223 123 178 -12 263 139 -165 -254 76 165 159 15 229
7770B29k13P6l70L64q6K7J74r1j68K8J24Lk7L1q0rj04J27o8K8R8k17K75l4l4K6
$$ 229 16 92 -278 86 0 27 201 110 -58 -30 94 97 70 101 21 12 -92 35 -33 -5 93 -124 151 117 83 109
7796A09n7j4m7N5J12O8k29J21k07J84L7l90L30rN5j76O5J7o6J5q4Q6O9J03m0k19
$$ 109 52 38 -9 46 158 226 -3 118 -89 95 132 -258 72 63 118 -58 7 24 -42 -27 -111 -25 44 147 107 -112
7822a12J69N4j34J91l03J91k02R7l9J33j03J49J45j56j97L09j27j8k49Q8K66r0
$$ -112 57 111 -23 168 -135 56 -146 -49 -88 45 -58 91 236 80 -117 192 65 47 -202 -114 152 62
7844F2j98J45L6j24M4K00k23j08J37R0q2k24O4J10K95j51P0q6l5m2J88k26J83
$$ 62 -136 9 45 -79 -35 165 -58 -166 -29 61 -21 -245 -181 -71 224 73 143 57 22 -20 168 -58 125
7867A25N1p0J7j1j18K15k81K37k23K8Q3k21M6M37k76j77J9rL26l08M8k52K82p2
$$ 125 176 106 123 112 -6 209 -72 165 -58 -30 53 -168 -122 315 39 -138 -119 -128 198 -110 -62 -314 -32 -104
7891a04K57k36J41j20O0j16Q3M5l3j64J86Q5r0J47k78J04p8M1J82k64jJ33O2p6
$$ -104 153 -83 58 -62 -2 -118 -35 10 -23 -187 -1 84 -6 141 -137 -33 -111 -70 112 -152 -153 -20 42 -34
7915c4K02j9l29L81l15J21M0k7P1j41J7J16J9N9k15j46P5L71l01o3K07k9Qp4n8
$$ -34 168 149 -180 201 -114 7 47 20 91 -50 -33 83 102 161 -54 -200 -125 246 -55 -118 89 60 68 -6 -64
7940f4j4J43j07q9l2R5j72J02J76j6l0O5K8j02m4K17l7j45j63J40Q8M8n5j06p8
$$ -64 -78 65 -42 -131 -163 -68 -240 -138 38 22 -8 57 85 -17 -61 156 119 -26 -189 -49 39 87 32 -74 -152
7965a52L00j11j94K25R8k7j42j57K74o0mj19jM7M3o5J91ml03m7L94l33J80J96
$$ -152 148 37 -157 68 166 139 -3 -160 114 54 50 -69 -70 -23 20 -45 146 142 -161 -208 186 -147 33 229
7989B29k07K5n9rm3N3LJ4R5p0J73l99K25j69j14L38J5M0r5j10K33k23K38j75J56
$$ 229 22 47 -12 -21 -64 -11 -8 6 101 31 204 -195 30 -139 -253 85 100 140 45 -65 168 -55 183 8 164
8014A64k65k75L27Q5J92k85M0P2R5j76k23K40k3J47j46j20L13N6j47j45J59J30
$$ 164 -101 -376 -49 36 228 -57 -17 55 150 -26 -249 -9 -32 115 -31 -151 162 218 71 -74 85 215
8036B15j05j76K01j60%J4K05j16N4r5rp3J47j01j37K59j26j57L1O6j01N0K29j65
$$ 215 110 -66 135 -25 -25 -11 194 78 132 37 28 -45 102 1 -136 123 -3 -160 -129 -63 -164 -114 115 -50
8060e0J88o7J45m3r3j96O5J20k40J59J68L6k79Q7o1J16m5p9P3L3j77K1Q8M2J24
$$ -50 138 71 216 173 80 -116 -51 69 -171 -12 156 192 -87 0 -61 55 10 -69 4 37 -140 -119 -31 11 135
8085A35k40M6J72rj46J81j34N7j50J61K3k25J83K6P0j78J94K8k35l4J09J10n2
$$ 135 -105 -59 113 104 -42 139 5 62 -88 73 96 -129 54 80 150 -28 166 194 -41 -75 34 144 92
8108I2j10l2jm7K5J44j15K0K06j58k05K71l9n5n2j18L71k70N0J96j78m9J27K24
$$ 92 -18 -50 -51 -98 -73 71 -44 -24 182 24 -181 90 51 -4 -56 -174 197 -73 -23 173 -5 -54 73 297
8132B97l32n1J84j92l8J9J08P4n7j8J12j43j49J85j58M3J3J06J45j81K65l06O5
$$ 297 -35 -86 98 -94 -132 -113 -5 69 12 -6 106 -37 -186 -1 -159 -116 -103 3 148 -33 232 -74 -9
8155iL1N9O4j94J64j50q2J07pj11Mp3J45J8j13J89j07m0L09j30j97k1J36j78K29
$$ -9 22 81 145 -49 115 -35 -117 -10 -17 -128 -124 -197 -52 -34 -147 42 -65 -105 204 74 -123 -144 -8 -186 43
8180D3n4n6J16O2k00N3l0r5J05m1K69
$$ 43 -11 -67 49 111 -89 -36 -66 -161 -56 -97 172
8191A72
$$ Imaginary data points
##PAGE= N=2
##DATA TABLE= (X++(I..I)), XYDATA
0@%%%%%%%%%%%qJ6j6J6j6K4l2M0m8N6p1P9q8J05j29J52j75K02k29K65l03L44l91
$$ 0 0 0 0 0 0 0 0 0 0 0 0 -8 8 -8 8 -8 16 -16 24 -24 32 -39 40 -48 57 -72 80 -95 107 -122 143 -160 184 -207
34b07M40m96N58o27P03p84Q74r73J080j196J323j461J612j780J964k164K383k625
$$ -207 233 -263 295 -332 371 -413 461 -512 568 -628 695 -766 846 -934 1030 -1134 1249 -1376
52a376K893l190L523l898M321m805N364o018O797p743Q917j0424J2444j5297J9667
$$ -1376 1517 -1673 1850 -2048 2273 -2532 2832 -3186 3611 -4132 4785 -5639 6805 -8492 11175
67A1175k7283M4326j54409K8665J83064j60730L3395Q8963n4741l6624J09668
$$ 11175 -16108 28218 -126191 -97526 85538 -75192 -41797 47166 -7575 -44199 65469
78F5469r008l2196N1731r083r3224M8469M7335p5508r003O1950p1048m8217O2639
$$ 65469 56461 24265 75996 66913 -26311 22158 69493 -6015 -15018 46932 -24116 -72333 -9694
91i694k61n4724K0730K0540p659J1701J3111Q327L7890P700m2936N146O0569j1640
$$ -9694 -9955 -64679 -43949 -23409 -31068 -19367 -6256 2071 39961 47661 4725 9871 70440 58800
105E8800m9850j203j1872k4545J9295p235k5386L0990O911m1398J9284M4673j5369
$$ 58800 8950 7747 -4125 -28670 -9375 -16610 -41996 -11006 -4095 -45493 -26209 18464 3095
118C095j0181L0206r004l5862K5232L5691k4317j0108K1231j9000j4518J9232
$$ 3095 -7086 23120 14116 -21746 3486 39177 14860 4752 25983 6983 -7535 11697
130A1697j0898j7034R815j0296k1211J4451K5220k860j3463J2045J9471k360K623
$$ 11697 799 -16235 -6420 -16716 -37927 -23476 1744 -1116 -14579 -2534 16937 14577 17200
143A7200R412q902r609j129p207n604n7L579j934j5205p51J2816l055N035J5897
$$ 17200 26612 17710 8101 6972 -235 -5839 -5896 -2317 -4251 -19456 -20207 -7391 -10446 -5411 10486
158A0486r925j1799J0973N880k069P338O472r138q736J0001M221j1723K135l17
$$ 10486 561 -11238 -265 5615 3546 10884 17356 8218 -518 9483 13704 1981 4116 3799
172C799j8453J32R863p998j040Q124j728K025P635N152L569P58q34n656n646L778
$$ 3799 -14654 -14522 -4659 -12657 -13697 -5573 -7301 -5276 2359 7511 11080 11838 11004 5348 -298 3480
188C480j30n099K66m510k976O576j177J074P637p825n439J0009K21m269N328K959
$$ 3480 3350 -1749 -1483 -5993 -8969 -2393 -3570 -2496 5141 -2684 -8123 1886 2107 -2162 3166 6125
204F125m674j733N590J113n722L368l8j2869K313O607r560M13R339o005k975J0690
$$ 6125 1451 -282 5308 6421 699 4067 4029 -8840 -6527 80 -9480 -9067 272 -5733 -8708 1982
220A982N524j270P72L162l769m314M998j102r396Q58m74p604M532N227m541k45
$$ 1982 7506 6236 7008 10170 6401 2087 7085 5983 -3413 -2555 -3029 -10633 -6101 -874 -5415 -5660
236e660K567M27P71k35M174K207l187J991K604p19K772l51k571o64m028k350j35
$$ -5660 -3093 -2666 -1895 -2130 2044 4251 1064 3055 5659 4940 7712 7361 4790 4126 98 -2252 -2387
253b387l091n06p71m581L599N203j83K987K981R2J076R70K238K06m590l57j422
$$ -2387 -5478 -5984 -6755 -11336 -7737 -2534 -2717 270 3251 3343 4419 5389 7627 7833 3243 2886 1464
270A464l619J890J31l877Q57n2k805J362J922J315n23j859L477K615j109L841
$$ 1464 -2155 -265 -134 -4011 -3154 -3206 -6011 -4649 -2727 -1412 -1935 -3794 -317 2298 1189 5030
286E030K656l157m04O6j085j57k759k308k384k597J527J117j266L516J426k223
$$ 5030 7686 4529 4125 4191 3106 2949 190 -2118 -4502 -7099 -5572 -4455 -5721 -2205 -779 -3002
302c002L385L743l24Q00l47m45j106j714J934n16l119Q27j846k870K836P08k955
$$ -3002 383 4126 3802 4602 4255 3810 2704 990 2924 2408 -711 116 -1730 -4600 -1764 -1056 -4011
319d011P38j81o75J148K336L359L20j705K676Q14j391K071r64l356j478k120r62
$$ -4011 -3273 -3454 -4129 -2981 -645 2714 3034 1329 4005 4819 3428 5499 4535 1179 -299 -2419 -3381
336c381N04p28M53q40n05L092P69J18L018J4j966J252O34Q38j04j083j88j394
$$ -3381 -2877 -3605 -3152 -3992 -4497 -1405 -636 -518 2500 2514 548 1800 2434 3272 3168 2085 1897 503
354E03j518J727o02j812K62k336j377K554R74l1Q74N08J188L31J298K906r48k447
$$ 503 -1015 712 110 -1702 -1440 -3776 -5153 -2599 -1625 -1656 -782 -274 914 1245 2543 5449 4501 2054
372B054N26j742j407J001q12j365o61j018N42J295L45J686j219q09K084m3O3J947
$$ 2054 2580 838 -569 432 -380 -1745 -2406 -3424 -2882 -1587 -1242 444 -775 -1584 500 457 520 2467
390B467m91o56K45o01J016L9j411j77j457j620J099o27l2J105r30k71J744J146
$$ 2467 1976 1320 1565 964 1980 2019 608 431 -1026 -2646 -1547 -2174 -2206 -1101 -2031 -2302 -558 588
408E88J495k21l18M88j158n12J881j197j515L87j132o57J050M61r4l18l49M79
$$ 588 2083 1862 1544 2032 874 362 2243 1046 -469 -82 -1214 -1871 -821 -360 -454 -772 -1121 -642
426f42p72J275J275j267K03J310q86M17J563q86q07k58j352M24r0o74J16j040
$$ -642 -1414 -139 1136 -131 72 1382 496 913 2476 1590 783 525 -827 -403 -493 -1167 -1051 -2091
444b091N08R69m51J314O96o88O00J38l65J010o64n59L16j014n41O99q4n0n3r10
$$ -2091 -1583 -614 -1065 249 945 257 857 995 630 1640 976 417 733 -281 -822 -123 -207 -257 -310 -1220
464a220N61l76J26J027l64k92J038p59L97J363m58l67O75o94k72n68N1j31o87
$$ -1220 -659 -1035 -909 118 -246 -538 500 -259 138 1501 1043 676 1351 657 385 -183 -132 -263 -950
483i50p6M03n59O85P94r44P57N13o02N86L53m21j76k57N3K10l81q7K65m15J36
$$ -950 -1026 -623 -1182 -497 297 -647 110 623 21 607 960 539 363 106 159 369 -12 -99 166 -249 -113
504a13l63k25P87l95l35J152p39j68R63k57J17O58o27l42M09o94K45p01K82K54
$$ -113 -476 -701 86 -309 -644 508 -231 -399 564 307 424 1082 455 113 522 -172 73 -628 -346 -92
524i2r09N80P46j048O71O29q15P84K50n29kO0l27J57k18O0J12n30K63J04p99M52
$$ -92 -1001 -421 325 -723 -52 577 -238 546 796 267 265 325 -2 155 -63 -3 109 -421 -158 -54 -853 -401
546d01K03j73O6J8j83Q66k92K79N13n30J34O9o76J14N04p01j27K2l46J09k7M13
$$ -401 -198 -371 -305 -287 -470 396 104 383 896 366 500 569 -107 7 511 -190 -317 -295 -641 -532 -559 -146
568a46J79n67N68K26l49O22Q1m56L66l75LO0j15J39l19n58N07j45n46O43j28j07
$$ -146 33 -534 34 260 -89 533 614 158 524 149 152 212 97 236 -83 -641 -134 -279 -825 -182 -310 -417
590d17Q8J57p9J010m42K25N1l38L37j36m12J77l41m91QK76k03L32m92K07L15j99
$$ -417 -329 -172 -251 759 317 542 593 255 592 456 44 221 -120 -611 -603 -327 -530 -198 -690 -483 -168 -367
612c67N33J23k20N61k02k99M02Oj44Lj13m17j12l09J19Ml62K63J04p6M77L09k43
$$ -367 166 289 69 630 428 129 531 537 393 396 283 -134 -246 -555 -436 -432 -794 -531 -427 -503 -26 283 40
635D0N44l07M3M11j83m0j52n51N56n48j76M42j64l92Q4k42L17J25k38L52q6j99
$$ 40 584 277 320 731 548 508 356 -195 361 -187 -363 79 -85 -477 -393 -635 -318 -193 -431 -79 -165 -364
657c64Q01L2rK66k26n25M39n9m00Q4k52N1n19O2M34j00j87M13j25k0L22K58j02
$$ -364 437 469 460 726 500 -25 414 355 -45 39 -213 -162 -681 -619 -185 -285 -472 -59 -184 -204 118 376 274
680B74j9L7l8m8J27L29m49l87M76o27j56L97j73J7L1Q8j4M4K74K02k24M6K75k56
$$ 274 255 292 254 206 333 662 213 -174 302 -325 -481 -84 -257 -240 -209 -121 -135 -91 183 385 161 207 482 226
704B26p2K21l17K3j33j28j8j85K40J75k74%K11j70J60L21j93j28K08k18L73rk41
$$ 226 154 375 58 81 -52 -180 -198 -383 -143 32 -242 -242 -31 -201 -41 280 87 -41 167 -51 322 313 72
727G2J14k59J47L21n08l1K16k50j04K83k52K53M9k25L76l15J99Q3k56J60J70n12
$$ 72 186 -73 74 395 -113 -144 72 -178 -282 1 -251 2 51 -174 202 -113 86 169 -87 73 243 -269
749b69J18J75j22J87k24M1K48l22O4K20o5j27J99k53K83M1k45k7J7L5o1r5N4J86
$$ -269 -151 24 -98 89 -135 -94 154 -168 -104 116 51 -76 123 -130 153 194 -51 -78 -61 -26 -87 -182 -128 58
773E8j45k5Jk03L87j37J32J4j76K43J51m5j78j58%l4P7j69K03J14l30K06q7J57
$$ 58 -87 -112 -111 -314 73 -64 68 82 -94 149 300 255 77 -81 -81 -115 -38 -207 -4 110 -220 -14 -101 56
797E6K83k82p2K36k14L6J62k22Q9J4l09L71k24k6K45n11L83J6k48OJ48J34J1K2
$$ 56 339 57 -15 221 7 43 205 -17 72 86 -223 148 -76 -102 143 -368 15 31 -217 -211 -63 71 82 104
821A04j81J99J4J6K25l44J54j20p7J7J45m72M17J20m96L65l02N7K07j84M7Q5L5
$$ 104 -77 122 136 152 377 33 187 67 -10 7 152 -320 97 217 -279 86 -216 -159 48 -136 -89 -4 31
844C1K93k15kJ29j67k74K53K2l81M09j30q6jj0QJ16o9J93J39j24J70o6k33j16
$$ 31 324 109 107 236 69 -205 48 70 -311 98 -32 -118 -119 -129 -121 -5 -74 119 258 134 304 238 5 -111
868a11M9J43J4L4k49O0k45N06k57k15K77p8O1M0R8j57J48k37K82l0q1J94l9l35
$$ -111 -62 81 95 129 -120 -60 -305 201 -56 -271 6 -72 -11 29 127 -30 118 -119 163 133 52 246 207 -128
892a28J11j16q3J06qj6m4Q0k3R2J66j16R8L6K0j14J05j32J64m9N5l71J12l3l4
$$ -128 -17 -133 -216 -110 -118 -134 -178 -98 -121 -29 137 21 119 155 175 61 166 34 198 149 204 -167 -55 -88 -122
917a22l2J73m6j19n5J71q6J38j42M2K05J96j89K8J36j92k00lJ52o9J80k94R1O1
$$ -122 -154 19 -27 -146 -201 -30 -116 22 -120 -78 127 323 134 162 298 106 -94 -97 55 -14 166 -128 -37 24
941B4k97L49m1j22J03j25M1J31j17o2K07o9OJ98k41O6M0j08R1k32J07m4K11M5
$$ 24 -273 76 35 -87 16 -109 -68 63 -54 -116 91 22 28 226 -15 51 91 -17 74 -158 -51 -95 116 161
965A61j24o2o1J66J42k46J04L7j43q8J41qj5PLn5P4N9j18n1o9j7P1J19j37J86
$$ 161 37 -25 -86 80 222 -24 80 117 -26 -114 27 19 4 11 14 -41 33 92 -26 -77 -146 -163 -92 27 -110 76
991G6k41J66J02J05j81J27j48j20L31k54J71n4j93O4M4K78j0n17P3L17r1Q6j96
$$ 76 -165 1 103 208 27 154 6 -114 217 -37 134 80 -113 -49 -5 273 263 -254 -181 136 45 131 -65
1014f5M6K84k83J2p4j62J06K03r5K3O5j36K4L0J63k30K34j11J97j08l9l4JN6j60
$$ -65 -19 265 -18 -6 -80 -242 -136 67 -28 -5 60 -76 -52 -22 141 -89 145 34 231 123 84 50 51 107 -53
1039e3M8q6q8J38J31k15R5K87j17j67p3QJ20J16ll60J11J26Q2k57K05O1Km0k27
$$ -53 -5 -91 -179 -41 90 -125 -30 257 140 -27 -100 -92 28 144 141 -219 -108 18 100 -157 48 109 111 71 -156
1064a56J53O2p8LJ25k15K97l81M19l54KL91k78Q8r7m5m9J28j03K9J61j69R1q9
$$ -156 -3 59 -19 -16 109 -106 191 -190 229 -125 -123 268 -10 78 -19 -64 -113 15 -88 -59 102 -67 24 -65
1088f5M3N0kM8l13L63m7k20M2P6M8j96J28q0K17j05N2Ko2O9L2k8%p3o4P4m1r1
$$ -65 -22 28 26 74 -239 124 77 -143 -101 -25 23 -173 -45 -125 92 -13 39 41 -21 48 80 52 52 -21 -85 -11 -52 -143
1116a43J13Q8J2p0j96q8L90j15r6J94k18J91o7M5J26j18j21J2N4J77r5k14K60
$$ -143 -30 58 70 0 -196 -284 106 -9 -105 89 -129 62 -5 40 166 48 -73 -61 -7 170 75 -139 121
1139A21n8r5L9Q5K22k22r8J05k19J76j42J12r1J91m33L01k6J43N9P5k6k94Rq0
$$ 121 63 -32 7 92 314 92 -6 99 -120 56 -86 26 -65 126 -307 -6 -32 111 170 245 219 -75 -66 -146
1163a46K44j49r4j37J58J68q4L5L9n4l0J30Oq0l6q0Lj85L21o2O1o7MJ56l6o3J6
$$ -146 98 -51 -145 -282 -124 44 -40 -5 34 -20 -50 80 86 6 -30 -110 -107 -292 29 -33 28 -39 -35 121 85 22 38
1190C8Oj66O4o2K89o4o3j92K20j14RJ0J19k30J22J04l44N9R7n5J68K08l41J38
$$ 38 44 -122 -58 -120 169 105 42 -150 70 -44 -35 -25 94 -136 -14 90 -254 -195 -98 -153 15 223 -118 20
1214B0r9O4j09J36k55L71p8l5J6jK0k51K73Lj75mJ93m7k8K39m03N5K72p9r0N4
$$ 20 -79 -15 -124 12 -243 128 50 15 31 30 50 -201 72 75 -100 -104 89 42 14 253 -150 -95 177 98 8 62
1240F2k14R3K80l21J74j06J98l04K11N9j86n5J41k25L21qj22j44N8K72j82J9k16
$$ 62 -152 -59 221 -100 74 -32 166 -138 73 132 -54 -109 32 -193 128 120 -2 -146 -88 184 2 21 -195
1263a95L58M7k41N7r8L91m72J73J23j96J72k30J95j9r3M5K5j2QQ1k39J08j71J48
$$ -195 163 210 -31 26 -72 319 -153 20 143 -53 119 -111 84 65 -28 17 42 30 38 119 -120 -12 -183 -35
1287c5P2Q3M6m09L22k1j53K78j14m0m0J90j60m2K82k53m8l4l4J41R6r2j02r0J35
$$ -35 37 120 166 -243 79 58 -95 183 69 29 -11 179 19 -23 259 6 -42 -76 -110 31 127 35 -67 -157 -22
1312b2k1k1J19j06Q9j07j68M42l30J45j32O7J97k97K1k1J23J04l8k0J36k84K59
$$ -22 -43 -64 55 -51 38 -69 -237 205 -125 20 -112 -45 152 -145 -124 -145 -22 82 44 24 160 -124 135
1335A35k95J38R5ol7j8K90l42qoK8K9K9Q9j77K74k50O4J97j63o5J6P0k12J58j16
$$ 135 -160 -22 73 67 30 12 302 -40 -48 -54 -26 3 32 121 -56 218 -32 32 229 66 1 17 87 -125 33 -83
1361h3J48J48j30J12j41j81J07JK12k27m1m3L2J26Q6o3k40L92j64J5o8p9J17l5
$$ -83 65 213 83 195 54 -127 -20 -19 193 -34 -75 -118 -86 40 126 63 -177 215 51 66 -2 -81 36 1
1385AJ3K72k95k7J11n0k27J35N4o2P2Nl7P7kl9J04j68J70o1k66K35K06l88J28
$$ 1 14 286 -9 -36 75 25 -202 -67 -13 -75 -3 2 -35 42 40 1 105 -63 107 46 -220 15 221 -167 -39
1410c9j5q1J93Jqj78J36j00J63J2p7k1K51l68o2Q4J05m8P3j63J73o0l1J51j22
$$ -39 -54 -135 58 59 51 -127 9 -91 72 84 7 -14 237 -131 -193 -109 -4 -52 21 -142 31 -29 -60 91 -31
1435c1L7j25o7K28j30O5R7L7r1L9j4j24J1J29r5q6J66pk24K27p1J9P9k21M2J29
$$ -31 6 -119 -186 42 -88 -23 74 111 20 59 45 -79 -68 61 -34 -120 46 39 -185 42 -29 -10 69 -152 -110 19
1461A9j40j22L02j03J55k97q7M25L6j33J77j26j3m2j00K5j48J32P9o4RQ8m1K3
$$ 19 -121 -243 59 -44 111 -186 -273 152 188 55 232 106 93 51 -49 -24 -172 -40 39 -25 -16 72 31 54
1485E4J90k00R6k82L13l90J43J11j87J83L3j31N3P2j48J13k82K67k29K82j22p1
$$ 54 244 44 140 -142 171 -219 -76 35 -152 31 64 -67 -14 58 -90 23 -259 8 -221 61 -61 -132
1507a32J92l4L9L8l07K01K1N7k56K00O9J5j84K15l97K89J61k91K59j10p9Q5lo2
$$ -132 60 26 65 103 -204 -3 18 75 -181 19 88 103 -81 134 -263 26 187 -104 155 45 -34 51 48 -14
1531a4P2j9K9j29K9J39J3k66J52K8j76J23n0R3r7KL24l39j04J94J3M3p6o7K70
$$ -14 58 39 68 -61 -32 107 120 -146 6 34 -142 -19 -69 24 -73 -71 253 -86 -190 4 17 60 -16 -83 187
1556A87n1k52J37k7K41k05j19K15k52K4P6Q6k54J36k2Q6J10k16R5J34O7l04K50
$$ 187 136 -116 21 -6 235 30 -89 126 -126 -102 -26 60 -194 -58 -80 6 116 -100 -5 129 196 -108 142
1579A42k7L7l18J19K07l29L69j59j48j50K90o6o3L50j95p6j72K1j03L23J5j80
$$ 142 115 152 -166 -47 160 -169 200 41 -107 -257 33 -33 -96 254 59 -17 -189 -168 -271 52 67 -113
1601a13K7J26lP1P2j85Q7KP0k05m8j20J60M7L1J34j53Pq4j00J88J78k24pJ77L2
$$ -113 -86 40 37 108 180 -5 82 84 154 -51 -99 -219 -59 -12 19 153 0 7 -77 -177 11 189 -35 -42 135 167
1627A67j94J70m0l26J82K0J19Jj66J9j08M48L6l75o9L10j09k50L23l50p5L58q8
$$ 167 -27 143 103 -223 -41 -21 98 99 -67 -48 -156 292 328 -47 -116 194 85 -165 158 -192 -267 91 3
1650CO3L3q4K1j29M4M8k07J04J82k3n9j18K25j39P6J09L3k74mJ99k67J51R1j75
$$ 3 66 99 15 36 -93 -49 -1 -208 -104 78 55 -4 -122 103 -36 40 149 182 -92 -96 103 -164 -13 78 -97
1675i7O7P9m6O7p8Q2o5j24J53k0o1K35k90j96K88J11pRm2j71J47j76K29j54k14
$$ -97 -30 49 3 70 -8 74 9 -115 38 18 -43 192 -98 -294 -6 105 98 107 65 -106 41 -135 94 -60 -274
1700b74J55J86nl1j37L71j59k37J75%j5q4K00k92J41J97j26r6M7n7n9l2J70o3
$$ -274 -119 67 62 31 -106 265 106 -131 44 44 29 -55 145 -147 -6 191 65 -31 16 -41 -100 -132 38 -25
1724b5jK14k63n3K55j94K69j27j94K87j12r3O6j13P4N5j39q9J83PJ3j33J47J64
$$ -25 -26 188 -75 -128 127 -67 202 75 -119 168 56 -37 29 -84 -10 45 -94 -183 0 7 20 -113 34 198
1748A98l17%R6p1J32o0k28J95O1qL7LO3NJ52p2m7o7q4M9N6j97R1k00J13J75j82
$$ 198 -119 -119 -23 -94 38 -22 -250 -55 6 -2 35 38 101 106 258 186 139 72 -12 37 93 -104 -13 -213 -100 75 -107
1775a07L9k8J08r3K34k57J71r3j89J43K09j65n6p1O2jOJ84J01k11l8k75L28K14
$$ -107 -68 -96 12 -81 153 -104 67 -26 -215 -72 137 -28 -84 -155 -93 -94 -88 96 197 -14 -52 -327 1 215
1799B15k62N4Q7P4k93Q2J28j21J87k06K3J65j40J75m9n2j51lm0J44O6J9j1j05
$$ 215 -47 7 94 168 -125 -43 85 -36 151 -55 -32 133 -7 168 119 67 -84 -87 -127 17 83 102 91 -14
1823a4K0r1J85r5K4j57K50j25k2m1r4J61nJ02N7o9Q5j22k2L6L2L0l98M37k35J00
$$ -14 6 -85 100 5 29 -128 122 -3 -25 -66 -160 1 -4 98 155 86 171 49 27 63 95 125 -273 164 -71 29
1849B9K3K04l76J94j38M9J14l9o1q6J25O0QP0k41L3K9p7L55q3Nk56o6J94Q3l47
$$ 29 52 256 -120 74 -64 -15 99 60 -1 -87 38 98 106 176 -65 -32 -3 -80 275 192 197 -59 -125 69 152 -195
1875a95J13K69j0j36k5m2K39l69J24M3L4J32k45K01j65J33k28lk5L78r0P8M1k26
$$ -195 -82 187 177 41 16 -26 213 -156 -32 11 45 177 -68 133 -32 101 -127 -130 -155 223 133 211 252 26
1899B6j94J73r4J76o5k52K54R5m6r7Q3O6m5j63K63q6L8j80Q6j80K80j26j37L78
$$ 26 -168 5 -89 87 22 -230 24 119 73 -24 59 125 80 -83 180 94 132 -48 38 -142 138 12 -125 253
1923B53l12m1p6p1J29Q1P2J48k54lK06Jj68N6O2j76k54M11l25L57k91K53j47R5
$$ 253 -59 -100 -176 -247 -118 -37 35 183 -71 -74 132 133 -35 21 83 -93 -347 64 -261 96 -195 58 -89 6
1947FJ66k20L87l72J26l98N14j98L7J41l35O9R0P0r3n4L10m8k20K08l29J77k43
$$ 6 172 -48 339 -33 93 -305 209 11 48 189 -146 -77 13 83 -10 -64 246 198 -22 186 -143 34 -209
1970b09L38l3n5k46K26K92k46J14k62L26j29n1pk24J05j08J84O9k70j4J94k3k49
$$ -209 129 96 41 -205 21 313 67 181 -81 245 116 65 58 -166 -61 -169 15 84 -186 -200 -6 -29 -278
1993b78J71J45P1l10K10L2O6k9p0m7R3J40k09Q9o0j5O0kj97K82p3k38J34j56K33
$$ -278 -107 38 109 -201 9 41 107 78 8 -39 54 194 -15 74 14 -1 59 57 -140 142 69 -169 -35 -191 42
2018D2M8j8k07J52N6Q8nK5J48k41J8k35J9n1J46rpmJ61k44K27j50J61j32J33j27
$$ 42 90 72 -135 17 73 161 156 181 329 88 106 -129 -110 -161 -15 -24 -31 -35 126 -118 109 -41 120 -12 121 -6
2044fj66K4K99k3k47Q2K7p4J34j53K23k21J8p0L05k39J49nn4N5M6J92m02K80k34
$$ -6 -172 -148 151 128 -119 -37 -10 -84 50 -103 120 -101 -83 -153 152 -87 62 57 3 58 104 296 -106 174 -60
2069f0p3P0K28n3j62o9J92k06m6M2L31l3j63j12K38j32k40M79l13O1n2Q0o0O2
$$ -60 -133 -63 165 112 -50 -119 73 -133 -179 -137 194 161 -2 -114 124 -8 -248 231 -82 -21 -73 7 -53 9
2093Ij02K8n3K16P9j98j9n1J62j98J27n5j55K30L2J5n1j25J7J33O0j40r7J96n8
$$ 9 -93 -65 -118 98 177 -21 -40 -91 71 -127 0 -55 -210 20 52 67 16 -109 -92 41 101 -39 -136 60 2
2118BO4k28K08K27j18q0r9k1Q3r7R6j38K45l04Q8j37J28r5R8j9M6k4N9jQ7J3k52
$$ 2 66 -162 46 273 155 75 -24 -45 38 -59 37 -101 144 -160 -72 -209 -81 -176 -78 -97 -51 -75 -16 -17 70 83 -169
2145a69J75J03j3j97l4K89k53m2L00j56J1q9K14j74Q8k1L1L9q6j12J66k36K23
$$ -169 6 109 96 -101 -135 154 -99 -141 159 3 14 -75 139 -35 53 32 63 102 16 -96 70 -166 57
2168E7%J03k40J45K3j92Nj0j5L69l07J41k50J96j82J84j11j02J68J42p9j22J88
$$ 57 57 160 -80 65 88 -104 -99 -109 -124 245 -62 79 -171 25 -157 27 -84 -186 -18 124 45 -77 111
2191A11j76J16k48J84J80p8M9l40N6K92j47o5j3J12j82K03M9m5J41k46n3J21M3
$$ 111 -65 51 -197 -13 167 89 138 -202 -146 146 -1 -66 -79 33 -149 54 103 58 199 -47 -100 21 64
2214F4l1p3R8O8j40PP6j22J30k36O0K14l05J14J61l30K51n%j34J05j04k2J3M0
$$ 64 33 -40 58 126 -14 -7 69 -53 77 -159 -99 115 -190 -76 85 -245 6 1 1 -133 -28 -132 -154 -141 -101
2239a01K22j06p2J17j88Q5J59O6k10j60J04k7R3K7M5j06J00j23r1L47k15j8J76
$$ -101 121 15 -57 60 -128 -43 116 182 -28 -188 -84 -111 -18 9 54 -52 48 -75 -166 181 -34 -52 124
2262A24q8j7j01K00j04J8q3L1L8P9J34m70J24J14J67j06j22n5K84k03Q3j12K37
$$ 124 36 19 -82 118 14 32 -51 -20 18 97 231 -239 -115 -1 166 60 -62 -117 167 -36 47 -65 172
2285A72m29L19l2J13k72J87k63L07l3K7R4l18M41j93J05j50o0l6J06j12j4P5J44
$$ 172 -257 62 30 143 -129 58 -205 102 69 96 190 -128 313 120 225 75 15 -21 85 -27 -41 34 178
2308A78k08L1m1r2Q4K16k06J04k28k4L23o7P4j99K86l03J13j26j08K62J8k75L02
$$ 178 -30 1 -40 -132 -48 168 -38 66 -162 -186 137 70 144 -55 231 -72 41 -85 -193 69 87 -188 114
2331A14p9j69J02RJ7J1J23j18J33k08K44l0k94j1K88j87o5L29m10J04J16J29j05
$$ 114 35 -134 -32 -23 -6 5 128 10 143 -65 179 149 -145 -156 132 -55 -120 209 -201 -97 19 148 43
2354D3q6lP8j41J60j62L3j8K22j1k22l8J58n9J29j07j37K20N6j9k27R7r9K06K2
$$ 43 -43 -46 32 -109 51 -111 -78 -96 126 115 -107 -145 13 -46 83 -24 -161 59 115 96 -131 -34 -133 73 95
2379I5k22K4J81N9J7p2K7p1j56Q9j3Q9r7j47J06L3L4K18j03k41K89K2j90K21j48
$$ 95 -127 -103 78 137 154 82 109 38 -118 -29 -42 47 -50 -197 -91 -58 -24 194 91 -150 139 161 -29 192 44
2404D4j03Q4M0j00R3j80K59j54n0m0J1k34N04j00j52j8J06K06j84j80K26K4j60
$$ 44 -59 25 65 -35 58 -122 137 -17 -67 -107 -96 -330 174 74 -78 -96 10 216 32 -148 78 102 -58
2427e8J08K2N2j85K83p6k3j10k71R5M34m42K07M5l17M73m40L14j74k9K42n3o7
$$ -58 50 72 124 -61 222 146 123 13 -258 -163 271 -171 36 81 -236 237 -203 111 -63 -92 150 97 30
2450C0j68J18kr2J84k94M67j47M9k92Q8l6J7N3P2o4J19j10mj15p4J15l5K16k7
$$ 30 -138 -20 -22 -114 70 -224 243 96 145 -147 -59 -95 -78 -25 47 -17 102 -8 -12 -127 -201 -86 -121 95 68
2475F8%p8j00O8n5l6K77O6n3j7j29M1j08k03L69j84L4M1jJ11k48Q1K75j87j88
$$ 68 68 -10 -110 -42 -97 -133 144 210 157 140 11 52 -56 -259 110 -74 -40 1 0 111 -137 -56 219 32 -156
2500a56K31l12M94j15j44%l2n7J51P8j89n4L13k06k8j2J13M3p1j53j5L43J8k40
$$ -156 75 -237 257 142 -2 -2 -34 -91 60 138 -51 -105 208 2 -26 -38 75 118 47 -106 -121 222 240 0
2524@J13j16LN2k61J35K1J22J2j10j8K03j42P7j12M5J1O4j67J66k49J57L9o4R3
$$ 0 113 -3 0 52 -209 -74 -53 69 81 -29 -47 156 14 91 -21 24 35 99 -68 98 -151 6 45 -19 74
2549G4p3R4j86q9J42r1J84k32J97K18l59J61k66K51q1K02l35J95J43J40l13Q5
$$ 74 1 95 -91 -180 -38 -129 55 -177 20 238 -121 40 -226 25 -56 146 -189 6 149 289 -24 61
2571F1k14P0N0n3n6N9J4L5J35j87Q7m5M5n3rkl4lL01j31j13K26l7j0l72K79K5
$$ 61 -153 -83 -33 -86 -142 -83 -69 -34 101 -86 1 -44 1 -52 -61 -63 -97 -100 201 70 -43 183 146 136 -236 43 68
2598F8Pk04K26j87J26Jo2j7N8K76k41j60N1Q2j9n7L4PQ8l8K0l4j33J88j32J51
$$ 68 75 -129 97 -90 36 37 -25 -42 16 292 51 -109 -58 24 5 -52 -18 -11 77 39 59 25 -108 80 -52 99
2624I9L4O8k0k98J43K32l10j00K52j23J5j77R3J71k82J6J33L6P1oJ81j25k37L24
$$ 99 133 201 181 -117 26 258 -52 -152 100 -23 -8 -185 -92 79 -203 -187 -54 -18 53 47 228 103 -134 190
2648A90k74J93j19m2J97l7O2q0n6p4N3j78J62K10k40m6QK49k76O0N6r6J7J04m3
$$ 190 -84 109 -10 -52 145 108 170 90 34 -40 13 -165 -3 207 -33 -79 -71 178 -98 -38 18 -78 -61 43 0
2673@R7k16P6J67p6j35m5L05q5j39J54j16J24j90oN6l1K03j98J55M1j40Q5k09
$$ 0 97 -119 -43 124 48 -87 -132 173 88 -51 103 -13 111 -79 -85 -29 -60 143 -55 100 141 1 86 -123
2697a23J83J87qr6j94K8n9J77j54N3m7K9k5r8J58Qk34J84K74m15K02j00J90j73
$$ -123 60 247 239 143 -51 -23 -82 95 -59 -6 -53 -24 -49 -147 11 19 -215 -31 243 -172 30 -70 120 -53
2721e3J74J26l68R7j04J74k77M10qk31J91J45j10l04K28J5rk0m1k03K98j47LJ51
$$ -53 121 247 -121 -24 -128 46 -231 179 171 -60 131 276 166 -138 90 105 96 76 35 -168 130 -17 -14 137
2745A37l08J20m6j54K48L4n1n7J89k10M3j6J86P4j98O5k63pK20K8RM1o5k58J31
$$ 137 -171 -51 -97 -251 -3 31 -20 -77 112 -98 -55 -71 115 189 -9 56 -207 -214 6 34 43 84 19 -239 -108
2770a08m3RJ7N3M9J77k58J56j82K52p4J6P6l10J07J16Jq3O0P5j80m3J7J48P9j20
$$ -108 -151 -142 -125 -72 -23 154 -104 52 -130 122 48 64 140 -170 -63 53 54 -29 31 106 -74 -117 -100 48 127 7
2796Gq8OK77k77l1R9J01j63j3j95L58k8r3J65j75J18N4n6r4p2L6K5j81K39L7j76
$$ 7 -81 -75 202 -75 -106 -7 94 -69 -82 -277 81 53 -40 125 -50 68 122 66 -28 -100 -64 -39 -220 19 56 -120
2822a20J05J20j26K01n4n17M00N7k76L3K94n1j76P0M0q8j27K53N8q9K23l81K90
$$ -120 -15 105 -21 180 126 -391 9 66 -210 -177 117 66 -110 -40 0 -88 -215 38 96 7 230 -151 139
2845A39k59QJ25N2r2J68p4J48m06M41l45r2l8L5O3O2K38j59j12J71k85K38JJ9
$$ 139 -120 -112 13 65 -27 141 67 215 -191 250 -95 -187 -225 -190 -127 -65 173 14 -98 73 -212 26 27 46
2869D6K3p4L39l71J56l0k30J24j81K32j1L0j03J30k37J21M0K7L02l74J25k09J06
$$ 46 69 -5 334 -37 119 89 -141 -17 -198 34 23 53 -50 80 -157 -36 4 31 333 -41 84 -125 -19
2892a9O3k14Q2N0o5n6J74o0j12P1M7O8K59k71J02j78j85K55r6K47l9j59l6J19
$$ -19 44 -170 -88 -38 -103 -159 15 -45 -157 -86 -39 29 288 17 119 -59 -244 11 -85 162 123 -36 -72 47
2916D7j00J46l07M11r3j23j25o8K03L7j5J05j87J3M8j47J87o2Q5j70J3M3L35k82
$$ 47 -53 93 -214 197 104 -19 -144 -212 -9 28 13 118 -69 -56 -8 -155 32 -30 55 -115 -102 -59 276 -6
2940fQ0j90J52j73K71j60J01l3Jk22P3K30K9kk21R6L8j44K13j54k7k3Q9j06O2
$$ -6 74 -116 36 -137 134 -26 75 42 43 -179 -106 124 153 151 -70 26 64 -80 133 -21 -48 -71 18 -88 -26
2965b6J00j30n4P1J10k28J94j13l5K06O9j99k8J37j38N6J05j27J80q5k6k8M7j7
$$ -26 74 -56 -110 -39 71 -157 37 -76 -111 95 164 -35 -63 74 -64 -8 97 -30 150 65 39 11 58 41
2989D1K1om6j64M4r9K82j77J21m8Qp1J05O0j94R4o9M7l2rR6j2K0q1O7K01r1M8
$$ 41 62 56 10 -154 -110 -209 73 -104 17 -31 -23 -94 11 71 -123 -29 -98 -51 -83 -92 4 -8 12 -69 -2 199 108 156
3017A56m09L28%j68l7J97K26m46K54J12k34j11J33o5J37Lo1m7K02k53k1K03j17
$$ 156 -253 75 75 -93 -130 67 293 -153 101 213 -21 -132 1 -64 73 76 15 -32 170 -83 -104 99 -18
3040a8J11q0k11M42k22m6J62kj55q0J99j94R0K08j46J4r5P2j0j28L5j00l11N51
$$ -18 93 13 -198 244 22 -24 138 136 -19 -99 100 -94 -4 204 58 72 -23 49 39 -89 -54 -154 -465 86
3064H6j35LOq0l7J15J09j00j46P7L00k55N6m7K60j50Rp9K9n1J61k61J2N1k9J98
$$ 86 -49 -46 -40 -120 -157 -42 67 -33 -179 -102 198 -57 -1 -48 212 62 71 -8 21 -30 131 -130 -118 -67 -96 102
3090A02k07M1j10R7P7K62j13j90N3J35k26K99j47l41L57j43j03Q5K53q2p9K9r
$$ 102 -105 -64 -174 -77 0 262 149 -41 12 147 -79 220 73 -268 89 -54 -157 -72 181 99 20 49 40
3113D0O9R2j89p2%J6j29j5K29O8Rj19R6q5L6J88l67K92K5k11M1p4Q5j50J35k55
$$ 40 109 201 12 -60 -60 -44 -173 -188 41 109 118 -1 95 10 46 234 -133 159 184 -27 14 -60 25 -125 10 -245
3139b45K36O4j63P3M4nM5r8kJ88o2j19M8j50j14M28j34j53M2p4L25o2j44k23K41
$$ -245 -9 55 -108 -35 9 4 49 -49 -51 137 75 -44 4 -146 -260 168 34 -119 -77 -151 174 112 -32 -255 -14
3164a4J49j38R7j68Q1q0M6l7l5knM2K37k05n2J30P8j04R9K1j31p5O6k5o9J59N1
$$ -14 135 -3 94 -74 7 -73 -27 -64 -99 -101 -106 -64 173 -32 -84 46 124 20 119 140 9 -66 0 -25 -94 65 116
3191A16r3j0J11k58J26j45J44o6j1M6k6J13j91j9Q8l6J48j64J48k3J55J25k61
$$ 116 23 13 124 -134 -8 -153 -9 -75 -86 -40 -66 47 -144 -163 -75 -111 37 -127 21 -2 153 278 17
3214A7Ol45M36j3k8J11l01Q0J42j6j45K5K8o5L3J91j53J5J22Pk42r0L1L8P2R2
$$ 17 23 -322 114 101 73 184 -117 -37 105 89 -56 -31 -3 -68 -35 156 3 18 140 147 -95 -185 -154 -116 -44 48
3240D8j63j03J53P9m1p6K59J1j99o0QJ41k42M05l38J7Q4P6L5q2J05k45L00k83
$$ 48 -115 -218 -65 14 -27 -103 156 167 -32 -92 -84 57 -185 220 -118 -101 -17 59 94 12 117 -128 172 -111
3264a11K91k66L0p1P1J35j06o2K11j86N9J52k74q0J73l5L4j23J8J15Q4J42l57
$$ -111 180 -86 -56 -127 -56 79 -27 -89 122 -64 -5 147 -127 -207 -34 -69 -35 -158 -140 -25 59 201 -156
3287a56K36Nk52rJ24p4K20J55l84J59J06k34P2n1j14K36R6j39J80j16J04j05l4
$$ -156 80 85 -167 -176 -52 -126 94 249 -135 24 130 -104 -32 -83 -197 39 135 -4 176 60 164 59 25
3310B5mk80J62J2J34K25m25Q0Q5L0r6J23j9q6M5O9p6J16k6k59K90j95j23J32m4
$$ 25 21 -259 -97 -85 49 274 -151 -71 14 44 -52 71 52 -34 11 80 4 120 94 -165 125 -70 -193 -61 -105
3335a05N9K4q1O9LR7p2j89K43K5J76m16K19j25M2K04j80Q7j37Q8N5j76o0K35r6
$$ -105 -46 -22 -103 -34 -31 66 -6 -195 48 73 249 -167 52 -73 -31 173 -7 80 -57 31 86 -90 -150 85 -11
3360a1n9J31j15n7p3R6K31k03J5n5L6J56p6j38K12q4p7j36J77l9j03J76J7j54
$$ -11 -70 61 -54 -111 -184 -88 143 -60 -45 -100 -64 92 16 -122 90 6 -71 -207 -30 -69 -172 4 21 -133
3384a33K73Q8m32L23j44K2nj41K95r0P5j21N0q5j01n7K90j78J39r8Q3o9m3J1j2
$$ -133 140 228 -204 119 -25 -3 -8 -149 146 56 131 10 60 -25 -126 -183 107 -71 68 -30 53 -16 -59 -48 -60
3409f0rL81k72j79M3K3K12j10j11o9J27J24o7O9k72J57k6j43K78M5n5P4O8j88
$$ -60 -69 312 40 -139 -96 -73 139 29 -82 -151 -24 100 33 102 -170 -13 -39 -182 96 141 86 160 228 40
3433D0J41j22j96J61J4j44J29K7q0J37k00J97p4J5k0l16J54J24j63K29k08K8j4
$$ 40 181 59 -137 24 38 -106 23 50 -30 107 -93 104 30 45 25 -291 -137 -13 -176 53 -155 -127 -141
3456a41J46k5Jj9M8J8M3Qq5N0J08j45l5Q5k03J55j35m0m6J06P0j03J87l2N9j51
$$ -141 5 -20 -19 -38 10 28 71 79 -6 44 152 7 -28 57 -146 9 -126 -166 -212 -106 -36 -139 48 16 75 -76
3482g6P9K4J74p4o4k07Q2K83k06m5L6N2j0L7n0o2J16n1q2l5L01l9j46j69R2N0
$$ -76 3 27 201 127 63 -144 -62 221 15 -30 6 58 48 85 35 -27 89 38 -44 -79 222 183 37 -132 -40 10
3508A0o2k5O0O1j15R2kJ95j24M3l90L51J15l83p4J25K0J51j98J29l9j76J70Q7
$$ 10 -52 -77 -17 44 -71 21 19 214 90 133 -257 94 209 -174 -248 -123 -103 48 -150 -21 -60 -236 -66 21
3532B1j44K43n5k13J42J42j63J11O9M7l09J92j10j18J33j25J22L3J85j69Qo4L0
$$ 21 -123 120 65 -148 -6 136 -27 84 153 200 -109 83 -27 -145 -12 -137 -15 18 203 34 42 -22 8
3555Hp1K87k96q4J53j27J46n0K2q4J24J18j77N7nj1r6p1N2r9J37Q9J35l67J98
$$ 8 -63 224 -72 -156 -3 -130 16 -34 -12 -96 28 146 -31 26 21 10 -86 -157 -105 -204 -67 22 157 -210 -12
3580a2J52j47j58N5K48n1N5k04P8j7J5j49O9O9J8j55J00J71n4n5l5J16%k16K27
$$ -12 140 -7 -165 -110 138 87 142 -62 16 -1 14 -135 -66 3 21 -134 -34 137 83 28 -7 109 109 -107 120
3605A20p2j51K77j70JK83k83Lj61J68J13k92J84O2l0j35K07j40L02m19l7J12R
$$ 120 48 -103 174 4 5 288 5 8 -153 15 128 -164 20 82 52 -83 124 -16 286 -133 -170 -58 -49
3628d9N4j72P0Pm5J03o7J28J33j83lOL0R9j00n1r8M1j12J92J71k27J83n3o2m9
$$ -49 5 -167 -97 -90 -135 -32 -99 29 162 -21 -24 -18 12 111 11 -40 -138 -97 -209 -17 154 -73 110 57 -5 -54
3654e4N1j7J06j82M4j48J74O5k27J29J07j02N5O9k06J08j58K70j04l3Q9o2J11
$$ -54 -3 -20 86 -96 -52 -200 -26 39 -188 -59 48 -54 1 70 -136 -28 -186 84 -20 -53 36 -26 85
3677H5k4K4J05j77o9l3M9J9K83l75J7J64q7r4K33j17J30k02J82l94M30n9j69k
$$ 85 61 85 190 13 -56 -89 -40 -21 262 -113 -96 68 -19 -113 120 3 133 -69 113 -281 149 90 -79 -81
3701h1K9J46q2p0j43K48j25j68K54P3k16J08K2p3m8J77l6l5%K41k37j5J83j17
$$ -81 -52 94 12 -58 -201 47 -78 -246 8 81 -135 -27 -5 -78 -126 51 15 -20 -20 221 -16 -31 152 35
3725C5j00J58j30k84K24K7J36j63Q7J19L3j68j40K12O1k8L0j90R4k6j03L14k99
$$ 35 -65 93 -37 -321 -97 -70 66 -97 -10 109 142 -26 -166 46 107 79 109 -81 13 -13 -116 198 -101
3748a01K59J32k75j5k1l7L6J19m6o3J06j17j47K3K31K21l11k9J3j30J06J25j28
$$ -101 158 290 15 0 -21 -58 -22 97 51 -12 94 -23 -170 -147 84 305 -6 -35 -22 -152 -46 79 -49
3771d9J95k18J77k27K40n9j65M3K55k02l8N7J84k99K48k31m0L0j14L68j18J21
$$ -49 146 -72 105 -122 118 59 -106 -63 192 -10 -48 9 193 -106 142 -89 -129 -99 -213 155 37 158
3793A58l06J45j1P1P9l61K47P6l57M7L34R1k25J16j9m8k32J08l5L80m24R0PJ96
$$ 158 -148 -3 -14 57 136 -225 22 98 -259 -212 122 213 -12 104 85 37 -195 -87 -122 258 -166 -76 -69 127
3817A27q4j82p7L07j55J17J8j52J47N6j00j32N7rJ24J33k21R2j25k6o4J64P4j61
$$ 127 43 -139 -216 91 -64 53 71 -81 66 122 22 -110 -53 -62 62 195 -26 66 -59 -85 -149 15 89 -72
3841g2P9k6j30J31r3K83J02m10J03j28J66k20L79k64K89j12j84J86Q6j52M6k0
$$ -72 7 -19 -149 -18 -111 172 274 -136 -33 -161 5 -215 164 -100 189 77 -107 79 165 13 59 39
3863C9o5J18j01J83l8k80OL80k37j40L67j17j73O8n2j5pR0j16K64n5q1Q5j81J79
$$ 39 -26 92 -9 174 136 -144 -138 242 5 -135 232 115 -58 10 -42 -57 -64 26 -90 174 119 38 123 -58 121
3888A21k6k3k22K09j51N8n1P8j47p7K39l7RQ5j59q1oJ48j10M00m51K30o6j13J00
$$ 121 95 72 -150 59 -92 -34 -85 -7 -154 -231 8 -29 -20 65 -94 -175 -181 -33 -143 257 -194 36 -30 -143 -43
3913d3Pr5k6K55j22o0J5nM7jk4N2j6J22k74J5J37J0r1K29j35K03l59K41R6j58
$$ -43 -36 -131 -157 98 -24 -84 -69 -74 -27 -28 -52 0 -16 106 -168 -153 -16 -6 -97 132 -3 200 -159 82 178 20
3939B0N7j2J14j68l1j14L46k90R5r2K7J52o3l3j20J87r9N3j10K25k07O7j71J02
$$ 20 77 65 179 11 -20 -134 212 -78 17 -75 -48 104 41 8 -112 75 -24 29 -81 144 -63 4 -167 -65
3963f5L34n04K97j1r3M5K7j33K93q9n4k41K76k85K43K45k52P9l53J87j39J30N0
$$ -65 269 -235 62 51 -42 3 30 -103 190 101 47 -194 82 -203 40 285 33 112 -241 -54 -193 -63 -13
3986a3k0J16n2N0j44j9q1N0L55l66%J79m6j52K66N6p1k7kl9p4o0K12j14R6l5P3
$$ -13 -33 83 31 81 -63 -82 -163 -113 242 -124 -124 55 9 -143 123 179 108 81 79 40 -34 -94 118 4 100 65 138
4013A38m9J7j07K2k8Q9M7K6m5J4j57K3O7j13K40j29J24o1K4n0k26Q9J74k45L20
$$ 138 89 106 -1 21 -7 82 129 155 110 124 -33 -10 57 -56 184 55 179 118 142 92 -134 -45 129 -116 204
4038B04l8O5k12J30m4k10JL2j11J10J18n7j79K95K8p7J8N5j92M8K42l01j31K91
$$ 204 166 231 19 149 105 -105 -104 -72 -183 -73 45 -12 -191 104 132 55 73 128 -64 -16 226 -75 -206 85
4062H5j07O8J74l76P5J45l5P3k86N8K49q7J13k12J02k3o4o2R8j1M8j69K32l60
$$ 85 -22 46 220 -156 -81 64 29 102 -184 -126 123 36 149 -63 39 16 -48 -110 -12 -23 25 -144 88 -272
4086b72K40Q8k28J90N5k8j5j75K51J6l10J26m2k2J35K16k97J31j32j5J94k27J73
$$ -272 -32 56 -172 18 73 45 30 -145 106 122 -188 -62 -104 -126 9 225 -72 59 -73 -88 106 -121 52
4109E2k13K45N5pk65L06k00K61j28j64J95j80N2J78l19J32j33J09M0j10J45o9
$$ 52 -161 84 139 132 -133 173 -27 234 106 -58 137 -43 9 187 -132 0 -133 -24 16 -94 51 -18
4131a8p7M9QMJ24M0p6N8r4J19q5j73m4J97J59k31k43J68P9k65K83L8p2l5j1q3
$$ -18 -95 -46 -38 -34 90 130 54 112 18 137 52 -121 -165 32 191 -40 -283 -115 -36 -301 -18 20 -52 -87 -98 -181
4157a81J71K35l29Q9J15r5O1M7j2n2j32J12p1m3l7K45j98J0M7N0l12K57q5k3J92
$$ -181 -10 225 -104 -15 100 5 66 113 101 49 -83 29 -42 -85 -122 123 -75 -65 -18 32 -280 -23 -108 -131 61
4182F1J70o5l63K16m8J17r5L5oj65j8L19k07J83k64Q4o5N6j9J29j00P5j08M7J18
$$ 61 231 166 -197 19 -29 88 -7 28 22 -143 -161 158 -49 134 -130 -46 -111 -55 -74 55 -45 30 -78 -31 87
4207H7k94J2K22j4K24k75Q8j01K09k69M7K32k95K71j24j05P5J50j68k2P3Q0qr7
$$ 87 -207 -195 27 13 237 -38 50 -51 158 -111 -64 168 -127 144 20 -85 -10 140 -28 -50 23 103 95 -2
4231bm8L5n8O6j8j45L18L1j44j18R0o6L9n0Np8J14Q0k5l9P7J70j66j51OL3j7J53
$$ -2 -50 -15 -73 -7 -25 -170 148 179 35 -83 7 -59 -20 -70 -65 -143 -29 51 26 -13 64 234 68 -83 -77 -44 -61 92
4259I2l04K23J87k64J03r1M0P5k38M12k10N9O5j28j96K45R0j30J65k38J26j87
$$ 92 -212 11 198 -66 37 -54 -14 61 -177 235 25 84 149 21 -175 70 160 30 195 -43 83 -104
4281a04L62k46J70j94p1L5j69J81M4j11M6J02K4J65l06O6J09j77m3R9j0R5P3j51
$$ -104 258 12 182 -12 -83 -48 -217 -36 8 -103 -57 45 69 234 -72 -6 103 -74 -117 -18 -28 67 140 -11
4305a1n3J32pk8Q5l54L59%j12N0j50R6K6L2r4J48K9j15J16k48J30j21J56r0l8
$$ -11 -64 68 61 33 118 -236 123 123 11 61 -89 7 33 65 -29 119 148 33 149 -99 31 -90 66 -24 -62
4330f2J45Lp6J14o3m0P4q0k27J33OJ93j00l3jr8m0Q3j70n9K40P1j52N8m6J59j3
$$ -62 83 86 10 124 61 21 95 15 -212 -79 -73 120 20 -13 -14 -112 -152 -69 -239 -298 -58 13 -139 -81 -127 32 19
4357A9j73Q6K43k10J10R2k42j9K35P5k14J2P4q2j86L09j35p4J31k17K31mj5J26
$$ 19 -154 -68 175 -35 75 167 -75 -94 141 216 2 14 88 6 -180 129 -6 -80 51 -166 65 61 46 172
4381A72k22m3j40K67k00K48j05P1Q6j95J83m8M0k37N5J5L63k40k37K57j54K43
$$ 172 -50 -93 -233 34 -166 82 -23 48 134 -61 122 74 114 -123 -68 -53 310 70 -167 90 -64 179
4403A79j57Q5k3k9k1j15J64j72J17k7k94K59j16K73o2K4j01q0J97p5Ko0k5j40
$$ 179 22 107 84 55 34 -81 83 -89 28 1 -293 -34 -150 123 61 85 -16 -96 101 26 28 -32 -57 -197
4427a97J43K09j49p5M9j6k5k6J31J33k37N1R4j74J48R0Oj36j04P3k41L95k74J11
$$ -197 -54 155 6 -69 -20 -36 -61 -87 44 177 -60 -9 85 -89 59 149 155 19 -85 -12 -253 142 -132 -21
4451b1O5L3M4j6pk48K3m2J42rl1J35j00j69O2j94L95q6j6K65k11J09k6j77J02
$$ -21 44 77 121 105 98 -150 -127 -169 -27 -36 -67 68 -32 -201 -139 -333 62 -24 -40 225 14 123 97 -80 22
4476B2k2J29k87J17J04j02K60j32P3k70J89Q6k14J34qk02L9J82j56Q9n1M8J22
$$ 22 0 129 -158 -41 63 -39 221 89 162 -108 81 167 -47 87 79 -123 -84 98 -58 31 -20 28 150
4499A50j70Q2p2J4J42l05K29k09QJ01j37K73O2k44J56k2j27k47M05O8L6l62M5
$$ 150 -20 62 -10 4 146 -159 70 -139 -131 -30 -167 106 168 -76 80 58 -69 -316 89 157 193 -169 -124
4522a24qJ10J63j93R1k76L6L56j60m2K1J98k86L49j74j32K02l54K86j30LJ44k43
$$ -124 -132 -22 141 -52 39 -237 -201 155 -5 -47 -26 172 -114 235 61 -71 131 -223 63 -67 -64 80 -163
4545a63K2K60j05K0L8k59j48M83kj3p5J3q6J64j09K9k06M11l89K61j39j21l5J7
$$ -163 -141 119 14 34 72 -187 -335 148 146 133 58 71 -15 149 40 69 -137 274 -115 146 7 -114 -149 -132
4569a32Mj31K13M0j59R7J84r4j13k9N1L1J12l3rk0O9N1n4j63K19j82j5n7J25k72
$$ -132 -128 -259 -46 -6 -165 -68 116 22 -91 -120 -69 -38 74 41 32 12 81 132 78 -85 134 -48 -63 -120 5 -267
4595b67L18K6K17l16K4L2Q0J7j02K05p3j93J07j4k03K20k6j71L4j20K35m9N3j25
$$ -267 51 77 294 -22 2 34 114 131 29 234 161 -32 75 61 -142 78 52 -119 -85 -205 30 -19 34 -91
4619i1K93k14o1J77r5J1j03K36n63L28K06j07J1r3n5J26q4J86l44K79J1j0p1Q9
$$ -91 202 -12 -73 104 9 20 -83 153 -410 -82 124 17 28 -65 -120 6 -78 108 -236 43 54 44 -27 62
4643F2J14L9j08k38L8k9O8J60r3j11r2P8QJ30n9N3m3o0J13n2o4J9m6n0K62m51
$$ 62 176 215 107 -131 -93 -122 -54 106 13 -98 -190 -112 -104 26 -33 20 -23 -83 30 -22 -86 -67 -113 -163 99 -352
4669c52J49K13R5j87p4J57m6m7M0j5j18PK67k8j00r4J57k3J25j59P4K97k99K7
$$ -352 -203 10 105 -82 -156 1 -45 -92 -52 -67 -185 -178 89 61 -39 -133 24 1 126 -33 41 338 39 66
4693F6j33J72j77J3m0n0K38r5J02p9j34J38j40L62l33J46j39l6J70PpN2j49l5
$$ 66 -67 105 -72 -59 -99 -149 89 -6 96 17 -117 21 -119 243 -90 56 -83 -119 51 58 51 103 -46 -81
4717h1J14q9k2Nl5L35k3m57K15K5Q8k4J45k41Q3j06j0J7mK41k11m8M9L8K36l05
$$ -81 33 -56 -78 -73 -108 227 204 -253 -38 -13 75 51 196 -45 38 -68 -78 -61 -65 176 -35 -83 -34 4 240 -65
4743f5K0P3J8j02K6J94j57j69L64r9k80L28k3p7%O6j22J20j4k7k8j20R4M5r7J64
$$ -65 -45 28 46 -56 -30 164 7 -162 202 103 -177 151 128 51 51 117 -5 115 101 74 46 -74 20 65 -32 132
4769A32l49K85j91L9O7J26k92J47kQ5r2j38j28L76r7Q9R1Jlj3j51P0n2j90P5K45
$$ 132 -217 68 -123 -84 -17 109 -183 -36 -38 47 -45 -183 -311 65 -32 57 148 149 146 133 -18 52 0 -190 -115 130
4795A30P8k30n3J26K27k30J06q0n3N4j69M4p9J68J25p4j88J45p2O9m9kJ46K9j43
$$ 130 208 -22 -75 51 278 48 154 74 21 75 -94 -50 -129 39 164 90 -98 47 -25 44 -5 -7 139 168 25
4820B5j56K18R7p6Kj36J34j2j21m9J83r8L4j10J67J7r2n9J65K6l41K59j61K48
$$ 25 -131 87 184 108 110 -26 108 96 -25 -74 109 11 45 -65 102 119 27 -32 133 159 -182 77 -84 164
4844A64p2j27Q9N0j66O6r3KK37j50k61L61k39koK27m2r7k7Q7j13R6j78K40o9J6
$$ 164 92 -35 54 104 -62 4 -89 -87 150 0 -261 100 -139 -141 -147 80 38 -59 -86 1 -112 -16 -194 46 -23 -7
4870gj72O6P7k45L16K4R0k08J67m9j36j17P8J71q2j2J72j36nPJ4k6j37L24k11
$$ -7 -179 -113 -36 -281 35 59 149 -59 108 59 -77 -194 -116 55 -27 -39 133 -3 -8 -1 13 -13 -150 174 -37
4895c7o8J8J97p1k98L79j56j08R7%J32n4r9K10j92j65J66J07l8j7K72k91L0m4
$$ -37 -105 -87 110 39 -259 120 -36 -144 -47 -47 85 31 -68 142 -50 -215 -49 58 20 3 275 -16 14 -30
4919c0P1J27j87J25J51n43K18o9oJ32j41J06O3J5n2o1K12m6l60j71M86k96L56
$$ -30 41 168 -19 106 257 -286 -68 -137 -143 -11 -152 -46 17 32 -20 -81 131 85 -275 -446 40 -256 100
4942A00j90J45j09p1J13J76l65L46k20K63j15k52P1J29o1J59q3j39K17p8l8P6
$$ 100 -90 55 -54 -125 -12 164 -201 145 -75 188 73 -179 -108 21 -40 119 36 -103 114 36 -2 74
4964G4P0l79J09J74J17j64J74k05P3L6k64J63q9L16k57j13L74k91L1j00j4K05
$$ 74 144 -235 -126 48 165 1 175 -30 43 79 -185 -22 -111 205 -52 -165 209 -82 -51 -151 -165 40
4986D0p8K6K37k92l1J09n4K37k45J17Q3j53K6O9J69m58K40j12m9J22K50k28p6
$$ 40 -38 -12 225 -67 -98 11 -43 194 -51 66 149 -4 22 91 260 -198 42 -70 -119 3 253 25 -51
5009e1K9O3N8m9k4Q9m0q6L32j36k92l8K2o6J0QL48m34K65k25J36l7k57N13j69
$$ -51 -22 41 99 50 26 115 75 -11 321 185 -107 -145 -123 -189 -179 -171 177 -257 8 -217 -81 -118 -375 138 -31
5034c1P4O0M6j24j87J94r8l3M4R0K09m52Q7r2O5J86M6P3k93J87k32K97p3j03K21
$$ -31 43 103 149 25 -162 32 -66 -99 -55 35 244 -208 -121 -213 -148 38 84 157 -136 51 -181 116 43 -60 161
5059A61k40m4r2K36N5Q9k55o3J05K49j41l6p9K5j40N5K83j30o1r7N1M18l10j57
$$ 161 -79 -123 -215 21 76 165 -90 -153 -48 201 60 24 -55 -30 -170 -115 168 38 -23 -120 -69 349 39 -118
5083a18J91j98J64p2N2r5P7j04J31j61L56k3k79R8Q4j38J3J1L6R9lk9j71J45r0
$$ -118 73 -125 39 -33 19 -76 1 -103 28 -133 223 200 -79 19 103 -35 -22 -11 25 124 121 92 -79 66 -24
5108b4n3M8ojP4l15L3K40M6n7J56P4l67r0K87k21L4Q2N1K0N1o4o3J13r6j7o0m0
$$ -24 -77 -29 -35 -36 38 -277 -244 -4 42 -15 141 215 -152 -242 45 -176 -142 -60 -9 11 62 -2 -65 48 -48 -65 -125 -165
5136a65J24J48m3k10J61kn0J76p5j67K25mj10j89J26J98j07m3J57r3p4rP3L8j53
$$ -165 -41 107 64 -146 15 13 -37 139 64 -103 122 118 8 -181 -55 143 36 -7 150 57 -17 -26 47 85 -68
5161f8J06j00l2K53Q8k56k9O0J43q6l26K40j3r7J87k19J82M4o9L03k76k1J12j17
$$ -68 38 -62 -94 159 247 -9 -38 22 165 79 -247 -7 -20 -117 70 -149 33 77 8 311 35 14 126 9
5185Ip8J73o4J58q1j20j81L57k10r0J43k5j01O3J36j42J06n4J14m6N8J1j32R5
$$ 9 -69 104 40 198 117 -3 -184 173 -37 -127 16 -9 -110 -47 89 -53 53 -1 113 67 125 136 4 99
5209I9j47L10l43k08J35K9L81k94o3J5J93N4j61j68J02P6OJ41k55L0O1J36j7M9
$$ 99 -48 262 -81 -289 -154 -125 256 -38 -101 -86 107 161 0 -168 -66 10 16 157 -98 -68 -7 129 112 161
5233A61j39J2Q6k53J42p6K83k40O2j31L22j26k07J18M9k27O0J97q8O6J12o7k28
$$ 161 22 34 120 -133 9 -67 216 -24 38 -93 229 103 -104 14 63 -164 -104 93 5 71 183 116 -112
5256a12K63k34J52K2J7K8j28k8L8j60L8J37L8p6l1LM5j32J96j38J80j03L1P9l06
$$ -112 151 -83 69 91 108 136 8 -20 18 -142 -104 33 71 -5 -36 -33 12 -120 76 -62 118 15 46 125 -181
5281a81L17l14L49Lk10Q4p8K69k43J33j07K8J03m8l2j26p8k7j21K43l7J26l38
$$ -181 136 -178 171 174 -36 48 -30 239 -4 129 22 50 153 105 73 -53 -131 -158 -279 -36 -73 53 -285
5304b85L04p7J50N3J33n20K03J30k99J86j95L42j37O8J39k74Q9j26J61l35K10
$$ -285 19 -58 92 145 278 -242 -39 91 -208 -22 -217 125 -12 56 195 -79 10 -116 45 -290 -80
5325h0k4R6q7K4N1J8p6K10j69o5J33k18K79n8J25l49K07m6k4j23L36j46Q6j55
$$ -80 -104 -8 -95 -71 -20 -2 -78 132 -37 -102 31 -187 92 34 159 -190 17 -29 -53 -176 160 14 100 -55
5349e5Q7j39P2J21J8k10Q2n6j36jL3K15M3o4j03J64k93K83Q3M7j97k05K11q0Q4
$$ -55 32 -107 -35 86 104 -106 -24 -80 -216 -217 -184 31 74 10 -93 71 -222 61 144 191 -6 -211 0 -80 4
5374DP6P%j41O8j88J10J50k25K34j01K6L0l2j27K07n4m7L7o6O8q4p7N5K3R4K2
$$ 4 80 87 87 -54 14 -174 -64 86 -139 95 -6 20 50 18 -109 98 44 -3 34 -32 36 -48 -125 -70 -47 47 69
5401F9l8k51M32l28Q0N7J2j60J00N6j96L72k55K0Q4j26K33k92K46j54M0O6J56
$$ 69 31 -220 212 -116 -36 21 33 -127 -27 29 -167 205 -50 -30 54 -72 161 -131 115 -39 1 67 223
5424B23m30J46J42l46K44rq9r0J78M4j57K16o4J8j02k7P4o2j6K02Q3j19k08L59
$$ 223 -207 -61 81 -265 -21 -30 -119 -209 -31 13 -144 72 8 26 -76 -103 -29 -91 -107 95 178 59 -149 210
5448B10k29p4K8k8M4p7Q3om1K6j13J54L8j9j40N5K25L5l59K55j6J77l24M7P0r0
$$ 210 -19 -93 -65 -93 -49 -126 -43 -49 -90 -64 -177 -23 15 -4 -144 -89 136 171 -188 67 51 228 -96 -49 21 -69
5474f9O0P9j22K2m8K1j8K74l35k61K58J75Mj00J3J65Q3l31M0K77l38J44K41k90
$$ -69 -9 70 -52 -30 -78 -57 -75 199 -136 -397 -139 36 40 -60 -47 118 201 -130 -90 187 -151 -7 234 -56
5498e6n2l7M5j2O3j6J9L2Q9j52J87o7n4O6j36Q5L1k97J15M5J09l2p7p1K48r0P2
$$ -56 -108 -145 -100 -112 -49 -65 -46 -14 75 -77 110 43 -11 55 -81 4 35 -262 -147 -102 7 -25 -102 -173 75 -15 57
5525E7j72J59r8Q6J49m42J82J05n0J60N7k25j88K08n0J02J65j83k60J15Q6J22
$$ 57 -115 44 -54 32 181 -261 -79 26 -24 136 193 -32 -220 -12 -62 40 205 22 -238 -123 -37 85
5547H5j50P1J5J23k73MJ9NJ89mN9l3j44J87m5L8r4J09k49q4L18r3n0r1k3nJ00
$$ 85 -65 6 21 144 -129 -125 -106 -101 88 84 143 110 -34 153 108 146 52 161 -88 -172 146 53 3 -88 -111 -116 -16
5574a6j12J71J29j06l23L19j76J66J07k92K76l81K73r8L7O1j67K44k29L50l01
$$ -16 -128 43 172 66 -257 62 -114 52 159 -133 143 -238 35 -63 -26 35 -132 112 -117 233 -68
5595f8L6o8j04L33r2j44Q8j88J25J16l7o7r9j5K55Q9p7k11M6J90r8J28j05J69
$$ -68 -32 -100 -204 129 37 -107 -19 -207 -82 34 -3 -70 -169 -184 71 160 83 -128 -82 108 10 138 33 202
5619B02k51MK28Qq5j65k2J07M3j5m3j72M8N1o9J29k3l3J2P4j80J86l34N88l00
$$ 202 -49 -45 183 191 106 -59 -81 26 69 54 11 -161 -113 -62 -131 -2 -25 -58 -46 28 -152 34 -300 288 -12
5644a2p7k5R1J45j74P9n2K38j13r0R2k3j05n2j3J98k31R0O3O0j06%J4Q2q2O2j33
$$ -12 -89 -114 -23 122 -52 27 -25 213 100 10 102 79 -26 -78 -91 107 -124 -34 29 89 -17 -17 -3 79 -3 59 -74
5671g4L8LkK9L6j13K29k39p3L2P4J49r4J3m8J93k34J08o3L6N1O1j51k09M09p1
$$ -74 -36 -33 -35 -6 30 -83 146 -93 -166 -134 -60 89 -5 8 -40 153 -81 27 -36 0 51 112 -39 -248 161 90
5697I0j71m3J79J35l85J88p1J19k50K55j33J58j12J07k21L16l27J40n2J1J18k27
$$ 90 -81 -124 55 190 -195 -7 -78 41 -209 46 -87 71 -41 66 -155 161 -166 -26 -78 -67 51 -176
5719a76R9J09k17r6K72L3nj50K26n1Ql8o9L13k59j19P5n8O5k5L3J77j37k7o3J80
$$ -176 -77 32 -185 -281 -9 24 19 -131 95 44 52 14 -55 258 -1 -120 -45 -103 -38 -63 -30 147 10 -17 -80 100
5745A00j1k01J64k2j21p9J84R5j52M3J09p8p7P2p4Q8k2j95mQ8j26J74J44O1k05
$$ 100 89 -112 52 30 -91 -170 14 109 -43 0 109 31 -46 26 -48 40 18 -177 -181 -93 -219 -45 99 160 -45
5770d5J28J78m73J53J28j75J35L6m7q9L93m12R1M3j11J63j84J37l98L05J4J6j20
$$ -45 83 261 -212 -59 69 -106 29 65 18 -71 322 -90 1 44 -67 96 -88 49 -349 -44 -30 -14 -134
5793a34K27j19L4L9j09O4J65k83Q0r5l5K98j30Q8j54K00q7p4J78j33j7M5j38J76
$$ -134 93 -26 8 47 -62 2 167 -116 -36 -131 -166 132 2 90 -64 136 49 -25 153 20 3 48 -90 86
5817H6j03O9l0J2o5L6m0R0J59l10K30j68j47L37k23P6k45M00k41M07l47K12j27
$$ 86 -17 52 22 34 -31 5 -35 55 214 -96 134 -34 -181 156 -67 9 -236 164 -77 330 -17 195 68
5840F8o8K63l33KK31j02p9K70k11j20R0K1p0q4K35j05M3O2j36J8K7p5J6P5K0n3
$$ 68 0 263 -70 -68 163 61 -18 252 41 -79 11 32 -38 -122 113 8 51 113 -23 -5 22 -53 -37 38 58 5
5866Ej11J34j8J32j66J04j12q4L2J70j90J73j40O7j12K33K5M4j76l9p4Q0J27l7
$$ 5 -106 28 10 142 -24 80 -32 -116 -84 86 -104 69 -71 -4 -116 117 142 186 10 -29 -103 -23 104 67
5890F7r0q7l3L8K45k9j51J2r3l1k0l8J50L8R8j23m4p8J09j5N7N7m1M8k0P2N8k06
$$ 67 -23 -110 -143 -105 140 111 -40 -28 -121 -152 -172 -210 -60 -22 76 -47 -91 -169 -60 -75 -18 39 -2 46 26 98 156 -50
5918e0O8n4K89m44J3K61q3j91K91q5m0p6o6K55j16r0Q4o5J45k32J58J61j40J49
$$ -50 18 -36 253 -191 -178 83 0 -191 100 15 -25 -101 -167 88 -28 -118 -34 -99 46 -186 -28 133 -7 142
5942A42j67J54j48J10j48Q0Mm2j08J21j0n4J62j46j0L1K1J58k33J27L5j89L32
$$ 142 -25 129 -19 91 -57 23 27 -15 -123 -2 -12 -66 96 -50 -60 -29 -8 150 -83 44 79 -110 222
5965B22k25k7J36j99j5K45j37J32j84J42j49R5j18L8p4K71j03J57j67l08J99J61
$$ 222 -3 -30 106 -93 -108 137 0 132 -52 90 -59 36 -82 -44 -118 153 50 207 40 -268 -69 92
5987I2o2N7j34J82k66P0J32j58R9j32P4J88O5k87J59j90J74O5J5ml30K14M5j74
$$ 92 30 87 -47 135 -131 -61 71 -87 12 -120 -46 142 207 -80 79 -111 63 128 143 139 -191 23 68 -106
6011a06nJ01o5Q2p4R0qj11K50k28J59j70R5k22M18q4j64L4L1j18K35k98J87J3
$$ -106 -111 -10 -75 7 -67 23 15 -96 154 -74 85 -85 10 -212 206 122 -42 -8 23 -95 140 -158 29 42
6035D2j12K71k40J73k88J57j46K03q2L12k12j44n3K23O8o0J40j43q9o1n2K79j85
$$ 42 -70 201 -39 134 -154 3 -143 60 -22 290 78 -66 -119 104 172 112 252 109 20 -41 -93 186 1
6058AJ9r4n2J65J20j76Q0j37K75k21J71j52J14r1k08J61M0j63K64p1L9j36J8L3
$$ 1 20 -74 -126 39 159 -17 63 -74 201 -20 151 -1 113 22 -186 -25 15 -148 116 45 84 -52 -34 -1
6082aQk3M8k2J57l50j10M81O4k33M5O4k60J41k04P3M8K15m30L47k7J51l11k8N6
$$ -1 7 -16 32 10 167 -183 -293 188 252 19 64 128 -132 9 -195 -122 -74 141 -289 58 31 182 -129 -157 -101
6107a01R8n6J44n0j6Q5j02J22j93J36n9K6j39o3J61j0J49l25J98J31n0J74k90
$$ -101 -3 -59 85 35 19 104 2 124 -69 67 8 34 -105 -168 -7 -17 132 -193 5 136 86 260 -30
6130c0j8J21r5Pm5L7pN4n9J3J69j07q5K1J25k56K18O1j78J42nl12K08r2Q9p6J29
$$ -30 -48 73 -22 -15 -60 -23 -30 24 -35 -22 147 40 -45 -24 101 -155 63 124 -54 88 83 -229 -21 -113 -24 -100 29
6157B9J28j25r5kJ35j72N5K04k74J57p8J65P0j83J4J02J20k20j06J08j01J0P7
$$ 29 157 32 -63 -65 70 -102 -47 157 -117 40 -38 127 197 14 28 130 250 30 -76 32 -69 -59 18
6180A8J63l14J08j78L27r1K06l21K08j27O7m7j10M4K7o2l6Q0j01J39j17J14K24
$$ 18 181 -133 -25 -203 124 33 239 -82 126 -1 66 19 -91 -47 -20 -82 -118 -38 -139 0 -117 -3 221
6203B21l71L17j68L5J06q8j98p3L8J86K74l20K05j03k87J94K63k59p3J75o2m4
$$ 221 -150 167 -1 34 140 52 -146 -219 -181 5 279 -41 164 61 -226 -32 231 -28 -101 74 12 -32
6225c2p5m2K38j49R9j04K96m81M49k60o8K04PJ30k04j4kj4p1J43k36K48M9n0j20
$$ -32 -107 -149 89 -60 39 -65 231 -250 199 -61 -129 75 82 212 8 -6 -8 -22 -93 50 -186 62 111 61 -59
6250e9J00k8J73k57J98l5l22K08n7J52J6k1N7p3j22J42j02M1j72K25j02K7J9l5
$$ -59 41 13 186 -71 127 92 -230 -22 -79 73 89 68 125 52 -70 72 -30 11 -161 64 -38 -11 8 -27
6274b7J70m23J76J42l4L3j45K04mk82L30k20N5j7J87j47r5J59J0m1m8j32O3L02
$$ -27 143 -280 -104 38 4 37 -108 96 92 -190 140 -80 -25 -42 145 -2 -97 62 72 31 -17 -149 -86 216
6298B16m43J80L5J14M3q2r0j69J47OJ46k97L01k20J58j88J34R7k12KL18r0k06
$$ 216 -227 -47 -12 102 145 63 -27 -196 -49 -43 103 -194 107 -113 45 -143 -9 88 -124 -122 196 106 -100
6321a00k7J83j11J45j3J1k70J64o5K4J84l95J31J52J17j82J63j45N7q9L3q4K03
$$ -100 -127 56 -55 90 77 88 -182 -18 -83 -59 125 -270 -139 13 130 -52 111 -34 23 -66 -33 -117 86
6344H6k4m7j04p7J14M3j28K47m7j0J1J2J2j16j73J18K05j68l1K16p3K4J78l30
$$ 86 62 15 -89 -166 -52 -9 -137 110 63 53 64 76 88 -28 -201 -83 122 -46 -77 139 66 90 268 -62
6368f2J78M4l81O9L4J40k24L05J55k24k67J63Q9j11J20l47L72j01K21k04L4P5
$$ -62 116 160 -221 -152 -118 22 -202 103 258 34 -233 -70 19 -92 28 -319 53 -48 173 -31 3 78
6390G8q9J39j03J5N3j38QL2o2j2J74L7j37L2k0N7L8j05K4j23n3K77nk55J94K23
$$ 78 -11 128 25 40 93 -45 -37 -5 -67 -79 95 132 -5 27 7 64 102 -3 21 -102 -155 122 117 -138 56 279
6416B79k57q5J48M3k12J14r1pJ69j26J07r5P0n0M9M9m57K45L13o8j29J13j6j42
$$ 279 22 -63 85 128 -84 30 -61 -68 101 -25 82 -13 57 7 56 105 -352 -107 206 138 9 122 106 -36
6440c6N0R7k42J53q4J5J44o6q3o8R6m7J06o7o9p8j3J58O9R1R2k18rK25l57K26
$$ -36 14 111 -131 22 -62 -47 97 31 -52 -120 -24 -71 35 -32 -101 -179 -192 -34 35 126 218 0 -9 216 -141 85
6466H5j66rJ10J10j02j14P6l07L23J23k13J33Ko2j41J88r2J02J8m2j8J32k47J95
$$ 85 -81 -90 20 130 28 -86 -10 -317 6 129 -84 49 51 -11 -152 36 -56 46 64 22 4 136 -111 84
6490H4k04q0L27j67J02j12L00l75L2lj48L23L1k74N4O2K7l7R4k73K17K07j95N9
$$ 84 -120 -200 127 -40 62 -50 250 -125 -93 -96 -244 79 110 -164 -110 -48 -21 -58 36 -237 -20 187 -8 51
6514E1Nk61K92o8k19K50j89j8K00M6j33M3R2J56k4r1L3k57J56n7J5j19J95j26
$$ 51 56 -205 87 19 -200 50 -139 -157 43 89 -44 -1 91 247 223 132 165 -92 64 7 22 -97 98 -28
6538b8k78J89J82Mj56k1L4J82K6J8o4k26J90J80j87Q0p9l5k83L92O1Q7l03J27
$$ -28 -306 -117 65 69 -87 -108 -74 108 134 152 88 -138 52 232 45 125 46 11 -272 120 181 268 -35 92
6562I2l9Q1M5k83M7n7K23j76K17l05L39r6Lj22jJ7P5r6J25mk3J40l95J88J29J
$$ 92 53 134 179 -104 -57 -114 109 -67 150 -155 184 88 91 -31 -32 -15 60 -36 89 85 62 202 -193 -5 124 125
6588A25j31r8J10P4k25J90k05J47K20j48l3Q9r6m7OJ42o6l9j45J16l7n9J60R4
$$ 125 -6 -104 6 80 -145 45 -160 -13 207 59 26 115 19 -28 -22 120 54 15 -130 -14 -51 -110 50 144
6612A44k73J09J30j72j4q5J20J22j6m3oQ7M1j4p5j7K8L3J15j67j08M0l1l1m1N0
$$ 144 -129 -20 110 -62 -76 -161 -41 81 65 22 16 103 144 130 55 38 66 99 214 47 -61 -21 -52 -83 -124 -74
6638g4k2Q4p5m0J58K47m26JJ21Ml8K16k46R8O2oj48R6OM1K1j04j12J84N4o7L7
$$ -74 -96 -12 -87 -127 31 278 -148 -147 -26 -22 -60 156 -90 8 70 64 -84 12 18 59 80 -24 -136 48 102 35 72
$$ [...]
8191g3
##END NTUPLES=NMR FID
##END=
