##TITLE=1H_DE-80H_X3
 200.13MHz, d2o
 8 sc
 
 19ns.26.2.2025
##JCAMPDX= 6.0         $$ Bruker NMR JCAMP-DX V2.0
##DATA TYPE= NMR FID
##DATA CLASS= NTUPLES
##ORIGIN= UXNMR, Bruker Analytische Messtechnik GmbH
##OWNER= pz
$$ XWIN-NMR		Version 3.5
$$ Mon May 12 16:01:10 2025 Russian Standard Time (UT+4h)  Yarkov@DPX200
##.OBSERVE FREQUENCY= 200.1313
##.OBSERVE NUCLEUS= ^1H
##.DELAY= (6, 6)
##.ACQUISITION MODE= SIMULTANEOUS
##.ACQUISITION SCHEME= undefined
##.AVERAGES= 8
##.DIGITISER RES= 18
##SPECTROMETER/DATA SYSTEM= spect
##.PULSE SEQUENCE= zg30
##.SOLVENT NAME= CDCl3
##.SHIFT REFERENCE= (INTERNAL, CDCl3, 0, 14.3821)
##AUDIT TRAIL= $$ (NUMBER, WHEN, WHO, WHERE, WHAT)
$$ ##TITLE= Audit trail, XWIN-NMR		Version 3.5
$$ ##JCAMPDX= 5.01
$$ ##ORIGIN= Bruker BioSpin GmbH
$$ ##OWNER= Yarkov
$$ C:/Bruker/XWIN-NMR/data/yarkov2/nmr/H-C/1/audita.txt
$$ ##AUDIT TRAIL=  $$ (NUMBER, WHEN, WHO, WHERE, WHAT)
(   1,<2025-05-12 16:00:12.10 +0400>,<Yarkov>,<DPX200>,
      <created by zg, POWCHK disabled, PULCHK disabled
       configuration hash MD5:
       00 E9 B6 7A A2 85 ED C7 34 08 36 98 17 FE 4E 26
       data hash MD5: 16K
       65 1D 50 CC 82 96 58 F0 6F 36 6C FE 35 EF 8C ED>)
$$ ##END=
$$ 
$$ hash MD5
$$ 6C B3 2B AA 92 1D A5 8C 22 9B B0 B8 F1 2D CC AD
##$RELAX= 
##$RELAX= 
##$RELAX= 
##$RELAX= 
##$RELAX= 
##$RELAX= 
$$ Bruker specific parameters
$$ --------------------------
##$DU= <C:/Bruker/XWIN-NMR>
##$EXPNO= 1
##$NAME= <H-C>
##$PROCNO= 1
##$TYPE= <nmr>
##$USER= <yarkov2>
##$AMP= (0..31)
100 100 100 100 100 100 100 100 100 100 100 100 100 100 100 100 100 100 
100 100 100 100 100 100 100 100 100 100 100 100 100 100 
##$AQSEQ= 0
##$AQ_mod= 1
##$AUNM= <au_zg>
##$AUTOPOS= <>
##$BF1= 200.13
##$BF2= 200.13
##$BF3= 200.13
##$BF4= 200.13
##$BF5= 200.13
##$BF6= 200.13
##$BF7= 200.13
##$BF8= 200.13
##$BYTORDA= 1
##$CFDGTYP= 0
##$CFRGTYP= 5
##$CHEMSTR= <none>
##$CNST= (0..31)
1 1 145 1 1 1 1 1 1 1 1 1 1 1 1 1 1 1 1 1 1 1 1 1 1 1 1 1 1 1 1 1 
##$CPDPRG= <>
##$CPDPRG1= <>
##$CPDPRG2= <>
##$CPDPRG3= <>
##$CPDPRG4= <mlev>
##$CPDPRG5= <mlev>
##$CPDPRG6= <mlev>
##$CPDPRG7= <mlev>
##$CPDPRG8= <mlev>
##$CPDPRGB= <>
##$CPDPRGT= <>
##$D= (0..31)
0 0.7 0 0 0 0 0 0 0 0 0 0.03 0 0 0 0 0 0 0 0 0 0 0 0 0 0 0 0 0 0 0 0 
##$DATE= 1747051211
##$DBL= (0..7)
120 120 120 120 120 120 120 120 
##$DBP= (0..7)
150 150 150 150 150 150 150 150 
##$DBP07= 0
##$DBPNAM0= <>
##$DBPNAM1= <>
##$DBPNAM2= <>
##$DBPNAM3= <>
##$DBPNAM4= <>
##$DBPNAM5= <>
##$DBPNAM6= <>
##$DBPNAM7= <>
##$DBPOAL= (0..7)
0.5 0.5 0.5 0.5 0.5 0.5 0.5 0.5 
##$DBPOFFS= (0..7)
0 0 0 0 0 0 0 0 
##$DE= 6
##$DECBNUC= <off>
##$DECIM= 32
##$DECNUC= <off>
##$DECSTAT= 4
##$DIGMOD= 1
##$DIGTYP= 9
##$DL= (0..7)
0 120 120 120 120 120 120 120 
##$DP= (0..7)
150 150 150 150 150 150 150 150 
##$DP07= 0
##$DPNAME0= <>
##$DPNAME1= <>
##$DPNAME2= <>
##$DPNAME3= <>
##$DPNAME4= <>
##$DPNAME5= <>
##$DPNAME6= <>
##$DPNAME7= <>
##$DPOAL= (0..7)
0.5 0.5 0.5 0.5 0.5 0.5 0.5 0.5 
##$DPOFFS= (0..7)
0 0 0 0 0 0 0 0 
##$DQDMODE= 0
##$DR= 18
##$DS= 0
$$ [...]
##$SUBNAM2= <"">
##$SUBNAM3= <"">
##$SUBNAM4= <"">
##$SUBNAM5= <"">
##$SUBNAM6= <"">
##$SUBNAM7= <"">
##$SUBNAM8= <"">
##$SUBNAM9= <"">
##$SW= 18.0517328524113
##$SWIBOX= (0..15)
0 0 2 0 0 0 0 0 0 0 0 0 0 0 0 0 
##$SW_h= 3612.71676300578
##$TD= 16384
##$TD0= 1
##$TE= 0
##$TE2= 300
##$TE3= 300
##$TEG= 300
##$TL= (0..7)
0 120 120 120 120 120 120 120 
##$TP= (0..7)
150 150 150 150 150 150 150 150 
##$TP07= 0
##$TPNAME0= <>
##$TPNAME1= <>
##$TPNAME2= <>
##$TPNAME3= <>
##$TPNAME4= <>
##$TPNAME5= <>
##$TPNAME6= <>
##$TPNAME7= <>
##$TPOAL= (0..7)
0.5 0.5 0.5 0.5 0.5 0.5 0.5 0.5 
##$TPOFFS= (0..7)
0 0 0 0 0 0 0 0 
##$TUNHIN= 0
##$TUNHOUT= 0
##$TUNXOUT= 0
##$USERA1= <user>
##$USERA2= <user>
##$USERA3= <user>
##$USERA4= <user>
##$USERA5= <user>
##$V9= 5
##$VALIST= <valist>
##$VCLIST= <CCCCCCCCCCCCCCC>
##$VD= 0
##$VDLIST= <DDDDDDDDDDDDDDD>
##$VPLIST= <PPPPPPPPPPPPPPP>
##$VTLIST= <TTTTTTTTTTTTTTT>
##$WBST= 1024
##$WBSW= 4
##$XGAIN= (0..3)
0 0 0 0 
##$XL= 0
##$YL= 0
##$YMAX_a= 75000
##$YMIN_a= -126460
##$ZGOPTNS= <>
##$ZL1= 120
##$ZL2= 120
##$ZL3= 120
##$ZL4= 120
##$ABSF1= 10
##$ABSF2= 0
##$ABSG= 5
##$ABSL= 3
##$ALPHA= 0
##$AQORDER= 0
##$ASSFAC= 0
##$ASSFACI= 0
##$ASSFACX= 0
##$ASSWID= 0
##$AUNMP= <proc_1d>
##$AZFE= 0.1
##$AZFW= 0.1
##$BCFW= 1
##$BC_mod= 2
##$BYTORDP= 1
##$COROFFS= 0
##$CY= 83.5205535888672
##$DATMOD= 1
##$DC= 2
##$DFILT= <>
##$DTYPP= 0
##$F1P= 10.8118882576601
##$F2P= -7.23987719738617
##$FCOR= 0.5
##$FTSIZE= 0
##$FT_mod= 4
##$GAMMA= 1
##$GB= 0.15
##$INTBC= 1
##$INTSCL= 1
##$ISEN= 128
##$LB= 0.25
##$LEV0= 0
##$LPBIN= 0
##$MAXI= 10000
##$MC2= 0
##$MEAN= 0
##$ME_mod= 0
##$MI= 1.114404
##$NCOEF= 0
##$NC_proc= 0
##$NLEV= 6
##$NOISF1= 3.799351
##$NOISF2= 2.8
##$NSP= 1
##$NTH_PI= 0
##$NZP= 0
##$OFFSET= 14.38212
##$PC= 1
##$PHC0= -1188.606
##$PHC1= 9.73375
##$PH_mod= 1
##$PKNL= yes
##$PPARMOD= 0
##$PSCAL= 0
##$PSIGN= 0
##$REVERSE= no
##$SF= 200.129724274929
##$SI= 16384
##$SIGF1= 3
##$SIGF2= 2
##$SINO= 400
##$SIOLD= 16384
##$SREGLST= <1H.CDCl3>
##$SSB= 0
##$STSI= 0
##$STSR= 0
##$SW_p= 3205.1282051282
##$SYMM= 0
##$S_DEV= 0
##$TDeff= 0
##$TDoff= 0
##$TI= <>
##$TILT= no
##$TM1= 0
##$TM2= 0
##$TOPLEV= 0
##$USERP1= <user>
##$USERP2= <user>
##$USERP3= <user>
##$USERP4= <user>
##$USERP5= <user>
##$WDW= 1
##$XDIM= 8192
##$YMAX_p= 0
##$YMIN_p= 0
$$ End of Bruker specific parameters
$$ ---------------------------------
##NTUPLES= NMR FID
##VAR_NAME=  TIME,          FID/REAL,        FID/IMAG
##SYMBOL=    X,             R,               I
##VAR_TYPE=  INDEPENDENT,   DEPENDENT,       DEPENDENT
##VAR_FORM=  AFFN,          ASDF,            ASDF
##VAR_DIM=   8192,          8192,            8192
##UNITS=     SECONDS,       ARBITRARY UNITS, ARBITRARY UNITS
##FACTOR=    0.0002768,     1,               1
##FIRST=     0,             0,               0
##LAST=      2.2672688,     0,               0
##MIN=       0,             -126460,         0
##MAX=       2.2672688,     75000,           0
$$ Real data points
##PAGE= N=1
##DATA TABLE= (X++(R..R)), XYDATA
0@%%%%%%%%%%%%%%%%%%%%%%Qj6J6j6J6j6J6k2L0l2L3l9M5n0N7o2O8p7Q6r6J07
43E6j17J29j43J58j75J93k12K34k58K84l13L45l83M26m76N35o03O85p85R13j081
64e88J314j661K216l266N900k5587l9599N8665M4279P20K178J5821J4061j591
78G2862k2380k6292k7364j0160j4829m4650j4062K9293K664r998J4703K9316L4971
91A4074K2298Q561J4111P631J527r707l4156j4665Q071k5106l1408L511J5181
104b0077j31j8058p891J6246P586L94M690J898K4361K8745j1818m227K7156Q959
118E7833j9158k0365l258M011j8966k8041j5949r149J0118R268j2412J2211L8794
131D937J7327P90L113J0106R237j5370j9788j397k478m080r621j9541L401J4594
$$ y = [0, 0, 0, 0, 0, 0, 0, 0, 0, 0, 0, 0, 0, 0, 0, 0, 0, 0, 0, 0, 0, 0, 0, 8, -8, 8, -8, 8, -8, 8, -14, 16, -16, 17, -22, 23, -27, 30, -32, 36, -41, 45, -51, 56, -61, 68, -75, 83, -92, 101, -111, 123, -135, 149, -164, 181, -202, 224, -252, 283, -320, 365, -420, 493, -588, 726, -935, 1281, -1985, 3915, -21672, -61271, -2606, 41673, 42393, 44571, 60392, 74453, 72862, 50482, 24190, -3174, -13334, -28163, -72813, -86875, -57582, -54918, -64916, -50213, -20897, 14074, 36372, 44933, 59044, 66675, 68202, 58495, 24339, 9674, 17745, -7361, -38769, -35258, -20077, -20208, -38266, -46157, -29911, -22325, -21931, -17241, -15343, 9018, 37763, 25945, 21718, 48874, 57833, 38675, 18310, 15052, 19063, 97, -27944, -43893, -53042, -42924, -33656, -46068, -33857, 4937, 22264, 23054, 26167, 36273, 45510, 30140, 10352, 8955, 6477, 2397, -7224, -26765, -23364, -8770]
145h770j0284j0698P866J7081R013q819K699J9628K695m098j158l388J0237N816
159B7820k0104j1478N007k173j4851j7929K454J4650k360p73R562R546J6577M532
173B0480j3382O549J6345l442j4521r914N407L770j8516j3962L099J704L318l602
187a6667n868J5152J4794m739l144P232J3524L751j4028p19Q800o597r772j0149
201h430r148O130R61j2185O74J3299J1556o47p193J0907J3812o655n194N82P65
216I234N890o522j4828K512O815m431j1214n643J0822M348j2655j497R097N255
230b817N865q79J10J4803Q722n385p386k166N091q033k0976l684M699m610k504
245a9150j756M170J5209N356l514L964R311P553p353j2691O190M727j0943n966
$$ y = [-8770, -19054, -29752, -21886, -4805, 4208, -4611, -1912, 17716, 20411, 16313, 15155, 11767, 22004, 27820, 7716, -3762, 1245, -928, -15779, -33708, -31254, -16604, -18964, -19737, -10175, -629, 15948, 20480, 7098, 13647, 29992, 26550, 12029, 2115, 7522, 11292, -7224, -21186, -18087, -16383, -13065, -16667, -22535, -7383, 7411, 2672, -472, 6760, 20284, 24035, 10007, 9288, 18088, 11491, 1719, -8430, -17578, -11448, -10487, -22672, -21998, -8699, 2857, 2210, -4983, 5924, 19736, 13081, 7887, 8469, 9234, 15124, 8602, -6226, -3714, 3101, -1330, -12544, -18187, -7365, -3017, -15672, -17169, -8072, -2817, 3048, 2169, 2279, 17082, 25804, 20419, 13033, 10867, 15958, 7925, -13051, -16735, -12036, -16646, -19150, -20906, -16736, -1527, 3829, 315, 4279, 13590, 21143, 13790, 1099, 7289, 12016, 1073, -4893]
259d893k84L186N476n350o584M571M183k426q964m637J1565M209p891L808R754
274E723O376L746m494j970N543k336r838j0472l973O304m975j1608O686J1244
288d044L046J485O72O088P792l949p590k818J601K686q754p824J0012O432n069
303b34j417K301M111J258p821m583J649J825J6o176o07J3440L295o123K597N249
319H780J978l357q527j727K848k403l959m267L700J0967k253o329O986O008j874
334F571n223m710K656J921n257l039R58N052O434m925k787R548K829n821m367
349a60q12L317j680p438n26L122L292J501n468J089R943o69o990P1L671K234l541
366I56n090L804L960p74j351l736K766N546o142o211L193L056j289m372q16O328
$$ y = [-4893, -5177, -1991, 3485, -1865, -8449, -3878, 305, -2121, -11085, -15722, -4157, 52, -7839, -4031, 5723, 12099, 15845, 11351, 9381, 14924, 12588, 2750, -7722, -11695, -5391, -10366, -21974, -15288, -4044, -998, 487, 1159, 7247, 15039, 11090, 3500, 682, 2283, 4969, -3785, -11609, -1597, 4835, -234, -1651, 650, 4761, 6019, -1802, -6385, -4736, -2911, -2895, -9071, -9678, 3762, 7057, 934, 3531, 8780, 10758, 7401, -1126, -2853, -5, -2408, -6367, -10634, -6934, 4033, 1780, -4549, 2437, 8445, 6571, 1348, -3362, -706, 1215, -4042, -7081, -6123, -1071, 5363, 438, -2349, 7199, 10028, 4207, -160, -972, 2345, 665, -6773, -7299, -4177, -885, 616, -4852, -3763, 6180, 5511, -1479, -1408, 2263, 4497, 956, -4134, -330, 3630, 2856, 1505, -2231, 535, 6081, -61, -6272, -3079, -23, -1312, -5684, -6500, -172]
382a72K392k155L12P19M237K851p071k759N574L18m471m562J052M907k185n132
398f145J524K544K536L36m936K880P640j558m305J1L712K471n679m356L271L33
414B79j895k207k708L846M876l961j849M038L878j10n074l58N192j006l674p98
430a531L7L590J076n843m09M515M44l689l808K536M981k643k830L501K667K590
446E184p23l987K524L380m087n183j877K075J112o101n19N247K822J655M95j55
462A862N077K154n059l218P10J283k406o374Q35M730j448j983K46J093M030l29
478A203m341J190L697P68k464j919M564M787l416j425K208l74r13m545n434P10
494e704L40k344k360J314O887L924k343L063N750J054m00l136k543J823j969n977
$$ y = [-172, 2220, 65, 377, 1096, 5333, 8184, 1113, -1646, 3928, 4246, -225, -4787, -3735, 1172, -1013, -6145, -4621, -2077, 459, 795, -4141, -1261, 6379, 4821, 516, 527, 4239, 6710, 1031, -3325, -54, 279, -1616, -3823, -6531, -2685, 2191, -1770, -3619, 419, 4297, 4187, -887, -1245, 3947, 2941, -733, -1531, -1494, 2096, 3172, -2671, -3080, 1435, 1879, -1810, -5618, -3082, 1899, -744, -3574, -73, 2594, 5184, 4461, 474, 2998, 6378, 2291, -2892, -4769, -2694, -1582, -7683, -8202, -2955, -133, 1522, 2017, 1862, 6939, 9093, 4034, 816, 1526, 2809, 403, -5971, -5136, -406, -1854, -3837, -3591, -2498, 1532, 1203, -3138, -1948, 1749, 2517, 53, -1866, 2698, 7485, 4069, 2644, 4852, 4478, 3565, -980, -6414, -5704, -5364, -7708, -10068, -8754, -1867, 2057, -286, 2777, 8527, 9581, 9181, 6045, 3502, 5325, 3356, -2621]
510b621l483M15K581j771m230L860N080r72r59N48J409L412j056k139K665L326
526F065J511k301k914L090L4o140l579n38q81o10l154m78L901L528J706N30K747
543B517O781J543m629K51J521k575l840m488j305J573j786j908p58K289L957j499
559b356k911M452L765q24l64M98K569J809k308j649K86M92m45m497l383K514k36
576b588m561j158K049L119J839o88K493M588J466K67k416m06L032k735n698j49
592a546Q93j393k628k314J804K426n34K46Q87K732L531j458k107L277J869k038
608C647k020j050J788k53l809j344k59P56L96k517k52M830J007j850M26K005K839
625D340p67k529J251J449q67j329k935m88K297k732l195J079K356P64r80j86L607
$$ y = [-2621, -6104, -5689, -3108, -4879, -9109, -5249, -169, -1141, -2100, -1552, -143, 3269, 2213, 74, 2739, 6065, 7576, 5275, 2361, 5451, 5485, -655, -4234, -4772, -5653, -6263, -9417, -9895, -5994, -2466, -760, -230, 2517, 9298, 10841, 6212, 6463, 7984, 5409, 1569, -2919, -4224, -2651, -4437, -6345, -7103, -4814, -857, -2356, -5267, -815, 2950, 2126, 1762, 2260, 4829, 6638, 4330, 2681, 2967, 3459, 3014, -1483, -4866, -2352, -2588, -7149, -8307, -6258, -3139, -1300, -1988, 505, 5093, 6559, 6826, 4410, 4004, 7036, 4301, -1397, -1546, -653, -2046, -4674, -6988, -5184, -2758, -3292, -3046, -2159, 573, 4104, 2646, 539, 3816, 5685, 3647, 1627, 577, 2365, 2112, -1697, -3041, -3300, -2544, -2148, -4665, -4917, -87, 920, -930, -504, 1501, 4340, 3573, 1044, 2295, 3744, 2877, 1548, -1387, -1875, 422, -2310, -5505, -4426, -2070, -1306, -2286, -2472, 1135]
642A135K145o69K00k61J364J641l678k901J102j91k452k402k48L069O00j345J438
659a453J956J923P84k248L04K905q56k352p90O41J457k452k609J078P27o73q42
676b500j753J603K551j405r89J990K634J916j424M3K641J38k580j905k171j69
692a380k16l928q79K135J550L94m51J955M072K38j155R10M55N05j035l351o6J390
710A143j349j718j074J623J339k167j414J496M59L86l20l71K494K778q93k52J246
727C406J523n5l387j317O96j224k678j692n00J878P69j251J425L064J998j0j264
744A381J555J900k010k065k5m28L31j035j754P98J269m92j169r30J709J412k263
761a816m95K104R62O60p17p2K248Q13j629j024l53R90j375l449r6J632k99q46
$$ y = [1135, 3280, 2611, 2811, 2550, 3914, 5555, 1877, -1024, 78, -113, -2565, -4967, -5215, -2146, -1546, -2891, -1453, 503, 2426, 3210, 962, 1266, 4171, 3315, 963, 173, 814, 2271, -181, -2790, -1712, -985, -1658, -2500, -4253, -2650, -99, -1504, -2493, -503, 2131, 4047, 2623, 2666, 5307, 5445, 2865, 960, -1211, -1380, -1596, -5524, -6403, -4268, -2718, -2324, -2775, -820, 3252, 3490, 2335, 3245, 3700, 4205, 3170, -181, -247, 1143, -206, -1924, -2998, -1375, -36, -2203, -3617, -2121, -1662, -1276, -1596, -1967, 527, 3305, 2412, 2160, 3406, 4929, 4874, 1487, 170, 866, -358, -3036, -4728, -5228, -3350, -2581, -3832, -2407, 657, 2655, 2645, 1381, 2936, 4836, 2826, 761, 736, 308, 639, -396, -2150, -1352, -83, -575, -1744, -2674, -965, 447, -1816, -2311, -207, 755, 1415, 698, 626, 2874, 3687, 2058, 1034, 681, 1671, 296, -3153, -3249, -1617, -1916, -2762]
779b762K36J384K185N2o61N72J118P01j463j986J242R62j906j314N95M78J206
796F39j311o94J387Q43m82j285o97K205O85k328M0J729L59j29j203j10J595l95
814H48j088r43K53J628m67j951J009J548n37n44j27Q84R69j037q68m3N29Q12j297
833d22j681J799J187j109m63M59R95P72j487l39J265Q7l57j356o30J762k17j980
851a715K2J388N48j96j099J041J483o41m05n27M59J029p51j843R73P44m56l77
869c23p35J000R39j242o69M30J73J007j450o38K066P95r90k84L80J315R8j913
887d1M1P9l41m13j275L3J764M2j123R89Q46Q15p21j030Q82O58p08r12m37K27J469
908H44j074q92J337Q15m9j108m36J226j38j424k05J26Q02M52j049j36K008K91
$$ y = [-2762, -2526, -1142, 1043, 1095, 434, 1006, 2124, 2825, 1362, -624, 618, 1580, -326, -1640, -1045, -567, 639, -672, -1366, 21, 864, 382, -903, -1600, 605, 1290, -1038, -998, 731, 1090, 961, -242, -352, 1243, 848, -240, -1183, -930, 698, 231, -1720, -711, 837, 300, -244, -371, 513, 1482, 445, -423, -466, 63, 875, -422, -2103, -304, 883, -226, -689, -230, 765, 1537, 50, -289, 976, 1063, 706, -650, -1280, 482, 265, -1715, -1693, -305, 243, 47, -1052, -11, 1472, 831, 426, -101, 358, 1387, 636, -1207, -234, 510, 54, -323, -1058, -58, 881, -361, -1030, -600, -427, 580, -870, -1508, 558, 1353, 363, 79, 459, 1774, 1872, -41, 0, 79, -262, -675, -1950, -1917, -153, -111, -1234, -245, 601, 1416, 695, -335, 547, 1205, 497, -415, -852, -625, 844, -230, -1122, 215, 1030, 981, -127, -563, 663, 525, -899, -1104, -978, -176, 276, -773, -909, 1099, 1390]
926A390q35m09K26R32q53j700N71N15o6J58p33O37J352m87q26p5O39K31j357r83
946a673J040L70k12k6K4J187J216q96o88O88N05q94j394n22J174k79j250J44N87
965h99P36P02j095N48R26J47q95o23O11J178p20p96L88K77L66m15j194J77Q15
984B34q90q77k79O97P97q92k06J693Q23R9l4J3Q06P1j314o59l4p8m73j544J61
1005a886J329k68o59M03N32J110J59r91P57Q86j53l46q22Q25O88j005j091J41
1023c91K27l6j012p79J215J82o41J22M63R97P80p78J75J177Jk23m93n95N16l90
1043E17j481j95j04N06l42q45P01J113j41j1N09O20P78o05n24J97M85k17r55r74
1063i68O16N76j311k36M78M68P9m06k6R69J77J40n26K22J046o3j036J1O42k54
$$ y = [1390, 555, 146, 372, 1304, 451, -1249, -678, -163, -229, -71, -804, -167, 1185, 698, -128, -203, 436, 667, -690, -1673, -633, -263, -475, -501, -477, 710, 1926, 1030, 342, 1030, 1535, 641, -753, -1275, -101, -380, -1630, -1486, -899, -163, 539, -556, -8, 918, 1065, 170, -453, 158, 1336, 616, -180, 208, 485, 851, 436, -758, -581, 234, -656, -1533, -1812, -1115, -318, -1210, -1416, 277, 1100, 1199, 1165, 1178, 1984, 2055, 741, 82, 48, -30, -503, -2047, -1886, -557, -825, -1484, -1081, -549, 561, 720, -271, 486, 1372, 1219, 873, 51, 876, 1564, 559, -532, -391, -164, -200, -1212, -1991, -776, -594, -1235, -1113, -650, 347, 1127, 349, 524, 1701, 1702, 1479, 986, 391, 907, 517, -964, -1159, -1263, -757, -1099, -1944, -1243, -130, -271, -282, 227, 847, 1625, 1020, 496, 693, 1178, 961, 6, -968, -352, 224, -1087, -1323, -845, -377, -298, -704, -730, 239, 416, 556, 30, 252, 1298, 1235, 199, 210, 852, 598]
1083E98l57r45l91Q43l48n61J39L20R25Q7p62J305M58l05j78k41K26r8j182n37
1103a004M86j81J18l95k39J341M37o48J02M52N00j59p77m9N20j05k23m96p8N42
1123A44pj021K06O66m4m11n66O62R01l71l4K09O52O86p87p03N26J65q67q41m15
1144a250N40k1p96J39J064K90N66k82J97R31O4o40j71j60J06m27o00k89M50l26
1164f15j14k99%J195m42n83N87M47M68q6k68P79K00j94j59k57l27K62j059q91
1184a356N30j80k40k96J31J107M18l37N84P27K57J88o07l30M91m32q80n69K56
1203e38N21n27q37L99K57J18nP7L19J125p16mL61M91P8m98l22M93n4q80l36k71
1225g49J9J84p72j80Q12L27K33l96O50Q35O7l89J86J72l50J15j072J96K1l94n85
$$ y = [598, 241, -704, -1095, -252, -600, -1161, -1022, -702, 223, 310, -452, 853, 1311, 1006, 828, 587, 813, 715, -467, -1004, -518, -699, -581, -976, -1215, 126, 563, -85, 17, 469, 969, 810, 33, -16, 504, 399, 176, -320, -398, 144, 137, -884, -678, -12, -56, -467, -1033, -371, 530, 159, 125, 334, 986, 1672, 885, 182, 708, 873, 6, -835, -1250, -710, -731, -1527, -1388, -324, -34, 532, 250, 447, 1378, 1442, 802, 631, 471, 577, 150, -450, -739, -289, -615, -729, -1028, -1028, 167, -275, -858, -271, 176, 644, 558, 290, 1069, 1269, 1075, 916, 659, 332, 594, -465, -1356, -826, -1006, -1246, -1542, -1411, -304, 114, -223, 361, 1088, 1345, 1533, 926, 596, 1087, 655, -225, -794, -538, -17, -544, -1381, -982, -725, -607, -612, -535, -216, 909, 193, 189, 550, 1041, 1119, 621, 299, 792, 738, -142, -478, -749, -730, -546, -1318, -1498, -686, -359, -126, -522, 128, 963, 1030, 641, 827, 999, 649, 764, -308, -112, -91, -485, -1070]
1246a070J28K75M30L5m09N60M68j29m4j56M01M99o14o2j55J05L8o03pL87j60l44
1268d27lj12M36Q0l52J90M35P1J45m02J63N93m67m71p0J40m3l00o42M50N34M7
1290ek39j8O49M35n55l3K63k97k04n6l69K87J74n50m2J75L43L02m08n7O87j70
1312C12j50q2j0L83o7n24J73K9L50l77m14J29M07m91l54J80K58K51j20M1N03K04
1334F31m2m9q3K00k56p10o0J26j90j08k91Q0Q10M5j36J89J32M69k07m33K65K16
1356E98l69k81j75J88L32m01l82K70N7qk40j67K03M71j15j99M70J07M07m27M0
1377C79K50o7k90j83n59M93k04q11O5N81k29M88m54M41N40O4k98l2J3J38r3l99
1399a67J92J08m7m4l06J2M68l88k96J46mK90j07l32N72L1Ll5QM52m0o51L16j33
$$ y = [-1070, -942, -667, -237, -202, -611, -51, 417, 288, 244, 88, 489, 988, 374, 312, 157, 262, 300, -303, -310, 77, -83, -427, -430, -542, -106, -26, -378, -188, 247, 318, 463, 61, 224, 817, 350, -121, -191, -51, -94, -394, -1036, -586, -52, -5, -244, -262, 387, 822, 267, 234, 497, 200, -4, -60, -429, -142, 32, -518, -560, -385, -42, 260, -148, -205, 482, 312, 162, 80, 70, 453, 386, -138, 35, 64, 414, 37, -377, -248, 159, -332, -686, -506, -248, 3, -117, -76, 427, 631, 589, 540, 457, 657, 401, -309, -369, -243, -433, -541, -832, -752, 58, 103, -33, 156, 288, 757, 550, 117, 382, 598, 229, -52, -227, -39, 293, -108, -490, -220, -163, -171, -411, -578, -375, 96, -19, -218, 252, 359, 766, 339, 379, 629, 562, 272, 89, -470, 23, -181, -992, -927, -346, -575, -87, -541, -100, 440, 504, 206, 174, 187, 325, 232, -167, 25, 133, 86, 42, -264, -252, 216, -172, -468, -322, -326, -36, -143, -475, 97, 128, 131, 96, 104, 556, 516, -135, 181, 48]
1423D8k9j10j80k08N11k21l27K05K39J58K34k95K1J95k8l21q2K12K79k30m96O47
1445B22j38K87m43LJ80J4j42k69J39R7m0k94M4M97j14J6j40J14K50L4l62K00J98
1468C53j8j69m71J95K36kl19m4M3K14Lk24P1M56l63K8O0J5K07j89K9J82l5k7k40
1493ij8K61j76m18J19j77J92L28l09mK48J40J6LK17J96k34m32P7p2p5j12j06L11
1517c4M7k32j76K31j2M51k86j75K68J61k35N5pK59m4n7j01L46o2l72m37P7N68
1540B33l94l10K77J40J02K78j22J35l7j49m2j23r3L45l00k67N2K8K48k28L8K47
1562E8J11j80L3j60J84Q6j83k20M80j23j14O8n8J40l9j48j75O5J96P0l92K94L59
1585C52k57Nk5k6K30k32k48K20Rj73m7l14M33J83j07j26J17K10NJ7k19K66M9k63
$$ y = [48, 19, -91, -271, -479, 32, -189, -516, -311, -72, 86, 320, 25, 46, 241, 213, -108, -190, 22, 301, 71, -425, 222, 84, 371, -72, -69, 111, 125, -17, -286, -147, -50, -90, -384, -340, 157, 43, 59, -81, 33, 283, 317, -45, 155, 353, 335, 166, -305, -110, 126, 124, -195, -239, -196, 18, 21, -203, -132, 324, -39, -11, 49, 64, 271, 82, 111, 293, 258, 231, -9, -27, 234, 58, -360, -241, -418, -226, 102, -207, -211, 37, 177, 193, 196, 413, 609, 375, -57, 20, -52, -127, -239, -345, -34, 13, -219, -395, -164, -176, 275, -11, -186, 82, 243, 8, 63, 56, 315, 271, 214, 113, 459, 397, 25, -412, -335, 233, -161, -471, -194, -54, 48, 326, 204, 339, 302, 153, 111, -12, -105, 240, -60, -327, -275, -247, 1, -227, -189, 58, 169, -11, 22, -138, 46, 132, -51, -271, 209, 86, -28, 40, -18, 122, 83, -65, -240, -175, 21, 91, -301, -7, 352, 95, 100, 75, 49, 279, 47, -201, 19, 28, -145, -192, -506, -73, 110, 3, -123, -6, 204, 209, 226, 7, 273, 322, 59]
1609E9j12j17N0J05k92J90l0K08p5j81J05K22J43j73j40L24q1J30l65j3K64k84
1631f3R5j73K1P8k57mk18L78J2J35k04M82r7p2K62q9l7J58l95j87K45k63o1j80
1655d34p0J58M06m42QM29J13J7k51J85L22J53l62J21k07J44q1l27j7J61j18l70
1677d62%K83J58k05k2J65J25K08k5K10J38j65j74p5K11l02k76l8o7J20k6k68J76
1700c11L4M82k6k32L98r0K83l91o7K06Nk23Qk22O5J22k41p2K06m0j29J55k5L31
1724B26O3k04n6M3N5K38j78k42K83j02j58k97K01P5jk35J67Q2J4P3L6R1K12j26
1748B60k47P1J52j25k76q4J15J47j35J42k30M61j80j25j18K96J5j85N9J36j65
1769a6L4o1K67k45R8p9j24N3L31m08r1O7P0K54j00K11l36L88j30j11j32Q3Q7j63
$$ y = [59, -53, -170, -120, -15, -307, -117, -147, 61, -14, -195, -90, 132, 275, 102, -38, 286, 205, 335, -30, -43, 221, -63, 32, -141, -120, -42, -299, -303, -521, -143, -131, 4, -200, 282, 185, 113, 375, 286, 249, 407, 12, -175, 70, -193, -254, -434, -504, -346, 60, -382, -374, 55, 168, 185, -66, 119, 441, 594, 232, 353, 146, 290, 209, -118, -135, 26, -92, -462, -462, -179, -21, -226, -248, -83, 42, 250, 225, 435, 573, 408, 234, 159, 370, 68, -208, -246, -313, -193, -219, -487, -311, -277, 205, 179, -53, 345, 255, 538, 147, 80, 286, 291, 68, 76, -146, -81, 41, -200, -272, -66, -106, -235, -80, -105, 226, 289, 85, 29, 72, 127, 365, 187, -55, 228, 126, -32, -329, -128, -53, -54, -289, -122, -40, -26, 47, 83, 174, 386, 260, 13, 84, 236, 111, -165, -249, -134, 13, -122, 20, -210, 251, 71, -54, -172, 124, 139, -46, 13, 149, -16, 18, -43, 224, -21, 77, -2, -126, -73, 258, -150, -241, -174, -104, 150, 50, 261, -75, 313, 183, 72, -60, 23, 110, -53]
1793e3p0K8n4j16J04N6K94l1k38K38n8K34j62o4j59Q2j34M3k04Q4L14m34r4K65
1817a29J65K16m03q3L58o9P7J5j71J27J25l43Q4J82r3l39K10j89J09j65j25K10
1839b31J34ML48k59Q5K88j14q3%k59K49j3l60K32q9k6k5o0Q0K12m50J0K78k9K21
1864A43K39m63L42J5J17k78r8n9J3n9J81l36J38q8K5j03L23j02p2J35k8M50j51
1887B84l29K41O3j87j24j3Q4N8l27OL7j3K63k61k13M71J3K0N7j51K0J93j65r1
1911f4J85r7M2Jk00K55n4j9m08L00m5J62l11M71r3j98L53l8l34kJ04QO6k86J88
1936a4J4j95L7L42k21oJ73p3Q2j17lN3j71q9k8K03m0L1o5R4Q3o6J31k20j14L25
1962A46O5n01J75K11o1j04J20n8J59l71K30j39J05P5j20K6L7Q9n8M6j20j17L75
$$ y = [-53, -123, -95, -149, -265, -161, -105, 189, 158, -80, 158, 100, 334, 172, 108, -51, 31, -103, -60, -264, -180, 134, -300, -394, -129, 36, 252, -151, -234, 124, 55, 132, 147, -24, 103, 228, -115, -31, 151, 58, -281, -71, -260, -151, -316, -441, -231, -97, -93, 255, -4, 81, 369, 255, 172, 172, -87, 162, 149, -211, 21, -68, -94, -119, -179, -99, 113, -337, -327, -49, -78, 143, 382, -81, 261, 276, 393, 115, 17, -42, -29, -88, 93, -243, -105, -193, -168, -271, 52, -50, -122, 13, -15, 435, 284, -45, 196, 259, 72, -52, -65, 19, 77, -250, -244, -207, -220, 43, -218, -431, 40, 53, 73, 130, -21, -1, 192, 27, -64, 121, 24, 66, 67, -133, 122, 68, 49, -359, -59, -104, 58, -253, 218, 125, -73, 280, 242, -92, -94, 10, 18, 84, -202, -14, 0, -195, -158, 184, -37, -43, 130, 57, 139, 22, 19, 72, -99, -188, -216, -13, -53, -22, -87, 7, 90, 24, 155, -65, -179, 146, 211, -290, -115, 96, 35, -69, 51, -7, 152, -219, 11, -128, -23, 52, -68, -42, -5, 84, 26, 72, -48, -165, 210]
1985B10j29l8J93l21J92m82L25M4J14j23j36K03L3J75m14L68K80m29J30l47K50
2006I8r6pj29J01o4N2J36n5m6O0j55K05m5p4L22m62J32L42j97L7j71k1K10j8k22
2031f7j2K5Q2mk39J42O8p2K4m3J39L2K9o6L0K11m40K91k96j8L86k75m7P8J33R4
2057A85k1l12R8j04Q3M4r6K40j04n8N1P0k9J36k10j11K13p7j8O7q0J32k4j74J75
2082G6O5l50J98j77O1L98j30j69j44L38j3l2j73N5J69j08J65l06J40K7l0j29L8
2105c1j79K09j12j25K63o7J32j6O7j73J65k58J95N6J3Ol06L9J76Ln7Q4j57j28
2129b01L10M3l55J98J08p8O2j75K09J01l11J10K85k79l2q2M8n8k07k8J69K89j55
2152b9j02J50J20p0j19J74L2l0O9m44J24K42j78n4o6O0n2r4J78Q0K5J17K10m36
$$ y = [210, 81, 43, 236, -85, 107, -375, -50, -6, 108, -15, -151, 52, 85, 260, -154, 214, 494, 65, 195, -152, 98, 2, -5, -134, -33, -97, -45, 91, 36, -10, 50, -105, 100, 55, -19, 303, -159, -27, 315, 118, 155, -16, -37, 173, 155, -67, -79, -54, 28, 24, -215, -73, -5, -77, -53, -96, 43, 75, 104, 38, 68, 279, -161, 130, -166, -184, 202, -73, -120, -42, 91, 185, 164, -148, -50, -154, -71, -27, -123, 117, 13, -45, 6, 76, 47, 183, -27, -138, 75, -2, -20, 47, -33, 99, 75, -99, 76, 141, -209, -11, -188, -127, 271, 141, -28, -172, 166, 153, 121, -52, 3, 172, 64, 229, -77, 63, 90, 60, -69, -31, -210, -1, -113, -238, 25, -42, 90, 74, 141, -32, 133, -125, 70, 126, 139, 145, -161, -122, 54, 57, 0, 84, -73, -201, 109, 152, -203, -5, 103, 25, 87, -88, 121, 222, -89, 21, 306, 27, -5, -87, -39, -97, -304, -332, -163, 126, -29, -131, 19, 139, 69, -50, 124, 156, 126, 195, -249, -125, 117, -61, -115, -181, -121, -173, -267, -89, -9, 16, 133, 343, -93]
2176i3jJ63j10L33l09J68j11J34l79P6K13Jl17O4K88R0l42J58k35L99j29k10K07
2199E8N9j07j48K32j78J25j27R1l9J41m89L66M7J11j79o6p0K28J73j44n5l8J3
2222Dr8J18m6O1j5N7J8j91JK81k95J03k78J61p9J90j26K66M1j79l01J65J96j26
2246g2q1o3J82k2LK18k47R2k7N2J29j60J85k27M7M9j92R6j04Q3j8J50k17K07l8
2271B5Q2l16K8K56J14o4ql4j35R0j63L5q3J96J29j41k15J00K06l27O5N0J89M8
2295A27j55P9K13q7l00L36l67J31k4p1j31J4k9K62K5k85N10j51O6k93L3R4J24
2318A21r9J36j18M4j4j55L7j71J21m5P1m3K04J16j29mL5j0p9J38J6k96N8K63q6
2343A11j56k61K12L9k3r6J17K1L9l36M14k18K91N8j45p2j68J24L0P4j46J8j8J14
$$ y = [-93, -94, 69, -41, 292, -17, 151, 40, 174, -205, -129, 84, 85, -232, -168, 120, 210, -132, 26, -209, 190, 61, -149, 58, 117, 10, -138, 94, -84, 41, -86, 5, -34, 107, -382, -16, 31, 142, -37, -103, -173, 55, 228, 84, 29, -9, 4, -94, 24, -22, 39, 24, 81, 99, -92, -91, 190, -105, -2, -280, -119, -198, -8, -134, 132, 173, -6, -307, -142, 54, -72, -153, -216, -34, -56, -53, 165, -82, 10, -17, 35, 164, 4, 189, -38, 9, 58, -134, -38, -142, -59, -77, 73, -144, 63, 25, 107, -209, -181, 75, 189, 125, 117, 83, -52, 38, -125, -90, -173, 23, 152, 11, -204, -104, 102, -225, -160, -110, 79, 127, -28, 51, 264, 177, -123, 213, -154, -23, -47, -118, -249, -235, -264, -2, 23, -262, 248, 97, 163, -130, -97, -3, 121, 22, 158, 40, 84, 70, -85, -48, -219, -98, -143, -72, -115, 89, 205, 76, 72, 107, 97, 18, 156, 172, -124, -66, 197, 111, -45, -306, -94, -55, -78, -174, -57, -36, 3, -333, 81, -137, 154, 212, 67, -5, -173, -49, -19, 55, -91, -73, -91, 23]
2367B3l11o4K19K87l28J35J43j40K98J4l57J16J00j72P7k4J50j52Mj6k38O3%P0
2391a03K4L9m4J1n3J27joj18J53o3r6J18P5k9oj14l9J34o1J44q7l6m0O1J1p1m4
2419a14K94q4j64Kj16J67j34J34M2kn9R1K2k4l7M4l5o9J72k50J23k8J3J07p4o8
2445d7L16j45O0m1k03O9J76j61J60j21J45j90j17j89L28j48J48k38J91K05l38
2466a40J09j02Q7j40K46k16J25K23k08r8kL25J8p8p9QJ04j11k7m4N8K6j90R1j23
2491a38j6K78O4j52J13j00m8N3j08JP4q7j34K08P5k54K31j9P6q0k69K90J65r3
2515A30k88J83N0j50J9O7P5j83J46j22K03k27M1n9q3K11o0P3J2J21j10j7J0j6
2539B6p5o3K36r4k17K05n1m7J41j27M6n9J41J3j72L36k06p2J81k25J78J1o7qq0
$$ y = [23, -288, -352, -133, 154, -174, -39, 104, -36, 262, 276, -81, 35, 135, -37, 40, 16, 166, 14, 18, 2, -236, -173, -173, -103, -79, -40, -84, -73, -126, 1, 0, -6, -124, 29, -34, -130, -12, 63, 34, 28, -86, -125, 9, -52, 92, 5, -31, -71, -10, 1, -70, -114, 180, 96, -68, -66, -182, -15, -149, -15, 27, 25, -34, 57, 79, 55, 18, 62, 27, -42, 130, -120, 3, -25, -12, 95, 21, -47, 269, 124, 184, 143, -60, 9, 185, 24, 184, 63, 208, 18, -99, -288, 40, -108, 40, -198, -7, 198, -140, -31, -133, -46, -186, 60, -156, -31, 192, -16, -114, -116, 209, 227, 149, 70, 78, 182, 71, 44, 0, 58, 84, -106, -15, -138, -154, 124, 188, 36, 149, 49, 1, 54, -54, -53, 21, -66, -200, 8, 83, -171, 60, 41, 117, 37, -232, 58, 223, 130, -158, 25, 75, -75, -56, 11, 86, -97, 49, -73, 130, -97, -56, -115, -198, 13, -47, 26, 38, 159, 49, 32, 42, 26, -49, -112, 124, 30, -187, 18, -33, -80, 61, -66, -20, -79, 62, 75, -97, 239, 33, -39, 142, -83, 95, 106, 39, 31, -49]
2564d9J07l4N3J26j17O3j25m0L1L8k9o8r0Q1K00j12k1j65N8L11l16K36k56Q6J49
2589A17j84L8Q2J64j35J40l22j74K20Q0J04l9j6j47J43J7J92j59ml0r0m5J40l09
2613b17O1K10J65l46L1K35m00N15k48L7j0j10q7K25k55J99j98K04m4J34m2n2J1
2636A8Q9k03K80j75J46j59k7j70L48j37j5J97m43K51O3j58J75Ok28K45J8R5q7
2659A29l19K21O4l58K36JK54m4j9k56PJ6K1J80j77K5Q1j94J53k6J03j32j47L23
2683A42l1j79q1K00j15Q8J08rj34P3om6o0K07j78J7Qm3L9J50j23j81L16k53L15
2708B24r6j7J37l72o6J14k66M43k36K29k36L95j78N6j90J7K3q4K75j98L54l79
2730e1P9M7L23l41j27O0N8M1j98J69n3k41K45l6j7J2K44k27K7j10K30p3J33o3
$$ y = [-49, 58, 24, 77, 203, 86, 149, 24, -16, 15, 53, 24, -44, -134, -53, 147, 35, 14, -151, -93, 218, -98, 138, -118, -32, 117, -67, -29, 53, 217, 82, 222, -100, -274, -54, 26, 130, 91, 75, -72, 71, 88, 280, 121, 117, 87, -3, -48, 92, -217, -156, 54, 219, -127, -96, 139, -261, 254, 6, 43, 33, -77, -164, 61, -194, 5, -193, 11, -33, 101, 59, 7, 18, 107, -96, 184, 9, 155, -4, -31, -201, 147, 10, -5, 192, -251, 0, 63, -95, 80, 86, -142, 103, 121, 216, 129, -190, 31, 95, -263, -27, -26, 228, 184, 165, -91, -84, -68, -47, 133, -44, -19, 62, -132, 21, -5, 98, -34, -181, 142, 111, -68, -149, 51, -64, 24, 132, 123, -11, 62, 56, 10, -50, 157, -21, -4, 4, -39, 0, 150, 27, -154, 162, -91, 224, 128, 111, 248, -124, -190, -76, -342, 101, -135, 94, -142, 253, 75, 131, -59, -42, -19, -103, 172, -26, 328, -51, 28, 75, 398, 57, -70, -10, 48, 89, -109, 60, 7, -234, 11, -25, -42, -30, 214, -13, 14, -96, 134, 61, 194, 131]
2754A31j88J61o2J19k05k20M20j85j10K33j8N6j26Q2j42J60j94Q6J55k77J62j81
2776a43R7Q4k62L44k81K66j98J12K3j38Q2J42k3r0j5q5K35q8j55O2K3m1O4j03
2800h8K13j61J59J9j49J3K74k85K08j39l4j53N9M9o0J32j7m2L9m1o5j13L02m9
2824G1nLj72J99l0j34n4K64Kl40J40j3m1Q6R8k09K82j51P5m9r3J64J5j36p4J72
2850G0k10M94k78o4k4j8l7N3J49o5k79J8pJ94kj75N74m21N7j92J65j07P3J05j57
2875h4L58j31j62j3P0j97J58Q4k96J79M1N2l7P8o6j4n9J83Q5j74q6k9J35k8P3
2900A20l6k05J6Pm7J14J87J27M1l72M0l3M1P3r0O1J4j72q7L29k22R0r7Q3j8Pk40
2927b69K75p5J95k12J8L6j35J70j3L5q8o2M0J06l7J23k56K11l7q0K97m23K00q9
$$ y = [131, -57, 104, 42, 161, -44, -264, 156, -29, -139, 94, 76, 132, 6, 88, -54, 106, -88, -2, 153, -124, 38, -143, -46, 38, -224, 120, -161, 105, -93, 19, 42, -96, -14, 128, 105, 15, 0, -85, 150, 62, -93, -31, -8, -49, 15, -88, 125, -36, 123, 142, -7, 6, 280, -5, 203, 64, 30, -123, -64, -15, -75, 57, 40, -2, 37, -4, -69, -182, 120, 71, 66, 69, -103, 96, 66, -68, -122, 142, 144, -196, -56, -69, -110, -24, 74, -135, 147, -4, 71, 22, -71, 93, 108, -28, -102, 70, -140, 354, 76, 12, -12, -30, -67, -14, 135, 70, -209, -191, -198, -4, -6, -181, 393, -28, 29, -163, 2, -105, -32, 73, -84, 274, 143, -19, -32, 38, -159, -1, 83, -213, -34, 7, 59, 22, 100, 34, 20, -39, 144, 229, 55, -31, -60, 75, 47, 120, 84, -121, -105, -98, -145, -31, 156, 283, 324, -48, -8, -41, 0, 73, -17, 44, 58, -114, -201, 128, -94, -4, -101, -18, -36, -29, -269, 6, -69, 126, -86, -68, -32, -167, 3, -10, 25, -63, -125, -85, 21, -16, 107, -149, 62, 25, -55, 242, -181, 19, -70]
2951g0K62j55r3J50oj61O5p9J5J40n7J13k36K93O3l8k5j73QL8Ok42K23J00k68
2976a27o2K80l39J58O3j8j04J81M8n3o4j0J8L0k0K7j71R4P5L7j35N8m7j26m0L78
3002A31j04pR2j61r2K24p3j93K36m4k7L2J58j38l18L06j38J43K1m5N5j2J61j33
3026G4l2J36k00p8K8J29j50K17j31o8K32m0nq6j20N7R2j64JM0K54j74Q2j28n1
3051h5O1J41j83K04k39J23l4p3J02j11Q9J00j0q4J55j94P4n6qJ38J80l80J59k28
3075a59M48k41j17m2nj9M9K78j82L4J0j05K8J6q4K32k37j6N1L9k2P9J1k7k5J71
3101A65O4l86J46J90j68J5j07K20k26M4J82k60j69K69J18j80J54j4j08r3J73J25
3123A54Qj15M5k38l2N3K15N5r5j52j07RR8J9j66J01M3K32Jj22K40l09O1r2J24
$$ y = [-70, 192, 37, -56, 94, 88, -73, -8, -87, -72, 68, 11, 124, -112, 181, 244, 206, 181, 8, 16, 54, 60, -182, 41, 141, -127, -189, 91, -248, -90, -27, -45, -149, 32, 80, 27, -37, -47, -29, 1, -19, 8, -163, -69, 6, 43, -92, -34, -81, -207, -247, 131, 27, 20, 112, -49, -141, 83, 10, -183, 53, 9, -18, 14, 172, 34, -284, 22, -116, 27, 48, 3, 58, 46, 207, 74, 42, 178, -22, -100, -72, 57, -93, 124, -7, -75, 157, 117, 112, 26, -94, -37, 55, -109, -108, -68, 186, 12, 94, -34, -85, -24, 117, -66, 138, -101, 22, -12, -85, 17, -94, -5, 95, 85, 1, 156, -38, 36, -20, -28, 110, 290, -90, 69, -159, 289, 48, -69, -111, -116, -135, -86, 192, 10, 44, 54, -51, -23, -7, -91, 141, -96, -112, -61, -22, -44, 35, 46, 19, -6, 165, 229, -157, -11, 179, 11, 26, -81, 139, -87, -43, 139, -121, -290, -21, 97, -83, 71, 57, -51, -144, 29, 154, 162, 47, 92, -146, -178, -125, 90, 145, 50, -102, -209, -200, -102, -83, -249, -148, -105, 127, 128, 6, 246, -63, -2, -94, 30]
3148C0n7n5J24j6J30r3q9O3q7j27J90m8Q4j14k2K68l56J98k74J45Q6k4k8k1J73
3173H0j54L3mj19K36q3R8L6k58J92J38k68J61k57K28j54L6J79k11K58l52K72r8
3196a1K99m30J12p4L30l19r1K65l41L3K78m7J4k07J22J96qj48J00j12j89K95p1
3219dN2L0Lo2o8J42Q7q4k78J56K7j0J64Q8k38N6PJ2j26l7K50j54m3q3J69j89L63
3246B30l09K1J9j45K0J93l7P4n2j90K37J33j98n9J8q5K6j4j02K23o6K02j02q2
3270d5q0kJ44O2QO7k46l2qJ99j04J42q2j30J31k36L7J41K67j89o5l9pK20l89Q1
3296a55mJJ98Q5M1q7k53K23Oj16J21j07R3n5o0J86q8r6Qn7J83N6j10n4J23oj60
3323h4J16p1l02N55l54K54l28K60j8p0K16k07K41k87NJ55j93Q1P1J59j1j54pr5
$$ y = [30, -27, -82, 42, 26, 156, 63, -26, 37, -50, -177, 13, -35, 49, -65, -87, 181, -175, 23, -251, -106, -20, -44, -72, -93, 80, -74, -41, -45, -164, 72, -11, 87, 123, -135, 57, 195, -73, 88, -169, 59, -95, -59, 120, -91, 167, -185, 87, -11, 288, -142, -30, -104, 226, -93, -184, 81, -260, -227, 51, 4, 18, -189, -67, 129, 121, -27, 73, -39, -228, 67, -4, 48, 78, 81, 19, -49, 93, 180, 96, -182, -26, 1, -9, 155, 243, 5, 61, 68, 80, -46, -83, 167, 13, -30, -113, 56, -133, 230, -79, -58, -39, -184, -164, 29, -8, 66, 14, -176, 61, 194, -4, -63, -45, -130, -104, -118, -220, 3, -63, 139, 37, -45, -125, -127, 17, 79, 87, 154, -92, -124, -132, 67, -37, 105, 23, -107, 24, -212, -175, -34, 233, 44, -21, -60, -67, 153, -236, -155, -159, -158, 40, 125, 166, 79, -174, 49, 55, -61, 60, -47, 46, -9, -69, 117, 29, -67, -59, -116, 67, 123, 13, -41, 82, 76, -84, 32, -39, -341, 214, -140, 114, -214, 46, 28, -42, 174, -33, 208, -79, -74, 81, -112, -31, 40, 199, 188, 34, 27, -68]
3347f8K76k67O6J78l08J58r4K41k11n4J15J55k52J51k48J55P2j59J60qk38L50
3369A70l25K86q5OO1o3L1j6k35M3J69J03j05N5j50J66m7j02P1j52J15j7R8J28
3393B05k5k97K13j20O4k0J10j15j93K79r9j26K87n8K4q3J01j35J03j05N5O9j75
3416d1J28K1j99K8K75k14j0j55J33j75L2J32m7J88%o5O3J50l34K02m7K6q3rr0
3441i1L1n5KJ60j20K7n1M7Q1L6l33L34j00J92k01L3K29l44K6L98j74l0j24j03
3465a30J95j34p0n9K72j89J95o2J07k72M33j51q7J80j62M3j41O6J49j45K51l65
3487g6j89L5K88M4k43P3J66q2k0k6J01l8N4j95J28n6qj38lR3K0Rk1K10k93K65
3513I8J65k70k5K88j97j39O9L7j35J48k17L18k43l5K76l2j90K02j26J8M1l06K28
$$ y = [-68, 208, -59, 7, 185, -123, 35, -59, 182, -29, -83, 32, 187, -65, 86, -162, -7, 65, -94, 66, 58, -180, 170, -155, 131, 46, 52, 113, 50, 81, 65, -170, -127, 42, 145, 40, 95, -55, 111, 64, -38, 33, -119, -4, -21, 77, 205, 180, -117, 96, -24, 40, 20, 130, 15, -178, 101, 2, -124, 163, 105, 129, 46, 147, 12, 115, 10, 65, 134, -41, 87, 108, -91, -63, 212, -2, -12, -167, -34, -209, -177, -45, -92, 96, 96, 31, 94, 244, -90, 112, 65, 91, 8, -1, -91, -60, -115, -113, 47, -73, -46, -97, -50, 31, 67, -266, 68, -32, 160, -41, -8, 221, -123, -97, 301, 127, 97, -27, -130, 65, -69, -139, -198, 74, -115, 80, 18, 125, -147, 286, 135, 48, 228, 66, 109, -32, 34, 183, 38, 289, -76, -265, -230, 58, 102, -141, -68, 98, 16, -4, -30, 71, 33, 87, -108, 20, -36, -44, -182, -185, -92, -72, -63, -84, 126, -167, 98, 263, -7, -32, 256, 59, -80, -11, 26, -109, 39, -178, 140, -103, -138, 138, 106, -84, 118, -8, 10, 51, -255, -27]
3536b7J12k03K25o7j18r0K69n8R3j59N5J8k05L59j28j40K0K16r8Q7k72%K8J61
3560G8J34l44K7J92r3j11Q1K23k93J09k85K8L54K2o3p6j1RJ22p7p5J5J02j7M9
3585A00j70m3O5r5J33P0n9M7J18j61P6k35J67J7o0J53j53L8q4Qn4K24kj96J05
3610Ij15R4P7J6N8l05K84j06j66J44j29K64K9j69J98j58j69K66l4j61J34k91M18
3633A88j9j17l9n7K32m3j50j96O3J28J80mk01J75j71o9J18Q9j63q3J29K53j30
3656A13j14m4J64j15J01k50K22r2j74J46K5N9L9k1n3r6K9P1j27L2n8J84m8J05
3680I8j42K55p2J08k82q2J34p6jj35P6J49kj65N5J95j91OK13N5q2j35p3J55J98
3705B59l26J37l5j63J66K8j17O1l8n3J1o2K69P1j38o5J51R1n4j90m6q9K01r7r5
$$ y = [-27, 85, -118, 107, 40, -78, -168, 101, 43, 136, -23, 32, 50, -155, 204, 76, -64, -44, 172, 74, 161, -111, -111, -83, 78, 212, -132, -105, 87, -6, -117, -36, 187, -106, 3, -282, -254, 100, 122, 59, -17, -28, -19, 103, 26, -49, -34, 68, 51, 100, -70, -113, -48, -143, -10, 60, 1, 48, 166, 5, 81, -154, 13, 30, -30, 123, -30, 8, -76, -68, -122, 102, 100, -96, 9, -106, -12, 65, 81, 139, -166, 118, 12, -154, -10, -139, 125, 154, -15, 183, 25, -144, 122, 88, -73, 61, -230, 188, 169, 52, 13, -44, 188, 145, -5, -201, -138, -10, 170, 166, -35, 140, -31, -100, 18, 107, -56, -139, -10, 243, 113, -1, -45, 119, 4, 105, -145, 77, -15, -189, -43, -18, 41, 80, 59, 6, -90, -61, 10, -117, -85, -143, 41, -7, 98, -44, 211, 139, 247, -35, -117, 17, -59, -60, -195, -119, 30, 28, -137, -82, 113, -78, -72, 141, 196, 114, -21, -94, 61, 259, -67, 70, 35, -128, 38, 66, -51, 10, -28, -81, -70, -132, 137, 208, 70, 5, 156, 247, 193, 3, -43, -132, 69, -28, -123]
3730a23K02j69nJ75o1k55L38j81k3j1L42l77J6K16J53q0j76L0K5j0K4q7K6n6K1
3755d6k9J01Lj60q9L96q5j26J13k01Q0l5J43J13j38p7P0J90m5k21M0L8k6J30n9
3780H0k88J44k22J61K06q5L9J34k34N3l10L13j1Q6j0q9J58j63l0N9m7pL7J62k72
3805a36J28n8P7%M0n9j7Q1j60J11J55j50m0p4O3J68j40R6k51L83l18L30j42j98
3829a11r5L16k19o1J51j9Q6j64Q8p2K2P2J10l9j71n0L02j22k21J09J27k0o0J0
3853c1O5q8N5p6J0p1J90L6J5k09J29o6n0J65K4j18n5k5j02L80l27J38l4O6J88
3878B09k47pJ23P5k56M8K18j57o8n7K50Q3m51j5M19J2k09J29n8j4q3o3K68o1j41
3903e3J73k08J11K4P0Nl62N9J33M2j20J9N5O1j8J5J6m7K3J30lr6k8n0R0N3J46
$$ y = [-123, 79, -90, -95, 80, 19, -236, 102, -79, -102, -113, 229, -148, -132, 84, 237, 157, -19, 11, 36, 26, 50, -37, -11, -67, -46, -75, 26, 29, -131, -220, 176, 91, -35, 78, -123, -43, -78, 65, 178, 40, -37, 33, 223, 178, -43, -3, 35, 9, 139, 80, -208, -64, -286, -125, 81, -4, 35, 169, -65, -12, -322, -9, -20, 66, 56, -33, 125, -38, -68, -9, -56, -63, -26, 136, -136, -8, -66, 11, 11, 51, -8, -25, 56, -104, 7, 162, 12, -28, -102, -39, 129, -11, 85, -166, 217, -101, 229, 87, -111, -206, 110, -109, -170, -19, -38, 48, -116, -28, -100, -78, -6, 104, 65, -106, -156, 146, 24, -197, -88, 39, 19, -41, -31, 34, -54, 1, -75, -65, -136, 54, 90, 105, -104, 25, -41, -91, 74, 98, -20, -75, -100, -202, 178, -149, -11, -45, 21, 209, -38, -45, 78, 153, -103, -55, 163, 6, -62, -119, 131, 214, -237, -252, 167, 179, -30, 99, 41, 27, -56, -119, 149, 88, -53, 120, -88, 23, 47, 117, 122, -240, -181, -48, -6, -126, -107, -52, 9, -9, 6, 22, -25, -2, 128, 125, 29, 1, -49, 41, 94, 240]
3930B40k19m8J96K5l08J74k12J12O0n9j6Op1K09L8j84OJ23ko4l4J05j35R4N2M7
3956A35l55L26j49nj9N6N7j29o5K27k76J71J62j36Q9l58J94k5K48l83K72q7J39
3979H9r2k05L18j05p0J92j34j02K62k70J47q7O0K05j78L7n6J45o3k16K08p8kQ4
4003H9M5j93J6J35j2j2r1k3J02k2o7J16l2K35p5k06J90l20K8K7R1j38J36j9j20
4028a20r1J12J95M4o3n5j01jL5j18K67k64L63l03P4j29J96O2l6k51K33L3K13r9
4052A96m44K19l8JJ12J7k4O1k1jj11p9P2l8p5O2J62j05J04j75L51k10m7m4N6q5
4078h4R0N4p2O0j74K74k96R0J54j66JK57j12J14q4o5l9l1J18k01J43K01o0k08
4102c6j16J27J53j28K80k18j89J64n1J07j16k06J63K27j6k31J41J59k42o9Q0j5
$$ y = [240, 21, -27, 169, 194, -114, 60, -152, -40, 20, -39, -55, -49, -120, 89, 127, -57, -51, 72, 70, 6, -28, 77, -58, 36, 88, 135, -220, 106, -43, -48, -67, -11, 46, -83, -148, 79, -197, -26, 136, 0, 89, -269, -75, -100, 148, -235, 37, -50, 89, -3, -208, 110, 5, -65, 127, -7, -109, 153, -117, 30, -57, 3, 208, 30, 67, 11, 156, 93, -123, 85, 7, 5, 89, 134, -59, -43, 92, 80, 68, -23, -46, 56, 34, -33, 83, 51, 286, 211, 5, 195, -125, -97, -70, 21, -117, 19, 0, -120, -211, -99, 96, 140, 77, 22, -79, -80, -45, -163, 104, -160, 203, -100, -26, -155, 41, 103, 67, -184, 49, 82, 295, 196, -248, -29, -67, -66, 46, 63, 39, 100, 79, 78, -33, -112, -40, -78, -153, -91, 71, -34, 70, -105, 246, 36, -11, -55, 1, -84, 6, 60, -12, 48, -126, 148, -148, -58, 96, -70, -69, 188, 76, 190, 106, 41, 2, -29, 89, -112, 31, 232, 172, -36, -152, -25, 128, 0, 280, 62, -127, 37, -14, 93, -23, -229, -66, 161, 145, -86, 55, 214, -28, -97, -17, -32]
4124c2N3J08lj49k02L09J32q0L9p6k26Q9j49K7J54j08r0J96m8k7J37k8N9K9j01
4149A3K7N8J9J27r1j31k4J76l31O5J01Q8j75J40J8j15R5J44l12j04K26l7O6j1
4173C2r9N3K48r7o0J0J9j61O1P4L7k40J00K49n5j51l7K28j45k4n7J19l28L03K5
4198A04j64j7J62n8K18l20O2J9o8k8J23k9k0K75l06j26K57p6n4K15p2j46l0NL
4223g1J44j9k55M01m7k62l1J24r4K71m4p4k21K38p0J06k5k21K45k04l7K30r7j6
4247b9n1K72j58k8l6k0n1R5k6K87jj06j73j8J57k52J92KkJ2rJ1o4j19L28k50J1
4274b6Q6o6l2q5K03k1p8J25j28L5j62K39j04rP7j40o9L12l0q4l70M49l62J38N2
4299e0Oj5P8n9o2J05M6Lm0J44k9l6o0q1K01k58j10K20j8J58k31L5q2J7R5j58K78
$$ y = [-32, 21, 129, 126, -23, -225, 84, 216, 136, 175, 99, -127, -38, -187, -160, -6, -114, -204, -8, -56, -83, 54, 26, 85, 114, 13, 40, 98, 117, 244, 153, 22, -2, 174, -157, -92, 9, 97, -78, 62, 80, -35, 60, 204, -108, -212, 14, -23, 43, 32, -67, -14, 234, 137, 77, 87, 106, -55, 6, 80, 117, -123, -23, 226, 171, 20, -17, 211, 66, 42, -15, 104, -224, 79, 104, -60, -77, 85, 27, 245, -75, -13, 6, -62, -90, 33, 4, -16, 259, -47, -173, 84, 8, -46, 169, 97, -49, -79, -74, -71, 73, 54, -201, 200, 153, -109, -140, -16, -110, 161, 117, 43, -178, 60, -10, 96, 71, -150, 95, -109, -146, 84, -13, -29, -80, 192, 34, 6, -30, -50, -101, -6, -32, 255, 254, 148, -25, -43, 114, -138, 54, 56, 54, 66, 57, 68, 4, -115, 213, -37, -26, 60, -6, -38, -123, 80, 59, -19, 106, -22, 13, -149, 90, -14, -23, 54, -86, -155, 157, 127, 43, -327, 122, -240, -102, -50, -44, -59, 19, -40, -102, 3, 49, 52, 12, 156, 127, 91, 31, -50, 151, -107, -217, 3, -15, 143, -88, -53, -135, -118, -23, -181, 97]
4326I7j09k23K77K16l55J33j3K17p4k29J9k05K05j1J4nRj55J14J35J61p4N8r6
4350A06j63R7j63k9K02Km3J91j87j6qJ42k03J22k01M4J45r9m7K39j6j17N2j0J92
4375B32l55J40K22k71J18j49n0K63j79j04J53J61l24L77k90r1O7P0J43j98J76
4396A11Q7m44K67j60K46j52o8K33Pj91K1kJ56k20j06L05k55L58k7o4J4k37J63
4419D2J38N9k69NR3P4J2K1k12O1P2j72R4k0r3L6L13l05l1J25m2L0j23J32N2Q9
4445A81j53L1K7l10K95j17q4O1J28M5O3k22ON5K00k58K70q1k35K8r7K90o4Oj1
4470E4q7J0r2J80J08k56K62l08K15k35K21n4N2j58l1K41k97K50m1r8L1n4K91j24
4494H0j76Q2k9M2j8j46M30k43j29J41r6J26j06K0j33L16n1j57L1m0J21k3J01j61
$$ y = [97, -12, -235, 42, 258, -97, 36, 23, 240, 166, -63, -44, -249, -44, -55, -41, -46, -37, -192, -78, 57, 218, 144, 202, 106, -57, 40, -123, -152, 50, 52, 9, 200, 13, -3, -11, 131, -72, 50, -151, -107, 38, -61, -108, 131, 115, -2, 50, 40, 232, -123, 17, 239, -32, 86, -63, -113, 150, -29, -133, 20, 181, -143, 234, -56, -147, -80, -10, 133, -65, 111, 198, -246, 21, -139, 107, -45, -113, 120, 127, -64, -43, -45, 111, -109, -215, 90, -165, 193, 166, 102, 116, -121, 42, 180, 239, -30, -25, 68, 142, 154, 175, -37, 24, 96, -76, 18, -2, -95, -59, 254, -51, -82, 43, 1, 31, -92, 40, 92, 181, 28, 59, 86, -224, 71, -46, -130, -69, 59, 104, 167, -55, -49, 6, 206, -52, 218, 137, -98, -70, -167, 123, 59, 65, 54, -33, -23, -115, 65, 173, -83, 179, -129, 86, -149, 72, 18, 70, -88, -119, 122, -175, 75, 34, -64, -33, -87, 204, 80, -96, -14, -43, -1, -19, -165, 265, 22, -107, 34, -62, 64, -42, -22, -155, 161, 110, -47, -16, -56, 65, 42, 143, -18]
4518a8p9Pj07K02oq8L19l27K24K8j98kRq7J11j01K23o4j13J75N2l3nq6j69m8L03
4545A22k51N6J50k91P0J27jm2j25L47k18l5K46q5j62o2J20j09K37j71O7M4qJ38
4569A64l89K80J25K5j67j12L3R0k64K66L15k47j94n2L3R2j18J66j55J71R7j88
4591b9M0j31K11j80J27L9j21J18J3j01J61m3k54K20j57J21K61k32K4q7J45j99
4613e4J19q4j21P8J88o3k3O6k41J78J00l3q8o1R3J17k21j02K77L3j78N7K46j44
4637A39j76Q0O1J00j96J01j77K40k44L52k23j80J50J8k22J68MJ62k5r5k09J69
4659cmJ10m04K38OoL6R4J58k16P1J2j43l4M4k3j2J53o4k6KN6J09j57JJ69k91J37
4687A3j27L07j53j31J28j56J93j78N4P4J09j13Lj49n3K06J40k38R3n5R5j84K50
$$ y = [-18, -97, -90, -197, 5, -1, -89, 230, -97, 127, 155, -43, -45, -36, -123, -12, -113, 110, 46, -67, 108, 160, 127, 122, 36, -133, -181, 122, -129, -73, 77, -214, -144, -17, -18, -60, -185, 162, -56, -91, 155, 70, -92, -154, -34, -143, 94, -77, -10, 34, 26, 164, -225, 55, 180, 205, 38, -74, -41, 49, -215, 51, 366, 119, -75, -127, -94, -2, -120, 46, -109, 62, 159, -29, 11, -120, 91, -89, 38, 77, -44, 74, 87, -14, 147, 104, -150, 70, -87, 34, 295, 63, 87, 0, 145, -54, 65, -19, -140, -62, 126, 63, 40, 106, -135, 43, 143, 110, 22, -39, 54, 171, -50, -152, 125, 158, -20, 37, 283, 139, -37, 43, 104, 204, 8, 109, -68, 172, -72, 280, 57, -123, 27, 45, -177, -9, -5, 157, 132, 37, -172, -3, -7, 103, -301, -63, -57, -63, -27, 67, 225, 9, 80, 92, -51, -85, -41, -64, -76, 77, 13, -13, -11, 45, 154, -3, -2, 167, -124, 13, -114, 193, 40, -91, 37, -119, 74, -104, -50, 24, 133, 20, 23, -126, -179, 27, 167, -71, 22, -33, 62, -122, 128]
4710A28k6m5j24J41o0j52j35K07J29k4Q3k93P6J7j87K85j61J10L7o3R4k14P1J09
4734CK05k65J80j82R5L5k86L07l63K45k4K48j09k48N4J77p3m05M57n8j59K81j13
4757Bk07J24k8P6%J76q7R3j39qj16o5K27j85J01q4N6J84q8J3o8O2j64O5m4J76
4783G2K1l27R6J23J05j89J7n8P5o1J61q8j22L21k41J42L4j00j58J18J96q5J12
4806A64o5O0M4j88P1k15K32j94R9K60k80N2p1K38k20l4N2J48k44JM1j08K08k39
4830a88J14k8L25n2p0j25J49j77J09k71K67k58J83P5J25k45N3K21o0m7m9K62k79
4853C4R8j69J1nk65L25P5R5l59K37l09J19k43M53q1r8K12l56L21k70J89R0k09
4876a05K58j19k06K83j48K45l53r0L02j81L0j05L90j49j4M3o7j07m4J12O4p8J71
$$ y = [128, 102, 57, -67, 74, 14, -138, -273, -66, 63, 39, 122, -171, -95, -78, -265, 20, -141, -31, 6, -57, 37, -177, -106, 3, 208, -57, 123, -59, 36, 71, -215, 92, -271, -26, -50, 198, 89, -159, -105, 72, -1, -406, 51, -7, -166, 115, 2, -205, -81, -109, -33, -33, 143, 56, 149, 10, 2, -114, -179, 48, -137, -36, -120, -64, 120, 32, 45, -23, 39, -125, -60, -104, 72, 93, -234, -138, -15, 90, -99, -82, -140, -65, -126, 35, -53, -175, 146, -95, 47, 81, -19, -177, -59, 137, 52, 164, 99, 159, 203, 15, 86, -129, 103, -91, 8, 268, -12, 40, -31, 207, -13, -47, 5, 153, -91, -90, -49, -157, 51, -188, -74, -102, 223, 171, 101, -24, 125, -52, 57, -214, 53, -205, -22, 53, 178, -67, -14, 207, 147, 100, 51, 313, 34, 132, -37, -26, -31, -296, 29, 104, 199, -160, 77, -232, -113, -356, 97, 16, -82, 130, -226, 95, -175, 14, 104, -105, 153, 34, -172, 111, -37, 208, -145, -235, 67, -114, -84, -189, 201, 52, 38, 81, 14, -93, -137, -25, 39, -39, 132]
4899A32j41k2P5nj3K15l65O8K76m13J29r6K6O8p2M1n3N5L19k81kK56k65J62n5
4924C9J8j63j9K59j22o8k4J56j13J66L3Q2j09J8k41J86k08L12k03J23m6j65J67
4947G8j24j22j0j2J29J43m7J07N6k33j75L45r3m7L5j18J82r2J1k27J87K61k13
4970B1o9K91k73J88Np4j64l7Np4J15J32K01k67l0q4J78j18J42o5K7l1N5JK4l44
4996b45J37J54l8k6P5j34O3P0mO3j96J93r7j44K95k43K23Ql16J32k7J36m4k12
5020a77K39m3lm0J95j84j28L21m1k48q7J43r8J54j88K08L8k19L53j53J64o1l9
5043A06O3l10J09O6l0P6J51k36R2nj20J65j44J32j46M3k3o1Jlm8l9R8j04J92o3
5069c8pp8q8L15j25J82K0l85J30j15K69m8j34P0J60j7P1j80kJ29l07J57J22Q5
$$ y = [132, -9, -31, 44, 39, 26, 241, -124, -56, 220, -193, -64, -160, -134, -66, -138, -97, -150, -95, 224, -57, -59, 197, -68, 94, 39, 57, -106, -125, 134, 12, -56, -80, 76, -37, 129, 162, 244, 135, 153, -88, 98, -110, 202, -1, 122, 76, -89, 78, -46, -168, -178, -190, -61, 82, 35, 142, 198, -35, -210, 135, 42, -5, 30, -88, 94, 2, 13, -214, -27, 234, 21, -48, 243, -30, 158, 163, 89, -75, -112, -107, -181, -66, 66, 267, 0, -30, -114, 64, -54, 88, 23, 50, 19, 74, 75, 99, -245, -108, 46, 8, -18, 57, -77, -14, 56, 52, 115, -81, 112, 15, -129, 166, -77, 146, 154, -162, -30, -57, 79, 35, -177, 62, 19, 16, -24, 171, -13, -141, 180, 139, -109, -196, -53, -151, 3, -185, 23, 61, -158, 195, 42, 206, 145, 106, 169, -141, -32, 34, 4, 80, 231, -5, 87, 82, -38, 127, -17, 115, -31, 12, -11, -72, -71, -74, -122, -161, -63, -167, 25, -38, -45, -123, -211, 104, -21, 161, 181, -204, -74, -189, 80, 32, -102, -32, 128, 111, 182, 2, 0, 129, -178, -21, 101, 186]
5093A86k22O3q9j0L5j19J5J89j07K79k12M8R3j71N6p4k37M37p3k21J54j33J37
5116B4N3p0O7j73K35k00kJ61P3l10R4P7J25j17j40J94j03J10joj5J29j81l4j21
5141a31K29o7j73n4P6N8l5Q3Q6j30j34K41J42k57J09j86L35j14j75O8K50k74R1
5164C8J6l7j27Q4K20r3J6k00k14L69j57K20j84R8j64K2J92j9o1j55K52j10J62
5187A68r9n0J2k2j3J13m6J5j70J51j5kl6J09j80J00m5r9m3K78k47K28k39L5nm9
5213a51K11r2P8K4P0j93L4r5J38j38K6J07K0O6j74R3N8q7Nj28R7l8L52l48N5j9
5239b9m0K0l4J72j30p3J50k24J13j67K62k99K30J84Q3k25P8m5k2l2j8j05J79L0
5263E8L4r6J12n7j29o4K10J44k75N6J38j58J13N6k49k9K62K4k56R9j13K61r9o9
$$ y = [186, -36, 27, -62, -72, -37, -156, -141, 48, -59, 220, 8, 56, 149, -22, 34, -40, -277, 160, 87, -134, 20, -113, 24, 77, 7, 74, -99, 136, -64, -66, 95, 168, -142, -48, 29, 154, 37, -103, 91, -12, 98, 97, 91, 76, 205, 24, -10, -131, 98, 31, -142, -196, -120, -62, -97, -14, 72, -58, -192, 49, 191, -66, 43, -143, 192, 78, -97, -29, 221, -53, 38, 54, 17, -110, -26, 194, 101, 117, -83, -297, 72, -85, 135, -49, 49, -115, -93, 99, 80, 19, -136, 116, 6, 168, 69, 19, 31, 9, -4, 109, 63, 78, -92, 59, 44, 42, 6, 115, -65, 35, -10, -109, -152, 126, -121, 107, -132, -97, -102, -151, 60, -32, 46, 70, 140, -53, -19, -114, 24, -114, -88, 19, 39, 105, -69, 24, 82, -5, 0, -128, -31, -69, 283, -65, -10, -29, -69, -49, -83, 89, -41, -114, 36, -188, -75, -242, 20, -279, -49, 135, 218, -7, 71, 26, 4, -28, -46, -151, 28, 58, 92, -4, 108, 51, -78, -142, 68, 212, -63, -7, 131, -27, 86, 142, -107, -136, 126, 150, -106, -7, -120, 141, 42, -27]
5287b7L14n05J34N8j01O7q3j1J72j34N3Q9o3jO2j74K36j68q4J42J39n1Q9n7j12
5312a6k28K01j56K01j43M9J98k69J77Q3j08P0j11K6m0J22J9l4Kj83K69k69J44
5335DJ11j30K0L8lJ04j73K34j45k2M5j70K52j73j68Q4J10q7K93k75l1J3J8J04
5359E3q6K06j08j88J92P6m84N23k68P1r9j02L10rr7mM2k74J57m8R1K14l47k17
5383c96N99l47J40j90J81K1O2K46l79J03l5j98J43K3J69j41K2J07o8p7k2QJ15
5406H6Q8l7r5n8J23k87K43K3j08J4k17N01l03L2lJ9Nq5K35j52o5p0L19l9%j27
5432D2k16L31Q4l45J31j6Q4l34P2J62K9j07NP2j75J77j33R4j89K56l9L6j01O0
5456b0j04J18j39K5J5J69Mj06p8K89j38p0O5p3K1j00R4m0j0j7J31j70K26j92L46
$$ y = [-27, 287, -218, -84, -26, -127, -60, -143, -154, 18, -116, -63, 26, -37, -38, 24, -150, 86, -82, -166, -24, 115, 64, 153, 96, -16, -244, -43, -199, 2, -141, -92, 106, -163, 14, 97, -11, 59, -52, -26, -66, 56, 75, 41, 43, -140, 129, -140, 4, 115, -15, 5, 43, 40, 144, -29, 205, 60, 38, 83, -87, 165, -8, -176, -92, 18, -69, 224, -51, -82, -69, -51, 53, -33, 173, 65, -123, 69, 145, -339, 184, -84, -13, -112, -214, 96, 87, -10, -14, 28, -246, -89, -137, -46, 168, -179, -396, 203, -144, -4, -194, -13, 8, 70, 316, -63, 40, 5, -193, -50, -27, 142, 1, 23, 130, 62, -15, -37, -29, 86, 174, 137, 42, -16, 107, -180, 63, 86, -22, -8, -225, 276, -27, 5, 2, 21, 26, -59, 176, 24, -41, -111, 208, 169, 169, 42, -174, 157, 241, -104, 27, 11, 95, -239, -167, -5, 24, -83, -78, -6, -181, -4, -137, -43, -232, 24, -15, 21, -80, -20, -124, -6, -145, -120, -105, 64, 68, -38, -116, 173, 35, -35, 30, -43, -22, -122, -28, -68, -78, -95, 36, -134, 92, -100, 246]
5481B46k86L0K8k33J53J25L9k46J74M2j28L9K22j84p2K8n6J12j34P8Q2j6J67j80
5505C0q4J9L5j6O6j82P4K37n8j09j16J72k21J86k12J61%j49J04M0K0m4R1j51M0
5530f7K9O5k59K58Q5l15M15l36J09J19n7o4Q0j04m9%J01m5J29j48lJ20o2K0k17
5555a96K50J6J16o5k46N8o1J23l9k6J81K8k28OLL4J16l34J08L74k02J78l38J91
5579D7j22q4L31k48K29q3J63j91k05J74K1j61k68L45q3Q7j3j02J06P9k01J91n2
5602d0J64n6M2R5k06K12j25q4q0J13N0j10M4r2L16k89L19k14K24l72J68O3q3n3
5626FMj7J77j79RJ2M8MR7r5o5J33j44j33J98n8n9Q2o9j05J61J39j46p4J63P7k69
5653a03J6O6J5J6n6j65J3K14j34K18k88M00m14K85n7j37Q8J87j14k0r0n9J95j54
$$ y = [246, -40, -10, 18, -215, -62, 63, 102, -144, 30, 72, -56, -17, 205, 21, -51, -23, -79, 33, -101, -23, 59, 43, 210, 30, -54, -35, 0, -16, 50, -132, -58, 179, 121, 12, -104, 68, -153, 33, -179, -18, -18, -167, -63, -23, -3, -47, 44, -107, -67, -38, 27, -232, 26, 111, -204, 211, -125, -16, 103, 46, -18, 62, -42, -91, -91, 10, -35, 94, -54, -57, 63, 1, 21, -196, 54, 70, 186, 121, -125, -67, -128, -5, -44, -70, 111, 139, -89, -83, -80, -46, 70, -264, -156, 218, 16, 194, -144, 47, -75, -159, 172, -76, 153, 70, 233, 42, -163, 11, 32, -129, -397, -52, -135, -48, -61, -163, -57, 22, -179, 12, -40, 124, 68, 110, 205, -1, 211, 86, 2, -78, 35, 85, -25, 19, -73, 243, -46, 273, 59, 283, -89, 79, 142, 59, 6, 10, -7, 170, -9, 0, 12, 60, 64, 161, 66, 1, 134, -10, -143, 55, -3, -62, 20, -49, -154, 7, 146, 0, -74, 89, 166, -103, -87, -21, -6, 10, -46, -211, -198, 16, -118, 100, -188, 212, -202, 83, 26, -111, -23, 164, 50, 30, -60, -119, 76, -78]
5677g8J06R5m0k7j54L36j39j04R3j15R7J17l71J27J91k85K77j44M1qM8k5J07j37
5701HJ47j35Q6j30Q8O4k11OO2R1k75L93m55L97n7J63r5j60kJ16j54M0K92k07p9
5726gJ02j24L51l36l7Q7K1p8O3J26j61l2Q1k48J80L0j07K24q7J01k5m1r6J46r1
5751D2m3j21nJ86k3j95O9J68K13l01O2m0p3q7J54o5j17Q9%N4J84o3m8r5L4m4P3
5778HK24k91Q7N1J15k90lJ48K0j14r2O9j10L00p7Q2j54J55k54K25j7j96m6K59
5802I9M1o6j6Mk12J74mp7P8r4N8j08K52l2J14l98P3J08R7q6Nj81K72k12J50r2
5828e3j1K07n1j19P8j11l1L25k49j26Q6j48J08O3L23m66M20l86J36n8j3J32k02
5851a46K13Mp1j27J63j24K09O4o7M0j37PJ44j23O1j26l1P7R5j28o9k6K33p8K4
$$ y = [-78, 28, 123, 83, 56, -98, 238, 99, -5, 88, -27, 70, 187, -184, -57, 134, -151, 126, -18, 23, 15, 63, 38, 145, 8, 155, 20, 106, -24, 64, 128, -83, -77, -15, 76, -199, 194, -261, 136, 79, 242, 147, -13, -15, 101, -53, -13, 279, 72, -7, 95, -29, 322, -14, -51, 36, 57, -21, 42, 168, 7, -25, 56, -192, -12, 18, -89, 135, 48, 149, 124, 83, -13, 133, 42, -1, -122, -127, 59, 36, -159, -90, 78, 291, -10, 52, 12, -61, -148, 6, -59, -176, -87, -87, -33, 151, 88, 40, -55, -21, -65, 8, 232, -59, 28, 79, 194, -96, -99, 49, 69, -45, -137, -68, -178, 122, 45, 127, -27, 128, -126, 99, 82, -114, -160, 99, 140, 74, 58, 62, -150, 24, 20, -57, 21, -73, -15, -123, 129, 97, 211, -187, -114, -6, 91, 5, 10, -171, 101, -111, 39, -53, -64, 143, 92, -27, 51, -60, -91, 234, -15, -141, -55, -203, -95, -32, 291, -175, 245, -141, -5, -63, -76, 56, -146, 67, 71, 0, -127, 36, -88, 121, 185, 118, 158, 21, 28, 172, 49, 110, -16, -47, 30, 125, -3, -72, -98, 135, 57, 81]
5876H1J7q5oP5r8o6J10m6n7n5L0K16j69n8K52j31n7J25j93N6N2J19Mj00j98K64
5902H2k28K04K65l53K91k77M5j02L2j04R6J74j30M4J70m1j22r0P1m5K8L7k50J80
5926b3K17k36j72K71j78K69j37J91j29J9q6J44k22J57j01J30j07j31M11j73j53
5947c9qR5R6j03k8l9j44L06oj23o9k03K51j3J7K61l32J37o8M4L8j38J36n4j6K2
5973B0M6J6l10L22p1Qq6K6j4P4q4j83K30p4J26J08k48J29N7j36l5P4j2j7j89M17
5999A94l91M14l47J21J46k59R8j21J97l3p6o8L14k84K53k32J12J5j53L43k95J58
6021A06qK7k32OJ21k74K27l9K42k22J3J22rj15j5j10K02j70J70m2J48r9K6q7p8
6046i0K07j68O6j65K50o6N0j20M7J28l4j27k2k5O1J12j03l1K59k17Q5n0m6j75
$$ y = [81, 98, 13, 7, 82, -16, -82, 28, -18, -75, -130, -100, 116, -53, -111, 141, 10, -47, 78, -115, -59, -7, 112, 116, 16, -182, 82, -146, 58, 323, -30, 261, -16, 29, -73, -41, -145, -49, 125, -5, 39, 209, 168, 46, -44, 27, -18, 10, 47, -203, -23, 194, -42, -214, 57, -121, 148, 11, 202, 73, 92, 6, 150, -72, 85, -16, 114, 7, -124, 287, 114, -39, -47, 48, 144, 41, 13, -26, -170, 136, 130, 7, -62, -265, -14, -27, -10, 251, -81, 56, -12, 32, 70, -68, 68, 14, -2, 20, 66, 82, -228, 94, 23, 31, -55, -29, -43, 31, -53, -236, -6, -80, 46, 154, -94, 35, 92, -44, -79, -5, -17, -34, -223, 194, -197, 217, -130, -9, 137, -122, -24, -145, 52, 19, -57, -125, 189, -95, 158, -74, 38, 53, -100, 243, -52, 106, 98, 125, -107, -101, 20, -254, -27, -66, 176, -46, -33, 89, 80, -35, -50, -160, 42, -128, 42, 0, 148, 49, 75, -12, -90, 117, -51, 15, -150, 100, 34, 84, -36, 11, 139, 105, -22, -44, -69, -8, 104, 1, -30, 229, 12, 97, 47, 1, -174]
6070a74J34P4r0k6J2K0k9N1L3K19l37m3J27J39Q5j26O5p1K16m40R1JK77k38L6
6095FP9K0k46J0J39J06k17j87J69l9L36j34PL0j32LP8m0P7l1p2k2Q7k08Q6K29
6121A34N5k17j5Q0j74K12K5P8k03J24j47o4J82J47j20j76J25R3j11K4j92J36J4
6144A0J7J5o7j12J39P3k37J17j32L64k43j10K45j14j99K29L0j48l3K04j12J53
6166H9j97J9K20j56M5R1l5j34J43M1j48J05k6j83P9J8K6J19j83m6P3P8o8n7L3
6191e4k10J27R7J02j59M9M1k0J25j03q9P2N5k49P4J87J98m16J10J79j95j61J70
6214g0Q3J02o6o4J38j51n8j21L0L31j23K64k92p3N0j9j40K16j0pP7l04J97j88
6238a98J91k01J93N0o1o1J85k34o2K25j6QR0k07o1K0K01J47n1k7j61j32O8O2L1
$$ y = [-174, -40, 34, -56, -82, -70, -50, -79, -28, 5, 224, -113, -156, -29, 110, 195, 69, 134, 63, 279, -161, -70, -69, 208, -30, 6, 85, 105, -141, -131, 8, 114, -103, -290, -121, -160, 176, 42, 49, 79, -53, -50, 28, -12, 65, 34, -38, -60, 27, -181, -95, 134, 189, -28, -43, 37, -137, 75, 100, 178, -25, 99, -48, -112, 70, 217, 97, -79, 46, 139, 28, 52, -140, -4, 10, 27, 42, -25, -137, 2, 75, -162, -45, -177, 187, -56, -166, 79, -35, -234, -5, 25, -123, -156, 48, -64, 89, -108, -89, 131, -25, 20, 111, 76, -58, 85, 126, -22, 83, 57, -126, -47, -29, -3, 116, -67, -113, -40, 38, -30, -87, -54, -264, -137, -40, 62, -97, -48, -7, -27, 98, -5, -94, -22, 33, -216, -142, 45, 243, -173, -63, 116, -79, -240, -70, 13, 115, 49, -15, 123, -28, -86, -207, -177, 154, 31, 295, 3, -70, -20, -39, -179, 37, 27, 20, 97, -207, -10, -198, -7, -208, -15, 35, -26, -87, 98, -136, -198, 27, 11, 19, 109, -98, -159, -139, 62, 209, 158, 131, -30, -162, -94, -32, -1]
6263aq4J47J22j88k05J12J60p1J18k73O7QJ50j27R4nJ16n6l3r6P7k7L3k17o0M55
6289B16j22j4L8k14K0K1J73k11J36l1Q8J6j99O5r2N1O5j46L13k79l1K19j17N7
6313B2K5R5K6j67O0k4q3R8N5j8p7m7q7P6Jj34L73k76J39q5k13K55o1PJ19j10J08
6340G7Q6k30J77j88O9P5o3j83M61k90K08k20J6j9n0J42j40K27l6k07O6k91M50
6363A37o0q9j13Q9M5M7J01r3PM7mk69L25l03K84k15n9K8M3M8R7k10L88k92O6N2
6389I7j43O3p2ok07L38r8K7q2J03o2p5P1o0J65ok6r8L36k30j62L58q2o4j26Ml5
6416g2J22j32J06L3j9k69K33J6q2J90k63L0J61j7n4K2o8J34J27k0j06r2j2j13
6440a45K49l05N8J87J4K2k07J10q1O7J34P1n7oR8j05j57K12k04O8J18p8n0Q0k1
$$ y = [-1, -85, 62, 184, -4, -209, -97, 63, -8, 110, -163, -96, -88, 62, -65, 29, 24, 140, 84, 51, -45, 32, 5, 38, -179, -239, 216, 94, 80, 118, -96, -76, -55, 118, -93, 43, 12, 100, 116, -83, -18, -110, -59, 6, -140, 173, -106, -137, 82, -35, 22, 47, 142, 168, 1, 61, 37, -46, 52, 107, 89, 12, -35, -122, -46, -45, -179, 194, -82, 57, -28, -241, 14, -47, -40, 79, -31, 77, 163, -67, 110, -78, -9, 66, 3, -180, 281, -9, 199, -21, -5, -24, -74, 68, -72, 155, 119, -88, -22, -313, 137, 77, -12, -125, -36, 9, 56, 157, 64, 71, 118, 114, -155, 170, -133, 151, -64, -123, -95, -52, -4, 93, -117, 271, -21, 45, 97, -46, 17, -55, -61, -268, 70, -28, -1, -83, 20, -42, -117, -46, -106, 59, 53, 27, -71, 265, 35, -127, 231, 149, 85, -41, -37, -72, 50, -82, 24, 57, 38, -231, 2, 18, -64, 126, -137, -107, 54, 37, -17, 5, -63, 71, 198, 178, 72, -20, -32, -145, 104, -201, -143, 44, 58, 80, -127, -17, -98, -31, 103, 174, 117, 111, 209, 104, -53, 159, -45, 23, 141, 63, 13, 93, 72]
6465G2M6j41P1N8k05RJ33N5J15k19K7m7K08q6m10L69P1j60K37k97J53k04K00J7
6489G2j25R6j37J32p1Nm4R5j00N1l7J54j34j51J64Q7K3j45jJ5Jn2L0MK0P1j36
6516a13nQ4k1j8K0L1J41k13m2O6O5l8L68k77N6k67n8J13R4K27j00J19q6P3k09
6541A0R3J08k94K23j51Lo3L9N4NJ7l1L8j43J49j22J38j11J03J2O5j72J78k38P0
6566b0j21J34J8o3O8K3R0j37O4p2P7pk09K90%j91J42j7q6J35j42j6n4qJ52J11
6592A61k68J18Q8k06J37J47j52P3j21J69l7J37k94J71Mj45J15j76j19K86j78o
6614i6L38k10j38K47l0r1N2j91L43l01R7J97q9k29J48m0J84k7k70K29j07O9Q1
6637A66k40J34o5J07j2k44K08q7L5P9j07q0J70J74k33k25K19Q9K3j08jK09l71
$$ y = [72, 118, -23, 48, 106, -99, -90, 43, 98, 213, -6, 21, -26, 182, 96, -314, 55, 126, -34, 203, -94, 59, -145, 55, 72, -53, 43, -94, 38, -33, -28, -72, 23, -77, -26, -63, 91, -43, -194, -30, 57, 80, -65, -66, -51, -50, -102, -72, -68, -48, 23, -113, -118, -34, -55, -73, -53, -22, 119, -94, -136, -70, -5, -43, 325, 48, 104, -163, -221, -108, -14, 213, 113, 232, 146, 219, 10, 103, 211, -83, 140, -11, -8, -71, -32, 22, 27, 44, 13, 51, -92, 57, -65, 73, -38, 65, 77, 142, -30, 148, -90, -20, -141, -7, 11, -52, 16, 39, 129, -8, 56, -16, 61, 54, -155, 135, 135, -56, 86, 69, -17, 118, -24, -40, -94, -102, 50, 161, -107, 11, 99, -107, 30, 177, 25, 98, -23, 146, 109, 246, -48, 123, 127, -18, 97, -79, -198, 88, -90, -96, 242, 32, -106, 141, 111, 20, 72, -119, 224, -77, 20, 217, 128, -101, 47, 7, 191, 164, -106, 123, 16, 85, 166, -74, 60, -5, 102, 90, -154, 54, -33, 2, 81, -26, -106, 64, 238, 5, -220, -1, 88, 111, 3, 2, 211, -160]
6660a60J32L2j6Q1m5Q1l1r7j42K30j32j0kq0K01J37r4Mo8J1P5J02m31J52J06k46
6686b10J29J07l4J49j98K02k50J51k4O2n7j81R4J13Qk5p7j84oK25K33m06K19p0
6710c0l8K21j38P6p9k71K60r3K78k82M8R9mJ44l41J02j8m0K42k00Qn6J41l15O2
6735b24K82j99J33n5J03k65M43j84j54J64q6j11K94%j24rO6k38J77oj33K54M4
6758A72k57N6l9J49%n0R3j88k24L45j32J64j44j19J95j59Q7k05J21L00j84j54
6780a73O5Q3MM3o6n3J3P7r0J63o8J1J01o2J60k34j4l8J76n7Qr9R3L8r4R4L9j48
6808b8j03M4J72r1r2J81r7n0J57o6P5n3m8Ql8R4l95L51J65j79Ro4M0J14k50J22
6834b2L0P4j30K7M9O7j51QJ47j53O8L6PJ03k54J08p7J99k89J45r3J9K45k36K8
$$ y = [-160, -28, 4, -12, 69, 24, 105, 74, -23, -165, 65, -67, -77, -79, -159, 42, 179, 85, 89, 21, 32, 107, 209, -222, -70, 36, -210, -81, 26, -8, 141, -57, 145, -105, 46, 22, 84, 27, -154, -60, 53, 61, 36, -41, -225, -231, -6, 227, -179, 40, -30, -68, 153, 15, 91, 12, -259, 1, -92, 186, -96, -48, 51, 47, 191, -150, -48, -66, -106, 136, -64, -56, -112, 29, -286, -224, 58, -141, -8, -63, 40, -225, 218, 34, -120, 44, -42, -153, 141, 141, 17, 8, 74, -164, 13, 7, -126, 128, 172, -85, -29, -68, 81, 81, 31, 124, -64, -288, 57, -75, 89, -55, -174, 21, -138, -51, -256, -135, 165, -19, -173, -108, -25, -21, 22, -44, -97, -84, -7, -97, 66, -2, 9, 110, 48, 208, -26, -40, -78, 98, 41, 49, -50, 43, 81, -13, 81, 120, -28, -131, -87, 85, -6, -98, 83, -14, -64, 93, 27, 102, 49, 1, 9, -29, 65, -330, 21, 186, 7, 16, -48, -8, 106, -144, -22, 8, 82, -48, -21, 28, 95, -56, -48, 99, -54, 14, 50, 57, 160, -94, 14, -63, 136, -153, -8, -101, -82, 163, -73, -45]
6859d5P0j35O9k8q9Q9J67j42M2M4NL6J49j40K4m2j12k1p0J05R2k17J72j92R9J03
6885C3k28K73pk14K22K5k0j20J02Rp5J18l03K59q9o9P0M7O4j52M0J61j06j09q
6910g7L1p5R0p2J61m7j79M23n75L27J89k05J67j16q0L54j55m8l19K74j0J41n8
6933A41k38j99L27k00O4L24k48M0kK02k80J21k92K94l7K24l25M5j26L47j22j67
6955a07J87K4n0j02M1n4J91j29plR5j74O3J18J4q3K06k13j19%J42j06K02n9j39
6980f2j35L94j46j06j37l3L94l10m5L91j79J3K39k19q5R4j62J16K2om6j42L58
7003B08k13J2j76L41L0r8j75J55J11l53K28j12k00J88k0L38l60K21k35K52n6j92
7025a06J14J12j00r9K1o6J49j61J81q0J9J34q1j57j53K58j55N4L35m57L20l44
$$ y = [-45, 25, -110, -41, -69, -158, -69, 98, -44, -2, 42, 47, 83, 232, 92, 116, 74, -38, -59, -129, -24, 68, -149, 23, -169, -70, 33, -195, 78, 71, -143, 79, 104, 84, -36, 66, 75, 0, 118, -185, 74, -15, -84, -14, 33, 97, -55, -15, 146, 40, -69, -77, -46, -121, -31, -103, 58, 11, -168, 255, -320, 7, 196, -9, 158, 42, -38, 316, 161, 113, -206, 68, 58, 199, 141, -97, -296, 31, -169, -105, 219, -29, 11, 9, 211, -69, 52, -240, 54, 17, 241, -84, -39, -165, 182, 60, -107, 80, 104, 54, -48, -7, -61, 130, 1, -6, -9, 86, -88, -25, 93, 107, 24, 230, 17, -102, -102, 40, -66, 136, 77, -62, -197, 197, 51, -55, -192, -225, 169, -141, -186, 205, 26, 39, 278, 59, -26, 68, -94, 22, 44, 38, -8, -150, 208, -5, 7, -169, 172, 202, 104, -71, 84, 195, -158, 70, -42, -242, -54, -74, 264, -96, 125, -110, 142, 86, -106, 8, 120, 20, -79, -58, -124, 25, -136, 45, -35, -16, 118, 37, -120, -273, -15, -170, -116, 219, -238, 82, -262]
7047b62K81j67P8P1J18Kj09J52k03N4N7m0j28j98K96m9R7L5l9l6P2j58J66N4l1
7072A13j42Q9J0j87J92k30M6q5K93j05J15j76k4pJ50J7j37o3k6P2j1P1k9r6J89
7097C9O2lj56P2J95k14k4j6L7L2Lk71J22K51j83q5p7J75K4j58L83k66M5Qj47J16
7123c6j3J74j2l7j68K64j49K3L11k83k38K36k7j34O1j0N2O2p1O7Pk97J26J56M1
7148A05j93J02j39J44L4n5RJ2r8l9m9K18j79K52j72j70O0J08k3N7j68K94j76J33
7172F7m8PO7k20L46l73J92p0k47K11J75o7J8j15j11L07l42K66q7J23L3j80j16
7195a64L00j94K30l66K10L1j27J1K13K19l38k97L00j9LN7M9o1k3O8k10K45J70
7218C07k87j33K20j86r9L21j2K0k34r0J12J95k04Q6q3J02R3k01j28K76K3J03l23
$$ y = [-262, 19, -148, -70, 1, 119, 121, 12, 164, -39, 15, 72, 32, -96, -294, 2, -47, 50, 85, 46, 10, 82, -76, 90, 144, 113, -29, 60, 70, -117, 75, -155, -109, -194, 99, -6, 109, -67, -91, -98, 52, 69, -68, -131, -157, -85, -96, -25, -54, -150, 39, 101, 98, -58, 14, 209, -5, -29, -45, -8, 24, 27, -244, -122, 129, -54, -139, -216, -41, -17, -175, 208, -58, -13, -5, -152, -36, -49, 125, 113, 76, -92, 172, 23, 46, 357, 74, -164, 72, 45, -89, -28, -38, 14, 76, 5, 72, 79, -218, -92, 64, 105, -88, 14, -125, 19, 53, -2, 7, 19, -79, -118, -167, 51, -128, 124, -48, -218, -158, -50, -73, -16, -184, 110, -66, 67, 19, 26, 93, -127, 219, -154, 38, -32, -279, -68, 107, 40, 58, -57, -168, 139, -203, 63, -24, 99, 132, -48, -164, 136, -58, 172, -194, 16, 47, -80, -69, 144, 363, 25, -272, 28, 9, 12, 69, 118, 57, 34, 102, -108, 137, 307, 20, -113, 107, -79, -178, 143, 131, 151, -83, -173, -61, 134, -70, 16, -67, 35, 128, -73, -201, 75, 98, 201, -122]
7241a22Q5J19q4J58k11L7r2N4Q4j47J56L6q6J56m23L84%j77J25l1q2P3j6K62p7
7266A81k45O8M1N0n7q1n4N1n1j54J91K19j97P2K36l03j35R3J90j29n3j20K43j17
7290f1J15r5n5R9n3j6K0K7m5K36j65J06k0m4J39k32L05k43j16q6M39k15J22k62
7314a00K61o7k6rj85K91q2q7Q4J1p2O4k4R0j94PRKj11J32k87L70o9k1r1R6J37
7341A29m2j19RJ02L26n67o0J38k41L08k9R0j39J00nj11J32l8K1P2j48l6J01q6
7365i3J03p7qJ05k6j39K48j09J2M8m33M36p5j19PQ5K58l91J29K7j93M25j14J43
7389B49k05l09K51K40q3j11J07j25J74l45P0n3K34j55MJ33nj02J28k45J61q7J38
7412F4k18K60j45K6j30J94l5j64J28j88O6L1J3j72J45P2J79j02k22M43k35m6k5
$$ y = [-122, -37, 82, -2, 156, -55, -18, -110, -56, 28, -119, 37, 73, -13, 143, -280, 104, 104, -73, 52, 21, -61, 12, -4, 258, 181, -64, 4, 45, 95, 38, -43, -97, -46, -97, -251, -60, 159, -38, 34, 270, -33, -168, -75, 115, -14, -67, -187, 56, -61, 54, -41, -96, 3, -50, -66, -46, -19, -64, 172, 7, 113, 93, 49, 188, -44, 261, 18, -98, -184, 255, 40, 162, -100, 161, 94, 68, 59, -126, 165, 83, -4, 80, 91, 19, 83, 59, 149, -45, -38, -29, -27, -138, -6, -293, 77, 8, -13, -104, -8, 129, 87, -32, -23, 79, 405, -162, -222, -84, -325, -17, -46, 44, -95, 5, 0, -111, 21, -17, 4, 76, -72, -108, -7, -93, 10, -67, -75, 30, 4, -135, 113, 4, 16, 64, -369, 67, -8, -127, -120, -35, 223, -168, -39, -12, -205, 220, 106, 249, 44, -265, -14, 226, 143, 32, 139, 14, 188, -157, -87, -140, 94, -61, -57, 76, 71, -31, 97, -148, 13, -74, 64, -154, 106, -39, -13, -143, 51, 16, -148, -20, -208, -142, -111, -98, -270, -125, -53, 126, 24, -198, 245, 10, -36, -61]
7435f1R1J10j39j22L00J23m73L99k18L8r0m5r1O2K64l66jP7K3M1K3N9J2N5O4j52
7461a7RL6K7j8j14J27J09j46M2J22k18R3N9j04l5j8r4K86j5j13M3j32J87j66M0
7486a0q5N5K80k80o6K44k27M5J2M9J73mK4j03k35K21j34J07k35K24O1N8k9k90
7510a45J28j93K32j6nk9j02n3J0K83m8J86k59K87m90K12M6pj59J99l0k91J85L3
7534b6j52K28Jr2J61Q7p5l84L93K3o2o6m1j29N4p1J85j50J48J48l41j4O0O9k7
7559g3J02R2j36l5K32j20q4p0Q8j33K44l2j43R0N4Rk25qk8M9K4L6r1K73r8r8J76
7586I5l35K15p2J12M7p2L3m8J17j27J06l11M82j40P2p3n8j67J61j36J19r6j2K20
7610A32j30N9o4j21K32j50jJ32j24O1M4jk4j1L5k40J37R8k08L0R2J14o3l8J27
$$ y = [-61, 30, 140, 1, -121, 179, 302, -171, 228, 10, 48, -42, -87, -178, -116, 148, -218, -219, -142, -119, -78, -55, 4, 16, 71, 135, -17, -8, 28, 55, 37, -77, 50, 159, 13, 55, 177, -41, 52, 111, 7, -28, -46, -140, 146, 131, 18, 61, -71, 116, -50, -10, -95, -40, 240, -40, -106, 138, -89, -44, -32, 17, 190, 186, 210, 107, -128, 93, -41, 66, -169, 55, 116, 174, 145, -145, -17, -210, 22, 6, 1, -28, -130, -183, -173, 110, 62, 248, -11, 276, -214, -2, 44, 37, -122, 77, 47, -244, -59, -26, -178, 50, 51, -41, 120, 207, 132, -252, 141, 164, 102, 36, -5, -134, -80, -151, 34, -116, 32, 180, -161, -175, -115, -46, -73, 29, 121, -15, -50, 182, 62, -22, -92, -4, -137, 107, 75, -68, 22, 76, 85, -140, -148, -176, -127, -103, -67, -158, 115, 17, -81, 95, -240, -25, -97, 15, 62, -10, 23, -25, 92, -35, 71, -240, 242, 102, 174, 101, 43, -124, 37, -99, 20, -76, -88, 132, 2, 61, -3, -124, 108, -42, -43, 89, -35, 26, 70, 69, 45, 34, 69, -171, -34, 64, -144, -114, -22, 92, 29, -9, 118]
7635A18j76J59r0lj00J31j7M6p4M8nj27J4J85l8o2j78J40J00j02p3P0R4J27n2
7660A35j48p0N8j14L44j97M3J00m2l2k4K84m56K17j90j0J61J11o7n9l8n0J69q9
7684C6K8J63l80L17j41J29j05j29K23k66J38r8K06j04K2j58K15k0K5j92j00q0
7706b71J88j16K02j82K2J71j04N7J40q1k35J57J42J02L3k94K22K8l20K70L5k38
7728g2J57k04J51p9M6j26Q2J40j64J20l00K59j41N3Ml9Q8j26L14k46J58O3j82
7751d4j59P3L13k5j02J11k99j1M40l18J64k90l5O9NJ08k3j42M0K61j46J37n4K7
7775A00m47L38N1q3J38j33O3j85J28j3j69J84j17J71m5K84m77J13K40k12J64j80
7797h7J44j60l9J43N2n1k35K27k38J86J64N8L5k76J1J73oM3k77J61k22N04j41
$$ y = [118, -58, 101, 11, 8, -92, 39, 22, 68, -6, 42, 37, -90, -76, 109, 71, 9, -169, -29, 71, -31, -104, -34, 60, 187, 135, -13, -83, -25, -139, 205, 8, 51, 151, 109, 77, 53, 337, -119, 98, -92, -102, 59, 170, 103, 44, 6, -44, 125, 36, 64, 227, -153, 164, 23, 152, 47, -82, 141, -125, 13, -85, 121, 17, 39, -119, 96, 76, 101, -91, -191, -271, -83, -199, 3, -179, -157, 14, -90, -33, 107, 26, -209, -52, 90, 192, 225, -69, 153, 181, -139, 131, 166, -72, 85, -119, 32, -47, -1, -127, -45, 95, -69, 51, -249, 10, -131, -78, -74, -113, -25, -151, 163, -83, 75, 138, -44, -203, -130, 183, 158, 56, 167, -132, -143, 297, -21, 143, -147, -182, -113, -108, 0, -23, -165, -125, 136, -10, 127, 73, 100, -347, -9, 42, -41, 97, -36, 27, -158, -30, -43, -212, -28, -145, 26, -19, 265, -212, -99, 141, -71, 93, -87, 57, -103, -142, 1, 53, 2, -233, -6, -244, -58, 106, 164, 199, -77, -66, 107, 101, 144, -133, 28, -194, 310, 169]
7820A69m8K4l60K51k07K92k54oK65k42m1J85j06J99l01J25J92j09j53J44l1k6
7842c8ll7L8K03k14O4j86M37k56K45k64P5k08NL77l08K21l66P3P6K89k02J54k03
7866b8o0J8J88o8p1K19l78J59J7J93q2m4l5j64J73J3O2j17q2L65j17qj89j1K48
7891B01n1j14M6k31K43R6q9k25O3J33q2r2K26J06k04j67K44o5j56J89n7n5o7K17
7915A09%j04j9Q8m5q5m6L79l44Jp8L11k40J36j05K78k09q1J32m8k66L27qk38J76
7940B1k39J84K03l53J61q3J37k11P2Q7J7j24K78k39K7R5J4O3j21k17J97O3J9k1
7964C0K55l28R6J35k90J18k75K90p0K2J73j08j70Q8J39j67k76J09L23k12J23L2
7986C7k33L32J20j29q4P9j67J60j21j6R3L7k39J56j49j77M43k2k33J82O0j37k17
$$ y = [169, 121, 145, -215, 36, -171, 121, -133, -139, 126, -116, -157, 28, -78, 121, -180, -55, 137, 28, -125, 19, -12, -38, -41, -78, -40, 163, -51, 13, -173, 264, 8, 253, -11, 64, -144, -139, 238, -70, 151, -215, -142, -66, 223, 21, 175, -28, -88, -70, 118, 50, -21, 198, -180, -21, -4, 189, 107, 63, 28, -136, 37, 50, 112, -5, -87, 278, 161, 153, -36, -47, 201, 150, 36, 82, -149, 94, 190, 101, -124, -61, 72, -10, -102, 124, 230, 26, -141, 103, 38, -118, 71, 14, -41, -108, 109, 109, 5, -14, 74, 29, -56, -102, 277, -67, -66, -144, 167, -73, 63, -42, 236, 27, -54, 78, 30, -236, 91, 83, -155, 21, -218, -34, 169, -184, -23, -106, 31, -180, -108, -21, -4, -128, 150, -89, -62, 33, 47, 110, -11, -228, -31, 32, 51, 30, 285, -43, 53, 188, -102, 16, -259, 31, -39, -17, 156, 48, -122, -34, 105, -62, -338, -229, 94, -118, 5, 37, -196, 136, 256, 127, 43, 122, -45, 115, -6, -22, 71, 108, -131, 25, -124, -301, 142, 120, -113, 69, 129, -8, -225]
8009b25K48Lj03K27j09k8j60M3K81k50L9J03L4k36J66q6J05N8J71l78L55k45M3
8032E6L3K4j59l3ql0O1R1p3J86j5l14R3m3J95j08k1R4jj1l9K06j53L9o6J7r0J65
8060I6J44k72pN7k0l09L10R9j24J42j52P4P7k95Q2K39j39K6n3M4j18J08M3M1N4
8085A47j84n4J24rO9j20Q3J08k98j05K45J1q5j17J36J66n3rl37K49l0K1J60k39
8109a21L5R1J40j58l3J32q6J36n0qj04q4J28j93P2p1J48j69K93p0J68j79Mj44
8133a23K14j13qJ11j81K58m6p2k40K31L2L9j69P9j78L4j1J39m9j02J89r3k7J02
8157A6Q7j37m1o6N4J08K3j40Q4j63Q8k6K75j09l53L58j54J24p7M8J6KO3j73L6
8182e7L0L4j35K96j81J3k35J34j15
$$ y = [-225, 23, 26, -77, 150, 41, 13, -147, -104, 177, -73, -34, 69, 103, -133, 33, -53, 52, 110, 281, -97, 258, 13, 56, 89, 113, -46, -79, -87, -117, -56, 35, -38, 148, 133, -181, -88, -131, 64, -44, -65, 29, 28, 17, -22, 184, 31, 70, 4, 21, -69, 96, 240, -32, -39, 18, -2, -311, -1, 98, -26, 116, -36, 38, 115, -180, -98, 141, 2, 28, -25, 19, -99, 9, 52, 93, 147, -37, -91, 33, 24, 93, -27, 56, 164, -134, -239, 6, 17, -68, -185, -49, 117, 64, 55, -282, -33, -63, -42, 118, -121, -86, 5, 145, -13, -46, 86, 0, 136, 86, 78, -26, -110, 18, -175, -103, -174, -26, -195, 98, 28, 196, 17, 21, -123, 91, -22, -30, 81, -100, 158, 112, 40, -200, 31, 63, 102, -67, 12, -166, -132, -143, -4, -53, -155, 34, -59, -86, 16, 103, -34, -75, -141, -87, 21, 44, -96, -12, -175, -87, -113, 162, 53, -300, 58, -96, 28, -49, -1, 15, 17, 80, -93, -57, -27, 7, -128, 168, -13, 0, -235, -101, -216]
8191b16
$$ Imaginary data points
##PAGE= N=2
##DATA TABLE= (X++(I..I)), XYDATA
0@%%%%%%%%%%%%%qJ6j6J6j6J6k4L2l9M7n4O2p2Q8j02J16j33J51j69J93k21K50
35A33k82L15l55L97m40M92n47O06o75P47q25R12j004J106j220J346j483J634j802
54i45J991k205K443k714L031l404L846m381N049n913P071q714J1256j5760K6182
69A6833j00068m3225Q7455j7814K4020L1705M3337J2885N456m634M793l55o3l5920
83B4405j7114J5940j1363m2185o713N698L927o159j1811L05J0174M707R666n40
97b1063J6474M0473J0495j0258K0307J8572j3065l3546k6861n866j3180k7099
109d4617j2904m653J0775K2767m527O23M0390K5199o337o77J4466J4327j1957
122D2875k7196j0704m812j883k592k2659o894K2085K5j7852k327J0751J2941j314
$$ y = [0, 0, 0, 0, 0, 0, 0, 0, 0, 0, 0, 0, 0, 0, -8, 8, -8, 8, -8, 8, -16, 16, -23, 24, -30, 32, -40, 48, -54, 62, -71, 80, -89, 104, -117, 133, -149, 166, -189, 208, -232, 260, -287, 319, -356, 391, -434, 478, -526, 580, -640, 706, -777, 857, -945, 1046, -1159, 1284, -1430, 1601, -1803, 2043, -2338, 2711, -3202, 3869, -4845, 6411, -9349, 16833, -83235, -126460, -39005, -56819, -32799, -1094, 42243, 55128, 60584, 55950, 60743, 60388, 60325, 24405, 7291, 23231, 11868, -30317, -37030, -31332, -27405, -33564, -45375, -45070, -34896, -30189, -20523, -21063, -4589, 35884, 46379, 36121, 56428, 75000, 61935, 28389, 1528, -4338, -17518, -44617, -57521, -62174, -51399, -28632, -33159, -32536, 7854, 33053, 26716, 26039, 40505, 54832, 42875, 15679, 4975, 163, -1720, -4312, -26971, -33865, -11780, -11755, -29607, -31934, -21183, -8242, -9556]
136i556l170J9987J8931N514J108q694J166J0731j7731k3860j736K606p849j9117
150c1670p431J5669L225n462Q999J0606J6345J5964q642m422J4557K401j4518
163A5621j4500l7Q752j0744j6178O16Q75J411n87j1765Q023K3795K848o441M072
178E761J3997J0561j3073j2655O938M90p816r168j2389M032P568j2811p333R829
192a6069J2883N645p267L515J8044P49p507p71j320O278K286j4539n127P199r36
207C063j1441j3694K980J1048p501n738J0195R339J0003L740n994Q965J2587m951
221B2601j1722o385L764j204j9695r793P632P43j088l48Q88J4244J0457n404k882
236A808N276Q673j324j3755P31J1435l969p025k009j421M734k913j2978k202N614
$$ y = [-9556, -12726, 7261, 26192, 31706, 32814, 24120, 25286, 36017, 18286, -5574, -7310, -4704, -12553, -31670, -39101, -23432, -20207, -25669, -16670, -6064, 10281, 26245, 17603, 13181, 27738, 30139, 15621, 1121, 1084, 9836, -908, -17086, -16470, -15595, -14184, -14771, -26536, -18513, 5282, 8130, 1689, 5761, 19758, 30319, 17246, 4591, 11529, 12019, 4203, -4965, -17354, -13322, -5754, -18565, -25898, -16069, -3186, 2459, -4808, -1293, 16751, 17500, 9993, 9222, 7902, 14180, 16466, 1927, -3200, 3999, 3063, -8378, -22072, -19092, -8044, -15545, -21283, -11088, -1749, 8254, 11994, 6000, 14965, 27552, 22601, 10879, 4494, 8258, 7054, -12641, -22434, -14802, -14059, -15147, -15495, -14607, -363, 10094, 4690, 1808, 7084, 15757, 14433, 678, 1409, 12844, 8875, 1850, -159, -1580, 3154, 241, -12737, -14939, -9325]
251i325K163n735o987J1158J4983l505R9J0380O062L506n392j0185L39q81r908
266c228j1294n732Q206M675r328L068J3267M676R53j718j047P224M10p916m704
281b488J697P581j451j0974M768J0269m052o330l236K45L225n602q042K687O457
296e246N705j585k682J2481R094p835m166J240k55k751r447n726L813K229k01
311e332k256P46J2256L961q986M08N372j038m709o472k6N814m39k475K31M197
327A252Q733k576r314M316M891o100o086k668L372L696l991j556M512M467L623
342F571m447m960P248K342q337l406J538M100N66m698J293N983J745l92m767j999
358a620P104k775j0169Q0M486J205k128k985N217O662j319j187o96K032M978n533
$$ y = [-9325, -7162, -12897, -19884, -8726, 6257, 2752, 2851, 13231, 19293, 22799, 17407, 7222, 7561, 6680, -3228, -14522, -20254, -12048, -7373, -16701, -13633, -366, 4310, 5263, 3545, 2498, 9722, 10132, 2216, -2488, -791, 6790, 5339, -5635, -867, 9402, 5350, -980, -4216, -3971, -746, -6348, -14390, -11703, -5246, 459, -1126, -3808, 8673, 17767, 9932, 5766, 7006, 6751, 4000, -5447, -11173, -7360, -5131, -5332, -7588, -6842, 5414, 9375, 389, 797, 6169, 5131, 422, -6050, -6076, -262, -701, -3176, -2945, 1252, 9985, 7409, -1905, 2411, 7302, 1202, -4884, -7552, -4180, -484, -4475, -6031, -1519, 2948, 6571, 2124, -2836, 4412, 6754, -1583, -4989, -3451, 649, 1215, -3483, -2190, 3793, 5538, 5146, 379, -1620, 5484, 2709, -7460, -7380, -2894, -1689, -3817, -6802, -1585, 5077, 3758, 2571, 1875, 3907, 8885, 3352]
374C352p617L971L421l766m302p53N108J854n007l43K336J978K756m764k429P824
390C619K013m607j559K421M314k212o773J386K450q12j653m365R55O934j837n410
406e136K013M943J935l361k846N226K732l041j584j300J974L360n522m463L464
421a606J938k427m024J28O145J355l376K062K808K858J254n666j551M121j467
436B552n702l006J838M408k860l614M710L492P84j5k929K303M326l948m359N23
452a497K825R92m838j556N505J198k990j300j346K044J844n388j624M641L404
467A914M57k146K324O307j198m401p43j066J5l211o642l81L631l01j487P49N690
484d89O352j993p50M028R12j438l022m206J189J380m026k618O63K977J226n258
$$ y = [3352, -4265, -294, 3127, -639, -4941, -5694, -586, 1268, -3739, -4082, -1746, 232, 2988, -1776, -4205, 3619, 5632, 1025, -534, 1887, 6201, 3989, -2784, -1398, 1052, 240, -1413, -5778, -4823, 2111, 274, -5136, -3123, 1820, 3755, 394, -2452, 2774, 5506, 2465, 881, -419, 1555, 4915, -607, -5070, -1606, 332, -2095, -6119, -5991, 154, 1509, -1867, 195, 3003, 5861, 7115, 1449, -102, 4019, 2552, -3150, -6156, -4318, 90, -2770, -6384, -1674, 1818, 2602, 2587, -342, 1961, 6287, 2339, -2020, -1497, 1328, 2320, -2518, -4074, 1431, 2629, -361, -1661, -3007, -963, 881, -4507, -6131, -1490, 1914, 2371, 225, 2549, 8856, 7658, 3257, 2514, 1448, 1463, -1748, -8390, -8771, -5140, -5441, -6928, -6179, -489, 5863, 3870, 3120, 7148, 8060, 6622, 3600, -606, 583, 1963, -2063, -4681, -4018, -1041, 185, -5073]
500e073r52M538j04j827j34N28M553K303k065J000M199L096j776n287K94J533
516D826n608n886j404o22Q74n04j156M754N622K571J24O9M628K509n461k263J289
533D362j347j908l391k708K045P48k418j732Q17M171N06m319J153N544N14l67
549A670Q73K339M103p03l286q90n74r43m248o292R56K675l471j047K431L514L232
566C39L82O95L726K477K11k060k902K130k50o184k330J479J95q45k793K12L176
583b342K90r73n0J165M920O23l258K369L954q56k221k215N39Q98l332k994m15
600c898K55P97j812k574L990L603p24o0K330L220R16k510j061R63j83j314k870
617i32k665K685k04m112k72K122K007j93j141K853L528j65n94p82L23K187k276
$$ y = [-5073, -6025, -1487, -1591, -3418, -3552, -3024, 1529, 3832, 1767, 2767, 6966, 10062, 8286, 2999, 3293, 4826, -782, -6668, -8072, -8694, -7820, -8324, -9480, -4726, 896, 3467, 3591, 3660, 8288, 10797, 5336, 3073, 4362, 3015, 1107, -2284, -4992, -2947, -2199, -4617, -6349, -5532, -1361, -855, -5174, -4021, 1523, 2037, 1670, 2543, 4882, 8985, 8282, 4996, 4106, 3532, 2589, -1659, -7951, -6995, -4320, -7791, -8838, -6407, -2893, 339, 721, 1416, 5142, 7619, 7830, 5770, 2868, 4998, 4748, -1436, -3766, -2287, -2092, -2937, -5730, -5518, -2342, -2052, -3025, -3075, -1910, 3010, 3633, 375, 2744, 6698, 5842, 3621, 1406, 1945, 2843, -489, -3483, -3898, -3643, -2846, -4658, -7232, -3242, 361, -363, -423, 1907, 5127, 6043, 3533, 2472, 3435, 3252, 1938, -932, -3597, -912, -1116, -5228, -5500, -3378, -1371, -1564, -2705, 148, 3676, 3511, 2917, 2135, 2458, 4645, 2369]
634B369l928P39J357j130k232j469J893J654j856N9J397J661K262j844j635L305
650B602J419j647j516K18J846r21l294q61O73n39p48k440L36L965O40j084J572
667B21K848K238p73k181J489N95k344k192k369n06J166k417j874K263K139J382
683c15p10M4L568J218k090l20K78J070P71k615j301K249M7k335k016M4J693j540
701b260k801J174J416Q62P41n55K414L578L05j374M33O73J39l306l484L85p91
718b451j554r60k85K069K346p60P6K379K102O18j966l99K261l76k472l69J33Q78
736A270k77k580l52J555j70j835j629Q00K453q04j256K500J875J527K97r00R64
753C438J266k051k238j362J00L33k928j078J895Q43j5K78N47K316J288j426n02
$$ y = [2369, -1559, -820, 537, -593, -2825, -4294, -2401, -747, -2603, -2544, -1147, 514, 2776, 932, -703, 2602, 4021, 2374, 858, 1076, 2922, 2001, -1293, -2154, -1481, -2020, -2768, -5208, -4872, -907, -267, -1351, 221, 3069, 5307, 4534, 2353, 3842, 4437, 2093, -99, -2468, -2974, -1808, -4225, -6099, -3836, -1697, -315, -1025, -981, 2587, 3805, 1715, 1395, 1673, 2743, 3514, 899, -402, 1847, 1894, -441, -2457, -2413, -720, -2260, -5061, -3887, -2471, -1609, -868, -1423, 991, 4569, 4874, 3500, 3933, 4606, 4745, 1439, -2045, -1660, -2451, -4005, -4965, -5250, -3181, -835, -1595, -1519, 860, 2962, 3580, 1614, 1215, 3476, 3100, 628, 259, 392, 1270, 993, -1587, -1939, -384, -554, -2389, -4018, -3218, -765, -1569, -2825, -325, 1550, 3077, 3374, 2474, 3438, 4704, 2653, 415, -947, -847, -514, -3442, -4520, -2625, -1782, -1797, -1519, -972, 1344, 2632, 1206, 704]
770G04Q17R06o06k656J15K354q71j578O5L97P93o65j877M91J131M2n39j169J885
789b61K162j139r26J534P01P1j052j552J108p3j211j336m37J910R98k091J45K497
807A048L54m75p60k45J608l04j854j02K88R74l33k020J051J758o63p46l8P42J114
826A397r79j344J054K91J95q60j236J433J238j684o44Q35O79L18j057o19J618
843F35j4l65q49K5J610M32k257K03J444J53q27j205J71J254q57q95JN76J318l51
863B02j152J077J870o22r06j74P87K93j410j157Q54j89J42q87n91J815R67j260
881c41j44P85J020m10j303pJ138k12n67m36k2J521R0j737M59R30j51q38j267O35
901h57P19r21J46K35P34J334n35j180J431O21q49j099o71J061J19j397l62J127
$$ y = [704, 1521, 2427, 1821, -835, -720, 1634, 763, -815, -750, -353, 440, -225, -2102, -1611, -480, -438, -977, -2146, -261, 1901, 762, -164, 1370, 2071, 2142, 1090, -462, 646, 573, -638, -1974, -2411, -501, 497, -1594, -1449, 1048, 1402, 927, 167, -78, 1530, 1226, -628, -730, -442, 532, 199, -1821, -770, 988, 325, -421, -459, 283, 1397, 418, -926, 128, 419, 614, -246, -1482, -49, 1189, -495, -1139, -304, 375, 693, -364, -983, 635, 621, 256, -593, -568, 1042, 1474, -783, -580, 864, 1017, 190, -1015, -844, 410, -447, -1342, -1341, -765, 553, 202, -950, 127, 1997, 1375, 469, 295, 1082, 1375, -35, -1192, -338, -527, -385, -1272, -1863, -48, 919, -341, -485, 300, 1320, 910, -393, -400, 738, 526, -41, -477, -499, 1022, 1112, -625, -166, 764, 613, -225, -1492, -857, -138, -1059, -913, -678, 56, 1390, 855, -325, 1106, 1727, 878, -221, -892, 169, 288, -1109, -1471, -344]
919c44L57P43q26k76J662k97j200l78K23L40k56j466P72J318j20K02n25O74J422
938B025q45j547K22M60qj251q98J471M77p23M30l17P39R35j057p69R82L08m41
957A93q00K33J271K17j140L42N47L77m63j530k81Q38l78j090k61M55J486k47m06
976f37J431Q17j53R8r36M28O77j152j489K02K78K01j040n59J339N29o92J97O0
995d01P40O68j061RR63M62k29o30K42R84p97j128r7l3k65n12j085L55J263l60
1015i12l6J31J158J318m83n19J069L4m25q86o19J85M49j406o62J51O03L04r82
1034a528K07J392L09l63K76K63Q14K8q04J2K20l5k46j128K50O51q11j064M60J60
1054i37L93r9p09R62J042k3Jm24J106O71j342p07R28l89m91r39o43J081k41m28
$$ y = [-344, 13, 756, -70, -346, 1316, 1019, -181, -559, -336, 4, -252, -1718, -946, 372, 252, 454, -71, 603, 2025, 1180, -367, -145, 315, 307, -944, -1842, -371, 106, -617, -187, -504, 235, 1170, 113, -656, 326, 634, 193, -607, -374, 897, 1114, -26, 316, 863, 1240, 777, -753, -1034, -196, -574, -1664, -1925, -1470, 16, -231, -637, 794, 1611, 1458, 1556, 620, 1048, 1725, 573, -916, -714, -436, -235, -1275, -1834, -495, 34, -658, -461, -401, 339, 1007, -54, -45, 918, 1380, 1151, 521, 763, 1747, 950, -178, -275, -308, -573, -1085, -2170, -1815, -552, -912, -948, -817, 341, 1659, 1176, 657, 1726, 1760, 1335, 449, -170, 15, 464, -942, -1604, -1453, -850, -546, -1528, -1321, 71, 380, 17, 293, 556, 1370, 1398, 594, 606, 826, 791, 545, -583, -333, 318, -493, -1557, -1097, -937, -544, -643, -1352, -390, 652, 629, 630, 206, 1312, 1983, 641, -66, 862, 473, -18, -957, -1600, -519, -760, -1188]
1074a188j11M43J167K99n34J82J134k48n23m52j5N50n72p54n7L65K14l50p05O34
1094e21J015m74m77M60K56O79o80j03N34J87k89m15l22O26K85j636j84K39L30
1113d90k30m29M53J187L12m30M44K44M29k62r48k86N02r00m84o73K51R69m47k9
1133h17L63Q41M48j32p47Q59O12j031l93K68M48j96p61o09Q03m16M2m75k48O23
1153e18J46m61L91M20O85L50o62N52J020l37q14k99m87On60j267M46K35M5J62
1173i47k48Q81J109k78j24O19J46J98m72p79N22m5o02l49k24L38j80o50J6M11
1193f58j82M36k93P6J241J29k94K28M18M84m04q35M35l10r22j90o03j30O32k87
1213a029o92Q46P73M19j01R7P92K18o93m3K46j38j63o75n97N31l0m59l38K28P22
$$ y = [-1188, -1299, -856, 311, 610, 76, 258, 1392, 1144, 621, 169, 154, 704, 132, -622, -679, -314, -100, -450, -1155, -521, 494, 20, -457, 3, 259, 938, 258, 155, 689, 876, 587, 172, -150, 476, 761, -875, -1059, -820, -490, -720, -1149, -696, 491, 803, 373, 817, 1061, 1490, 1228, 280, -6, 496, -404, -888, -1561, -1310, -341, -788, -817, -454, 387, 835, 703, -44, 815, 1427, 396, 3, 271, 719, 523, -238, -847, -44, -460, -418, -893, -1141, -518, -372, -833, -442, -22, 663, 1013, 351, 903, 1923, 1586, 772, 473, -14, -8, -568, -1835, -1389, -1154, -1109, -947, -1195, -314, 795, 517, 393, 1012, 1158, 1356, 884, 105, 627, 582, -20, -369, -593, -255, -435, -1085, -1069, -658, -840, -404, -697, -621, 620, 749, 455, 683, 1101, 1585, 1181, 346, 781, 471, -451, -641, -1244, -1374, -742, -1029, -1721, -875, -102, 317, 216, 313, 1105, 1323, 630, 587, 833, 695, 532, -143, -740, -209, -239, -698, -1036, -808, -86]
1234h6o1o85M18P19mK00l07L88K21N0o81P4K34J27p41o03L49J52l19k53l00N55
1256e53N59j92P4N17M13j9l03j94L87k04o43j64m6J33r2n14Q6N74K83Jj52QO84
1279F43l29l88J54K54j65m8k84P3L64r8n43J68J61K85o95j80O53J93k39r3J54
1300D0L70K45p34J61J98K8j5p19l10O80k49j60j35L23M84p1m0J57M32J24k84k73
1322B52j18L28p94o61O65j01J32j54j85O05M46m49Q7nL98J34n31j04N06q2k20
1343A49k35k00N07J2l64l15j46J55R6l62K75N00k6j37M09p7L88p3m11K64J8m4
1365C83q76j53L70P5m88r3N50J7J89k30M8N81K7l19Qj04L16K26p17J21J47K4j85
1388h3k69J74K53m11k54LJ44N81l00l33P26L90J13k57k55K55N7n16l32L17R6l47
$$ y = [-86, -147, -832, -414, 305, 301, 501, 194, 582, 803, 853, 172, 246, 480, 607, -134, -737, -388, -236, -555, -808, -1108, -553, 6, -186, -112, 405, 818, 799, 496, 302, 689, 485, -158, -322, -368, -235, -327, -841, -755, -181, 102, 103, -49, -41, 643, 314, -74, 80, 334, 169, 121, -163, -90, 274, 176, -367, -199, -38, 247, -448, -628, 25, 218, -21, -114, 40, 410, 655, -79, 82, 280, 308, 293, -426, -736, -56, -305, -465, -600, -277, 207, 136, 96, 253, 685, 809, 525, 252, 134, 462, -332, -993, -328, -429, -297, -451, -636, -31, 415, -34, 53, 48, 446, 580, 49, -55, 451, 369, 149, -86, -286, 221, 233, -131, -446, -592, -437, -341, -703, -428, 72, 46, -91, 318, 241, 629, 556, 145, 409, 427, 383, -493, -646, -276, -201, -689, -782, -232, -215, -26, -256, -208, 373, 400, 81, 89, -15, 301, 527, -190, -69, 78, 102, -83, -352, -178, 75, -336, -590, -587, -443, 138, -162, -495, 231, 621, 734, 477, 222, 477, 534, 18, -314, 3, 99, -248]
1410b48j15j58L84J71j32m1J03L83q8m23N2L44J3k98j13O8M24l9o10J88M46m9
1432B62l06k32K04K91k26m09J46p5O82j24m58L25L33k58r5o5J38m8l39K0J53J52
1454G1K49m54o5K17Q3m70K36M0j4J75n48L55K99k71J08P7K16J19j29k29K1J31
1476B17K7j39l95K8J18j79j50K2L33J94k15L4K18R4P3j33k34M37jm49J31o0N9
1499C0qj90k16L88j72j23K6RL23j68j08K84K61q7j17P1j93N99m83r0J90j90k01
1522a65j09k24L00l6q3Q1R5K76K30l50o0L59m6q9m01M8K56N5m90J34R0P6K03n50
1546d00J22N36m16p1O6K78J76j63m10L52L04k38Jj28K83j38l28k38Q9J52J75j09
1568a05P5K27Ooj05N9Q9J02m72j4Q6J16j29k18m8N03j71l20N83q7L7j90p1J57
$$ y = [-248, -363, -521, -137, 34, -98, -139, -36, 347, 259, -164, -112, 232, 245, -53, -166, -98, 326, 287, -323, -135, 311, 262, -44, -276, -72, 219, -7, -416, -270, -345, 337, 213, -245, 80, 413, 155, 60, -5, 133, 85, -254, -234, -81, 71, 320, -134, -199, 18, 101, -369, -133, -93, -107, 68, -480, -125, 174, -97, 11, 88, 304, 423, 294, 65, 86, 217, 244, 105, -290, -262, -144, -323, -473, -451, -118, 76, -139, -105, 113, 207, 280, 147, -87, 350, 349, -100, 31, -29, 30, 22, -168, -384, 4, -168, -291, -265, -256, 67, -101, -209, 75, 336, 249, 132, 203, 10, 609, 126, 36, 226, 36, -165, -274, -498, -198, -234, -317, -236, -141, 135, 365, 15, -45, 314, 268, 179, -222, -174, 82, 137, -353, -219, -129, -53, 150, -400, -278, 258, -158, -229, -163, 115, 291, 128, -282, 70, 374, 136, 137, 9, 292, 154, -174, -412, -323, -171, 4, -105, -30, 197, 203, 197, 92, 151, 240, 342, -130, -144, -58, 58, -71, -289, -337, 166, -5, -325, 258, 171, 208, 18, -53, 104]
1592A04J64k83k1q4J57P3k70O9J83j6k28J37k63L20J11j61J4k4J36K7p2k93O37
1615D17l34l39Q4r6P2j90q1J59K22P1K3rK81P0k16q4J41J1j6k05j22J41j86P0
1639a16k73j44M46n8k08r4M62j99M94k46J85J24l8J6j98M9J17l05l30L54j63k29
1661c54Ol17K71J72j0Q0J74J77J43N8k82J72L93n68k0j74J24L8m83l6J10LJ13
1684b10P2j38K33J6k0K04J88J9n1k55K11K10k61k97k13K12%j26r3j15L12q6J09
1707g9O9J30R2N2k56L58J39k5k18k57R0o0j14k94R4J91j07k4R1R0K80j54j27O0
1731B1J74R3j59j39j0K59j60j52L41j40l54J53p9J01K04k85o2L50q1o2n2k8L75
1754C08pj30j20N9k10J41r9l06K24J34q8j25oK70J82j76M1R9j19J43k04j48J76
$$ y = [104, 268, -15, -36, -120, 37, 110, -160, -91, 92, 76, -152, -15, -278, 42, 153, -8, 6, -18, 118, 145, 73, -220, 417, 83, -256, -172, -268, -196, -386, -467, -308, -86, -15, 8, -1, 280, 350, 134, 50, 191, 202, 186, -19, -141, 0, -186, -116, -389, -533, -87, -145, -353, -447, 15, -184, 310, 64, 249, 373, 335, 351, 153, 202, 319, 14, -316, 38, -125, -354, -348, -665, -394, -222, -232, -152, 22, 199, 342, 400, 118, 290, 683, 115, 95, -79, 45, 83, -400, -436, -326, -323, -210, -138, -276, -43, -27, -47, 157, 345, 364, 313, 58, 269, 479, 218, -79, -292, -80, -80, -206, -299, -414, -102, -188, -79, -10, 120, 212, 264, 8, 366, 505, 480, 262, 5, 95, 35, -79, -373, -279, -88, -195, -219, -128, -38, 242, 88, -39, 21, 195, 288, 129, -10, -20, 239, 79, -73, 268, 128, -226, -73, -152, -51, 153, -132, -194, 156, 75, 13, -39, -67, 308, 301, 171, 51, 110, -100, 41, -58, -364, -140, -6, -94, -219, -225, 45, 227, 51, 92, 191, 72, 215, 11, -137, 39]
1777C9k79j28J48M0L6K08k80J62K11q4M3k95J01K67J1r7j30j05J55l1r6L11m45
1800b38k2J50j0J09Or0J68M9J31j47j79O5K84n2l60J30k7j15l3l3k7M8nJ60K17
1825A79j38K11j4q3J72j72J43j63K26k86J83m21J0MO4M1j30k32L39m8JLj68M47
1849A68j98K60j73J48n7p8k82L40o6J91m69P6RL4j82m1K53O4Q5m2m2r8J07M5o2
1874a0K96m8j56J0j37j1j7k46J61K44o4K2j00j2J27K1N1K2j36K31k81J37L9L5
1898A78J1k20k54L70J46k23j76N2K93Lk74j5K45J5R3k61J48k01J50l61L52m2K4
1921E3J02k42J50k45J76j30J52n9lK81l67J39k17J71o9K7lK66J77l12J9j6O0j56
1945d6o0R7j06J13j97J61J78ml99j03L87j24O6j19J92p8l7%j86M09k1j84Q0p3
$$ y = [39, -240, -368, -220, -180, -144, 64, -216, -54, 157, 73, 116, -179, -78, 189, 200, 103, -27, -132, 23, -8, -104, 207, -238, -260, -110, -120, -11, -5, -95, 73, 122, 253, 106, -73, -8, 276, 224, -136, -6, -33, -148, -181, -214, -241, -193, -198, -38, 179, 41, 252, 238, 155, 327, 155, 298, 135, 361, 75, 258, -163, -153, -149, -85, -44, -174, -406, -67, -115, -114, -111, -279, 168, -30, 230, 57, 205, 148, 70, -212, 128, 62, 253, -216, -140, -131, -97, -279, -320, -67, -3, 82, 40, -2, -100, 7, 52, -10, 286, 238, 82, 92, -45, -56, -73, -319, -158, 86, 22, 44, -56, -68, 59, 80, 131, 153, 17, 248, -33, 104, 143, 178, 189, -31, -285, 85, 231, 8, -168, -116, 177, 180, -94, -109, 136, 151, 244, -17, 131, -70, 80, -281, 71, 29, 53, 155, -87, 63, -182, -6, -136, 16, -43, -46, 235, -132, 7, -210, -39, -108, -81, -84, 182, 359, 47, 66, 50, 110, -46, -106, -9, -115, -2, -199, -38, 140, 136, -263, -366, 21, -103, -37, -156, 36, -42, -79, -79, -265, 144, 123, -61, 19, -54]
1969e4J23L3l24K51k7j57k3m1L54K7mk03mL51m1m3k46L91k46j86J00j76K08j09
1993d6m0p5J01J61pl63L95j60N8j29J07K04l8j59J12j0P2L3j37j83J76j16j01
2016a45j94K56j4J66k18j76K79J83N1r3N3k03K83l45J45l2Q2k18L5J4lR2j2O7
2040E3l29K52j18R1r0J71r1J33q3K47m8j02j98J44k59K44n5J37o7P6k52pJ0L4
2064a07L33m02K59j72J96J1l9l81L38j82R7q2J16J33o9o4J05PJ63j40m74M11j69
2087a12k08PJ88P9P5j48J4L14p6L3k60J94P0k91j95J80o4M54m06J83j56J76pk32
2111a88L30j11p1k7Q9j15oK92l5J0j63P4K00m42K34R8j37Jj66L5j08J03L9rK27
2136A54k18J76j14J82J05l50p6L94k64J02q5Nj0r0J61k20j13L18j71n7o4L05L3
$$ y = [-54, 69, 102, -222, 29, 2, -155, -178, -219, 135, 162, 158, -45, -49, 302, 261, 218, -28, 363, 117, -69, 31, -145, 63, -46, -86, -161, -60, 101, 94, -269, 126, -34, 24, -105, 2, 206, 168, 9, 121, 111, 183, 216, 79, -104, 72, -44, -145, -339, -83, -97, 69, -149, -325, -46, 137, 188, 95, 148, -55, 228, -117, 28, -4, 78, -140, -105, -91, -94, -2, -14, 53, -276, -24, -142, -51, -141, 30, -61, 72, -11, 236, 188, 86, -112, 32, -227, 17, -38, 99, 32, 108, -144, -151, -141, -107, 226, -176, 83, -89, 107, 118, 79, -302, 36, -146, -49, -131, -15, 118, 49, -15, 90, 97, 260, 120, -354, 57, -112, -320, -313, -125, -46, 29, -119, -105, 209, 133, 166, -94, 100, 170, -121, -316, -136, -200, 254, -152, 31, -125, 51, 44, -188, 142, 31, -40, -67, 22, -93, -99, 193, 158, 168, 5, 79, 279, -163, 71, 169, 32, 33, -133, -98, -206, -103, -64, -73, 154, -64, 112, -2, 180, 285, -65, -141, 253, -11, 91, 6, 11, 1, -89, 72, -148, -261, 57, -114, -171, -235, 70, 103]
2159A03N3k52P6R9m9J96j64OQ9j65j33K71j20k07J8O2J73K9j24L7L99j35n4m8
2183A60j70j7J69j23J1M8j00J29j68n2J24%j17J58r7J20o2J7m7J35q1l9j81M8
2207a35M1N6K41o6M1k81R5j14K29r9j26Q3j10J86l3j97K04K35K0j0p9k62lK11
2231A27j63q5M9J85j67O4k0J49j38K02l38K58j97k32R2P2Q9j17J84j65J6K46k36
2254a25j4R7J35k1k25M36j27k13K53N1j73j25J29j06j73L41k54k58J88K88N9k44
2276h1Q8J07j9K88j14m04Q1p3J32r5K1%n4j1J27J65l90K56M7J5j83Q3L34l68K48
2301B00J28k67q0k05L18Q6k58p8j61M16j16j56r4O7L52Ok44K73M5j09m8J44j94
2324B5J07k04J22M7j2l2j31N1J35j50M0k9J66o9J38l57P9KpL25m59J96J16j87
$$ y = [103, 156, -96, -20, 79, 30, 226, 62, 68, 157, -8, -141, 130, 10, -197, -179, -117, 56, 85, -39, -2, 397, 262, 208, 160, -10, -27, 142, 19, 30, 78, -22, 107, -61, -113, 11, 11, -106, 52, -45, 75, 13, 30, -17, 118, 37, -2, -183, -135, -94, -38, 203, 137, 178, -103, -8, -122, 107, 8, -118, -35, -145, 41, 8, -189, 15, 250, 270, 260, 181, -81, -84, 127, -36, -121, -72, 113, -54, 10, -10, 139, 1, 203, -135, 123, -74, -306, -214, -142, -53, -170, 14, -151, -135, 111, -125, -139, -42, 93, 72, -153, 283, 156, -57, 196, 247, 74, -51, 78, -28, -201, 140, -114, -372, -184, 104, 163, -81, 7, 114, 95, 383, 269, -135, -54, -127, 5, -90, -69, -69, -123, -134, -7, 158, -232, 24, 71, 86, -97, -14, 320, -48, 200, 328, 61, -19, -224, 94, 180, -78, -156, -317, 99, -17, -173, -267, -200, 152, 158, -86, 187, 232, 123, 75, 219, 25, 132, -72, 50, 97, 85, 53, -78, -27, 108, -42, -2, -31, 135, 66, 204, -153, -74, -72, -79, 246, -213, -17, 99, -88]
2348h8j4O5J6j2o8j23J89P9j19Q5J44l18J77o7%J47k89L77N0k84N0q5J70j63J62
2373H1k92J60j16j29K00K87j05r8J20j95K91l56K32M9j02j83J74%p6k9J84k81
2395a84l3K79j24JR2K9k05Q9R3R2l5m5M2R0l46Q2Nj1J60M0j73R2J38k64J21j07
2421h2J66J3J09l47L25k95K17k5l01J71J0j95J81j24K12q1K65j98n2J09kj08J51
2444A19j23k00K60n4N8l2j51J81j17o1K16j66n8K88k21Q8k70L33p0j72L61q5k88
2467a64K0K15k57L06l34K29q9K13m8j1N7l50J03J05K37k32j28Q7k62J73K25j74
2489g9O0J74j26m1k7j9K6J3lj51J87Q0opk15L97l13j22J85O8m3p6K58k92N2P9
2515E9j65J55oO4l4q4lk50K07K0j32Q0J50N8k03J00M6K5K9J47m29N5K65j98j47
$$ y = [-88, -102, -37, -21, -33, -101, -224, -35, 44, -75, 10, 154, -164, 13, -54, -54, 93, -196, 181, 231, -53, -3, -88, 82, -81, 81, -211, -51, -167, -296, -96, 191, 86, -12, 108, -87, 204, -152, 80, 129, 27, -156, 18, 18, -58, -87, 97, -184, -217, 62, -62, -61, 31, 60, -145, -56, 37, 129, 94, 49, 91, 181, -165, -83, -78, -89, 71, 111, -62, 30, 168, -96, 25, -82, 84, 97, 206, -141, 184, -111, 106, 81, -220, -49, -39, -234, -53, -177, 35, -46, 219, 21, -31, 78, 76, -32, 119, -4, -204, 56, 2, 60, 28, -123, 58, -59, -120, 96, -70, -128, 160, -61, 27, -243, 90, 20, -152, 209, 124, -164, -144, 71, -186, 120, -214, 15, -74, 139, 91, 80, 137, -213, -110, -5, 232, 0, -128, -41, -303, -130, 95, -79, -19, 155, 29, -12, -39, -58, -32, -19, -22, -173, 14, 94, 88, 81, -134, 263, -50, -172, 13, 81, 38, -38, 220, -72, -20, 59, -106, 49, 43, 107, 73, -11, -14, -264, -57, -37, -169, -89, 61, 119, -84, 16, 62, 87, 116, 263, -166, -111, 154, -44, -191]
2540a91m0K81M4M8l5k09K5K66k42K18k92j80J47J43qK7j79M18m78K71j85R1Q1
2563B1k62L04ll5m4L3k7j11K74j35k31J09N4J60j70J99l10O5K50j28R5L2k84J78
2587C4k2QK12k00o6j7Q9J2j23R1j24M41m66J6J31M8P3r5j12J96O1j64LJ12j19
2612A9o9Q2k68J77J56J3j20L97n11O9J02j26K8O7p7J72q1k10J52j20K36O2k30
2635h0J18k84L19k0rLj42J01p6k8l2R4J25j83K00j54J34n4o8J60j42o7Q0j0N6
2660D1j4Rr1J1m4j91Q6N3J40L7j00J21j25P1m0p8J88n6J28p0lnl7J4P2r2p3K0
2688b8J41j78N9N2j0r7K1J1J1j19J32J46k81J05K13k68R2J79j68jR4j21M1O8J07
2713B01O4m58J76Lj63J74m2K61j84J3R8j14j60O3N9n3J24p6K7K49l31p5L14r6
$$ y = [-191, -231, 50, 94, 142, 107, -102, -77, 189, -53, 165, -127, -307, -160, -17, -25, 2, -177, 241, -237, 34, -151, -60, 21, -241, 63, 60, 25, -19, 14, -13, -124, 150, 15, -216, -107, -53, 107, -63, 136, -174, -109, 141, 13, 108, 140, -144, 34, 12, 20, 232, 32, -34, -51, 38, 50, -73, 18, -106, 335, -131, -115, 16, 64, 137, 42, -70, 126, 187, 23, 26, 138, 19, -50, 32, -236, -59, 97, 110, -10, 387, -124, -55, 47, -79, -51, 16, -61, 111, 30, -180, -28, -148, 88, 150, -80, 38, -246, 73, 53, 44, 47, -95, 6, -70, -98, -130, -36, 89, -94, 106, -48, 86, 32, -36, 124, -18, -85, -5, -15, 41, 27, 36, -55, -44, -88, -279, -193, -140, 0, 37, -63, 58, -67, 4, -36, -114, 74, 18, 146, 76, 73, 68, 31, 45, 117, 25, -48, -28, 113, -65, -6, 46, 36, -61, -40, -29, -18, -137, -5, 141, -140, -35, 178, -90, 2, 181, 13, 12, 106, -15, 26, 94, 201, 265, -193, -17, -14, -177, -3, -45, 216, 32, 45, 143, 29, -131, -68, -9, -62, 62, -14, 13, 262, -69, -144, 170, 74]
2737G4j69K10k00K41j03k77L96n4j08J21j83M4J08j33j03K22J8J3j78L2j52LJ28
2760e0j10L76j96j60J03P6k9K69l98L14j14l31K45L1m2M5k54N1J97J12J8j18J78
2783B13l26Q5J33j20K9o2%p7L34l31R6L2p5J66j3k31R0M2J04j34J3j3N1p2j37
2808b03K46k08K81%j11j04L36k85mML3J89k69k7j0rk5Q9q7K56l40K87k0l11K86
2833fL3l8M1J51l2m8j65j34R4R6n6k8J16l25K36K49j71j4q8N7K32k62O7k14J30
2858g9R8Q7j42l0j3M6j6j20K13j58J11J0k02K46N7ok67J33R3O7k4j60K91m26L47
2883A56j31rJ12k62J21o5J13o7j2Q3J01k72J39p2N8J14k3j01k0kk3N4j05K23k83
2908a73L75j93Q5j73P7p1R2j04K1K30k55k41K94K53j35k53r9M40j3j42k35L5J52
$$ y = [74, -95, 115, -85, 156, 53, -224, 172, 118, 10, 131, -52, -8, 100, -33, -136, 86, 104, 117, -61, -29, -181, -178, -50, -160, 216, 20, -140, -37, 39, 10, 279, -119, 195, 81, -250, -5, 26, -16, 29, -225, -174, 23, 135, 153, 35, 213, -113, -28, 105, -15, 14, -48, -48, -125, 209, -122, -26, 6, -69, 97, 84, -147, -57, -15, 89, -45, -32, -45, 6, -66, -203, 43, -165, 116, 116, 5, -99, 237, -48, -52, -48, -15, 174, -95, -122, -132, -141, -166, -77, -164, 92, -248, 39, 19, -292, -6, 27, -11, 30, 181, 149, 101, -64, -198, -104, -8, -64, -92, 24, -301, -65, 184, 13, -1, -89, -32, 200, -62, 5, -209, -79, 19, 106, -36, -66, -79, -33, -49, -169, 44, -114, -3, 7, -195, 51, 108, 102, -165, -32, 61, 128, 104, -56, 235, -191, 156, 25, 16, 128, -134, -13, -78, 35, -32, -44, 39, 140, -132, 7, -65, -7, 107, 84, -17, -37, -39, -62, -8, -113, 110, -173, 202, 9, 94, -79, -2, -73, 19, -85, -64, 166, -89, -330, -36, 217, 82, -171, -270, 170, 157, 15, -220, -185, -33]
2931c3K2Jq6K08j61q3J16J19q0P5k70K11j9n9J06q2p8J41j49lJ29m8j1n7Q9l0
2957c2r8K17j2k45J77k23P3J20j90J71J65j63o3K10k07J2oK09l6p4lP4r7l9J37
2982G7j98P7J16r0j80J59k07L13o5k2R0r6r1K72m1k0K88m29J64O8L9l27J17n0
3006c6n7jQ6n6J54l3J25n5l06O9m6J10m4P7N7j22m3j03K44q4Q5p0J62j5J8j52
3032c6N2k40m3L12l6RP6k2K10k25l8J30j68J61k52k5K38j32p9K73j80l3R6N7Q7
3057A92K0k04J36l30M09k51j6q5J53r9R3O6p0m4M9j43R2J70k08j7O6p8P2J8k9
3082c8J63j03LJ29j23J50k05J09n1k17M19j03q2j56J99p8j6o7J76j96K02j65N5
3105Ej0L9l0K17l17K12J36k99J01o4pl2k29K25Q4k1O1J79r5j68K00j52o0J95j27
$$ y = [-33, -11, -10, -96, 112, -49, -132, -16, 103, 23, 98, -172, 39, 20, -39, 67, -15, -93, 48, -101, -104, 25, -23, -34, -91, -2, -32, -130, 87, 75, -170, 7, -216, -143, -23, -213, -42, 123, -40, -103, 107, -100, -88, -94, 115, 79, 5, 2, 76, -21, -60, 77, -121, -44, 72, -18, -198, -39, -246, 67, 2, -20, 70, -26, -117, 155, 114, 94, 382, -47, 117, 185, 224, -103, 14, -36, -93, -94, -8, -64, 90, 57, 182, 127, -179, -110, -156, -46, -90, -13, 44, -78, -121, -224, 20, -64, 21, -49, 113, 98, 116, -36, 16, -224, -267, 45, 9, 18, 94, 72, 282, 57, 19, 149, -19, 142, -110, -135, 103, -29, -108, 165, -15, -48, 48, 105, 192, 212, 8, 144, -186, 223, -28, -44, -129, 24, -75, 18, 84, 14, -30, 19, -124, -32, 138, -70, -87, -21, -99, -27, -9, -38, 125, 22, 25, 154, 31, 181, -24, 85, 34, -183, 236, 133, 51, -105, 94, 16, 0, -67, 109, -87, 115, -50, 5, -5, 34, 4, 221, -96, 116, 252, -47, 54, -10, -17, -49, -278, -53, 31, 10, 71, 250, 155, -13, 187, 35, -25, 170, 43]
3130D3o2r7J33p0Q2J5k6p6L67l45n7R8j8P2j35n5o1J43L5r4m1L36j47J72K1j45
3156H8k06L6j36K20k3K1Nm6O8P1o1r7j9L8jj6J0m5O3J60k16K94k32LJ04k47J24
3183d0J74k08q2K64rj88jj12R8OP3R5L3l08K09J19p4K4n0K2Np8J34k43K31n0M6
3210I0p6j22L2M4R2M5o5n2j9o9K44j20qj13P2N3r4K78k47J9LN7j04J0O1N0j1M
3238E4j08J44j95P5J6J7j24M7K41m74L72r6r8P6J24j4j36J38O9J0j70p4K02m0
3262E6J16j78J02Nj37k58J10J14P4J07p9j17J32J0N7o0J70j42j38J50j04N6R2
3285A38k12R2n6P9q9K17j77k66M72j94NL2k5p9J2P5J0k85K52P8o6J34k76J97K6
3310I4l21J84O7j09K3K1J98j61N2O6m5J53j93J7K7J20j87J3Rn8Rj19M6K35j74
$$ y = [43, -19, -116, 17, -53, 29, 44, 18, -58, 309, -36, -93, 5, -13, 59, -76, -131, -192, -49, -14, -108, -149, 187, 40, 212, 233, 88, -118, -82, -218, 2, -21, 0, 5, -41, 27, 98, 37, -60, -79, -41, -42, -58, -48, -93, -30, 130, -86, 208, -24, -21, 83, -164, -40, 134, -74, -156, 108, 99, -89, -90, -202, -104, -98, -25, 70, 103, -205, 4, 123, 49, 73, 23, 45, 50, -28, 106, -137, 94, 44, 90, 14, -108, -76, -32, 60, 105, 40, -12, -31, -100, 144, 24, 16, -97, -25, 28, -66, 212, -35, -16, -13, 44, -60, -50, 11, 61, 50, 54, -54, 90, -105, -30, -14, 3, -121, -74, 167, -307, 65, -31, -129, -53, 71, 57, -79, 59, 128, 138, -32, -106, 96, 56, 172, -6, 96, 101, -36, -294, -184, -70, 4, 111, 32, -85, 47, 57, 114, 54, 224, 82, -56, 94, -10, 46, 138, -74, 18, -38, 41, -48, 169, -8, -274, 198, 4, 9, 41, 16, -63, -51, 24, 34, -251, 1, 79, 13, 147, -129, 68, 94, -227, -43, 24, -85, -62, -41, 157, -4, 48, 114, 69, 222, 29, 46, 73, 193, 6, 19, 28, -30, -21, -140, -94, 141, -33]
3335c3O6j46Q0K93j54j72o9K13j20k3l0Pk7LP7Q9k4j57J83k3n0J77%n8k38l4J47
3362b3l1Q8K8j26K16k36R4k25J98j1m8M63l94R5Jm0j99K15j15J25J6k20M7R8j20
3387a04L00l37J9NJ10J25O8m6K1j9j38r6k03L20j34J37l5n7M1n9R9k3K1J62j30
3412D7Q9o5L1p9p4J21p4j47K38j4n3j34q9M22k96K09k92R5oJ49k58K87O4k78K24
3437A17k16n9J81L0R3j66J9p1p1K9J12j33J2N6n5J93j76q8K06J7j70K07J56j90
3461C3nK31m03J37J09p4Lq5J02P2l9m2P7j92Rp5K97k30J17j9r0K79j19j56J80
3486A17l33K35j95J25N3q7J48r0J6O5r0O9J6L2k25M1N7m7J10k18K56l0OJ80k88
3511g7o3j12R4K09j66N13l93M1J05k86L48j74N0j95K51kk14n6K47r9k9O2k2l17
$$ y = [-33, 33, -113, -33, 260, 106, -66, -135, 78, -42, -65, -95, -88, -115, -112, -35, 54, 30, -127, 56, 33, -17, 160, 160, 102, -136, -170, -23, -54, 34, 62, -64, 152, -84, 10, -215, -17, -28, -76, 387, -7, 88, 89, 49, -150, 65, -50, 75, 91, -129, -82, 16, -104, 196, -141, -122, -117, -7, 118, 186, 140, 161, 142, 4, -92, -295, 25, -109, 28, -7, -64, -23, -82, 17, -6, 15, 177, 47, 136, 71, 102, 23, -51, 70, -4, -151, 87, 73, 20, -114, -203, 219, -77, 132, -160, -65, -71, 78, -180, 107, 171, -107, 117, -99, -158, 23, 53, 146, -20, -1, -72, -143, -114, -2, -135, -123, -67, -122, 71, -105, -193, 13, 30, -140, 67, 223, 33, 28, 259, -144, -7, 102, 28, 31, -54, 48, 120, 81, 39, 116, -76, -67, -142, 155, -75, 42, 23, -67, 212, 93, -63, 117, -216, 19, -176, -51, 2, -85, 63, -27, -11, 54, -36, 33, 49, 81, -144, -103, -46, -93, 17, -201, 55, 25, 31, 211, -77, -140, -252, -158, 51, -115, 398, 5, 46, 151, -135, 213, 39, 89, -106, 145, 143, -71, -127, 120, 21, -8, 54, 32, -285]
3535b85K92n0Q3N1r7j04J14r2J09QL2j50P8l1L7J04j85O4J38k18J11K24j37k07
3559a11J43k88M63j10j80m3J34J19k57M4J19O4R9j71Q4o2j61P3r8K89k39J87k7
3582G1j68K07j01j65J10j93L80r6J1n5l6n9K88j17k6mo8p2K19O9j07k12L13j69
3606B0j36J63oj28Q9jP2N9J09j09L1k21J7LQ6rk54K38K6l9MJ39j18n4K38k56J05
3633F8j14M8o4J95j79J15q8J33p5L4Oj50Q8O6Q5k59j11J97j1k35L26J7Q0k37L08
3658B43k74J02j08p4R3J21j03j09M5J51k00m6J25n1K02p6k2J23k22K3O9j45mK95
3682A58j69j05K08O6j89L46m32L63m40J93j2oN3k24J66O0L9m1k0k6K5P5o6k02
3706a80R6J35K7N3j40P3J06p8r8r4J28J00j61J16q0N8p3P1r7j02N9MK46j25Pj11
$$ y = [-285, 7, -43, 40, 91, -6, -110, 4, -88, 21, 29, 61, -89, -11, -42, -5, 99, -86, -22, 116, -102, 9, 233, 96, -111, 32, -256, 207, 97, -83, -126, 8, 127, -130, -86, 33, 97, 196, 25, 109, 47, -114, -41, -139, 150, -89, 98, 71, -97, 110, 9, -156, -46, -239, 141, 45, 56, 1, -35, -94, 194, 77, 51, 47, -21, -93, 126, 195, 88, -124, 189, 20, -116, 47, 41, -87, 2, 1, 73, 132, 241, 132, 163, -58, -41, -38, 48, 39, -215, 23, 49, 10, 14, 153, 35, -19, 219, -37, 68, -46, 2, -62, 133, -46, 69, -19, 114, 39, 73, 79, -71, 17, 83, 168, -91, -202, -5, -16, -251, 75, 92, 172, -65, 243, -31, 71, -37, -111, -18, 103, 0, -109, -64, 87, -113, -159, -34, -85, 117, 41, 19, 142, -80, -57, 12, -133, -137, 158, -11, -116, 92, 158, -31, 315, -117, 246, -194, -1, -13, -19, 34, -190, -24, 36, 75, 34, 14, -12, 13, 88, 22, -180, -84, 51, 78, 131, -9, 64, 170, 92, -6, -100, 28, 128, -33, 83, 3, 61, -12, 59, -38, -140, -81, -77, 169, 44, 51, -60]
3732f0K19pj86Jo1K30r3j74J91j85r4OJ20k0N9k37L41r9M1o4P2P0j69K30j58K29
3758B02j22K2K0k6k20J7O8PR6q9K34k32j57K96k24J42J06j68K29j20l6p1rJ30
3782I5n5m4K12k34J34j86Q1J98l72N7J47J7J76k38O4J18j36m0j7n0O0O4n0j08
3806a07MJ93j68J5J68N7j41p5R0j48J47j37Q4k37J67J0K6m6J85j39M1k18k6J42
3830a13J73Pj59P0K57j40k72O1K67j50k39J40K41L2j44j3m7O4k77L15j80K1L6
3853e0J09p8k11J64J65j11j34K79k70L60k87q8O6Q8n9J94ol4j00M3j05J93L9q7
3877H0l3p2K1J23q2O6o0K6J28j58J89j34j12R9Qk90M3K12j23P8j3q9J23M6j46
3902g0K9K32n10K97J30j12qj19J48M9k09N0J4J38j88J76l9L3j02n3R3N1K4j34
$$ y = [-60, 159, 152, -34, -33, -94, 136, 43, -131, 60, -125, -219, -213, -93, -113, -54, -291, 50, -49, -8, -72, 0, 70, -99, 131, -27, 202, 80, 102, 122, 96, -124, -107, -39, -32, 64, -25, 209, -23, -180, 116, -108, 34, 140, -28, 201, 81, 45, -26, -35, 95, 40, -4, 208, -26, 108, -78, 3, 201, -171, -114, 33, 50, 226, -12, 52, 170, 34, -6, -23, -73, -13, 51, 1, -107, -103, 90, -78, -63, 105, 162, 21, -54, 36, -112, 35, -102, -18, -255, -88, -78, -52, -98, 87, -52, -11, -229, -255, -113, 60, 67, -92, -22, 235, 95, -177, -116, 151, 1, -238, -98, 143, 175, 31, 18, -29, 35, -242, 73, -107, -86, -50, 59, -19, -230, -66, 99, -12, -146, 133, -137, 223, -64, -152, -86, 2, -57, 137, 131, 97, -3, 40, -65, 128, 167, 80, 47, -25, -4, 119, 37, 103, 43, 69, 197, 39, 228, 94, -18, 81, 89, -201, -158, 54, -69, 9, -4, -93, 30, 76, -70, -41, 191, -319, -22, 108, -4, -12, -131, 17, 66, -143, -93, -79, 59, -129, 47, 8, 41, -61, -114, -21, 30, 54, -80]
3926h0Q1L3m8J3nj0k3J42q8k67K39l0m2Q2j01J35k9m9n0j8Q5N7q2J49J9j15L9
3953C7k0r7K55k08M8R6j68OJ12O8k88J72j24L16j77o0M5J2j00Q8P3O5j31PMK2
3979E3j19o9OJ60l2k9K3R1k10N1K39l02M2oJ58J40j52j28O0j46K53M2LP7q8k50
4005a33J52k23J62j15lK05q1q0K4N3O9J54l11J75l7nn0nJ40k26q6K16J56j78K8
4030Ar5K71j80j37K4K40J03q1k22K22O9j57j37Q5o1j26K52M0p4k55J57j88K81
4053C2%K9L1j07J06j90J91j37j22K32j93LJ78J41l02N2j26J65j63L26m13J87K5
4076e5j4J26J3o3j18K61L0k08J7Q9L5N0K8k45j3J74j62R3m2j89j7P8K5K4PP8j68
4103a66K69l17J42J99j35RmK01Oj49j3p1P0j5P5M8k49K26r3k53K56K5j32j4j40
$$ y = [-80, 1, 34, -14, -1, -6, -16, -39, 103, 15, -252, -13, -43, -85, -3, -104, 31, 2, -47, -97, -115, -30, 27, -55, 94, 113, -2, 37, 17, -80, 175, -33, 15, 111, -57, -51, 61, 129, -159, 13, -111, 205, 28, -32, 13, 25, -75, 13, 86, 151, 20, 27, 31, 53, -66, -135, -129, 31, -1, -30, -7, 84, -126, -75, 164, -138, -96, -102, 56, 196, 44, -84, -24, -170, 83, 125, 128, 205, 117, -133, 19, -204, -42, -157, -160, 45, -36, -116, -92, -39, 30, 184, -127, 48, 11, 6, -44, -49, 91, -135, -221, -5, 151, -27, 1, -94, 177, -3, -140, -116, 124, 227, 146, -76, 146, 215, 58, -79, 6, -55, -181, 71, 111, 37, -218, -61, -249, 32, 32, 61, 92, -15, 91, -99, 92, -45, -167, 65, -128, -125, 53, 194, -108, -56, -182, -17, -180, 146, -267, -80, -55, -69, 57, 70, 7, -111, 150, 180, -28, -11, 78, 113, 163, 191, -54, -67, 107, -55, 38, -4, -193, -210, -132, -107, -83, -76, 2, -166, 103, -214, -72, 127, -8, 1, -3, 198, 204, 55, 42, -29, 41, 26, 101, 149, -100, 126, 33, -220, 36, 61, -71, -85, -225]
4128b25K23J50j49K04j28j21nM6m5r6m8J93j55K15j51l1J71m8r8MM5J05j19Q8
4152B5l5j05Pn5j9P3J15Jj63K20j77O3M6k75L81J60k15Ok8O1j27R8n3j12J57j00
4178e1R5j49L7qJ66m6j48J04j85J34K0j16L9K81j38p0j58J44k2k06M29j82j33
4201a63P8j8M4r3O7L53k36m9J1l5J29j21ON6j5J6j5j26J25M1J51q3J5k9q9pJ92
4228B05j4m01L8J35J53R4k46p2J39j44O0J45j39k14N68l17J07Q5j86q7m4K00k
$$ y = [-225, -2, 148, -1, 203, 75, -46, -51, -5, -50, -146, -194, -1, -156, 59, -92, -123, 48, 0, -98, -94, -49, 56, -63, 25, -10, -115, -108, -163, -182, -109, 6, 7, -156, 64, -113, -50, -4, -279, 102, 262, 47, 53, 25, 86, -41, 57, 4, -108, 49, -51, 44, -105, -68, -76, 90, 44, -104, 0, -185, -51, -31, -147, -108, 173, 35, -35, -193, -49, -71, -277, 152, -30, -163, -85, -103, -59, -152, -85, 268, 32, -17, -6, -41, 88, -33, -27, 29, 14, 30, 15, -111, 14, 55, 206, 123, 138, 109, 20, 13, 205, 191, -210, -172, -37, 116, 210, -36, -108, 31, -113, -53, 92, -47, -261, 307, -10, 97, 182, -4, -91, -135, 65, 63]
$$ [...]
8191E
##END NTUPLES=NMR FID
##END=
