##TITLE=1H_DE-80H_X3
 200.13MHz, d2o
 8 sc
 
 19ns.26.2.2025
##JCAMPDX= 6.0         $$ Bruker NMR JCAMP-DX V2.0
##DATA TYPE= NMR FID
##DATA CLASS= NTUPLES
##ORIGIN= UXNMR, Bruker Analytische Messtechnik GmbH
##OWNER= pz
$$ XWIN-NMR		Version 3.5
$$ Fri Apr 11 16:34:43 2025 Russian Standard Time (UT+4h)  Yarkov@DPX200
##.OBSERVE FREQUENCY= 200.1313
##.OBSERVE NUCLEUS= ^1H
##.DELAY= (6, 6)
##.ACQUISITION MODE= SIMULTANEOUS
##.ACQUISITION SCHEME= undefined
##.AVERAGES= 8
##.DIGITISER RES= 18
##SPECTROMETER/DATA SYSTEM= spect
##.PULSE SEQUENCE= zg30
##.SOLVENT NAME= CDCl3
##.SHIFT REFERENCE= (INTERNAL, CDCl3, 0, 14.3821)
##AUDIT TRAIL= $$ (NUMBER, WHEN, WHO, WHERE, WHAT)
$$ ##TITLE= Audit trail, XWIN-NMR		Version 3.5
$$ ##JCAMPDX= 5.01
$$ ##ORIGIN= Bruker BioSpin GmbH
$$ ##OWNER= Yarkov
$$ C:/Bruker/XWIN-NMR/data/yarkov2/nmr/H-C/1/audita.txt
$$ ##AUDIT TRAIL=  $$ (NUMBER, WHEN, WHO, WHERE, WHAT)
(   1,<2025-04-11 16:33:06.25 +0400>,<Yarkov>,<DPX200>,
      <created by zg, POWCHK disabled, PULCHK disabled
       configuration hash MD5:
       00 E9 B6 7A A2 85 ED C7 34 08 36 98 17 FE 4E 26
       data hash MD5: 16K
       D2 AB A5 D7 4F 51 FC 3E 28 14 4E B6 73 E6 2B 7D>)
$$ ##END=
$$ 
$$ hash MD5
$$ EE 55 46 A5 2D 19 75 6E 6E 43 0C C4 35 CA CF 69
##$RELAX= 
##$RELAX= 
##$RELAX= 
##$RELAX= 
##$RELAX= 
##$RELAX= 
$$ Bruker specific parameters
$$ --------------------------
##$DU= <C:/Bruker/XWIN-NMR>
##$EXPNO= 1
##$NAME= <H-C>
##$PROCNO= 1
##$TYPE= <nmr>
##$USER= <yarkov2>
##$AMP= (0..31)
100 100 100 100 100 100 100 100 100 100 100 100 100 100 100 100 100 100 
100 100 100 100 100 100 100 100 100 100 100 100 100 100 
##$AQSEQ= 0
##$AQ_mod= 1
##$AUNM= <au_zg>
##$AUTOPOS= <>
##$BF1= 200.13
##$BF2= 200.13
##$BF3= 200.13
##$BF4= 200.13
##$BF5= 200.13
##$BF6= 200.13
##$BF7= 200.13
##$BF8= 200.13
##$BYTORDA= 1
##$CFDGTYP= 0
##$CFRGTYP= 5
##$CHEMSTR= <none>
##$CNST= (0..31)
1 1 145 1 1 1 1 1 1 1 1 1 1 1 1 1 1 1 1 1 1 1 1 1 1 1 1 1 1 1 1 1 
##$CPDPRG= <>
##$CPDPRG1= <>
##$CPDPRG2= <>
##$CPDPRG3= <>
##$CPDPRG4= <mlev>
##$CPDPRG5= <mlev>
##$CPDPRG6= <mlev>
##$CPDPRG7= <mlev>
##$CPDPRG8= <mlev>
##$CPDPRGB= <>
##$CPDPRGT= <>
##$D= (0..31)
0 0.7 0 0 0 0 0 0 0 0 0 0.03 0 0 0 0 0 0 0 0 0 0 0 0 0 0 0 0 0 0 0 0 
##$DATE= 1744374785
##$DBL= (0..7)
120 120 120 120 120 120 120 120 
##$DBP= (0..7)
150 150 150 150 150 150 150 150 
##$DBP07= 0
##$DBPNAM0= <>
##$DBPNAM1= <>
##$DBPNAM2= <>
##$DBPNAM3= <>
##$DBPNAM4= <>
##$DBPNAM5= <>
##$DBPNAM6= <>
##$DBPNAM7= <>
##$DBPOAL= (0..7)
0.5 0.5 0.5 0.5 0.5 0.5 0.5 0.5 
##$DBPOFFS= (0..7)
0 0 0 0 0 0 0 0 
##$DE= 6
##$DECBNUC= <off>
##$DECIM= 32
##$DECNUC= <off>
##$DECSTAT= 4
##$DIGMOD= 1
##$DIGTYP= 9
##$DL= (0..7)
0 120 120 120 120 120 120 120 
##$DP= (0..7)
150 150 150 150 150 150 150 150 
##$DP07= 0
##$DPNAME0= <>
##$DPNAME1= <>
##$DPNAME2= <>
##$DPNAME3= <>
##$DPNAME4= <>
##$DPNAME5= <>
##$DPNAME6= <>
##$DPNAME7= <>
##$DPOAL= (0..7)
0.5 0.5 0.5 0.5 0.5 0.5 0.5 0.5 
##$DPOFFS= (0..7)
0 0 0 0 0 0 0 0 
##$DQDMODE= 0
##$DR= 18
##$DS= 0
$$ [...]
##$SUBNAM2= <"">
##$SUBNAM3= <"">
##$SUBNAM4= <"">
##$SUBNAM5= <"">
##$SUBNAM6= <"">
##$SUBNAM7= <"">
##$SUBNAM8= <"">
##$SUBNAM9= <"">
##$SW= 18.0517328524113
##$SWIBOX= (0..15)
0 0 2 0 0 0 0 0 0 0 0 0 0 0 0 0 
##$SW_h= 3612.71676300578
##$TD= 16384
##$TD0= 1
##$TE= 0
##$TE2= 300
##$TE3= 300
##$TEG= 300
##$TL= (0..7)
0 120 120 120 120 120 120 120 
##$TP= (0..7)
150 150 150 150 150 150 150 150 
##$TP07= 0
##$TPNAME0= <>
##$TPNAME1= <>
##$TPNAME2= <>
##$TPNAME3= <>
##$TPNAME4= <>
##$TPNAME5= <>
##$TPNAME6= <>
##$TPNAME7= <>
##$TPOAL= (0..7)
0.5 0.5 0.5 0.5 0.5 0.5 0.5 0.5 
##$TPOFFS= (0..7)
0 0 0 0 0 0 0 0 
##$TUNHIN= 0
##$TUNHOUT= 0
##$TUNXOUT= 0
##$USERA1= <user>
##$USERA2= <user>
##$USERA3= <user>
##$USERA4= <user>
##$USERA5= <user>
##$V9= 5
##$VALIST= <valist>
##$VCLIST= <CCCCCCCCCCCCCCC>
##$VD= 0
##$VDLIST= <DDDDDDDDDDDDDDD>
##$VPLIST= <PPPPPPPPPPPPPPP>
##$VTLIST= <TTTTTTTTTTTTTTT>
##$WBST= 1024
##$WBSW= 4
##$XGAIN= (0..3)
0 0 0 0 
##$XL= 0
##$YL= 0
##$YMAX_a= 135050
##$YMIN_a= -192098
##$ZGOPTNS= <>
##$ZL1= 120
##$ZL2= 120
##$ZL3= 120
##$ZL4= 120
##$ABSF1= 10
##$ABSF2= 0
##$ABSG= 5
##$ABSL= 3
##$ALPHA= 0
##$AQORDER= 0
##$ASSFAC= 0
##$ASSFACI= 0
##$ASSFACX= 0
##$ASSWID= 0
##$AUNMP= <proc_1d>
##$AZFE= 0.1
##$AZFW= 0.1
##$BCFW= 1
##$BC_mod= 2
##$BYTORDP= 1
##$COROFFS= 0
##$CY= 83.5205535888672
##$DATMOD= 1
##$DC= 2
##$DFILT= <>
##$DTYPP= 0
##$F1P= 10.8118882576601
##$F2P= -7.23987719738617
##$FCOR= 0.5
##$FTSIZE= 0
##$FT_mod= 4
##$GAMMA= 1
##$GB= 0.15
##$INTBC= 1
##$INTSCL= 1
##$ISEN= 128
##$LB= 0.25
##$LEV0= 0
##$LPBIN= 0
##$MAXI= 10000
##$MC2= 0
##$MEAN= 0
##$ME_mod= 0
##$MI= 1.114404
##$NCOEF= 0
##$NC_proc= 0
##$NLEV= 6
##$NOISF1= 3.799351
##$NOISF2= 2.8
##$NSP= 1
##$NTH_PI= 0
##$NZP= 0
##$OFFSET= 14.38212
##$PC= 1
##$PHC0= -828.9437
##$PHC1= 10.73372
##$PH_mod= 1
##$PKNL= yes
##$PPARMOD= 0
##$PSCAL= 0
##$PSIGN= 0
##$REVERSE= no
##$SF= 200.129724274929
##$SI= 16384
##$SIGF1= 3
##$SIGF2= 2
##$SINO= 400
##$SIOLD= 16384
##$SREGLST= <1H.CDCl3>
##$SSB= 0
##$STSI= 0
##$STSR= 0
##$SW_p= 3205.1282051282
##$SYMM= 0
##$S_DEV= 0
##$TDeff= 0
##$TDoff= 0
##$TI= <>
##$TILT= no
##$TM1= 0
##$TM2= 0
##$TOPLEV= 0
##$USERP1= <user>
##$USERP2= <user>
##$USERP3= <user>
##$USERP4= <user>
##$USERP5= <user>
##$WDW= 1
##$XDIM= 8192
##$YMAX_p= 0
##$YMIN_p= 0
$$ End of Bruker specific parameters
$$ ---------------------------------
##NTUPLES= NMR FID
##VAR_NAME=  TIME,          FID/REAL,        FID/IMAG
##SYMBOL=    X,             R,               I
##VAR_TYPE=  INDEPENDENT,   DEPENDENT,       DEPENDENT
##VAR_FORM=  AFFN,          ASDF,            ASDF
##VAR_DIM=   8192,          8192,            8192
##UNITS=     SECONDS,       ARBITRARY UNITS, ARBITRARY UNITS
##FACTOR=    0.0002768,     1,               1
##FIRST=     0,             0,               0
##LAST=      2.2672688,     0,               0
##MIN=       0,             -192098,         0
##MAX=       2.2672688,     135050,          0
$$ Real data points
##PAGE= N=1
##DATA TABLE= (X++(R..R)), XYDATA
$$ [...]
1637C5j40L09j13J21l99L24k13J60O5l06R2N7p7J24j96R4K53p0J7m0l54K71j01
1660h7qJ96j84J07j42J73j56P1m8J35j09J66j19J5j2j1j36n3K13R7j29m5O5q7
1684h8J50R2Lm22L29j45O5L6n7K6m2L09k90K54j13p5m0J04r2j63K23j84J11Kl2
1709c9k1R9R2j44%l0Mn2J46j04p7lL7J35o0J00k23J57l7j57K34P7j48J01k66J90
1735A1J48j79j88K15j62n1J01J63j26N6J20j15J06q9l17J66J29k5o4N8pq3L51
1758B18k48j64O4K9L1k41M38q5l15Q9O8P9J15o5N4l5J32j38p3K65j74q2J61M9
1782A72j43j43J85m7m5J69Lj77J12q8j65J85j29J0J13J68j55J43j18rm8k6O4o
1806B5m9J07j16L30k85j05K00Nl59J87j17L58j3p6k67M4J98j99P7m9m1L38k90
$$ plain form
1637 35 -105 204 91 212 -187 137 -76 84 149 -157 -65 -8 -85 39 -157 -63 190 120 137 97 -257 14 -87
1660 -87 -95 101 -83 24 -118 55 -101 -30 -78 57 -52 114 -5 10 -2 -13 -149 -202 11 108 -21 -66 -1 -88
1684 -88 62 154 157 -265 64 -81 -16 20 -37 -11 -53 256 -34 220 107 32 -8 96 4 -159 64 -120 -9 -7 -39
1709 -39 -60 39 131 -13 -13 -43 -39 -91 55 -49 -126 -129 -92 43 -17 83 -140 17 -20 -177 57 134 -14 87 -179 11
1735 11 159 -20 -208 7 -155 -206 -105 58 -68 -12 108 -7 99 10 -307 -141 -12 -37 -101 -43 -50 -133 218
1758 218 -30 -194 -130 -101 -70 -311 127 42 -273 -184 -116 -37 78 13 67 32 164 26 -47 218 44 -38 123 172
1782 172 29 -114 71 24 -21 148 151 -26 86 -2 -167 18 -111 -101 12 180 25 168 50 41 -7 -33 31 25
1806 25 -24 83 -33 297 12 -93 107 112 -247 -60 -177 181 168 92 -175 -131 67 -132 -55 -104 -145 193 -97
1829i7L63k73J8j09J30j42j0J37o3l4p6L13q7lj95K31j56m0J21L0p8ll7K33j9
1854A54m39L34j11p0Q3n5P0J69j51k0k50J58K94k62P7J65pj5k42J79j37j05r9
1877b80K78J9J08j93J35O7k55J13J07O7j33J2j21J39j24J26o3k7N1%j04Mn7oJ18
1902a9k9Q7M3p6Rj21Q6m9P3J9o4J42P3k39L1Oq0R3r4J51J15k19J52j43q7L91j26
1929A25j32P0r5K5j07J17j55MqO3J14M5o6n6o7J70j70J08J64j05q3o9L03j76j46
1954a27K20m5j75P7J09q5mL2J02L8k22jJ6J5R3l2Q6j72K13j50j10j3O7O1J04m0
1980E7j17N6j99K27j79NQ1J25m9J36k76rJ69Jl7m9L6j86J31J49J39m7l40J84j09
2005a01K12Q7k55J74j19j16J62o4q0J29J35m3k64J02J90k21j63L95jl10J53p0
$$ plain form
1829 -97 266 -7 11 -98 32 -110 -120 17 -46 -80 -156 157 70 67 -128 103 -53 -93 28 58 -20 -23 -60 173 154
1854 154 -285 49 -62 -132 -49 -104 -34 135 -16 -36 -286 -128 166 -96 -19 146 139 124 -118 61 -76 -181 -280
1877 -280 -2 17 125 -68 67 134 -121 -8 99 166 33 45 -76 63 -61 65 2 -25 26 26 -78 -74 -131 -137 -19
1902 -19 -48 39 82 6 15 -106 -20 -69 4 23 -41 101 174 -65 -34 -28 -108 -15 -109 42 157 -62 90 -53 -140 251 125
1929 125 -7 63 -32 -7 -114 3 -152 -148 -156 -93 21 66 0 -56 -123 47 -123 -15 149 44 -39 -108 195 19 -127
1954 -127 93 48 -127 -50 59 -26 -30 2 104 142 -80 -81 -65 -50 43 11 97 -75 138 -12 -122 -135 -68 -7 97 57
1980 57 -60 -4 -203 24 -155 -150 -69 56 7 143 -133 -142 27 28 -9 -58 -22 -208 -77 72 211 164 -176 8 -101
2005 -101 111 198 -57 117 -2 -118 44 -20 -100 29 164 121 -143 -41 149 -72 -235 160 159 -151 2 -68
2027f8P7j77K24j25K88k88N4j18J58kK9k32J19L5o7J89nL2j49l3j02K38j97J24
2051Do0M5P0q9J61j90J18j31j83L02k0M6j1K8N5j40J28Jk85K70j6k46K41p0m4
2076a6K65k16l2j03J15J12l5j04J05j5j70K26k87K18r5K53k20r6pq5L54k66L60
2099B61k99j16L30j24j58k10K44J41L2N4j21M4R2j11r9j3J49k6Om5Jl8q7K84l95
2124b04K99j08Q9k75J36p5Q5j83J93J38l14J17K49k64J61j13L9m3L1O5K6q9K3
2147a7M3j17q1K13J24j94N7J17j33M1j22m5K04k62J41J20j1%j18J75k8R3l79J92
2171A3m3q5J80k35L98l70J70l4nn6J25r1J89k24K20l8m20M70M1j26j3L3j02j31
2195a34K19j5PJ60l27L58j76j79o3K64j61jQ1m5J08j42l2j08K47J01k30M9Q0j0
$$ plain form
2027 -68 9 -168 56 -69 219 -69 -15 -133 25 23 52 -180 -61 -26 -93 96 91 123 -26 -59 -161 77 -120 4
2051 4 -56 -11 59 -30 131 -59 59 -72 -255 47 27 73 62 90 145 5 133 134 -151 119 103 -143 98 28 -16
2076 -16 249 33 1 -102 13 125 90 -14 91 76 -94 132 -155 63 -32 221 1 -95 -102 -187 167 -99 261
2099 261 -38 -154 176 52 -106 -316 -72 69 101 155 34 78 170 59 -40 -53 96 70 76 31 32 -6 -93 191 -204
2124 -204 95 -13 76 -199 -63 -138 -53 -236 -43 95 -219 -102 147 -117 44 -69 -30 -73 -42 23 49 -40 -17
2147 -17 26 -91 -172 41 165 -29 28 145 12 53 -69 -114 90 -172 -31 89 78 78 -40 135 107 200 -179 13
2171 13 -30 -115 65 -170 228 -142 28 -6 -11 -67 58 -33 156 -68 152 114 -306 164 205 79 66 99 -3 -134
2195 -134 85 70 77 237 -90 268 92 -87 -150 114 -47 -48 33 -12 96 -46 -78 -186 61 162 -68 -19 61 51
2219E1j32K40k84Q5J46k27P8J83j72J37j70L35l99K0K22j97j02K79o9n5k1k0L32
2242B60k04qj71Q3N0m9R0m4k5p2J07j18P2K2P5q1K50j83l3k9j83K51O8P1l41N5
2268h7k66K60N9R6Ok58L89k32J38j45J09l20J91O6l8j60K71j56M4j03l8J55P0
2291E1p9r7P1r2O7L44k67j5J37k23J23J57j12P6j61J33l4j00j7j66J37r9K22l9
2315A7k5J92k38Q4J86p0j73J58j88J14J41j92j47L47j05j77j37J16J42l9q7L7
2337d4J44j91O5p5R2Q4n4Q6j54m8J09k4L8j93j2K6P4J44o1j24J08q6L4J79k03
2362h6k5J32O1l7j05M10k64Jm5LL3j13pJ04J14J0k85Q4J9J98j23L7j97No5O4J85
2389A08k89M00l49J69j4j73L8J75K4j53K59k54R5K0nO2J20j95k9K1j67K94j05
$$ plain form
2219 51 -81 159 -125 -40 106 -121 -43 140 -32 105 -65 270 -129 -109 113 -84 -186 93 24 -31 -52 -72 260
2242 260 56 48 -123 -40 10 -39 51 7 -18 -90 17 -101 -29 -7 68 -13 237 54 21 -8 -191 60 128 199 -142 -87
2268 -87 -353 -93 -34 62 68 -190 199 -33 105 -40 69 -251 -60 6 -32 -192 79 -77 -33 -136 -174 -19 51
2291 51 -28 -125 -54 -146 -79 265 -2 -17 120 -103 20 177 65 141 -20 113 79 -21 -38 -204 -67 -166 56 17
2315 17 -8 184 -54 30 216 146 -27 131 -57 57 198 6 -141 206 101 -76 -213 -97 45 6 -81 -44
2337 -44 100 -91 -26 -101 -9 75 21 107 -47 -95 14 -10 28 -165 -177 -151 -77 67 6 -118 -10 -96 -62 117 -86
2362 -86 -111 21 82 45 -60 350 86 87 42 45 78 -35 -42 62 176 186 -99 -15 4 202 79 116 -81 -76 -141 -77 108
2389 108 -181 219 -130 39 25 -148 -110 65 89 -64 195 -59 36 56 51 113 233 38 9 30 -137 157 52
2412E2k9j6mK5l4P4o6k01L39k08J27K9P9j53J84k80J05j61r1K18q3J29n4j30l1
2437a80K16R5j42j59K69j94K15R3n6l22J31R4k40K28l5j22Q2J98j17j97J0N8o2
2460a37J9K36j08l5%q0j00J61K2J21l32L8K85p2r0J07L0j73J93O5k14K29j89N5
2484C1L1j17J29q3M6j82K04k48R2J86j73l9p2R1p3J14J52j22Q2j95n6M07k25K
2508a8J18n2M8k34J30k6qj41P8K03j05N5k48K22k19J67j6N6n4J73k70K08N4o7
2532E4J7l4q5K9J7m9K08P8l05J24q5mm4J04j72q3K47R6k47J4K2RJ31k12J36J53
2558A19k35K2Q1q2R9j69Q6K80k56K22k21J43J79l85L4J46L4p4j74N1j5j07J38
2581h4j5J14L9m4N0L1O1j31J52o5k07NJ08j80J76k28N6J40L1J62k21kJ50L8L5
$$ plain form
2412 52 23 7 3 28 -6 68 2 -199 140 -68 59 88 167 14 198 -82 23 -138 -229 -11 -94 35 -19 -149 -180
2437 -180 36 131 -11 -170 99 -95 120 213 157 -165 -34 60 -180 48 13 -109 -27 171 54 -143 -133 -75 -137
2460 -137 -118 118 10 -25 -25 -105 -205 -44 -22 99 -233 -195 90 18 -72 35 65 -108 85 150 -64 165 -24 31
2484 31 62 -55 74 -9 37 -145 59 -189 -97 89 -84 -123 -195 -104 -177 -63 89 -33 49 -146 -202 205 -20 -18
2508 -18 100 48 96 -138 -8 -34 -42 -183 -105 98 -7 48 -200 22 -197 -30 -46 10 -44 129 -141 67 121 54
2532 54 71 37 -48 -19 -2 -51 157 235 -70 54 -31 -35 -79 25 -147 -230 17 113 -134 -120 -98 -89 42 -170 -34 119
2558 119 -116 -94 -13 -95 4 -165 -79 201 -55 167 -54 89 268 -117 -83 63 97 23 -151 -100 -115 -222 -84
2581 -84 -99 15 54 10 60 91 152 21 173 108 -99 -94 14 -166 10 -218 -162 -22 9 171 -50 -52 98 136 171
2606A71j06N2j90L46l62l2N1o6J56l0K52k79l9j4J24j20m9Q4m4J01k0j97P1P1
2630f9o5o4J29K41J5j63l6o5q4Q1j06QJ10L23j78l0j79J70l30J80K26j97N0J02
2654F9j36J48k92K60Rj59K46j21K1o8K22k58L4o5M5P5Rk33K31j49J88J27j31j72
2678a00K02P0l21P2M1J99n0L3j73j67L06j92K87o4q8k20J85K4p1n1K17j85J07
2701F1j82n8K00J37j13p9o4K13Q0m52K70p3j6j5K49p5k50L44Kk60N0l4l1l2Q0
2726d8j21J13K33j27k14J67k0p8o5K47k08J36j87J40J4J84k03j66L22m8m6J91
2748B16M4k53q5J65j32J12L7j61Jo5J00J22j22p6J33j04Q5j26j3J46L3o3p8n3
2772a37J73m7o6K39j32k57M12p6l8q4P6j39M6J80k57K98k11j3R4K8j55J61j87
$$ plain form
2606 171 65 117 -73 273 -89 -121 -70 -136 20 -10 242 -37 -76 -90 34 -86 -135 -51 -95 6 -14 -211 -140 -69
2630 -69 -134 -198 -69 172 187 24 -12 -77 -161 -80 -186 -178 -68 255 77 47 -132 38 -292 -112 114 -83 -33 69
2654 69 -67 81 -211 49 58 -101 145 24 45 -23 199 -59 -25 -90 -45 30 39 -194 37 -112 76 203 72 -100
2678 -100 102 172 -149 -77 -36 163 113 146 -27 -194 112 -80 207 143 55 -165 20 44 -27 -78 139 -46 61
2701 61 -121 -179 21 158 45 -34 -98 115 195 -257 13 -60 -76 -91 158 83 -167 177 179 -81 -31 -65 -96 -128 -48
2726 -48 -169 -56 177 50 -164 3 -17 -95 -160 87 -121 15 -172 -32 -18 166 -37 -203 119 71 25 216
2748 216 260 7 -78 87 -45 67 104 -57 -56 -121 -21 101 -21 -97 36 -68 17 -109 -122 24 57 -6 -84 -137
2772 -137 36 -11 -77 162 30 -227 185 109 71 -13 63 -76 -30 150 -107 191 -20 -33 61 89 -66 95 -92
2795i2q2L32n2k35o3K18j59k1K81R6j58j25PRK23k16j5N4J03k2k8j04n4J57m4
2820A0k00J79Q4O1J4Rj68j72J17K98k83j54K83k38J10J52k21J47l3J76k69J76
2842G8j28j99M04j67j88N7L09l03J66J7j83K71j85o3J50l6J68jj95j38J51l2K44
2865A97j58n8l7L11k45P6k05J91k0k23J23J71j85K14m3k42L7P5K2p1P6K22k50
2888b2L3j01%Lr6J01j39K20J5j8m1n0K46p2j76J40J2j52O6J54j62L24m52J68N0
2913E1r9J6Q4K3k2K11l54J37j79K60j07j39O4J4j11J70o4K57j79J35k20m5J55
2936E8j18R5j8K47n02L72q9l1oj4Jo6O3n0j7L21m12J55K14q9j12k2K1r8l2Q2l6
2963h3P9J69r5j21k0Q3j53K68j27J06l91K88m2R4R8j56p7L4p0K49r1n7J14Q5j30
$$ plain form
2795 -92 -174 158 106 -129 -192 26 -133 -154 127 223 65 -60 -53 -44 179 -37 -52 2 105 83 55 -49 -103 54 10
2820 10 -190 -11 73 134 148 157 -11 -183 -66 232 -51 -205 78 -160 -50 102 -119 28 -5 171 -98 78
2842 78 -50 -249 155 -12 -200 -143 166 -137 29 46 -137 134 -51 -114 36 0 168 167 -28 -166 -15 -47 197
2865 197 39 -19 -56 255 10 86 -119 72 52 -171 -48 123 -62 152 109 -133 -96 -21 1 -70 6 228 -22
2888 -22 11 -90 -90 -87 -183 -82 -221 -1 14 -4 -45 -95 151 79 -97 43 55 -97 -31 123 -39 285 -167 1 51
2913 51 -48 -32 52 75 53 264 -90 47 -132 128 21 -118 -54 -40 -151 19 -45 212 33 168 -52 -97 58
2936 58 -60 35 17 264 -238 134 45 14 8 -6 -5 -71 -8 -58 -75 246 -166 -11 203 114 2 -20 1 -97 -129 -47 -83
2963 -83 -4 165 70 -51 -71 12 -141 127 0 106 -285 3 -39 55 153 -3 -80 -46 -116 133 42 -15 99 184 54
2988E4k60K97M6k06J66k85K98j31J13m76M29R0j19O2j60kk02L39o8j13Q5Qm6J72
3012I1r2j88K27j9q9ro5J21N6j24N0pJ72j29p1J69r0n3J31j67K8K23qp4J41m3
3038A81k03r1K3K35k30P8j95K31j00P1j2l4P0l0n3k3J89Nj12j16J71j8q7P4k7
3063cr6P3J2J90k04K38P2l48J5L2P3l4L59p12L68qJ30k4j78k4j2k9K93j19l2n7
3089b5J52j53n6J81j01J14m4o7j01L7K70k88Rl2J76P9j93K26q7l72L92j58J05
3112F4J83k70L2j73K11mN1j95n0L58k04r9J51l6j87r6J58J04m7J05k41K43qo3
3136a3K69k36L1m5j04J64J2Pp4p2P9J86k34NLk12J52k8J62jj85OL8J9K64l68M13
3163B38k39K35j84j5M4j45N5Q7J5o7j0p1j15J87j69J56k8N3J59q3q1j13m9J41
$$ plain form
2988 54 -206 91 137 -69 97 -188 110 -21 92 -384 45 135 16 78 -82 -84 -286 53 -15 -128 -43 -35 -81 91
3012 91 -1 -189 38 19 -70 -79 -144 -23 33 -91 -41 -48 124 -5 -76 93 3 -50 81 -86 -58 165 157 83 224 181
3038 181 -22 -113 -90 145 -85 -7 -202 29 -71 0 -12 -46 24 -6 -59 -82 107 112 0 -116 55 37 -50 24 -3
3063 -3 -99 -26 -14 176 -28 210 282 -66 -51 -19 54 20 379 -333 35 27 157 133 -45 -69 -81 -110 183 64 32 -25
3089 -25 127 -26 -82 99 -2 112 68 1 -100 -63 207 -81 -72 -104 72 151 -42 184 97 -275 117 -41 64
3112 64 247 -23 9 -164 47 43 94 -101 -151 207 3 -96 55 19 -168 -264 -106 -2 -49 56 -185 58 50 -13
3136 -13 256 20 51 6 -98 66 78 85 11 -61 18 204 -30 -25 -22 -234 -82 -110 52 51 -134 -128 -90 -71 193 -175 238
3163 238 -1 234 50 35 79 -66 -11 76 91 24 14 -57 -172 15 -154 2 -26 27 186 103 22 -91 -140 1
3187AJ10l47J04o2Q5K45P8k24M6j95K76j6j17PQ9J7j05Q8k22J80Q9k8m6q1k35
3212b63J88J82k63N6R0J79l6j41j73L07j29k38L24p0J9J6J38j32j84J73j46N9
3234d4L38k71j00R2n8j80J63N8j11K67p7p1j14N0J23j29K76j26O5j62j29L75l64
3257a29J0K06l28L49j3l04K14J04j09M0j0O8l2p3O0J0P6j81j22J74Q1k74L11k43
3281a15J29j33R7J32Nj17R6j52J19n6J26j31K0j46j20J54K0l2K45o4k11K06p5
3304cJ42j24J84m25K96j98K83k46O5J04j25M2p1J03n0J4M6R0J23m53P4M8R3L1
3328D3J8J87k91j75L35O4l13J33LR1k21J79j67L0J01J19j29O8J5j34o8Q5L9mj85
3353a77J68M9j22L8J02k53M13p1j71l5r1K29j63m4J22q9K2R5j20R3J07o0j61l7
$$ plain form
3187 1 111 -236 -132 -194 -109 136 214 -10 36 -159 117 101 -16 -9 80 97 -8 80 -142 38 127 99 53 -28 -263
3212 -263 -75 107 -156 -100 -10 169 133 -8 -181 126 -3 -241 83 13 32 48 186 54 -130 43 -103 -44
3234 -44 294 23 -77 15 -43 -223 -60 -2 -113 154 77 6 -108 -58 65 -64 212 86 151 -11 -140 235 -129
3257 -129 -119 87 -241 108 95 -209 5 109 0 40 30 98 66 -7 53 63 139 -42 -164 10 91 -183 128 -115
3281 -115 14 -119 -22 110 115 -2 94 -58 61 5 131 0 20 -126 -246 -92 -72 -104 141 77 -134 72 -3
3304 -3 139 15 199 -226 70 -128 155 -91 -26 78 -47 -5 -76 27 -23 -9 37 127 250 -203 -129 -81 12 43
3328 43 61 248 -43 -218 117 181 -132 1 4 95 -126 53 -114 -84 17 136 7 75 90 -44 -112 -27 12 8 -177
3353 -177 -9 40 -82 -44 58 -195 218 147 -24 -59 -150 79 -84 -128 -6 -95 -73 22 -98 -5 102 42 -119 -156
3377a56QJ67m5q7pK42j12j04J89j76J32p7L07q4k49J69j71R9J77j37R5l73J83
3400a0M5r5M9K7Q0k3j05J43m0N9j61o5J52q8J37j32J86j92Q3N9n0j33j18K00j35
3425a27R5Q0m6j22J18K16m10K01k5J87p2o6L4l1o7K0r0M8J46j00j18J00j46O4
3449a11L61r6J71m37K19m15L39j39K12j04J5J97l4j30j61J12J40j66K6J84k18
3470c5jN5p4O9RJ35k08K64j89j77K44j09q9J02R5Mj7k2J51j30j65j23L63l5n9
3495E8o1J4j05K7J01n4J57k77r6L35J11k06N8m4M8p2j05J54k3K4m2j1j26L57k73
3520e1J06r4m6j0O3qK1j11J38J71j99o9L4J6l6Q6j24K5O5k6J1R9j28p7K96j74
3546b2NNJ73j36j06J98MK3j09J6J74rk92J17j95P4J4J48l00J06J08m0J38j41j78
$$ plain form
3377 -156 -148 19 -26 -113 -120 122 10 -94 95 -81 51 -26 281 197 -52 117 -54 45 222 85 180 -193 -10
3400 -10 35 -60 -11 16 96 73 -32 111 71 130 -31 -96 56 -32 105 -27 159 -33 50 109 59 -74 -192 8 -127
3425 -127 -32 48 2 -120 -2 214 -196 5 -20 167 95 29 63 32 -35 -15 -105 -57 89 -11 -129 -29 -175 -111
3449 -111 250 154 325 -112 107 -308 31 -108 104 0 15 212 178 48 -113 -1 139 -27 -1 183 -35
3470 -35 -36 19 -55 14 23 158 -50 214 25 -152 92 -17 -106 -4 91 95 78 56 207 77 -88 -211 152 117 58
3495 58 -3 11 -94 -67 34 -20 137 -140 -236 99 210 4 62 18 66 -6 -111 43 20 44 2 -9 -135 222 -51
3520 -51 55 -39 -85 -95 -32 -40 -19 -130 8 179 -20 -89 -55 -39 -75 11 -113 -88 -23 -49 -38 61 -67 -144 152 -22
3546 -22 -17 -12 161 25 -81 117 121 144 35 51 225 216 -76 41 -154 -80 -66 82 -218 -112 -4 -44 94 -47 -225
3571b25K04N3J02k73J47Nj46K6oO3j08R3J3J48l8k60J17lJ82q0j05J12O3n7k77
3596b50M03l14J50J18j73J39j37R1l46J75P7j62O3L81k89J37k13J14J47j17K65
3617B59j57J19l57K01k50K31k82K97p8j46JJ3J46M0k16L6L13n3j69J07J70k83
3639e8o4jJ17l0J84k96M8L65l22K42j78m26M89j53J19J7j09R3k4J54L3j74Q1J
3663A08k22K0K40l2j78O6J5P5m6K5j34J19j89K01r4r2K68j19j30K96l63J11J74
3686A19k7j08O7q9M4o0L1k2K20j39k06L22j40j89J02J18J34j1j07L1q8Qj20Q8
3710b2KP1P0K35m25K21k71k5J37m9J65k03J26j24L01j79J24j45j56K33j26r4J92
3733E8j42J53J4j21P9J04l7j09J05m4jk3l8M2k12K84k3k57K84p1p4q9K72j70P0
$$ plain form
3571 -225 -21 32 134 -139 8 13 -133 -107 -113 -50 -158 -65 -52 96 58 -202 -85 -88 94 14 -91 21 84 27 -250
3596 -250 153 -161 -11 107 -66 73 -64 27 -319 -144 -67 -229 -166 215 -74 63 -150 -36 111 -6 259
3617 259 102 221 -136 65 -185 46 -236 61 -17 -163 -162 -149 -3 37 -179 -143 170 117 -52 55 225 -58
3639 -58 -122 -123 -6 -36 148 -148 -100 265 -57 185 7 -419 70 -83 36 53 -56 37 13 167 200 26 107 108
3663 108 -114 -94 146 114 -64 2 17 92 46 71 -63 56 -133 68 -26 -118 150 31 -99 197 -166 -55 119
3686 119 92 -16 51 -38 6 -54 -23 -45 175 36 -170 152 12 -177 -75 43 177 166 59 90 2 10 -110 -22
3710 -22 -20 51 121 356 -69 152 -119 -144 -7 -56 109 -94 32 -92 209 30 154 9 -147 86 -40 -134 58
3733 58 -84 69 83 -38 41 145 108 -1 104 60 59 36 -2 40 -172 112 89 -168 116 45 -29 -118 154 -16 54
3758E4j80J29j20J01J90j35O0l50K70J85j96qR0j93J62j44j00L91j34j50p7J30
3780b5J13j93J35K5j12l5Q6J33k40J88J57l45Pl9K17r6k2P0j01N0n9J29j90Q9
3804e8n7N6J56j19j52Q3K48k64J30J7j32J35NJ28k8j50k9j36K03k53L36q1j43
3827a05J56m5N1K0J15r2k11n3J93q8J65o6l5Q7j77n3Q8J57j19J23k02r5P5O4O7
3852B0J96L5k22J5p7Qm8N2J90k91J52p4k7J78l1l9j83P2O9r0o9J03J0J14L3k12
3878a16q3K18j4P2j55M1J2k9P3L1J50j16J59k12L1K25m31J82n5j85M18k16J01
3901A01j34j23L62k16k3J89k05K03j02j10R3j31L54j48j65K47k76L43l11J45J6
3922A09r8k9Q3On3j2n6J1qJ56j78N9l0k1j0Q2lK6k96K7L71k15P0K5j4J1K9j5m9
$$ plain form
3758 54 -126 3 -117 -16 174 39 99 -251 19 204 8 0 90 -103 59 -85 -185 206 72 -78 -155 -25
3780 -25 88 -105 30 55 -57 -92 -6 127 -113 75 232 -113 -106 -145 72 -24 -46 24 -77 -27 -86 43 -147 -58
3804 -58 -115 -59 97 -22 -174 -91 157 -107 23 40 -92 43 48 176 148 -2 -31 -167 36 -217 119 38 -105
3827 -105 51 6 57 77 192 100 -111 -164 29 -59 106 40 5 92 -85 -138 -50 107 -12 111 -91 -186 -111 -47 20
3852 20 216 251 29 44 -33 -25 -73 -21 169 -122 30 -44 -71 107 76 37 -146 -74 -5 -95 -164 -61 -51 63 96 -116
3878 -116 -199 19 5 77 -78 -37 -25 -54 19 50 200 84 243 31 62 287 -144 38 -17 -202 216 0 101
3901 101 -33 -156 206 -10 -33 156 -49 154 52 -58 35 -96 258 110 -55 192 -84 259 -52 93 109
3922 109 11 -18 65 71 18 6 -50 -39 -47 109 -69 -10 -40 -61 -71 11 8 34 -262 -235 136 -79 -9 16 2 13 42 27 -22
3951b2j5J21l4K1j00j7j8m5L63l75J86M0M7p0j01l4J13j24j27J67R5Jj74m4J09
3976c7J65k90J44q5J90m3n4m8J59M5o3r3J22j29j84K19j61K94o1Q4j95N6r3J99
4000A41j28k11J32RL7m6K46j33J02k99j22R5K90k3J06m80M30j67k61J58K58p4
4022F0j25R0l5N1l8Q6j23l0M8j17K51k14L1Q8j88L78l64m3J56q3J46r2n1pK68
4047A43k07j11J29K9J5R3p9J08J1j0k28o0K2N0J11j49M2J61o8q6P9q9K9j00L12
4072A47j2q5J33j27J7k18J33rO9pO9N9m13R7K98j90K14j13j25Q4l2K23Pj37k4
4097E8q1p2J60p0o2j7J24n7J10l13K50p4J11L0O2j59O8k8q5J81l28K96l13L67
4121A58k64J81J7k13J00p9n1J27j28L66m73L24k7j0k99J19P1J95k6j98k20K20
$$ plain form
3951 -22 -37 84 50 71 -29 -46 -64 -109 254 -121 65 105 152 82 -19 -53 60 -64 -191 -24 71 72 -102 -146 -37
3976 -37 128 -162 -18 -103 87 44 -10 -58 101 146 83 -10 112 -17 -201 18 -143 151 90 174 -21 35 -58 141
4000 141 13 -198 -66 -57 -20 -66 180 47 149 -150 -272 -177 113 90 196 -284 146 -21 -282 -124 134 60
4022 60 -65 25 -10 41 3 89 -34 -64 -16 -133 118 -96 -65 23 -165 213 -151 -194 -38 -121 25 -67 -118 -125 143
4047 143 -64 -175 -46 -17 -2 91 12 120 131 121 -107 -167 -145 -95 16 -133 -91 70 2 -84 -5 -94 -65 -165 147
4072 147 135 50 183 56 73 -145 -12 -21 48 41 110 169 -244 -147 151 -39 175 62 -63 21 -11 212 219 82 58
4097 58 -23 -95 65 -5 -67 -84 40 -17 93 -220 30 -44 67 97 159 0 68 40 -45 136 -192 104 -209 158
4121 158 -106 75 92 -121 -21 -100 -151 -24 -152 214 -259 65 38 28 -271 -152 -81 114 88 -110 -330 -110
4143a10P5J11l37K11P4K2n5m9l5O5K19j72p3J65l7k60L85k85P5R5k41K24R7N1
4167B15r0j90Kj0Jn7J91k44J85j39J72j82J97j64K69k93k3K25j63J49M9l3o4q
4191eJ0k64K18j8J88N1j98Rkj22Q6J00j31MQ8l14J76n8L98m25K54L3M5j92j39
4216b08P2J43J66k79K17k28N4J45j19J24j54l1j6RR4P8Q4q9j6k25Q2K40j07jp2
4241c7L4m1P4l2k21J61J08j72%J39o7k63L75J23j94Q3r5J14p0J23o1J68j41j67
4265e9N0K70l66NK13k01j17J88l3L1m7J37j33J69o2J62j74J07k40K43j31J3q7
4288f2q5J75k00J04K22j42OJ53o6n8r3J30k14J25n7M9p3K85j04j66l6J62j39K25
4312A41r4j30Q3j67K93Pj9j6nj52M6j68J66Q3l13K17oJ5K0P4l88K69k24J41J34
$$ plain form
4143 -110 -35 76 -261 -50 24 46 -9 -58 -93 -28 191 19 -54 111 74 -186 199 -86 -11 84 -157 67 164 215
4167 215 125 -65 -63 -73 -72 -129 62 -182 3 -136 36 -146 51 -113 156 -137 -160 65 -98 51 100 67 3 -5
4191 -5 5 -259 -41 -59 129 180 -18 -9 -11 -133 -47 53 -78 -74 14 -300 -124 -182 216 -209 45 78 123 -69 -208
4216 -208 -136 7 173 -106 111 -117 -63 82 -37 87 -67 -98 -114 -105 -11 67 151 62 46 -179 -97 143 36 35 -37
4241 -37 -3 -44 30 -2 -223 -62 46 -126 -126 13 -54 -317 58 181 -13 70 -25 89 19 142 81 249 108 -59
4265 -59 -9 261 -105 -100 113 -88 -205 -17 -50 -19 -66 71 -62 107 45 207 33 140 -100 143 12 25 -62
4288 -62 -147 28 -172 -68 154 12 18 171 105 47 -46 84 -130 -5 -62 -13 -86 199 95 -71 -107 55 -84 141
4312 141 47 -83 0 -167 126 133 114 98 93 -59 -13 -181 -15 68 -245 -28 -34 -19 1 75 -313 -44 -268 -127 7
4337Gq8J20j02Q2Q2o5n7K7k22K53j09J26k26m6J74J42k77K84j33p0k2L8J76o2
4361C2q1J41k24J58R7k4j34O9o2p9J96Rk9k7P5j12J8q6Q9J16j08k2l1j36L58j61
4387D2j71J56k4k7J9k15K23l9oJ63q5j52L25j71k41J05J55j33J32j13J33k76K32
4410C2p2j66K70j15j89J53J09j17K76j97P3O4J52k85Q4j85K05k97K29j11p1J14
4432d4O1J14l15J46q5J65P2k50k35L50k6N9q8J77k17r6K68Mq0j1J72j51n6L0J11
4457G5j1J89l50j96K63r3n9K48l3k09K73j96K90j78r1K09k74J03J42Lj62K7j30
4480a60L18k08K1q3J47q6m1m5J65Kj41K79j49J95j49N7j2k39K77j39j44J94J13
4503A72j76k9J01oj04J39j77n5P7J8J1N4p3o9K25L07j31l55M1J6o0O0j38J70N
$$ plain form
4337 7 -81 39 -63 19 101 36 -21 6 -216 37 -72 54 -172 -218 -44 98 -179 105 -28 -98 -120 -82 94 32
4361 32 -49 92 -132 26 123 99 -35 34 -28 -107 89 98 69 42 117 5 23 -63 26 142 34 12 -19 -155 203 42
4387 42 -129 27 3 -24 -5 -220 3 -36 -42 121 36 -116 209 38 -203 -98 57 -76 56 -57 76 -200 32
4410 32 -40 -206 64 -51 -240 -87 22 -95 181 -16 57 121 273 -12 72 -113 92 -205 24 -87 -158 -44
4432 -44 17 131 -184 -38 -123 42 114 -136 -371 -21 -47 12 -76 101 -116 -212 56 60 -20 -31 141 -10 -66 -36 75
4457 75 64 253 -97 -293 -30 -123 -182 66 33 -176 97 -99 191 13 -78 131 -143 -40 102 105 -57 -30 -160
4480 -160 158 -50 -29 -112 35 -51 -92 -137 28 30 -111 168 19 214 65 122 110 -129 148 9 -135 59 172
4503 172 -4 -33 68 62 -42 97 -80 -135 -58 -40 -29 25 -48 -117 108 415 284 -71 -30 -14 -74 -14 -152 18 23
4528B3l3j62K75k8K6k35J71Pj06J98j87J09q1J82l16L49j94O6j03l8J87r4L9j4
4552D1j26K53k26k3J36J27j92P1q8P3k16m5J14J27n2J31l8l70M53j61R7j54J37
4575F9r1o5j40L32l8q2J25L0j88J84j17J37j40j32J32k5K50j95K3j13j61J19O2
4598b4q2K57q5j64J20n4J14j22N3L8qk22L8K61j86J13L4N4o6N0k68j8K51M7k25
4623i4K01j12J8k7K9o7o8J64o7m6J50o6j8j93J4l3K17N1j17K22nk05n3n4kL6J22
4650cK24k67L7P1J90k42r7J29R3J07l53J34J85o2j97J62J42j45P3j00k1P8k69
4673a31K53p1J2k40K53j99K18j20k7L6J16j20k36J25K6K82k82Q6j52J61J51j09
4695C2K8k4J18k97Q9J57j52P9r2j1J67j01J6j7j51L5J96j80R1J0k97K79M1n4J02
$$ plain form
4528 23 -10 -172 103 75 101 -134 37 44 -62 136 -51 58 -23 159 -157 192 -2 64 -39 -77 110 16 55 41
4552 41 -85 168 -58 -81 55 182 -10 61 -27 46 -170 -215 -101 26 -26 105 67 -303 150 -11 86 -68 69
4575 69 -22 -87 -227 105 67 -15 110 140 -48 136 19 156 16 -116 16 -9 241 46 69 -44 -205 -86 -24
4598 -24 -106 151 66 -98 22 -32 82 -40 13 51 43 -179 -141 120 -66 47 81 135 69 119 -149 -167 84 131 -94
4623 -94 107 -5 13 -14 15 -52 -120 44 -23 -69 81 15 -3 -196 -182 -215 2 53 -64 158 153 -52 -105 -159 -161 -125 -3
4650 -3 221 -46 -9 62 252 10 -87 42 135 242 -111 23 208 146 -51 111 253 108 181 81 60 138 -131
4673 -131 122 51 63 -177 76 -123 95 -25 -52 -16 100 -20 -256 -131 -105 177 -105 -19 -171 -10 141 32
4695 32 60 36 154 -143 -54 103 -49 30 -62 -73 94 -7 9 -8 -159 -124 72 -108 -17 -7 -304 -25 16 -38 64
4720F4J4L4O8k24Lj34J47l7J03k0q2K00l16J96j17p8K50j89J70j4j93K30j0n0
4744A5j3Q7r1M5j50J59j09J89j02J7j70J66J26j19J77k87j88K73J03K3k16J08
4766D3Q7p9j3N1J3j30j53J96J55k8k09Q4Nn7L25l47N1J89l29J59L8j09N2n6M6
4791a6k4J09j21K9p8N6q4o8K32j30K45j21j41J51O3J7j88J33M6k61R3p9O7R3P9
4816A02oq4J81k67K8j32N2J09N3L7r6J82k11L27l17K11r8j09J59j83Q8K24l76
4839a26K5P9j4NJ65n3j72N3J1R2J59k12J4J27Q7q5k18J21J33k30K86k62m3J9O6
4864B7J69l37J11K62j69n2jj41J46j45K25pL8k96M19k07j15J65j62J92k54J57
4886B5Q7j88P8Kj26J75j46J23K2j19P6k0M8J0j88K25j4o8m1R5j04R9N5j55M3P2
$$ plain form
4720 64 78 112 180 -44 -41 -175 -28 -65 38 18 -64 136 -180 16 -101 -179 71 -118 52 38 -155 75 65 15
4744 15 2 89 -2 43 -107 52 -57 132 30 47 -123 43 169 50 227 -60 -248 25 128 151 -65 43
4766 43 130 51 38 89 102 -28 -181 15 170 142 -67 17 22 -35 290 -57 -6 183 -146 13 51 -58 -6 -62 -16
4791 -16 -40 69 -52 -23 -101 -45 -129 -197 35 -95 150 29 -112 39 102 119 -69 64 110 -151 -58 -137 -70 23 102
4816 102 96 12 193 -74 -46 -178 -126 -17 36 73 -23 159 -52 275 -42 169 71 -38 121 -62 26 250 -126
4839 -126 -101 -22 -36 -31 134 81 -91 -38 -27 65 224 12 26 153 240 155 -63 58 191 -39 247 -15 -58 -39 27
4864 27 196 -141 -30 232 63 11 10 -131 15 -130 95 88 126 -170 249 42 -73 92 -70 122 -132 25
4886 25 112 -76 2 4 -122 53 -93 30 52 -67 9 -11 37 47 -141 84 70 2 -39 56 -48 51 106 -49 -6 66
4912F6J00j85J76L2j90j90L75p3k2q3q3k9O3J20j85J63j08K89k47j78N58l84K8
4935A3m4O1R7q2j13N3n0J03o1l8J04q3q2J82p6N4j61K81k37k6K21M0j03oj21l7
4961a11J64j92J59j1j14L02j59o0p5K07j87L34k04k26J31J65j32K05k31J40j13
4982hj15K80r1o7j07P4R5j22%J0J52k60J90O3k69K20j86n6L37r8p8J1n3J79r0
5007A1l8K02j77q9L9j34K06j69JK07q6j7K0O1p8lO2K5P2J59j17j82J29j61O4m
5033CL3K5J44r2j54J4K98j26j12j61K34k63j21L44J35k64j4K60j71k08K35o8m0
5056f9n4K82j33q0J22n3j04q0K40J68j71N4k5o4J87l04J41J7j63p9M89l00k81
5079b60L30p4k40L37M8m0k58M05k19j2J5k5J8j10N9O4N6m2p5M0k8O2j70j3K65
$$ plain form
4912 66 166 -19 157 189 -1 -191 184 111 89 6 -77 -106 -43 77 -108 55 -53 236 -11 -189 369 -15 13
4935 13 -31 30 127 45 -68 -15 -65 38 -23 -61 43 -40 -122 60 -16 38 -123 158 -79 -105 116 156 53 47 -74 -111
4961 -111 53 -139 20 9 -105 197 38 -22 -97 110 -77 257 53 -173 -42 123 -9 196 -35 105 -8
4982 -8 -123 157 66 -1 -108 -34 61 -61 -61 -51 101 -159 31 94 -175 45 -141 -197 140 42 -36 -25 -78 101 11
5007 11 -27 175 -2 -91 -52 -186 20 -149 -148 59 -27 -44 -24 37 -41 -44 18 43 115 274 157 -25 104 -57 7 3
5033 3 36 61 205 113 -41 -27 271 145 33 -128 106 -157 -278 66 201 -63 -77 183 12 -196 39 -29 -69
5056 -69 -123 159 26 -54 68 15 -89 -169 71 239 68 122 97 33 220 -84 57 74 -89 -168 321 21 -260
5079 -260 70 -4 -244 93 141 101 -157 248 29 17 32 7 25 -85 -26 38 94 52 -23 17 -11 51 -119 -132 133
5104A33o2L8J16j43k54R4j6l4K62l31K85k26m9K45j33J01N3j47R3N2K0l02K60
5127E5Q2n2n4p8J07J1k69K27j34K70j39J77r4j02J4o8J79k17J40p6M8Pj3l5o6
5152h0J47q9K2p1L6J37o9j4j25J23l06J80K59k83K53P1l25J15j76J15Q2R7k7j0
5176F2r5N1j69K91J64l17K82k06j39J18mr5j1J16k17K12N0R6l76L4P2J60j6J6
5200G9j98J51L3l1R1k4j40o5o1J29J46k80K78K1j65k32L53M5J23q6l74R1J25K4
5224C3p3J80j91K57j91J54j64j04j1K57k23J91j20J28k42K03P0k25j21J23K38
5245A69k01m1J6r2K86j37J73Q2k31l9R0j10M6L6k23J49O9Rj10J3J01j8J64j25
5269G6Q1j08j76L9P3%r9K27j05q6j2K42k6k3n7j23J96k21L46l65J99Q6j59R0k27
$$ plain form
5104 133 71 109 225 82 -172 -78 -94 -128 134 -197 88 -138 -187 58 -75 26 79 -68 25 77 97 -205 55
5127 55 137 85 31 -47 60 71 -198 29 -105 165 26 203 109 7 21 -47 132 -85 55 -21 27 34 21 -14 -80
5152 -80 67 -22 0 -71 -35 102 33 19 -106 17 -289 -109 150 -133 120 191 -134 -19 -195 -80 2 99 72 62
5176 62 -33 18 -151 140 304 -13 269 63 -76 42 38 -57 -68 48 -169 43 93 189 -187 -153 -81 79 63 79
5200 79 -119 32 65 34 125 101 -39 -104 -165 -36 110 -170 108 129 -36 -268 85 130 253 167 -207 -116 9 33
5224 33 -40 140 -51 206 15 169 5 -99 -110 147 -76 115 -5 123 -119 84 154 -71 -192 -69 169
5245 169 -32 -73 -57 -149 137 0 173 255 24 -15 75 -35 11 47 -176 -27 42 51 -59 -46 55 37 201 76
5269 76 157 49 -127 -88 -15 -15 -114 113 8 -78 -90 152 126 103 46 -77 119 -102 244 -121 78 164 5 95 -132
5294a32L08l12J02J58k5P0k56L34j78k31J29J24M7j28P6J7k88K22j64R5j14K38
5316I2l5J16km9j28J02k04J11N1rr7K51j16J01j63J39j83l1J54m2j36k6R7N0o1
5341a8J51rj82J70k05N4J33l24L58j51j16O8O6K37k00P5K0k64J92mk13J01l8L11
5365B12j10k72J82J02J8l07R2K01j59R0O6j8j40QM8J4N0j00J37k04J31rJ51j18
5389F5j34N6lN6l4J7J57j37m41L11O4J2qJ03j00K03j31Q3j27k99J45J60O7J2l5
5414F2k11J88J29l61J54K65l66J05K94k96O6n1m0J62k28J11m1J09n8J0N9K9j42
5437e1J59q7o1O2K04l28K06o3Qj12Q0J17j13j9Q2O2P1j85K25k32k9N2j17qR3J33
5463A49k9j43J09j38k7R6K5q6J3J87k48J59m0j00J57M5j74ko7K00M9j52k2L5l16
$$ plain form
5294 -132 176 -136 -34 124 99 169 -87 247 69 -162 -33 91 138 10 86 103 -185 37 -127 -32 -146 92
5316 92 57 173 171 122 -6 96 -108 3 54 45 -52 199 83 184 21 160 -23 -54 100 58 -78 -104 -7 43 -18
5341 -18 133 124 -58 112 -93 -39 94 -230 128 -23 -139 -71 -5 232 32 107 127 -137 55 51 -162 -61 -99 212
5365 212 102 -170 12 114 132 -175 -83 118 -41 49 115 97 -43 -35 13 27 77 -23 114 -90 41 32 183 65
5389 65 -69 -13 -16 40 6 23 180 43 -398 -87 -23 -11 -19 84 -16 187 56 139 12 -287 -142 18 85 97 62
5414 62 -149 39 168 -193 -39 226 -140 -35 259 -37 29 -22 -62 100 -128 -17 -58 51 -7 3 62 91 -51
5437 -51 108 21 -40 22 226 -102 104 41 49 -63 17 134 21 2 84 146 217 32 257 25 -4 48 -69 -77 16 149
5463 149 120 -23 86 -52 -79 17 42 -44 -31 156 -92 67 27 -73 84 129 -45 -47 -114 86 135 -17 -39 -4 -320
5488c20K96n4L06l15L7m6J6J2K9K08k66J87j9o9N5qp6m7j5O6jRJ93k92O2R6k42
5515a98P8R4J06n4n2j05K54o9k7lJ00j75J36O8k88K75j99O4R8j89L0M8N5QQ6l9
5541A02p6j06O1M5M4l3J2l58J71J85K01m09j21M55m20M23k57J83k70K57j45L6
5563b0P7Rj02j0j3j20j05N01k93K11O2p8j49J9lL9k05J19N8j81K34k2P6j08J89
5588A85k88n7J90N0j31j46J08Q5n5L7r4K06m8kk8j2J5J00k20J31J05j18J46r3
5612F6j8m7K03k49J71j24j51K03l00J51p3K13j57J35l2N2K20k30j76J34N8J27
5634A76j10j11N0N6j07Q9K33j74n6j46j01J49N1O0n2M8j95O3R5l6L2K2j91Q5J05
5659C5j5l2j03M8l5K34r3rj36J10l7j33L83k77j4L9J42j75k1J38kK3Rm8q3M7j17
$$ plain form
5488 -320 -24 -78 228 -87 -50 -96 -80 -68 -39 169 -97 90 71 2 57 49 -27 -74 -89 -23 -24 -15 178 -114 -52 44 -198
5515 -198 -120 -26 80 26 -26 -131 123 54 27 24 124 -51 85 153 -135 140 -59 5 103 -86 -56 -8 47 55 141 102
5541 102 26 -80 -19 26 70 37 49 -309 -138 47 248 -161 -282 173 -247 176 -81 102 -168 89 -56 -20
5563 -20 57 66 -36 -46 -59 -179 -284 217 -76 135 197 119 -30 -11 -14 25 -180 -61 -3 -184 50 28 104 -4 185
5588 185 -103 -160 30 80 -51 -197 -89 -4 -59 -22 -116 90 42 40 12 0 15 115 -105 26 131 13 159 66
5612 66 48 1 204 -45 126 2 -149 54 -246 -95 -168 45 -112 23 -9 43 263 33 -143 -9 49 176
5634 176 66 -45 5 61 -46 43 276 102 46 -100 -201 -52 -1 59 7 55 -140 -77 18 -18 14 36 -155 -70 35
5659 35 20 -12 -115 -67 -102 132 39 30 -106 4 -33 -166 217 -60 -74 -35 107 -68 -89 49 47 70 79 31 -52 -5 -122
5686a22R2J41qj76j73L05j00nj47N1K31j04J67j54j49J37J18j72J92k19J76No9
5709A7m3k53K49J3L3j75J57O8jj16L0M5j65K47Pl04J87P3j37J6j24N9M46m80K94
5734A43q0j06L3J8j84J41O3j66O1J84j73J7K26k40p7O1J81l14n7L49k48K5K29
5757H6J2p7j0k8l7Q7q4J14o6j8L7o4Q9J01j10R3o1o7M5n2R8q0P8O9j96K60l94
5784a75J53k2rK86k24J43N9k67k08K27J99l64L01j6Oj58J23j67J49J46j32M5j97
5807a02K41j81l4oO6j29J84k09K24j37K87k74M5R1j37J49k35J54PJ6k28R9J61
5830E2R2j30O8j13O1j3j14K29r5l5l3j54J33k7K1J69j08k8Q5N5j39K63k63r4J95
5855G7j01J46q2L9K01l70P3jJ23K7o5m0r5K00qk44J40J27mj22j24L6K7J73j20
$$ plain form
5686 -122 -30 111 103 -73 -246 59 -41 -46 -193 -142 89 -15 152 -2 -151 -14 104 -68 124 -95 81 86 17
5709 17 -26 -279 -30 -17 16 -159 -2 66 65 -51 -21 24 -141 106 113 -191 -4 69 -68 -52 -176 -117 329 -151 143
5734 143 63 -43 -10 8 -176 -35 28 -138 -77 107 -66 -49 177 -63 -140 -79 102 -212 -269 80 -168 -143 86
5757 86 98 21 11 -17 -54 33 -51 63 -3 -21 16 -48 41 142 32 125 64 -3 42 -10 88 8 86 155 -41 219 -175
5784 -175 -22 -44 -53 233 9 152 211 -56 -264 -37 162 -202 99 83 89 -69 54 -113 36 182 50 95 -102
5807 -102 139 -42 -76 -82 -16 -145 39 -170 54 -83 204 -70 -25 66 -71 78 -157 -3 4 20 -208 -109 52
5830 52 144 14 82 -31 30 17 -97 132 37 2 -31 -185 -52 -79 -58 111 3 -25 60 115 -24 239 -24 -118 77
5855 77 -24 122 40 79 280 -90 -17 -18 105 132 67 27 -68 132 124 -120 20 147 143 21 -103 -67 -40 133 13
5880A3j47O4P5lP8j10K7j11O3K12k11J14Q4l04p2K79j23J55m9J72j43k3j65J61
5904C6l08M20k49N2q7K55j5j72J95n3l8m2K0K26j85oM0j29j93K27J0Lj70K48O
5929I1j42J37pr3J96k12J70L6Q6k8p7j06k4OO2k23L07k76j9J23j99m2L71P0j21
5954H6j81J46j47m1K83j17M8r4K0j57J25K10j70R6N9p7j29J98ok61m7K52M5k07
5978f6K50k70MJ72q5k7J5J44l41K41r8J3J98L4k69P6M1o8rj95J94L4n4L8j04K17
6004H5K8j99J58m4K2Rk24K49l1j08O9o2J24j29k0J60q6Lk09K27Npq7r3K71o8m
6031C9J13l45K12k35K67N5j5k04R2P2N2q0J59k77n4J70J20l04N3J80L1p8R0pj17
6056a1m8K96k34J48j25R6k1j81p7j9J84m3K28k29k42M02o0j72lK0Rp2J11J08%
$$ plain form
5880 13 -134 -70 5 2 80 -30 -3 -114 -51 161 -50 64 148 -156 -228 51 -72 83 34 206 63 40 -125 36
5904 36 -272 148 -101 -49 -136 119 104 -68 127 74 36 -6 14 240 55 49 89 -40 -233 -6 4 7 -163 85 91
5929 91 -51 86 79 -14 182 -30 140 176 262 234 157 51 27 33 95 -128 179 -97 -116 7 -192 -234 137 207 86
5954 86 -95 51 -96 -137 146 29 77 -17 3 -154 -29 181 11 107 166 89 -40 158 152 -109 -156 96 141 -66
5978 -66 184 -86 -82 90 5 -22 -7 137 -204 37 -61 -48 150 184 -85 -9 32 -36 -45 -240 -46 -12 -66 -28 -132 85
6004 85 113 -86 72 28 50 59 -165 84 53 -55 14 -48 76 -53 -73 87 1 4 -205 22 27 20 -67 -160 111 43 39
6031 39 152 -193 19 -216 51 106 91 -113 -21 51 103 23 182 -95 -149 21 141 -163 -110 70 101 23 113 106 -11
6056 -11 -59 237 3 151 26 122 101 -80 -157 -176 8 -35 193 -36 -278 124 64 -108 -111 -91 -82 -154 -43 65 65
6081F5o6j39J39n3n7M5j09M41k00k33P5K3O8M5k07R2P0oR5l3K0p7Q8m3j6O1Q5
6108A73j37k78J73J09P2O1k60n0J00K5N5j04J42j84j61J40m0J32K2J63k09P5L
6131B2K27k17k3J7j45R8j10M6J17o5N0J17Nk25j9j7j72K91J67n1k51K84j79J9
6155a4l5j4Q7P0j13k70K71K2j03O5l8J09j40L7J09K1m7k5j18K2lO2J72k00L4m6
6181h5l0J93rj9j1J74m30L46J81l76J35r1p8K33l58J35J39j32J52j55J68K76l62
6204dR2k8J08j99j40J43M4Pj71p1J84J0j79M16k04p2K15j37L4J08r6j05O0N9j70
6229i6M4J64l33K89j9j42M8K70k94O2m9O4j9m4P7j91L12k55J52j35j37K56r9j40
6253b15J72n1J66LK4k28P5j84K37j02P4Q6r8L4q8L69k03r1q0J76n0o4J53j48M4
$$ plain form
6081 65 -1 -140 -1 -54 -111 -66 -175 266 66 -167 -92 -69 -1 44 -163 -71 -1 -7 88 55 75 -2 86 43 27 88 173
6108 173 36 -242 -69 40 112 173 -87 -137 -37 -12 43 -61 81 -103 -264 -124 -164 -32 -10 153 -56 19 22
6131 22 249 32 9 26 -119 -21 -131 -85 32 -33 17 134 139 -86 -105 -122 -294 -3 164 113 -138 146 -33 -14
6155 -14 -49 -63 24 94 -19 -289 -18 4 -99 -34 -72 37 -103 -66 43 64 17 -8 -126 -104 -107 -45 127 -73 -39 -85
6181 -85 -115 78 69 50 39 213 -217 129 310 -66 69 -22 -100 133 -225 -90 49 -83 69 -86 82 358 -4
6204 -4 88 60 168 -31 -171 -28 16 23 -148 -219 -35 -25 -204 212 8 -64 151 14 48 156 60 -45 15 74 -96
6229 -96 -52 112 -221 68 49 -93 -45 225 -69 -7 -56 8 -11 -55 22 -169 143 -112 40 -95 -232 24 -75 -215
6253 -215 -43 -94 72 75 99 -129 -54 -238 -1 -103 -29 57 -41 -7 -95 274 71 -20 -100 76 26 -38 115 -33 11
6278A1l2N1k7J28j20O2R1k01Q0J01k49O1K22l34J18j54K23j26L2M8j0o9J05J19
6302A30l43Q0J40o1K27k64P0P9k8J06l22K19J06k29L4ol2N4M2j49K21j82M4R0
6326B6%rP3j89N8K67j50K1j01j22K05j79n1K57J71k07L9n4k4j3j80K01j04J19
6350E4q5M6J1j6J23j3P6k21R1k34J05j10M3L54l96L44l36K11J48j80M8l9j10J13
6374B7j15m0K9L65k2k00q0J36j02p4J34r0j25NJ42j99J33J17M9j56N3o5L22j39
6398A05L6m36K63J22j35j34J28j0P4n8o9K2n3P6p4J6J30j38J82r0m1J95p8P5q6
6423B2j25J31N2j81L6j83K50q2J26j01O2N5L2j77J09Q3k12K75j42R2k05J91K3
6446A31r1q3K2K63m06J99n7J20m8Q7PJ16k65J25O4j36J6m34L13K55j45j40J13
$$ plain form
6278 11 -21 30 3 131 11 73 164 -37 43 144 -105 -44 178 -156 -38 -192 31 -95 -63 -15 -25 -94 11 130
6302 130 -213 -133 7 -54 173 -91 -21 58 30 136 -186 33 139 -90 -56 -62 -94 -40 2 -147 74 -108 -64 26
6326 26 26 17 90 -99 -41 226 76 97 -4 -126 79 -100 -151 106 277 70 109 55 31 18 -162 39 -65 54
6350 54 -31 15 26 10 133 120 196 -25 66 -168 -63 -173 -130 224 -172 172 -164 47 195 15 63 24 -86 27
6374 27 -88 -128 -99 266 244 44 -36 100 -2 -76 58 -32 -157 -152 -10 -209 -76 41 90 -66 -13 -78 244 105
6398 105 141 -295 -32 90 -45 -179 -51 -61 13 -45 -114 -92 -145 -69 -143 -127 3 -135 47 -43 -84 111 33 108 22
6423 22 -103 28 80 -101 -65 -248 2 -80 46 -55 7 62 94 -83 26 109 -103 172 30 122 -83 108 131
6446 131 40 -43 -21 242 -164 35 -22 98 50 137 144 260 -5 120 184 48 64 -370 -57 198 53 -87 26
6469B6o7J34j79L3J20k83J67N9J70m0k7P7j58n8J46M9j41J8j95K06k42J29k0K26
6493A50l18J01K0J82j41L02k40k8j18O3l2Q3Lr2o7M8L15l78K8p4K77l00L59R6
6517B39k31k3Oj56J52J20Jo3r4r8K98l78L1K54j41J51N3n3k4Nj16L70r5m80L58
6542H6n2p6J72k59K25k97K85k84J49P9r3Q2l08M30k27j1K55%l27J78l5K58l31
6565a01K16j1J5j60K6r2J55N1n8R5j29q2J10P6j24Q6l95M01j09Q3k10J86Q6j78
6589f3j7J35o1j43J29L9k44J53K39k46J29m6R2q7l7n4r7L29j6j89n1K60m03L46
6613I7J6l41L98o1r2o2J11O6j43q3J50k25Q8J34j81K4R2L8j56L7j4J46k78L63
6637A24k22Q9m5j03K62k21J10J23j10j6j02r8K50M5mj92Q0j24J89J61j99oJ15
$$ plain form
6469 26 -41 93 -86 -53 67 -216 -49 10 180 140 113 190 32 -26 120 169 28 46 -149 57 -185 -56 -76 150
6493 150 -168 -67 -47 135 -6 296 56 28 -90 -27 -59 24 27 -65 -132 -84 231 -147 -119 -193 84 -216 143 239
6517 239 8 -15 -9 -165 -13 107 108 45 -49 -147 151 -227 -196 58 -83 68 121 68 44 49 -67 303 208 -272 86
6542 86 34 -42 130 -129 96 -201 84 -200 -51 28 -65 17 -291 139 -88 -99 156 156 -171 7 -28 230 -101
6565 -101 115 104 119 -41 -15 -107 48 99 41 136 7 -75 35 111 -13 73 -322 79 -30 53 -157 29 115 -63
6589 -63 -80 55 -6 -149 -20 19 -225 -72 167 -79 50 4 96 9 -28 -82 -179 150 134 -55 -106 154 -249 97
6613 97 113 -228 170 109 17 -45 66 132 -11 -94 56 -169 -81 53 -128 -104 -12 26 -130 -93 -107 39 -239 124
6637 124 -98 -9 -54 -157 105 -116 -6 117 7 -9 -111 -209 41 86 82 -110 -30 -154 35 196 -3 -9 106
6660A06j91j0J3Q1M5K7j26J82k20K71j48j02Q0J18j23J0Q7o5M0k02P1J95J10k11
6684C8j79J36m7K2k6l8Q6l8k8J05J05j32J61k07JJ76p5k45K14qJ6k2P0j08mR5
6710F8M1K28m15J95j6k6r4J43Q4r7k53J02J18q1K64k01j53oJ03m5j2o0Q8j74K67
6735F8M0j04j47L7K67k84J64Q2j54K24l20J26k00J87L5j97J96Kr6Q7J38j53K05
6758B03m07L0J48L5Q7j3NL7j94n5L16k12K87k21o6J36m3J11k46r9O1r7J87n7%
6783f7k06K29J14J3j40j15K37l01J27K64j92J47oj89O7Lo3J22j11nL1l6J24O1
6807A08j10j58J81m6J00j59J51j00J46J25l87kJ32k1q4j08J61J45L4k19J22l0
6829a9J83j11j59L42j53l5m1L9j25J06k6p3L0j7K3Ok6J02j29R9q1K48k24p8L06
$$ plain form
6660 106 -85 -95 -82 -1 44 71 -55 127 -93 178 30 -72 8 126 3 13 100 35 75 -127 -56 139 249 38
6684 38 -141 -5 -52 -30 -56 -94 -8 -46 -74 31 136 4 165 -42 -41 135 60 -185 29 21 37 15 85 -23 -27 68
6710 68 109 337 -78 117 101 75 -19 124 208 111 -142 -40 78 -3 261 60 -93 -99 4 -41 -53 -113 -25 -199 68
6735 68 108 4 -143 -106 161 -123 41 123 -31 193 -127 -1 -201 -14 21 -176 20 22 -74 13 151 -2 203
6758 203 -204 -174 -26 9 96 83 88 125 -69 -124 192 -20 267 46 -20 116 73 184 -62 -161 -100 -197 -10 -67 -67
6783 -67 -273 -44 70 83 -57 -172 65 -236 -109 155 -37 110 104 -85 -18 -15 -78 44 -67 -72 -41 -77 47 108
6807 108 -2 -160 21 -25 75 -84 67 -33 113 238 -149 -151 -19 -40 -124 -232 -71 74 108 -111 11 -19
6829 -19 164 53 -106 236 83 48 7 46 -79 27 1 -72 -42 -59 -36 -30 -56 46 -83 16 -65 183 -41 -119 187
6854A87j94J02j12K40k68J96j67J50l36J40J20l03L1J03K72R4l48K25k86J1R9
6875d4J38O1J2r4j23m8K09k56J6K77l0l66L14j8q2j4J42j2k02J36mJ34l03J21
6899c6K59l65J74J46j20j92K0J20j02K10k14Q7j5m0Pj1O7J23k91K65j07K4K15
6922B24j57m7j94q5J55J48k2L4j28J99r9O5O9j39k6k4p9K49j92p6N8j92K52n5
6946f2J62k06k7q9l3M28j86J06l27J36J03n8N3K2O5k68K30j34Q9J20Mn7o8J59
6970A62k39J71jL4r4J23j08l56K68KJ25l3j40J6nj39K71k8nK4J19j6k63L57l18
6995g3Q7j77r8L93j10o9J76l65K70j20L5j33K13Q1Q0l62L08k22k6K44j48L2JP5
7019I2J07l26K1K08j1p3mk66N05k89K11r4l22P8K80k21J91j02k9K01j78O2p6J31
$$ plain form
6854 187 -7 95 -17 223 -45 151 -16 134 -202 -62 58 -245 -214 -111 161 255 -93 132 -154 -143 -44
6875 -44 94 155 167 73 -50 -98 111 -145 -129 148 118 -248 66 48 -34 -48 94 82 -120 16 12 146 -157 -36
6899 -36 223 -142 32 178 58 -134 -114 6 -96 114 -100 -13 -28 -68 -61 -72 -5 118 -173 92 -15 9 224
6922 224 67 20 -174 -259 -104 44 22 56 -72 127 28 93 162 23 -3 -27 -106 143 -49 -125 -67 -259 -7 -62
6946 -62 100 -106 -133 -222 -255 173 -13 93 -234 -98 5 -53 0 22 87 -181 49 -85 4 124 128 71 3 162
6970 162 -77 94 93 127 33 156 48 -308 -40 -38 87 54 -86 -70 -75 -214 57 29 24 48 167 151 -112 245 -73
6995 -73 14 -163 -261 132 22 -47 129 -236 34 -86 -51 -184 29 110 190 -172 136 -86 -112 132 -16 16 17 92
7019 92 199 -127 -106 102 91 18 14 -252 253 -36 175 81 -241 -163 117 -104 87 -15 -44 157 -21 41 -35 96
7043I6K9k04L4L06n01J79J73m8l3pr0R6l0J54j69O8J47l54N4j15K18N1o9J03j38
7068e0O6r4J60j29P6M5j97P6J7p8K00p7ONj03J80l42J86j5P6j20Q3K3J06j31o3
7094i4K51k47K04o7K7k1j53J5L47j49K5j41o7J38J1j08k5M5J9P2o7R3q4o6p0L03
7120A91j28j02p2m4r2R0K54j53%J30j09J04j60P4K1l9p1K78k47M9o0L0OQ8J58
7145A96m4n8j81L58k95J08Kj1j00LP3Q2j77R8J17j57j30J96j05k5J42K3n5o6k1
7170b7K4N9Q6j13mM2r6J6r5p7J87J96k55j57P1K57o3J05k43j2Q1J54p0j53J41
7195E4J7k9q7J38j62q6L02n0j44J11j07L42l56N1L2l5j94K58Q0j62R0J30k43J12
7219F2J16j87rR6k4Q5k85J59ln4Q0N7O0k05o9J30J19m0j00r7O0N0J91k13K6q5
$$ plain form
7043 96 125 -79 -45 261 -240 -61 112 64 31 24 -66 30 0 154 -15 53 200 -154 -100 -215 3 54 -15 88 -50
7068 -50 16 -78 82 -47 29 74 -123 -47 -30 -108 92 15 21 26 -77 103 -239 -53 -68 8 -112 -29 -6 100 -31 -94
7094 -94 157 -90 114 47 74 53 -100 -85 262 113 138 -3 -70 68 79 -29 -54 -9 10 82 15 108 24 -42 -112 191
7120 191 63 -39 -111 -155 -247 -157 97 -56 -56 74 -35 69 -91 -17 4 -35 -106 172 -75 -26 -86 -56 -50 38 196
7145 196 152 94 -87 271 -24 84 86 75 -25 -22 51 133 -44 54 171 14 -116 80 -25 -50 92 115 60 -6 -27
7170 -27 -3 56 142 29 25 67 -29 -13 -108 -185 2 198 -57 -214 -143 114 51 156 -87 -99 -18 136 66 -87 54
7195 54 71 42 -45 93 -69 -155 147 97 -47 64 -43 299 -57 -6 26 -9 -203 55 135 -27 63 193 -50 62
7219 62 178 -9 -18 78 54 139 -146 13 10 -44 36 93 153 -52 -121 9 128 88 -12 -109 -49 1 192 -21 5 -80
7245h0Q1m4n8J70l44K71p6K35l02J98n9J76j87J2Q2J9j7O0l03K04K2m7J08k44
7269a23j24M5R4K67j76o9L53l22K04m0r4K24j69o5n6o8q0L43q9j25Q8PL6K5PM6
7295A39k00J59j03J33P1j8l36J95o7O3k4l43N52L4k96P2J49j40j77K30j37J21
7317G7p9j7j52L09Nr5j79r2O7K83j07j56Q8j3NK14j21j19O4Q9lN1j19o8Q1k17
7343b04L41Ok17J80j58J19j4k26J40n5K3l8J66m2J1k21J32K27j56K90m68M3J72
7366E1O5j91Q7j30R3L8K66l00N4j82J28j44L3J17j93J12M7K84k06o4R5j22R0j81
7390a53R3r6J04N5N5j86m1K61R6k53J93Mj00r4K89j79q3L0J16j22J35j51LJ77
7414A53l93K17j35J09j43J42J03R4k36j21J63J97j08j36J40M8J17k68p3K3n4K26
$$ plain form
7245 -80 1 -43 -101 69 -275 -4 -80 155 -147 51 -8 168 -19 -7 75 94 77 137 -166 38 60 13 121 -123
7269 -123 -247 -202 -108 159 -17 -86 267 -55 149 109 15 239 70 5 -51 -119 -199 144 55 -70 18 25 61 86 93 139
7295 139 -61 98 -5 128 199 181 -155 40 -27 36 12 -331 221 255 -41 31 180 40 -137 93 -44 77
7317 77 -2 -19 -171 138 143 48 -131 -223 -156 127 20 -136 -48 -61 -56 158 37 -82 -18 71 68 119 0 -68 13 -204
7343 -204 137 143 -74 106 -52 67 53 -173 -33 -88 -65 -103 63 21 32 -189 -57 170 14 304 -164 -121 51
7366 51 116 -75 12 -118 -25 13 279 -21 33 -149 -21 -165 -132 -15 -208 -96 -49 235 29 -35 60 -62 28 -153
7390 -153 -60 -156 -52 3 58 -128 -169 92 188 -65 128 132 32 -62 227 48 -35 -5 111 -11 124 -27 -24 153
7414 153 -240 -23 -158 -49 -192 -50 53 147 -89 -210 -47 150 42 -94 46 94 211 -57 -130 -107 -161 65
7436F5N2N5Nk00n1K36j12P0j40L0j17L18l02L0J59j50K50j62o8K44k19j2K9k3
7460a3K9J93j14j69J01k1J70l2r6k11L84o5k04Q1P8k37n7K76O3m12L63l17K36
7483B6Ok3J24q7j38J60M6j11P9j39K70j79J43j88P4NqM4k12K35j82J60j73Q4J63
7508A79l24K35j21O0r6M4k05L11j52j46J20K70k05R4R8j70k04J66K71m8j81N2
7530D8j62J27q2O8l0J22k89l7M54k83K89k40L7M7j87J89k34jJ84p3J67j29q2L26
7554B29k77N0j80K45K4l76K84l2J30j16P1L6l62M16j7k05j24K31M2j66K38l6j64
7577e9J39n8J1P5k36O8j95L07k32L87m2k50J64k25J3K27j92p9O0K39k95J59R7
7600H3j74J44j93O6O5J46k96L1J69J11k42R5p1N4j93K13J46k80k0K69j58M6m4
$$ plain form
7436 65 117 172 177 -23 -74 162 50 120 -20 10 -107 211 -91 -61 98 -52 198 36 -32 212 -7 -19 10 -13
7460 -13 16 209 95 -74 27 6 176 144 48 -163 221 156 -48 33 111 -126 -183 93 156 -256 107 -210 26
7483 26 32 9 133 46 -92 68 114 3 82 -57 213 34 177 -11 63 68 60 104 -108 127 -55 105 -68 16 179
7508 179 -145 90 -31 29 -67 -23 -228 83 -69 -215 -95 175 -30 64 162 -8 -212 -46 225 177 -4 48
7530 48 -114 13 -69 -1 -31 91 -198 -235 219 -64 225 -15 22 69 -118 71 -163 -164 20 -53 114 -15 -97 229
7554 229 -48 2 -178 67 91 -285 -1 -33 97 -19 52 88 -274 142 125 -80 -204 27 69 -97 141 105 -59
7577 -59 80 22 33 108 -128 -60 -255 52 -180 207 165 -85 79 -146 -133 94 -98 -177 -117 122 -173 -14 83
7600 83 -91 53 -140 -74 -9 137 -159 -128 41 152 -90 5 -66 -12 -205 8 154 -126 -146 123 -35 11 -33
7623c3O2o0j04J28k05L56j5j74J41j06r3J87L3j32j69K84o4j43O1J6O2P4n4j03
7647e1O3P6Mj95R9j08L51k38J8j85J46j24K04J03j00J36j93J45k35J81j9k18O7
7670g3N1o2J23j87L7M5J77J6j94k9N5Q5j28K13j99OJ14J4k57M62k69J05k00J62
7694F7M8j8j99Pl0O7j72J70J15m7Nr6J10j23l0O5l5nk16K39J79o9j98L36k35J29
7720F4M5k21oJ50p8L3n0J32n1m1k02P8K8J72k26J56n2o3K38Q1j63r5J19m7L6p
7746C0J44j68j56J59J91j96Qj85J91r8J10j6j45P9rO4P4j10j78K08j72K67j07
7769a5R8j45Q0R4j35J30l8q5J31N0j21l8Qlj09LP8K01l57K20P5rj34R2j32O0j66
7796a67n8J48J68j76M2O7J41j31J43p7m2N6P7j51k08K00L0J16j58J80j89J0l51
$$ plain form
7623 -33 29 -31 -135 -7 -212 144 129 -45 96 -10 -103 84 117 -15 -184 100 36 -107 -46 -30 32 106 52 -51
7647 -51 12 88 92 -103 -4 -112 239 1 19 -166 -20 -144 60 163 63 199 6 151 -84 97 78 -140 -73
7670 -73 -22 -84 39 -148 -111 -66 111 127 -67 -96 -41 44 -84 129 -70 -64 50 64 -193 269 0 105 -95 67
7694 67 115 97 -102 -95 -125 -58 -230 -60 55 8 13 -83 27 -96 -126 -61 -96 -101 -317 -78 101 32 -166 170 -65 64
7720 64 109 -112 -118 32 -46 -13 -63 69 18 -23 -225 -147 -119 53 -173 -17 -69 -132 106 187 24 -71 48 1 37 30
7746 30 174 6 -150 9 200 4 12 -173 18 -80 30 14 -131 -52 -61 3 77 -33 -211 -3 -175 92 -15
7769 -15 83 -62 18 112 -23 107 69 -16 115 165 44 6 14 11 -98 -95 -17 184 -173 47 122 113 -21 71 -61 -1 -167
7796 -167 -225 -77 91 -85 -43 24 165 34 177 100 58 114 191 40 -168 32 62 178 20 200 11 21 -330
7819c30M74j21mj35J48j39L05j76p5J59p4j42o5J28J83l3j22J24k10Q3J33k4k9
7842E8j8J41j46j19K58k8k02O6O0j89K63j64J51o9M7j10J31R6k17n5K2o4K04l33
7866b17J42J05j52K62m2j13Mk05L21q2J77Rj53J0q4j49R0J65k23J00R7R7k28J16
7890D7L6k06J42j35J0K22pK1m4l9r3Jmj3N3O4J29j56M5j53J78q8O7ML7j06j20
7917a08l9J47m9J37m0l7P5j13n9Q2pm0N4j71J95J9q6N3k5m0K29k61P4m9J61j72
7943g0L6MO9n3j29J53j51J26o3K14j33J49j27k04J78j15p8K21J25l31K31k40K80
7966I2j1k43O1K73k47J11j36j03M6L40J85m19J43l4Q5k56K52k73J73p8J82k00
7988e7o3J20lKj56L41j17r7J31k5j66j5J30m3K4q6P8k66P6K27lk57K49J24k15
$$ plain form
7819 -330 144 23 19 -116 32 -107 198 22 -53 106 32 -110 -175 -47 136 103 -19 105 -105 -22 111 87 58
7842 58 40 181 35 -84 174 146 -56 10 70 -119 144 -20 131 62 109 -1 130 226 9 -46 -24 -88 116 -217
7866 -217 -75 30 -122 140 98 -15 -11 -216 105 23 200 209 56 66 -18 -167 -77 88 -135 -35 62 159 -69 47
7890 47 83 -123 19 -116 -106 116 109 130 86 47 -46 -45 -49 -62 -9 55 184 28 73 -80 98 10 77 81 118 12 -108
7917 -108 -147 0 -49 88 48 11 86 -27 -86 -4 -11 -51 3 -168 27 46 -40 13 -12 -52 177 -84 -10 -59 102 -70
7943 -70 -34 -30 39 -14 -143 10 -141 -15 -78 136 3 152 25 -179 -1 -116 -194 27 152 -179 52 -188 92
7966 92 81 -162 -101 172 -75 36 -100 -203 -157 183 368 -51 92 58 143 -113 139 -134 39 -39 143 -57
7988 -57 -120 0 -3 -1 -157 184 67 -30 101 76 -90 -105 25 -18 6 -80 -2 -268 -192 35 32 -225 24 148 -67
8013f7J12q0R3l0n3K1O3k1L6m9J2p3J42P4q2j95O6J41k52K3R1J53j09j81J66J20
8039A21r0o6K6m0J12j65M4J08j54N6rK94l19K6m8m0K30j18j23K74j34j17L88j68
8063H8j69J37o5J43j58Q5q4J29j02L7K5j90Q3qL14m39K58j68J20j78L92K7r0k62
8087g5O0J08m18K17N3m3m5K57k2j93J92j38K8%rJ24l9m5k8J45k77n4L43J38l14
8112c5MR2k37P8K43Q8k47j54M4Q3J09L7k35M5P4J10q5P2M6r4k5M9O4j63J17L6
8138A16k3n6j43jL61l46K65q1o0j07K82j06l1j80P7K43j65J7K7l15J68K06K2k04
8162c4n8J22O0qo8K0j12L3j40J50L0P1Pr9J79m55L42M0j05J07l3q7l33L87M8k02
8188a38M05j56l6
$$ plain form
8013 -67 45 -35 58 28 -25 -4 59 38 74 25 37 -36 106 180 98 -97 -31 110 -142 -119 -28 125 16 -165 1 121
8039 121 31 -35 -9 -49 63 -102 -58 50 -104 -48 -57 237 -82 -56 -104 -144 86 -32 -155 119 -15 -132 256 88
8063 88 -81 56 -9 134 -24 61 -23 106 4 41 66 -124 -41 -49 265 -174 84 -84 36 -142 250 277 187 -75
8087 -75 -15 93 -325 -108 -55 -98 -143 114 92 -101 91 -47 -19 -19 -28 96 57 12 -16 129 -148 -202 141 279 -35
8112 -35 -31 61 -176 -98 145 233 -14 -168 -124 -41 68 105 -130 -85 -11 99 14 86 132 38 13 62 126 -37 80 116
8138 116 93 37 -106 -107 254 -92 173 92 32 -75 207 101 70 -110 -33 210 45 62 89 -226 -58 148 170 -34
8162 -34 -92 30 90 82 14 34 -78 -45 -185 -35 -5 66 73 -26 153 -302 40 80 -25 82 49 -38 -371 16 64 -138
8188 -138 267 111 75
8191G5
$$ Imaginary data points
##PAGE= N=2
##DATA TABLE= (X++(I..I)), XYDATA
0@%%%%%%%%%%%qJ6j6J6k4L2l2M0n5O3p2Q8j04J21j45J69j93K24k57K97l43L90
33B07m40M96n59O27p02P87q80R80j090J209j341J485j639J809j997K203k427K673
51A401k944L244l578L953m374M848n391O020o758P636q703J0033j1743J4036j7295
66i615K2325l1180N1384j85319l9693K07490j27089J9771J29805M1204m6268P4902
78A07717K7333o0964k1806M4840p0357q4213K0314K3966o2389j5795L4689J5499
90d1166o055K4967L0556M023m348L1368R829k6593K322K2202k4462k4112J4972
103A3503Q638k6391j7366J741j1246j1263J6366J940j0863K7325K6358j8501n58
116c17L5799J3447j5757q095o25r071j1179r889j8775j2201J0292L411j0057P132
$$ plain form
0 0 0 0 0 0 0 0 0 0 0 0 0 -8 8 -8 8 -16 16 -16 24 -31 32 -40 48 -56 65 -80 89 -104 120 -137 160 -183 207
33 207 -233 263 -296 331 -371 416 -464 516 -574 635 -706 779 -860 949 -1048 1155 -1272 1401
51 1401 -1543 1701 -1877 2076 -2298 2550 -2841 3179 -3579 4057 -4646 5387 -6356 7680 -9615
66 -9615 12710 -18470 32914 -152405 -192098 15392 -111697 -91926 37879 79083 32815 107717
78 107717 135050 74086 52280 97120 26763 -57450 -37136 -13170 -75559 -91354 -56665 -41166
90 -41166 -47221 -22254 8302 12325 7977 39345 49174 22581 24903 47105 22643 -1469 13503
103 13503 22141 -4250 -21616 -19875 -31121 -42384 -26018 -24078 -34941 -7616 18742 241 -317
116 -317 35482 48929 33172 25077 24452 15381 4202 -5687 -24462 -36663 -26371 -22960 -33017 -25885
130b5885K1030J0773M531O077P631L823m874o548o546p523j604k823j1074n457
144a8469M018J559k349L125R471N353L46L297K713j292L400R43p487k249M096
159F475l288p449r15K198j153k765m20J465J987L129O32j473L660M554j024k572
175C041P0M45r22k001r81q55o00o17l22n56J132J750j20j81J064Q36j17k02j91
194F73K27l76J02m33m10J99J38J29J70J11j07j65J05k80n31K9k40j39m3n48K7
215a362J087Q69p59K98J086O92o6n93J59j20n33p96j221r52O62J9j304N30J466
234h38Q65J07K45J328O72l11N1m17q76O84n42k510j54R48l86j242j66J397O04
253e41l14O17l4N06J806l0j775J381J730q07k060p04J356j058j963o98k39oJ227
$$ plain form
130 -25885 -4855 5918 10449 16526 24157 27980 23106 16558 10012 2489 885 -1938 -13012 -18469
144 -18469 -14451 -12892 -15241 -12116 -2645 2708 3054 6351 9064 7772 11172 12115 4628 2379 6475
159 6475 3187 -4262 -5177 -2979 -4132 -6897 -7317 -5852 -3865 -736 -104 -1577 2083 6637 5613 3041
175 3041 3111 3556 2634 633 -348 -1203 -1803 -2420 -2742 -3298 -2166 -416 -536 -717 347 1183 1066 864 673
194 673 900 524 626 193 -217 -18 120 249 419 530 423 258 363 83 -448 -419 -659 -798 -841 -1389 -1362
215 -1362 -275 594 -165 133 1219 1911 1845 1252 1411 1291 758 -38 -1259 -2211 -1549 -1530 -2834 -2304 -838
234 -838 27 134 379 1707 2379 2068 2119 1702 826 1510 968 -1542 -1696 -748 -1134 -2376 -2542 -1145 -541
253 -541 -855 -238 -272 234 2040 2010 235 1616 3346 2539 479 -225 1131 73 -1890 -2588 -2827 -2833 -1606
272a606n62o03K295K760r8q39J147J848q29k137l14n74j847n58q70j292O16K048
290a415L2j49J939J907M41r05L25O97j168j81j567j730L95O33j237o42R86J627
308a2K25r08O85J538m01j57k68m55P88m7j240k84O97L90j079o10R21L32j000j37
328a022K75j63O07L15j04J63J155K61n32j81M87J1j222l61o99m43L98p5o97M99
348a328J243M32k10L43J196J28q24k31K67o33l01l87j038L16P15m05p06P97J070
367D44k38m64N86O47l91k46L21l86N10l0m84m46J58M67q87p83P19K72o65M0M6
388h10K96N50M41r9r5P82L84n39p82O50l1j157j65k28l6K14Q7m63K95J129L24
409G47m07m9J141l7j071NK15m32l40m78j56L09K85J3m74K39R28o3m55N35K22j89
$$ plain form
272 -1606 -2168 -2771 -476 2284 2186 1347 2494 4342 3513 1376 1062 488 -1359 -1917 -2787 -4079 -3463 -1415
290 -1415 -1383 -1532 407 2314 2755 1850 2175 2872 1704 1523 -44 -1774 -1379 -746 -1983 -2625 -1639 -12
308 -12 213 -695 -10 1528 1127 970 702 247 1035 988 -252 -536 161 551 -528 -1138 -217 115 -885 -1022
328 -1022 -747 -910 -303 12 -92 71 1226 1487 955 774 1261 1272 50 -311 -1010 -1453 -1055 -1130 -1827 -1328
348 -1328 -85 347 137 480 1676 1804 980 749 1016 383 82 -305 -1343 -1027 -312 -717 -1423 -626 444
367 444 206 -258 328 975 584 338 659 273 783 753 269 -177 -19 448 -439 -1222 -503 -231 -896 -856 -810
388 -810 -514 36 477 378 283 1065 1449 910 128 778 747 -410 -575 -803 -839 -625 -538 -1001 -706 423 747
409 747 340 291 1432 1395 324 329 544 112 -228 -706 -862 -553 -268 -255 -729 -490 438 375 -80 455 677 488
431D88J6k93k44J68p3k26n16J57N12Nn99K58N19j00K08o3j04N01n7k60l43K98
453B52M20p97m74M16K77l97j99Q1K2M70o1j47J23M99M30o22m9J31K78l42k15k21
475a25P8j62k82j47J5N87P3l63K20L95J29j77Q4K19Q1l19P5j88j45k83J23m56
497e68r8M55J94l11K95M15l59K64k0j18K05%k95mk25J52o2m99K70L21j16rj00
520b13J91J36J08k54Q4KK98k70k6J39J77k57j30J68l68O0K3Lj61L77K6j68j37
543a92L82J47k64L54k17j47J67o7j99k4k89K49j53k04L48P9k06Q4M27L6k37J08
565A82Rp5K7k69J53k48K55j24o3Q3L47k83j89K13p7M9N0L9j35p6J51J31p0Q0j63
590cqJ11m9j80J42j69J19j0j2j05J37P9R0l8m5K2J0M9On5J83o4k16M2j50K25k7
$$ plain form
431 488 504 211 -33 135 62 -164 -680 -523 -11 -6 -605 -347 172 72 280 217 113 614 557 297 -46 252
453 252 672 -125 -599 -183 94 -303 -502 -421 -399 71 10 -137 -14 485 915 293 244 375 653 311 96 -125
475 -125 -47 -209 -491 -638 -623 -36 37 -326 -106 289 418 241 325 544 625 306 381 193 48 -235 -112 -568
497 -568 -666 -211 -17 -328 -33 382 23 287 267 149 354 354 59 55 -170 -18 -80 -579 -309 12 -104 -113 -213
520 -213 -22 114 222 -32 52 54 352 82 56 195 372 115 -15 153 -215 -155 -132 -129 -290 87 113 -55 -192
543 -192 190 337 73 427 210 63 230 163 -36 -60 -349 -100 -253 -457 -109 -30 -236 -152 275 311 74 182
565 182 191 116 143 -126 27 -221 34 -90 -153 -70 277 -6 -195 18 -59 -10 40 79 -56 -132 19 150 80 160 -3
590 -3 -11 100 51 -129 13 -156 -37 -47 -59 -164 -27 52 142 104 59 81 91 140 146 91 274 210 -6 36 -114 111 84
617H4j70kJ09j30j38J17R9L32k47J8j54L47j23r7K7k8p2j76Q1k48J01N7J11J23
641B1Q1O2O1R1k02q5L64m46Q9n9j60K26j89l8J4N8N6J8j98K73p7j03N0J36O0m7
667E6k9r8M8J98k82J68j35R7l5j90k48M03Jj72K0K67q6N5r5M18l54k6M8R2j02
692A9j42L88m49k34L29KJ23No0J88KL5n4n6j8Q5j86K5j63L28j83n7N2j6O6j1j14
719i6J48j10J49m3J54j37Q5O0j79j63R9J57k02OM0P2l5l6K85j07k55K77Qj18J12
744A71j99L56l77m1Q4J58j34l95M71j29J38k09N4J8O0J41j51m6N2j60R6j7n4J27
768A4j23j10J76Q0M4j84k2K42Lj93K60l88K55j59Q2J4J7j57R4M3J56l12K20O4
792A16j9R3j28J65K4j31o0nj09N9o2j00R1R7l2j84J55J78j75L5m5j48J86J48m9
$$ plain form
617 84 -86 -88 21 -109 -247 -130 -31 301 54 72 -82 265 142 45 72 44 -28 -204 -123 -371 -270 -213 -102 21
641 21 102 164 225 316 114 29 393 -53 36 -23 -183 43 -146 -184 -170 -112 -56 -38 -236 37 -40 -143 -93 43 103 56
667 56 27 -71 -23 175 -107 61 -74 23 -12 -202 -450 -47 -46 -218 -198 69 -17 38 -57 361 7 -19 29 121 19
692 19 -123 265 -184 -418 -89 -87 36 41 -19 169 171 206 152 96 78 163 -23 2 -161 167 -16 -73 -21 -37 29 18 -96
719 -96 52 -58 91 48 202 65 150 210 31 -132 -33 124 -78 -72 -32 40 5 -31 254 147 -108 169 177 59 171
744 171 -28 328 -49 -90 -6 152 18 -377 94 -35 103 -106 -52 -34 26 167 16 -30 22 -138 -42 -59 -113 14
768 14 -109 -219 -43 37 81 -103 -125 117 120 -73 187 -201 54 -105 -23 -9 8 -149 -55 -12 144 -168 52 116
792 116 97 190 62 227 251 120 60 55 -54 5 -57 -157 -66 31 -1 -185 -30 148 -27 8 -37 -185 1 149 100
817A00k0k40KJ24Ok67J46J24r4K57K2j86n7N8J13q2r7o6K44l80O8J18j64L05j05
842g1K92k63%J74q8l5J27l28K31p8J2j73K88P4k36N4j38J84K2JR6l31L17Q8l84
867a65J08J58j10j90K59p6Q3P6j89Jj16K54l4j75J2J32l9J51l93N04n0l30K51
890A22o2j02K26k6m20m0L77m2Oj51k1K52L4n5q0J11o8p2L51k62j71j36K21O6k17
915a59L81k9j47KJ0J5l5J01J35l84PNJ61j32J11j18j37J80J34o1o1K1J11%j13
940bQ8k62N6K31j25r5J79R0p5j62J41p2K25k99n6J35r2K33r7k2k06J06kJ68kn4
966B9k66L44k05N8J64j82J53j85J0k9K7K02j27K39p1j75J81j76N5k48K23J9k14
989a74K29Q4k48J30J02j53k00L22k72K08j87K06j09m4J00j01OK52l62M2K59n9
$$ plain form
817 100 80 -160 -158 -34 -28 -295 -149 -25 -119 138 160 -26 -83 -25 88 6 -91 -157 87 -293 -225 -107 -271 34 -71
842 -71 221 -42 -42 132 44 9 136 -192 39 -39 -27 -200 88 162 -74 -20 -158 26 48 49 145 -186 131 219 -165
867 -165 -57 101 -9 -199 60 -16 67 143 -46 -45 -161 93 59 -116 -104 28 -11 140 -253 251 201 -129 122
890 122 60 -42 184 158 -262 -302 75 33 39 -112 -133 119 153 98 18 129 61 -11 340 78 -93 -229 -8 58 -159
915 -159 222 193 46 48 58 73 38 139 274 -110 -103 -98 63 -69 42 -76 -213 -33 101 40 -21 0 111 111 -2
940 -2 86 -176 -120 111 -14 -109 70 160 85 -77 64 -8 217 -82 -138 -3 -95 138 41 19 -187 -81 -83 85 83 29
966 29 -237 107 -98 -40 124 -58 95 -90 -80 -109 -82 120 -7 232 161 -14 167 -9 46 -202 21 40 -174
989 -174 55 139 -109 21 123 -30 -230 92 -180 28 -159 47 -62 -106 -6 -107 -101 151 -211 -169 90 31
1011C1O0j98p4K94j62kq2K13r8j10L58m13P0J14j05J22K78r9j74j29k10L01L2
1034A7L6n8P1Jp3K26k71l5J40P0j42O8j97j57L43j27K27N1k27J07K5j7qO7o4n3
1060B0j00OMj4M4K38k28n0jJ10j1J08l10J31M7K9l22K56o3pL23l30K00m1R9n5
1086H3n6M4N9j61J12q5K19k56j4l4K42o9j09j22K83j55j16O1J55L5j80K46j18
1109F4l11L05R1Q0j70J51j44P9Qj57o3q0K36J2j29J52k8j05P5j73K45k16r3R1
1133h0k1J09k5p2K67k47Q5n8O0J59j69J87j21j94L3P8o0k24L69k64K9R5R9j31
1157i6o7K79j7r5J39q1kJ09p7j86P1J40l09J39J41j32J02k7rK88k96j39L4L40
1181B49l38J54L0p2QP2j1K6J5l2l23P5j38K52L3P3j20m4l8J70m4k22K73J40k26
$$ plain form
1011 31 91 -107 -181 113 -49 -51 -133 80 -18 -128 230 -183 -113 1 -104 18 296 197 23 -106 -316 -15 17
1034 17 53 -5 66 67 -6 220 -51 -86 54 124 -18 50 -147 -304 39 -88 139 190 -37 70 95 78 70 137 73 20
1060 20 -80 -74 -70 -84 -40 198 -30 -80 -81 29 18 126 -184 -53 -6 23 -299 -43 -106 -113 210 -120 80 39 138 83
1086 83 27 71 130 -31 81 -4 215 -41 -55 -89 153 84 -25 -147 136 -19 -135 -74 81 116 -64 182 64
1109 64 -247 58 149 229 59 210 66 145 153 -4 -67 -147 89 101 -28 124 96 -9 66 -107 138 -78 -171 -80
1133 -80 -101 8 -17 -89 178 -69 16 -42 18 177 8 195 74 -120 -87 -9 -69 -293 76 -188 -159 -64 35 -96
1157 -96 -163 116 99 4 143 62 60 169 92 -94 -23 117 -192 -53 88 -44 58 31 22 310 14 -125 -91 249
1181 249 -89 65 95 23 31 103 92 118 133 101 -222 -147 -285 -33 0 73 -47 -91 -129 41 -3 -225 48 188 -38
1206c8r8K76J9q9j19J10%k7j02M9O8j7J55j11N1j64j10L70j79k29q3O02n24k1
1230b11R0L02k87P5M7L4L7j41N8R0j26j36J10J37m6j87K42p2o6j84N3J81O5o1
1254DoJ39k31K21j50j70K40q1M5o4l4j4J24j6Jj32J82R8k12q1J90Q4m56L01l97
1279d15M36J1r6K54k88J06L1L8l3j61P2j16P5J93l7m3J66l39J12Q4o4J09j5j93
1303a13K25N6j47M2kpP4p1q7j31lK87n1r6j00J06M8J78l1j78n8L29k40n2j43J59
1329fo5l4j47J48J33K6J59k48J00j15o1J90P4k26O7J8k25L39j51J28o7M3k07J4
1353a13N4nJ70j96J55K8j89Q9M7k5Q2o6j05R7O8k5l21K54J16O4J85k75K2n0j21
1378f0K09j54l2j2J41q7j0m3j31K74j84K69m9j12k30K86q4j02rQ3P6j64K35j60
$$ plain form
1206 -38 -136 140 159 70 -49 61 61 34 -68 -19 49 32 187 76 127 -37 -147 223 44 -185 -268 334 -190 -211
1230 -211 -121 181 -106 -31 16 50 87 -54 4 94 -32 -168 -58 79 33 -154 88 16 -50 -234 -181 0 65 4
1254 4 -2 137 -94 127 -23 -193 47 -34 11 -53 -87 -101 23 7 8 -124 58 156 -56 -137 53 137 -319 -18 -415
1279 -415 21 32 -64 190 -98 8 39 77 44 -117 -45 -161 -86 107 70 27 193 -146 -34 50 -14 95 80 -113
1303 -113 112 168 21 63 61 54 128 57 -30 -161 -164 123 72 -24 -124 -18 30 208 177 -1 -59 270 30 -22 -165 -6
1329 -6 -71 -105 -252 -104 29 55 214 -34 66 -49 -110 80 154 -72 -5 13 -212 127 -24 104 37 80 -127 -113
1353 -113 -59 -64 106 -90 65 93 -96 -7 40 15 97 31 -74 23 91 66 -255 -1 115 179 364 89 111 61 -60
1378 -60 149 -5 -37 -49 92 5 -5 -48 -179 95 -89 180 131 19 -211 75 -9 -111 -120 -37 39 -125 110 -50
1402e0J25r0J3J55k21J31j17O6J61j92j75RK19j3j05J75l29L30j3p9j4p0N8M4
1426A8j6l3L9o1N2l7l6L0J73j16P9j04K4L4J0r0Q1j85J04j6l6J69p8N4j58J68
1452F9L3k82M12j22j81Q0K4j24K7M5m7K35j55q3Q1J8l5K8J97k91j6O9J43k32J64
1477E7L3j02j59J85K4N8j00j43Q2K54j32j37K23j8k02p2K93j56p2n5K11nj71%
1501a04M1K4j12L06k62o6N6N1J06j17N9M3O2M2k42jL90k65n1j92K08P2j96K6J21
1526ak18k9L08j79L2j85L58P8Q7m19N4P5j54J81J4l4p8l7K68k85J66J6J19k51
1550a14j51K74Q0M1l19N8J76N6k03J23K9q9O4j8q4j46L41j15J06j55K33l0Q0j09
1574A28K0m3k25K08m9J38j98OP4K4j93R9n4K19j51k0J36j35j6m1oL06k72O9k93
$$ plain form
1402 -50 75 -15 -2 153 -68 63 -54 12 173 -19 -194 -185 34 21 -84 91 -238 92 79 0 -14 -84 -26 18
1426 18 2 -31 8 -53 -1 -38 -74 -44 129 13 92 -12 12 46 56 -34 47 -138 -34 -50 -86 83 5 59 -99 69
1452 69 102 -180 232 110 -71 9 33 -91 -64 -19 -66 169 14 -69 12 30 -5 23 220 -71 -87 -18 125 -107 57
1477 57 90 -12 -171 14 38 96 -4 -147 -65 189 57 -80 143 125 -77 -149 144 -12 -84 -139 72 67 -104 -104
1501 -104 -63 -39 -151 155 -107 -173 -117 -66 40 -77 -18 25 87 129 -113 -114 276 11 -40 -232 -24 48 -148 -122 -1
1526 -1 -219 -248 60 -119 -87 -272 86 164 251 -168 -114 -39 -193 -12 2 -32 -110 -147 121 -164 2 18 137 -114
1550 -114 -265 9 89 130 -189 -131 45 101 -102 21 50 -39 25 7 -77 -223 118 3 109 -46 187 157 237 128
1574 128 148 105 -120 88 39 177 -21 -15 59 83 -110 -11 -65 154 3 -17 119 -16 -32 -73 -79 227 -45 24 -269
1599b69M41j38j00k9J11Q6O7j21N0k96J90O2k74K97j82R8j25J15j71K92k99M4
1621a51P7K78k61J99m8p7k45OK44J0pR5o6L42l65r7j12N2lL33n2l38K6J64K24
1646B28j96r7K18k35P4K3k17K97k20K20j6q0J96k05J17j26N8k56K74j43J21j6
1668A9O5j27j3J05r9k1J09j6J69l7O4k51R4j63J49q6P2r1J14l03L51j10j27Q1
1692e2J71k5M8j66j47K48j33M5J05Kk32J77l6J11l40J45J98j45Q4r9j02J37J5
1715IP2k54J67M6M9m9j68J45n0O1L0q9Q8n8J86k31jJ13K3p0o4N3Jj91L11j03o1
1742c5K31k19J77M8K8m18J73N4r0J91j77q1k3J19OK9j63P2N6l3K26j07j50J76
1766I0o7M8m5j24K90j57j09N1o2m7J95L3m4J4r4JJ77Oj10j17K48k64J49r4J70
$$ plain form
1599 -269 172 34 -66 -95 16 102 169 48 98 -198 -8 54 -220 77 -105 -7 -132 -17 -188 104 -195 -151
1621 -151 -74 204 -57 142 94 17 -228 -222 22 32 25 120 54 396 31 -66 -178 -126 -129 204 152 -186 -160 4 228
1646 228 32 -65 153 -82 -8 15 -202 95 -125 95 79 -1 195 -10 107 -19 39 -217 57 -86 35 19
1668 19 84 -43 -56 49 -50 -71 38 22 191 154 218 -33 61 -102 47 -39 33 -58 56 -247 104 -6 -133 -52
1692 -52 119 94 142 -24 -171 77 -56 -11 94 96 -136 41 5 116 -224 -79 119 -26 58 -41 -143 -6 9
1715 9 81 -173 -6 40 89 40 -128 17 -33 28 58 -31 57 -1 185 -46 -47 66 89 19 -45 8 9 -182 129 26 -35
1742 -35 196 -23 154 202 230 -188 -15 39 -51 140 -37 -118 -141 -22 -16 13 -150 -78 -22 -55 171 64 -86 90
1766 90 23 71 26 -98 192 35 -74 -23 -85 -132 63 96 52 66 -28 -27 150 156 46 -71 177 -87 62 -32 138
1791A38j18K04j91k62L32q9J3k2K23k75K97l18J51J6R1j82j50J94J37l31J37l
1813hL38l33J9L6M0j38Q9k1l0l1J47mm9j51l0J88j21j06L23j49j15L2Q3k35L20
1838I4o2O2J44j22j30q6N8KJ36Q8l45L15j46j08J96J17j49m1k06K04O5j22j30
1861a66P3Q7l8R5q2k15K40O2j08J53nk35L34L4n1p7j3q8L5o1M0k11L60j14k19
1886a70K2O7M6J98j07m9J43j16J92j79Oj48N0o5R7Q7o6k43K78P8k14J94p6R8j59
1911c6K02k68K18k59K07k0J4k5M8K11k28K65l81j43L12Q9j26L4n4J0k29K0NL35
1935B01l60K45J18q4j59R9n9J4j99K89j14l4m5K42j19k15L6r2P9J78q5R6j44K8
1959h4lK34k88Q7j55K25j9j04K25j45p0O1J61l25K90j22M7n8J11k34L26k11M3
$$ plain form
1791 138 20 224 33 -229 103 14 27 5 228 -47 250 -68 83 99 190 8 -142 52 189 -142 -5 -8
1813 -8 330 -3 16 52 92 -46 43 22 -8 -39 108 104 55 -96 -126 62 -59 -165 158 9 -106 -74 9 -226 94
1838 94 32 94 238 116 -14 -100 -42 -40 96 184 -161 154 8 -100 96 213 64 23 -183 21 86 -36 -166
1861 -166 -93 -6 -44 51 -31 -246 -6 56 -52 101 96 -139 195 229 178 101 88 0 35 -26 14 -197 163 49 -170
1886 -170 -148 -81 -35 163 56 7 150 34 226 47 53 -95 -45 -110 -13 74 8 -235 43 121 -93 101 25 123 -36
1911 -36 166 -102 116 -143 64 44 58 33 81 292 64 329 -52 -195 117 206 80 114 60 70 -159 -139 -134 201
1935 201 -159 86 204 120 -39 60 1 15 -184 105 -9 -43 -88 154 35 -180 -144 -236 -157 21 -64 32 -112 -84
1959 -84 -87 147 -141 -54 -209 16 -3 -107 118 -27 -97 -36 125 -200 90 -32 15 -43 68 -166 160 -51 -8
1982hJ19N1n8Q9j35k3q2K3J20K7n0j6J69j53p3J4O1K3l22J70J36k97L97r4j13
2007b5l8J59n4j14m2K11J4k1j35K61m2k27q4J61pm7oq4L4L11J9r9j57j46K65N7
2033A64k88K9lK00N7j50J59l54J82M6j47k4K1j00K99N3l8L9M4k94J05p3lj32P1
2058a37J12J13J1j14J14p9RoP0K4J25j65P2k6q4q8L01l68J61l2m9R2j2PJ03l43
2084a89K41q5J02j23RN7m2J13J58k71Q9j05j70J72mJ29m7M9k63L54l32L3J96o9
2108Bm1J50k07K09K5k26P9j10R7L8K70l37N4o4K19K2k34j21L08j65J6lJ30j66
2132e5J51p9P3j35m6J77l8J25j04q0O9o5m5J23J45k44K7J08k51O6R9k1j55J63
2156HO7j47K76j47n2J49k54K93ll50R9r4K34j02K8rp6P4K4Q6k32n5J74M9KJ37
$$ plain form
1982 -8 111 162 104 193 58 35 -47 -24 96 123 73 57 226 73 0 14 75 98 -224 -54 82 -215 182 88 -25
2007 -25 -63 96 42 -72 -114 97 111 90 -45 216 174 -53 -137 24 17 -30 -36 -120 -86 225 244 145 -12 -158 107 164
2033 164 -124 -95 -98 102 159 9 168 -186 -4 42 -105 -129 -108 -208 91 144 106 145 189 -105 0 -73 -76 -208 -137
2058 -137 -25 88 99 -15 99 20 29 23 93 117 242 77 149 123 39 -49 252 -116 45 13 -36 56 44 51 154 -189
2084 -189 52 -33 69 -54 -45 12 -30 83 241 -30 59 -46 -216 -44 -48 81 34 83 -180 174 -158 -125 71 2
2108 2 -39 111 -96 113 138 -88 -9 -119 -22 16 286 -51 3 -61 158 180 -54 -175 133 -32 -16 -19 111 -55
2132 -55 96 17 90 -45 -91 86 48 173 69 -11 58 -7 -52 71 216 -28 -1 107 -144 -78 21 0 -155 8
2156 8 75 -72 204 57 5 154 -100 193 190 -160 -61 -155 79 -23 5 -4 -80 -6 18 104 -128 -183 -9 40 42 179
2182A79l8k42K99k60O8j88K91j75RJ21j11q9J52j1j5J58k75K09j81K47j17p4o9
2205a12j7J96k37J36P4M9l2l2p7J60l6j13K21o5k33K99j15q8L3r4n7J55q5K70
2229B00j80N8j38J2J44j93K48k01l5j16KK50O9k33NK30j14j14J47r8J3q2K94k17
2253d9K46O2j87k77M4PJ41j99K65j02P8j17J09j57K11M1J91m14L6Q9J30k0j55
2276b7R0j39MOr1J65j90J6J87j7j26q0R5J6J14l16J23N9K76k67J9m6J10j06J70
2301D5j60N6j17K68k67J80o5M3k44J97o6K75k10o6J60Nj32J1k2Q5j08K06r3L9
2325B0q6K9K49k75K4p0P0r9J52J72k93J21mp0j7J70j9j36k33L28j53J48J68j86
2349A0J88j30j9j75J77K10k23Q2q2k89L77L2r5j40J13K36j55j26J4N2J81j84R1
$$ plain form
2182 179 141 -101 198 -62 6 -182 109 -66 -57 64 -47 -136 16 5 -10 148 -127 82 -99 148 31 -43 -112
2205 -112 -129 67 -170 -34 40 89 57 25 -52 108 72 -41 180 115 -118 181 66 -22 11 -83 -140 15 -70 200
2229 200 20 78 -60 -48 96 -97 151 -50 -85 -201 -199 51 120 -113 -108 122 8 -106 41 -57 -44 -126 168 -49
2253 -49 197 259 72 -205 -161 -154 -13 -212 53 -49 29 -88 21 -136 75 116 307 -107 -71 18 148 128 -27
2276 -27 63 -76 -72 -66 -157 8 -182 -166 21 4 -122 -202 -107 -91 23 -293 -170 -111 165 -102 -83 -129 -19 -125 45
2301 45 -115 -59 -176 92 -175 5 -60 -17 -261 -64 -130 145 -65 -131 29 34 -98 -87 -109 -24 -132 74 -19 20
2325 20 -66 -37 212 -63 -39 -109 -39 -138 14 186 -107 14 10 -60 -77 93 74 -62 -295 33 -120 28 196 10
2349 10 198 68 49 -126 51 261 38 120 38 -251 126 158 63 -77 36 272 117 -9 5 57 238 54 145
2372A45j77K5O5q1J82k02q1oK00M2j04pJJ4o3J31p9J61o4k35J11j95K00J84j16
2397E1j8l4J34k55K51j70Q1K24n06M48j67O0Kqp6p0kJ80j54J42j8j94P9K1j74
2422a73j08L40n7K50k13j47oN6j32K18P0j18q1MJ83k76J74j65K65Mj9ll1j0J62
2447A87k44m7K28J34l20p2J81Q6j90J88j29J2R1j28J65o3k60K2J21N3K42k71K9
2470A5l0q9J35J40k3j55J34j45K7o0K9Kj33K56q7r6L25j96k02J94j91N7j49L85
2494A43j01q6m7J73Q0k75K39j56K2j66kJ88k1j4M4P4k57J57k6J29N0l9j63R5j14
2519g3L6O9o3Q5q4o2J81p8j51J30j33K35l1Q9j48k5N8r4M7j08JR3j27JM25l05
2545c2m0M9M6qR3q0r8j21J96j30J17R6k8l80L40M8o1J46k00J32j26l3l0Q5l5j47
$$ plain form
2372 145 -32 -7 58 -23 159 -43 -124 -130 70 112 8 1 2 16 -47 84 5 166 102 -133 -22 -217 -17 167 51
2397 51 33 -1 133 -122 129 -41 40 264 -242 206 39 99 101 93 17 -53 -55 125 -29 113 95 -99 -20 1 -173
2422 -173 -281 59 2 252 39 -108 -114 -58 -190 28 98 -20 -101 -97 86 -190 -16 -181 84 88 69 66 35 25 187
2447 187 -57 -104 124 258 -62 -134 47 133 -57 131 2 14 105 -23 142 79 -181 -159 -38 15 257 -14 15
2470 15 -15 -104 31 171 148 -7 127 -18 9 -51 -22 -20 -153 103 16 -80 245 49 -153 41 -150 -93 -242 143
2494 143 42 -44 -91 82 162 -113 126 -30 -8 -174 -176 12 -9 -23 21 95 -162 -5 -31 98 148 109 -54 41 -73
2519 -73 -37 32 -31 54 -30 -92 89 11 -140 -10 -143 92 61 150 2 -23 35 -59 -12 -120 -119 -26 -153 -152 273 -32
2545 -32 -72 -23 23 15 108 28 -70 -191 5 -125 -8 88 60 -320 20 68 7 153 -47 85 -41 -74 -104 -19 -54 -201
2571b01K20j22K39k34N6M8O3N7k09K9L21k21J7K5J3j44J10j69J15J00q8J50j51
2594B4k1oM2j70K44j07m3K91k1J6j97N5j01k9n6j14J42l1J7J55k15Q2M9j38J93
2619F1L3l56K26L9K37l2k71O1K50k92Q7j17J26Q7k44K4K51q6k89K15n7p0P9J52
2643A14J28l00J14r2j7J20J63r1k89J94L7j99J73M3j71J47j10N6j69k22N24m3
2665A10j32J49n7K4K0j46j3j2k7JP5j66J58j5P5q2M5J06j96J22j1j50J02J10K0
2690A10j36J26j00J9r2J10PQ7j09j29J3L5P5j1O4N1k05K5QO4P8l5k53L63j94J09
2716H0N4k39N7O2J03k62K66j72P3Q7l2m8n8J04Mj21J11RN8j58J06r8k2ml6L7l1
2743g0R6J26q0k31J15J9K36j44j13l9P0R2j47r4k6N2K57n7K16k46j11K53j75J5
$$ plain form
2571 -201 19 -103 136 -98 -42 6 69 126 -83 -54 267 46 63 88 101 -43 67 -102 13 113 25 175 24
2594 24 3 -3 39 -131 113 6 -37 254 233 249 52 107 6 -23 -79 -193 -51 -82 -65 90 -125 -43 6 -132 61
2619 61 94 -262 -36 3 240 208 -63 -2 248 -44 43 -74 52 139 -105 -81 170 84 -205 10 -47 -117 -38 114
2643 114 242 -58 56 -36 -53 67 230 139 -150 44 81 -118 55 98 -73 74 -36 20 -149 -371 153 110
2665 110 -22 127 70 94 114 -32 -45 -57 -84 -83 -8 -174 -16 -31 44 -38 7 113 -83 39 28 -122 -20 90 110
2690 110 -26 100 0 19 -73 37 44 131 22 -107 -94 -59 16 5 69 120 -85 -60 -52 12 90 55 -198 165 -29 80
2716 80 134 -105 -48 14 117 -145 121 -51 22 109 77 29 -29 75 79 -42 69 78 136 -22 84 -14 -36 -40 -76 -39 -70
2743 -70 26 152 72 -159 -44 -25 211 67 -46 -85 -15 77 -70 -164 -190 -138 119 62 278 32 -79 174 -1 14
2767A4l8j72J04K20j88j14K44j26K91j21j05n4M0J3Q0qk01L4J11Q7k07R7J47k68
2791a20K79j66J31q4JR6k27L85m54L31q7o2q9N1J4K2j48K39Q8k77k4K00l24J05
2815a20k6K70k91K6J54J6J7m9J66j13K12k36j64R3Q5o9J02L3J64l13R4j65J21
2838Gj4%J27j47j27J89N1k32J68M1J44n5j92q1J06M3j27K05j00j18K87j57Q0o3
2862C5j64J12k61J02L6K7J57L1l1j80K5M6J51k22oK72j29k51L93j65nk5K76j12
2886A12j84J00qr3J94J6j22L0L2j16j54L54j22j70J54n2J42M1j69n8K21J17j84
2909H1j37J42j82J36N0k4n6l8r1j96L98l4J02j66q6k2J42j41jK24j15m9J24R7
2933A58l38K60m7o5Q7p8J04m4j66K19j38P9R1p2L2k61K51k5Q2j04O7k3n0j33J12
$$ plain form
2767 14 -24 -196 -92 128 -60 -174 70 -56 235 114 9 -45 -5 8 88 80 -121 -87 24 111 -96 1 148 -120
2791 -120 159 -7 124 40 41 137 -90 295 -159 172 85 23 -66 -15 -1 21 -127 112 200 -77 -101 99 -225 -120
2815 -120 -146 124 -167 -141 13 29 46 -3 163 50 262 26 -138 -45 40 -29 73 106 270 -43 51 -114 7
2838 7 -7 -7 120 -27 -154 35 86 -146 22 63 207 152 -40 -121 -15 28 -99 106 6 -112 175 18 98 35
2862 35 -129 -17 -278 -176 -140 -113 44 75 44 -136 -111 -65 86 -136 -142 130 1 -250 143 -22 -27 -52 224 112
2886 112 -72 28 20 -73 121 137 15 45 77 -39 -193 161 39 -131 23 -29 113 154 -15 -73 148 265 81
2909 81 -56 86 -96 40 90 66 10 -28 -119 -315 83 49 151 -15 -101 -123 19 -122 -123 101 -14 -63 61 158
2933 158 -180 80 33 -32 55 -23 81 37 -129 90 -48 31 122 50 82 -179 72 47 129 25 92 69 19 -114 -2
2958bn2j50J22K42k15P4q0J43M5o8j77J79j75J20j1J48k00l3K24k05L29k94k9
2981f5K55k88J46m0P7l25K52q7M5m0j17K39J07j17j13K14p7q1j42J03M1Q0j12
3004d5o1P3Q1kj39l9K2K84o7k46R6J45j15j77N8j0J72j92J37j14J00Ro2o4J92
3029C6r9J3J88j39k12j6J92j64K54O9r6j35J66l6J17J05k49n0K08j64j0l7j51
3052b10R3rJ00j8k1J45R0k06J17J79l12M4L2j40Q1J50lj82Q5J86k90J40l4MK5
3077D6r1j19L07j35J38r7j41J09P0j12K0j8n8J67K56l10j20R7q0M5m0j00Q2J46
3101F2k49L21j43L3m6K05j73J50j48J44J28l49pJ09J71k86p0K02j54J30j28j2
3123a10J23j29j10M94m45L0L04r1n6P6j96l3K16q1J12j23k18K83k04M09k36Q4
$$ plain form
2958 -2 -54 -204 -82 160 -55 19 -61 82 127 59 -118 61 -114 6 -5 143 -57 -90 134 -71 258 -36 -65
2981 -65 190 -98 48 8 85 -240 12 -75 -30 -70 -187 52 159 42 -71 143 66 -15 -157 -54 -13 67 -45
3004 -45 -106 -33 48 46 -93 -132 -110 174 107 -139 -43 102 -13 -190 -132 -142 30 -162 -25 -139 -39 -30 -92 -156 36
3029 36 -63 -50 138 -1 -213 -229 -37 -201 53 122 26 -109 57 21 138 243 -6 -56 152 -12 -22 -59 -210
3052 -210 -117 -126 -26 -44 -65 80 170 -36 81 260 -52 -8 24 -116 -35 115 112 -70 15 201 -89 51 17 21 46
3077 46 -45 -164 143 8 146 49 -92 17 87 -25 -5 -23 -81 86 342 32 -88 9 -71 -26 -66 -166 -84 62
3101 62 -187 134 -9 24 -22 183 10 160 12 156 284 -65 -72 37 208 -78 -148 54 -100 30 -98 -110
3123 -110 13 -116 -226 268 -177 -147 157 66 10 86 -110 -143 73 -8 104 -19 -237 46 -158 251 15 99
3145I9j49J72r9L8j03m2J15J11r9k32L00k48K46p8Jj20K14j28O6O6p4j04r2K67
3169A27N3l57J27J4J42j00j9l9J68k03J70m0j26J01j8l3o9N9K3M3j5Q6j94K6J07
3194C3k6L14l88R5o7J6k30J68j31J33J16L2Lpo5j4l3J78k16K03j0j04M2oj73K53
3220A16k38J73k06J00N7O1k41O9J94r4P6PN1j93K3J41q3J2L2J04q9k4%N4k18J01
3246a5J83r9l5J56l33K28j79J2J88J5k86L17r1k25J61n4j95L05k25L46j05k50
3268a81K95K3p8n9J06j46J98k70L70k67r6J23J13j00k32L73j96M2M7mj51K16j29
3291ck07K21j91R6J60J02l52L27k62l1R4J06p0N5j53MK11r6r2L79j66n9j17Q0
3315C6J2l85M23m4N3k0mJ44m86L95k26k3K10l6p0j37j42K21K3J95mq3J08k15j36
$$ plain form
3145 99 -50 122 23 61 -42 -84 31 142 43 -189 111 -137 109 31 32 -88 126 -2 64 130 56 -48 -140 127
3169 127 180 -177 -50 -36 106 6 -13 -52 116 -87 83 43 -83 18 0 -33 -102 -43 -20 23 8 94 -100 -74 33
3194 33 7 321 -67 28 -39 -23 -253 -85 -216 -83 33 65 68 61 -4 -18 -51 127 -89 114 104 0 42 36 -137 116
3220 116 -122 51 -155 -55 2 63 -178 -109 85 -9 67 74 125 -68 -45 96 13 25 57 161 72 48 48 102 -116 -15
3246 -15 168 69 34 190 -143 85 -94 -82 106 121 -165 152 61 -164 -3 -57 -252 53 -172 174 69 -181
3268 -181 114 137 59 0 106 -40 158 -112 258 -9 -105 18 131 31 -201 172 -24 18 65 61 -90 126 -3
3291 -3 -210 11 -180 -84 76 178 -174 153 -109 -140 -46 60 -10 45 -108 -104 107 11 -81 298 132 73 -44 36
3315 36 48 -337 86 42 95 75 71 215 -271 124 -102 -125 85 49 -21 -158 -300 -79 -56 139 135 52 160 -55 -191
3340a91J3J0J83J14j93K4m3J42N5j7K2j72l1J73k92K97Q1l39m4K37J5j05K25k39
3364g5J74j71K66j79j69J58j2N7j56k6O3r7K63j22K24l30L6Q2k0R0l0m0L5o6p2
3389a17L6J50j01K01k05m2K85j41m4k12L58j69K0j13j07J68M8j3N8j10R9k70Q6
3412a35P2j6N8O7r8k07J69j1Q6n4O3j65K84l29M71n4j04j5K2j08J39l3j60O7k3
3437a4J32k46J31kN6K2Q2k0k35J15L0O0n0J62k31K11j41J72q2J6q1r8j41L4L5
3462h3K0Q0J3o6m9J55Q3k7j21M8j35K50r7N9K3j74k51L93k48K27J2m6j1j04R0
3487D1qN7j23j71J11M38k15k02QJ09j11j23J25q9l3R9J34J19l02J64j17Q3m1J53
3511A06J9r0K27q3j03j12j2L13l43L2n0Q7l6j7n8j56M99k94J4Q4Qo4K4l4l26M29
$$ plain form
3340 -191 -178 -168 15 129 -64 -40 -83 59 114 97 119 -53 -84 89 -203 94 175 -164 -208 29 44 -61 164 -75
3364 -75 99 -72 194 15 -154 4 -8 49 -107 -133 -70 -167 96 -26 198 -132 -96 -14 -34 56 26 -14 21 -45 -117
3389 -117 -81 69 -32 169 -36 -78 207 66 22 -190 168 -1 19 -94 -201 -33 15 2 60 -50 49 -221 -135
3412 -135 -63 -79 -21 46 -52 -259 -90 -101 -15 -69 -6 -171 113 -216 255 201 97 82 104 -4 135 102 -58 9 -14
3437 -14 118 -128 3 1 57 79 161 141 -94 21 51 111 61 223 -8 203 62 234 152 168 87 -11 -152 -118 -83
3462 -83 -63 17 30 -36 -85 70 153 126 5 53 -82 168 71 130 153 -21 -272 121 -127 100 112 66 55 -49 41
3487 41 33 90 -33 -204 -93 345 130 -72 -64 45 -66 -189 -64 -153 -186 -87 47 166 -136 28 -89 -6 -47 106
3511 106 125 35 262 179 76 -36 -48 265 -78 -46 -96 -9 -45 -62 -120 -276 223 -71 -57 27 35 -29 -5 -39 -365 64
3537F4r9pp4J62N7l78J78R1q4%L9K69k56pJ46P5n2k6j08N6j73J44r9J88m2p1j11
3564a18N4L20l24Q5N5j22l6m0K06n6k1j21K46j11J97j61k1j12J80L6j45P0q3K46
3588B24l86J80k5J41j15j6J78k57j89K65P2q2j62K57k60K72j11j58K19m0j83J22
3610e4l4R1J04j98J36m6J8j55K36k74J05k1Q2r3K05j19l12L85P7k30O7j09J85
3633D6M0KRJp5P5j37j53K06J31j73j44L08j9J35j87j11jq8K8M2J33q0j10K22k79
3659a79J42N6J0pj4p6k2J22K4k04J86K3J3K1r4J2k38K48K37m01J42k16M23j61
3683D7j9l1K25q8j14J63j35m8N6Nk08M6M5J68j87r6L99k82l3P8k28L56j46p4K53
3708A52j56mJ83k29N4K65k62q6n8J17J25k0j44J47q7j7J09p0L89l04L2p1j89J80
$$ plain form
3537 64 -35 -42 -116 46 103 -275 -97 -6 -90 -90 -51 218 -38 -45 101 176 124 98 -10 46 -127 17 -82 106 64 -7 -118
3564 -118 -64 256 -68 17 72 -50 -86 -126 80 24 3 -118 128 17 214 53 32 -80 100 136 -9 61 -22 224
3588 224 -162 18 -7 134 19 3 181 -76 -265 0 72 -10 -172 85 -175 97 -14 -172 47 7 -176 -54
3610 -54 -88 3 107 -91 45 -1 17 -138 98 -176 -71 -92 -10 -103 102 -17 -329 56 133 -97 -30 -139 46
3633 46 86 88 97 98 23 98 -39 -192 14 145 -28 -172 136 117 252 65 -46 -47 -135 -107 -65 68 -12 -122 100 -179
3659 -179 -37 19 29 22 8 -68 -90 32 56 -148 38 61 74 95 1 13 -225 23 260 -141 1 -215 208 47
3683 47 28 -3 222 134 20 183 48 0 56 61 -147 -101 -56 112 -75 -171 228 -54 -87 -9 -237 119 -27 -101 152
3708 152 -4 -8 175 -54 0 265 3 -83 -141 -24 101 81 -63 84 -3 -20 89 19 408 104 136 65 -124 56
3732E6j46j07K90j55J0J77R5j47j1O0j64K15J09k95Q8j98J05K4k53J96p6J83o4
3755hl7J24j11J68l02M2K83k65o2K10J18l54J50K7k3p9K0J5ro1M7K79N6m64L08
3780G2J34k46K05n13K95k05L87q9j55o7J93P9M9M5k49K14j09L09n68K27Q7L6p2
3803E9n6j49L35j93k24Q5j7J40r0k0J71J0q9J44n9k67J78J56K6j39q0o8K7J11
3827im2j71M5K10J1j7J34k07LK05j61j13L83k93k79R9J60r2L56j74k13Q9J64j54
3851f6m5K40k5O4k79J06M3Q3m9j18J41k2L0j77KJ56l17L22k68J29j02M39k88k15
3875b16J66r0J53k2L5o1Q3M3J56k32l6J39l6p3q5N9k8rj16L21k12K03j83K31j58
3900C2K7j01k06M68l49o5K94o6Kjj45j26K46k28J73k1O5L4J5M6j90K39k2j88J89
$$ plain form
3732 56 -90 -197 93 -62 -52 125 220 73 62 122 -42 173 282 -13 75 -123 -18 6 -247 -51 -127 56 -8
3755 -8 -45 79 -32 136 -166 -124 159 -106 -168 42 160 -194 -44 -17 -40 -119 -99 -84 -93 -154 -107 172 228 -236 72
3780 72 206 -40 165 -348 -53 -258 129 40 -115 -182 11 90 139 184 -65 149 40 349 -219 8 95 131 59
3803 59 3 -146 189 -4 -228 -143 -160 -20 -110 -130 41 51 -38 106 47 -220 -42 114 140 1 -79 -147 -120 -9
3827 -9 -51 -222 -177 33 44 27 161 -46 -43 162 1 -112 271 -22 -301 -202 -42 -134 222 48 -165 -76 88 -66
3851 -66 -111 129 104 168 -111 -5 38 121 72 -46 95 73 103 -74 -72 84 -233 89 -179 -50 -152 287 -1 -216
3875 -216 -50 -140 13 -9 26 -35 48 91 247 15 -21 118 82 9 -76 -17 -45 -54 -170 151 -61 142 -41 190 32
3900 32 59 -42 -248 220 -129 -194 100 34 36 35 -110 -236 10 -218 -45 -66 -1 33 48 94 -96 143 121 -67 122
3925A22m8j70P3r6J38J2R9k2n9k6j17K11j8j99P9J32j27j35J69j70J15R7M6j74
3949f8J1o7l8J19l5J2K30k48J5K8k4k3J73k39L01R9l78OP4J22j43o1K55k2j4n6
3975B9l2q3J39o5L1%J94l36K36j16OJ2q6Q4j5m9o2n9K16J29j01j08n3K21j14J55
4001A73k53l5L2L3j1O7r4J00M5J4Rj90j1L19j36j73O3J8K46j65j56L9J10j10m1
4026a07J58l8N0j2r8J75j72j35K60j48K42j97N5O8k13R6O9j08j03K15j00j08J46
4049eJ66k50p1P9K4K56l66L8J13o0J50p2j14J12N3J16k54J55N5j04j8O9Nn3j37
4074a13%O2Q7j22M7j00K74j75J56k00L2J3j24K28k18J86j88J16q3J8J9R9M0R2
4098A46j30j74K21K0l49N21m30N7K24n2p7J62r3j6J2p8J52j27n7nO6j74K10Q9
$$ plain form
3925 122 74 -96 -23 -119 19 31 130 108 49 23 -94 117 99 -100 -21 111 -16 -151 18 -152 -37 60 106 -68
3949 -68 -57 -124 -162 -43 -78 -66 164 -84 -69 -41 -65 -88 85 -154 147 246 -132 -126 -52 70 -73 -134 121 99 85 29
3975 29 -3 -86 53 -12 19 19 213 -123 113 -3 3 15 -71 13 -2 -51 -113 -172 44 173 72 -36 -89 132 18 173
4001 173 -80 -115 -83 -50 -61 6 -88 12 57 71 80 -110 -121 198 62 -111 -48 -30 216 51 -105 -66 44 -66 -107
4026 -107 51 13 63 51 -47 128 -44 -179 81 -67 175 -22 33 101 -112 -16 53 -55 -158 57 -43 -151 -5
4049 -5 161 -89 -160 -81 -57 199 -167 -129 -16 -76 74 2 -112 0 53 169 -85 70 125 21 3 72 77 24 -113
4074 -113 -113 -51 36 -86 -39 -139 135 -40 116 -84 -52 -39 -163 65 -153 33 -155 -39 -122 -104 -85 14 54 146
4098 146 16 -158 63 83 -266 255 -175 -118 106 54 -23 139 46 30 42 -36 116 -11 -68 -73 -7 -181 29 118
4122A18n9j84J48J63o8k04K7j5L06k32q8K60j73mQ6p2j12J13r8J37Nq2L8P4L4
4147A18j44j13j76K49Q2j09qJ24o9j21J02r4K18j06N0J4j66K03j62J16n0J0r9
4170a31p7K54J2n9o2j09K08K4q2J04k2q3K1l69M19j07K53j23K04l95o0O1J47m4
4194a6J68j47J49j19R1l7j07j0q1O3j19K51j10J83l2l58Q6J47j66K01N4o8R9j0
4218A12j97J32j26J55j9n3j50K03K2K7l2j07l5O2K2j9J5j12K89j33j33J34j49
4241i2n0j9L8K22L7k71J36j64K95J3p1j48K65j27Q3k09J76k03J30p8M9J40Jj67
4265a4j66K02j54M0L09j78J18j36j4j64J42o2J44o3J91j44p6R1j57M7m3J84j4
4288H3nKk33L26j02K07l48J22j46J49p6j9J37j47P9j54K8o0J45K06l46o8J95m5
$$ plain form
4122 118 59 -125 23 186 118 -86 -59 -74 232 0 -88 172 -1 -5 81 9 -103 10 -88 49 54 -28 10 84 118
4147 118 -26 -139 -315 -66 16 -93 -101 23 -46 -167 -65 -159 59 -47 3 17 -149 54 -108 8 -42 -32 -131
4170 -131 -208 46 58 -1 -63 -172 36 60 -22 82 60 -23 -2 -371 48 -59 194 71 275 -120 -180 -119 28 -16
4194 -16 152 5 154 35 126 89 -18 -28 -109 -46 -165 86 -24 159 127 -231 -145 2 -164 37 91 23 122 112
4218 112 -85 47 -79 76 57 4 -146 57 79 106 74 -33 -68 -6 16 -3 12 -100 189 56 -77 57 -92
4241 -92 -142 -161 -123 99 136 -135 1 -163 132 145 74 -74 191 64 147 -62 114 -89 41 -37 12 152 153 -14
4265 -14 -180 22 -132 -92 217 39 157 21 7 -157 -15 -77 67 4 195 51 -25 66 -91 -44 -87 97 83
4288 83 78 80 -153 173 71 278 -70 52 -94 55 -21 -40 97 -50 29 -125 -97 -157 -12 194 -152 -220 -25 -70
4312g0k2J3l0P0J06j83K02o5O5j94pR2j90J00K08r5J05k55K74j02k49J74J57k55
4336a51J06j28Q8qQ4k58K51J05J66k03l04L23j6j55OK22j07j65J81Nn3j05j0Q4
4360d2Q4j43J9J26J02k44K04j79L56k57k9j94n4J86j7j6K5m3O9k8J21j03J58j85
4384h4N1O0j11K92l46l2J11J61k32L48k49J48p4J82m06K06j47J51j37L67m5j78
4406C6JK7Q0k89J08J18j02l8n8P2P5L0J49k50Rj12K35p6j76J63Q5Lj14n7K43l4
4432A28j00j92PM5N1Q7R0L6j44j00O7m0j81K09n1K6M7J59k05R4o6JK16k23ll8
4458h0J18k18K62p9K09k97r6L30p3k33J50K00k51r1J86K63j41l4J20k30m0J07
4480H2J52k08K35k12k61K06j7R9r8J22q3j6r2J21j19q7J58J6j14O9l1K56l52K81
$$ plain form
4312 -70 -92 -79 -109 -39 67 -116 86 21 86 -108 -115 -23 -213 -113 95 0 105 -150 124 22 -227 -53 104 -151
4336 -151 -45 -173 -85 -93 -9 -267 -16 89 255 52 -252 71 55 -100 -94 128 21 -144 37 42 -11 -116 -126 -42
4360 -42 42 -101 -82 44 146 -98 106 -73 283 26 -3 -197 -251 -65 -82 -98 -73 -116 -47 -75 46 -57 101 -84
4384 -84 -33 27 -84 208 -138 -170 -59 102 -130 218 -31 117 43 225 -181 25 -122 29 -108 259 214 36
4406 36 37 64 144 -145 -37 81 -21 -59 -117 -45 30 60 209 -41 -32 -144 91 15 -161 2 87 90 -24 -81 162 128
4432 128 28 -164 -157 -112 -61 26 116 152 8 -92 -25 -65 -246 -37 -88 -62 -15 144 -61 33 -33 -32 184 -39 -42 -80
4458 -80 38 -180 82 3 212 -85 -181 149 76 -157 -7 193 -58 -149 37 300 159 125 245 15 -25 82
4480 82 234 26 261 49 -212 -6 -23 76 -22 100 17 1 -91 30 -89 -176 -18 -2 -116 -47 -78 178 -174 107
4504A07j02J13J02k15k6j6j78J05Q9Q1q8J04J9j05J60j00J53Mk46J8J28j47N0
4527A0j97k1K93M5k63J04J23l38L08J43j51j44J98m8j01k5p6J65j8j23K32j22
4549fJ54j41L9J0j37k9j42K61o1J03K3K1k69K67M9j97K98j01j10r5J54mj41J22
4573F8o2M5k4N6j4j25j74L15k05J22J38r4j07J97j41p5M5O7m4K5n5m0r4o1K64
4598B7j44L13k73p8J59k4K43p7k78N2J37p8L1J60q4j39P6r1j24Q7q9J04J22P6
4622A08j30j5J1R1j28J01pj07N2j50L14ok22K22J2m7o7N7n0J09k2k16K8j3j54
4647b29M91j68j33M3p1K65p0J37j14j23j11R4j16K06n3j38R2M6J69m97K25L34
4669B79j78l19K27N7p8p3K25l42K8K57M8p2j32J83l4k0rk26J19K91l48J84j61
$$ plain form
4504 107 5 118 220 5 -21 -37 -215 -110 -21 60 -28 76 95 -10 150 50 203 207 -39 -21 107 -40 10
4527 10 -187 -208 85 130 -133 -29 94 -244 64 207 56 -88 110 62 -39 -64 -140 25 7 -116 116 -6
4549 -6 148 7 46 56 -81 -110 -252 9 -52 51 74 95 -174 93 142 -55 243 142 32 -63 91 87 -54 68
4573 68 6 51 27 83 69 -56 -230 85 -120 2 140 46 -61 136 -5 -80 -35 32 -12 13 -42 -82 -176 -237 27
4598 27 -117 196 -77 -155 4 -20 223 146 -132 -80 57 -21 10 170 86 -53 23 -68 -192 -105 -194 -90 32 108
4622 108 -22 -37 -26 65 -63 38 31 -76 -24 -174 140 134 -88 134 146 99 32 89 39 148 126 -90 -62 -75 -229
4647 -229 262 94 -39 4 -67 198 128 265 151 28 -83 11 -105 101 48 -90 2 48 217 -280 -55 279
4669 279 101 -218 9 66 -12 -85 140 -202 -174 83 131 59 -73 110 76 56 47 -179 -60 231 -117 67 -94
4692i4K25j53K0o7q8K01n7J30o8J54j34q6N5k50J59L9j1n9K87k97K10r4O3J7j53
4717e1R6p8L0J11k7j41O2OM8Q6j55K5o1J67j69r2J88p3nj8N0L6J07l6q1m6o9K75
4745A85j88J75j24j00R1R8j42L3N0jj88R6j94K18L4j34K7J30K7j19k5l0j26K89
4769H2Q8j07Ml8j47J62m2p7J46J57l87K46j03kO4j74O6k6K90k75K12l48K61M0
4793I2j98O6O5j18K91l30K54k26K87l69N9J60k30M24j30J42l95R4K2R9o6P1R3
4816A57j60j26P6O5N0P7k17J51l5o4j33J22q7J18O1k02J25k14K78j25j30M0J84
4839A1R1ml17L10k89K86k53J96o1K81j14q0j40l2K18p6pj08n1L6K16r2%o6q0M
4865a21j1J13NJ23L2J7k74P4J79l46J82N2J70l57K65m7j70L45j18j95n0k9M8J01
$$ plain form
4692 -94 131 -22 -2 -69 -157 44 -13 117 49 203 69 -17 38 -212 -53 -14 -25 -84 203 -94 116 22 85 102 -51
4717 -51 45 -33 -3 108 81 -60 2 8 56 142 -13 12 -49 118 -51 -143 45 -28 -33 -51 -1 35 142 106 25 -21 -90 185
4745 185 -3 172 48 -52 39 137 -5 28 78 77 -111 -15 -209 9 43 -91 -64 66 93 -26 -51 -81 -207 82
4769 82 170 63 67 29 -118 44 2 -75 71 228 -159 87 -16 -18 46 -128 -62 -88 202 -73 139 -209 52 92
4793 92 -106 -40 25 -93 198 -132 122 -104 183 -186 -127 33 -197 227 97 239 -156 -62 -40 59 -7 64 157
4816 157 -3 -129 -53 12 62 139 -78 73 38 -26 -159 -37 -124 -6 55 -147 -22 -236 42 -83 -213 -173 11
4839 11 102 98 -219 91 -198 88 -165 31 -30 251 137 57 -83 -115 103 27 20 -88 -139 -103 113 21 21 -45 -125 -121
4865 -121 -132 -19 -14 109 141 158 -116 -42 137 -209 -27 25 195 -162 103 56 -114 231 113 -82 -132 -161 -113 -12
4889a2K35r3m1K9j86L8O8J76k15P0k04K19k60K88P5k25K42k69R7ln2j01K11j05
4913a8q7K06k84K29k9j42O0O9r4J47q3j44L01J9j99l2n3J78N4l22J38J45j8n1
4937a0J36j20R3M6Q1l46R4L8J03J37k33p6k9R7jk8n2kK04k29J20k2J7J34k47N5
4963d0lK66j94o5j02K02k29L31k69P3l16J89R0J03p7O6J14q9n5N8l3K6p0P2l0
4988A8q7l3K46k42KQ7J76N5l38N2R4p4J19m2j40qL54j42j4l3j10J78j41K35j67
5013D5J55k3j41J1j11J67j68J68q6j5r1J22j41R3o9N5j77K04q7j41N35m08M6L1
5037b6lK26p5k13J49j56K02k54R9J39oQ9k85M1J90M9k52NL3KJ16j38K28k04J6
5062b8K8J58m38K83J3J8j60J62o9J68j43o7N0l2j15K23k7j81L4jK9J38P2l6j29
$$ plain form
4889 -12 223 130 89 118 -68 -30 38 214 -1 69 -135 84 -176 112 187 -38 204 -65 32 29 -23 -124 87 -18
4913 -18 -105 101 -183 46 17 -125 -65 4 -90 57 -26 -170 131 150 -49 -81 -134 44 98 -224 -86 59 41 -10
4937 -10 126 6 99 145 226 -120 -26 12 115 252 19 -57 -86 11 10 -18 -70 -72 132 -97 23 1 18 152 -95 -40
4963 -40 -43 223 29 -36 -138 64 -165 166 -103 -30 -346 -157 -67 36 -41 25 139 50 -5 53 20 46 -24 48 18
4988 18 -69 -102 144 -98 -96 -9 167 222 -116 -64 30 -44 75 33 -107 -115 239 97 83 50 -60 118 -23 212 45
5013 45 200 177 36 47 -64 103 -65 103 17 2 -89 33 -108 -15 -84 -29 -206 -2 -89 -230 305 -103 -57 -26
5037 -26 -29 197 122 -91 58 -98 104 -150 -51 88 82 171 -114 -73 117 166 -86 -81 -48 -46 70 -68 160 -44 -28
5062 -28 0 158 -280 3 16 34 -126 36 -33 135 -8 -75 -25 -57 -172 51 24 -157 -123 -124 -95 43 115 79 -50
5087e0J64l0j75n2J06m4O1O0q7N7pj2j03L7J37j1J4j06J65j25M9R4r3o3j22J16
5113b0k3J28j43l9J75j17k9O4P0K2J6J04r7J42m40J96J07p3k30K37K59l99K6j02
5137a66J53j43jL28k80n3J37J66o3J3m21L94j23M1NO9o0n9J19j50l5J71j82K10
5161G0n1r9l7P2J84p5j20K40j70L6l40L71j94K45k73M9J25j6Q8j03J5l1J15j36
5185c5o0K08P4m10K73lj91J63J21k01J02P5j10j34J55m7o8J57l64M25j46j62K40
5208F2J42j60K3j49L01k57J28j69J07j21j2P0M3J4J14j56J16m6O4k4k44Q1Q9j75
5232a59r7K71N5M4r9K4j05O2j07J35j1J18k22j0O3J27j78j20L14j80L8O5n1k8
5256e1K17q2j19L4r7R3MK77k73j06M8j59J69j31J72J22o3j19j44K29K5N0k71M7
$$ plain form
5087 -50 114 84 -91 -143 -37 -81 -20 40 -47 10 3 -9 -112 -75 62 51 65 -41 124 -1 48 142 49 -14 -136 -20
5113 -20 -43 85 -58 -97 78 -39 -68 -4 66 88 104 208 111 253 -187 9 116 43 -187 50 309 -90 -64 -166
5137 -166 -13 -156 -157 171 -109 -162 -25 141 78 91 -330 64 -59 -18 -13 56 -4 -63 56 -94 -129 42 -140 70
5161 70 19 -80 -117 -45 139 64 -56 184 14 50 -290 81 -113 132 -141 -92 33 17 105 2 17 -14 101 -35
5185 -35 -95 113 187 -223 50 47 -144 19 140 -61 41 116 6 -128 27 -20 -88 69 -295 130 -16 -178 62
5208 62 204 44 67 -82 219 -38 90 -79 28 -93 -105 -35 8 22 136 -20 96 50 114 90 -154 -73 16 -159
5232 -159 -256 15 70 114 15 39 -66 -4 -111 24 13 131 -91 -101 -38 89 -89 -209 105 -75 -37 28 -23 -51
5256 -51 166 84 -35 -1 -98 -5 -1 276 3 -103 -55 -214 -45 -176 -4 118 55 -64 -208 21 46 96 -175 -128
5280a28J32j88K65R5k30J4P7pj18N9K9p6N6P4r7K8k7J03j68J16j68J87K5%l49
5305b96M79l05p9O4J51j32K06j39J51k24N7Q6J45j73J2O4qq2K10j47j6q7K2Q8
5329D7j28R0k%j5n2j01J61j02O6j16M2J43rl6J2N5j35N4oL9k1N7K00k77j2j58
5356b04L30o0l8L6k20J07J42j8k41MJ1Q2K12l7k46J09J94k2o7j85J82r0J81k00
5380c8p0m8J19J98j64j7J01k9l5q9O5k8K16m6j00mN0O7J55k51M6RK7j04r0Q2j91
5407a69J20J31J06k03J28j55J73K1k88J00ok42Q2N0J83L7p3j34K47j62L29k81
5429fRj42j09K90j35%K14k0R0k31K29j63P4j96K18k4j58K5r8O8k54K62J50J3j44
5454c8O9K34j06o3j46k01L09J26k08K1j92K15K9o3n6l4l0l0N2J10r7M1j37K95
$$ plain form
5280 -128 4 -184 81 176 -54 -40 37 30 -88 -29 0 -76 -20 54 -43 -15 -42 61 -107 9 -159 28 53 53 -296
5305 -296 183 -122 -201 -137 14 -118 88 -51 100 -124 -67 19 164 -9 3 67 59 -23 187 40 24 -63 -41 47
5329 47 -81 9 7 7 -8 -60 -161 0 -102 -36 -152 -110 33 24 -12 0 55 -80 -26 -32 7 -14 43 243 -34 -46 -204
5356 -204 126 66 28 64 -156 -49 93 75 -166 -162 -151 -69 143 106 -140 -31 163 141 74 -111 71 -19 162 -38
5380 -38 -108 -156 -37 161 -3 -20 81 52 17 -72 -7 -35 181 135 35 31 81 148 303 52 98 107 134 30 -60 22 -169
5407 -169 -49 82 188 -15 113 -42 131 152 -136 -36 -42 -284 -202 -152 31 68 -5 -139 108 -54 275 -6
5429 -6 3 -139 -248 42 -93 -93 121 101 191 -40 189 26 100 -96 122 98 -60 -35 -133 -65 -319 -57 93 106 -38
5454 -38 31 265 159 96 -50 -251 58 184 -24 -3 -195 20 49 -14 -70 -104 -134 -164 -112 -2 -99 -58 -195 100
5478A00j86J89j21L5K5k86K56j40K00p6j45Q4J10r0j17J82J53k02M6r7J14N5r
5501H0j48oj72L45m5j80M1j0P0L0j30J25K68k71j75J54M2M2l9J38l81L61%l7q3
5526A9Q2K3j94O0K03p2l72K43j77M15r2j93j03M19m51J23J09j69K69k29J9J26
5548E8j65L10p9l0j32K21k92L4Pj7J97l16L6J71J84k28J1N8K8o2N0j31J54q3J60
5573A44Pk03R0J01j79J36j09O4j8j85K89k23j26M50k68J69n7Mj57m8j6K46l44
5596b33J79K71l41K06k9J98l65J27J67p7j58R5q0m0J0J16P9n8j65K12o5N1j08
5619hp6M1k4K00p1k07L10l25j3J62p9K21k20R3j48J21P7L9l9l07K95j95K52k41
5643a42J26J26k07N1jr4M05k76M7K6k7l6l9j7L46q4l51o9M3N4J37J20k64k5K02
$$ plain form
5478 100 -86 103 -18 17 42 -244 12 -128 72 -4 -149 -65 45 -45 -162 20 173 -29 17 -80 34 89 80
5501 80 -68 -74 -246 99 54 -126 -85 -95 -25 5 -125 0 268 -3 -178 -24 18 60 21 159 -222 139 139 102 19
5526 19 101 124 -70 -10 193 121 -251 -8 -185 230 138 -55 -158 261 -190 -67 42 -127 142 -87 -68 58
5548 58 -107 203 124 94 -38 183 -109 -75 -68 -85 112 -204 -168 3 187 -41 -30 28 56 -6 44 -87 67 -16 144
5573 144 151 -52 38 139 -40 96 -13 51 33 -152 137 -86 -212 238 -30 139 82 86 -71 -119 -135 111 -233
5596 -233 -54 217 -124 82 53 251 -114 13 180 103 -55 40 -40 -80 -70 46 125 67 -98 114 49 100 -8
5619 -8 -84 -43 -67 133 62 -145 165 -160 -173 -11 -90 131 -89 4 -144 -23 54 93 54 -253 42 -153 99 -142
5643 -142 -16 110 -97 -46 -47 -141 264 -12 35 61 34 -2 -41 -58 288 204 -147 -216 -173 -119 18 138 -126 -151 51
5668E1l14K25K71l91K06l0p2L48o16L99j15J39j4j41J4n5J53j13L02k46K9n2q3
5691a05o5K57j36j3J93j65J20J6j9j52LO6p2JL73l34J88k44J16l3Q0p9l0J67l73
5716b40L76j23m2J00j15J54Jj5J12l6k99j34J71P7M9l1j88K99jk0L3j60n7k23
5740c12K29P3J62l32L97j07k26N8o7J45j21N8l3k72M70j58L02j86j55l9J54J0
5762E0J14j31Pj8N7k15J43n0Q6J38k66R6J27j15J18l24R4K3l6J90k64J71K16j07
5786A04P5L9m07K47q7Pj14J09j6p9J33J64j77Q7n7k83K34J90j29n7m5r3K41J32
5810B18j35j05m8m5K27j84J1J04L4j82K29j18K8r0L2J6n8K15j12j76K10j80K16
5833A07r9j27M0K06j94m3j10J27R8j80L63k68j34K25j75J95j27J54K51l12o5K14
$$ plain form
5668 51 -263 -38 233 -158 48 18 -54 294 -322 77 -38 101 87 -54 -40 -95 58 -55 247 1 30 -22 -105
5691 -105 -170 87 -49 -62 131 -34 86 102 83 -69 -66 0 -72 -71 302 -32 156 -88 28 -5 75 -4 -34 133 -240
5716 -240 136 13 -29 71 -44 110 111 96 208 172 -127 -261 -90 -13 36 5 -183 116 115 95 128 -32 -89 -312
5740 -312 -83 -10 152 -180 217 110 -116 -58 -125 20 -101 -43 -76 -348 122 -36 266 80 -75 -114 40 50
5762 50 164 33 40 22 79 -136 7 -43 43 181 -85 11 138 23 141 -183 -89 -66 -102 88 -176 -5 211 104
5786 104 179 218 -189 58 -29 -22 -136 -27 -43 -122 11 175 -2 85 28 -255 -21 169 40 -17 -62 -155 86 218
5810 218 83 -22 -70 -115 112 -72 -61 43 77 -105 124 6 34 -56 -24 -8 -66 149 37 -139 71 -109 107
5833 107 8 -119 -79 127 -67 -110 -220 -93 5 -175 188 -80 -214 11 -164 31 -96 58 309 -3 -68 146
5855A46k04J07N3q5L7J51k87K35k1k32K70l09J27n4m8j81L66k21K24k17J25J09
5877I1Qm9J59l99K04j3jM7p3J21k01J63j22J24OJ61k85j77J82J3L08l37N4r2J05
5902cj04o4J25r1Q1N5N3J41l20J85M6k58j5k6J87oj51J21N4Q6j97K66k11K21j85
5927a0M0j15J07n7J98p8p9r1L21j81k2Q2j6k15M6R2J30o1j94k8K8K32n4Q6j30
5952C1j35n3Q0k6L80l09r0L00l05K79N3m76L65r8O5q2J0pj50M96l98K29n5k41
5976a37P5j0L2j15r5L28K10k19k4J05M4k03pR0n4k62J65J35l9n4r2J16Q8j65J33
6001D5r9K0M1q1j36J41%L1K22n3p9n6K8r3j47L77k19R5r3l8J65R0j16J69k03%
6027A1O2r2J0N0j44o1L28k09J92q6j50O0O9J32k97K19k21n9J17lK53k55J09L2
$$ plain form
5855 146 -58 49 102 17 54 205 -82 153 132 -100 170 -139 -12 -66 -114 -295 71 -150 74 -143 -18 91
5877 91 99 50 209 -190 14 1 0 47 -26 95 -106 57 -65 59 65 226 -59 -236 -54 -41 267 -70 -16 -108 -3
5902 -3 -107 -171 -46 -137 -56 -1 52 193 -127 58 104 -154 -169 -195 -8 -14 -165 -44 10 96 -101 165 -46 175 -10
5927 -10 30 -85 22 -35 163 85 6 -85 236 55 33 115 99 -116 -70 22 152 91 -103 -131 -103 129 75 161 31
5952 31 -104 -157 -77 -103 277 -32 -122 178 -127 152 205 -271 94 -4 61 -21 -11 -18 -168 328 -70 159 104 -137
5976 -137 -62 -72 -40 -155 -250 78 288 69 45 150 194 -9 -16 74 20 -242 -77 58 19 -35 -127 -11 77 -88 45
6001 45 -54 -34 7 -74 -210 -69 -69 -38 184 131 52 -4 24 -69 -216 161 -58 37 -56 -94 71 161 45 214 11 11
6027 11 73 -19 -9 41 -103 -164 164 -45 147 61 -89 -29 40 172 -125 94 -127 -186 -69 -72 181 -74 35 67
6051F7Q8k11P6M7P1nk59K04j19K80k51P1j2j09J37j29J58k14R2K22l01k37L73
6074C9l9o5P3l5j1l3j13J63k7N9Q5q6k5j8q0J61n1J28n1r5R6K3k55J72J22J56
6100B93l32Jj45M42k55l4J47j15n5J2R8J72k34m5P5Jo5mJ43O5j50p0M8jJ22k05
6126i1J62J1l5n7O2N5k9k20J40k9q1K02j46K28j75O3j4k5N2O4k04n7J36j01L47
6151B58k19j23QP0J0K6j02L5r5pJ26J2j67J62K8k30P9r1K07rj1J37j5j83J72j81
6177a03M2J16R3j66L0J91k1j56j15L17k19K83l40O9k7lj9O2k44L39J24l35J56
6200G4k3q9L2n0M4j60R3L8j03P5j45K54qj52J06J20j64J40r5R8J22k41J46n9O1
6225A14k43Q2m3m1M3J34j27O0JK5J00p4K0l6k3j19P6J20k9k10J54J65O7k20o6
$$ plain form
6051 67 155 -56 20 67 138 133 -126 78 -41 239 -12 59 47 -62 75 -54 104 -110 -18 204 -97 -334 39
6074 39 0 -65 8 -27 -38 -71 -184 -21 -48 11 96 10 -15 -33 -113 48 -3 125 74 -21 75 98 -157 15 137 293
6100 293 -39 -38 -183 259 4 -30 117 2 -53 -41 57 229 -5 -50 25 26 -39 -43 100 165 15 -55 -7 -8 114 -91
6126 -91 71 82 47 -10 52 107 78 -142 -2 -31 -112 90 -56 172 -3 60 46 21 73 137 -67 -124 12 -89 258
6151 258 39 -84 -76 -6 4 30 -72 -37 -132 -139 -13 -1 -168 -6 22 -208 -129 -220 -13 -22 -33 104 89 -94 78 -103
6177 -103 -61 55 148 -18 12 203 182 26 -89 228 9 292 -48 21 -6 -9 -28 34 -210 129 253 -82 74
6200 74 51 -38 -6 -56 -12 -172 -79 -41 -144 -69 -214 40 32 -120 -14 106 -58 82 -13 85 207 -34 112 53 114
6225 114 -129 -47 -90 -131 -88 46 -81 -21 -20 5 105 31 51 15 -8 -127 -51 69 40 -170 -16 149 216 -4 -70
6250g0p6M7J06R5q3O9l6j03r9j5K52J60n10L68j40j08O5K64k29m0J21J20j35M
6274B7j93M11l21R9O8j0n9k04R8m2J79j51L7O0j05J74Pj15j4K0j85L28j1j21R0
6299F7J69k85K6L5J35k46O4J85j23J42j55QoJ45j40R2k44J38J74j51K4N2p0k5
6323A1j7l6o3M4L0J22M0j55j4J4J81j57J99m2j79P7n9J03K20l95M1J04m3L1o6
6348il4k39M06k62M6J37R0j98m1J29l7L9p3n6M1J67l38L23k8k9o1j89J79k9K14
6373A48j2j99J93n4k21K66j81J41j77K7P8j35j57L69m0l9K06k29j01k7Q3K06K3
6396A68j61r6K60k74K16j91O7N3l18L18J5j05P1lJ65m04Q7K30j15R4j90K47M7
6419A81o9l18K67q8k4O3q1l9J11N9k8jm0J54m3j49K14j35J9J41l5%j25j72K4k8
$$ plain form
6250 -70 -146 -99 7 102 19 88 52 -51 -150 -165 87 247 -263 105 -35 -143 -78 186 -43 -83 38 158 23 27
6274 27 -166 245 -76 23 91 81 22 -182 -84 -126 53 -98 -61 -1 -106 68 75 -40 -54 -34 -219 109 98 -23 67
6299 67 236 -49 -23 12 147 -99 -35 150 27 169 14 22 16 161 21 113 -131 7 181 30 54 106 36 11
6323 11 -6 -42 -105 -61 -31 91 131 -24 -38 -24 157 0 199 157 -22 55 -4 99 319 -76 -35 69 26 57 -9
6348 -9 -43 -282 124 -138 -92 45 135 -63 -104 25 -12 27 -46 -102 -61 106 -232 91 63 34 -27 -216 -37 -66 148
6373 148 136 -63 130 76 -145 121 -60 81 -96 -69 9 -126 -283 86 46 7 213 -16 -117 -144 -61 145 168
6396 168 7 -89 171 -103 113 -78 -11 42 -276 42 57 -48 23 20 185 -219 -132 98 -17 77 -113 134 181
6419 181 112 -206 61 -27 -51 12 -69 -108 3 62 34 33 -7 147 104 -45 169 34 53 194 159 159 34 -138 -114 -142
6445a42J22L3q9P1J0Q2k38K81j70M4PL6j04k05K52J2P1k7J55k23l6J7L23j48r0
6470D4J47k46k2M5K17j52j23K66j75O5J58k28M5j29j34J20J66r9Mr8J4J22m6n8
6494i7Q8n0R9j11J29m80N25o2J07j48J9j38j37Q9R5J58j22K27j37n0j70M6LR0
6518b7J55j04L6j5J09k66J34J41j03l7N8p2J04l23L86j20R1j84PJ81j77Q1k17
6541a62L58l84L22l44K60J07j12k65K41J33j98R5k0O7kjj05J5L9pj47O1k9J46
6565F8j8J96k18L6L6o1K49k57j8k3p4K94m63K22Ok4J22k64L10j08r2j3J59J59
6589B24k41O1j06J85l73J82J68j81K00m7k6r6K55l97K18J10p6j76M8J07j3o4J18
6612H0k06l2R6R6q2o0l0L61Rj47j86K6p1o2L62k43N5q2L6J72P5p9p6n1J29p5j28
$$ plain form
6445 -142 -20 13 -76 -5 5 87 -151 130 -40 4 11 47 -57 -262 -10 2 73 46 201 -22 -58 -41 282 134 44
6470 44 191 -55 -77 -32 185 33 -90 176 1 66 224 -4 41 -88 -222 -102 64 -35 -31 -129 -115 7 -39 -97
6494 -97 -9 -59 40 -71 58 -422 103 41 148 0 19 -119 -256 -167 -72 86 -36 191 54 4 -166 -120 -117 -27
6518 -27 128 24 60 45 154 -112 22 163 60 23 81 9 113 -210 176 56 147 -37 -30 151 -26 55 -162
6541 -162 196 -188 134 -210 50 157 45 -220 21 154 -44 51 31 98 96 95 -10 5 44 37 -110 -49 -78 68
6565 68 50 246 28 64 100 39 288 31 13 -10 -84 210 -253 -31 -25 -49 73 -191 119 11 -81 -94 65 224
6589 224 -17 44 -62 123 -250 -68 100 -81 119 72 46 -50 205 -192 26 136 60 -116 -68 39 26 -38 80
6612 80 -126 -158 -62 34 -48 -108 -138 223 232 85 -101 -75 -146 -208 154 -89 -34 -116 -80 92 167 88 12 -39 90 15 -113
6639a13p0K78r6l0P3K7j19K0J54k64K51k3k26L17j82j16J35j0Qm2N4k4o1J72N
6664A18j45q5N0J09Pj59j7K03l0%j20J28k52J76K3L5K0J1j37K39k10%j9L4q7K97
6690A89k6j15Oj71J11M0j29J53Q2j50P1p0O3m5ML3j39k9R9J27K6m5j7j9o3j82
6716a96L3K12j38J09j65J64J1J31k41K03j4l3k21J65l48L64K1j29m2K78l46N0
6738a32K33j47j16Q2q0L52l71P4P8o6L90k31l03N0L25k41J3K07K7k49LK34j1k07
$$ plain form
6639 -113 -183 95 -1 -31 42 69 -50 -30 124 -140 111 88 -138 179 -3 -119 16 6 14 -28 26 2 -59 113 118
6664 118 -27 -112 -62 47 54 -105 -122 81 51 51 -69 59 -193 -17 6 41 61 72 -65 174 -36 -36 -55 -21 -108 189
6690 189 163 48 54 -117 -6 34 -95 58 140 -10 61 -9 54 9 13 46 -93 -122 -23 104 130 85 68 49 -14 -196
6716 -196 -163 49 -89 20 -145 19 30 161 -80 123 109 76 -145 20 -328 36 57 -72 -114 164 -182 -132
6738 -132 101 -46 -162 -80 -160 192 -179 -105 -27 -93 297 66 -237 -187 138 -103 -90 117 144 -105 -102 132 121 -86
$$ [...]
8191c
##END NTUPLES=NMR FID
##END=
