##TITLE=1H_DE-80H_X3
 200.13MHz, d2o
 8 sc
 
 19ns.26.2.2025
##JCAMPDX= 6.0         $$ Bruker NMR JCAMP-DX V2.0
##DATA TYPE= NMR FID
##DATA CLASS= NTUPLES
##ORIGIN= UXNMR, Bruker Analytische Messtechnik GmbH
##OWNER= pz
$$ XWIN-NMR		Version 3.5
$$ Fri Apr 11 15:58:38 2025 Russian Standard Time (UT+4h)  Yarkov@DPX200
##.OBSERVE FREQUENCY= 200.1313
##.OBSERVE NUCLEUS= ^1H
##.DELAY= (6, 6)
##.ACQUISITION MODE= SIMULTANEOUS
##.ACQUISITION SCHEME= undefined
##.AVERAGES= 8
##.DIGITISER RES= 18
##SPECTROMETER/DATA SYSTEM= spect
##.PULSE SEQUENCE= zg30
##.SOLVENT NAME= CDCl3
##.SHIFT REFERENCE= (INTERNAL, CDCl3, 0, 14.3821)
##AUDIT TRAIL= $$ (NUMBER, WHEN, WHO, WHERE, WHAT)
$$ ##TITLE= Audit trail, XWIN-NMR		Version 3.5
$$ ##JCAMPDX= 5.01
$$ ##ORIGIN= Bruker BioSpin GmbH
$$ ##OWNER= Yarkov
$$ C:/Bruker/XWIN-NMR/data/yarkov2/nmr/H-C/1/audita.txt
$$ ##AUDIT TRAIL=  $$ (NUMBER, WHEN, WHO, WHERE, WHAT)
(   1,<2025-04-11 15:57:06.95 +0400>,<Yarkov>,<DPX200>,
      <created by zg, POWCHK disabled, PULCHK disabled
       configuration hash MD5:
       00 E9 B6 7A A2 85 ED C7 34 08 36 98 17 FE 4E 26
       data hash MD5: 16K
       1E 4E 1A CE 2C 77 64 0A 3C E7 7B 8C A4 D8 76 77>)
$$ ##END=
$$ 
$$ hash MD5
$$ B9 53 AE 03 88 9D 1C 41 87 E3 EE AF 96 87 AD EC
##$RELAX= 
##$RELAX= 
##$RELAX= 
##$RELAX= 
##$RELAX= 
##$RELAX= 
$$ Bruker specific parameters
$$ --------------------------
##$DU= <C:/Bruker/XWIN-NMR>
##$EXPNO= 1
##$NAME= <H-C>
##$PROCNO= 1
##$TYPE= <nmr>
##$USER= <yarkov2>
##$AMP= (0..31)
100 100 100 100 100 100 100 100 100 100 100 100 100 100 100 100 100 100 
100 100 100 100 100 100 100 100 100 100 100 100 100 100 
##$AQSEQ= 0
##$AQ_mod= 1
##$AUNM= <au_zg>
##$AUTOPOS= <>
##$BF1= 200.13
##$BF2= 200.13
##$BF3= 200.13
##$BF4= 200.13
##$BF5= 200.13
##$BF6= 200.13
##$BF7= 200.13
##$BF8= 200.13
##$BYTORDA= 1
##$CFDGTYP= 0
##$CFRGTYP= 5
##$CHEMSTR= <none>
##$CNST= (0..31)
1 1 145 1 1 1 1 1 1 1 1 1 1 1 1 1 1 1 1 1 1 1 1 1 1 1 1 1 1 1 1 1 
##$CPDPRG= <>
##$CPDPRG1= <>
##$CPDPRG2= <>
##$CPDPRG3= <>
##$CPDPRG4= <mlev>
##$CPDPRG5= <mlev>
##$CPDPRG6= <mlev>
##$CPDPRG7= <mlev>
##$CPDPRG8= <mlev>
##$CPDPRGB= <>
##$CPDPRGT= <>
##$D= (0..31)
0 0.7 0 0 0 0 0 0 0 0 0 0.03 0 0 0 0 0 0 0 0 0 0 0 0 0 0 0 0 0 0 0 0 
##$DATE= 1744372626
##$DBL= (0..7)
120 120 120 120 120 120 120 120 
##$DBP= (0..7)
150 150 150 150 150 150 150 150 
##$DBP07= 0
##$DBPNAM0= <>
##$DBPNAM1= <>
##$DBPNAM2= <>
##$DBPNAM3= <>
##$DBPNAM4= <>
##$DBPNAM5= <>
##$DBPNAM6= <>
##$DBPNAM7= <>
##$DBPOAL= (0..7)
0.5 0.5 0.5 0.5 0.5 0.5 0.5 0.5 
##$DBPOFFS= (0..7)
0 0 0 0 0 0 0 0 
##$DE= 6
##$DECBNUC= <off>
##$DECIM= 32
##$DECNUC= <off>
##$DECSTAT= 4
##$DIGMOD= 1
##$DIGTYP= 9
##$DL= (0..7)
0 120 120 120 120 120 120 120 
##$DP= (0..7)
150 150 150 150 150 150 150 150 
##$DP07= 0
##$DPNAME0= <>
##$DPNAME1= <>
##$DPNAME2= <>
##$DPNAME3= <>
##$DPNAME4= <>
##$DPNAME5= <>
##$DPNAME6= <>
##$DPNAME7= <>
##$DPOAL= (0..7)
0.5 0.5 0.5 0.5 0.5 0.5 0.5 0.5 
##$DPOFFS= (0..7)
0 0 0 0 0 0 0 0 
##$DQDMODE= 0
##$DR= 18
##$DS= 0
$$ [...]
##$SUBNAM2= <"">
##$SUBNAM3= <"">
##$SUBNAM4= <"">
##$SUBNAM5= <"">
##$SUBNAM6= <"">
##$SUBNAM7= <"">
##$SUBNAM8= <"">
##$SUBNAM9= <"">
##$SW= 18.0517328524113
##$SWIBOX= (0..15)
0 0 2 0 0 0 0 0 0 0 0 0 0 0 0 0 
##$SW_h= 3612.71676300578
##$TD= 16384
##$TD0= 1
##$TE= 0
##$TE2= 300
##$TE3= 300
##$TEG= 300
##$TL= (0..7)
0 120 120 120 120 120 120 120 
##$TP= (0..7)
150 150 150 150 150 150 150 150 
##$TP07= 0
##$TPNAME0= <>
##$TPNAME1= <>
##$TPNAME2= <>
##$TPNAME3= <>
##$TPNAME4= <>
##$TPNAME5= <>
##$TPNAME6= <>
##$TPNAME7= <>
##$TPOAL= (0..7)
0.5 0.5 0.5 0.5 0.5 0.5 0.5 0.5 
##$TPOFFS= (0..7)
0 0 0 0 0 0 0 0 
##$TUNHIN= 0
##$TUNHOUT= 0
##$TUNXOUT= 0
##$USERA1= <user>
##$USERA2= <user>
##$USERA3= <user>
##$USERA4= <user>
##$USERA5= <user>
##$V9= 5
##$VALIST= <valist>
##$VCLIST= <CCCCCCCCCCCCCCC>
##$VD= 0
##$VDLIST= <DDDDDDDDDDDDDDD>
##$VPLIST= <PPPPPPPPPPPPPPP>
##$VTLIST= <TTTTTTTTTTTTTTT>
##$WBST= 1024
##$WBSW= 4
##$XGAIN= (0..3)
0 0 0 0 
##$XL= 0
##$YL= 0
##$YMAX_a= 113778
##$YMIN_a= -183671
##$ZGOPTNS= <>
##$ZL1= 120
##$ZL2= 120
##$ZL3= 120
##$ZL4= 120
##$ABSF1= 10
##$ABSF2= 0
##$ABSG= 5
##$ABSL= 3
##$ALPHA= 0
##$AQORDER= 0
##$ASSFAC= 0
##$ASSFACI= 0
##$ASSFACX= 0
##$ASSWID= 0
##$AUNMP= <proc_1d>
##$AZFE= 0.1
##$AZFW= 0.1
##$BCFW= 1
##$BC_mod= 2
##$BYTORDP= 1
##$COROFFS= 0
##$CY= 83.5205535888672
##$DATMOD= 1
##$DC= 2
##$DFILT= <>
##$DTYPP= 0
##$F1P= 10.8118882576601
##$F2P= -7.23987719738617
##$FCOR= 0.5
##$FTSIZE= 0
##$FT_mod= 4
##$GAMMA= 1
##$GB= 0.15
##$INTBC= 1
##$INTSCL= 1
##$ISEN= 128
##$LB= 0.25
##$LEV0= 0
##$LPBIN= 0
##$MAXI= 10000
##$MC2= 0
##$MEAN= 0
##$ME_mod= 0
##$MI= 1.114404
##$NCOEF= 0
##$NC_proc= 0
##$NLEV= 6
##$NOISF1= 3.799351
##$NOISF2= 2.8
##$NSP= 1
##$NTH_PI= 0
##$NZP= 0
##$OFFSET= 14.38212
##$PC= 1
##$PHC0= -823.88
##$PHC1= 15.13372
##$PH_mod= 1
##$PKNL= yes
##$PPARMOD= 0
##$PSCAL= 0
##$PSIGN= 0
##$REVERSE= no
##$SF= 200.129724274929
##$SI= 16384
##$SIGF1= 3
##$SIGF2= 2
##$SINO= 400
##$SIOLD= 16384
##$SREGLST= <1H.CDCl3>
##$SSB= 0
##$STSI= 0
##$STSR= 0
##$SW_p= 3205.1282051282
##$SYMM= 0
##$S_DEV= 0
##$TDeff= 0
##$TDoff= 0
##$TI= <>
##$TILT= no
##$TM1= 0
##$TM2= 0
##$TOPLEV= 0
##$USERP1= <user>
##$USERP2= <user>
##$USERP3= <user>
##$USERP4= <user>
##$USERP5= <user>
##$WDW= 1
##$XDIM= 8192
##$YMAX_p= 0
##$YMIN_p= 0
$$ End of Bruker specific parameters
$$ ---------------------------------
##NTUPLES= NMR FID
##VAR_NAME=  TIME,          FID/REAL,        FID/IMAG
##SYMBOL=    X,             R,               I
##VAR_TYPE=  INDEPENDENT,   DEPENDENT,       DEPENDENT
##VAR_FORM=  AFFN,          ASDF,            ASDF
##VAR_DIM=   8192,          8192,            8192
##UNITS=     SECONDS,       ARBITRARY UNITS, ARBITRARY UNITS
##FACTOR=    0.0002768,     1,               1
##FIRST=     0,             0,               0
##LAST=      2.2672688,     0,               0
##MIN=       0,             -183671,         0
##MAX=       2.2672688,     113778,          0
$$ Real data points
##PAGE= N=1
##DATA TABLE= (X++(R..R)), XYDATA
$$ [...]
1626B61l49Q4j05k0K11k29K53j66J33m6j04K42k21R4j76R0J65k20l7nJ50j09J76
$$ 261 -88 -4 -109 -129 82 -147 106 -60 73 27 -77 165 -56 38 -138 -48 117 -103 -140 -145 5 -104 72
1649G2n6Lj62O4LNJ2qK08j26j54K57j44J40l12K16j95K18o8K7J40j12Q9p0J7p0
$$ 72 16 19 -143 -79 -76 -71 -59 -67 141 15 -139 118 -26 114 -198 18 -177 41 -27 0 140 28 117 47 64 -6
1675fk9r1nk9J14J8k8l8J66J29k07J85M6l61J68Rq1J8J29j70K7l2J50M5j91M3
$$ -6 -35 -126 -131 -160 -46 -28 -56 -94 72 201 -6 179 225 -136 32 41 -40 -22 107 -63 -36 -68 82 127 -64 -21
1701b1K5J38j25p0k0J61j15k56K14Q0M1k3l7j8P5l4L8M7PO5l0p4K6o3K6j05J96
$$ -21 4 142 17 -53 -73 88 -27 -283 -69 11 52 29 -8 -26 49 15 53 100 107 172 142 68 94 31 57 -48 148
1728A48J5j66J29l31L17l8p2J30j65k52K78R7k15j08L17Q3o3p4nn3J94l53L67
$$ 148 163 -3 126 -205 112 74 2 132 -33 -285 -7 90 -125 -233 84 167 104 30 25 -28 166 -187 180
1751A80l68L05J95j45j10j29J70J18j30j32K24j33J07j67K12j35k7k13J77J85
$$ 180 -188 117 312 167 57 -72 98 216 86 -46 178 45 152 -15 197 62 35 -178 -1 184
1771A84r1o5M0j34M6M1J9K4k28k7j2N3K4K18j52j25J12K86k76J7r2j23M67l01
$$ 184 93 28 68 -66 -20 21 40 64 -164 -191 -203 -150 -126 92 -60 -185 -73 213 -63 -46 -138 -261 206 -95
1795i5J63j90K29r7L4j60J30O4r5q3K0K1j20J88N4r5J48n3j54J79P6k01K1L2j83
$$ -95 68 -122 107 10 44 -116 14 78 -17 -100 -80 -59 -179 9 63 -32 116 63 -91 88 164 -37 -16 16 -167
1820a67L08j55Q6q7%m8J63R3j90K2O9j42p0KL5J06r6m0n9K82j0Q9l17%K65Lk20
$$ -167 141 -14 72 -15 -15 -63 100 193 3 25 94 -48 -118 -116 -81 25 -71 -111 -170 112 102 191 -126 -126 139 142 -78
1847g8J66M1j06n3n8L11n5k88mJ88j19q6R4o9J21J49j36nJ62l22J30j07K20k08
$$ -78 88 129 23 -30 -88 223 168 -120 -124 64 -55 -141 -47 -116 5 154 18 13 175 -147 -17 -124 96 -112
1871a12K82j97r3J11M0p5J31p3M0kj72K17K1k33k1J18n2k3J06K8o8J30j83M83
$$ -112 170 -27 -120 -9 31 -44 87 14 54 52 -120 97 118 -115 -136 -18 -70 -93 13 41 -27 103 -80 403
1895D03l47m2j83J27O7Pk0j39KK29j00K48j17j08k19J35L8r3K10o9j88L00p5p4
$$ 403 56 14 -169 -42 25 32 12 -127 -125 104 4 252 135 27 -192 -57 -19 -112 98 29 -159 141 66 -8
1919hj0J14O0m4j38J68k57L2j1R3J1O7j04R5j18J5R2r5L2j40J92Lrl8j25K28l56
$$ -8 -18 96 156 112 -26 142 -115 -83 -94 -1 10 77 -27 68 -50 -35 57 -38 -6 -146 46 49 40 2 -123 105 -251
1946b51J80K46q6J7k52P9O6J15j74Q7J12k82K22k37J9J96pJ81Mk35o6o4L0J76
$$ -251 -71 175 89 106 -146 -67 -1 114 -60 27 139 -143 79 -158 -139 57 50 231 235 0 -66 -130 -100 76
1970G6j52O1M5J26k81J31j45J0LR6J28J3j85J22n9J1k48J93j00K49j51K99j49
$$ 76 -76 -15 30 156 -125 6 -139 -129 -126 -30 98 111 -74 48 -11 0 -248 -55 -155 94 -57 242 93
1993I3j91J02ON1kj17k5K70l81J46J5Ql2l7P8J35%k65J86J16m6j62Q5k21L52k09
$$ 93 -98 4 10 61 59 -58 -83 187 -194 -48 -33 -25 -57 -94 -16 119 119 -146 40 156 110 -52 33 -188 164 -45
2019d5J32r9J97j79J10J08l00M22k02j63n4J91k24L34k71J23Q1j81K75l57J31
$$ -45 87 -12 185 6 116 224 -76 346 144 -19 -73 118 -106 228 -43 80 161 -20 255 -102 29
2040B9J4k2pP9P5m22L32j16K9o2K4K04r6r9j84J13K8K21j4j27j65M8oJ11P8K6
$$ 29 43 21 14 93 168 -254 78 -38 -9 -71 -47 157 61 -38 -222 -109 -81 140 126 -1 -166 -118 -124 -13 65 91
2066I1n6j74L31L9k78Q3k77J83RQ9J59k90L9K30k06J16r8q9J72k37L07j07Q6j79
$$ 91 35 -139 192 231 -47 36 -241 -58 -49 40 199 -91 -52 178 -28 88 -10 -99 73 -164 143 36 122 -57
2090e7L9J29J64l4l77K28j19P5m0m14M35J47k50N0J61P6j86p4p9J77j79J74k94
$$ -57 -18 111 275 241 -136 92 -27 48 8 -406 29 176 -74 -24 137 213 27 -47 -126 51 -128 46 -248
2113b48L06Rk52L84l32K41k5j56J96p4k99J58J3K5J01o9k6JQ3lJ21mm5k05l4J03
$$ -248 58 67 -185 199 -133 108 83 -73 123 49 -250 -92 -79 -54 47 -22 -48 -47 36 33 154 150 105 -100 -134 -31
2139c1j15J3K99j06j98J98j20Q0j17K61k59N1J71j84P1o7n1K10nJ00m7k06K70
$$ -31 -146 -133 166 60 -138 60 -60 20 -97 164 -95 -44 127 -57 14 -53 -104 106 101 201 154 -52 218
2162B18j94l7J63j07j30J49k51J07K08j66k06J39K66j54m7J91j32j88N8K14r2
$$ 218 24 -13 150 43 -87 62 -189 -82 126 -40 -246 -107 159 5 -42 149 17 -171 -113 101 9
2183IJ73j48k75L66q0M4k3P0j44o7M2J15j10R4j6k51O9K11m6pJ48j82j27J31J59
$$ 9 182 34 -241 125 45 89 66 136 -8 -75 -33 82 -28 66 50 -201 -132 79 33 26 174 -8 -135 -4 155
2208A55j31J04j4j5r0l8NP5q9J88j99J32p1k72L15j3M4k03J20K7K9m5L3l43j2
$$ 155 24 128 114 99 9 -29 -24 51 -38 150 -49 83 12 -260 55 42 86 -117 3 30 59 14 47 -296 -308
2233c08L44l0k9oJ53J1p1k07J10j22K44j68P6J22j45L08l92P4K18k31J12J31l52
$$ -308 36 6 -23 -29 124 135 64 -143 -33 -155 89 -79 -3 119 -26 282 -110 -36 182 -49 63 194 -158
2256a58O3J05l3N7O3R4k22J9KJ22j94J39l5J51j79K74l65N1P7j13j3Q9l2j66J06
$$ -158 -95 10 -23 34 97 191 -31 -12 -10 112 -82 57 22 173 -6 268 -97 -46 31 -82 -95 -6 -38 -204 -98
2281i8R2O2l3n5P3k10J61p6O5N2j12O8Q5l9k03N6J42m6j92j5l7L38J3k20Q7R7
$$ -98 -6 56 23 -32 41 -169 -8 -84 -19 33 -79 -11 74 35 -168 -112 30 -16 -208 -223 -260 78 91 -129 -42 55
2307E5qP0j95Oj17K27r0k2K41j55o0k01M64j30j21k26M02j27J9j48J40M0JN6m6
$$ 55 47 117 -78 -72 -189 38 -52 -74 167 12 -48 -249 215 85 -36 -262 140 13 32 -116 24 64 65 121 75
2332G5p4o9J35j15J10M3j33O6Q4n9k4k05K39j62K4J68j43NK22k55Q3p6J38r9o3
$$ 75 1 -68 67 -48 62 105 -28 38 122 63 39 -166 73 -89 -65 103 -40 -35 187 -68 15 -61 77 -22 -85
2357h5J52J18l00J29kJ33j75Jl4J3J87j38N2j34j3J12Nj22M5M6n6P9j01p5J73
$$ -85 67 185 -115 14 12 145 -30 -29 -63 -50 137 -1 51 -83 -96 16 21 -101 -56 -10 -66 13 -88 -163 10
2382A0K41k40O6n9p8OO2K36k89jj0J73m8m8O1j70lJ52j18K34j48k8L1M2j18m2
$$ 10 251 11 77 18 -60 -54 8 244 -45 -46 -56 117 69 21 82 -88 -91 61 -57 177 29 1 32 74 -44 -86
2408h6J05K12l75K56l83J31J13J06k42K97j7j81N3L38j57k15J0o0J69J11j0k63
$$ -86 19 231 -144 112 -271 -140 -27 79 -163 134 117 -64 -11 327 170 -45 -35 -95 74 185 175 -88
2430h8M9J3k2J83J75k76J81k02J9l03L33K1j06J18q1j53J2L17j67O0k11J60J92
$$ -88 -39 -26 -48 135 310 34 215 13 32 -271 62 83 -23 95 14 -139 -127 190 23 83 -128 32 224
2453B24l50M9j7J01J62m29K93r4j43K27m65M34J7P0j16L8j21L05m71M47m41J45
$$ 224 -126 -77 -94 7 169 -260 33 -61 -204 23 -442 -8 9 79 -37 1 -120 185 -286 161 -280 -135
2475a35K84j13P9j47O3J02j03j45M47k37q9pK17k27K8j11R4j59J22J15j9k19J39
$$ -135 149 36 115 -32 31 133 30 -115 332 95 6 -1 216 -11 17 -94 0 -159 -37 78 59 -160 -21
2498b1j58J71K0j18M5p3K0J82j52K61j26J30p3n4O9r5Lj26K54oj27j7K33l50O1
$$ -21 -179 -8 12 -106 -61 -134 -114 68 -84 177 51 181 108 54 123 28 31 -95 159 153 26 9 242 -108 -47
2523d7J7J33M1j20mL1k22K98l36J69j55J66J28k25J42J3J88j95%j87m9J14J4l5
$$ -47 -30 103 144 24 20 51 -171 127 -209 -40 -195 -29 99 -126 16 29 217 22 22 -165 -214 -100 -86 -121
2547a21L30l85L06j11j99L30k41l3j2OJ06J38j40K40j97k5p5K03j30M1j00K93
$$ -121 209 -176 130 19 -180 150 -91 -124 -136 -130 -24 114 -26 214 17 -8 -83 120 -10 31 -69 224
2569B24j08j92O4p3k0K36n3R5j30J5o7Jj61J80j4K75m34K73j00J37j86j11J82
$$ 224 116 -76 -12 -85 -105 131 78 173 43 58 -9 -8 -169 11 -3 272 -162 111 11 148 -38 -149 33
2592C3n5oQ9j53M8O0k7j45K61k08J54J75k43J46k8J14k42k08J87j57J11J76p2
$$ 33 -22 -28 61 -92 -44 16 -11 -156 105 -103 51 226 -17 129 101 215 -27 -235 -48 -205 -94 82 10
2615A0L4j86L64k48o4K76k27K44j85q6Jn7L90k69n8M3r9J09qj15K5N5Q5j13P9
$$ 10 44 -142 222 -26 -90 186 -41 203 18 -68 -67 -124 266 -3 -61 -18 -117 -8 -16 -131 -106 -51 34 -79 0
2640@N7J05J1l16O7O2n5J61L5k40L38k27l9J39n0J45l80K11j78J65l1K05k02M9
$$ 0 57 162 173 -143 -76 -14 -69 92 127 -113 225 -2 -41 98 48 193 -187 24 -154 11 -20 185 -17 32
2664C2j57M3M0K00k04m5L3O6o6n6M2j6K62j75j39j1L23k91K71%K1J2j90M9J06
$$ 32 -125 -82 -42 158 -46 -91 -58 8 -58 -114 -72 -88 174 -1 -140 -151 172 -119 152 152 173 185 -5 44 150
2689A50L0l68k7J59K12m84L47n6J52l0k5r5k7K52l41K57l09R7r5L26kK3k13J30
$$ 150 180 -188 -215 -56 156 -328 19 -37 115 85 60 -35 -62 190 -151 106 -203 -106 -201 125 123 146 -67 63
2713F3j28K19j21m5l9K64m17J14J5Rk7oK00l94L45j54J88k70K48nk9K0n4O4m7
$$ 63 -65 154 33 -12 -51 213 -204 -90 -75 -66 -93 -99 101 -293 52 -102 86 -184 64 59 30 50 -4 60 13
2738A3j4j50q3K93%j97Q3j29K67K0q3j09J56m6J55l9k31J50J9M4j15mjN7J27l59
$$ 13 -1 -151 -234 59 59 -138 -55 -184 83 103 20 -89 67 21 176 137 -94 56 75 119 4 0 -1 56 183 -176
2764a76Q9L4K85j54l4q2n7o3Q6K38j26N4J6j35j46L51r6j05K12j03PJ45l91Qm4
$$ -176 -87 -53 232 78 44 -38 -95 -158 -72 166 40 94 110 -25 -171 180 84 -21 191 88 95 240 -151 -143 -187
2789a87J79j3K97l24j97K31RR4k77K11j10J70qK6J15k00o1J91k35M6k8o3K27j52
$$ -187 -8 -21 276 -48 -245 -14 -5 89 -188 23 -87 83 75 101 216 16 -45 146 -89 -43 -71 -134 93 -59
2813e9K2K5p1Q5J58j58R9L8m95M97no7o6P1j41Q1k0o5J55j21J3M9j93J93km0j38
$$ -59 -37 -12 -83 2 160 2 101 139 -356 141 136 69 3 74 -67 14 -6 -71 84 -37 -24 25 -168 25 23 -17 -155
2840a55K6K23J23l80MJ19m3M8p5J87l6L1m2L1k85J17l6K08j53L17n0k38M4J55
$$ -155 -129 94 217 -163 -159 -40 -83 -35 -110 77 41 72 30 61 -224 -107 -143 65 -88 229 179 -59 -15 140
2864A40M2k31K44k75J74k86L34ok87J11N1J27j80l7L11k21K3p2j97K45k10K37
$$ 140 182 -49 195 -80 94 -192 142 136 -151 -40 11 138 -42 -79 232 11 34 -38 -235 10 -200 37
2886C7j61J3N5J51k23L7J00j1K3N0j82K93k76J45j34J22J51n3r3J45j71j0k38
$$ 37 -124 -111 -56 95 -128 -91 9 -2 21 71 -111 182 -94 51 -83 39 190 137 44 189 18 8 -230
2909b30J28L83l36J81l12J98J67j60k0L3L3j2n5m0l0o2J93O2k31j2n7K5K0K81
$$ -230 -102 281 -55 126 -186 12 179 19 -1 32 65 53 -2 -42 -72 -134 59 121 -110 -122 -179 -154 -134 147
2933A47p3L0k06Q6N4Mj51J17K52l68m2J65P1j19J45j63J58j19j60L71J03j71j48
$$ 147 74 104 -102 -16 38 42 -109 8 260 -108 -150 15 86 -33 112 -51 107 -12 -172 199 302 131 -17
2956a7j53O7J20J41k71O1J64J14k16o3j29r9L56k16Q6K00K2k24Q2j4R8J32k73
$$ -17 -170 -103 17 158 -113 -52 112 226 10 -53 -182 -281 75 -141 -55 145 167 -57 25 11 109 241 -32
2979c2J5m9R1j93J19O7n7J12o1l1J14K1j65J40j7j25L90k68R8j72M6j08J28q7
$$ -32 -17 -66 25 -168 -49 18 -39 73 12 -19 95 116 -49 91 74 -51 339 71 169 -3 43 -65 63 -24
3003b4m6RK38k25K4J57M7j38ro6j8oJ01R6l35J47j03R7j12K79j35J82j28n5o3
$$ -24 -70 -61 177 -48 -24 133 180 42 33 -33 -51 -57 44 140 -195 -48 -151 -54 -166 113 -22 160 32 -23 -86
3028h6J77r5k0J33n8J52p7q7K15l52lK20K6j47J23k26J6J5J16o0Oj07R3L5L3K6
$$ -86 91 -4 -24 109 51 203 126 39 254 -98 -101 119 145 -2 121 -105 -89 -74 42 -18 -12 -119 -26 9 42 68
3054F8p6m5j03L38k13q2J68O6j05K14k06k28L12kj46K60k37J62j85J52Oj11j80
$$ 68 -8 -53 -156 182 -31 -113 55 121 16 230 24 -204 108 106 -40 220 -17 145 -40 112 118 7 -173
3077a73J09K09l73K74J9l3J0q0J51k66J68j59J91j45J82l9m9N3k55K41j94K62
$$ -173 -64 145 -228 46 65 32 42 -38 113 -153 15 -144 47 -98 84 45 -4 49 -206 35 -159 103
3099A03J01l34J50l1o6L59l27j03J33J0j35J00n6J74k6j37J39j88O1j11K90r8
$$ 103 204 -130 20 -11 -77 282 -45 -148 -15 -5 -140 -40 -96 78 52 -85 54 -134 -73 -184 106 8
3121Hj22J01K7J76k2p9j44n1J26J0rm6l1J31j97J35J9j44q2J01L39j63j49m2K3
$$ 8 -114 -13 14 190 168 89 -55 -106 20 30 21 -25 -56 75 -122 13 32 -112 -194 -93 246 83 -66 -108 -85
3146h5q9K51j31Q7nM0q0r3K19j29O6j87L0P6K3O1N9j14Q5J38l66L4J7J96k06P
$$ -85 -174 77 -54 33 28 68 -12 -105 114 -15 51 -136 -106 -30 -7 54 113 -1 84 222 -144 -110 -93 103 -103 -96
3172i6J09o1M0K37k16Q1p5K4q3N8p9L0Q7q2k2o7M2j00K64pj98P3K61k70K89j03
$$ -96 13 -48 -8 229 13 94 19 43 -40 18 -61 -31 56 -26 -48 -115 -73 -173 91 84 -114 -41 220 -50 239 136
3198A36p8k6j0j35J37J5j9r8J35r2j6J2p6Q4qmm9J31J43l2l00Q4J79J13j21L4
$$ 136 58 32 22 -113 24 39 20 -78 57 -35 -51 -39 -115 -31 -39 -43 -92 39 182 150 -150 -66 113 226 105 139
3224A39j7j21j38J35K06k28q4r5J62J48j64K16K7k95o6J23K87k47l7O3J62l06
$$ 139 122 1 -137 -2 204 -24 -108 -203 -41 107 -57 159 186 -109 -175 -52 235 -12 -49 14 176 -130
3246a30J95Q9k80M2J38J34j56k53J89J35J03n6k68R6J0L5j66K18J9N6n7k2M8j40
$$ -130 65 154 -126 -84 54 188 32 -221 -32 103 206 150 -118 -22 -12 23 -143 75 94 150 93 71 119 -21
3270b1R8j00J02j07N9j5M9k29J31L4l5j36J10J66j06J19l59K03M9M4j21J82j10
$$ -21 77 -23 79 -28 31 16 65 -164 -33 1 -34 -170 -60 106 0 119 -240 -37 12 56 -65 117 7
3293GO5j29P2Qj45K58n3J10l47q2K49j31N2N1K31k13j93J45K82k31J30j66L5M9
$$ 7 72 -57 15 23 -122 136 83 193 -154 -236 13 -118 -66 -15 216 3 -190 -45 237 6 136 -30 5 54
3317E4m7L5k1r7J32K03l20r6j43L27qj23J00j5j36K68j47J27q3L8Q1k71J92o7
$$ 54 7 42 21 -76 56 259 -61 -157 -300 27 19 -104 -4 -19 -155 113 -34 93 10 48 129 -142 50 -17
3341a7J97j54j33K25j79P5j20K58K3j63j30J12J87l91J41o1K49j81K15r0n6j08
$$ -17 180 26 -107 118 -61 14 -106 152 175 12 -118 -6 181 -210 -69 -130 119 -62 153 63 7 -101
3363a01L2N1j0J58j66R5l3p7Q8k5j82M5J84j34m0M58j60k98J37j32K82k92L50
$$ -101 -69 -18 -28 130 -36 59 26 -51 37 12 -170 -125 59 -75 -115 343 183 -115 22 -110 172 -120 230
3386B30j85k73K90k29K37j77J02P7j35l8J22j79J18N7j35n0J08J3K03m0j50K54
$$ 230 45 -228 62 -167 70 -107 -5 72 -63 -101 21 -158 -40 17 -118 -168 -60 -47 156 116 -34 220
3408B20Q4j56n3l0J1j04j80L92j47j46K60k68K49k44j07J57J60pK35m05L10k85
$$ 220 304 148 95 65 76 -28 -208 184 37 -109 151 -117 132 -112 -219 -62 98 91 326 -79 231 -54
3430e4k04L10j32r4J19k16K61o2K6k1o1K4O4M0N4r6K0J88r5O5j97J24p6j37n5
$$ -54 -258 52 -80 -174 -55 -271 -10 -72 -46 -67 -128 -104 -40 0 54 -42 -22 166 71 136 -61 63 -13 -150 -205
3455b05K93j15j81l3L19j00K1k51J99J21j91j91K07Mj09L76m5M4k38M7J95l81
$$ -205 88 -27 -208 -241 78 -22 -1 -252 -53 68 -123 -314 -107 -103 -212 164 119 163 -75 -28 167 -214
3477b14J64P2k2J0OM6o2N3o1k07O1J46J7q6J97r4m8J57j96N2j4k7j16K38k93J06
$$ -214 -50 22 0 10 16 62 0 53 -8 -215 -154 -8 9 -77 120 26 -22 135 -61 -9 -23 -50 -166 72 -221 -115
3503a15Q0Q0r4N6L3n6J59l4j25m1J95k08N9J1NK04k36q6J02j61K42M1ML2k88J16
$$ -115 -35 45 -49 7 40 -16 143 109 -16 -57 138 -70 -11 0 5 209 -27 -113 -11 -172 70 111 115 147 -141 -25
3529b5j25Q6m1P1J27k12j24J26J23J01k11K40%Q7k20J91j2k33J3P1l3J1j06J94
$$ -25 -150 -64 -105 -34 93 -119 -243 -117 6 107 -104 136 136 223 3 194 182 -51 -38 33 0 11 -95 99
3553I9k75M4J10Q7j55J51m6r9j6j12K79j21n3M1J06m4r9J62j6N5k8o5n4J31j74
$$ 99 -176 -132 -22 65 -90 61 15 -84 -100 -212 67 -54 -107 -66 40 -4 -103 59 43 98 70 5 -49 82 -92
3578i2J24Q7j06P8k35K57j46j88K41L0J08l05J89l6kj02J42k06N0J86J40n05K56
$$ -92 32 119 13 91 -144 113 -33 -221 20 50 158 -147 42 6 4 -98 44 -162 -112 74 214 -291 -35
3601c5K26k40k6k1J12j14J5J46q5l2q2R0J33K5j1k51J35l7K2m2J69nj19P1j0k27
$$ -35 191 -49 -75 -96 16 -98 -83 63 -22 -54 -136 -46 87 112 101 -150 -15 -52 -30 -72 97 92 -27 44 34 -193
3627a93J75j43M4k0J52O1j95L29j04k1k45R8J54j20O2j05L9Q1M6j53J97n0j30
$$ -193 -18 -161 -117 -137 15 76 -119 210 106 85 -160 -62 92 -28 34 -71 -32 49 95 -58 139 89 -41
3650d1J28j33K03j40J8j32J40k64L18k27J33l9p5J69p6J46k72K83O6l25R0J30
$$ -41 87 -46 157 17 35 -97 43 -221 97 -130 3 -36 -111 58 -18 128 -144 139 205 -120 -30 100
3672A00j73J75j50m3qL04k96J62p2O5j1j28R7j40K64q5j82N5J6J54j10n5M6K04
$$ 100 -73 102 -48 -91 -99 205 -91 71 -1 64 53 -75 22 -118 146 61 -121 -66 -50 104 -6 -61 -15 189
3696A89k53J09N0j68j15K62k19K15q9K18l30N7J41j20o2j01J64k91J54Q9j2J11
$$ 189 -64 45 95 -73 -188 74 -145 70 -19 199 -131 -74 67 -53 -115 -216 -52 -343 -189 -100 -112 -1
3718aJ6J06RM3n8p9P9O9j66j54L5kK37j5k26J21o9J07M3j19K13k22J44j53K82
$$ -1 15 121 130 173 115 36 115 184 18 -136 -101 -103 134 119 -107 14 -55 52 95 -24 189 -33 111 -42 240
3743B40j21l0J85l18l4K3J97l12P1k02L59j82K05N1j74K21q7J20j13mn2J5r7K36
$$ 240 119 89 274 -44 -78 -55 142 -170 -99 -301 58 -124 81 132 -42 179 92 212 99 95 43 58 -39 197
3767A97j60lJ7J00O0k03j20n8P9L04j96k50J62j15K5J48J68j32j79O4L37r8j30
$$ 197 37 34 51 151 211 8 -112 -170 -91 213 17 -233 -71 -186 -161 -13 155 23 -156 -92 245 147 17
3790A7j33J15M4M8j55l0m5N2M9n5K41j86K79k80j52J69mj72o4K63k1m2N7k9j31
$$ 17 -116 -1 43 91 -64 -94 -139 -87 -38 -93 148 -38 241 -39 -191 -22 -26 -198 -262 1 -20 -62 -5 -34 -165
3815a65Q7j2K97k97K44j91O1J7j53J86k3kj96J59k0Rj01RO5q6M2J93j43o7J04
$$ -165 -78 -90 207 -90 154 -37 24 41 -112 74 51 49 -147 12 -8 1 -100 -91 -26 -112 -70 123 -20 -87 17
3840A7o2M3J75k88q8P1L05n5j53o6P9P7j89Q8m5K47j74J82j38m4j16J22j59J54
$$ 17 -45 -2 173 -115 -203 -132 173 118 -35 -101 -22 55 -134 -46 -91 156 -18 164 26 -18 -134 -12 -171 -17
3864a7j18l3K9jJ52K20j53k83K01j1l5N5J54j60P6k5j38J89k38R9K6o9K64k59
$$ -17 -135 -168 -139 -140 12 232 79 -204 -3 -14 -49 6 160 0 76 51 -87 102 -136 -37 -11 -80 184 -75
3888g5J52j96p7J09j5K4o4k6K65l3j9m0o8J43k58K38l8p4K84l18R8L0P1j15N6
$$ -75 77 -119 -196 -87 -102 -78 -142 -168 97 64 45 5 -63 80 -178 60 22 -52 232 -86 12 42 113 -2 54
3913E4j04K51k88q1K50j06r6M7o0L71l83J85lJ27j29j0R4m22K84o6J41j11L56
$$ 54 -50 201 -87 -168 82 -24 -120 -73 -133 238 -145 40 37 164 35 25 119 -303 -19 -85 56 -55 301
3936C01m01MK66k41r9L91l57L36l2l21K71mn2Q4o6R2j09l3p2%l1J46M0j89RJ64
$$ 301 -100 -96 170 -71 -170 221 -136 200 168 -153 118 114 62 146 80 172 63 30 -42 -42 -73 73 113 -76 -67 97
3962I7n1J75n21J63K19j15K06l98M18l21J66k7j12J05j37lL7l7K49j38J3J4L5
$$ 97 46 221 -300 -137 82 -33 173 -225 193 -128 38 11 -101 4 -133 -136 -99 -136 113 -25 -12 2 37
3985C7k85L01n2j03R9p2L46j65j3k35K0M6K05j61Q7L4P3j91j03k7N5J79k13K88
$$ 37 -248 53 1 -102 -3 -75 271 106 93 -142 -122 -76 129 -32 55 89 162 -29 -132 -159 -104 75 -138 150
4009A50j0k65J96Pp6k59OK12J5J35j77o5JK07j96j6K82j47mJ92m7j41r1R0N3j06
$$ 150 140 -125 71 78 2 -257 -251 -39 -24 111 -66 -131 -130 77 -119 -135 147 0 -4 188 141 0 -91 -1 52 -54
4035e4J6J0J56k20q8K07N5P4m38OJ58J24J5j70K59j96j5lK12k60J20J44q8N0j40
$$ -54 -38 -28 128 -92 -180 27 82 156 -282 -276 -118 6 21 -149 110 -86 -101 -104 108 -152 -32 112 24 74 -66
4060f6j41L89l25P8K81m48J59L2K23l85K89M0k26j07K20m2P3M4J03k62J04m6P3
$$ -66 -207 182 -143 -65 216 -232 -73 -41 182 -203 86 126 -100 -207 13 -29 44 88 191 -71 33 -13 60
4083F0J56k16r9Q1O2j86L05j52j14J83j16N2q6K29j80m0Q9m7r7J98p2o2K02Oj91
$$ 60 216 0 -99 -18 44 -142 163 11 -103 80 -36 16 -70 159 -21 -61 28 -19 -116 82 10 -52 150 156 -35
4108c5J01P9k00J04L7k40P7K15j24O5j26Q4j7J13m7j75Q4L8Q2j12J26k86L25j72
$$ -35 66 145 -55 49 86 -154 -77 138 14 79 -47 37 20 133 86 -89 -5 33 115 3 129 -157 168 -4
4132dJ45j80n8J4M6O1K4j09R0k3K00j0o6j66J21K02k08j40J42r5Q7k64L70k48
$$ -4 141 -39 -97 -83 -37 24 48 -61 29 6 206 196 130 -36 85 287 79 -61 81 -14 73 -191 179 -69
4156f9p8n6J66j59K43q4k1p4N5l6K15j34J10Nj68K06k72K75j05k39L03n6%l11
$$ -69 -147 -203 -37 -196 47 -37 -58 -132 -77 -113 102 -32 78 83 -85 121 -151 124 19 -220 83 27 27 -284
4180b84K12m2p3J57m3P2J08k56J79k0m2l6M4J22K2j39K4j58J5J06J47k8k09PJ46
$$ -284 -72 -114 -187 -30 -73 -1 107 -149 30 10 -32 -68 -24 98 120 -19 5 -153 -138 -32 115 87 -122 -115 31
4205C1k12J93M7j59J6J1J91k02k7R7L6k07K06j4R5oN3l24L99l62K26M3r7Qk29
$$ 31 -181 12 59 -100 -84 -73 118 -84 -111 -14 22 -185 21 7 102 96 149 -175 224 -138 88 131 34 42 -187
4230a87J58J56j71n1J89k74L02r5j73K10l5M9j10J04r2j87J29J3J28J91l65N6
$$ -187 -29 127 -44 -95 94 -180 122 27 -146 64 29 78 -32 72 -20 -207 -78 -65 63 254 -111 -55
4252e5k1j64N81l59Jj82M97l46j12J36J22or3r7N2J55n0q0M1P2Lj10m1M8R8j38
$$ -55 -76 -240 341 -18 -17 -199 298 -48 -160 -24 98 92 -1 -98 -46 109 59 -21 20 92 95 -15 -56 -8 90 -48
4278d8Q1K70k87J0m3n8k20M39J3k77P5J47j21j24j86K47J28k78J85o1J93r3J35
$$ -48 33 303 16 26 -17 -75 -295 144 157 -120 -45 102 -19 -143 -329 -82 46 -232 -47 -108 85 -8 127
4301A27j4O2k31O9N1k31L14j03k01M84m39o5M36m92L62j61K8R9k51p6K09J50k15
$$ 127 113 175 -56 13 64 -167 147 44 -157 327 -112 -177 259 -233 129 -32 -4 95 -156 -232 -23 127 -88
4324h8j7j1K81k27l3k5O1P0Q4j65K22Pk22j9j1j31J67J50j56m6M1K31k31J13q
$$ -88 -105 -116 165 -62 -95 -120 -59 11 95 -70 152 159 -63 -82 -93 -224 -57 93 -63 -109 -68 163 -68 45 37
4349C7J01N6k47m1p4J67K24j04j40K26l15J04P0L9l40n3J93J08J00j98JQ5n6R2
$$ 37 138 194 -53 -94 -168 -1 223 119 -21 205 -110 -6 64 103 -237 -290 -97 11 111 -87 -86 -1 -57 35
4373C5k2M9R0p3p5R0JQj87QO9J52j89J29l3j32K02k16K94l45J72q7J15N9k29K92
$$ 35 13 62 152 79 4 94 95 103 -84 -76 -7 145 -44 85 52 -80 122 -94 200 -145 27 -60 55 114 -115 177
4399A77k28J79j28rj15K94l03K33p9R9q5jL7j40J55j25J69j25j6j33O2l9n7K75
$$ 177 -51 128 0 -9 -124 170 -133 100 21 120 35 34 71 -69 86 -39 130 5 -11 -144 -82 -121 -178 97
4423I7J5j21Q6J03l60M9K28j83K30r6J1j53n1N0L3j06J36R5j85P4L1n9J46j04
$$ 97 112 -9 77 180 -180 -131 97 -86 144 48 59 -94 -145 -95 -62 -168 -32 63 -122 -48 -17 -76 70 -34
4447c4Qn3Q2l79K32n9P8K03k25J99k45M8L08l22J95m7n6K42K4N7m22J74M6q7K8
$$ -34 -26 -79 3 -376 -144 -203 -125 78 -147 52 -193 -145 163 -159 36 -11 -67 175 199 256 -166 8 54 -33 -5
4472eJ92m5j13l2L8m2l4J23l3p0L0N9p3K6j03J03k2j70P7JO1J05p7PQ0nk36J69
$$ -5 187 142 29 -3 35 -7 -41 82 49 -21 9 68 -5 21 -82 21 -1 -171 -94 -93 -32 73 -4 3 83 78 -158 11
4500A1K0M5Q1k03J94l51K84k63J64P9Q2l42K40j30p7K22j9n0J07j2L6k23P1l5
$$ 11 31 76 157 -46 148 -203 81 -182 -18 61 143 -199 41 -89 -166 56 37 -13 94 82 118 -105 -34 -69
4524f9P8L7J30k83P3L8k29L31j56m8K92l28J01j16K66j43n2J51j22Q2j38Q9K43
$$ -69 9 46 176 -107 -34 4 -225 106 -50 -98 194 -134 -33 -149 117 -26 -78 73 -49 33 -105 -16 227
4547B27l03K64n5k80M6L27j99%j29J7qJ34k12L57j75j12J6M1j66K61j48j4K6L0
$$ 227 -76 188 133 -147 -101 226 27 27 -102 -85 -93 41 -171 186 11 -101 -85 -44 -210 51 -97 -111 -85 -55
4571e5J97k92kK31J34j35Q9k68J99j85j42J45J02Qk1l8Jp1K00j70p6j0N1J57J20
$$ -55 142 -150 -152 79 213 78 167 -101 98 -87 -229 -84 18 26 5 -33 -32 -103 97 -73 -149 -159 -108 49 169
4596A69j73K46l51O1Ql2R9J16n4j45j38j5L96l00J29q6O9kJ86j82Q0j16n9O9r9
$$ 169 -4 242 -109 -48 -40 -72 27 143 89 -56 -194 -209 187 -113 16 -70 -1 -3 183 1 81 -35 -94 -25 -124
4621a24J47k5j34K11q5QJ33j12k9p6l1K40k76K79r0j02j1j3K16j97J04p0K0R5
$$ -124 23 -2 -136 75 -10 -2 131 19 -10 -86 -117 123 -153 126 36 -66 -77 -90 126 -71 33 -37 -17 78
4645G8k47J53M4J47o0M7l61N1J86j09q8P6LJ67j53J64j49k4N8J53j00J48m1j77
$$ 78 -169 -16 28 175 115 162 -199 -148 38 -71 -159 -83 -80 87 -66 98 -51 -75 -17 136 36 184 143 -34
4669c4J2j33J86J00k58M7L60j04k78J52m9p6J7O5J33j89J67j21j05J21J85k54
$$ -34 -22 -155 31 131 -127 -80 280 176 -102 50 1 -75 -58 7 140 -49 118 -3 -108 13 198 -56
4691e6p3K99j80M4M6o2p3Kj2J63L1q6k46N09m04J85q3k84L70n9K44l05N1p5k27
$$ -56 -129 170 -10 34 80 18 -55 -53 -65 98 129 43 -203 306 -98 87 4 -280 90 31 275 -30 21 -54 -281
4716b81L04J71k53kQ1J5M1j26j0K0j2jl8k8O6oo2J98j39n9q5K07k8L1k64J56j7
$$ -281 23 194 -59 -61 20 35 76 -50 -60 -40 -52 -53 -91 -119 -53 -59 -121 77 -62 -121 -206 1 -27 4 -260 -104 -121
4743a21J49j44J03j16J09Q6k26L14l57K35j01J59mN3j24R2j49n0k5l8j34L02j68
$$ -121 28 -116 -13 -129 -20 66 -160 154 -203 32 -69 90 86 139 15 107 -42 -92 -117 -155 -289 13 -155
4766a55K35K0M0kj47p0Q8N6J7q9m4L10k76K56l34L8o9J34N4q4j29P2J75l9k3j16
$$ -155 80 100 140 138 -9 -79 9 65 82 -7 -51 259 -17 239 -95 -57 -126 8 62 -22 -151 -79 96 57 34 -82
4792h2J05j58k9K39k54L72k24l6j08K10j1l00K09QR6J58k28L7J29R4j18p8J01
$$ -82 23 -135 -164 75 -179 193 -31 -67 -175 35 24 -276 -67 -59 37 195 -33 4 133 227 109 31 132
4815A32q6j54j00L60l45J68K27j60j29K81j18M4k41J60j04J79j26j69K58j35J12
$$ 132 46 -108 -208 152 -193 -25 202 42 -87 194 76 120 -121 39 -65 114 -12 -181 77 -58 54
4836E4po6n6P2k7J14j64J27M9j48NJ89q4J4pL9j63M1N9l7O0J16j40N1p8j00J75
$$ 54 47 -19 -75 -3 -30 84 -80 47 96 -52 -47 142 58 72 65 104 -59 -18 41 4 64 180 40 91 13 -87 88
4863H8l01K37K3n8Kn7R5nK5J43k88Q9K86k71J9k06J05m4J55j26N5J06j39K51k21
$$ 88 -213 24 47 -11 -9 -66 29 24 49 192 -96 -7 279 8 27 -179 -74 -118 37 -89 -34 72 -67 184 -37
4888c7J92j48o0o9J18J38j65J56j21Rk18L81k3k05O7m1J9j98K10j9k18K49J29
$$ -37 155 7 -53 -122 -4 134 -31 125 4 13 -205 176 153 -52 15 -26 -7 -205 5 -14 -232 17 146
4911A46q0q3J84j07r7J9l8J52R5j01j00K15j75J57k51P0O6rlk56J40J83k15J49
$$ 146 66 -17 167 60 -37 -18 -56 96 191 90 -10 205 30 187 -64 6 72 63 60 -196 -56 127 -88 61
4935F1J68k89j3OR6n9P7k6J9K04j98J39k56K66k0k2l0k85K29Q7j71K64j36k0j57
$$ 61 229 -60 -73 -67 29 -30 47 21 40 244 46 185 -71 195 175 153 123 -162 67 154 -17 247 111 91 -66
4960f6rJ78j13K7j55L1L17j58j65K10m45L63k05L54j96J7P4j4Q2J0k72K1K69k9
$$ -66 -75 103 -10 17 -138 -107 210 52 -113 97 -348 15 -190 164 -32 -15 59 45 127 137 -135 -114 155 126
4984A26k7k5k5k62K87j69oK01l18K88K1k00K00p7M0j89J08K31k91j31K51J54j22
$$ 126 99 74 49 -213 74 -95 -101 100 -218 70 91 -109 91 14 54 -135 -27 204 -87 -218 33 187 65
5007F5l3k7j91P2J39J0n5O1p9J07j62rJ6J0J05J03m0n2j70j63J08L19j43j29L6
$$ 65 32 5 -186 -114 25 35 -20 41 -38 69 -93 -102 -86 -76 29 132 92 40 -130 -293 -185 134 -9 -138 -102
5032a02Q1J28k1k14j2Q7R2j8o7n9K3K01K2m1o2J6j59R2kK8k1O4J0k14K20o1j00
$$ -102 -21 107 86 -128 -140 -53 39 21 -46 -105 -82 119 141 100 38 54 -105 -13 -15 13 -8 56 66 -148 72 11 -89
5059h9J47j96K06pj81j28L12o1Jr4J11J30k78r4K91r0K3M9q0r2L36j86o5O8j49
$$ -89 58 -138 68 61 -120 -248 64 3 4 -90 21 151 -127 -221 70 -20 3 52 -28 -120 216 30 -35 33 -116
5084a16J88P9k8m6j29LP8m3J0J0K80m19K01j95J99N5j94J66j32l0k6J29p0Q5k3
$$ -116 72 151 123 77 -52 -49 29 -14 -4 6 286 -133 68 -127 72 127 -67 99 -33 -63 -89 40 -30 55 32
5109C2o1n7J4M7K8jJ97Oj45k18J25K42l2k76L04j18k20N3p6K7K02j47l7L3J48
$$ 32 -29 -86 -72 -25 3 2 199 205 60 -158 -33 209 177 -99 205 87 -133 -80 -156 -129 73 -74 -111 -78 70
5134G0O6j28J27k38oJ0J8J9Pn8J58K7M1k21J1J42j06N7n0j36J53L9j07K40J09
$$ 70 136 8 135 -103 -109 -99 -81 -62 -55 -113 45 72 113 -108 -97 45 -61 -4 -54 -190 -37 2 -105 135 244
5159B44k45p9O7J94l54k7L23k87J75o4m9o4J75k01K72J73l08ln0o8L01q3J20j42
$$ 244 -1 -80 -13 181 -173 -200 123 -164 11 -53 -102 -166 9 -192 80 253 -55 -58 -108 -176 125 42 162 20
5183B0p2l8R8P2J41j87L7j0M7r3J56j97K63j07j7p4J35j39k66K37P7J89j49q0
$$ 20 -52 -90 8 80 221 34 71 61 108 15 171 -26 237 130 113 39 174 35 -231 6 83 272 123 43
5207D3j62K63j34Q1K8j36P%P2o5L7Q5j56K3j04kj8Q9Q0K36k41O2M5kj22J34J28
$$ 43 -119 144 10 91 119 -17 -10 -10 62 -3 34 119 -37 -14 -118 -120 -138 -49 31 267 26 88 133 131 9 143 271
5234B71r0k54P7Lj74J98J86j62j65j41K74j24k05K64K5qJ22l03K69j36q9J81m4
$$ 271 181 -73 4 7 -167 31 217 55 -110 -251 23 -101 -306 -42 -17 -25 97 -206 63 -73 -162 19 -25
5257b5j34K20J55m57K29j36K78k98Q6q6K47n6J94j78j57K7O5p1K46l31L38k9j38
$$ -25 -159 61 216 -241 -12 -148 130 -168 -82 -168 79 23 217 39 -118 -91 -26 -97 149 -182 156 127 -11
5280a1j46j05K66n6l3M5j06J18K3M4J7q3N5N4k5l0k1p0J3M8O3j94J34j74P1m4
$$ -11 -157 -262 4 -52 -85 -40 -146 -28 -5 39 56 -27 28 82 57 27 6 -64 -51 -3 60 -134 0 -174 -103 -147
5306a47j0J81o8M4J5n4J62np6PM7N9j96K7j13J22kN0O1j09J6K68l14m2p0K42k32
$$ -147 -157 24 -44 0 15 -39 123 118 42 49 96 155 -41 -14 -127 -5 -7 43 104 -5 11 279 -35 -77 -147 95 -137
5333a37K89k25P3l0J27j01N8K19k33L0k91J76p3P5q2J73RN5J9j25K51l91J05K
$$ -137 152 -73 0 -30 97 -4 54 273 40 70 -221 -45 -118 -43 -125 48 57 112 131 6 257 -134 -29 -27
5357b7J39j80j16M16k62qJ64j91j23O0P5j53K71j17J11j12m8r0J74j55K34k08
$$ -27 112 -68 -184 232 -30 -38 126 -65 -188 -128 -53 -206 65 -52 59 -53 -101 -191 -17 -172 62 -146
5379a46M6jJ34L07m8k57j47J00r9J85J48j99j86J12K13k45J80j1k52J63j20K25
$$ -146 -100 -101 33 340 292 35 -112 -12 -111 74 222 23 -163 -51 162 -83 97 86 -166 -3 -123 102
5401A02J10k79J33j40J77r1J38j41k03L4O4J96j01j12J82j71O2J68k0j16j9Ol2
$$ 102 212 -67 66 -74 103 12 150 9 -194 -160 -96 100 -1 -113 69 -102 -40 128 108 -8 -27 -21 -53
5424e3k04K56r2P0J11j66L15j40Q0o7k21N1k15L44l7j85L09q0j38M6j3L29k07
$$ -53 -257 -1 -93 -23 88 -78 237 97 177 110 -111 -60 -275 69 32 -153 156 76 -62 -16 -29 300 93
5447I3Q0j23m5J20P9k35k7J31M0j20L32m31O3J62k01Q1k19L62l37L00p0L9k09
$$ 93 173 50 5 125 204 -31 -58 73 113 -7 325 -106 -43 119 -82 -1 -220 142 -195 105 35 74 -135
5470a35J83o0J80l22K05Lk62L30m4j07q3M1N4r5L01j74L6j34L1MJ46j53J81k12
$$ -135 48 -12 168 -154 51 54 -208 122 78 -29 -112 -71 -17 -112 189 15 51 -83 -52 -48 98 -55 126 -86
5494h6L39m49J86M2j15J33j23P9K1M5J73l13M9L03p8n2p0Q9k37L0M6k8JL2J09
$$ -86 253 -196 -10 32 -83 50 -73 6 27 72 245 -68 -19 284 206 154 84 173 -64 -34 12 -16 -15 17 126
5519A26l16K13K1M9k84L76l08J27J17l44L24j66K41j97R8j47J17n8k2j3%j44J25
$$ 126 -190 23 44 93 -191 185 -123 4 121 -223 101 -65 176 -21 77 -70 47 -11 -33 -46 -46 -190 -65
5542f5J77j6J16O5k25r1q1K19J16J9j15j20J50q9k6l5r3O0l3K31N9j13j61j9J32
$$ -65 112 96 212 277 52 -39 -120 99 215 234 119 -1 149 60 34 -1 -94 -34 -67 164 223 110 -51 -70 62
5567F2P0j52l5Q2k21M31o5l15J22mM6J64j58J0K7k0J5o5J23k07pK24j0j58Q9l6
$$ 62 132 -20 -55 27 -194 237 172 -143 -21 -25 21 185 27 37 64 44 59 -6 117 -90 -97 127 117 -41 48 12
5593A2o3K76p6k27K04j70J24pm1m3J5k52K57r2OJ0L20k37n6p7J61Nj78J03k65
$$ 12 -51 225 149 -78 126 -44 80 73 32 -11 4 -248 9 -83 -77 -67 253 16 -40 -117 44 49 -129 -26 -291
5618b91M80m0j53P5P2JN8k08j02M3k43L94J1K6k63J96RmN2k16K25j24j5k89L15
$$ -291 189 149 -4 71 143 144 202 -6 -108 -65 -308 86 97 123 -140 56 65 61 113 -103 122 -2 -17 -306 9
5643Ij50J39J26j59L37l43J31l1r0J01o0m1pJ21j38J35j35j73L16J0R0j60J04
$$ 9 -141 -2 124 -35 302 -41 90 59 -31 70 10 -31 -38 83 -55 80 -55 -228 88 98 188 28 132
5666A32k00J29j07J72n0rQ6m35L61M5j33j99J50j46J45L0J13j0o3j33K03j88J89
$$ 132 -68 61 -46 126 76 67 153 -282 79 124 -9 -208 -58 -204 -59 -29 84 74 11 -122 81 -107 82
5689H2j85K10j47l9m7j4r5L35nq7rn7k1p2L05j74J40j56l7N5Oj00J63n3J53j46
$$ 82 -103 107 -40 -79 -126 -140 -235 100 95 8 -1 -58 -79 -151 154 -20 120 -36 -73 -18 -12 -112 51 -2 151 5
5715EN4M4N0j99j68L53l05J27rK48l91J33J70j11Q9j65n5J85J70m14J40R8l10
$$ 5 59 103 153 -46 -214 139 -166 -39 -48 200 -191 -58 112 1 90 -75 -130 55 225 -189 -49 49 -261
5738b61K83J25k48J57M5J08j08j21J48j91K11j21%K0j09Q5p6J1K86m12n5N2L3
$$ -261 22 147 -101 56 101 209 101 -20 128 -63 148 27 27 47 -62 23 -53 -42 244 -168 -223 -171 -138
5761a38k2K20L4p5j41P2J57j46K07k16j18N0J50l6L4N2k14L52l50K75k71J09P8
$$ -138 -160 60 94 19 -122 -50 107 -39 168 -48 -166 -116 34 -2 32 84 -130 222 -128 147 -124 -15 63
5784F3j30J41j85L68m75K21om5n8K2J24J3l3m4j3J2p1R7j79J75L0J13j05k93K69
$$ 63 -67 74 -111 257 -218 3 -3 -48 -106 -84 40 53 20 -24 -37 -25 -96 1 -178 -3 27 140 35 -258 11
5809A1nL9j06q9J30N7P3j16j64l5N88k44r4J5r0q4Q7K37l54L62l38J75j41J80
$$ 11 6 45 -61 -150 -20 37 110 -6 -170 -205 383 139 45 60 -30 -114 -27 210 -144 218 -120 55 -86 94
5833I4L4j27N6K08k26n6j7p4K39Jj13J43k3k28M6m8J38j27l2Q1K7j13J46q1k3
$$ 94 128 1 57 265 39 -17 -34 -108 131 132 19 162 139 -89 -43 -91 47 -80 -112 -31 -4 -117 29 -52 -75
5858g5rK21j71j3J40J19j49l5Q1O7N9l15J51j51J1K01q4q1J42L6j04j7o3J55k59
$$ -75 -84 137 -34 -47 93 212 63 28 109 176 235 -80 71 -80 -69 132 48 -33 109 145 41 24 -39 116 -143
5883a43K78k99K43k36J7J67J5l2k2P3m9N9o8Q7q6l0j25J68Q7j42o8K45j59q8K70
$$ -143 135 -164 79 -157 -140 27 42 10 -12 61 12 71 3 90 4 -26 -151 17 104 -38 -106 139 -20 -108 162
5908A62l60J52K1j7l3J20j74K21K7J87k80R1j10k10K81j97L73l27n8K67k29R5
$$ 162 -198 -46 -25 -42 -75 45 -129 92 119 306 26 117 7 -203 78 -119 254 -73 -131 136 -93 2
5930BQ0K0k52o0Q7Q7k3l7J05k06L65k48Q5J4K4j2J20p6j38n5M7r1J77qp9l7J85
$$ 2 82 102 -150 -210 -123 -36 -59 -96 9 -197 168 -80 5 19 43 31 151 75 -63 -118 -71 -162 15 7 -72 -109 76
5957G6l27M83q6j50K25j17j28Q2j45p4K70M8P5k95J03m9k3J04l55L16J23j43k43
$$ 76 -251 232 146 -4 221 104 -24 58 -87 -161 109 157 232 -63 40 -9 -32 72 -283 33 156 13 -230
5980b30J88J49J0L0o2K4J63k30j76J48j17j75L47K01k88j01M02j80j93m4O9l7
$$ -230 -42 107 117 147 85 109 272 42 -134 14 -103 -278 69 270 -18 -119 283 103 -90 -134 -65 -102
6002a02j11ML23o7K8m3q1P4r9K21k17NJ39P5j06N0k8l18K03OP5k53L67k51K07
$$ -102 -213 -209 114 47 75 32 -49 25 -74 147 -70 -65 74 149 43 93 65 -253 -50 -44 31 -222 145 -106 101
6027A01J60k82P1o4j17R1R7m7J28O0p1n02M66K2j43K86k92j24P5p7K86j14j18
$$ 101 261 -21 50 -14 -131 -40 57 10 138 198 127 -375 91 113 -30 256 -36 -160 -85 -162 124 10 -108
6050a08J90p9J27q1j3K34l96J29j09J74n3L5M2j41J80k05J65j36J60n0j10q5J92
$$ -108 82 3 130 49 36 270 -126 3 -106 68 15 50 92 -49 131 -74 91 -45 115 65 -45 -130 62
6073F2j58K32k35K52k73ON6J57k73N1J72j7m5o1J74j72J71j39R3j06J80j04j09
$$ 62 -96 136 -99 153 -120 -114 -58 99 -174 -123 49 32 -13 -74 100 -72 99 -40 53 -53 127 23 -86
6096h6J31r3RJ07q0J11k3k15K00j40J45J07j40m1j25K11qQJ6m1J61j47j38j61
$$ -86 45 -48 -39 68 -12 99 76 -139 61 -79 66 173 33 -8 -133 78 70 78 94 53 214 67 -71 -232
6120b32K69J90o1j13l53K59j85L76l18k3J44Q6K64k83m3o6L03N4j29l29J35j2
$$ -232 37 227 166 53 -300 -41 -226 150 -168 -191 -47 39 303 20 -23 -89 214 268 139 -190 -55 -67
6142f7Q7o3j35K5K21nj07j9K88j21L1j03k8J14j4J40j65r8KO4L2k40K19j31J12
$$ -67 20 -43 -178 -153 68 63 -44 -63 225 104 135 32 4 118 104 244 79 -19 -17 47 79 -161 58 -73 39
6167C9j14mj08J34Q9r2l6M9Q7m1k25J35m2K75n4k10J93j47q4P2O3k8O3J07k24
$$ 39 -75 -79 -187 -53 36 -56 -92 -43 44 3 -222 -87 -129 146 92 -118 75 -72 -156 -84 -21 -49 14 121 -103
6192a03K12k84K18q6q3J87j1o9J20q4O3p6r1K24k11%j65J05M9K8k18L89k77J66
$$ -103 109 -175 43 -43 -126 61 50 -19 101 17 80 4 -87 137 -74 -74 -239 -134 -85 -57 -275 114 -163 3
6216CL1j98Q1j60L82j96K02J6k37P1k27K08j9O6q3J04j55R8L7j18j0K78j80k4
$$ 3 34 -164 -83 -243 139 -57 145 161 -76 -5 -232 -24 -43 23 -60 44 -111 -13 24 -94 -104 174 -6 -30
6240c0K06j02k11J62K72j54q4j18j42K32j4P9J06j44j32J03k15L01j44O9k3J2
$$ -30 176 74 -137 25 297 143 59 -59 -201 31 17 96 202 58 -74 29 -186 115 -29 40 17 29
6262B9j50K2J60l7L1K20n66L65j31J45r9Q5K02j79o8q6m1M6p9J36L2l2J37j40
$$ 29 -121 -99 61 24 55 275 -291 74 -57 88 -11 74 276 97 29 -57 -98 -52 -131 5 37 5 142 2
6286BK01l13J68j54K17j56Q4j25J05n4n8J79Q8j32j21m0K69Mj72J7J22Pj51k03
$$ 2 203 -110 58 -96 121 -35 49 -76 29 -25 -83 96 184 52 -69 -109 160 164 -8 9 131 138 -13 -216
6310b16K92j27P1p8J63kj1mj55o0K73j50j57J19J02%l80K48K03k25P0K54j77k11
$$ -216 76 -51 20 -58 105 103 92 88 -67 -127 146 -4 -161 -42 60 60 -320 -72 131 -94 -24 230 53 -158
6334a58R7QJ53L0Pk52O8J8P5kj12N9jJ70k08J5Q2Q2p0j76K53j95N9rk3LL5J27
$$ -158 -61 -53 100 130 137 -115 -47 -29 46 44 -68 -9 -10 160 -48 -33 49 131 61 -115 138 -57 2 -7 -30 -27 8 135
6362A35L6j42j71L52j5o7r9N3j02j74MJ09o2K14J2R2r5k24R1j34K54j23j78J52
$$ 135 171 29 -142 210 195 128 29 82 -20 -194 -190 -81 -143 71 83 175 80 -144 -53 -187 67 -56 -234 -82
6386h2K92k22K62l82Q6M7P7l6p7N1k58P2M8P9k82M18o3j62MK8R6K34l44L13l12
$$ -82 210 -12 250 -132 -46 1 78 42 -35 16 -242 -170 -122 -43 -325 93 30 -132 -128 -100 -4 230 -114 199 -113
6411a13P6J60Rk46J03M1p8K8J35j59J54j39K71k72L0Jk69M48k07lK8j57K2J97
$$ -113 -37 123 132 -114 -11 30 -48 -20 115 -44 110 -29 242 -30 0 1 -268 180 -27 -30 -2 -159 -137 60
6435F0m39K67O6n7N6nk3L05m51K20k23K37k9K8L5j97J65j86J75j15P2P6Lo5k0
$$ 60 -379 -112 -46 -103 -47 -52 -75 230 -221 -1 -224 13 -16 12 47 -150 15 -171 4 -111 -39 37 40 -25 -45
6460d5J29k8R5k74J11K62k57k33M15j04M1j6j56P5L1m7J7k54J15M3j4O0n7K44
$$ -45 84 56 151 -123 -12 250 -7 -240 175 71 112 96 -60 15 46 -1 16 -238 -123 -80 -94 -34 -91 153
6484A53k6j74rJ55j63K30l26J26p9j6L01k42p6K34k15M3j32L17J56j60j89j02
$$ 153 127 -47 -56 99 -64 166 -160 -34 -113 -129 172 -70 -146 88 -127 -84 -216 101 257 97 -92 -194
6506a94q6K66J7J08j40j18K98k37P1Q9o0k12J82mn2NrR6mp1J10Kr4q6J82j37K95
$$ -194 -280 -14 3 111 -29 -147 151 -86 -15 74 14 -198 -16 -20 -72 -67 -76 20 16 -55 55 57 -37 -123 59 -78 217
6533B17k60J56k21J06L4N9j03m4K31k60K8J69j32Q5M0j92J32j6J8J07j32m8P8
$$ 217 -43 113 -108 -2 32 91 -12 -56 175 -85 -57 112 -20 65 105 -87 45 29 47 154 22 -26 52
6556E2l0Nm5O1J1j67L1l4J41n7J62k64J81j42K20j21j02J17k98K84j41j57L11
$$ 52 22 27 -18 43 54 -113 -82 -116 25 -32 130 -134 47 -95 125 4 -98 19 -279 5 -136 -293 18
6579A8M1k78Q6K86j60NN6j43J01P7J4j41N3j94L09R1j12R2L9k90L3n6P7k4m1R0
$$ 18 59 -219 -133 153 -7 -2 54 -89 12 89 103 -38 15 -179 130 221 109 201 240 -50 -17 -73 4 -20 -61 29
6605B9k5q1R5j89K42p7N2o3O8Mj32j59K63m3j52k8J60K4N0lq7R2Q6l20J35P8M4
$$ 29 4 -77 18 -171 71 -6 46 -17 51 55 -77 -236 27 -16 -168 -196 -36 -12 38 35 -52 40 126 -194 -59 19 63
6632F3j64J8J0JK33k93L00j89j9R8k09RJ99k05J27P0P6j73j2L0M4j8j9q6j68J59
$$ 63 -101 -83 -73 -72 161 -132 168 -21 -40 58 -151 -142 57 -148 -21 49 125 -48 -60 -30 14 -4 -23 -109 -277 -118
6658a18P3N9k27J77%O8K31k16L8q9J37p6P8l05K46K21n9j53K08k52M6m1j12M4
$$ -118 -45 14 -213 -36 -36 32 263 47 85 -4 133 57 135 -170 76 297 238 85 293 41 87 46 -66 -22
6682b2P2j33j10J46K19o9j47p0N1K00l5j23J21j71M3j19J44j45K31r8j4k2K62
$$ -22 50 -83 -193 -47 172 103 -44 -114 -63 137 102 -21 100 -71 -28 -147 -3 -148 83 -15 -29 -51 211
6705B11k20j0p5L3J19Oj93J23R9m5J18j68r1K69k05O1J13k04M3q7K65j60q0n8
$$ 211 -9 -19 -94 -61 58 64 -129 -6 93 48 166 -2 -93 176 -29 32 145 -59 -16 -103 162 2 -78 -136
6729a36J73J51r7j16k7Q7j51R5P3Ko4P0J45rj89j52J71P9m2q0p0J34R3k79J43
$$ -136 37 188 91 -25 -52 35 -116 -21 52 54 -10 60 205 196 7 -145 26 105 63 -17 -87 47 140 -139 4
6754DK19k55J14k57M4J63L4M5m0j73J14J38j72J07l00J01r0N1J43p9K28k06l9
$$ 4 223 -32 82 -175 -131 32 66 111 71 -102 12 150 -22 85 -215 -114 -204 -153 -10 -89 139 -67 -106
6777a06J35p5q1J19L7M0p3j14L1P1o1j1K06J59k68j57J51r2O0r5K07j39R0L74
$$ -106 29 -46 -127 -8 29 69 -4 -118 -87 -16 -77 -88 118 277 9 -148 3 -89 -29 -124 83 -56 34 408
6801D08m05q3J5M1J1K4j14j06K87Q6l16J78j99K67K7j68J57j87o1J38j1J27k87
$$ 408 3 -80 -65 -24 -13 11 -103 -209 78 164 -152 26 -173 94 121 -47 110 -77 -138 0 -11 116 -171
6824a71J52J4j66K63j02l4n0M6O4j08K37k25J67k84J86J7J0J08M2K2lk17M6j6
$$ -171 -19 -5 -171 92 -10 -44 -94 -48 16 -92 145 -80 87 -197 -11 6 16 124 166 188 185 -32 14 -2
6848bk7N5M6r2Nj14N0J80L6o2j33J72k09J44o9k9J16q5J07mM8l3k97K33Rj46P3
$$ -2 -29 26 72 -20 -15 -129 -79 101 137 75 -58 114 -95 49 -20 -49 67 -18 89 85 133 100 -197 36 45 -101 -28
6875b8R9j59J83k6L0pN3j49K60m10J91J10l14K36l9j37J33J42l25K91j18k5j17
$$ -28 71 -88 95 69 99 92 145 -4 256 -154 37 147 -167 69 30 -107 26 168 -157 134 16 -9 -126
6898a26J16j56K26l4j21R4J74k70q0M58k70k20K56O7j38K2l0R2P3r4r8j4rJ56
$$ -126 -10 -166 60 26 -95 -1 173 -97 -177 281 11 -209 47 114 -24 -2 -32 60 133 39 -59 -73 -82 74
6922G4Jm5KM2M0k44J94O5R4l07P3n6J26L1m68M28j08O2n2L9m7p2J00n8Q0n8R8
$$ 74 75 30 32 74 114 -130 64 129 223 -84 -11 -67 59 90 -378 50 -58 4 -48 -9 -56 -128 -28 -86 -6 -64 34
6949C4Q4q5J2k43L3K46R0k54L90m25j8o0J62J17j90K44q5p8J39j78J59j30J86
$$ 34 118 33 45 -198 -165 81 171 -83 307 -118 -136 -196 -34 83 -107 137 52 -26 113 -65 94 -36 150
6972A50o0K0m5o7o4P0Ol9R4q1j72J14L90k63%j65K05l50J62P1PJ02lR8j21j43
$$ 150 90 110 65 -2 -66 4 10 -29 65 -16 -188 -74 316 53 53 -112 93 -257 -95 -24 -17 85 82 180 59 -84
6998h4j47K9P6R1J16j3n3Ok0Q7j17l9pJ01J49j98k9M3R1k0j2j0p1Q7j71J62n4
$$ -84 -231 -202 -126 -35 81 68 15 21 1 88 -29 -68 -75 26 175 -23 -52 -9 82 62 50 40 -31 56 -115 47 -7
7025gmq4P3J47J22jl76K10j65L5P2o5J3M2J66j8J3J88k28pj63J12P5R1l72J34
$$ -7 -11 -95 -22 125 247 246 -130 80 -85 -50 22 -43 -30 12 178 160 173 361 133 126 -37 75 150 241 -131 3
7051CJ0O8l5r1J30m5q9j42L8N8J93j76KJ60m0j68j01J8p2K53O0k68L50q0L2j81
$$ 3 13 81 46 -45 85 40 -49 -191 -153 -95 98 -78 -76 84 44 -124 -225 -207 -279 -26 34 -234 116 36 68 -113
7077a13k8Q4j84J95R6j65K39j30r9J4J34j6k7N7r2M9j2rn5j72J64K40k46L3k0
$$ -113 -141 -57 -241 -46 50 -115 124 -6 -105 -91 43 27 0 57 -35 14 2 -7 -62 -234 -70 170 -76 -43 -63
7102f3j18K6L38k38j8J34m6J3j45K38j93J13k65J95o5L51j09j67k10L06k62L48
$$ -63 -181 -155 183 -55 -73 61 15 28 -117 121 -72 41 -224 -29 -94 257 148 -19 -229 77 -185 163
7124A63j28K%J4J59j83j92L5J10J00j53j3J57j93J52n4k3J3K4M4N8k45J28rJ9
$$ 163 35 37 37 51 210 27 -165 -130 -20 80 -73 -86 71 -122 30 -24 -47 -34 -10 34 92 -153 -25 -34 -15
7149a5K15k52J87j94K16p3j02M0j49K81j52J19P2k13J70p0l0j04p7J99n5kn5o9
$$ -15 200 -52 135 -59 157 84 -18 22 -127 154 2 121 193 -20 150 80 50 -54 -131 68 13 11 -44 -113
7173a13Q4J26O6j26K9J10k16k8J7j16J19j57M56j32j92J52q0m5r8j08L72j20k2
$$ -113 -29 97 163 37 66 176 -40 -68 -51 -167 -48 -205 251 119 -73 79 -1 -46 -144 -252 120 0 -22
7196b2p7%J27M1n7J5j39k2Q5m3J28j08j66J32P2j16J23K3lp0k4L1k32K47R6j09
$$ -22 -99 -99 28 69 12 27 -112 -134 -49 -92 36 -72 -238 -106 -34 -150 -27 -4 -7 -77 -101 -70 -302 -55 41 -68
7222f8PN9O9j42L3J13N3k22Q2O7k18m6J37L8n4J82NK9j61J48q2On0l0J68k46J02
$$ -68 -61 -2 67 -75 -42 71 124 -98 -16 51 -167 -213 -76 -38 -92 90 95 124 -37 111 29 35 -15 -45 123 -123 -21
7249b1M6L6M4j33M0k24L90l04m7N8K29o6J4K0j48P2m7k5J96l61K21Mm9J16j57
$$ -21 25 61 105 -28 12 -212 178 -126 -173 -115 114 48 62 82 -66 6 -41 -66 130 -231 -10 -6 -55 61 -96
7274i6N3n1J24Qm4J23p6l9R9k26M2J56k32j49J71K56r1n1M7l9O3m6k36J53P9J2
$$ -96 -43 -94 30 38 -6 117 41 2 101 -125 -83 73 -159 -308 -137 119 28 -23 24 -15 48 2 -234 -81 -2 10
7300A0k25K85J87k51j99K85q7N7k3lP7m52K93j12J72n2k36K65k52K85J64l49L32
$$ 10 -215 70 257 6 -193 92 5 62 39 36 113 -339 -46 -158 14 -38 -274 -9 -261 24 188 -161 171
7323A71j94J20j9p4j88j6L92M8m2k84K28j39J43j33J14p6J86j71n0M1k18K45M0
$$ 171 -23 97 78 4 -184 -200 192 240 198 -86 142 3 146 13 127 51 237 66 16 57 -161 84 124
7346A24j02l57L55J1j89M0J74q2j96J01j11K65Ol11K35O4o5o0K5L5l1M6Q0j6R8
$$ 124 22 -335 20 31 -158 -118 56 -26 -222 -121 -232 33 39 -272 -37 27 -38 -98 -73 -38 -69 -23 57 41 139
7371A39k00M4P4k04K20L8j24M3J6r4o9J45J79j60k60R4J51J10k02N6nK25Qk03
$$ 139 -61 -17 57 -147 73 111 -13 30 46 -48 -117 28 207 47 -213 -119 32 142 -60 -4 -9 216 224 21
7395B1RP3n2n1J39j97J00P9k02k2O3k1k7m1J92N7j12L4l1j11P4L6q3k47K87K3
$$ 21 30 103 51 0 139 -58 42 121 -81 -103 -40 -61 -88 -129 63 120 8 42 11 -100 -26 10 -73 -320 -33 -10
7421a0j59K84l9q8P3o3J25o1L7j73J00O6m4j27O8k02J51K1J68l3j56j26K40J10
$$ -10 -169 115 76 -12 61 -2 123 62 99 -74 26 92 48 -79 -11 -213 -62 -41 127 94 -62 -188 52 162
7445A62k23J83k22J75j69L06l83O6K4P1p1L2J33k57K60l34L14j81J12j58Q9J07
$$ 162 -61 122 -100 75 -94 212 -171 -105 -81 -10 -81 -49 84 -173 87 -247 67 -114 -2 -160 -71 36
7467C6Q1k10j14K07r5M5m5R4L5j32Oq0J32p6M6J48l2j36K08k37J49O8j74J12j7
$$ 36 117 -93 -207 0 -95 -50 -95 -1 34 -98 -92 -172 -40 -116 -70 78 46 -90 118 -119 30 98 -76 36 19
7492A9j8k2J48Mp6j59L50k52j74L6K52l0nj75J3R8R5l7l5n9L2j62R3r3J70J40
$$ 19 1 -21 127 131 55 -104 246 -6 -180 -144 108 78 73 -102 -89 9 104 67 32 -27 5 -157 -64 -157 13 153
7518A53k14J81r8l5L27l90P3J12q5J02m0k04K22k37M3K25k00K94l35j26J59K23
$$ 153 -61 120 22 -13 314 -76 -3 109 24 126 86 -118 104 -133 -90 135 -65 229 -106 -232 -73 150
7540A50j74J43k19J75j75J39j30M3K3L9J02j73Mq9J45j94N1l3J34m0m7J20p0M1
$$ 150 -24 119 -100 75 -100 39 -91 -48 -25 14 116 -57 -53 -142 3 -191 -140 -173 -39 -79 -126 -6 -76 -35
7564c5J93k85L21k97M12j45k48J62j32J46J76k54nQj4J00k5j58K45l7k13J23l1
$$ -35 158 -127 194 -103 309 164 -84 78 -54 92 268 14 9 17 3 103 78 -80 165 128 -85 38 7
7587GrN7j23p3J73j41J52m0J28l33J40J89q9m7J91j28k02J49k6j37K70j85q4J44
$$ 7 -2 55 -68 -141 32 -109 43 3 131 -202 -62 127 38 -9 182 54 -148 1 -25 -162 108 -77 -161 -17
7611a7M8J72j09l2O9k17n0O2j5j58K36j74J89L3j06J41q9q4j09N1K65N8k55O6
$$ -17 31 203 94 62 131 -86 -136 -74 -89 -247 -11 -185 4 37 -69 72 -17 -101 -210 -159 106 164 -91 -25
7635b5O9j7J51k74J02K5J00r0K0J56j78j23j41K62j03N%J78j89l0M5m6J58n2r
$$ -25 44 27 178 -96 6 31 131 41 61 217 39 -84 -225 37 -66 -61 -61 117 -72 -102 -57 -103 55 3 -6
7660fK80l61J09K8j78K57k55J34P7j89mj4N8O4j39K77r9j6R4k37J02n0Q0r1J97
$$ -6 274 -87 22 50 -128 129 -126 8 85 -104 -108 -122 -64 0 -139 138 39 23 117 -120 -18 -68 12 -79 118
7685A18n6j55K1k9l8O8J39o0l5j84K12K21j91n6k4J64j44q4P7J84o2j85K77k15
$$ 118 62 -93 -72 -101 -139 -71 68 8 -27 -211 1 222 31 -25 -49 115 -29 -113 -36 148 86 -99 178 -37
7709c7K45j81J71k97K6NJ03j31K2K1l9L04q1j19j0N8o5J77k99k3l5R5J01o8K51
$$ -37 208 27 198 -99 -73 -68 35 -96 -74 -53 -92 212 131 12 2 60 -5 172 -127 -150 -185 -90 11 -57 194
7734A94l11QJ18j8j41J55p0J81k9p1k75M64k30J84k64J55K84m91J77K54m13K19
$$ 194 -117 -109 9 -9 -150 5 -65 116 87 16 -259 205 -25 159 -105 50 334 -157 20 274 -139 80
7756H0m5r9K22k09J85k73J34N7J96k19J36j47j07j03K14J34k55M3J19k73M3J73
$$ 80 35 -64 158 -51 134 -139 -5 52 248 29 165 18 -89 -192 22 156 -99 -56 63 -210 -167 6
7778FK1l3N3l3j26K04j20r2J38j0o5N9M3k13K47j02J01j62K0J08m5K6K26j87j51
$$ 6 27 -6 47 14 -112 92 -28 -120 18 8 -57 2 45 -168 79 -23 78 -84 -64 44 -1 25 251 64 -87
7803h7J73n9j00N2N9l6n9rK54j87J99k85J63r1M7J40j51J7j76J35J8J58j88R8
$$ -87 86 27 -73 -21 38 2 -57 -66 188 1 200 -85 78 -13 34 174 23 40 -136 -1 17 175 -13 85
7827H5Ol27J91J6P9k3J14j98o1K12k25K44Ok09J91k22K64r0j5j40J13K3j50J55
$$ 85 91 -236 -45 -29 50 27 141 -57 -118 94 -131 113 119 -90 101 -121 143 53 38 -102 11 34 -116 39
7851C9j09M6j37K32k22J81Q3j56J37j32L8l7j44J15K16Ll60K32j93J49K05m93
$$ 39 -70 -24 -161 71 -151 30 113 -43 94 -38 0 -37 -181 -66 150 153 -207 25 -168 -19 186 -307
7873c07L63P3k69P7N7n6J42j91J64P2k76M05m45J95K0N1r2p4R0J78k99l7K1K30
$$ -307 56 129 -140 -63 -6 -62 80 -111 53 125 -151 254 -191 4 24 75 -17 -91 -1 177 -122 -159 -138 92
7897I2J3J3r0j87R8o5l7K40n7j96K32k20K75j64l3J44q0q0K18k7L7q8k23J22M6
$$ 92 105 118 28 -159 -61 -126 -163 77 20 -176 56 -164 111 -53 -86 58 -22 -102 116 89 126 38 -185 -63 -17
7922a7j8j50K72q1R2j62MJ19J4j70J78j30j27K65j00jM3j11O3M6J70k51k03K54
$$ -17 -35 -185 87 6 98 -64 -60 59 73 -97 81 -49 -176 89 -11 -12 31 -80 -17 29 199 -52 -255 -1
7946aQ6L9j95K33k11J32k11j2K57q4m4k8P0P3o5o0P9Q8p9p2P5j8j02K3J71j72
$$ -1 85 124 -71 162 -49 83 -128 -140 117 33 -11 -39 31 104 39 -21 58 146 67 -5 70 52 -50 -27 144 -28
7972b8K3j12J75l7k27K25j44J27P5K3k6M5k70J03Jn8j11M01j13q1j13J98q8On9
$$ -28 -5 -117 58 21 -206 19 -125 2 77 100 74 119 -151 -48 -47 -105 -216 185 72 -9 -122 76 -12 -6 -65
7997f5J20M0j57nK14k25J23j37N4n3J58J71l12P4K55k25j39M4j0JO8n4K3J6R4
$$ -65 55 95 -62 -67 147 -78 45 -92 -38 -91 67 238 -74 0 255 30 -109 -65 -75 -74 -6 -60 -37 -21 73
8022G3j2m3J71j76J91j89RJ95k67J23k85J16l3J93k8j01J96k04J89qj16P6K9l25
$$ 73 61 18 189 13 204 15 24 219 -48 75 -210 -94 -127 66 38 -63 133 -71 118 110 -6 70 99 -226
8046b26K31J11r5p1j36J17J49j60J14k46J84L2J55j17O6K4o6Q1j09j52L14j07
$$ -226 5 116 21 -50 -186 -69 80 -80 34 -212 -28 4 159 42 108 132 66 147 38 -114 200 93
8068I3k54J71p1L14k66k73K72o4K19o8j57K25k09J91j60J85k50L3J53M7o5L9j54
$$ 93 -161 10 -61 253 -13 -286 -14 -78 141 73 -84 141 -68 123 -37 148 -102 -69 84 131 66 105 -49
8091d9OM5k0J20j22n1k9J13j55J26J83k27m4J24p9J57j55J12j23nM6J45k27MR6
$$ -49 -43 2 -18 102 -20 -71 -100 13 -142 -16 167 -60 -104 20 -59 98 -57 55 -68 -73 -27 118 -109 -105 -9
8116iq3L15k03j96J70p6J39j66K64j70R3M5j05Q0q9j4J67k19K1n9N0N5M5K53l10
$$ -9 -92 223 20 -176 -6 -82 57 -109 155 -15 78 123 18 98 9 -5 162 -57 -36 -95 -45 10 55 308 -2
8141bJ5J03K0l27K15K5K40k52J4q7j7K9r2K46j03n2j7J41j96Q7j67J43o4J76j25
$$ -2 13 116 136 -191 24 49 289 37 51 -36 -53 -24 -116 130 27 -25 -42 99 -97 -10 -177 -34 -98 78 -47
8166d7K5J5l7j18p6M20n04L85qk4j04L3q1L07k58K35k69R6M8K05l56R4j68R8J16
$$ -47 -22 -7 -44 -162 -238 182 -322 63 55 31 -73 -40 -121 186 -72 163 -106 -10 38 243 -113 -19 -187 -89 27
8191B7
$$ Imaginary data points
##PAGE= N=2
##DATA TABLE= (X++(I..I)), XYDATA
0@%%%%%%%%%%%qJ6j6J6j6K4l2L7m5N6o5P3q8J04j21J45j69J93k24K57k91L31l76
$$ 0 0 0 0 0 0 0 0 0 0 0 0 -8 8 -8 8 -8 16 -16 21 -24 32 -33 40 -48 56 -65 80 -89 104 -120 137 -154 177 -199
34a99M24m80N42o06O77p57Q41r34J037j150J274j407J554j716J891k083K295k528
$$ -199 225 -255 287 -319 358 -399 442 -492 545 -605 669 -738 816 -900 991 -1092 1203 -1325
52a325K786l073L394l753M161m628N168n802O555p470Q610j0075J2044j4840J9154
$$ -1325 1461 -1612 1782 -1971 2190 -2438 2730 -3072 3483 -3987 4623 -5452 6592 -8248 10906
67A0906k6767M4225j63895m8140J59594p6951L9102Q9913M4271n799M7319j0475
$$ 10906 -15861 28364 -135531 -183671 -24077 -101028 -61926 27987 72258 66459 113778 103303
79A03303l8275n165J4466o0608k9176K9833o354n4606j61J0768m642l820M517
$$ 103303 65028 59863 74329 13721 -15455 14378 8024 -46582 -46743 -35975 -40617 -44437 -39920
92c9920j709L961J2186K5526M936L779L4897J9428k3824K421K5886j4275m6754
$$ -39920 -41629 -37668 -25482 44 4980 8759 43656 63084 39260 41681 67567 53292 6538
105F538j8690J915j9125k1169K126n635L215L2086O584j0175L5884L3387j7288
$$ 6538 -12152 -10237 -29362 -50531 -48405 -54040 -50825 -18739 -12155 -22330 13554 46941 29653
118B9653j0447K1816N836k2347j5470n443j1926k231N905j4728j1846J7334Q825
$$ 29653 19206 41022 46858 24511 9041 3598 -8328 -10559 -4654 -19382 -31228 -13894 -5069
131e069j2334l894R637Q997j29n89J1007J1253L596K511m743n073L597p128j9870
$$ -5069 -17403 -21297 -11660 -2663 -2792 -3381 7626 18879 22475 24986 20243 15170 18767 11639 -8231
146h231o853O064m522j4814J774J6798J164l599J1995Q130J837R336l43r543L768
$$ -8231 -15084 -9020 -13542 -28356 -26582 -9784 -8620 -12219 -224 7906 9743 19079 18736 9193 12961
161A2961N583j0830j2558K445M132q492p007K286p58R53M257l869N95J2801N623
$$ 12961 18544 7714 -4844 -2399 1733 -6759 -13766 -11480 -12238 -11285 -7028 -10897 -10302 2499 8122
176H122m621R99Q959M401p793o532L433n50o417m660l571r15K427k080l109L264
$$ 8122 3501 4500 13459 17860 10067 3535 6968 6418 1 -4659 -8230 -9145 -6718 -8798 -11907 -8643
192h643P070K867k770K737Q322r53m707J946l42k092J114k965n133J367K722l617
$$ -8643 -1573 1294 -1476 1261 9583 8630 3923 5869 5527 3435 4549 1584 -3549 -2182 540 -3077
208c077o109K020N830l025l040M901M017J497J465r54J545M196j086m973k290
$$ -3077 -9186 -7166 -1336 -4361 -7401 -2500 1517 3014 4479 3525 5070 9266 8180 3207 917
223I17J634j363o960k533L070k57j549J635K643K637K856O20k18N10K385k40m680
$$ 917 2551 1188 -5772 -8305 -5235 -5492 -7041 -5406 -2763 -126 2730 3350 3132 3642 6027 5787 1107
240A107j262L112j330l658K21P66k95L5j613o88J481J657j412k006K559M355j554
$$ 1107 -155 2957 1627 -2031 -1810 -1044 -1339 -1304 -2917 -3605 -2124 -467 -1879 -3885 -1326 3029 1475
257A475j350L440J409q34j181j180o65p96k010k271j003J578J002j460P72L952
$$ 1475 125 3565 4974 4140 2959 1779 1114 318 -1692 -3963 -4966 -3388 -2386 -3846 -3074 878
273H78P33j71P68N96K21l32j293j321m82O23k69k058K32K608p21j433M31R56j50
$$ 878 1611 1440 2208 2804 3025 2693 1400 79 -403 220 -49 -2107 -1875 733 12 -1421 -990 -34 -184
292a84r16m36M47N53R19J88j93J557J395j664j095J196p34j706j048k34mk69M47
$$ -184 -1100 -1536 -1089 -536 383 571 378 1935 3330 1666 571 1767 1033 -673 -1721 -1955 -1959 -2228 -1781
311a781K19N87J578J184j042J46J324k45j511n18jm4o18k5K4J37Q54J44j246P27
$$ -1781 -1562 -975 603 1787 745 891 2215 1970 459 -59 -60 -104 -722 -747 -723 -586 268 412 -834 -107
331a07J007r58j000P67L21P4n69L77P19qnK3m71J89N9q50m05L35J75l57k99N43
$$ -107 900 -58 -1058 -291 30 104 -465 -88 631 623 618 641 170 359 418 -432 -837 -502 -327 -684 -983 -440
353d40R33p8kQ8j52L73Oq64k35O05l53m06n5M49L54m23R5L35p0K17j95o78N94
$$ -440 493 415 413 501 349 722 728 -136 -371 234 -119 -525 -580 -131 223 -200 -105 230 160 377 182 -496 98
376I8K45l37k76L98K03M5m39r4K61j78J85q3k79J80M70n59k09K62M83k85j34m4
$$ 98 343 6 -270 128 331 376 -63 -157 104 -74 111 28 -251 -71 399 -160 -369 -107 376 91 -43 -87
398h7K98l28j52J32j24K61kj98J01M26k56j79qJ22J82k14o0J80j80K0j79K23L0
$$ -87 211 -117 -269 -137 -261 0 -2 -200 -99 327 71 -108 -116 6 188 -26 -86 94 -86 -66 -245 -22 8
421HP3j79M1m0J3K77l61M1K20j23Q6Rk8j24J65j02J26j10m3K28mj73j22mR5K19
$$ 8 81 -98 -57 -97 -84 193 -168 -127 93 -30 56 65 37 -87 78 -24 102 -8 -51 177 173 0 -122 -126 -31 188
447A88r4l16R3J59r1j5K46j16N1M2j97J45j55m2L4n6K9N4K06k44J95qO6k8k58
$$ 188 94 -222 -129 30 -61 -76 170 54 105 147 -50 95 -60 -102 -68 -124 -95 -41 165 -79 116 108 174 146 -112
472a12P9O7Kr1m7K79j31k66J13n7Q3J91j26J4P5n8k02k73N32N0k7o9J72j97J95
$$ -112 -33 34 36 -55 -102 177 46 -220 -107 -164 -81 110 -16 -2 73 15 -187 -460 72 122 95 26 198 1 196
497A96n3R6j55J44j10l04j09K49n0j68L31R4j14j9Lj56J46P7j98nP3L45l16K1
$$ 196 143 239 84 228 118 -186 -295 -46 -96 -264 67 161 47 28 31 -125 21 98 -100 -105 -32 313 -3 18
521A8PL77k24o3j90K50m00r7j62K44K30k17L16jM39Kj94j50R4Kk81j41k11L17
$$ 18 25 402 178 115 -75 175 -225 -322 -484 -240 -10 -227 89 88 527 529 335 185 279 281 0 -141 -352 -35
545c5M2j28k5Q0J68j32j98J53J7L02n29K32K7J97Q6j67l5K45M6m71L8L2j99j01
$$ -35 7 -121 -146 -66 102 -30 -228 -75 -58 244 -285 -53 -26 171 257 90 55 300 346 -125 -87 -55 -254 -355
569c55j2%L30l10L52k07N57j8n1j84J81M0O0m39n2M7j08J6j98L34k3L03l22p8
$$ -355 -367 -367 -37 -347 5 -202 355 337 286 102 283 323 383 -56 -108 -61 -169 -153 -351 -17 -40 263 -59 -137
593a37K75K10m49J31j43L80l73J01O4Q4k23J27j01j6J31l03R8j90L99o7j89K77
$$ -137 138 348 -101 30 -113 267 -106 -5 59 143 -80 47 -54 -70 61 -242 -144 -334 65 -2 -191 86
615H6L3j88K56j05N3P8J1m28l2J04K00j30k63J15K11p9k92L38j3K67j13R2R6j6
$$ 86 119 -69 187 82 135 213 224 -204 -236 -132 68 -62 -325 -210 1 -78 -370 -32 -45 222 109 201 297 281
639B81J84m32r1N5L26l67Mk07K55j17j50J64j71L55Q1k27J15N24o23o5J01J08
$$ 281 465 33 -58 -3 323 -44 -40 -247 8 -109 -259 -95 -266 89 170 -57 58 582 -41 -106 -5 103
661A03J43k24r7j70K39J93l42p6Q8K32k89j39M00m3J38j35l0L74j83j43J36q2
$$ 103 246 22 -75 -245 -6 187 -155 -231 -143 89 -200 -339 61 18 156 21 -9 365 182 39 175 93
683I3qJ7q2k39n5o0K65k71M21j0O3o1j81L10j94J65m19L16o0k35J32m7K99k27
$$ 93 85 102 20 -219 -274 -334 -69 -340 81 71 134 73 -108 202 8 173 -246 70 10 -225 -93 -140 159 -68
707f8j2o8J13m9l1M9j0J02J98oj77J94O3j22M4j74M0K16o26R2k8O7j14L99l82
$$ -68 -80 -148 -35 -84 -115 -66 -76 26 224 218 41 235 298 176 220 46 86 302 -324 -232 -260 -193 -307 92 -290
732b90K88L87k63P8j07K38j87k36qL02l54N7k03O2M78j70o2n0K30j23j0j43P3
$$ -290 -2 385 122 200 93 331 144 -92 -100 202 -152 -95 -298 -236 242 72 10 -40 190 67 57 -86 -13
755a3K38k50m0J48J89j09K0l34L17m6K10o01J64n2L70l84j5M4J57K03k74k6K35
$$ -13 225 -25 -65 83 272 163 183 -151 166 120 330 -271 -107 -159 211 -173 -188 -144 13 216 -58 -84 151
778A51J6j54j10J97K4l35J92J2o4J37K3L4k09K40K2k20k9J61j73J69j18j65K78
$$ 151 167 13 -97 100 124 -211 -19 -7 -71 66 89 123 -86 154 176 -44 -73 88 -85 84 -34 -199 79
801G9j44J61j59R6k03L03l98K64J59r7k9j88K21N3j74%K25p6p0k24l8L61r5m2
$$ 79 -65 96 -63 33 -170 133 -265 -1 158 61 32 -156 65 118 -56 -56 169 93 23 -201 -239 122 27 -15
825a5k00Q4m7P8P4j29L11j57j68K5j32L01K6q2j22J35n2j00J04O1oj32P8JJ34
$$ -15 -215 -131 -178 -100 -26 -155 156 -1 -169 -144 -276 25 51 -31 -153 -18 -70 -170 -66 -5 -11 -143 -65 -64 70
850G0k9j05l4j00J99k8J36j01Q5r0Qp2J04j35l9P1M4M9Nj35M0k31K41K99k04L9
$$ 70 41 -64 -98 -198 1 -27 109 8 93 3 11 -61 43 -92 -131 -60 -16 33 38 -97 -57 -288 -47 252 48 87
876H7j14J11l02P8K62n0j23J92k36K42J4k6n7p2L7Mj76R2R8p6j96K80m3k98K16
$$ 87 -27 84 -218 -140 122 72 -51 141 -95 147 161 135 78 6 43 47 -129 -37 61 -15 -211 69 26 -272 -56
901e6J07PJ01o0mj81L9p5J28J19k79K57q4m8N9k50J68j10J88l47M92k01l5M0n
$$ -56 51 58 159 99 95 -86 -47 -122 6 125 -154 103 19 -29 30 -220 -52 -162 26 -321 171 -30 -65 -25 -30
926c0L4M3j40k0M4K7J00j26rj58L23o7r7j12K50Q7k45N1J71J13k17j43L42j64
$$ -30 4 47 -93 -113 -69 -42 58 -68 -77 -235 88 21 -76 -188 62 149 -96 -45 126 239 22 -121 221 57
950E7P6p3m5K11m65K22O0j09K66q7j26R7J15m8K1j74o4Qj0L9J73j98j4l03M34
$$ 57 133 60 15 226 -239 -17 43 -66 200 113 -13 84 199 151 172 -2 -66 -58 -68 -29 144 -54 -68 -371 63
975F3j45O5J25o6n8P5J8o7r8n7J62j20P4p4J33q9N9p3Q9J62k97j4J19J66k15p8
$$ 63 -82 -17 108 42 -16 59 77 10 -88 -145 17 -103 -29 -103 30 -59 0 -73 16 178 -119 -133 -14 152 -63 -141
1001a41K79r4M3k28K3L82j64o2R1q6k40J1J6J20J55j28q0R6K58k77J67M3l30L8
$$ -141 138 44 87 -141 -118 264 100 38 129 43 -197 -186 -170 -50 105 -23 -103 -7 251 -26 141 184 -146 -108
1025a08K11j30q8J7l3J09j58L0R6NK22j16k19K95q8j2j21J44L10l52j76J52l4
$$ -108 103 -27 -115 -98 -131 -22 -180 -150 -54 -49 173 57 -162 133 45 33 -88 56 366 14 -162 -10 -44
1048d4rk3J39k27J91l39K84l7K1N4n3K06j44L3J49k69mJ66r6k11J47j85l9K95
$$ -44 -53 -76 63 -164 27 -312 -28 -65 -44 10 -43 163 19 52 201 -68 -72 94 -2 -213 -66 -251 -290 5
1072Ej91L50k94J91k9j49J68j16J65J43j91N9O2q4q6k28R1K2j75J40n8M07j9r2
$$ 5 -186 164 -130 61 32 -117 51 -65 100 243 52 111 173 89 3 -225 -134 -112 -287 -147 -205 202 183 91
1096I1rr4J98J45m17J60p3J51k92m8L35j91J11J25k21K8k79L08j78L33k40J08
$$ 91 82 -12 186 331 -86 74 1 152 -140 -188 147 -44 67 192 -29 -1 -280 28 -150 183 -57 51
1118E1j89K45j80L80l63R5J83j84j58J20J69k72L4o7J27J16k73K00N0k2j5k35
$$ 51 -138 107 -73 307 -56 39 222 38 -120 0 169 -103 -69 -136 -9 107 -166 34 84 62 47 -188
1140a88J20R8J06k2j12J9k20L21k22J36N4o2K04k30K04j07j98J71K19p6o3j36
$$ -188 -68 30 136 114 2 21 -199 122 -100 36 90 28 232 2 206 99 -99 72 291 215 152 16
1162A6j10J22rJ3q1Ol9J67j48j37n3K76r0NQ1j14K36Q2j54j01m7P6k6l2J35q1
$$ 16 -94 28 19 32 -49 -43 -82 85 -63 -200 -253 23 -67 -62 19 -95 141 223 69 -32 -79 -3 -29 -61 74 -7
1188gk7J33j3j99L06k48R1r5jL85l89J79j36K6J14j14p7k3J48P2ml62K54j55N4
$$ -7 -34 99 86 -113 193 -55 36 -59 -60 325 -64 115 -21 5 119 5 -72 -95 53 125 121 -241 13 -142 -88
1213h8K7lL53k25k31K20j16pJ20k9m5j96J04K72j57p3J4m3J1K66j74M2J32l78
$$ -88 -61 -64 289 64 -167 53 -63 -70 50 21 -24 -220 -116 156 -1 -74 -60 -103 -92 174 0 42 174 -204
1237b04K33O6j11Q1K07j97K4m1j13J94j6j4k24L34k37m3J43L3l6k58Q6K22N0L0
$$ -204 29 95 -16 65 272 75 99 58 -55 139 123 109 -115 219 -18 -61 82 115 79 -179 -93 129 179 209
1261B09j37j20R3K8k4k11l2K13Lj52J33r6q8P8J03j04J19J72p2n0k11K25k1k02
$$ 209 72 -48 45 73 49 -162 -194 19 22 -130 3 -93 -181 -103 0 -104 15 187 115 65 -146 79 58 -144
1285a44J20po1R6K6J12r3k58K10Q5N1k11K14p8k5J96j86k4K21j65j2j95J15r5
$$ -144 -24 -31 -92 4 30 142 49 -209 1 86 137 -74 140 62 37 233 47 23 244 79 67 -128 -13 -108
1309a08P0r5J31p1j45J45J96p1k25K76j46J9J45o4k4k67K06J69P3m38J82K00k8
$$ -108 -38 -133 -2 -73 -218 -73 123 52 -173 103 -43 -24 121 57 33 -234 -28 141 214 -224 -42 158 130
1332A30r7mJ06q7oj3o1K2J10J2l22r2L22j20K00q8K2q9J10p2k9jJ41l14M25k1
$$ 130 33 29 135 48 42 29 -32 -10 100 112 -210 -302 20 -100 100 12 34 -55 55 -17 -46 -47 94 -220 205 184
1358A84k09n4J19L0k55L37j57J22k42O6k25M28k06p6K51J2j31j55K42mq6J42j51
$$ 184 -25 -79 40 70 -185 152 -5 117 -125 -59 -284 144 -62 -138 113 125 -6 -161 81 77 -9 133 -18
1381a8K29j46l9j16J20j90R2o0J76K48l54J38l1p4K11k58R9N4O5J5k39J34k33
$$ -18 211 65 26 -90 30 -160 -68 -128 48 296 -58 80 49 -25 186 -72 27 81 146 161 -78 56 -177
1404a77J57l3q0Q0K22l13J15p8K09j03J56m9k74O8O5J45j96M8R0l7k11M8J26J52
$$ -177 -20 -53 -133 -53 169 -144 -29 -107 102 -1 155 106 -168 -100 -35 110 -86 -38 52 15 -196 -148 -22 130
1428A30l27J32m3J37j5j6k12K81O3k35M0OO0m3J81k90K70n0P2k58m5K07J27k93
$$ 130 -197 -65 -108 29 14 -2 -214 67 130 -105 -65 -59 1 -42 139 -151 119 69 141 -117 -162 45 172 -121
1452a21K18j86J7J87j56J6M4j78K78k38Q0p9l2K67k23J85j07J79p8j06jj59K13
$$ -121 97 -89 -72 115 -41 -25 19 -159 119 -119 -39 -118 -150 117 -106 79 -28 151 73 -33 -34 -193 20
1475B0q6MJ07k38J32k3P8p1qn0J13p2J74p6q4M8rP4Rj67J91k70K76mr4L1r9Q7
$$ 20 -66 -62 45 -193 -61 -84 -6 -77 -85 -135 -22 -94 80 4 -80 -32 -41 33 42 -125 66 -204 72 68 -26 5 -94 -7
1503gJ07oj11O0o7r0J24j5L6J09q2j42K04j69q3R9J28o9j57J92l3Q0J1j09p9K48
$$ -7 100 94 -17 43 -24 -114 10 -5 31 140 58 -84 120 -49 -132 -33 95 26 -131 61 28 108 119 10 -69 179
1529A79o9j10j68N8j07K6Q1J53j89j20L28j95J92R3l7k64J03J64j41J26j23P6
$$ 179 110 0 -168 -110 -217 -191 -110 43 -146 -266 62 -133 59 152 115 -149 -46 118 -23 103 -20 56
1551E6jj9p3r2J07j20J13J55l90J7P5J50J09O7j60q5m2J74j17k92M26J34k73p7
$$ 56 55 36 -37 -129 -22 -142 -29 126 -264 -247 -172 -22 87 154 -6 -91 -133 41 -76 -368 58 192 -81 -158
1575a58L31o9l21J55J21l6r5J22J38o8j77M9r2M9L60m47j13K99l7j52q7J19K21
$$ -158 173 104 -217 -62 59 23 -72 50 188 120 -57 -8 -100 -51 309 -138 -251 48 11 -141 -228 -109 112
1598A12o1j05R1q8M0P6m6Q9n2r9j93QJ97J26j0j81m8P7OJ49k1j68J32jj96R4K34
$$ 112 51 -54 37 -51 -11 65 19 108 56 -43 -236 -228 -31 95 85 -96 -144 -67 -61 88 67 -101 31 30 -166 -72 162
1625A62j99K6L2P7k00R5j54L63r0o3nJ21q1ko8m5N0J04Kk28J34k98K22j62J24
$$ 162 -37 -11 21 98 -102 -7 -161 202 112 49 44 165 84 82 14 -31 19 123 125 -103 31 -267 -45 -207 -83
1650h3n5R5P9o0Kj4L8r2J34j21r0K17j15M5K34k93j46L79k96J95PJ71l10k46K18
$$ -83 -138 -43 36 -24 -22 -36 2 -90 44 -77 -167 50 -65 -20 214 -79 -225 154 -142 53 60 231 -79 -325 -107
1675a07J43k15J20J26k7l6N3K09j19n0j44J16j78M24k13Ol97K83R6r6J00n4O1
$$ -107 36 -179 -59 67 40 4 57 266 147 97 -47 69 -109 315 102 108 -289 -6 90 -6 94 40 101
1698A01j1j87J29P5k73n8L33j98j00P2o6J73K7J46k94j05J48PJ57k51J43O4n8
$$ 101 90 -97 32 107 -166 -224 109 -89 -189 -117 -183 -10 17 163 -131 -236 -88 -81 76 -175 -32 32 -26
1721b6K38j23p5R5Kk54J73j09j46K47n5m4J4J97Rr1O8q8K52j51l6j64k4%Q9j26
$$ -26 212 89 14 109 111 -143 30 -79 -225 22 -33 -77 -63 134 143 52 120 32 284 133 97 -67 -91 -91 -2 -128
1747a28J47k41L36q1j51J54J55k30j34K20k16L86J69l27J9j09k7q1J13K34j80
$$ -128 19 -222 114 33 -118 36 191 -39 -173 47 -169 217 386 59 78 -31 -58 -139 -26 208 28
1768B8o9O1k2J12k4k34K85l56J27J65m3l84M84j16k3qm0R1N4j32N3k42P5K48P2
$$ 28 -41 20 -2 110 86 -148 137 -219 -92 73 30 -354 130 14 -9 -17 -57 34 88 -44 9 -233 -158 90 162
1793A62k12J6K39k55kK70k36m5R9n7L5J71l74Q6K81k97K11r1o5k04J39R4k0P8
$$ 162 -50 -34 205 -50 -52 218 -18 -63 36 -21 14 185 -189 -103 178 -119 92 1 -64 -268 -129 -35 -55 23
1817B3J1R0k46j32J86K38l98M34k89Q9k8P0j51J97O4k05P5j40J17j23J74k9k9
$$ 23 34 124 -122 -254 -68 170 -228 206 -83 6 -22 48 -103 94 158 -47 28 -112 5 -118 56 27 -2
1840bJ18j30P1r0O1J85J14n86M09k24J87k14J22o1j12J8rJ87j59K6Q0K15l92K07
$$ -2 116 -14 57 -33 28 213 327 -259 150 -74 113 -101 21 -40 -152 -134 -143 44 -115 -89 -9 206 -186 21
1864B1L2l9L6k77J91P9M3r2M3o1j34J0J95pN5k1j17o1K39j08J5j3j29N3N0o6J36
$$ 21 53 14 50 -227 -36 43 86 -6 37 -24 -158 -148 47 40 95 74 -43 -104 135 27 42 29 -100 -47 3 -63 73
1891G3Qk02J9L14l86R4L6K52j06r9K2j28o4K79j48j5J75k39n6J29o6K42p7q8J78
$$ 73 81 -121 -102 212 -174 -80 -44 208 102 3 25 -103 -167 112 -36 -51 124 -115 -171 -42 -108 134 57 -31 147
1916A47k38M8J12k26M4O4J7o9Q3m6J40r0o2j29K01j14K09L2l7j34R2q0j27Q0K13
$$ 147 -91 -43 69 -157 -113 -49 -32 -101 -18 -64 76 -14 -76 -205 -4 -118 91 123 86 -48 44 -36 -163 -83 130
1941A30k35J62r3P4o8N3J78j14j30J73q3R5q7M5k37Q7M2k29L19q6j9j76J93J22
$$ 130 -105 57 -36 38 -30 23 201 87 -43 130 47 142 55 100 -137 -50 -8 -237 82 -4 -23 -199 -6 116
1965A16k06j86J18K63j38Q2j84K18r8k5j81K25r2Q9K7n5J63l59K93r7q7K80k74
$$ 116 -90 -276 -158 105 -33 49 -135 83 -15 -40 -221 4 -88 1 28 -27 136 -223 70 -27 -114 166 -108
1988a08J16j55j6L05l78L04nj02LL9l0j0P2M3m9o0O4N2k53K46q2mk6O7J29k32
$$ -108 8 -147 -163 142 -236 68 63 -39 -36 3 -27 -37 35 78 29 -31 33 85 -168 78 -4 -8 -34 33 162 -70
2014g0O5J58p2R6k19k7J31q4k43L71k59J58r3K16j82q6M11k78l1J20k05kJ58j58
$$ -70 -5 153 81 177 -42 -69 62 -22 -265 106 -153 5 -88 128 -54 -140 271 -7 -38 82 -123 -125 33 -125
2038a25N2l6Q3m2jJ45R0k42p1R5o8M3K90l75J47j61L81k70j3J87Rk72J34P3L2
$$ -125 -73 -109 -26 -68 -69 76 166 -76 -147 -52 -120 -77 213 -162 -15 -176 205 -65 -78 109 118 -154 -20 53 85
2063H5q4KR3L9j0k07k29J85J2K49K4k96L4K48pJ6k26j72L32j76K64j03m6j16J86
$$ 85 1 3 96 135 125 -82 -311 -126 -114 135 159 -137 -103 145 138 154 -72 -244 88 -88 176 73 27 -89 97
2088I7l09K66m5k64J53K54k53J70o9mJ97j30J76l44Q8J24r6k30J50J9J00k17o0
$$ 97 -212 54 9 -255 -102 152 -101 69 0 -4 193 63 239 -105 -17 107 11 -219 -69 -50 50 -167 -227
2111b27K57j22J17J40K4l73L44j38P0R0j5j87r7J64Pj58J71q2j72K53K1k5l1j3
$$ -227 30 -92 25 165 189 -184 160 22 92 182 167 -20 -117 47 54 -104 67 -15 -187 66 87 62 31 18
2135A8Q2j17k1P8r1q1J55p3P1L7m5j4n0J54j54K2j00j63K98n8J13k75L8J91L2
$$ 18 100 -17 -38 40 -51 -132 23 -50 21 58 13 -1 -51 103 -51 -29 -129 -292 6 -52 61 -214 -176 15 47
2160D7r2r3j7L42j41o1J94m18K01p7j46L59r4N2l7Rj7N8k7j55lJ22P0q4k10K79
$$ 47 -45 -138 -155 187 46 -15 179 -239 -38 -115 -261 98 4 56 19 28 11 69 42 -113 -116 6 76 -8 -218 61
2186F1k78K44k3P5j3n6j8l7j60J99L5jm4M9J31l04K94j82q5j2K0J22m3j2J57n9
$$ 61 -217 27 4 79 66 10 -8 -45 -205 -6 29 28 -16 33 164 -140 154 -28 -113 -125 -105 17 -26 -38 119 60
2212F0k1k73L74j29j60J04n5J72j24p1J32Q6j91K97j49o7M5N4O5k15k4J53q5J52
$$ 60 39 -234 140 11 -149 -45 -100 72 -52 -123 9 95 -96 201 52 -15 30 84 149 -66 -90 63 -22 130
2236A30j91J19o6K34k04j28J56o8J06L0k83K1K70j45lN9o1k3l7j9K19j09M4m5
$$ 130 -61 58 -8 226 22 -106 50 -18 88 118 -165 -144 126 -19 -22 37 -24 -47 -84 -103 116 7 51 6
2260Fj41L0K25l52J89M2m4l4j27J85k25L12n4Pr8L9L8r4R7J58k31K22l17Q3J43
$$ 6 -135 -105 120 -232 -43 -1 -45 -79 -206 -21 -246 66 12 19 -79 -40 -2 -96 1 159 -72 150 -167 -84 59
2285E9m8q8QJ28m8P5J6q5J06r8j02N2k11J95j37K23J17q2j18J92j46M4m7l6M8
$$ 59 11 -77 -69 59 11 86 102 17 123 25 -77 -25 -236 -41 -178 45 162 80 -38 154 8 52 5 -31 17
2310A7j01M7J80j00J7k47K11q0J90r0R9j48o5j04J70j34L50l11J45L3j27L7j72
$$ 17 -84 -37 143 43 60 -187 24 -56 134 44 143 -5 -70 -174 -4 -138 212 -99 46 79 -48 -11 -183
2333a83J86j12L00k94J70j15J17l4J0N4l9k1J2k38J03J32JJ8k43K67k55J49Q4
$$ -183 3 -109 191 -103 67 -48 69 35 45 99 60 39 51 -187 -84 48 49 67 -176 91 -164 -15 69
2356F9j10J73r6J60k38k5K54j71K1m7J46j84k6J82k36rL7J9L1Q7Q0p6k09J46L45
$$ 69 -41 132 36 196 -42 -67 187 16 37 -10 136 -48 -74 108 -128 -137 -100 -81 -50 37 117 41 -168 -22 323
2381C23k50m4j45J01p6J91l24J59K27l04K70N3j12r0j20Q3Q0q9K00k35j2J56p
$$ 323 73 29 -116 -15 -91 100 -224 -65 162 -142 128 181 69 -21 -141 -58 22 -67 133 -102 -114 42 35
2404C5J21J7k92P9O9n3Q4j27j37K31J01j56M6J25K1j70J04j5J0p1R9k45L04j21
$$ 35 156 173 -119 -40 29 -24 60 -67 -204 27 128 -28 18 143 164 -6 98 83 93 22 121 -124 180 59
2428E9j91j48K51J06l54L50k06J29m5o6O7j7k69K50J08j3P4j86o3J85J13j95K87
$$ 59 -132 -280 -29 77 -277 73 -133 -4 -49 -115 -48 -65 -334 -84 24 11 85 -101 -164 21 134 -61 226
2451B26l95O4J71n7j46R7r8L65j68k45J24O8K45l00K12r7j71J23J2j3J31j16%
$$ 226 -169 -105 66 9 -137 -40 -138 227 59 -186 -62 6 251 -49 163 66 -105 18 30 17 148 32 32
2474C2j7l0O3j82P4o0L13j99q1J97J51m22K0J41k6J09j82Lp2K22k26L66o3j55
$$ 32 15 -15 48 -134 -60 -120 193 -6 -87 110 261 -161 -141 0 -26 83 -99 -96 -168 54 -172 194 131 -24
2498b4J70k90J47P7r8pk5J9J78j64M3l2l2m3J19j62J50l3j4Q2J6j62J03j28j8
$$ -24 146 -144 3 80 -18 -25 -50 -31 147 -17 26 -6 -38 -81 38 -124 26 -7 -21 61 77 -85 18 -110 -128
2523a28O8J28m1k08K3N2P2n9K3k3K16o7pr9J89k19K27j07q1J28k31J46N9k45K23
$$ -128 -60 68 27 -181 -158 -106 -34 -93 -70 -93 123 56 49 -50 139 -80 147 40 -41 87 -144 2 61 -184 39
2548C9n9P3O0j75J35k72K26j14L30j32K7k73L00o7j05p4N8M2k04M85j28j44l77
$$ 39 -20 53 113 -62 73 -199 27 -87 243 111 138 -135 165 98 -7 -81 -23 19 -185 300 172 28 -349
2571c49K07o9L20k77n4J69J86j52j76J03R4N4j74p3L89j67j95L06j05j73J45J5
$$ -349 -142 -211 109 -168 -222 -53 133 -19 -195 -92 2 56 -118 -191 198 31 -164 142 37 -136 9 24
2593B4o6q1O7O8j53K14k33K73o0q0J31O0k66K34k57J48J79k92k1Q2M1M2o2k37
$$ 24 -42 -123 -56 12 -141 73 -160 113 53 -27 104 164 -102 132 -125 23 202 -90 -111 -29 12 54 -8 -245
2617b45J53J39k03k7J58k43M11k49J74M2j75o0L2l9K27j72pJ78j47J20J36k12
$$ -245 -92 47 -156 -183 -25 -268 143 -106 68 110 -65 -125 -93 -132 95 -77 -84 94 -53 67 203 -9
2639iRj00K01P2M8l6n13K27L3O3N5j93L00j12k0J97j54j26l1O3j6j90K48jn21
$$ -9 0 -100 101 173 221 185 -328 -101 -68 -5 50 -143 157 45 25 222 68 -58 -89 -26 -42 -232 16 15 -506
2664e06N65J17j90j4K24k05O7q9j29p1J66m4J57Qj88J4r4Q4K17k01p5J73N0J21
$$ -506 59 176 -14 -28 196 -9 58 -31 -160 -231 -65 -109 48 56 -132 -118 -212 -128 89 -112 -187 -14 36 157
2688A57k85J47j0p3j64L87k51J47J1j92m5K25r0M2j13R7M7j04M0j4o6k1J16j72
$$ 157 -128 19 9 -64 -228 159 -92 55 66 -126 -171 54 -36 6 -107 -10 37 -67 -27 -41 -107 -128 -12 -184
2712a84J08p6K01j14N4k3J45j14M0n8O1K6m7K26m31K34k4k45J62R3k33J00j01
$$ -184 -76 -152 49 -65 -11 -34 111 -3 37 -21 40 66 19 245 -186 48 24 -221 -59 34 -199 -99 -200
2735b00m9J00J05q6L62k97N8J69j52Oj64L55m24K74n8j15N5j43L9J66J23j47o9
$$ -200 -249 -149 -44 -130 232 -65 -7 162 10 16 -148 207 -217 57 -1 -116 -61 -204 -165 1 124 -23 -92
2758i2P2N7k50J23K21o1Qk82K29M6k10L08j49p6P2j25K17p0k2m0Q5l8k5np6J61
$$ -92 -20 37 -213 -90 131 70 78 -204 25 71 -139 169 20 -56 16 -109 108 38 16 -24 61 23 -2 -7 -83 78
2784G8L2K2P9l97K26L1l73K12J12M3K7j2j85R7j71K91r2P8O4k01K26j2l11L4K3
$$ 78 110 132 211 -186 40 71 -302 -90 22 65 92 80 -105 -8 -179 112 20 98 162 -39 187 175 -136 -102 -79
2809g9J52L8j15O9k28R0K43k69J26J8J1r4k9J36j28O0k6j5J19o3nJ33q9o6l1R5
$$ -79 73 111 -4 65 -163 -73 170 -99 27 45 56 -38 -67 69 -59 1 -25 -40 79 16 11 144 55 -11 -42 53
2835E3o9J53j94K5K50k73M6q7M4K39j75j79K92j13J88k82K94p4l4k24P7P8r2M6
$$ 53 -16 137 -57 -32 218 -55 -9 -96 -52 187 12 -167 125 12 200 -82 212 138 104 -120 -43 35 -57 -11
2859a1J74L3l50m4K28j70K05J24k13n0j02J71j48N9K37oj76J8p5O3L1P9o1j20
$$ -11 163 196 -154 -198 30 -140 65 189 -24 -74 -176 -5 -153 -94 143 137 -39 -21 -96 -33 -2 77 16 -104
2883a04K09l4k1O0j06j85j22K49j10J63j54l7J74k1r8Q1J26k83K73P6k08M2k6
$$ -104 105 71 50 110 4 -181 -303 -54 -164 -1 -155 -192 -18 -39 -137 -56 70 -213 60 136 -72 -30 -56
2906e6j07K26R7k15R2q2j47L64k94J36O1J0j69l7oM6N0Q3m1j40J89q9O2o4J23
$$ -56 -163 63 160 -55 37 -45 -192 172 -122 14 75 85 -84 -121 -127 -81 -31 52 11 -129 60 -29 33 -31 92
2931I2n4j72L51l56M3M7p4J07p2L3k9R6L8n0P6k30J34P6n9K6K2r1n3K61j94J47
$$ 92 38 -134 217 -139 -96 -49 -123 -16 -88 -55 -84 12 50 0 76 -154 -20 56 -3 23 45 -46 -99 162 -32 115
2957A15R1k87J53k52K07k2J10n9j0pQm3M0N3q7Q0j32J40j70R0j21J01j93K17j9
$$ 115 206 -81 72 -180 27 5 115 56 46 39 47 4 44 97 10 90 -42 98 -72 18 -103 -2 -195 22 3
2982Cj34Q9J56P3j28k96L09j30j7L8K13n8k32J08KK7n9j05j0K11m1q3L9Q4j61
$$ 3 -131 -42 114 187 59 -237 72 -58 -75 -37 176 118 -114 -6 -4 23 -36 -141 -151 60 19 -64 -25 59 -102
3007a02O5j95J98j69L30o2p6Q3j89o8K58j05J7J84l36L17k18nJ97j90j0J18k43
$$ -102 -37 -232 -34 -203 127 65 -11 72 -117 -185 73 -32 -15 169 -167 150 -68 -73 124 -66 -76 42 -201
3030b01J64j57O7J61j59l4J36q8k16M14k7k21J40J60o6J8j20O3K1p5N2J87r9m9
$$ -201 -37 -194 -127 34 -125 -159 -23 -111 -327 87 60 -161 -21 139 73 91 -29 34 55 -20 32 219 120 71
3054G1P2j73p3N7QJ49M6l45J53J88p2P4k26j52J10L38l23O2J1K2k24M44K2j76
$$ 71 143 -30 -103 -46 -38 111 157 -188 -35 153 81 155 -71 -223 -113 225 -98 -36 -25 -3 -227 217 239 63
3078F3q4M6J65j97L3k65K48j12P9q2L1J12Mj44J96j2m8m5K42l52J21j21k7O6q4
$$ 63 -21 25 190 -7 26 -239 9 -103 -24 -106 -75 37 41 -103 93 81 33 -12 230 -122 -1 -122 -149 -83 -167
3103a67J51k03J8L18l5j8k51K99R0n6j11m4O9l6J72k56J19n9p5K7J88j69O1j26
$$ -167 -16 -219 -201 117 82 64 -187 112 202 146 35 -9 60 24 196 -60 59 0 -75 -48 140 -29 32 -94
3127i4J97p8Q8j3j58J52J79j56n9l9j88J47p9j08L07J28m03K9K12o0K2Qj64J08
$$ -94 103 25 113 100 -58 94 273 117 58 19 -169 -22 -101 -209 98 226 -177 -148 64 4 26 34 -130 -22
3151b2l1K25l14K35k10J50K29l17K55k43j1l1J95j39J37j82M1o7Q2J28j60j40
$$ -22 -53 172 -142 93 -117 33 262 -55 200 -43 -54 -85 110 -29 108 -74 -33 -100 -18 110 -50 -190
3173a90J40J35k06K7N9N6j37J67m2K1J3J7j54J8R4K1JJ17k6l61J60J8Q1o3mN1
$$ -190 -50 85 -121 -94 -35 21 -116 51 9 30 43 60 -94 -76 18 39 40 157 131 -230 -70 -52 29 -34 -38 13
3199A3J16j59j61L11j58J40j32o7K82l84K00r0m0J49j09K23K0Q2l3k97l8K50k78
$$ 13 129 -30 -191 120 -38 102 -30 -97 185 -199 1 -89 -129 20 -89 134 154 236 203 -94 -132 118 -160
3222a60j2j1K47j50R6j80J46K24j93L6MN6j84o3J98j94R0QOj09K32L0n3K2R9r6
$$ -160 -172 -183 64 -86 10 -170 -24 200 7 43 47 103 -81 -144 54 -140 -50 -42 -36 -145 87 117 64 86 185 89
3248H9K8o3j73K75p3J3k56P1J12R6p8l02K51p4J15K02l25J35j70J5K43j34r2p6
$$ 89 117 54 -119 156 83 96 -160 -89 23 119 41 -261 -10 -84 31 233 -92 43 -127 -112 131 -3 -95 -171
3272a71L5J73j23r5J16j85J60J08j64j3J81J06j12O6j94o3J34l9J93j23j3j78
$$ -171 -136 37 -86 -181 -65 -250 -90 18 -146 -159 22 128 16 82 -112 -175 -41 -80 113 -10 -23 -201
3294b01J00N7j05K70j12m5J28m86N30qO6r1O6k19m4J44p0j72Q7M5J96l3l30L40
$$ -201 -101 -44 -149 121 9 -36 92 -394 136 128 194 103 169 -50 -94 50 -20 -192 -105 -60 136 103 -227 113
3318A13q6J18k14K6l2P1nk1J26k18M31j99O5l09J5K32kr9J6Q2K2k36J91k54J46
$$ 113 27 145 -69 -43 -75 -4 -9 -30 96 -122 309 110 175 -134 -119 113 111 12 28 110 132 -104 87 -167 -21
3343b1l58M00n7P4jp1m4O1M2j58K24j53K17J2j35p9J55k42J6J79j24j93J08J88
$$ -21 -379 21 -36 38 37 -34 -78 -17 25 -133 91 -62 155 167 32 -47 108 -134 -118 61 -63 -256 -148 40
3367D0k7L9j79N4O9R1K44l80m4K37k24J49J2j83J52j57J84j92O3L07k05P4l5l3
$$ 40 13 52 -127 -73 -4 87 331 -49 -93 144 -80 69 81 -102 50 -107 77 -115 -52 255 50 124 89 56
3391E6j44rK17k56K70j50j53J97K3Oj12k87K11M6k6J35m3j46J89N0j68J94k24
$$ 56 -88 -97 120 -136 134 -16 -169 28 51 57 -55 -342 -131 -85 -111 24 -19 -165 24 74 -94 100 -124
3414a24R8l5J14k14nK21j71J91QO9k20J01J47j26k1j87O6J45M3J14j34q9m5J03
$$ -124 -26 -61 53 -161 -166 55 -116 75 83 152 -68 33 180 54 33 -154 -88 57 100 214 80 -9 -54 49
3438D9j86L27k81J29R4o9j56N5j6K8J93k07K64j59m8m5j1J2J23j12M0p6K00lj70
$$ 49 -137 190 -91 38 132 63 -93 -38 -54 -26 167 -40 224 65 17 -28 -39 -27 96 -16 24 -52 148 145 -25
3463b5J13j64K3k5M3O3j21K49j83O9J5o1j57L10k95j3N0L00J0l21O3J28j37Q8
$$ -25 88 -76 -53 -78 -35 28 -93 156 -27 42 57 -4 -161 149 -146 -159 -109 191 201 -120 -57 71 -66 22
3487B2J15j97K5JJ10j08L6J1l27L63n9k63L49k02J57j2lj60L2J17K9j46K13o2
$$ 22 137 -60 -35 -34 76 -32 4 15 -312 51 -8 -271 78 -124 33 21 18 -142 -110 7 36 -110 103 41
3511D1J25j86RM7l20K33Pk26K40J67r6J70j95J45j78M8m9mk8M02m11R5J20m08
$$ 41 166 -20 -11 36 -284 -51 -44 -270 -30 137 41 211 16 161 -17 31 -18 -22 -50 352 -59 36 156 -252
3535b52M57k59K76k03J13j83J2l1M1N8l7J2OL2j02o1J63N4R4k24J55j0l94L81
$$ -252 205 -54 222 19 132 -51 -39 -70 -29 29 -8 4 10 42 -60 -121 42 96 190 -34 121 111 -283 98
3559I8p1m5J10j54mK52j60mj11q8L35m3J24k95J28J72o05M36j77m5L12j37n3P6
$$ 98 27 -18 92 -62 -66 186 26 22 -89 -177 158 115 239 -56 72 244 -361 75 -102 -147 165 28 -25 51
3583E1j33m0N0n3j76J37K82k9R2j63R2N7m13L32p5j30J30jP8r8J24j02l6rj12
$$ 51 -82 -122 -72 -125 -301 -164 118 89 181 18 110 167 -246 86 11 -119 11 10 88 -10 114 12 -24 -33 -145
3608a45J04J08r4N9l7j62PM1J05K03k50j65L20k3Ml7k07J00J39k53L04P2j48j88
$$ -145 -41 67 -27 32 -5 -167 -160 -119 -14 189 -61 -226 94 71 75 38 -169 -69 70 -183 121 193 45 -143
3632a43l1J07R4Rj9J0p5J36J3l65K87K58l62L12k10q0J30O1k49K01M6k13L06n2
$$ -143 -174 -67 27 36 17 27 -48 88 101 -264 23 281 -81 231 21 -59 71 132 -117 84 130 -83 223 171
3656A71j72M8j74J38rK4l8M2j04J55n5m7K4MJ2l7J36j45L2k84K46J21n2J46l06
$$ 171 -1 47 -127 11 2 26 -12 30 -74 81 26 -21 3 7 19 -18 118 -27 5 -279 -33 88 36 182 -124
3681a24J64j27J00k2j62J05L4O4K9j29j9M9K23j85N4q6p4J41q5j10K33q4P9j18
$$ -124 40 -87 13 -9 -171 -66 -32 32 61 -68 -87 -38 185 0 54 -32 -106 35 -50 -160 73 -11 68 -50
3705e0J74k58M7M3R2P3J10j96j27P9j21KK7K3K18p8Rj54Q9N4k09K42j78n9K88
$$ -50 124 -134 -87 -44 48 121 231 35 -92 -13 -134 -132 -105 -82 136 58 67 -87 2 56 -153 89 -89 -148 140
3730A40n6R3m3j31k9Mj13K48j38Q5j03L3m6K8l2N2j73J85j53J21J9o0J18l1j35
$$ 140 84 177 134 3 -26 -22 -135 113 -25 60 -43 -10 -56 -28 -60 -8 -181 4 -149 -28 -9 -69 49 18 -117
3755a17P6J17Lm6q7r3L52l50K27j06P4l63N90k74L0R8j52J8K3j27P7K4k09L08
$$ -117 -41 76 79 33 -54 -147 205 -145 82 -24 50 -313 277 3 33 131 -21 -3 20 -107 -30 -6 -215 93
3779I3j54J79Jj22K6m9J73L6l60Q0J31L9j44P0Rjm1l8O0J21k06o3P4p2J46P1o1
$$ 93 -61 118 119 -3 23 -26 147 183 -177 -97 34 73 -71 -1 8 7 -34 -72 -12 109 -97 -160 -86 -158 -12 59 -2
3806bj82K97j8m19J54M2M3J05K4k71N9J16L1n0J7J1o1J35J82r8j42J38j03j73
$$ -2 -184 113 95 -324 -170 -128 -85 20 44 -227 -168 -52 -21 -71 -54 -43 -104 31 213 115 -27 111 8 -165
3830a65n2J16J07n8J86r9p5J07N1k14L8l4L26k62j75K58j79J97k59J98k14K77
$$ -165 -217 -101 6 -52 134 35 -40 67 118 -96 -58 -92 234 -28 -203 55 -124 73 -186 12 -202 75
3852G5k19M27m22J82q7J96j67nl1R2L7k03R6O0j15J72J7j99J82n7M23m90J48Q
$$ 75 -144 283 -139 43 -44 152 -15 -20 -51 41 78 -125 -29 31 -84 88 105 -94 88 31 454 -36 112 120
3876A20k99J89k0j34K15n6J1r2K08q8o5M3n7K02j36j67J08M5Nk1j24L5J37R5M9
$$ 120 -179 10 -10 -144 71 15 26 -66 142 54 -11 32 -25 177 41 -126 -18 27 32 11 -113 -78 59 154 203
3901B03p7k93L51%k47P8r3J85J9q1qm2p1o1L76k70P2r5K21M2l52J36k4j27K2J61
$$ 203 126 -167 184 184 -63 15 -78 107 126 45 37 -5 -76 -137 239 -31 41 -54 167 209 -143 -7 -31 -158 -136 25
3927B5J95j81J01o4k80K15p4m8o1J69k47K35J36j40M6R2j78j61K80n4j78J42J
$$ 25 220 39 140 76 -204 11 -63 -111 -172 -3 -250 -15 121 -19 27 119 -59 -220 60 6 -172 -30 -29
3950b9J50j37K15j75O9pJ61j84k63R8l2J27J53j97K2O3k2j4p4J16J08n7J09k61
$$ -29 121 -16 199 24 93 86 247 63 -200 -102 -134 -7 146 -51 -29 34 12 -2 -76 40 148 91 200 -61
3974f1P9j00J72m6J92k13J92k52J13p4k3J17o3L2J81l69J93j06ML5j76K04K6k16
$$ -61 18 -82 90 44 236 23 215 -37 76 2 -21 96 33 65 246 -123 70 -36 -32 3 -173 31 57 -159
3998a59O0K16k09J67k11j54L16j20Q3Q3q2Lp2O8jj36Q6m0J46L1l9Q0j48k6J13
$$ -159 -99 117 -92 75 -136 -290 26 -94 -11 72 -10 -7 -79 -11 -12 -148 -62 -102 44 75 36 116 -32 -58 55
4023E5J0qj02J08j84J50Q7o1j63R5oj52K34j20K01j05N8j14K9J29O6k09m2OL5
$$ 55 65 57 -45 63 -121 29 116 55 -108 -13 -19 -171 63 -57 144 39 97 -17 12 141 207 -2 -44 -38 -3
4048cj14kL78k66J65l25J57K83j35j41jj45J74p6j07J00K15j34k15K40lj81K31
$$ -3 -117 -119 259 -7 158 -167 -10 273 138 -3 -4 -149 25 -51 -158 -58 157 23 -192 48 45 -136 95
4071I5L5k73L37l52J54M5N2j36J6K16j10j93P0j68J82q9K73k19J52j16K4l2J02
$$ 95 130 -143 194 -158 -4 41 93 -43 -27 189 79 -114 -44 -212 -30 -119 154 -65 87 -29 -5 -37 65
4094F5J5j40R8j40N3J0L6j4N8k20K48j25J32k31J52p0K78L6l81K17j54J24K8j78
$$ 65 80 -60 38 -102 -49 -39 -3 -17 41 -179 69 -56 76 -155 -3 -73 205 241 -140 77 -77 47 75 -103
4118a03N6R1J58j33J46k21Qj59NK89n5j19K9q1P8j28j22M16k02l7K6j03J50L6
$$ -103 -47 44 202 69 215 -6 2 -157 -152 137 82 -37 -8 -89 -11 -139 -261 155 -47 -84 -58 -161 -11 25
4142B5k49K05m2J40O2k70J67j79LJ59J0J43kk01j08J60J43p3j86k4K26j24o8J60
$$ 25 -224 -19 -61 79 141 -129 38 -141 -138 21 31 174 172 -29 -137 23 166 93 -93 -117 109 -15 -83 77
4166G7J84l63j7K03M4k90K14M6j7j02jk10M41l02j27K68r9p1Q3J61j31rJ56M0
$$ 77 261 -102 -119 84 128 -162 52 98 81 -21 -22 -232 209 -93 -220 48 -51 -122 -39 122 -9 -18 138 178
4190A78k75R4j26O1P6J59l98M46k28J5n6k7Q3l2N0q6R5j39j0K07p7r1m0J39j93
$$ 178 -97 -3 -129 -68 8 167 -231 215 -13 2 -54 -81 2 -30 20 -66 29 -110 -120 87 10 -81 -121 18 -175
4215a75M80l47j8O9L45l70J40o5j25J89k3n1p1Q4j10q3J6J08k8Q7r2M3o1Q8oK1
$$ -175 305 -42 -60 9 354 -16 124 59 -66 123 100 49 -22 62 -48 -131 -115 -7 -35 52 -40 3 -58 30 24 45
4241D5Q3r4j42p4J90r0R3m4k5J13k36J7J76R7Qo6l27K70p3J5KJ17m0p7J05j30
$$ 45 128 34 -108 -182 8 -82 11 -33 -58 55 -181 -164 12 109 117 51 -276 -6 -79 -64 -62 55 15 -62 43 -87
4267h7K98l42J4J72P9j98J56l33J51J42q0J02l0j9j09J28j0%k5j31J98k0l52L26
$$ -87 211 -131 -117 55 134 -64 92 -241 -90 52 -28 74 44 25 -84 44 34 34 9 -122 76 56 -296 30
4291C0k5p7P9j5o3J53m9j5pJ10j36j43Q5l1J94r7j43R9P1J99l08R2J52j87l5L0
$$ 30 5 -72 7 -8 -71 82 33 18 11 121 -15 -158 -73 -104 90 -7 -150 -51 20 219 -89 3 155 -32 -67 -37
4317c7l6PL5L28r5j16p5j19n0J06R4j34J12J9P7J19j97r4J17N5j12j44L37j82
$$ -37 -73 -66 -31 297 202 86 11 -108 -158 -52 42 -92 20 39 116 235 38 -56 61 116 4 -140 197 15
4341A5O1j00p2J07M6k91K44j51J83m5j57K38j32J84m2j75J32j6j09J96j29q5K86
$$ 15 76 -24 -96 11 57 -234 10 -141 42 -3 -160 78 -54 130 88 -87 45 29 -80 116 -13 -98 188
4364A88j37j12J53Mk7k66J47L0k8J45k64R7K40l34K39l7j74K96j95r2K00J06m08
$$ 188 51 -61 92 96 69 -197 -50 -20 -48 97 -167 -70 170 -164 75 38 -136 160 -35 -127 73 179 -229
4387b29K31Lj07J73k27O6O9k00J98M4q1r4K33Rr0K72r3j59j2K06l80Q7M0K11m92
$$ -229 2 5 -102 71 -156 -90 -21 -221 -23 21 -60 -154 79 88 -2 270 177 18 6 212 -168 -81 -41 170 -322
4412c22M84N8p3k49j34K69m3j0j14Q7J70j12Qr2K78o9k19J15L9J5m6L2j1j52J18
$$ -322 162 220 147 -102 -236 33 -10 -20 -134 -47 123 11 19 -73 205 136 -83 32 71 86 40 72 61 -91 27
4437B7j48J57K41k0k65j15P0K45k20p8J95p8r9R2M4o8N7J87K3k71m9k3k15L05
$$ 27 -121 36 277 257 -8 -123 -53 192 -28 -106 89 11 -88 4 48 -20 37 224 247 -24 -73 -96 -311 -6
4461fk6O9k1J49j95J03r8J23j17K84k61M9J9j5K9j09J33J17j98m1J3J26p9J4n7
$$ -6 -32 37 16 165 -30 73 -25 98 -19 265 4 53 72 57 86 -23 110 227 29 -12 1 127 48 62 5
4486EL7o9P7pl3L3Q1j23o2N1K07p6j37Q4j68L2K45k42J39q2j87Q7jJ22j05J59
$$ 5 42 -27 50 43 10 43 124 1 -61 -10 197 121 -16 68 -100 -68 177 -65 74 -8 -195 -108 -109 13 -92 67
4512F7J34j31j38M3J4J62k61J81q0L14j13l3k94L06Q8k03p0j15J59j42J16Q6j88
$$ 67 201 70 -68 -25 -11 151 -110 71 -9 305 192 159 -135 171 259 56 -14 -129 30 -112 4 90 -98
4535i8J82k22P2P4j39J96j00p5Q8P0J09p2m5q2l9M6j04lJ3J94l6q7J72k66K46
$$ -98 84 -138 -66 8 -131 65 -35 -110 -22 48 157 85 40 -42 -81 -35 -139 -142 -129 65 29 -58 114 -152 94
4560I4j53j20L62j69j00k7N7q5J15j39mR5J53J2r3k3j97J24K15j9k20J07J32q0
$$ 94 -59 -179 183 14 -86 -113 -56 -141 -26 -165 -169 -74 79 91 -2 -25 -222 -98 117 98 -122 -15 117 37
4584C7L3k9R9j23J18l23L6R4K61k37k40J95J41K1j00J2M2k22L18k91K16k40K23
$$ 37 70 41 140 17 135 -188 -152 -58 203 -34 -274 -79 62 83 -17 -5 37 -185 133 -158 58 -182 41
4607D1n8q3K27k40O8K20k93j00K49n6K11m6j53l6K62q3Jj57r9J38l9p6J46J07
$$ 41 -17 -100 127 -113 -45 175 -118 -218 31 -25 186 140 -13 -49 213 130 131 -26 -125 13 -26 -102 44 151
4631A51k87J86N3k36L2O4o4L1K35l55K47j52J17n4n0NR2j38j37K39j48J73O5j08
$$ 151 -136 50 103 -133 -101 -37 -101 -70 165 -190 57 -95 22 -32 -82 -77 15 -123 -260 -21 -169 4 69 -39
4655c9O2L0j4j45R9J66l58M28j67j97J56k4J09R8j77L2k14j21K82l7J32Op2j2
$$ -39 23 53 39 -106 -7 159 -199 229 62 -135 21 -3 106 204 27 59 -155 -276 6 -31 101 107 35 23
4679B3p4r1K36%j33j03j3O8m7K90j7j72l0K3L2j02l35M46j39J10j2j31J69k72
$$ 23 -51 -142 94 94 -39 -142 -155 -87 -134 156 139 -33 -63 -40 -8 -110 -445 1 -138 -28 -40 -171 -2 -274
4703b74L77J09j85K06n58K46K0L40m75J71J04j43K09k26J05k34K93k63K02k1L78
$$ -274 103 212 27 233 -325 -79 -59 281 -194 -23 81 -62 147 -79 26 -208 85 -178 24 3 381
4724C81n38J0L8J50J67k48P6J25k27J59j40M3J05k37L30Jj83O0J43j27j51N5J36
$$ 381 -157 -147 -109 41 208 -40 36 161 -66 93 -47 -4 101 -136 194 195 12 72 215 88 -63 -8 128
4747A28r4j70O5J31L9K45m92K86p6o9r3K10j87Q3j02J12J24k94J16Q3j1R0j46
$$ 128 34 -136 -71 60 99 344 -148 138 62 -7 -100 110 -77 6 -96 16 140 -154 -38 45 34 124 -22
4770b2r2K68j67j1J46j89PJ18jn4l3j28O6J66j4j56K4J55j48K01j03P4l3j09N1
$$ -22 -114 154 -13 -24 122 -67 -60 58 57 3 -30 -158 -92 74 60 -96 -72 83 -65 136 33 107 74 -35 16
4795A6k76K94lO5j96J49j53J9M1J25j58J40j33J78%j35J40l4m9j34J56m6r6k09
$$ 16 -260 34 31 96 -100 49 -104 -85 -44 81 -77 63 -70 108 108 -27 113 79 30 -104 52 6 -90 -299
4819b99L66j29K02n2j55J67j42J09r3NN5Rj37R3J42p9p8P8Rj97L2L8N9Q0j48J51
$$ -299 67 -62 140 88 -67 100 -42 67 -26 -21 34 43 -94 -1 141 62 -16 62 71 -126 -94 -56 3 83 -65 86
4845H6j42L9J09q5n4km9L68k26P2r2l42L91J34l16n3K70j63P7K26m45J96j10J22
$$ 86 -56 -17 92 7 -47 -49 -98 270 44 116 24 -318 73 207 -109 -162 108 -55 22 248 -197 -1 -111 11
4869A1R1l04J23K08R8k38J49j69R9Q1j62J97r6oj46K50k06J67k21J59P7k3p2r1
$$ 11 102 -202 -79 129 227 -11 138 -31 68 149 -13 184 88 82 -64 186 -20 147 -74 85 162 139 67 -24
4893b4k01K32K50l53j0j12J75J99j20l5j55J32qJ18l9q2L8j19L1J37K15m03J92
$$ -24 -225 7 257 -96 -106 -218 -43 156 36 1 -154 -22 -30 88 49 -33 5 -114 -83 54 269 -134 58
4916E8m3j63J84n1k1M5j37K21R7r4n9l2R5k81K34J90j31n1J13o0m5l7q4K5M2m9
$$ 58 15 -148 36 -15 -36 9 -128 93 190 96 37 5 100 -181 53 243 112 61 174 114 69 32 -52 -27 15 -34
4942c4Q7o0J2p8j66M90k63Rl1O9o0j90j00K05j9P6P0J16l07J96j49J04j21K6J89
$$ -34 53 -7 5 -73 -239 251 -12 -3 -34 35 -25 -215 -315 -110 -129 -53 17 133 -174 22 -127 -23 -144 -118 71
4967G1r1j50N6M52j79l31M13l24j23K71P4n8j21J14j11K21k12J52l54K39n2k9
$$ 71 -20 -170 -114 338 159 -172 241 -83 -206 65 139 81 -40 74 -37 184 -28 124 -230 9 -43 -72
4989g2N8J8Q7j20J66N7j3j43j1P6k43L03k03o3J91r6K62k15j27K75j73J5J25K
$$ -72 -14 4 91 -29 137 194 181 38 27 103 -140 163 -40 -103 88 -8 254 39 -88 187 14 29 154 156
5013A56l9k13J48q2J49j4P7j82J06j36O6j56M6k13P6J04R4p8O0J10q5J65l37K47
$$ 156 117 -96 52 -30 119 105 182 0 106 -30 36 -120 -74 -287 -211 -107 -13 -91 -31 79 -6 159 -178 69
5037F9k08N1J75K5k59J84k09J82j60K20L7j81J97J39k41M4n3j4J34j51J24j38
$$ 69 -139 -88 87 112 -147 37 -172 10 -150 70 107 -74 123 262 21 65 12 -2 132 -19 105 -33
5059c3Q5k17J3K23N2o1l1j02m4K30jJ2k54J82l9Q6n6p5Q8P5j96j16L95m36L31
$$ -33 52 -165 -152 71 123 62 31 -71 -115 115 114 126 -128 54 15 101 45 -30 58 133 -63 -179 216 -220 111
5084A11q6k1k7p5P1P7M6k03J19r2p4L9P0J6r2l8J87p8L7M9r1P2j47J88k1q2J76
$$ 111 25 4 -23 -98 -27 50 96 -107 12 -80 -154 -115 -45 -29 -121 -159 28 -50 -13 36 -55 17 -130 58 37 -45 131
5111A31Jj07J02k56l1K04L3N8k31J98o7m2j58k9L96k76O2j8Q5k85K20l1J79k71
$$ 131 132 25 127 -129 -160 44 77 135 -96 102 35 -7 -165 -194 202 -74 -12 -30 55 -230 -10 -41 138 -133
5135a33K00J2n8K9M5J02j17oj45K06k8J44l97O7J19j36k3K43j96NJ52J74k40P7
$$ -133 67 79 21 50 95 197 80 74 -71 135 107 251 -146 -79 40 -96 -119 124 -72 -67 85 259 19 96
5159I6O3j96l8J22l2j5l5M2R7m2K2n4m4o4K08M0k75K56N3k73O8J61k79N3K04p8
$$ 96 159 -37 -75 47 15 0 -35 7 104 62 84 30 -14 -78 130 170 -105 151 204 -69 -1 160 -119 -66 138 60
5185F0n2p2K54j15k86J31l6K81jp3j57m6K26N6j39K5k59L32q6l2j6j12J17P9n3
$$ 60 8 -64 190 75 -211 -80 -116 165 164 91 -66 -112 114 170 31 56 -203 129 43 11 -5 -117 0 79 26
5210B6q9J93l86L26J57j08j34j8J36nl5n7j36K97l2l55L39j65R6j46J2m2M3M4
$$ 26 -63 130 -256 70 227 119 -15 -33 103 98 63 6 -130 167 135 -220 119 -46 50 -96 -84 -126 -83 -39
5234c9N0M7j30j05K07n8N1j14K88j04o8l1j55K42j55J95k09j88L61j53k4K77k44
$$ -39 11 58 -72 -177 30 -28 23 -91 197 93 25 -6 -161 81 -74 121 -88 -276 85 -68 -92 185 -59
5257e9N3M0Nk48K1K32M6l5k91n5M14p3m0M2J2Q7j62Ol8l3N6k4nJ25m0k82J56N4
$$ -59 -6 34 39 -209 -188 44 90 55 -236 -291 123 50 10 52 64 151 -11 -5 -43 -76 -20 -44 -49 76 36 -246 -90 -36
5285c6K29j22j76J67p1J51J9j04l00K01P2q9J28n2q6j6P6J07j08j22K58j98L9
$$ -36 193 71 -105 62 -9 142 161 57 -243 -42 30 -59 69 17 -69 -85 -9 98 -10 -132 126 -72 -33
5308c3o0L03j82pj8O4m1j17J90l3j37K3Q0q4J40j11M0j22J01L4J05p9L3Qj25J61
$$ -33 -93 210 28 21 3 67 26 -91 99 66 -71 -48 32 -52 88 -23 17 -105 -4 30 135 56 89 97 -28 133
5334A33l5j66Q6K9j6PJ98l08K77l40j33K32j00L28k60L52j25j30J19j03j06J08
$$ 133 98 -68 18 47 31 38 236 -72 205 -135 -268 -36 -136 192 -68 284 159 29 148 45 -61 47
5356D7R8k46J28j43L5O4J8KlK0P0o2N5n2M6J47l03K28P5k75P9l84L61J00j80J9
$$ 47 145 -101 27 -116 -81 -17 1 3 0 20 90 28 83 31 77 224 -79 149 224 -51 28 -356 5 105 -75 -56
5382e6J11p5J7M0n1J35q8K7k73M76j06j09Km7q4j5J58Q8r1Q6k86q3J50O7K99k34
$$ -56 55 -20 -3 37 -14 121 33 60 -213 263 157 48 50 3 -81 -96 62 150 59 145 -141 -224 -74 -7 292 58
5408E8j53J73J10k27J63k82J92J22j17n1K05j31j3j35J74j81K4r8J70J56j85M8
$$ 58 -95 78 188 -39 124 -158 34 156 39 -12 193 62 49 -86 88 -93 -69 -167 3 159 -26 22
5430B2j86K41j22N7j0K1o3K05k04j35R0J60j2k31J69R7k8n8m2Q9O7j47N9Q0j70
$$ 22 -164 77 -45 12 2 23 -40 165 -39 -174 -84 76 64 -167 2 99 71 13 -29 60 127 -20 39 119 -51
5455e1k38K66J14l5j25J72j44L2O1Q4j15k71K12j08K48j58n2J92pk40K73k61n2
$$ -51 -289 -23 91 56 -69 103 -41 -9 52 136 21 -250 -38 -146 102 -56 -108 84 77 -163 110 -151 -203
5478b03L77j28j75L2N4k06R9J83j31j75M29j25l25M46k24J18j38J19J11j04j97
$$ -203 174 46 -129 -97 -43 -249 -150 33 -98 -273 156 31 -294 152 -72 46 -92 27 138 34 -163
5499a63K68l5p3p6m8K43j98n4Q5j04J59J8O3k58m6L06p9J4J73j90L8JJ7k16J09
$$ -163 105 70 -3 -79 -127 116 -82 -136 -51 -155 4 22 85 -173 -219 87 8 22 195 5 43 44 61 -155 -46
5524d6j1M8M7k5K9k8l7J82N0k70K01j44r4J0L2J6m8K07j01J66k26m6K03j33j07
$$ -46 -57 -9 38 13 42 14 -23 159 209 -61 140 -4 -98 -88 -56 -40 -88 119 18 184 -42 -88 115 -18 -125
5549a25K41j26j60M85m17J10K23l35M1K10r0pLp2P8nj77J26J80N0j96k00K38j63
$$ -125 116 -10 -170 315 -102 8 231 -104 -63 147 57 50 53 -19 59 54 -123 3 183 233 37 -163 75 -88
5573h8q3l3M44j99o6j86J04j33K02R8o7M5j24P6j9K92m31K64Ql69L31O2k38J14
$$ -88 -171 -204 240 41 -25 -211 -107 -240 -38 60 -7 38 -86 -10 -29 263 -168 96 104 -265 66 128 -110 4
5597Dk0r2J35q9j47jL43k71J91P0n2M0p2J96k81oO1L1q3j37pJ49k24K59j54K77
$$ 4 -16 -108 27 -62 -209 -210 133 -138 53 123 71 111 39 235 -46 -52 9 40 -43 -180 -187 -38 -262 -3 -157 120
5623A20o9k46K30k39L07m3j52L14k83r9J76k36J15j57L60k97J68P2Mj3J45k42
$$ 120 51 -195 35 -204 103 60 -92 222 -61 -160 16 -220 -105 -262 98 -199 -31 41 45 32 177 -65
5645f5J64j16Mo2K87j79k79K23n8q4K78p3L2p1J43o6m6k3J21j63j17L63k08J86
$$ -65 99 -17 -13 -75 212 33 -246 -23 -81 -165 113 40 72 1 144 78 32 9 130 -33 -150 213 5 191
5669A91k02oP6j95J32r4N6j65M1J29j26l2J30j3l2j06L66k35k6Q2L7J20j32O4
$$ 191 -11 -17 59 -136 -4 -98 -42 -207 -166 -37 -163 -195 -65 -78 -110 -216 150 -85 -111 -29 8 128 -4 60
5693F0j14Q6j08P4J25J34k37k70K26J62l44L45l21J78J5J68k67N9J18j12R3p2
$$ 60 -54 32 -76 -2 123 257 20 -250 -24 138 -206 139 -182 -4 11 179 -88 -29 89 -23 70 -2
5715boK04j95j39P4J44P4k5N2l69jK87j2k66J06N9P1k35L21j99J34Qj09l1O2N5
$$ -2 -8 196 1 -138 -64 80 154 129 181 -188 -189 98 86 -180 -74 -15 56 -179 142 -57 77 85 -24 -55 7 62
5741F2m6j04k6k6J19q2K34k2j94J0R5j67J03J04l9R8m5k50R9K32j92j59J48K72
$$ 62 16 -88 -114 -140 -21 -103 131 109 -85 -75 20 -147 -44 60 21 119 74 -176 -77 155 -37 -196 -48 224
5765B24k62J11j67pm0K74m4k08o7L05M0k88J35j34M49j81j31k91M64j29j0j14
$$ 224 -38 73 -94 -101 -141 133 89 -119 -186 119 159 -129 6 -128 321 140 9 -282 182 53 43 -71
5787g1p8J87L9Nj12J66j09j33J91n1j55K8P4j13L85l00O6m4P1j4n5j36k9K33j49
$$ -71 -149 38 77 82 -30 136 27 -106 85 34 -121 -93 -19 -132 253 -47 19 -25 46 32 -23 -159 -188 45 -104
5812a04L6K2J18q2J53j14r9J91j18N6N8j09K1j09K21j54K63k57M6o6j20M65k32
$$ -104 -68 -46 72 -10 143 29 -70 121 3 59 117 8 29 -80 141 -13 250 -7 39 -27 -147 318 86
5835H6k2j4m1M4k42J40k9J77j6l%j90K89j69K4M8l25M78j97r8K9N9j19J87p6j3
$$ 86 64 50 9 53 -189 -49 -78 99 83 80 80 -110 179 10 34 82 -243 235 38 -60 -31 28 -91 96 20 7
5861GK1m7NM8pj31K88M7k99K18n7j34M3p5L19k43J21j40p1J7J40j00J35j1M0j53
$$ 7 28 -19 -14 34 27 -104 184 231 -68 150 93 -41 2 -73 246 3 124 -16 -87 -70 70 -30 105 94 134 -19
5887a9o3J18kk47K63j2q6kJ93j62k70K69n8J60j98R8J41q8L3p9P4Lj72N7j36K82
$$ -19 -82 36 34 -213 50 38 -48 -50 143 -19 -289 -20 -78 82 -116 -18 123 35 68 -11 63 66 -106 -49 -185 97
5913I7j2l43K31K07k20J13J0k18L27n4j28k9P5j47J58J06j94J10k00L72m50L53
$$ 97 85 -258 -27 180 -40 73 83 -135 192 138 10 -19 56 -91 67 173 -21 89 -111 261 -189 164
5935A64k48OK66o9k5j99P7R8M9k36K80j86J53k04l1K58k02P9kJn6R7j76K21p6
$$ 164 -84 -78 188 119 94 -105 -28 70 119 -117 163 -23 130 -74 -105 153 -49 30 28 29 -27 70 -106 115 39
5960C9o5k0Pm3m0K69k03J18j01J10k28R4m8N9R1J13k14J73k7q3j50Q6R5R6j66
$$ 39 -26 -46 -39 -82 -122 147 -56 62 -39 71 -157 -63 -111 -52 39 152 -62 111 84 1 -149 -63 32 128 -38
5985c8L20k92k47N04l60K41m35L42J70j00l64K13J19J01p0k59L4N7J60j61j40
$$ -38 282 -10 -257 247 -113 128 -307 35 205 105 -259 -46 73 174 104 -155 -121 -64 96 -65 -205
6006b05L29n8P5q6o2K23m90L77m6k60K10q6Q7K16k08M8j02m1l0Q7j79K44n9J8
$$ -205 124 66 141 55 -7 216 -274 103 57 -203 7 -79 8 224 16 64 -38 -79 -109 -22 -201 43 -16 2
6030BJ9l7K10j99J17N6l10J28r1J53j6j47J51n5M6q6O2o8J26J83k99J60r2k22
$$ 2 21 -16 194 -5 112 168 -142 -14 -105 48 32 -115 36 -19 27 -59 3 -65 61 244 -55 105 13 -209
6054b09L14j76K09k0j24K8p6J17j17J9rK73j30q0Q9j57K18k8k32J49Km16L79j3
$$ -209 105 -71 138 118 -6 22 -54 63 -54 -35 -44 229 99 19 108 -49 169 141 -91 58 60 -356 23 10
6078A0L6k04K79j98J20n7k27O6j23K82l9L2RN3m8O5n7J04k37K26r8J80M4k86j9
$$ 10 46 -158 121 -77 43 -14 -241 -175 -298 -16 -55 -23 -14 39 -9 56 -1 103 -134 92 -6 174 218 -68 -87
6103h7J81j04j44n9K58j30R9O4o4k20L19k09k4J06n2n1P9J40k81K42r6J6Q6n4
$$ -87 94 -10 -154 -213 45 -85 14 78 14 -206 113 -96 -120 -14 -66 -117 -38 102 -179 63 -33 -17 69 15
6127A5M7N3m6j54J71J5j83L3P4j5qk76K19J84p6J8j30L10l19J84j09R0l92O8J66
$$ 15 62 115 69 -85 86 101 -82 -49 25 10 2 -274 -55 129 53 71 -59 251 -68 116 7 97 -295 -227 -61
6152f1q1K66p5n3J62l54K53j74J74j81P9l8K16o1l7l8J30o4j67M51l13n3k6J2
$$ -61 -142 124 49 -4 158 -196 57 -117 57 -124 -45 -83 133 72 35 -3 127 63 -104 347 34 -19 -45 -33
6176c3J0J59j24N4p4J96j52k6k98K36J95O6j27j22k7L31n61M08k03L8P0m5J20
$$ -33 -23 136 12 66 -8 188 36 10 -288 -52 143 209 82 -40 -67 264 -297 111 -92 -54 16 -29 91
6199I1j09K77m46K65J01j2j54p6N3J14k92L7K09N5j9j45pL16k43k61n6K65J8o6
$$ 91 -18 259 -187 78 179 167 13 -63 -10 104 -188 -151 58 113 94 -51 -58 258 15 -246 -302 -37 -19 -85
6223h5P2j34J77q5R2L2k08j8J71Q7o9L0m26J97J80L08k87N5j84L5K77j84pJ04
$$ -85 -13 -147 30 -55 37 69 -139 -157 14 101 32 62 -364 -167 13 321 34 89 -95 -60 217 33 26 130
6247A30o2m9oj1l6J38k38L06m6j71K56j91j22o4J26PK0l8J3lN9N4j77l2J12K7
$$ 130 68 19 13 2 -34 104 -134 172 126 -45 211 20 -102 -166 -40 -33 -13 -51 -38 -41 18 72 -105 -137 -25 2
6273Bj0j34K83kp2j96K44k63K61j45j31J46O1o7J21l7j21J87r3J5J00j70L3j00
$$ 2 -8 -142 141 139 67 -129 115 -148 113 -32 -163 -17 44 -23 98 61 -60 127 34 49 149 -21 12 -88
6297h8J57k29J22J4j62K14j99K25j18R5J3j72L08j69o1J51j46o9M8R0k44L14k61
$$ -88 69 -160 -38 -24 -186 28 -171 54 -64 31 44 -128 180 11 -50 101 -45 -114 -66 24 -220 94 -167
6320a67J66j1j64O7p1J94k1j73P5J91r7n7R2k19K11JK4j77J24J34N8k71J91r2
$$ -167 -1 -12 -176 -109 -180 14 -7 -180 -105 86 -11 -68 24 -195 16 17 41 -136 -12 122 180 -91 100 8
6344Hm9j45J02P7k2P9L2k29K16p7p9q1K56o1q3J78k97J2J39K11m9o1K91m04P9
$$ 8 -41 -186 -84 -7 -29 50 82 -147 69 -8 -87 -168 88 27 -56 122 -175 -163 -24 187 138 77 368 -36 43
6369D3k4r5P8l1O1j85R1j07J81j81J42J0j30K15j56O8k3Q4l6J32k38K80j63Q1
$$ 43 19 -76 2 -29 32 -153 -62 -169 12 -169 -27 -17 -147 68 -88 -20 -43 41 5 137 -101 179 16 97
6393I7p8p3K26j75O4P6j84M4N2j4K7j17R3j75J79P7j06n5L9J00j78K4N5J59j43
$$ 97 19 -54 172 -3 61 137 -47 -3 49 35 62 -55 38 -137 42 119 13 -42 -3 97 -81 -57 -2 157 14
6418A4K37m30J31j19J97O6m0q7p2K15J5l8Q0j52N0m1k1L2k48J83K99j58j0p3L5
$$ 14 251 -179 -48 -167 30 96 56 -31 -103 112 127 89 169 17 67 26 5 37 -211 -28 271 113 103 30 65
6443F5j34%j45L54o2nK6o9K01l86l3K04J90k11n5P2k1j33L83j45j02J16K4j00
$$ 65 -69 -69 -214 140 78 73 99 30 231 -155 -188 16 206 -5 -60 12 -9 -142 241 96 -6 110 134 34
6467C4L9R3j61O4m9K3j65M0K61k99nL3n0J52N5k21J12n5J38P6j47J54k07o1J03
$$ 34 73 166 5 69 20 43 -122 -82 179 -120 -125 -92 -142 10 65 -156 -44 -99 39 115 -32 122 -85 -146 -43
6492d3j14K09p0J02r2J33k47l0L02k77J97J29j49M3M2j11j08K31m4p4p7R1Jk53
$$ -43 -157 52 -18 84 -8 125 -122 -152 150 -127 70 199 50 93 135 24 -84 147 103 29 -48 43 44 -209
6516b09J78j08M17j45j31K07k78L18k28l7J83k35Q0P1m3m9nK6J22r3M7k1l3o9
$$ -209 -31 -139 278 133 2 209 -69 249 21 -16 167 -68 12 83 40 -9 -14 12 134 41 88 67 34 -35
6540c5r2O3J94j02j95K34K33p4j54j08J16J27k7j82j4J46j78j31J31j84L08m7
$$ -35 -127 -64 130 28 -167 67 300 226 72 -36 80 207 180 -2 -16 130 -48 -179 -48 -232 76 29
6562B9j58K21j26mJ65m5o8j82Q1J8K11j00L6l29o8M84l73Q5J36j9J57j25J4P5
$$ 29 -129 92 -34 -38 127 82 14 -168 -87 -69 142 42 78 -251 -319 165 -208 -123 13 -6 151 26 40 115
6586A15l02J72m3J81j70N7M2L5j05Q7k32K4M01l27K45k14P1j58K06j55lJ56l5
$$ 115 -187 -15 -58 123 -47 10 52 87 -18 69 -163 -139 262 -65 180 -34 37 -121 85 -70 -73 83 48
6609D8L5j11O0O0j39O7oN6p6MP4j40R1l9K1J19l40P6L74l17J15j61L6K4J04k5
$$ 48 83 -28 32 92 -47 20 14 70 -6 -2 72 -68 23 -16 5 124 -216 -140 234 -83 32 -129 -93 -69 35 10
6635A0J01J46l37J48l28J19J29J15m9j22J02L6k16K71k85J34j16j2J64j68j9J93
$$ 10 111 257 -80 68 -260 -141 -12 103 54 -68 34 70 -146 125 -160 -26 -142 -154 10 -158 -177 16
6657A6%J82j22Nj24N1j06q7K85J9j03L1j65k00L31L1J2J58k29J9k00M00j76J71
$$ 16 16 198 76 81 -43 8 -98 -185 100 119 16 47 -118 -318 13 44 56 214 -15 4 -196 204 28 199
6681A99j14j78jJ56n7OJ11j10m9k5m4O5l2L1Mj07O4L72j71r0j60P2p6R7p7jQ0
$$ 199 85 -93 -94 62 5 11 122 12 -37 -62 -106 -41 -73 -42 -38 -145 -81 291 120 30 -130 -58 -134 -37 -114 -115 -35
6708c5N6J27j81K86l66J55r4J45k11J61Roj19J30j48o7J37m8k6J85l5J67l53J70
$$ -35 21 148 -33 253 -113 42 -52 93 -118 43 52 46 -73 57 -91 -158 -21 -69 -95 90 55 222 -131 39
$$ [...]
8191C5
##END NTUPLES=NMR FID
##END=
