##TITLE=31P_DE-80H_X3
 64 sc D2O
 26.2.2025
##JCAMPDX= 6.0         $$ Bruker NMR JCAMP-DX V2.0
##DATA TYPE= NMR SPECTRUM
##DATA CLASS= NTUPLES
##ORIGIN= UXNMR, Bruker Analytische Messtechnik GmbH
##OWNER= root
$$ XWIN-NMR		Version 3.5
$$ Mon Apr  7 14:26:56 2025 Russian Standard Time (UT+4h)  Yarkov@DPX200
##.OBSERVE FREQUENCY= 81.013821
##.OBSERVE NUCLEUS= ^31P
##.ACQUISITION MODE= SIMULTANEOUS
##.ACQUISITION SCHEME= undefined
##.AVERAGES= 64
##.DIGITISER RES= 17
##SPECTROMETER/DATA SYSTEM= spect
##.PULSE SEQUENCE= zgpg30
##.SOLVENT NAME= CDCl3
##.SHIFT REFERENCE= (INTERNAL, CDCl3, 0, 198.062)
##AUDIT TRAIL= $$ (NUMBER, WHEN, WHO, WHERE, WHAT)
$$ ##TITLE= Audit trail, XWIN-NMR		Version 3.5
$$ ##JCAMPDX= 5.01
$$ ##ORIGIN= Bruker BioSpin GmbH
$$ ##OWNER= Yarkov
$$ C:/Bruker/XWIN-NMR/data/yarkov2/nmr/P31/2/pdata/1/auditp.txt
$$ ##AUDIT TRAIL=  $$ (NUMBER, WHEN, WHO, WHERE, WHAT)
(   1,<2025-04-07 14:25:20.79 +0400>,<Yarkov>,<DPX200>,
      <created by zg, POWCHK disabled, PULCHK disabled
       configuration hash MD5:
       00 E9 B6 7A A2 85 ED C7 34 08 36 98 17 FE 4E 26
       data hash MD5: 32K
       F2 7B 5A EA A9 3E AD 55 44 98 39 35 3E BD 48 45>)
(   2,<2025-04-07 14:25:28.18 +0400>,<Yarkov>,<DPX200>,
      <Start of raw data processing
       efp BC_mod = 2 LB = 1.5 FT_mod = 6 PKNL = 1 PHC0 = 1789.316 PHC1 = 11.49541 SI = 64K 
       data hash MD5: 64K
       FB EE 5F C1 55 B2 1B 18 74 2F 7B C4 F0 06 59 4B>)
(   3,<2025-04-07 14:25:55.90 +0400>,<Yarkov>,<DPX200>,
      <pk PHC0 = -16.59782 PHC1 = 16.6 
       data hash MD5: 64K
       D2 F2 D0 D4 FE EE 77 59 EA C9 6B AE B0 E8 08 73>)
$$ ##END=
$$ 
$$ hash MD5
$$ 1D 28 D5 2C 92 AB 6F 44 8D BC 18 60 5D 98 B6 B8
##$RELAX= 
##$RELAX= 
##$RELAX= 
##$RELAX= 
##$RELAX= 
##$RELAX= 
##$RELAX= 
##$RELAX= 
$$ Bruker specific parameters
$$ --------------------------
##$DU= <C:/Bruker/XWIN-NMR>
##$EXPNO= 2
##$NAME= <P31>
##$PROCNO= 1
##$TYPE= <nmr>
##$USER= <yarkov2>
##$AMP= (0..31)
100 100 100 100 100 100 100 100 100 100 100 100 100 100 100 100 100 100 
100 100 100 100 100 100 100 100 100 100 100 100 100 100 
##$AQSEQ= 0
##$AQ_mod= 1
##$AUNM= <au_zg>
##$AUTOPOS= <>
##$BF1= 81.014009
##$BF2= 200.13
##$BF3= 200.13
##$BF4= 200.13
##$BF5= 200.13
##$BF6= 200.13
##$BF7= 200.13
##$BF8= 200.13
##$BYTORDA= 1
##$CFDGTYP= 0
##$CFRGTYP= 5
##$CHEMSTR= <none>
##$CNST= (0..31)
1 1 145 1 1 1 1 1 1 1 1 1 1 1 1 1 1 1 1 1 1 1 1 1 1 1 1 1 1 1 1 1 
##$CPDPRG= <waltz16>
##$CPDPRG1= <>
##$CPDPRG2= <waltz16>
##$CPDPRG3= <>
##$CPDPRG4= <mlev>
##$CPDPRG5= <mlev>
##$CPDPRG6= <mlev>
##$CPDPRG7= <mlev>
##$CPDPRG8= <mlev>
##$CPDPRGB= <>
##$CPDPRGT= <>
##$D= (0..31)
0 1 0 0 0 0 0 0 0 0.06 0 0.03 2e-05 3e-06 0 0 0.0002 0 0 0 0 0 0 0 0 0 
0 0 0 0 0 0 
##$DATE= 1744021520
##$DBL= (0..7)
120 120 120 11 120 120 24 19 
##$DBP= (0..7)
150 150 150 150 150 150 150 150 
##$DBP07= 0
##$DBPNAM0= <>
##$DBPNAM1= <>
##$DBPNAM2= <>
##$DBPNAM3= <>
##$DBPNAM4= <>
##$DBPNAM5= <>
##$DBPNAM6= <>
##$DBPNAM7= <>
##$DBPOAL= (0..7)
$$ [...]
##$SUBNAM3= <"">
##$SUBNAM4= <"">
##$SUBNAM5= <"">
##$SUBNAM6= <"">
##$SUBNAM7= <"">
##$SUBNAM8= <"">
##$SUBNAM9= <"">
##$SW= 400.765351723535
##$SWIBOX= (0..15)
0 1 3 0 0 0 0 0 0 0 0 0 0 0 0 0 
##$SW_h= 32467.5324675325
##$TD= 32768
##$TD0= 1
##$TE= 0
##$TE2= 300
##$TE3= 300
##$TEG= 300
##$TL= (0..7)
0 120 53 12 22 120 120 120 
##$TP= (0..7)
150 150 150 150 150 150 150 150 
##$TP07= 0
##$TPNAME0= <>
##$TPNAME1= <>
##$TPNAME2= <>
##$TPNAME3= <>
##$TPNAME4= <>
##$TPNAME5= <>
##$TPNAME6= <>
##$TPNAME7= <>
##$TPOAL= (0..7)
0.5 0.5 0.5 0.5 0.5 0.5 0.5 0.5 
##$TPOFFS= (0..7)
0 0 0 0 0 0 0 0 
##$TUNHIN= 0
##$TUNHOUT= 0
##$TUNXOUT= 0
##$USERA1= <user>
##$USERA2= <user>
##$USERA3= <user>
##$USERA4= <user>
##$USERA5= <user>
##$V9= 5
##$VALIST= <valist>
##$VCLIST= <CCCCCCCCCCCCCCC>
##$VD= 0
##$VDLIST= <DDDDDDDDDDDDDDD>
##$VPLIST= <PPPPPPPPPPPPPPP>
##$VTLIST= <TTTTTTTTTTTTTTT>
##$WBST= 1024
##$WBSW= 4
##$XGAIN= (0..3)
0 0 0 0 
##$XL= 0
##$YL= 0
##$YMAX_a= 64058
##$YMIN_a= -74486
##$ZGOPTNS= <>
##$ZL1= 120
##$ZL2= 120
##$ZL3= 120
##$ZL4= 120
##$ABSF1= 0
##$ABSF2= 0
##$ABSG= 0
##$ABSL= 0
##$ALPHA= 0
##$AQORDER= 0
##$ASSFAC= 0
##$ASSFACI= 0
##$ASSFACX= 0
##$ASSWID= 0
##$AUNMP= <proc_1d>
##$AZFE= 0.1
##$AZFW= 0.5
##$BCFW= 0
##$BC_mod= 2
##$BYTORDP= 0
##$COROFFS= 0
##$CY= -3
##$DATMOD= 1
##$DC= 0
##$DFILT= <>
##$DTYPP= 0
##$F1P= 0
##$F2P= 0
##$FCOR= 1
##$FTSIZE= 65536
##$FT_mod= 6
##$GAMMA= 0
##$GB= 0
##$INTBC= 1
##$INTSCL= 9.790993e-09
##$ISEN= 30
##$LB= 1.5
##$LEV0= 0
##$LPBIN= 0
##$MAXI= 10000
##$MC2= 0
##$MEAN= 0
##$ME_mod= 0
##$MI= 50
##$NCOEF= 0
##$NC_proc= -8
##$NLEV= 6
##$NOISF1= 182.463
##$NOISF2= 159.3651
##$NSP= 0
##$NTH_PI= 0
##$NZP= 0
##$OFFSET= 198.0616
##$PC= 4
##$PHC0= 1772.718
##$PHC1= 28.09541
##$PH_mod= 1
##$PKNL= yes
##$PPARMOD= 0
##$PSCAL= 0
##$PSIGN= 0
##$REVERSE= no
##$SF= 81.0140089999434
##$SI= 65536
##$SIGF1= 159.3651
##$SIGF2= -187.1042
##$SINO= 113.3802
##$SIOLD= 16384
##$SREGLST= <1H.CDCl3>
##$SSB= 0
##$STSI= 65536
##$STSR= 0
##$SW_p= 32467.5324675325
##$SYMM= 0
##$S_DEV= 0
##$TDeff= 32768
##$TDoff= 0
##$TI= <>
##$TILT= no
##$TM1= 0
##$TM2= 0
##$TOPLEV= 0
##$USERP1= <user>
##$USERP2= <user>
##$USERP3= <user>
##$USERP4= <user>
##$USERP5= <user>
##$WDW= 1
##$XDIM= 65536
##$YMAX_p= 364859357
##$YMIN_p= -361099532
$$ End of Bruker specific parameters
$$ ---------------------------------
##NTUPLES= NMR SPECTRUM
##VAR_NAME=  FREQUENCY,     SPECTRUM/REAL,   SPECTRUM/IMAG
##SYMBOL=    X,             R,               I
##VAR_TYPE=  INDEPENDENT,   DEPENDENT,       DEPENDENT
##VAR_FORM=  AFFN,          ASDF,            ASDF
##VAR_DIM=   65536,         65536,           65536
##UNITS=     HZ,            ARBITRARY UNITS, ARBITRARY UNITS
##FACTOR=    0.49542278885378, 1,            1
##FIRST=     16045.7642231865, 0,            0
##LAST=      -16421.768244346, 0,            0
##MIN=       -16421.768244346, -361099532,   0
##MAX=       16045.7642231865, 364859357,    0
$$ Real data points
##PAGE= N=1
##DATA TABLE= (X++(R..R)), XYDATA
$$ [...]
$$ plain form
46551 9579007 8263848 5596155 4051152 3772774 3362327 2633220 2430498 2211160 129481
46542 129481 -3825479 -6624477 -5536456 -1659169 1388731 1712372 406648 -1193713
46534 -1193713 -3432015 -6698786 -9580608 -10126340 -8172464 -5221023 -2692165 -1426702
46526 -1426702 -2052443 -4199769 -5835522 -5220742 -3443211 -3117159 -4429736 -4678549 -2502937
46517 -2502937 -310303 -857192 -3196353 -4278378 -3540730 -3286759 -4578819 -5313951 -3349418
46508 -3349418 316389 2957892 3619100 3540178 3509171 2623940 332189 -1659724 -1015948
46499 -1015948 1960556 4196611 3514007 1180817 -241539 -533043 -1529790 -3615389 -4719619
46490 -4719619 -3453329 -1300278 -373584 -442332 114708 1335399 1604720 318535 -1163815
$$ packed form
46551I579007j315159k667693j545003k78378m10447p29107k02722k19338k081679
46542A29481l954960k798998J088021L877287L047900L23641j305724j600361
46534a193713k238302l266771k881822n45732J953876K951441K528858J265463
46526a426702o25741k147326j635753O14780J777531L26052j312577k48813K175612
46517b502937K192634n46889k339161j082025P37648K53971j292060p35132J964533
46508c349418L665807K641503O61208p8922l1007q85231k291751j991913O43776
46499a015948K976504K236055o82604k333190j422356k91504r96747k085599j104230
46490d719619J266290K153051R26694o8748N57040J220691K69321j286185j482350
$$ plain form
46481 -1163815 -1507360 -948289 -357921 151936 966833 1908638 2157885 1243006 -183959
46472 -183959 -909916 -854074 -1826060 -5450936 -10212466 -12256446 -10133382 -6981951 -6149227
46463 -6149227 -6264587 -3649822 1093241 2706584 -1527631 -7526136 -9475075 -6831619
46455 -6831619 -3699913 -2791162 -2997966 -2543213 -1678538 -1532576 -2182553 -2854083 -2903226
46446 -2903226 -1812794 886225 4724898 7613789 6826715 1119285 -7809905 -15857194
46438 -15857194 -19088852 -16613683 -11078299 -6130936 -3628197 -3379504 -4490895 -5724310
46430 -5724310 -5226623 -1881664 2606463 4550218 2195267 -2122741 -4565465 -3649251
46422 -3649251 -662602 2611709 4962166 5148198 2359463 -2167461 -5453706 -5569543
$$ packed form
46481a163815l43545N59071N90368N09857Q14897R41805K49247r14879j426965
46472a83959p25957N5842r71986l624876m761530k043980K123064L151431Q32724
46463f149227j15360K614765M743063J613343m234215n998505j948939K643456
46455f831619L131706R08751k06804M54753Q64675J45962o49977o71530m9143
46446b903226J090432K699019L838673K888891p87074n707430q929190q047289
46438a5857194l231658K475169N535384M947363K502739K48693j111391j233415
46430e724310M97687L344959M488127J943755k354951m318008k442724R16214
46422c649251K986649L274311K350457J86032k788735m526924l286245j15837
$$ plain form
46414 -5569543 -3346274 -893729 563010 875556 329947 -144025 773464 3008619 4455061
46405 4455061 3597949 1910852 1719378 2328285 831453 -3093121 -5985654 -5317405 -2991322
46396 -2991322 -2346524 -3520889 -4040189 -2877821 -1472894 -960562 -535278 944463 3040038
46387 3040038 4059420 2975418 1039411 1297165 5301417 9965959 9594607 2438244
46379 2438244 -6439145 -10688520 -9499539 -6648997 -4470704 -2229888 233938 1216868
46371 1216868 207367 -922560 -754156 278166 1985684 4907584 7633631 6898578
46363 6898578 2265794 -2042759 -2249100 355321 2177121 2450026 2823403 3670287 4018255
46354 4018255 4136479 5036703 5725379 3823307 -747647 -4850149 -5422513 -2384128 1741077
$$ packed form
46414e569543K223269K452545J456739L12546n45609m73972R17489K235155J446442
46405D455061q57112j687097j91474O08907j496832l924574k892533O68249K326083
46396b991322O44798j174365n19300J162368J404927N12332M25284J479741K095575
46387C040038J019382j084002j936007K57754M004252M664542l71352p156363
46379B438244q877389m249375J188981K850542K178293K240816K463826R82930
46371A216868j009501j129927J68404J032322J707518K921900K726047p35053
46363F898578m632784m308553k06341K604421J821800K72905L73377Q46884L47968
46354D018255J18224R00224O88676j902072m570954m102502n72364L038385M125205
$$ plain form
46345 1741077 3952410 2846337 -223754 -2319181 -1999572 -435162 1114515 3036237
46337 3036237 5117959 4895548 1095304 -2851307 -2274237 2228487 5104474 2843867
46329 2843867 -2259952 -5686412 -5295751 -1907326 2068936 3870955 2599224 838093
46321 838093 1910682 5224083 6884192 5273842 2975043 2314528 2300202 1565673 1235691
46312 1235691 2599297 4441806 5094462 5028225 5044798 3982995 941449 -2059540 -2718358
46303 -2718358 -2333822 -3674425 -5886113 -5322421 -1588790 917688 -1172742 -5567269
46295 -5567269 -7310159 -4744103 -724089 1226734 469046 -782144 14340 3371794
46287 3371794 7441574 9712690 8988260 5940637 2338289 -69443 -620202 -287423 -742255
$$ packed form
46345A741077K211333j106073l070091k095427L19609J564410J549677J921722
46337C036237K081722k22411l800244l946611N77070M502724K875987k260607
46329B843867n103819l426460L90661L388425L976262J802019j271731j761131
46321H38093J072589L313401J660109j610350k298799o60515j4326p34529l29982
46312A235691J363606J842509O52656o6237J6573j061803l041546l000989o58818
46303b718358L84536j340603k211688N63692L733631K506478k090430m394527
46295e567269j742890K566056M020014J950823p57688j251190P96484L357454
46287C371794M069780K271116p24430l047623l602348k407732n50759L32779m54832
$$ plain form
46278 -742255 -2458849 -4238606 -4782856 -3766845 -1039329 3689824 9268177 12685168
46270 12685168 12035939 9073068 7043786 6653439 6095207 4573543 3442848 3604991 3935898
46261 3935898 3135643 1620145 763587 1419274 3775255 7448417 10944854 12029403 9558401
46252 9558401 4575598 -655802 -4143627 -4892541 -3450223 -2022815 -2711584 -5020891
46244 -5020891 -6242878 -4853497 -2187592 40742 2281113 5607120 8712828 8623876
46236 8623876 4512836 -846895 -4038277 -4349035 -3485134 -2732447 -1474163 1419906 5534813
46227 5534813 8894481 9855319 8378906 5351716 1589424 -1774573 -2829115 -358097
46219 -358097 4274673 8099259 9638903 9792295 9513183 8444651 6665523 5829623 6824405
$$ packed form
46278g42255j716594j779757n44250J016011K727516M729153N578353L416991
46270A2685168o49229k962871k029282l90347n58232j521664j130695J62143L30907
46261C935898q00255j515498q56558O55687K355981L673162L496437J084549k471002
46252I558401m982803n231400l487825p48914J442318J427408o88769k309307
46244e020891j221987J389381K665905K228334K240371L326007L105708q8952
46236H623876m111040n359731l191382l10758Q63901P52687J258284K894069M114907
46227E534813L359668R60838j476413l027190l762292l363997j054542K471018
46219c58097M632770L824586J539644J53392k79112j068532j779128q35900R94782
$$ plain form
46210 6824405 7700325 6155129 3316191 2579683 4763900 6941450 6745509 5516580 5851096
46201 5851096 7925854 10136106 12142818 15064558 18925864 21809855 21872302 19042014
46193 19042014 14672785 10635924 8673832 9214117 10534510 10390323 8730412 7334256
46185 7334256 6500262 4315967 478636 -1487332 1510560 6964475 9201912 7001338
46177 7001338 5400155 8603906 13978790 15590117 12055656 7963588 7760377 10744197
46169 10744197 12808104 11440493 7893953 5226525 5240431 7283346 9457908 10564951
46161 10564951 10634304 9847606 7872789 4782472 1912582 871417 1816501 3279411 3585405
46152 3585405 2221303 298266 -99847 2076010 5011678 5481846 3088685 1537528
$$ packed form
46210F824405Q75920j545196k838938p36508K184217K177550j95941j228929L34516
46201E851096K074758K210252K006712K921740L861306K883991O2447k830288
46193A9042014m369229m036861j962092N40285J320393j44187j659911j396156
46185G334256q33994k184295l837331j965968K997892N453915K237437k200574
46177G001338j601183L203751N374884J611327l534461m092068k03211K983820
46169A0744197K063907j367611l546540k667428J3906K042915K174562J107043
46161A0564951O9353p86698j974817l090317k869890j041165R45084J462910L05994
46152C585405j364102j923037l98113K175857K935668M70168k393161j551157
$$ plain form
46144 1537528 3963165 8349626 10090092 8234514 6073809 5601605 4972006 2622211
46136 2622211 664973 1997019 6297591 11078082 14757900 16426743 14545566 8963636
46128 8963636 3128935 1187097 3250677 6118505 8042584 9727304 10931792 9781102
46120 9781102 6345684 3693260 3886065 5470631 6380938 6843642 7703764 8303850 8205610
46111 8205610 8939416 11561798 14122391 14092784 11859526 9190913 5852412 1160448 -2257897
46102 -2257897 -595934 4951951 8282150 6057877 1806670 403422 1571844 1632023
46094 1632023 -558010 -2717851 -3179400 -2716250 -2371241 -1879739 -698289 1113274 3468656
46085 3468656 6342663 8855622 9491989 7939094 5980172 5808058 7579172 9066609
$$ packed form
46144A537528K425637M386461J740466j855578k160705m72204o29599k349795
46136B622211j957238J332046M300572M780491L679818J668843j881177n581930
46128H963636n834701j941838K063580K867828J924079J684720J204488j150690
46120I781102l435418k652424J92805J584566R10307M62704Q60122O00086r8240
46111H205610P33806K622382K560593k9607k233258k668613l338501m691964l418345
46102b257897J661963N547885L330199k224273m251207j403248J168422O0179
46094A632023k190033k159841m61549M63150L45009M91502J181450J811563K355382
46085C468656K874007K512959O36367j552895j958922j72114J771114J487437
$$ plain form
46077 9066609 7973224 4555963 1486412 727256 1291212 1193279 837568 2310234 5376779
46068 5376779 7023219 6061468 5331364 7208062 9457763 8617429 5666100 4626308 6394620
46059 6394620 7905280 7515680 7333506 9106566 11141291 11016593 8793093 5776010 2334562
46050 2334562 -1031607 -2197545 762432 6989300 13534899 17966969 19375116 17914170
46042 17914170 14575563 10700552 6921651 3331663 948788 1484402 4927096 8819715
46034 8819715 10723311 10024816 6916227 1730101 -3747944 -6583780 -5838344 -3601859
46026 -3601859 -1737122 134897 2114448 2494422 1021401 726409 3377366 5687810
46018 5687810 3836091 -304754 -1705176 584284 3393468 5639874 9266181 13766914
$$ packed form
46077I066609j093385l417261l069551p59156N63956r7933l55711J472666L066545
46068E376779J646440r61751p30104J876698K249701q40334k951329j039792J768312
46059F394620J510660l89600j82174J773060K034725j24698k223500l017083l441448
46050B334562l366169j165938K959977O226868O545599M432070J408147j460946
46042A7914170l338607l875011l778901l589988k382875N35614L442694L892619
46034H819715J903596o98495l108589n186126n478045k835836P45436K236485
46026c601859J864737J872019J979551L79974j473021k94992K650957K310444
46018E687810j851719m140845j400422K289460K809184K246406L626307M500733
$$ plain form
46010 13766914 15190201 12303426 9315289 10184498 13722951 16550174 17699139 17881354
46002 17881354 17064246 15506564 14916993 15883150 16048911 13568615 10854145 12080347 17779430
45993 17779430 24199051 27372588 25994162 21246465 15941984 13245008 14184574 16580080
45985 16580080 17809481 18028982 19149875 21430089 23070673 22921607 21693043 20326164
45977 20326164 18709248 16432588 13840232 12031952 12293827 15247565 19909549 23968669
45969 23968669 25725341 25476404 24594178 23988927 24020533 24796167 25500568 24478345 21384643
45960 21384643 18452037 18029203 19388814 19682624 17846878 15768773 15309843 15826308 15518423
45951 15518423 14240242 13888519 16137110 20407022 24321261 26013411 25614777 24292308
$$ packed form
46010A3766914J423287k886775k988137Q69209L538453K827223J148965J82215
46002A7881354q17108j557682n89571R66157J65761k480296k714470J226202N699083
45993A7779430O419621L173537j378426m747697n304481k696976R39566K395506
45985A6580080J229401K19501J120893K280214J640584j49066j228564j366879
45977B0326164j616916k276660k592356j808280K61875K953738M661984M059120
45969B3968669J756672k48937q82226o05251L1606P75634P04401j022223l093702
45960B1384643k932606m22834J359611K93810j835746k078105m58930N16465l07885
45951A5518423j278181l51723K248591M269912L914239J692150l98634j322469
$$ plain form
45943 24292308 22444958 19705400 16358980 13503319 11767606 11158510 12209759 15527667
45935 15527667 19693809 21648628 20464563 19078964 20548766 23763996 24822681 22077211
45927 22077211 17964964 15820447 16271443 17220574 16799565 15908005 17313132 21703748 25622542
45918 25622542 25245134 21775517 20257596 22574787 24936732 23824996 21075517 20427470
45910 20427470 21824200 22440047 21311816 19510812 17353702 15017814 14574766 17555700
45902 17555700 21342920 21865914 19430312 18080747 19499287 21475736 22351954 22829909
45894 22829909 23013781 21827040 20080155 20023774 21022253 19977785 17110376 16508797 19153127
45885 19153127 20525047 18073763 16086228 18988341 24053527 25883975 24920883 25656875
$$ packed form
45943B4292308j847350k739558l346420k855661j735713o09096J051249L317908
45935A5527667M166142J954819j184065j385599J469802L215230J058685k745470
45927B2077211m112247k144517M50996R49131m21009q91560J405127M390616L918794
45918B5622542l77408l469617j517921K317191K361945j111736k749479o48047
45910B0427470J396730O15847j128231j801004k157110k335888m43048K980934
45902A7555700L787220N22994k435602j349565J418540J976449Q76218M77955
45894B2829909J83872j186741j746885n6381R98479j044468k867409o01579K644330
45885A9153127J371920k451284j987535K902113N065186J830448r63092P35992
$$ plain form
45877 25656875 28232694 27986956 23299412 18419448 17350199 19175004 20877436 21282980
45869 21282980 20600507 18990949 17391385 17510096 19283062 20081519 18029589 14761951
45861 14761951 13477120 15273268 18555610 21129604 21780591 20580497 18797570 18109086
45853 18109086 18986651 20046566 19638399 17901966 16644564 17127975 18432192 18366519 15942076
45844 15942076 12500477 10110994 9394848 9684798 10727155 12630984 14127607 12963764
45836 12963764 9040456 5438285 4895269 6667367 8392723 9537019 10928204 12199157
45828 12199157 12344365 12111618 13029328 14300679 13647672 11537702 11433493 14708521 18116546
45819 18116546 18049164 15031560 11992541 10050025 8458977 7269747 7164810 7284777 6084807
$$ packed form
45877B5656875K575819k45738m687544m879964j069249J824805J702432M05544
45869B1282980o82473j609558j599564J18711J772966P98457k051930l267638
45861A4761951j284831J796148L282342K573994O50987j200094j782927o88484
45853A8109086Q77565J059915m08167j736433j257402M83411J304217o5673k424443
45844A5942076l441599k389483p16146K89950J042357J903829J496623j163843
45836A2963764l923308l602171n43016J772098J725356J144296J391185J270953
45828A2199157J45208k32747R17710J271351o53007k109970j04209L275028L408025
45819A8116546o7382l017604l039019j942516j591048j189230j04937J19967j199970
$$ plain form
45810 6084807 4435808 5161129 8779580 12192547 12911146 12393569 13221278 14751382 14414103
45801 14414103 12549815 12552740 15425082 17231474 14096881 7838923 4070392 5615169
45793 5615169 10308900 14891783 18283343 20508488 20963808 19171896 15747548 11562286
45785 11562286 7281617 4420327 4937865 8444172 11567279 11868752 10974859 11913835 14665406
45776 14665406 16674002 16859606 16502046 16434949 15935502 14697606 13700153 13532409 13622897
45767 13622897 13618391 13858926 14006625 12919031 10587807 8657770 8202530 8343748 7935245
45758 7935245 7380617 7805315 9398345 11550076 13979926 16901389 20326310 23435910
45750 23435910 24375053 21295033 14881228 9411995 9293010 14190413 19442492 21691757
$$ packed form
45810F084807j648999P25321L618451L412967P18599n17577Q27709J530104l37279
45801A4414103j864288K925K872342J806392l134593o257958l768531J544777
45793E615169M693731M582883L391560K225145M55320j791912l424348m185262
45785A1562286m280669k861290N17538L506307L123107L01473q93893R38976K751571
45776A4665406K008596J85604l57560o7097m99447j237896r97453j67744R0488
45767A3622897m506K40535J47699j087594k331224j930037m55240J41218m08503
45758G935245n54628M24698J593030K151731K429850K921463L424921L109600
45750B3435910R39143l080020o413805n469233j18985M897403N252079K249265
$$ plain form
45742 21691757 21922555 22166806 21896827 19621377 15955580 12629570 9855160 7220136
45734 7220136 6082585 8120553 11894574 13877574 13283236 13135793 15664827 19153129
45726 19153129 20832248 20791609 20847211 20744698 18039475 12052166 6283267 5766126 11991966
45717 11991966 20692724 25171488 22640506 17220646 15581296 19451992 24026306 24476996
45709 24476996 21924639 20860170 22297970 22898136 20815521 18830409 20185217 24117535
45701 24117535 27675674 29721291 30457422 28843116 24060023 18823310 17381297 19762175
45693 19762175 21503164 20124426 18381125 19247907 21089346 20883597 19695177 21017314
45685 21017314 24827564 27197639 25803873 22495096 19919254 18567892 17995341 18266426
$$ packed form
45742B1691757K30798K44251k69979k275450l665797l326010k774410k635024
45734G220136j137551K037968L774021J983000n94338j47443K529034L488302
45726A9153129J679119m0639N5602j02513k705223n987309n768899n17141O225840
45717A1991966Q700758M478764k530982n419860j639350L870696M574314M50690
45709B4476996k552357j064469J437800O00166k082615j985112J354808L932318
45701B4117535L558139K045617P36131j614306m783093n236713j442013K380878
45693A9762175J740989j378738j743301Q66782J841439k05749j188420J322137
45685B1017314L810250K370075j393766l308777k575842j351362n72551K71085
$$ plain form
45677 18266426 18918145 18654599 17452769 17255134 19382821 22911680 26702555 31084219
45669 31084219 35900643 38721821 37325054 33006231 29247067 27642717 27249990 27668712
45661 27668712 30368016 36273676 43820344 50528280 55529459 59554026 63120382 65876407
45653 65876407 67616658 69004729 70953063 73813026 77516352 81966233 86592779 89921314
45645 89921314 90788665 90218508 90869379 93955200 97820108 100378456 101592792 102203189 101608573
45636 101608573 99421335 98098057 100800378 106450186 109957587 108242631 103319141 98361815
45628 98361815 93760266 89019791 85710438 85454467 86676023 86506546 85043658 84787843
45620 84787843 86370086 87890312 88667152 90740499 95677581 102095747 107598533 111517601
$$ packed form
45677A8266426O51719k63546j201830j97635K127687L528859L790875M381664
45669C1084219M816424K821178j396767m318823l759164j604350l92727M18722
45661B7668712K699304N905660P546668O707936N001179M024567L566356K756025
45653F5876407J740251J388071J948334K859963L703326M449881M626546L328535
45645H9921314Q67351n70157O50871L085821L864908K558348J214336O10397n94616
45636A01608573k187238j323278K702321N649808L507401j714956m923490m957326
45628I8361815m601549m740475l309353k55971J221556j69477j462888k55815
45620H4787843J582243J520226P76840K073347M937082O418166N502786L919068
$$ plain form
45612 111517601 114323421 115468347 113578069 108819626 103925403 102043885 103518325 105367337
45604 105367337 104625625 101892087 100403345 101561879 103069102 102230984 99346421 96472587
45596 96472587 94525286 93502018 94012686 95944155 96561948 93054298 86962191 83173462
45588 83173462 83927396 86341808 86652415 84441828 81549133 79142579 77529565 77051537
45580 77051537 77387813 77367579 77156385 79226322 85026225 91604192 93991870 90969818 86442118
45571 86442118 84675357 85971675 87938408 89428903 91360742 94023431 95618530 94525122
45563 94525122 91840870 89987874 89092516 86725572 81838440 76989532 75143748 75759249
45555 75759249 76040333 74886103 73041860 70074466 64500893 57348073 52287764 50702182
$$ packed form
45612A11517601K805820J144926j890278m758443m894223j881518J474440J849012
45604A05367337p41712k733538j488742J158534J507223q38118k884563k873834
45596I6472587j947301j023268N10668J931469O17793l507650o092107l788729
45588H3173462P53934K414412L10607k210587k892695k406554j613014m78028
45580G7051537L36276k0234k11194K069937N799903O577967K387678l022052m527700
45571H6442118j766761J296318J966733J490495J931839K662689J595099j093408
45563I4525122k684252j852996q95358k366944m887132m848908j845784O15501
45555G5759249K81084j154230j844243k967394n573573p152820n060309j585582
$$ plain form
45547 50702182 49328099 44954569 39327396 36693192 37769348 39074471 37917132 35350451
45539 35350451 33702033 33391629 33346409 33188345 33563802 34597790 35040739 33397732 29790401
45530 29790401 26315341 25136331 26308652 28007598 28761146 28525191 27489607 25237089
45522 25237089 21943020 19283200 18864758 20330068 22169938 23949219 26448577 29754184
45514 29754184 32480599 33211830 31948534 29885445 28294521 27733046 27807756 27476429 25891067
45505 25891067 23228629 20780747 20195839 22245401 25838487 28489496 28504759 26664287
45497 26664287 25079408 24783708 25614984 27922743 32186509 36650989 37927167 35291888
45489 35291888 32187773 31676312 32486445 31878690 30403555 30519220 31700541 30859800 27696785
$$ packed form
45547E0702182j374083m373530n627173k634204J076156J305123j157339k566681
45539C5350451j648418l10404m5220j58064L75457J033988M42949j643007l607331
45530B9790401l475060j179010J172321J698946P53548k35955j035584k252518
45522B5237089l294069k659820m18442J465310J839870J779281K499358L305607
45514B9754184K726415P31231j263296k063089j590924n61475P4710l31327j585362
45505B5891067k662438k447882n84908K049562L593086K651009J5263j840472
45497B6664287j584879k95700Q31276K307759M263766M464480J276178k635279
45489C5291888l104115n11461Q10133o07755j475135J15665J181321q40741l163015
$$ plain form
45480 27696785 25828874 27445149 30011771 30088826 27972922 26428764 26548531 27108555 27040394
45471 27040394 26495283 25860739 25346351 25454751 26672002 28621370 30225438 30719139 30303005
45462 30303005 30174215 31829189 35278038 37790059 36036688 30396702 25539059 25141722
45454 25141722 27266872 27084794 23490325 20369820 20863623 22938669 22487778 19384036
45446 19384036 17851878 20460393 23876433 22459491 15520787 8922319 8625136 14082411
45438 14082411 19440487 20338631 17645848 14835192 13906017 14513841 15335802 15301387 14669751
45429 14669751 15459046 19281240 24129423 25423173 21688483 17204147 16902127 20289126
45421 20289126 23036605 23299876 23106809 23787750 23654521 21284533 18282049 17127685 18170064
$$ packed form
45480B7696785j867911J616275K566622P7055k115904j544158J19767N60024o8161
45471B7040394n45111o34544n14388J08400J217251J949368J604068M93701m16134
45462C0303005j28790J654974L448849K512021j753371n639986m857643l97337
45454B5141722K125150j82078l594469l120505M93803K075046m50891l103742
45446A9384036j532158K608515L416040j416942o938704o598468k97183N457275
45438A4082411N358076Q98144k692783k810656r29175O07824Q21961l4415o31636
45429A4669751P89295L822194M848183J293750l734690m484336l02020L386999
45421B0289126K747479K63271j93067O80941j33229k369988l002484j154364J042379
$$ plain form
45412 18170064 20196049 22344987 23941423 23820640 21536207 18448575 16286319 15332114
45404 15332114 15067853 15583243 16954180 18048571 17486880 15330804 12568717 9573204
45396 9573204 6509994 4616360 5199664 7493103 9267466 9708220 10080205 11381284 13106093
45387 13106093 14790826 16923643 19367648 20532737 19475801 17567425 16567072 16094978
45379 16094978 14852006 13669175 15021370 19140061 22608799 22028424 17996946 14234110
45371 14234110 13306462 14362265 14945943 13959670 12429727 11989599 13264215 15720415 18617612
45362 18617612 21630266 24444154 26257791 26459108 25892754 26550943 29209135 31872112
45354 31872112 31736084 28768057 26140202 26518647 28948390 30421537 29740938 28375569
$$ packed form
45412A8170064K025985K148938J596436j20783k284433l087632k162256r54205
45404A5332114k64261N15390J370937J094391n61691k156076k762087k995513
45396I573204l063210j893634N83304K293439J774363M40754L71985J301079J724809
45387A3106093J684733K132817K444005J165089j056936j908376j000353m72094
45379A6094978j242972j182831J352195M118691L468738n80375m031478l762836
45371A4234110r27648J055803N83678r86273j529943m40128J274616K456200K897197
45362A8617612L012654K813888J813637K01317n66354O58189K658192K662977
45354C1872112j36028k968027k627855L78445K429743J473147o80599j365369
$$ plain form
45346 28375569 27776720 27585667 26994885 26395136 26638697 27651814 28936083 30785128 33704951
45337 33704951 36807307 37895928 35363316 29594029 22889162 18578527 19283398 24474727
45329 24474727 29938973 31343128 28761458 26397868 27420018 30419471 31674359 29658150
45321 29658150 26298377 24659368 26358646 30548374 34443671 35340237 32955437 29451857
45313 29451857 26796963 25030877 23745092 23854196 26347387 30110525 32755496 33342422
45305 33342422 32754394 31617298 29570193 26784997 24648241 24404025 26157829 29409299
45297 29409299 33386284 36657591 37780439 36853628 35368402 34223689 33137288 32306483
45289 32306483 32954599 35294256 37414324 37520107 36294305 35753757 36561948 37781808 38655242
$$ packed form
45346B8375569n98849j91053n90782n99749K43561J013117J284269J849045K919823
45337C3704951L102356J088621k532612n769287o704867m310635P04871N191329
45329B4474727N464246J404155k581670k363590J022150K999453J254888k016209
45321B9658150l359773j639009J699278M189728L895297Q96566k384800l503580
45313B9451857k654894j766086j285785J09104K493191L763138K644971N86926
45305C3342422n88028j137096k047105k785196k136756k44216J753804L251470
45297B9409299L976985L271307J122848r26811j485226j144713j086401q30805
45289C2306483O48116K339657K120068J05783j225802n40548Q08191J219860Q73434
$$ plain form
45280 38655242 39217592 39449452 39117432 38446795 38013980 38047912 38529181 39525704 40454063
45271 40454063 39559812 35668293 30483818 27586209 28477442 30690158 30642405 27724122 24760827
45262 24760827 24772755 28028981 32297397 35370417 36907800 37940168 39195739 40535948
45254 40535948 41866464 43622781 45798056 47187136 46508979 44066050 41503267 39989548
45246 39989548 39360627 39050327 39039843 39530654 40212597 40340823 39464183 37951890 36881103
45237 36881103 37323149 39445077 42195188 43992248 43864672 42098282 39948554 38565284
45229 38565284 37896737 36889952 35259565 34575927 36426311 39659018 41215127 40351479
45221 40351479 40245760 43957630 50164728 54830765 56317882 56818677 59098114 63914793
$$ packed form
45280C8655242N62350K31860l32020o70637m32815L3932M81269R96523R28359
45271D0454063q94251l891519n184475k897609Q91233K212716m7753k918283k963295
45262B4760827J1928L256226M268416L073020J537383J032368J255571J340209
45254D0535948J330516J756317K175275J389080o78157k442929k562783j513719
45246C9989548o28921l10300j0484M90811O81943J28226q76640j512293j070787
45237C6881103M42046K121928K750111J797060j27576j766390k149728j383270
45229C8565284o68547j006785j630387o83638J850384L232707J556109q63648
45221D0351479j05719L711870O207098M666037J487117N00795K279437M816679
$$ plain form
45213 63914793 70693725 78565856 86008934 91136882 93398759 94160152 95179182 97337060
45205 97337060 100745306 104605929 106884667 106068762 103855072 104049026 107648015 110947228
45197 110947228 110178344 106375596 103526098 103110725 103025537 101451850 99137923 97393251
45189 97393251 96043222 94427318 92892873 92084619 91700623 91075066 90407587 90392636 90960263
45180 90960263 91361881 91471063 92115984 93825542 95902697 97296263 98057956 99256749 101460602
45171 101460602 104011169 106054285 107476628 108084638 106556020 101645433 94653115 89472785
45163 89472785 89309928 93697755 99162338 102451734 102832410 101761566 100912868 100529935 99628588
45154 99628588 97797381 96155609 95660912 94938219 91392259 84845930 78593422 76018837
$$ packed form
45213F3914793O778932P872131P443078N127948K261877P61393J019030K157878
45205I7337060L408246L860623K278738q15905k213690J93954L598989L299213
45197A10947228p68884l802748k849498m15373q5188j573687k313927j744672
45189I7393251j350029j615904j534445q08254l83996o25557o67479j4951N67627
45180I0960263M01618J09182O44921J709558K077155J393566P61693J198793K203853
45171A01460602K550567K043116J422343O08010j528618m910587o992318n180330
45163H9472785j62857M387827N464583L289396L80676j070844q48698l82933r01347
45154I9628588j831207j641772m94697p22693l545960o546329o252508k574585
$$ plain form
45146 76018837 77342831 80536888 84053652 87230424 89120433 88958016 87631391 87023082
45138 87023082 87609341 87913017 86667326 84595213 83668327 85207757 88944862 93476655
45130 93476655 97417339 100240428 101954599 102174635 100387224 97429245 95531098 95906602
45122 95906602 97113004 96879777 94827711 92175759 89537418 86636633 83811017 82024142
45114 82024142 81268307 80415590 78891475 77283461 76087314 74884121 72816495 68978340
45106 68978340 62718009 54897373 48481901 46119907 47102219 48363934 48392258 48104377 47806516
45097 47806516 45996404 42316536 39359422 39693749 42484049 44646336 44348830 42188425
45089 42188425 40054103 39979869 42840818 46858100 48603416 46832883 44065859 42985136
$$ packed form
45146G6018837J323994L194057L516764L176772J890009j62417j326625o08309
45138H7023082N86259L03676j245691k072113r26886J539430L737105M531793
45130I3476655L940684K823089J714171K20036j787411k957979j898147L75504
45122I5906602J206402k33227k052066k651952k638341k900785k825616j786875
45114H2024142p55835q52717j524115j608014j196147j203193k067626l838155
45106F8978340o260331p820636o415472k361994R82312J261715K8324k87881k97861
45097D7806516j810112l679868k957114L34327K790300K162287k97506k160405
45089D2188425k134322p4234K860949M017282J745316j770533k767024j080723
$$ plain form
45081 42985136 42867334 41510674 39088866 37342579 35952474 33027579 29239547 28173333
45073 28173333 31375097 35538754 36276640 33074416 28979133 26682870 26626371 28135297
45065 28135297 30460046 32573582 33466613 33380268 33934781 36162573 38753613 39306312 37529093
45056 37529093 35961012 36427435 36822202 33552985 27120520 22641303 23592807 27310218
45048 27310218 28772499 27109343 25598392 26202315 27346517 27306167 26862901 27509197 29107674
45039 29107674 30592530 31565311 32098914 31963195 30836367 28551887 24920127 20334350
45031 20334350 16528600 15230466 15881989 16346821 16112582 16832926 19194563 21490978 22379505
45022 22379505 22958824 24643066 26745698 27758737 27517253 26590015 25035888 23274164
$$ packed form
45081D2985136j17802j356660k421808j746287j390105k924895l788032j066214
45073B8173333L201764M163657P37886l202224m095283k296263n6499J508926
45065B8135297K324749K113536Q93031q6345N54513K227792K591040N52699j777219
45056C7529093j568081M66423L94767l269217o432465m479217R51504L717411
45048B7310218J462281j663156j510951O03923J144202m0350m43266O46296J598477
45039B9107674J484856R72781N33603j35719j126828k284480l631760m585777
45031B0334350l805750j298134O51523M64832k34239P20344K361637K296415Q88527
45022B2379505N79319J684242K102632J013039k41484r27238j554127j761724
$$ plain form
45014 23274164 22532017 22708700 21538221 17916770 14345459 13694401 15214923 16543708
45006 16543708 18007223 21359264 25288266 26304087 24058903 21814155 21108700 19955748
44998 19955748 17495128 16432486 18681324 21894935 23007182 22635191 23116151 24214589
44990 24214589 23851206 21842479 20094913 19817663 20851563 22939826 25353228 26021894
44982 26021894 23532042 19654973 17690980 18595367 20762971 23054844 25537665 27531470
44974 27531470 27785202 26966082 27317453 29114310 29944668 28529256 26886810 27284611 29086746
44965 29086746 30318394 30667742 31070303 31636439 31971400 32625991 34193832 35399739 33951832
44956 33951832 29327080 23404244 18460061 15724992 15598852 17723549 20604946 22415834
$$ packed form
45014B3274164p42147J76683j170479l621451l571311o51058J520522J328785
45006A6543708J463515L352041L929002J015821k245184k244748p05455j152952
44998A9955748k460620j062642K248838L213611J112247l71991M80960J098438
44990B4214589l63383k008727j747566k77250J033900K088263K413402O68666
44982B6021894k489852l877069j963993R04387K167604K291873K482821J993805
44974B7531470K53732q19120L51371J796857Q30358j415412j642446L97801J802135
44965B9086746J231648L49348M02561N66136L34961O54591J567841J205907j447907
44956C3951832m624752n922836m944183k735069j26140K124697K881397J810888
$$ plain form
44948 22415834 22658176 22359054 22589271 23616885 25497035 28396179 31884421 34602053
44940 34602053 35146934 33234932 30201597 28591977 30461099 35097918 39078701 40002117
44932 40002117 39728335 42009618 46944900 50249885 49007606 45732448 44657524 45718906
44924 45718906 45119512 41367194 37703988 37609073 40100564 41156758 38734301 34836175
44916 34836175 32950394 34652460 38803353 43158324 46195861 47595467 47551434 46291113
44908 46291113 44444227 43148199 42960565 43041230 42441258 41996504 43575651 47248056 50755789
44899 50755789 52563939 53982109 57000803 61183673 64308717 65302260 64752049 63036957
44891 63036957 60095586 57144386 56384495 58093561 59749588 59281946 57890952 58214312
$$ packed form
44948B2415834K42342k99122K30217J027614J880150K899144L488242K717632
44940C4602053N44881j912002l033335j609620J869122M636819L980783R23416
44932D0002117k73782K281283M935282L304985j242279l275158j074924J061382
44924D5718906n99394l752318l663206r4915K491491J056194k422457l898126
44916C4836175j885781J702066M150893M354971L037537J399606m4033j260321
44908D6291113j846886j296028j87634Q0665n99972m44754J579147L672405L507733
44899E0755789J808150J418170L018694M182870L125044R93543n50211j715092
44891F3036957k941371k951200p59891J709066J656027m67642j390994L23360
$$ plain form
44883 58214312 60555517 62441778 61619214 58292810 54531736 52444079 52867486 54909495
44875 54909495 56548387 56258793 54328575 52538048 52737372 55673062 60417077 64496797
44867 64496797 65380169 62692569 58637351 55728751 54672452 54891833 55999967 57607008
44859 57607008 58587080 58114335 57066957 57023394 58171206 59522827 60698755 61803340 61925112
44850 61925112 59934957 56939083 55660967 56630076 57059255 54689577 51021890 49321492
44842 49321492 50761117 53949354 57123010 59304034 60129298 59952847 59587963 59016123 57228243
44833 57228243 54258166 52082321 52147487 53314254 53966650 54832993 57369403 60249529 60322790
44824 60322790 57073510 53484740 51924515 51504976 50405191 48738620 47796635 47868980 48095802
$$ packed form
44883E8214312K341205J886261q22564l326404l761074k087657M23407K042009
44875E4909495J638892k89594j930218j790527J99324K935690M744015M079720
44867F4496797Q83372k687600m055218k908600j056299K19381J108134J607041
44859E7607008R80072m72745j047378m3563J147812J351621J175928J104585J21772
44850F1925112j990155k995874j278116R69109M29179k369678l667687j700398
44842D9321492J439625L188237L173656K181024Q25264j76451l64884n71840j787880
44833E7228243k970077k175845O5166J166767O52396Q66343K536410K880126P3261
44824F0322790l249280l588770j560225m19539j099785j666571r41985P2345K26822
$$ plain form
44815 48095802 47655010 46333660 44703449 44063457 45108570 46400422 45569911 42412003
44807 42412003 39204405 37547916 36868343 36744615 38214853 41129405 42553171 40352296
44799 40352296 36865846 36306572 39390152 43036257 44561032 43441557 39662596 33728982
44791 33728982 28476738 27373272 29911869 31657731 30222559 28291907 28906858 30714520
44783 30714520 30769688 29760288 30767457 33906688 36020876 35816784 35888629 38644585 42925935
44774 42925935 46044483 47076235 46609215 44911510 42130084 39313540 37655320 37232894
44766 37232894 37548781 38621011 40460745 42161285 42707451 42291585 41906823 42109950 42904811
44757 42904811 43995794 44258229 42181049 38328700 36141988 38057582 41511632 41436122
$$ packed form
44815D8095802m40792j321350j630211o39992J045113J291852q30511l157908
44807D2412003l207598j656489o79573j23728J470238K914552J423766k200875
44799D0352296l486450n59274L083580L646105J524775j119475l778961n933614
44791C3728982n252244j103466K538597J745862j435172j930652O14951J807662
44783C0714520N5168j009400J007169L139231K114188k04092P1845K755956M281350
44774D2925935L118548J031752m67020j697705k781426k816544j658220m22426
44766C7232894L15887J072230J839734J700540N46166m15866l84762K03127P94861
44757D2904811J090983K62435k077180l852349k186712J915594L454050p5510
$$ plain form
44749 41436122 36776482 31926342 31141563 34061979 37723659 40426399 41956539 42199720
44741 42199720 41699230 41990325 43219096 42855071 39157505 34684502 33549786 35944528
44733 35944528 38416435 39226654 39894142 40879591 39587294 34830508 30390230 30943006 35695795
44724 35695795 39039672 37393463 33096158 31184166 34121243 40330097 46448709 49917976
44716 49917976 50061515 47918113 45441002 44403575 45350200 47158803 47869624 46518746
44708 46518746 44115858 42275704 41128194 39592916 37652290 36787510 37525932 38231125
44700 38231125 37798846 38241835 42380904 49380073 54953927 56521033 56109253 57062349 59572010
44691 59572010 61184256 60699553 59480715 59000989 59075386 59227668 60249981 63032086 66580524
$$ packed form
44749D1436122m659640m850140p84779K920416L661680K702740J530140K43181
44741D2199720n00490K91095J228771l64025l697566m473003j134716K394742
44733C5944528K471907Q10219O67488R85449j292297m756786m440278N52776M752789
44724C5695795L343877j646209m297305j911992K937077O208854O118612L469267
44716D9917976J43539k143402k477111j037427R46625J808603P10821j350878
44708D6518746k402888j840154j147510j535278j940626q64780P38422P05193
44700C8231125m32279M42989M139069O999169N573854J567106m11780R53096K509661
44691E9572010J612246m84703j218838m79726P4397J52282J022313K782105L548438
$$ plain form
44682 66580524 68673925 68443448 67094985 65837027 64257751 61450813 57908450 55327302
44674 55327302 54903629 56675963 60301607 65446743 71136779 75434743 76398308 73568693
44666 73568693 68717104 65033635 64773699 67101074 68875160 68327428 67236502 68355362
44658 68355362 71529518 74297989 76078664 79252690 85234882 91736575 95674016 97187951
44650 97187951 98579034 100215084 100144759 97914260 96226089 97420832 99844573 99635534
44642 99635534 95814762 91862826 91612854 94864412 98484829 101298065 105744841 113811367
44634 113811367 123183144 129592130 132250018 134535734 139131589 144797657 148813694 150649169
44626 150649169 152013187 154861036 160550559 169348782 179285423 186998101 191469580 195632475
$$ packed form
44682F6580524K093401k30477j348463j257958j579276k806938l542363k581148
44674E5327302m23673J772334L625644N145136N690036M297964R63565k829615
44666G3568693m851589l683469k59936K327375J774086n47732j090926J118860
44658F8355362L174156K768471J780675L174026N982192O501693L937441J513935
44650I7187951J391083J636050p0325k230499j688171J194743K423741k09039
44642I9635534l820772l951936k49972L251558L620417K813236M446776Q066526
44634A13811367R371777O408986K657888K285716M595855N666068M016037J835475
44626A50649169J364018K847849N689523Q798223R936641P712678M471479M162895
$$ plain form
44618 195632475 202399388 210423239 216138492 219042425 222264920 228231592 236278101 244428513
44610 244428513 250968687 254169938 253290894 250704169 250651529 254764005 260601004 265272512
44602 265272512 268308791 270055100 269806929 267383870 264648835 263433107 263273709 262962508
44594 262962508 262975590 264400603 266607093 268150025 269258313 271367994 274710366 278349864
44586 278349864 282195168 286926109 292129271 296530660 300038644 303566704 306858080 308767487
44578 308767487 310027050 313223268 319019270 324687772 327885587 329881329 333111485 337185462
44570 337185462 339715441 340087972 339846526 339834575 339678063 340099398 342676156 346287806 346733441
44561 346733441 342007859 335803306 333058788 333464513 332602101 328946082 326021692 326821167
$$ packed form
44618A95632475O766913Q023851N715253K903933L222495N966672Q046509Q150412
44610B44428513O540174L201251q79044k586725n2640M112476N836999M671508
44602B65272512L036279J746309k48171k423059k735035j215728j59398l11201
44594B62962508J3082J425013K206490J542932J108288K109681L342372L639498
44586B78349864L845304M730941N203162M401389L507984L528060L291376J909407
44578C08767487J259563L196218N796002N668502L197815J995742L230156M073977
44570C37185462K529979L72531k41446j1951j56512M21335K576758L611650M45635
44561C46733441m725582o204553k744518M05725q62412l656019k924390P99475
$$ plain form
44553 326821167 329530923 330752327 330179807 329329754 327691895 323758917 319185628 318199087
44545 318199087 322130693 327416808 330240469 330802433 331496202 332941534 333903908 333762747
44537 333762747 332767090 330502926 326373809 321643917 319006433 319446093 320859169 320509577
44529 320509577 317841488 314086238 310027732 305472901 300728523 297172796 295569775 294545439
44521 294545439 291852287 287044712 281779685 277247144 272709574 267534526 263277296 261772919
44513 261772919 261680837 259215001 252726951 244596677 237777970 232346485 226793400 221126951
44505 221126951 216731892 213846971 210931440 206382066 199678803 191134643 181747123 173205749
44497 173205749 167041279 163733992 163022621 164234107 165467296 163790464 158235851 152032809
$$ packed form
44553C26821167K709756J221404n72520q50053j637859l932978m573289r86541
44545C18199087L931606N286115K823661N61964O93769J445332R62374j41161
44537C33762747r95657k264164m129117m729892k637484M39660J413076l49592
44529C20509577k668089l755250m058506m554831m744378l555727j603021j024336
44521B94545439k693152m807575n265027m532541m537570n175048m257230j504377
44513B61772919r2082k465836o488050q130274o818707n431485n553085n666449
44505B21126951m395059k884921k915531m549374o703263q544160r387520q541374
44497A73205749o164470l307287p11371J211486J233189j676832n554613o203042
$$ plain form
44489 152032809 149664594 151632110 154139334 154156436 152489267 151091303 149839928 147806687
44481 147806687 145912448 145878962 147292958 147990721 147206750 146226352 145592164 143709508 139308267
44472 139308267 133843465 129956948 128200554 126665185 123689890 119691016 116065744 113340942
44464 113340942 111094285 109124901 107803506 107139531 106012167 102809914 97057700 90350531
44456 90350531 85274200 83025073 82315553 81128210 79321722 78642901 80065771 82130068
44448 82130068 82451838 80108699 76006212 71782769 69061857 68696028 69510680 68652712 64721186
44439 64721186 59965169 57671835 57798978 57238033 54422467 51472056 51124048 53427840
44431 53427840 56401262 58444489 59208110 59338332 60019810 61540819 62147471 60200174 57612190
$$ packed form
44489A52032809k368215J967516K507224J7102j667169j397964j251375k033241
44481A47806687j894239l3486J413996O97763p83971r80398o34188j882656m401241
44472A39308267n464802l886517j756394j535369k975295l998874l625272k724802
44464A13340942k246657j969384j321395o63975j127364l202253n752214o707169
44456I0350531n076331k249127p09520j187343j806488o78821J422870K064297
44448H2130068L21770k343139m102487m223443k720912l65829Q14652q57968l931526
44439F4721186m756017k293334J27143n60945k815566k950411l48008K303792
44431E3427840K973422K043227P63621J30222O81478J521009O06652j947297k587984
$$ plain form
44422 57612190 58313845 62359299 64909520 63170161 61007348 63291354 68299215 70064465
44414 70064465 66750540 62053573 58897650 56603427 54743365 54936748 57143435 58329479
44406 58329479 57092357 56084508 57289329 58241168 56261686 53669161 54569728 57956094
44398 57956094 58386996 53410383 46465807 41755580 39618767 38365997 37873521 39183569
44390 39183569 42163036 45645645 49068161 52250991 54175384 53822462 52192726 51785435
44382 51785435 53541828 55625637 56023662 55214433 55032745 55651292 55357525 53330383 51044650
44373 51044650 50299541 51017296 51722542 51224183 49104128 45647537 42325953 41325687 43248478
44364 43248478 46009442 47333378 47553485 48414978 50018446 51090898 51750082 53350348
$$ packed form
44422E7612190P01655M045454K550221j739359k162813K284006N007861J765250
44414G0064465l313925m696967l155923k294223j860062J93383K206687J186044
44406E8329479j237122j007849J204821R51839j979482k592525R00567L386366
44398E7956094M30902m976613o944576m710227k136813j252770m92476J310048
44390C9183569K979467L482609L422516L182830J924393l52922j629736m07291
44382E1785435J756393K083809L98025q09229j81688O18547k93767k027142k285733
44373E1044650p45109P17755P05246m98359k120055l456591l321584j000266J922791
44364D3248478K760964J323936K20107Q61493J603468J072452O59184J600266
$$ plain form
44356 53350348 55347195 55029696 51444475 47321622 45595390 45809583 45702572 44883017 44766902
44347 44766902 45536430 45338619 42850780 39300471 37299064 38133150 40555496 42259945
44339 42259945 42533250 43069529 45680820 49763875 53181209 55277198 57258960 59391277
44331 59391277 59918639 57873391 55202890 54436398 55319815 55471695 53750417 51341326 49797798
44322 49797798 49589504 50746514 53530756 57647293 61389166 62582821 60910934 58980378
44314 58980378 60041813 64125566 67541563 67415512 65614273 66049983 68674671 69028575
44306 69028575 64285501 56992425 51555224 49467134 49734603 51778604 55457037 59529596
44298 59529596 62522506 64635095 67133071 70433184 74123138 78008493 81666177 83760730
$$ packed form
44356E3350348J996847l17499l585221m122853j726232K14193j07011q19555j16115
44347D4766902P69528j97811k487839l550309k001407Q34086K422346J704449
44339D2259945K73305N36279K611291M083055L417334K095989J981762K132317
44331E9391277N27362k045248k670501p66492Q83417J51880j721278k409091j543528
44322D9797798k08294J157010K784242M116537L741873J193655j671887j930556
44314E8980378J061435M083753L415997j26051j801239M35710K624688L53904
44306F9028575m743074p293076n437201k088090K67469K044001L678433M072559
44298E9529596K992910K112589K497976L300113L689954L885355L657684K094553
$$ plain form
44290 83760730 83317847 81144428 78856759 77173528 76030386 75382482 75077419 75132229 76659322
44281 76659322 80611364 84935925 85693856 82417035 79353081 79412780 80316868 79617908 79732850
44272 79732850 83539940 88148117 88693145 86337766 86343772 89170565 90037039 87517894 85958141
44263 85958141 87933165 90488858 91073571 91439819 92857402 92972950 91010299 91041765 95731599
44254 95731599 101076721 102120534 100335657 100272220 101849593 101549886 99287050 98311076 99042813
44245 99042813 98394143 95415387 92964652 93057522 94427506 95468294 96188760 96448370 95336868
44236 95336868 93241007 91995381 92339919 93529743 95649331 99599787 104381742 107205392
44228 107205392 107102961 106006673 105598416 105535983 105399621 105746563 106363388 106047883 105094933
$$ packed form
44290H3760730m42883k173419k287669j683231j143142o47904l05063N4810J527093
44281G6659322L952042M324561P57931l276821l063954N9699R04088o98960J14942
44272G9732850L807090M608177N45028k355379O006K826793Q66474k519145j559753
44263H5958141J975024K555693N84713L66248J417583J15548j962651L1466M689834
44254I5731599N345122J043813j784877o3437J577373k99707k262836r75974P31737
44245I9042813o48670k978756k450735R2870J369984J040788P20466K59610j111502
44236I5336868k095861j245626L44538J189824K119588L950456M781955K823650
44228A07205392j02431j096288m08257o2433j36362L46942O16825l15505r52950
$$ plain form
44219 105094933 105401796 107065426 107737968 106822416 107271302 110942539 114810476 114728281 111159488
44210 111159488 108183440 108020646 109505602 111244967 113253576 115438126 117105614 118554548
44202 118554548 121220168 125651449 130793610 135659063 140422943 145577173 151177476 157155319
44194 157155319 163326579 169027181 173793758 178310438 183528678 189157243 194560045 200817286
44186 200817286 209709669 220441156 229872288 236910180 244058442 252904004 260612925 263758298
44178 263758298 263911584 265850047 270726965 274747300 275266738 274714183 276672214 280722147
44170 280722147 283600768 283906614 283384532 284497731 288635656 295783157 303907047 309317620
44162 309317620 309708982 306559189 302912977 299663344 296265613 294205864 296363316 302531374
$$ packed form
44219A05094933L06863J663630O72542r15552M48886L671237L867937q2195l568793
44210A11159488k976048j62794J484956J739365K008609K184550J667488J448934
44202A18554548K665620M431281N142161M865453M763880N154230N600303N977843
44194A57155319O171260N700602M766577M516680N218240N628565N402802O257241
44186B00817286Q892383J0731487R431132P037892P148262Q845562P708921L145373
44178B63758298J53286J938463M876918M020335N19438n52555J958031M049933
44170B80722147K878621L05846n22082J113199M137925P147501Q123890N410573
44162C09317620L91362l149793l646212l249633l397731k059749K157452O168058
$$ plain form
44154 302531374 308777714 312416325 314795691 317678840 319810076 319608257 319052407 321675068
44146 321675068 327650574 333796256 338121721 341683253 345724951 349490125 351854975 353426515
44138 353426515 355750208 359168963 362335049 363610967 362617670 360555589 359075243 358836648
44130 358836648 359434342 360546817 362220601 363813195 363889632 361880296 358795187 355631453
44122 355631453 352387565 349510279 348616071 350261287 352560620 353908396 355541168 358993309
44114 358993309 362419158 362678731 360479139 359872337 362281736 364462818 363587233 361339567
44106 361339567 361074453 363100582 364859357 364358421 361575405 357452791 353178035 349930050
44098 349930050 348105071 347083455 346312857 345901921 345679918 344703196 342385386 339244376
$$ packed form
44154C02531374O246340L638611K379366K883149K131236k01819n55850K622661
44146C21675068N975506O145682M325465L561532M041698L765174K364850J571540
44138C53426515K323693L418755L166086J275918r93297k062081j480346k38595
44130C58836648N97694J112475J673784J592594P6437k009336l085109l163734
44122C55631453l243888k877286q94208J645216K299333J347776J632772L452141
44114C58993309L425849K59573k199592o06802K409399K181082q75585k247666
44106C61339567k65114K026129J758775n00936k783016m122614m274756l247985
44098C49930050j824979j021616p70598m10936k22003r76722k317810l141010
$$ plain form
44090 339244376 336047985 333218913 331321250 330564102 329258854 324727547 317033828 310030299
44082 310030299 306824572 305495632 301513740 293718914 285503459 279881985 275525470 268837720
44074 268837720 258901390 248984409 242958193 240904941 238981235 233676227 225385664 217232805
44066 217232805 211362115 207698146 205524026 204148097 202021229 197472330 191071375 185441569
44058 185441569 181911374 179041857 175272504 171225820 168385889 167223915 167655063 169510532
44050 169510532 171419592 171229221 168959392 167395550 168273716 169998791 170734060 171146674
44042 171146674 171818426 170698719 166366676 161541093 159532698 158908658 155813341 150341557
44034 150341557 146075738 143919735 141235081 137260721 134434954 133300220 130911962 126219439
$$ packed form
44090C39244376l196391k829072j897663p57148j305248m531307p693719p003529
44082C10030299l205727j328940l981892p794826q215455n621474m356515o687750
44074B68837720r936330r916981o026216k053252j923706n305008q290563q152859
44066B17232805n870690l663969k174120j375929k126868m548899o400955n629806
44058A85441569l530195k869517l769353m046684k839931j161974M31148J855469
44050A69510532J909060j90371k269829j563842Q78166J725075P35269M12614
44042A71146674O71752j119707m332043m825583k008395o24040l095317n471784
44034A50341557m265819k156003k684654l974360k825767j134734k388258m692523
$$ plain form
44026 126219439 122625157 122496485 122778904 119192268 112015068 104663239 98874647 94403881
44018 94403881 91535025 90573899 90026346 88285166 86404238 86622148 88693651 89963555
44010 89963555 88646390 85153513 80804141 77001837 74874961 73903592 71843842 67951525
44002 67951525 65104150 66254511 69738630 71064026 68999637 66777068 66911320 67835746
43994 67835746 66825258 63927703 61449256 60938969 61960891 63036267 63015971 62070600 61499073
43985 61499073 61891409 61866565 59896442 56968199 55636956 56559718 58078647 59407838 61658539
43976 61658539 64736446 65856793 63239937 59536019 59023096 62051563 64586408 63368065
43968 63368065 59661644 57260967 58060481 60574898 62329139 62727402 63172604 64720768
$$ packed form
44026A26219439l594282j28672K82419l586636p177200p351829n788592m470766
44018I4403881k868856r61126n47553j741180j880928K17910K071503J269904
44010H9963555j317165l492877m349372l802304k126876r71369k059750l892317
44002F7951525k847375J150361L484119J325396k064389k222569J34252R24426
43994F7835746j010488k897555k478447n10287J021922J075376k0296r45371n71527
43985F1499073L92336k4844j970123k928243j331243R22762J518929J329191K250701
43976F1658539L077907J120347k616856l703918n12923L028467K534845j218343
43968F3368065l706421k400677P99514K514417J754241L98263M45202J548164
$$ plain form
43960 64720768 66483971 66981609 66617390 67716320 71821283 77669925 82186708 83039785
43952 83039785 80254842 76117700 73650579 74300664 76737245 78573653 79399558 81148562
43944 81148562 85195968 90310361 94240790 96372113 97877984 99942756 102788980 106010574
43936 106010574 109006137 111330991 113186652 115211951 117409166 118968718 119778345 121344256
43928 121344256 125261907 131237072 137541534 143073184 148025112 152743771 156963997 160413993
43920 160413993 163578525 167480095 172599861 177860524 181023498 180956161 179443040 179466358
43912 179466358 181362182 182275087 180340383 177776322 178262218 182505826 188213450 193338739
43904 193338739 197134771 198785071 197735478 195441294 194235988 193974693 192170293 188237138
$$ packed form
43960F4720768J763203M97638l64219J098930M104963N848642M516783Q53077
43952H3039785k784943m137142k467121O50085K436581J836408Q25905J749004
43944H1148562M047406N114393L930429K131323J505871K064772K846224L221594
43936A06010574K995563K324854J855661K025299K197215J559552Q09627J565911
43928A21344256L917651N975165O304462N531650M951928M718659M220226L449996
43920A60413993L164532L901570N119766N260663L162974o7337j513121K3318
43912A79466358J895824R12905j934704k564061M85896M243608N707624N125289
43904A93338739L796032J650300j049593k294184j205306k61295j804400l933155
$$ plain form
43896 188237138 185261726 186268627 190642744 195637891 199637079 202293988 203168873 202467565
43888 202467565 202176394 204257516 208052663 211184801 212598576 212956438 212445852 210321260
43880 210321260 206840494 203794171 202571706 203144810 205301059 209159919 213708457 216520611
43872 216520611 216304653 214670348 214023755 214513867 214485709 213340961 212190649 211628464 210536830
43863 210536830 207840574 204328555 201744422 200601559 199786610 198138503 195679620 193243583
43855 193243583 191461608 190333936 189444307 188270808 186328683 183275026 179216544 175090743
43847 175090743 172348403 171552427 171367234 170000976 168057078 168598597 173077633 178263869
43839 178263869 179326294 175727461 171725907 170629701 171142103 170711611 169906983 170874810
$$ packed form
43896A88237138k975412J006901M374117M995147L999188K656909Q74885p01308
43888B02467565k91171K081122L795147L132138J413775L57862n10586k124592
43880B10321260l480766l046323j222465N73104K156249L858860M548538K812154
43872B16520611k15958j634305o46593M90112k8158j144748j150312n62185j091634
43863B10536830k696256l512019k584133j142863q14949j648107k458883k436037
43855A93243583j781975j127672q89629j173499j942125l053657m058482m125801
43847A75090743k742340p95976j85193j366258j943898N41519M479036N186236
43839A78263869J062425l598833m001554j096206N12402m30492q04628R67827
$$ plain form
43831 170874810 173057711 173535689 171130152 167347875 163287198 158386636 152706383 147792840
43823 147792840 144267551 140714883 135953038 130384862 124236611 116904105 109431747 105074506
43815 105074506 105218137 106801345 106207135 103846552 102084394 100398784 96366326 90682432
43807 90682432 87005577 86183079 84387978 78670144 71522260 67818722 69128084 73070012
43799 73070012 76809059 78964505 78873563 76254614 71909701 67474925 64104913 61999834
43791 61999834 61150140 61773064 63769061 66186393 67630485 67334550 65728912 63674803
43783 63674803 61209317 57756370 53802932 51189885 50695952 50300750 47442302 42530605
43775 42530605 38566431 37553161 39049404 42037524 45990446 49790387 51993287 53184481
$$ packed form
43831A70874810K182901M77978k405537l782277m060677m900562n680253m913543
43823A47792840l525289l552668m761845n568176o148251p332506p472358m357241
43815A05074506J43631J583208n94210k360583j762158j685610m032458n683894
43807I0682432l676855q22498j795101n717834p147884l703538J309362L941928
43799G3070012L739047K155446r0942k618949m344913m434776l370012k105079
43791F1999834q49694O22924J995997K417332J444092k95935j605638k054109
43783F3674803k465486l452947l953438k613047m93933l95202k858448m911697
43775D2530605l964174j013270J496243K988120L952922L799941K202900J191194
$$ plain form
43767 53184481 56030691 61616697 67311848 69679164 68254245 65227766 62659321 61271503
43759 61271503 60774558 60039142 58004853 55574800 55368991 58395851 62409312 64929207
43751 64929207 66158135 67087453 66683427 63791323 60539231 60505047 63802701 67053367 68300497
43742 68300497 68919513 70170349 70932070 70083499 68560995 67490694 66342835 64587867
43734 64587867 63427019 64034652 65337829 65293508 63467159 60847224 58061952 55457970
43726 55457970 54163046 55097028 57132391 58131331 58134154 59860065 65136318 71857084 75641390
43717 75641390 74279737 69700869 65488613 63282688 62231814 61413533 61445324 63190598
43709 63190598 65875815 67532160 66938605 64422948 61352355 59689526 61096978 64905458
$$ packed form
43767E3184481K846210N586006N695151K367316j424919l026479k568445j387818
43759F1271503m96945p35416k034289k430053k05809L026860M013461K519895
43751F4929207J228928R29318m04026k892104l252092l4184L297654L250666J247130
43742F8300497O19016J250836P61721q48571j522504j070301j147859j754968
43734F4587867j160848O07633J303177m4321j826349k619935k785272k603982
43726E5457970j294924R33982K035363R98940K823J725911N276253O720766L784306
43717G5641390j361653m578868m212256k205925j050874q18281L1791J745274
43709F3190598K685217J656345n93555k515657l070593j662829J407452L808480
$$ plain form
43701 64905458 67656385 66690907 63843005 63136161 64805197 64688597 60544193 55676903
43693 55676903 54030263 54430401 52907707 48849355 45082824 42759821 40217807 37134200
43685 37134200 35866881 37378134 39198069 39400233 39827953 42914224 47430805 50207244
43677 50207244 50647307 50627688 50837243 50404457 49993503 51928884 56264487 59455672 58604394
43668 58604394 55203390 53017490 53649147 55899342 58415830 61037742 63947691 67107391
43660 67107391 70384540 73065721 73693161 71754995 69110284 68124822 68617365 68424236 66946952
43651 66946952 66007361 66590026 66845446 64685783 60915777 58290528 58371759 60592829 63627073
43642 63627073 66336627 67880031 68101131 67575299 66552024 64511725 61596902 59492916
$$ packed form
43701F4905458K750927r65478k847902p06844J669036j16600m144404m867290
43693E5676903j646640M00138j522694m058352l766531k323003k542014l083607
43685C7134200j267319J511253J819935K02164M27720L086271M516581K776439
43677E0207244M40063j9619K09555m32786m10954J935381M335603L191185q51278
43668E8604394l401004k185900O31657K250195K516488K621912K909949L159700
43660F7107391L277149K681181O27440j938166k644711r85462M92543j93129j477284
43651F6946952r39591N82665K55420k159663l770006k625249Q1231K221070L034244
43642F3627073K709554J543404K21100n25832j023275k040299k914823k103986
$$ plain form
43634 59492916 59467768 60157818 58919308 55275350 51661499 50638463 52366291 54851208
43626 54851208 55850252 54617217 52444671 51210935 50963807 49910374 47670366 47094689
43618 47094689 50930560 57552793 62277006 62621292 60135915 57327463 55388267 55233129
43610 55233129 57877589 62383477 65487312 64941021 62070859 59902617 59841085 61125786
43602 61125786 62451599 63142871 63498784 64507050 66344006 67103582 64559672 59502430
43594 59502430 55487934 54634599 55559342 56255890 56790385 57738724 58042906 56479285 53976260
43585 53976260 52628158 53262815 55264658 57625311 58892644 57549610 54123126 51711120
43577 51711120 52747251 56257628 59646373 61741474 62534658 61735245 59864257 59333844
$$ packed form
43634E9492916k5148O90050j238510l643958l613851j023036J727828K484917
43626E4851208R99044j233035k172546j233736k47128j053433k240008n75677
43618D7094689L835871O622233M724213L44286k485377k808452j939196j55138
43610E5233129K644460M505888L103835n46291k870162k168242o1532J284701
43602F1125786J325813O91272L55913J008266J836956P59576k543910n057242
43594E9502430m014496q53335R24743O96548N34495R48339L04182j563621k503025
43585E3976260j348102O34657K001843K360653J267333j343034l426484k412006
43577E1711120J036131L510377L388745K095101P93184p99413j870988n30413
$$ plain form
43569 59333844 61821061 65412110 66698519 64983481 62312684 60339707 59516468 60383238
43561 60383238 62941876 65332125 65672454 64681768 64136208 63691589 62061885 60395090 61077934
43552 61077934 63635746 65275338 65274330 65266289 65298549 63603988 60679495 59427636 60239436
43543 60239436 59959015 57168958 54695305 55171296 57742248 60894437 64652908 67766972
43535 67766972 66794177 61165578 55792286 55220096 58059278 60528942 62444776 65571000
43527 65571000 68574757 68429908 65570268 63265188 62564727 61807524 60679085 61016664 63681897
43518 63681897 67785500 72641367 77443299 79739112 77774373 73978095 72597478 74165996
43510 74165996 75890980 77054395 79712955 83836249 86340741 86070881 85551491 86336832
$$ packed form
43569E9333844K487217L591049J286409j715038k670797j972977q23239Q66770
43561F0383238K558638K390249L40329r90686n45560m44619j629704j666795O82844
43552F1077934K557812J639592j008q041L2260j694561k924493j251859Q11800
43543F0239436k80421k790057k473653M75991K570952L152189L758471L114064
43535F7766972r72795n628599n373292n72190K839182K469664J915834L126224
43527F5571000L003757j44849k859640k305080p00461p57203j128439L37579K665233
43518F3681897M103603M855867M801932K295813j964739l796278j380617J568518
43510G4165996J724984J163415K658560M123294K504492k69860n19390P85341
$$ plain form
43502 86336832 86667230 85634526 85816253 89338397 94624109 99555354 104762251 111049827
43494 111049827 116487490 119211717 120738785 123297504 125978683 126935305 127672687 131452438
43486 131452438 138340973 145141559 149639553 152009068 152775313 152526790 153207639 156504537
43478 156504537 160916173 163238159 162992814 162704377 163891823 165763881 167971462 171330058
43470 171330058 175110684 176859032 176110944 175320175 175704920 175248352 172840527 171455136
43462 171455136 174220798 179305332 181970308 180756380 178672333 178664040 180627360 182936385
43454 182936385 184424833 184334884 182384422 179778510 178786578 180581883 184339768 188523900
43446 188523900 191813443 192768249 190419092 185997502 182674616 182571848 184942957 187891508
$$ packed form
43502H6336832L30398j032704J81727L522144N285712M931245N206897O287576
43494A11049827N437663K724227J527068K558719K681179R56622P37382L779751
43486A31452438O888535O800586M497994K369515P66245k48523O80849L296898
43478A56504537M411636K321986k45345k88437J187446J872058K207581L358596
43470A71330058L780626J748348p48088p90769L84745m56568k407825j385391
43462A71455136K765662N084534K664976j213928k084047q293J963320K309025
43454A82936385J488448q9949j950462k605912r91932J795305L757885M184132
43446A88523900L289543R54806k349157m421590l322886j02768K371109K948551
$$ plain form
43438 187891508 190520572 192411926 192525278 190469443 188088768 187801790 189461703 190530147
43430 190530147 189400965 186865321 184028286 180657205 176495758 172610460 170060304 168295006
43422 168295006 166270003 164314095 163379712 163098755 162348060 161448248 161882655 163713682 165256594
43413 165256594 165817188 166595399 167680554 166302256 160376995 152580841 148094162 148298385
43405 148298385 149228313 147038831 142816533 140423603 141036072 141898576 140203261 136422962
43397 136422962 133244778 132218236 132269708 131279914 128511381 125134669 122379084 119649019
43389 119649019 115199191 108785817 102819936 100181815 101213859 103452343 104023215 101688746
43381 101688746 96957893 91282215 86277402 82740078 79904700 76248118 71419672 66785416
$$ packed form
43438A87891508K629064J891354J13352k055835k380675k86978J659913J068444
43430A90530147j129182k535644k837035l371081m161447l885298k550156j765298
43422A68295006k025003j955908r34383k80957p50695q99812M34407J831027J542912
43413A65256594N60594P78211J085155j378298n925261p796154m486679K04223
43405A48298385R29928k189482m222298k392930O12469Q62504j695315l780299
43397A36422962l178184j026542N1472r89794k768533l376712k755585k730065
43389A19649019m449828o413374n965881k638121J032044K238484N70872k334469
43381A01688746m730853n675678n004813l537324k835378l656582m828446m634256
$$ plain form
43373 66785416 63603059 61280816 58191453 53912292 49929018 48113101 48868540 50604763
43365 50604763 50757539 47828498 43016250 39369487 38589323 39229637 39071848 38464932 39316463
43356 39316463 40955326 39790952 34408589 28580499 26734966 27907187 27229563 22970086
43348 22970086 18826974 18564766 21348535 23945292 25059097 25208114 24125800 21213218
43340 21213218 17919878 16818743 17965037 18426580 16198885 12846532 11317495 12492174
43332 12492174 14918830 16871848 17470562 16429135 13958298 10891779 8182460 6197274
43324 6197274 4793542 3921925 3863558 4925778 6923893 8903946 9808182 9843559 10448212
43315 10448212 11876100 11755497 8179874 3928554 4590015 11365350 18610160 20728925
$$ packed form
43373F6785416l182357k322243l089363m279161l983274j815917P55439J736223
43365E0604763J52776k929041m812248l646763p80164O40314j57789o06916Q51531
43356C9316463J638863j164374n382363n828090j845533J172221o77624m259477
43348B2970086m143112k62208K783769K596757J113805J49017j082314k912582
43340B1213218l293340j101135J146294M61543k227695l352353j529037J174679
43332A2492174K426656J953018N98714j041427k470837l066519k709319j985186
43324F197274j403732q71617n8367J062220J998115J980053R04236L5377O04653
43315A0448212J427888j20603l575623m251320O61461O775335P244810K118765
$$ plain form
43307 20728925 19082622 18926545 21274370 21968329 18542192 13697973 10730344 9116991
43299 9116991 6802248 4104662 2701732 2539280 2419383 2522582 3809034 5624034 6367840
43290 6367840 6243940 7004152 8973446 10631561 11483751 12993049 15649619 17128893 15096273
43281 15096273 10838991 8421701 10343405 15054332 18829190 19417972 17602934 15452763
43273 15452763 13591257 10937940 7329620 5115411 6578643 10229117 11729586 9061158
43265 9061158 4926181 2927409 3091304 3045643 2404896 3278839 6304133 8756912 8007707
43256 8007707 5226564 3776458 4653841 5571103 4728290 3527055 4388626 7218947 9800022
43247 9800022 11181077 12700851 15297907 17671719 18253724 17630153 17418746 17585438 16757426
$$ packed form
43307B0728925j646303j56077K347825O93959l426137m844219k967629j613353
43299I116991k314743k697586j402930j62452j19897J03199J286452J815000P43806
43290F367840j23900P60212J969294J658115Q52190J509298K656570J479274k032620
43281A5096273m257282k417290J921704M710927L774858N88782j815038k150171
43273A5452763j861506k653317l608320k214209J463232L650474J500469k668428
43265I061158m134977j998772J63895m5661o40747Q73943L025294K452779p49205
43256H007707k781143j450106Q77383R17262q42813j201235Q61571K830321K581075
43247I800022J381055J519774K597056K373812N82005o23571k11407J66692q28012
$$ plain form
43238 16757426 14975064 14143114 15199083 16471484 15951612 14200043 13724062 15721586
43230 15721586 18383893 18651227 15375826 10643151 7877702 8555419 11097173 13183444
43222 13183444 14290223 15034342 15019367 13347765 11147129 11210899 14202361 17193759 17403620
43213 17403620 15777619 15090598 15777673 15844312 14278201 12264459 10960414 10058146 9038217
43204 9038217 8284214 8323724 9111547 10520996 12491654 14399859 15532258 16581078 19178981
43195 19178981 23104867 25418171 23818055 19908785 17449315 17793427 18768573 18042062
43187 18042062 15812959 13644535 12345024 12201368 13955886 17675492 21159987 21519780
43179 21519780 18745098 16133647 16517488 19426489 22699938 25260169 26923201 27003795
$$ packed form
43238A6757426j782362q31950J055969J272401n19872j751569m75981J997524
43230A5721586K662307K67334l275401m732675k765449O77717K541754K086271
43222A3183444J106779P44119j4975j671602k200636O3770K991462K991398K09861
43213A7403620j626001o87021O87075O6639j566111k013742j304045r02268j019929
43204I038217p54003L9510P87823J409449J970658J908205J132399J048820K597903
43195A9178981L925886K313304j600116l909270k459470L44112R75146p26511
43187A8042062k229103k168424j299511j43656J754518L719606L484495L59793
43179B1519780k774682k611451L83841K909001L273449K560231J663032Q0594
$$ plain form
43171 27003795 25275299 23490847 23575583 24568235 23748032 20869527 18717996 18914911 19806904
43162 19806904 19590415 18947766 19003764 19129302 18866132 19760762 22607398 24734735 23259178
43153 23259178 19878757 19008860 21617907 24277306 24350257 22768392 21123417 19351152
43145 19351152 17603031 17523421 19784850 22375481 23080495 22128287 20996968 20230283 19950562
43136 19950562 21002043 23805299 27116958 29471093 30953943 32203128 32644399 31220795
43128 31220795 28122544 24473869 21098514 18871399 19248478 22600746 26503832 27539100
43120 27539100 24963734 21420824 20006757 21547577 24486080 26363274 25577444 22796311
43112 22796311 20740030 21799821 25796420 30467884 33751744 34997931 34509427 32881329
$$ packed form
43171B7003795j728496j784452Q4736R92652q20203k878505k151531J96915Q91993
43162A9806904k16489o42649N5998J25538k63170Q94630K846636K127337j475557
43153B3259178l380421q69897K609047K659399P2951j581865j644975j772265
43145A9351152j748121p9610K261429K590631P05014r52208j131319p66685k79721
43136A9950562J051481K803256L311659K354135J482850J249185M41271j423604
43128C1220795l098251l648675l375355k227115L77079L352268L903086J035268
43120B7539100k575366l542910j414067J540820K938503J877194p85830k781133
43112B2796311k056281J059791L996599M671464L283860J246187m88504j628098
$$ plain form
43104 32881329 30733873 28516892 26570530 25289738 24537171 23058395 19941806 16890799
43096 16890799 16976176 20118617 22090206 19916095 16199717 15417870 17601964 19113188
43088 19113188 18725630 18920507 20960842 22720562 22690615 22587528 24013653 25599963 25980775
43079 25980775 26952153 30426880 34074259 33757178 29679941 26428883 26543575 27456649 26081114
43070 26081114 23460236 22629993 23921802 25218037 25924786 27605158 30326576 31189645
43062 31189645 28074564 23064658 20165936 20611833 22458378 24163002 25968697 27481282
43054 27481282 26652802 22720813 18212944 16094565 16248524 16768415 17538559 19928923 23377687
43045 23377687 25105865 23858385 21761408 21523296 23402354 25808452 27479453 28150384
$$ packed form
43104C2881329k147456k216981j946362j280792p52567j478776l116589l051007
43096A6890799Q5377L142441J971589k174111l716378p81847K184094J511224
43088A9113188l87558J94877K040335J759720k9947j03087J426125J586310L80812
43079B5980775R71378L474727L647379l17081m077237l251058J14692R13074j375535
43070B6081114k620878q30243J291809J296235P06749J680372K721418Q63069
43062C1189645l115081n009906k898722M45897J846545J704624J805695J512585
43054B7481282q28480l931989m507869k118379J53959N19891P70144K390364L448764
43045B3377687J728178j247480k096977k38112J879058K406098J671001O70931
$$ plain form
43037 28150384 28244327 28704857 30126641 31584874 31624210 30804100 31431294 33884509 35256860
43028 35256860 33243374 29566181 27428785 27038606 26286815 25016985 25607720 29139269
43020 29139269 33591089 36548105 37578769 37144455 35219037 32227001 29688383 28483120
43012 28483120 27667080 26299252 25222809 25488904 26098591 25274774 23389422 22487790 22971472
43003 22971472 23005040 21818227 21403211 23443790 26146949 26232772 23475080 21147150 21713821
42994 21713821 23859937 24583027 22859004 20041413 17534917 15617683 14414931 14555060
42986 14555060 16235982 18451810 19865615 20136446 19933658 19971217 20545325 21752890 23431717
42977 23431717 24804413 24891065 23727494 22758699 23456474 25684544 27893135 28772596 28161272
$$ packed form
43037B8150384R3943M60530J421784J458233L9336q20110O27194K453215J372351
43028C5256860k013486l677193k137396l90179p51791j269830N90735L531549
43020B9139269M451820K957016J030664m34314j925418k992036k538618j205263
43012B8483120q16040j367828j076443K66095O09687q23817j885352r01632M83682
43003B2971472L3568j186813m15016K040579K703159Q5823k757692k327930N66671
42994B1713821K146116P23090j724023k817591k506496j917234j202752J40129
42986A4555060J680922K215828J413805K70831k02788L7559N74108J207565J678827
42977B3431717J372696Q6652j163571r68795O97775K228070K208591Q79461o11324
$$ plain form
42968 28161272 26544754 24650341 23706732 24891023 27746598 30188850 31209792 32621722
42960 32621722 36454555 41259174 43248717 41279634 38378272 37474428 37839755 37226698
42952 37226698 35514540 34043482 32762521 30662429 28380528 27725090 28643378 29115284
42944 29115284 28379383 27893435 28407343 28432531 26907500 25425056 26082385 28447782 30462179
42935 30462179 31541896 33016340 35694225 38359895 38845979 35995853 30838828 26319023
42927 26319023 25242802 27729816 31130295 32946522 33012503 32192570 30317689 26977641
42919 26977641 23449937 21795027 22105826 22412431 21531548 20427743 20390696 21474414 23454657
42910 23454657 26797086 31394738 35266848 35902586 32699625 27328782 22168333 19191447
$$ packed form
42968B8161272j616518j894413r43609J184291K855575K442252J020942J411930
42960C2621722L832833M804619J989543j969083k901362r03844L65327o13057
42952C7226698j712158j471058j280961k100092k281901o55438R18288M71906
42944B9115284p35901m85948N13908K5188j525031j482444O57329K365397K014397
42935C0462179J079717J474444K677885K665670M86084k850126n157025m519805
42927B6319023j076221K487014L400479J816227O5981q19933j874881l340048
42919B6977641l527704j654910L10799L06605q80883j103805l7047J083718J980243
42910B3454657L342429M597652L872110O35738l202961n370843n160449k976886
$$ plain form
42902 19191447 19672810 23385338 27843890 29665833 27601174 23846948 21890239 23294497
42894 23294497 26731101 29527311 29711565 27205456 23916417 22427713 23646123 25642978
42886 25642978 25661716 23481254 21806178 22666049 24299978 22932616 17668600 12463080
42878 12463080 12402215 18260263 25442052 28658691 27297241 25424656 26380710 28608051
42870 28608051 28148709 24477897 21452781 21856640 23460597 22487831 19259454 17482806
42862 17482806 18472568 19343711 17828399 16060950 17484900 21649178 24585292 23970578
42854 23970578 21693402 20752086 21276698 20916671 18480364 15670208 14796453 15848174 16934500
42845 16934500 17193811 17774005 19563324 21384604 21492539 19906572 18075799 16949020
$$ packed form
42902A9191447M81363L712528M458552J821943k064659l754226j956709J404258
42894B3294497L436604K796210J84254k506109l289039j488704J218410J996855
42886B5642978J8738k180462j675076Q59871J633929j367362n264016n205520
42878A2463080o0865N858048P181789L216639j361450j872585R56054K227341
42870B8608051m59342l670812l025116M03859J603957r72766l228377j776648
42862A7482806R89762Q71143j515312j767449J423950M164278K936114o14714
42854B3970578k277176r41316N24612l60027k436307k810156q73755J051721J086326
42845A6934500K59311N80194J789319J821280J07935j585967j830773j126779
$$ plain form
42837 16949020 16587037 16991686 17906126 18303751 17484754 16166099 15093880 13475052 10786763
42828 10786763 9247807 11584144 16355584 18567114 15757300 10895894 8304086 9221502
42820 9221502 12424820 16353308 18836439 17324766 11879531 6319728 4323039 5732105
42812 5732105 8213969 10521708 12075894 11522779 8626722 6176881 7080357 10432234
42804 10432234 13043183 13941431 14721254 16292655 18108898 20015938 22021481 22624646
42796 22624646 20253739 16258876 13772181 13610468 13850077 13296217 12633012 12212415 11613128
42787 11613128 11500657 12945963 14714794 14450759 12917432 13446512 16256901 17216357 14107068
42778 14107068 10523351 10851758 14231759 16588888 16578314 16243229 16997292 18063343 18526322
$$ packed form
42837A6949020l61983M04649R14440L97625q18997j318655j072219j618828k688289
42828A0786763j538956K336337M771440K211530k809814m861406k591808R17416
42820I221502L203318L928488K483131j511673n445235n559803j996689J409066
42812E732105K481864K307739J554186n53115k896057k449841R03476L351877
42804A0432234K610949Q98248P79823J571401J816243J907040K005543O03165
42796B2624646k370907l994863k486695j61713K39609n53860o63205m20597n99287
42787A1613128j12471J445306J768831k64035j533327N29080K810389R59456l109289
42778A4107068l583717L28407L380001K357129j0574l35085P54063J066051M62979
$$ plain form
42769 18526322 18501062 18321028 18300908 19025977 20346996 20511271 17931136 13707227 11021753
42760 11021753 11894844 15315337 18367848 18567687 15592098 11578368 9487005 10598581
42752 10598581 13771234 17122222 19655095 21206921 21978721 22432251 22482416 20614318 15398224
42743 15398224 8379272 3704153 3917449 7517620 11415584 14172732 15871651 16550366
42735 16550366 16199832 15193672 13766825 12145810 11436527 12455389 13407323 11543596
42727 11543596 7995486 7501045 11469282 14972658 13615568 9998727 9329961 11393058
42719 11393058 11876898 10026572 9441123 11454782 12983876 11926704 10194054 9811751
42711 9811751 9825695 8971158 8265851 8943180 10336375 11629959 13434471 15859626 17160775
$$ packed form
42769A8526322k5260j80034k0120P25069J321019J64275k580135m223909k685474
42760A1021753Q73091L420493L052511J99839k975589m013730k091363J111576
42752A0598581L172653L350988K532873J551826P71800M53530N0165j868098n216094
42743A5398224p018952m675119K13296L600171L897964K757148J698919O78715
42735A6550366l50534j006160j426847j621015p09283J018862R51934j863727
42727A1543596l548110m94441L968237L503376j357090l616841o68766K063097
42719A1393058M83840j850326n85449K013659J529094j057172j732650l82303
42711I811751J3944q54537p05307O77329J393195J293584J804512K425155J301149
$$ plain form
42702 17160775 16254302 14900851 15526413 18147319 20995720 22970762 23967084 23762744 21994337
42693 21994337 18755800 14598130 10656920 8805130 10161752 13229018 15377967 16514057
42685 16514057 18942913 22957927 25452450 24477884 22408275 22261656 23233991 22740157 21054060
42676 21054060 20573096 21441137 21308104 19357527 17575941 17569688 18600349 19431966 19988546
42667 19988546 20324264 19749582 18096528 16704279 17216936 20012255 24084204 27641031
42659 27641031 28792477 26938065 23917119 22653747 24087843 26344783 27320199 26903535
42651 26903535 25921896 24153991 20934656 17338869 16084592 18493891 22331363 23762042
42643 23762042 21603686 18776832 18811659 21483211 23237463 22035829 20100724 20749324
$$ packed form
42702A7160775r06473j353451O25562K620906K848401J975042R96322k04340j768407
42693B1994337l238537m157670l941210j851790J356622L067266K148949J136090
42685A6514057K428856M015014K494523r74566k069609j46619R72335m93834j686097
42676B1054060m80964Q68041j33033j950577j781586o253J030661Q31617N56580
42667A9988546L35718n74682j653054j392249N12657K795319M071949L556827
42659B7641031J151446j854412l020946j263372J434096K256940R75416m16664
42651B6903535r81639j767905l219335l595787j254277K409299L837472J430679
42643B3762042k158356k826854L4827K671552J754252j201634j935105O48600
$$ plain form
42635 20749324 23832041 26174894 25985387 24705382 24312390 24898814 25878171 27748767 30863609
42626 30863609 33366919 32398639 27590343 22066345 19495910 20864973 24330724 27361235
42618 27361235 28545648 28088038 27378983 27838168 29496650 30794844 30345724 28821452 28379963
42609 28379963 30021148 32184474 32464380 30304275 27439635 25919748 26274802 27541705
42601 27541705 28478819 28581685 28278531 28292629 28649182 28444049 26983112 25004048 24097506
42592 24097506 24768147 25760788 25741163 25046256 24994371 25701052 25579342 23460718 20551474
42583 20551474 19356632 20644968 22401003 22345485 20730547 19564954 19549776 19491725 19069503
42574 19069503 20176915 24010905 28268803 29518536 27851403 26725209 27904441 29056225
$$ packed form
42635B0749324L082717K342853j89507j280005l92992N86424R79357J870596L114842
42626C0863609K503310r68280m808296n523998k570435J369063L465751L030511
42618B7361235J184413m57610p09055M59185J658482J298194m49120j524272m41489
42609B8379963J641185K163326K79906k160105k864640j519887L55054J266903
42601B7541705R37114J02866l03154J4098L56553k05133j460937j979064r06542
42592B4097506O70641R92641j9625o94907n1885P06681j21710k118624k909244
42583B0551474j194842J288336J756035n5518j614938j165593j5178n8051m22222
42574A9069503J107412L833990M257898J249733j667133j126194J179232J151784
$$ plain form
42566 29056225 27588686 24764396 23936971 25885019 28161642 28676955 27717312 26197994
42558 26197994 24091886 21644671 20473080 21810226 24542135 26672857 28244879 30839186
42550 30839186 34099816 35071407 32197055 28077791 26309156 26943577 27598930 28117026 30614497
42541 30614497 34544018 35584768 31563295 26409202 25134568 27035715 27559791 25619215
42533 25619215 24736846 26824563 29054654 28391950 25865372 24202133 23763501 23326888 23167656
42524 23167656 24638198 27320462 28855457 27718082 24821667 22289436 21423193 21744695
42516 21744695 21535154 19642053 17014789 15857125 17106801 19596249 21746247 22860511
42508 22860511 22635007 21026103 19071637 18155091 17926262 16905151 15782011 17534832
$$ packed form
42566B9056225j467539k824290q27425J948048K276623N15313r59643j519318
42558B6197994k106108k447215j171591J337146K731909K130722J572022K594307
42550C0839186L260630R71591k874352m119264j768635O34421O55353N18096K497471
42541C0614497L929521J040750m021473n154093j274634J901147N24076j940576
42533B5619215q82369K087717K230091o62704k526578j663239m38632m36613j59232
42524B3167656J470542K682264J534995j137375k896415k532231q66243L21502
42516B1744695k09541j893101k627264j157664J249676K489448K149998J114264
42508B2860511k25504j608904j954466r16546k28829j021111j123140J752821
$$ plain form
42500 17534832 22800426 27726933 28695088 26978543 26025354 26104927 25100757 23395459 24075480
42491 24075480 28291259 33768160 38311870 41684940 43300438 41242282 35363386 29274590
42483 29274590 27330898 30525462 36260784 41030311 42567451 40757286 37736811 36422279
42475 36422279 37933848 40714149 42543685 42949461 43344386 45190240 48157502 49997074
42467 49997074 48798534 45790420 44805150 47824925 52130307 53559029 51722936 49862959
42459 49862959 50112009 51517324 52859625 54682036 57481812 59959314 60425338 58762945
42451 58762945 56122901 53648775 52007509 51230081 50740641 50319707 50678453 51985130 52751369
42442 52751369 52076961 51988187 54778300 58690014 59752588 57942167 57554376 60524256 63395247
$$ packed form
42500A7534832N265594M926507R68155j716545r53189P9573j004170j705298O80021
42491B4075480M215779N476901M543710L373070J615498k058156n878896o088796
42483B9274590j943692L194564N735322M769527J537140j810165l020475j314532
42475C6422279J511569K780301J829536M05776L94925J845854K967262J839572
42467D9997074j198540l008114r85270L019775M305382J428722j836093j859977
42459D9862959K49050J405315J342301J822411K799776K477502M66024j662393
42451E8762945k640044k474126j641266p77428m89440m20934L58746J306677P66239
42442E2751369o74408q8774K790113L911714J062574j810421l87791K969880K870991
$$ plain form
42433 63395247 62743006 59929510 58068404 57535652 57259515 57537523 58417549 57684105 53727065
42424 53727065 48548388 45002749 43062420 41767028 42434804 46119172 49936007 50360267
42416 50360267 48831608 49451931 51939275 51849850 47864496 43943106 43325895 44858130 46635340
42407 46635340 49099515 52548766 55183196 55923669 56294990 57418087 57794019 56116648
42399 56116648 53662646 51672593 48946804 44713271 41608278 42534432 45879552 47121628
42391 47121628 44823485 42319086 43226332 47269377 50994524 51393457 48479508 44889979
42383 44889979 43008966 42516501 41451714 39448734 38270375 38798114 39483022 38700894 36693749
42374 36693749 34011629 30188171 25687237 23049981 23686920 25073587 23794491 20378035
$$ packed form
42433F3395247o52241k813496j861106n32752k76137K78008Q80026p33444l957040
42424E3727065n178677l545639j940329j295392O67776L684368L816835M24260
42416E0360267j528659O20323K487344q9425l985354l921390o17211J532235J777210
42407D6635340K464175L449251K634430P40473L71321J123097L75932j677371
42399E6116648k454002j990053k725789m233533l104993R26154L345120J242076
42391D7121628k298143k504399R07246M043045L725147L98933k913949l589529
42383D4889979j881013m92465j064787k002980j178359N27739O84908p82128k007145
42374C6693749k682120l823458m500934k637256O36939J386667j279096l416456
$$ plain form
42366 20378035 18458842 19708744 22128954 23137736 22045385 19543652 16909424 15835618
42358 15835618 17139721 19423039 20502101 20026605 19211108 18532217 17630015 17005767 17493236
42349 17493236 18167041 17184834 14926724 14006745 15764584 18832445 21431181 22815225
42341 22815225 22188565 18903381 14553524 12250608 12675115 13293078 12664994 12751022 15119755
42332 15119755 17617322 17540819 16167030 17007717 20529361 23517963 23497455 21464281 20099383
42323 20099383 20941203 23429444 25571497 25680193 24196093 23104918 22882861 21435044
42315 21435044 17305342 12321201 9241246 8297742 8228394 9141357 11492474 13455108 12818218
42306 12818218 11096924 12158697 16452013 19982357 19747907 16996580 14116811 11553082
$$ packed form
42366B0378035j919193J249902K420210J008782j092351k501733k634228j073806
42358A5835618J304103K283318J079062m75496q15497o78891r02202o24248M87469
42349A7493236O73805r82207k258110r19979J757839L067861K598736J384044
42341B2815225o26660l285184m349857k302916M24507O17963o28084Q6028K368733
42332A5119755K497567p6503j373789Q40687L521644K988602k0508k033174j364898
42323B0099383Q41820K488241K142053J08696j484100j091175k22057j447817
42315B1435044m129702m984141l079955r43504o9348R12963K351117J962634o36890
42306A2818218j721294J061773M293316L530344k34450k751327k879769k563729
$$ plain form
42298 11553082 9328482 8586124 9554494 10423009 10270187 10870081 13560769 16601373 17921894
42289 17921894 18206035 18556536 17394041 13180323 8554586 7729663 10507506 12876458
42281 12876458 13365804 14597449 17856152 20359889 19822875 18284289 18853345 21169006
42273 21169006 22779525 23111841 23191793 22722764 20557924 17733053 17165303 19809790 23189254
42264 23189254 24416593 23084192 20557028 17989210 16030966 15269442 15688648 16332817
42256 16332817 16576332 17209343 19128793 21357369 21847128 20402644 19279035 20129370 21713511
42247 21713511 21926613 21013167 20836429 21427169 20704897 18233048 16911317 19269006 23588172
42238 23588172 25697153 23850788 20036386 17041175 16177732 17601199 20664876 23575747
$$ packed form
42298A1553082k224600p42358R68370Q68515j52822N99894K690688L040604J320521
42289A7921894K84141L50501j162495m213718m625737q24923K777843K368952
42281A2876458M89346J231645L258703K503737n37014j538586N69056K315661
42273B1169006J610519L32316P9952m69029k164840k824871n67750K644487L379464
42264B3189254J227339j332401k527164k567818j958244p61524M19206O44169
42256A6332817K43515O33011J919450K228576M89759j444484j123609Q50335J584141
42247B1713511K13102r13446j76738N90740p22272k471849j321731K357689M319166
42238B3588172K108981j846365l814402k995211q63443J423467L063677K910871
$$ plain form
42230 23575747 24581526 24171732 24558375 26344947 27319729 25482125 21823426 18942393
42222 18942393 18069151 18671043 19931613 21141797 21338174 20137513 18732162 18782059 20374119
42213 20374119 22139715 23312609 24531681 26407512 28320249 29189388 28843548 28013745
42205 28013745 27153617 25855064 23789807 22009322 22512250 25921119 30136134 32382031
42197 32382031 32465137 32691960 34292513 35468294 34018804 30726864 28570210 28950668 30172401
42188 30172401 29902103 28056738 26547758 26574910 27088143 26533745 25649042 26941613 30558154
42179 30558154 32347369 28308870 20227331 14038172 12535572 12924939 12416991 12436685 14934106
42170 14934106 17982324 18778745 18689114 20992169 24921543 26542142 25174377 24228898 25113810
$$ packed form
42230B3575747J005779m09794L86643J786572R74782j837604l658699k881033
42222A8942393q73242O01892J260570J210184J96377j200661j405351M9897J592060
42213B0374119J765596J172894J219072J875831J912737Q69139l45840q29803
42205B8013745q60128j298553k065257j780485N02928L408869M215015K245897
42197C2382031Q3106K26823J600553J175781j449490l291940k156654L80458J221733
42188C0172401k70298j845365j508980K7152N13233n54398q84703J292571L616541
42179C0558154J789215m038499q081539o189159j502600L89367n07948J9694K497421
42170A4934106L048218P96421q9631K303055L929374J620599j367765r45479Q84912
$$ plain form
42161 25113810 25102630 22956143 22192825 25814633 31164575 33504824 32366474 30788229
42153 30788229 29895912 28090733 25098422 23205220 23834762 25454811 25754452 24211080
42145 24211080 21920212 20236270 19936070 20511774 20129498 17569312 14364157 13652253 16589075
42136 16589075 21158409 24802644 26715323 26939909 24985037 20978167 17250182 16720253
42128 16720253 19455086 22342373 22873383 22024557 22201599 23289612 22801582 20019989 17605311
42119 17605311 17735940 18691799 17660376 15542178 15689378 18197605 19201982 16816599
42111 16816599 14163396 14463739 16334013 16874290 16726310 18234415 20362641 19882439 17064997
42102 17064997 15721366 17069836 17805285 15729213 13502948 14446738 17564906 19597339
$$ packed form
42161B5113810j1180k146487p63318L621808N349942K340249j138350j578245
42153C0788229q92317j805179k992311j893202O29542J620049K99641j543372
42145B4211080k290868j683942l00200N75704l82276k560186l205155p11904K936822
42136A6589075M569334L644235J912679K24586j954872m006870l727985n29929
42128A6720253K734833K887287N31010q48826J77042J088013m88030k781593k414678
42119A7605311J30629R55859j031423k118198J47200K508227J004377k385383
42111A6816599k653203L00343J870274N40277j47980J508105K128226m80202k817442
42102A7064997j343631J348470P35449k076072k226265R43790L118168K032433
$$ plain form
42094 19597339 19980929 20738205 22493113 23444238 22204890 19631248 17619580 17304322 18395977
42085 18395977 19451072 19094749 17570186 16439615 16292149 15895096 14315082 12429288
42077 12429288 11325324 10876570 11262702 13907340 18767714 22554998 22532674 20694806 20811828
42068 20811828 22361735 21578039 18477135 18089506 23074835 29296181 31537542 30411816
42060 30411816 30107736 31429410 31034493 27011406 21906132 19851203 22763752 29336946
42052 29336946 35875609 38311267 35475039 30619963 28147277 28944941 30579054 31544456
42044 31544456 32792429 34881199 36435858 36627797 36904449 38634044 40812340 41993945
42036 41993945 43185625 46633120 52226334 57043929 58559603 56963506 54271306 52382486
$$ packed form
42094A9597339L83590P57276J754908R51125j239348k573642k011668l15258J091655
42085A8395977J055095l56323j524563j130571j47466l97053j580014j885794
42077A2429288j103964m48754L86132K644638M860374L787284k2324j837868J17022
42068B0811828J549907p83696l100904l87629M985329O221346K241361j125726
42060C0411816l04080J321674l94917m023087n105274k054929K912549O573194
42052B9336946O538663K435658k836228m855076k472686P97664J634113R65402
42044C1544456J247973K088770J554659J91939K76652J729595K178296J181605
42036D1993945J191680L447495N593214M817595J515674j596097k692200j888820
$$ plain form
42028 52382486 52220457 53630706 55514534 56603581 56504159 55736805 54772853 53584522 52310800
42019 52310800 51778049 52792646 54997825 56895147 57253000 56251259 54801892 52901476
42011 52901476 49598901 45105504 41961285 42799888 47221036 52085945 54747127 54679494
42003 54679494 52209694 47768120 43071353 40991766 42726183 46276013 48954367 50192766
41995 50192766 50667041 50207341 48494725 46715715 46369761 47065200 47433436 47463050 47703952
41986 47703952 46920829 43408945 38550860 36089211 37370078 40067783 42168901 44015594
41978 44015594 45239431 43286045 37543652 32053089 30765677 31981687 31010470 27110564
41970 27110564 23943771 23494504 23552088 22119193 20837865 22160514 25518736 28432656
$$ packed form
42028E2382486j62029J410249J883828J089047r9422p67354r63952j188331j273722
42019E2310800n32751J014597K205179J897322L57853j001741j449367j900416
42011E2901476l302575m493397l144219Q38603M421148M864909K661182o7633
42003E4679494k469800m441574m696767k079587J734417L549830K678354J238399
41995E0192766M74275m59700j712616j779010l45954O95439L68236K9614K40902
41986D7703952p83123l511884m858085k461649J280867K697705K101118J846693
41978D4015594J223837j953386n742393n490563j287412J216010r71217l899906
41970B7110564l166793m49267N7584j432895j281328J322649L358222K913920
$$ plain form
41962 28432656 29993740 31330918 33421891 35984649 38079010 38687288 37158635 34036940
41954 34036940 31033913 29387785 28711500 28153930 28015912 29219288 31629291 33957512
41946 33957512 35171763 35209248 34530375 33757804 33526933 33902529 34147177 33758559 33285332
41937 33285332 33191425 32551799 30417349 28126952 28091284 29729840 28866079 22785402 14361809
41928 14361809 9118603 9076201 11699323 14423667 17463427 21472726 24954421 25808335
41920 25808335 24145161 21871986 20261965 19400981 19301639 19809885 19687949 17562922 13982876
41911 13982876 11057178 9787463 9198458 8470249 8259463 9015015 9506121 8442479 6574922
41902 6574922 5711600 6337685 7727388 9795842 12830806 15383337 14712558 10463598 6285263
$$ packed form
41962B8432656J561084J337178K090973K562758K094361O08278j528653l121695
41954C4036940l003027j646128o76285n57570j38018J203376K410003K328221
41946C3957512J214251L7485o78873p72571k30871L75596K44648l88618m73227
41937C3285332r3907o39626k134450k290397l5668J638556q63761o080677q423593
41928A4361809n243206m2402K623122K724344L039760M009299L481695Q53914
41920B5808335j663174k273175j610021q60984r9342N08246j21936k125027l580046
41911A3982876k925698j269715n89005p28209k10786P55552M91106j063642j867557
41902F574922q63322O26085J389703K068454L034964K552531o70779m248960m178335
$$ plain form
41893 6285263 6112140 9600678 12887024 13531326 12889140 13195656 14053213 13197674 9942224
41884 9942224 6293021 4588702 5222287 7086320 9285271 11615887 13843102 15365333
41876 15365333 15675928 14783353 13191191 11677533 10912702 10968855 11264855 11177186 10596617
41867 10596617 9832329 9274167 9240812 9746528 10337535 10763730 11891791 14911604 19093581
41858 19093581 21458735 19746603 14959339 9971700 6566653 5144092 6188522 9783506
41850 9783506 14030418 16250302 15972492 14806954 13398239 10986834 8348912 8142150
41842 8142150 10851459 13039437 11813745 9021367 8545202 10999412 13893099 16101027
41834 16101027 19131735 23884671 28629592 30821999 29388857 25074001 20034684 17109793
$$ packed form
41893F285263j73123L488538L286346O44302o42186L06516Q57557q55539l255450
41884I942224l649203j704319O33585J864033K198951K330616K227215J522231
41876A5365333L10595q92575j592162j513658p64831N6153K96000q7669n80569
41867A0596617p64288n58162l3355N05716N91007M26195J128061L019813M181977
41858A9093581K365154j712132m787264m987639l405047j422561J044430L594984
41850I783506M246912K219884k77810j165538j408715k411405k637922k06762
41842H142150K709309K187978j225692k792378m76165K454210K893687K207928
41834A6101027L030708M752936M744921K192407j433142m314856n039317k924891
$$ plain form
41826 17109793 17787160 20477134 21982095 20824525 18142696 15695837 14455457 14820380
41818 14820380 16385304 17499405 16886673 15833150 16897950 20237731 23207015 23986123
41810 23986123 23461916 22890922 22041238 20768438 20165317 20589275 20591215 19616492 19750711
41801 19750711 22421998 25161457 24775321 22743183 23834565 29124507 33835148 33478859
41793 33478859 29407758 26231790 25691650 25628277 24075314 21709183 20051100 19362954 19143343
41784 19143343 19233421 19418962 18985103 17775725 16924665 17292953 17706523 16199033 12863552
41775 12863552 9943920 8880910 8815981 8558478 8406954 8980300 9715051 10007381 10700130
41766 10700130 12673192 14761361 15034969 13757511 13107695 14072034 15539482 16509406 17128838
$$ packed form
41826A7109793O77367K689974J504961j157570k681829k446859j240380L64923
41818A4820380J564924J114101o12732j053523J064800L339781K969284P79108
41810B3986123n24207n70994q49684j272800o03121M23958J940r74723J34219
41801A9750711K671287K739459l86136k032138J091382N289942M710641l56289
41793C3478859m071101l175968n40140o3373j552963k366131j658083o88146k19611
41784A9143343R0078J85541m33859j209378q51060L68288M13570j507490l335481
41775A2863552k919632j063010o4929k57503j51524N73346P34751K92330O92749
41766A0700130J973062K088169K73608j277458o49816R64339J467448R69924O19432
$$ plain form
41757 17128838 17220222 15980398 13952709 13248509 14606524 15971551 15346127 13465397 12082092
41748 12082092 11102501 9481462 7957906 8495421 11083952 13158586 12725013 10653376
41740 10653376 9254045 9589709 10893772 12031200 12741550 13377026 13810050 13144404 10949603
41731 10949603 8510390 7952598 9829218 12283083 13013035 11519294 9170012 7796149
41723 7796149 8495430 10865222 12912519 12679281 10565003 9070882 9651377 11088088 11879801
41714 11879801 12674508 14617191 16497807 15933336 13077904 10723272 10199291 9356986 5954181
41705 5954181 1561372 202844 3414325 8308621 11113715 11494822 12182689 14779496
41697 14779496 17643983 18585147 18043109 17918334 18261585 17493959 15740145 15297416 17075733
$$ packed form
41757A7128838R1384j239824k027689p04200J358015J365027o25424j880730j383305
41748A2082092r79591j621039j523556N37515K588531K074634m33573k071637
41740A0653376j399331L35664J304063J137428P10350O35476M33024o65646k194801
41731A0949603k439213n57792J876620K453865P29952j493741k349282j373863
41723G796149O99281K369792K047297k33238k114278j494121N80495J436711P91713
41714A1879801P94707J942683J880616n64471k855432k354632n23981q42305l402805
41705E954181m392809j358528L211481M894296K805094L81107O87867K596807
41697A4779496K864487R41164n42038j24775L43251p67626j753814m42729J778317
$$ plain form
41688 17075733 19037358 19421090 19170679 19423294 18898854 16338842 13760930 14099431 16427837
41679 16427837 16744827 13510646 9534716 7926746 8748721 10461683 12378605 14462527
41671 14462527 16392519 18093535 20061698 22210201 23361813 22741366 21257168 20619662
41663 20619662 21573236 23180061 23439767 20877040 16181584 11799790 9146113 7229592
41655 7229592 5302734 5272119 8839300 13313985 13974695 10812739 9110633 12073704 16530805
41646 16530805 18070297 17084872 16601855 16731502 15258314 12521793 11675048 13931687 16749924
$$ packed form
41688A7075733J961625L83732k50411K52615n24440k560012k577912L38501K328406
41679A6427837L16990l234181l975930j607970Q21975J712962J916922K083922
41671A4462527J929992J701016J968163K148503J151612o20447j484198o37506
41663B0619662R53574J606825K59706k562727m695456m381794k653677j916521
41655G229592j926858l0615L567181M474685O60710l161956j702106K963071M457101
41646A6530805J539492r85425m83017J29647j473188k736521q46745K256639K818237
$$ [...]
##END NTUPLES=NMR SPECTRUM
##END=
