##TITLE=1H_DE-80H_X3
 200.13MHz, d2o
 8 sc
 
 19ns.26.2.2025
##JCAMPDX= 6.0         $$ Bruker NMR JCAMP-DX V2.0
##DATA TYPE= NMR FID
##DATA CLASS= NTUPLES
##ORIGIN= UXNMR, Bruker Analytische Messtechnik GmbH
##OWNER= pz
$$ XWIN-NMR		Version 3.5
$$ Mon May 12 16:13:21 2025 Russian Standard Time (UT+4h)  Yarkov@DPX200
##.OBSERVE FREQUENCY= 200.1313
##.OBSERVE NUCLEUS= ^1H
##.DELAY= (6, 6)
##.ACQUISITION MODE= SIMULTANEOUS
##.ACQUISITION SCHEME= undefined
##.AVERAGES= 8
##.DIGITISER RES= 18
##SPECTROMETER/DATA SYSTEM= spect
##.PULSE SEQUENCE= zg30
##.SOLVENT NAME= CDCl3
##.SHIFT REFERENCE= (INTERNAL, CDCl3, 0, 14.3821)
##AUDIT TRAIL= $$ (NUMBER, WHEN, WHO, WHERE, WHAT)
$$ ##TITLE= Audit trail, XWIN-NMR		Version 3.5
$$ ##JCAMPDX= 5.01
$$ ##ORIGIN= Bruker BioSpin GmbH
$$ ##OWNER= Yarkov
$$ C:/Bruker/XWIN-NMR/data/yarkov2/nmr/H-C/1/audita.txt
$$ ##AUDIT TRAIL=  $$ (NUMBER, WHEN, WHO, WHERE, WHAT)
(   1,<2025-05-12 16:12:23.98 +0400>,<Yarkov>,<DPX200>,
      <created by zg, POWCHK disabled, PULCHK disabled
       configuration hash MD5:
       00 E9 B6 7A A2 85 ED C7 34 08 36 98 17 FE 4E 26
       data hash MD5: 16K
       E2 92 68 D6 7F 42 44 33 2D 6F 5B 90 EE FC 20 D3>)
$$ ##END=
$$ 
$$ hash MD5
$$ 70 8C F0 33 95 1F F2 5D 99 A4 40 9F 4F 7A 63 91
##$RELAX= 
##$RELAX= 
##$RELAX= 
##$RELAX= 
##$RELAX= 
##$RELAX= 
$$ Bruker specific parameters
$$ --------------------------
##$DU= <C:/Bruker/XWIN-NMR>
##$EXPNO= 1
##$NAME= <H-C>
##$PROCNO= 1
##$TYPE= <nmr>
##$USER= <yarkov2>
##$AMP= (0..31)
100 100 100 100 100 100 100 100 100 100 100 100 100 100 100 100 100 100 
100 100 100 100 100 100 100 100 100 100 100 100 100 100 
##$AQSEQ= 0
##$AQ_mod= 1
##$AUNM= <au_zg>
##$AUTOPOS= <>
##$BF1= 200.13
##$BF2= 200.13
##$BF3= 200.13
##$BF4= 200.13
##$BF5= 200.13
##$BF6= 200.13
##$BF7= 200.13
##$BF8= 200.13
##$BYTORDA= 1
##$CFDGTYP= 0
##$CFRGTYP= 5
##$CHEMSTR= <none>
##$CNST= (0..31)
1 1 145 1 1 1 1 1 1 1 1 1 1 1 1 1 1 1 1 1 1 1 1 1 1 1 1 1 1 1 1 1 
##$CPDPRG= <>
##$CPDPRG1= <>
##$CPDPRG2= <>
##$CPDPRG3= <>
##$CPDPRG4= <mlev>
##$CPDPRG5= <mlev>
##$CPDPRG6= <mlev>
##$CPDPRG7= <mlev>
##$CPDPRG8= <mlev>
##$CPDPRGB= <>
##$CPDPRGT= <>
##$D= (0..31)
0 0.7 0 0 0 0 0 0 0 0 0 0.03 0 0 0 0 0 0 0 0 0 0 0 0 0 0 0 0 0 0 0 0 
##$DATE= 1747051943
##$DBL= (0..7)
120 120 120 120 120 120 120 120 
##$DBP= (0..7)
150 150 150 150 150 150 150 150 
##$DBP07= 0
##$DBPNAM0= <>
##$DBPNAM1= <>
##$DBPNAM2= <>
##$DBPNAM3= <>
##$DBPNAM4= <>
##$DBPNAM5= <>
##$DBPNAM6= <>
##$DBPNAM7= <>
##$DBPOAL= (0..7)
0.5 0.5 0.5 0.5 0.5 0.5 0.5 0.5 
##$DBPOFFS= (0..7)
0 0 0 0 0 0 0 0 
##$DE= 6
##$DECBNUC= <off>
##$DECIM= 32
##$DECNUC= <off>
##$DECSTAT= 4
##$DIGMOD= 1
##$DIGTYP= 9
##$DL= (0..7)
0 120 120 120 120 120 120 120 
##$DP= (0..7)
150 150 150 150 150 150 150 150 
##$DP07= 0
##$DPNAME0= <>
##$DPNAME1= <>
##$DPNAME2= <>
##$DPNAME3= <>
##$DPNAME4= <>
##$DPNAME5= <>
##$DPNAME6= <>
##$DPNAME7= <>
##$DPOAL= (0..7)
0.5 0.5 0.5 0.5 0.5 0.5 0.5 0.5 
##$DPOFFS= (0..7)
0 0 0 0 0 0 0 0 
##$DQDMODE= 0
##$DR= 18
##$DS= 0
$$ [...]
##$SUBNAM2= <"">
##$SUBNAM3= <"">
##$SUBNAM4= <"">
##$SUBNAM5= <"">
##$SUBNAM6= <"">
##$SUBNAM7= <"">
##$SUBNAM8= <"">
##$SUBNAM9= <"">
##$SW= 18.0517328524113
##$SWIBOX= (0..15)
0 0 2 0 0 0 0 0 0 0 0 0 0 0 0 0 
##$SW_h= 3612.71676300578
##$TD= 16384
##$TD0= 1
##$TE= 0
##$TE2= 300
##$TE3= 300
##$TEG= 300
##$TL= (0..7)
0 120 120 120 120 120 120 120 
##$TP= (0..7)
150 150 150 150 150 150 150 150 
##$TP07= 0
##$TPNAME0= <>
##$TPNAME1= <>
##$TPNAME2= <>
##$TPNAME3= <>
##$TPNAME4= <>
##$TPNAME5= <>
##$TPNAME6= <>
##$TPNAME7= <>
##$TPOAL= (0..7)
0.5 0.5 0.5 0.5 0.5 0.5 0.5 0.5 
##$TPOFFS= (0..7)
0 0 0 0 0 0 0 0 
##$TUNHIN= 0
##$TUNHOUT= 0
##$TUNXOUT= 0
##$USERA1= <user>
##$USERA2= <user>
##$USERA3= <user>
##$USERA4= <user>
##$USERA5= <user>
##$V9= 5
##$VALIST= <valist>
##$VCLIST= <CCCCCCCCCCCCCCC>
##$VD= 0
##$VDLIST= <DDDDDDDDDDDDDDD>
##$VPLIST= <PPPPPPPPPPPPPPP>
##$VTLIST= <TTTTTTTTTTTTTTT>
##$WBST= 1024
##$WBSW= 4
##$XGAIN= (0..3)
0 0 0 0 
##$XL= 0
##$YL= 0
##$YMAX_a= 129250
##$YMIN_a= -147773
##$ZGOPTNS= <>
##$ZL1= 120
##$ZL2= 120
##$ZL3= 120
##$ZL4= 120
##$ABSF1= 10
##$ABSF2= 0
##$ABSG= 5
##$ABSL= 3
##$ALPHA= 0
##$AQORDER= 0
##$ASSFAC= 0
##$ASSFACI= 0
##$ASSFACX= 0
##$ASSWID= 0
##$AUNMP= <proc_1d>
##$AZFE= 0.1
##$AZFW= 0.1
##$BCFW= 1
##$BC_mod= 2
##$BYTORDP= 1
##$COROFFS= 0
##$CY= 83.5205535888672
##$DATMOD= 1
##$DC= 2
##$DFILT= <>
##$DTYPP= 0
##$F1P= 10.8118882576601
##$F2P= -7.23987719738617
##$FCOR= 0.5
##$FTSIZE= 0
##$FT_mod= 4
##$GAMMA= 1
##$GB= 0.15
##$INTBC= 1
##$INTSCL= 1
##$ISEN= 128
##$LB= 0.25
##$LEV0= 0
##$LPBIN= 0
##$MAXI= 10000
##$MC2= 0
##$MEAN= 0
##$ME_mod= 0
##$MI= 1.114404
##$NCOEF= 0
##$NC_proc= 0
##$NLEV= 6
##$NOISF1= 3.799351
##$NOISF2= 2.8
##$NSP= 1
##$NTH_PI= 0
##$NZP= 0
##$OFFSET= 14.38212
##$PC= 1
##$PHC0= -1188.606
##$PHC1= 9.73375
##$PH_mod= 1
##$PKNL= yes
##$PPARMOD= 0
##$PSCAL= 0
##$PSIGN= 0
##$REVERSE= no
##$SF= 200.129724274929
##$SI= 16384
##$SIGF1= 3
##$SIGF2= 2
##$SINO= 400
##$SIOLD= 16384
##$SREGLST= <1H.CDCl3>
##$SSB= 0
##$STSI= 0
##$STSR= 0
##$SW_p= 3205.1282051282
##$SYMM= 0
##$S_DEV= 0
##$TDeff= 0
##$TDoff= 0
##$TI= <>
##$TILT= no
##$TM1= 0
##$TM2= 0
##$TOPLEV= 0
##$USERP1= <user>
##$USERP2= <user>
##$USERP3= <user>
##$USERP4= <user>
##$USERP5= <user>
##$WDW= 1
##$XDIM= 8192
##$YMAX_p= 0
##$YMIN_p= 0
$$ End of Bruker specific parameters
$$ ---------------------------------
##NTUPLES= NMR FID
##VAR_NAME=  TIME,          FID/REAL,        FID/IMAG
##SYMBOL=    X,             R,               I
##VAR_TYPE=  INDEPENDENT,   DEPENDENT,       DEPENDENT
##VAR_FORM=  AFFN,          ASDF,            ASDF
##VAR_DIM=   8192,          8192,            8192
##UNITS=     SECONDS,       ARBITRARY UNITS, ARBITRARY UNITS
##FACTOR=    0.0002768,     1,               1
##FIRST=     0,             0,               0
##LAST=      2.2672688,     0,               0
##MIN=       0,             -147773,         0
##MAX=       2.2672688,     129250,          0
$$ Real data points
##PAGE= N=1
##DATA TABLE= (X++(R..R)), XYDATA
0@%%%%%%%%%%%%%%%%%%Nj3J6j6J6j6K1k9L2l4M1m7N3o1O9q0R0j00J14j29J44j61
40h5J80j99K19k43K69k98L31l65M01m42M87n36N92o54P21p96Q84r83J095j231
60f53J393j587J829k141K560l153M064n665R272l3424J1684M8065m2044L1312
74B1512R6710k3987j12061L4155J12921n0260j52905K9414J18591p4738j41016
85a41664N0456J03857l7654p5431M7967R0212j0934l0410N8247L1463n6709k9568
97a68M3780L5138m0539p2467J508M6946j5034n6424p73N7096J3772o1798j1319
110f0282O9293J4435m2592P853M2748K819k8359R532M2065j6460n9678M289M3132
123B8795p891m8437j7208K8748N983k9039J2505L7688r90r575J1384J2542J232
$$ plain form
0 0 0 0 0 0 0 0 0 0 0 0 0 0 0 0 0 0 0 0 5 -8 8 -8 8 -8 13 -16 16 -18 23 -24 29 -32 37 -43 47 -53 61 -68 76 -85
40 -85 95 -104 115 -128 141 -157 174 -191 210 -232 255 -281 311 -343 378 -418 466 -517 578 -653
60 -653 740 -847 982 -1159 1401 -1752 2312 -3353 5919 -27505 -15821 32244 -9800 21512
74 21512 118222 94235 -17826 16329 129250 78990 -73915 -44501 74090 -648 -141664
85 -141664 -91208 12649 -25005 -100436 -52469 37743 26809 -3601 54646 86109 29400 -168
97 -168 43612 78750 38211 -34256 -32748 14198 -836 -57260 -58033 -937 12835 -48963 -60282
110 -60282 9011 23446 -19146 -11293 31455 34274 5915 15447 57512 41052 -18626 -14337 28795
123 28795 20904 -27533 -44741 -15993 -10010 -39049 -26544 11144 10154 579 11963 24505 25737
136B5737q133J638M476j8892j7297J924J318j199r917j2835J1469J6469l47n87
150f176M292N726L193Q99J4533M417j9235M230J5186j7135j6345Q771O448j5353
164f549j8978M670R520r539L183J3578n163M63J5573R700M009n134o371P627K661
179A9250q482r856o669M028k672j6197L974J2040o080l424O801M580P36K74R255
194G558O755j1529q88J1753j098l524l955o764L858N26r227k656K381O80j842
209g972k930Q957N084o966P236Q038q764j179O604j470n769n462N54K036n024
224g027K160K374n418N602O797m374J932M277j390n1j268P72L3n614K368J577
240B750q800J638M454o249n57K643j562O01J394L992K644l714N339O392m596Q48
$$ plain form
136 25737 17604 19242 23718 4826 -12471 -10547 -9229 -10428 -20345 -33180 -21711 -5242 -5589 -6176
150 -6176 -1884 3842 7035 7934 22467 26884 7649 11879 27065 9930 -6415 2356 8804 -6549
164 -6549 -25527 -20857 -11337 -20876 -17693 -4115 -9278 -8815 6758 16458 20467 15333 8962 16589 19250
179 19250 10768 912 -5757 -1729 -4401 -20598 -16624 -4584 -10664 -14088 -7287 -2707 -1971 -1697 7558
194 7558 14313 2784 1896 13649 12551 9027 5072 -1692 2166 2692 -6535 -9191 -6810 -6130 -7972
209 -7972 -10902 -1945 3139 -3827 3409 11447 2683 1504 8108 6638 869 -4593 -4039 -2003 -7027
224 -7027 -4867 -2493 -7911 -2309 4488 114 2046 6323 4933 4882 3614 4386 4419 -1195 1173 2750
240 2750 -6050 -4412 42 -6207 -6764 -4121 -5683 -5082 -3688 304 2948 -766 4573 10965 6369 7217
256G217J899m453l27k392o009O2k564k615J098j441K701K840r71N964L152l166
272I95M773K766l025N65j092j454N46l328o14q62l524K212r42m910L863Q27l433
289f637L413K328m17J816J504L591n5k600M127j46o110K331q81n752P34j30k416
306e300m42J27L668L15k291N230J851l184L740P66l277K003k07k191q9q01P33
323F51j442k725L384q70m065M086P94l107K450R94r9R90m05J819J33k053K223
340B758r44k801K900j756l320L282o67k119P81J044J197r94j092M038o03l193
356a489L492K6l081K781q86k000J159j70l13j108n22L421j403k533M446o21k548
373a349K887J10j425R48q86N17q45j508K286j693j760L601j555k087L269j11j506
$$ plain form
256 7217 9116 4663 4336 1944 -4065 -4003 -6567 -9182 -8084 -9525 -6824 -3984 -4955 1009 4161 995
272 995 5768 8534 5509 6074 4982 3528 4074 746 132 -730 -4254 -2042 -2984 -7894 -4031 -3204 -6637
289 -6637 -3224 -896 -1313 503 2007 5598 5543 2943 7070 6924 814 3145 2264 -3488 -2754 -2884 -5300
306 -5300 -5742 -5615 -1947 -1632 -3923 1307 3158 -26 3714 4480 1203 3206 2999 808 719 -82 651
323 651 -791 -3516 -132 -1002 -5067 -981 -187 -3294 -844 150 51 1041 636 2455 2588 535 2758
340 2758 1814 -987 1913 157 -3163 119 -548 -2667 -1886 -842 355 -639 -1731 2307 1704 -1489
356 -1489 2003 2029 -1052 1729 843 -1157 2 -168 -481 -1589 -2111 1310 -93 -2626 1820 1199 -1349
373 -1349 1538 1648 223 1171 285 802 -43 -1551 735 -958 -2718 883 -672 -2759 510 399 -1107
390a107J459J20Q58j27j327K512q68j886L021j796j991K106j429j676J398r25
406a658m23M7k4K208j207o11M070p06j478K884j214n64J456j796o71j1n48N73
424C27j976l75K345k155r47L006j642o26J849o9L96L2n3K116n76n71K291j968
442A404p10K219k703j651J773j330o77n53j57J658j194J18K767j435j90K943j510
459G72j07J522j876O46N85j024K41j074K73J318k638k67K306k049k29J367j671
476a905R07J226n12P18j49N53J671k130N06J782l246j5J769k382m20Q60j76K97
494f46r26R51J435j294O10K147k753P62J970j808o36P78k59j00j107N13Q95k456
512a924J023K242k702m71K132p99L37N98k02R69n21J042M79k436R60J661k980
$$ plain form
390 -1107 352 472 1330 1203 -124 2388 1520 -366 2655 859 -1132 974 -455 -2131 -733 -1658
406 -1658 -2081 -2034 -2058 150 -1057 -1668 2402 1696 218 3102 1888 1324 2780 984 313 302 -246 327
424 327 -1649 -2024 321 -1834 -2781 225 -1417 -2043 -194 -263 133 165 112 2228 1652 1081 3372 1404
442 1404 694 2913 210 -1441 332 -998 -1675 -2228 -2385 -727 -1921 -1803 964 -471 -661 2282 772
459 772 665 2187 311 957 1542 518 759 -315 -42 1276 -1362 -1629 677 -1372 -1601 -234 -1905
476 -1905 -998 228 -284 434 285 838 2509 379 885 2667 -579 -594 1175 -1207 -1627 -767 -943 -646
494 -646 -1572 -621 814 -480 130 2277 -476 286 2256 448 -188 590 331 231 -876 -363 532 -1924
512 -1924 -901 1341 -1361 -1832 300 -499 -162 436 234 1203 682 1724 2203 -233 727 2388 -592
529e92q77J576j344r9r9l08R24p29O49K145j897P23J622j445O69J229j528K44
547H63M29l70m10j176P48J233k565j33Q20j456R09Q91j548O21R43k27J223l30
565D65J45J198o73N20L30j967O95P04j893M8j22m41J037q15q55O15m49Q79R43
584C64j957J420Q50j214J419N23q45N71qM56k31j718J117M58k097M28M9j612J447
603e80L27j415M48L47P05M18j110J418M38j115J345K62j440J293o5q64M20p40
621I2m63O89j232p2K61j085J051K36j434J515N13q1R20n50K64O25o53O49j4j578
641c47J009j19j391Q56l18j377J189N8m59J83k32Q40L49j140J381J04m97J407
659A496n75r68J223l17n84o0o42K31j65j066R93j39j188J694P0p86J040M7J00
$$ plain form
529 -592 -1469 107 -1237 -1336 -1435 -1743 -819 -1548 -899 1246 -651 72 1694 249 918 2147 619 863
547 863 1292 922 512 -664 84 1317 -1248 -1381 -561 -2017 -1108 -217 -1765 -1144 -201 -428 795 465
565 465 610 1808 1135 1655 1985 18 713 1417 -476 -428 -550 -991 46 -769 -1624 -1009 -1458 -579 364
584 364 -1593 -173 677 -537 882 1405 560 1131 1123 1579 1348 -370 747 1205 -892 -464 -415 -2027 -580
603 -580 -253 -1668 -1220 -873 -168 250 -860 558 996 -119 1226 1488 48 1341 1276 412 832 92
621 92 -371 318 -914 -986 -725 -1810 -759 -523 -1957 -442 71 -10 910 360 624 1249 596 1245 1231 -347
641 -347 662 543 -848 8 -310 -1687 -498 -440 -899 -716 -948 -108 241 -899 482 586 89 1496
659 1496 921 -47 1176 859 275 215 -427 -196 -361 -1427 -434 -573 -1761 -67 3 -783 257 304 404
678D04Q18p16J29J3o56J196r51j528J809o28j032R33k99k75N60m60M27J93m14
697d77J213j72o45J084l75p41J378p66j036J021p03K60m15p14R76l58n47J072
715E5m07l49J289j96l70Q87p46L86P0r00R00o35p92J445r59o10J179m22j26M29
735A28l45P9K13m37P38o62k42J223p01n06J201n00m21Q48n75Q1J44n60P81p35
755b48m25J200o63k21J001j007N3P22n52J55N6l91O81n61p5J006n98l61Q92m74
775A90r0L27m70L82K1p40N05o48j93J180j032j63J073q06NP74k47L12j7l46N08
796E25k76k36P83r35J34N07j144L74M71q57L14pj39L47k56OJ144r25K42J013r09
817A76J84N24p86L12l6o83Q5m10K55M15j098N43Q53j005L72M93l03K61L13k07
$$ plain form
678 404 1222 506 635 648 -8 1188 237 -1291 518 -110 -1142 -209 -508 -783 -223 -683 -256 -63 -477
697 -477 736 564 -81 1003 628 -113 1265 499 -537 484 -219 41 -374 -1088 -112 -470 -1017 55
715 55 -352 -701 588 392 22 909 163 549 619 -281 619 -16 -808 637 -322 -932 247 -175 -301 128
735 128 -217 -138 75 -362 376 -286 -528 695 -6 -512 689 189 -232 616 41 122 266 -294 487 -248
755 -248 -673 527 -136 -357 644 -363 -310 412 -140 15 71 -320 361 -200 -275 731 133 -228 664 190
775 190 100 427 -43 339 360 -380 125 -523 -716 464 -568 -731 342 -464 -459 315 68 380 363 17 525
796 525 249 13 796 -139 -5 502 -642 -268 203 -654 -340 -347 -486 -139 -395 -389 755 -170 72 1085 176
817 176 360 884 98 410 374 -309 -224 -634 -379 36 -1062 -519 334 -671 -299 194 -109 152 465 258
837B58J88j45j08M59q17Q7P22j039q2O17q81K26K75l74M49k61J58O83p48N90N93
858H50q26L79O32j131L87J7o19L21j64k46L85o81K20Q03j095P13L04o09N53J69
878C62l95K89O4j51J46n57M40M58j196M83M18p58J94J85k75J12r3l6M59m50M62
899A61j33l12N87M6n96L27J68n83L02nJ36P5k75J66J29n88N06on38M81j77l66
921d95K74j6K13Ml70N22J67o15N99K90q90N61J24o60P32p20K58K69n58L35j38
942a14l77N35K43j013Q57o8m64M19R0k66Q27n96K94o3m93O48j70p75O92l01m60
963e55K85j11j68N54m30M96Q5k33M26O5m64N88j1o49L35j89j23L36n45K31N6n71
985e92N52k69k98P86k15m32O77k52J37L47j31J39l1l43L47l89l59O86o97l31O12
$$ plain form
837 258 446 301 193 652 -165 -78 644 -395 -477 140 -741 -515 -240 -614 -165 -426 -268 415 -333 257 850
858 850 24 403 1035 -96 291 308 -311 10 -154 -400 -15 -696 -476 327 -768 -55 249 -360 193 362
878 362 -33 256 320 169 315 -242 198 656 -540 -57 361 -397 -203 -18 -293 -181 -274 -310 149 -301 161
899 161 28 -284 303 349 -247 80 248 -335 -33 -38 98 173 -102 64 193 -395 111 105 -433 48 -129 -495
921 -495 -221 -237 -24 -20 -390 132 299 -316 283 573 -317 244 368 -292 440 -280 -22 247 -311 24 -114
942 -114 -491 44 287 -726 131 63 -401 18 108 -158 669 73 367 304 -189 459 289 -486 206 -95 -555
963 -555 -270 -381 -549 5 -425 71 156 -77 349 414 -50 538 527 -122 213 24 -99 237 -308 -77 -21 -592
985 -592 -40 -309 -607 179 -36 -468 209 -43 94 441 310 449 418 75 422 33 -326 360 -337 -668 -56
1006e6k92j51L12j81K62P6k54P40j26l66N21j16l78L96l34j91M15m55K17n6l70
1027c87L73k14m20O73n20J1M42O4r0N15l50OL24l09M09k48j69K84m51l13M63k30
1049a37m17L41k5J00nk30L09K13l09N46k76j56N11m17l5M03l49J29K49o94L51
1070A02l55j26N26n02K06J14n20K19M26l30L19K60l89N67l88p6L25m04j21M54
1090C07n11r9M06l77L1J28n2L23l57r4P43o61n8P02m85O7J67J0l3j7k30L11k91
1113g0o9M01o57j5L15o40J73K83K05k33L36J39M6k32K6O17o90L00K46m88J9M05
1135D17o73L2K32l34L74l20J05K16l92L11L20m13Q4O42n58j1K16Q4l8o0j61J52
1157B25o47L30K96o11n3K14j27L71K60m37K83j81J1M70m64J97K92o01N53m8m56
$$ plain form
1006 -56 -348 -499 -187 -368 -106 -30 -284 456 330 -36 485 369 -9 387 53 -138 277 -178 39 -17 -387
1027 -387 -14 -228 -648 25 -495 -484 -42 22 -68 447 97 103 427 118 527 279 110 394 -57 -370 93 -137
1049 -137 -554 -213 -238 -138 -143 -373 -64 149 -160 386 110 -46 465 48 13 416 67 196 445 -249 102
1070 102 -253 -379 147 -355 -149 -35 -555 -336 90 -240 79 339 -50 517 129 53 378 -26 -147 307
1090 307 -204 -303 103 -274 -243 -115 -167 156 -201 -295 448 -213 -271 431 -54 13 180 190 157 140 -90 221 -70
1113 -70 -139 262 -395 -410 -95 -735 -562 -279 -74 -307 29 168 214 -18 8 625 -65 235 481 -7 12 417
1135 417 -256 -224 8 -326 48 -272 -167 49 -343 -32 288 -125 -41 601 43 32 248 332 294 234 73 225
1157 225 -422 -92 204 -407 -460 -246 -373 -2 258 -179 104 -77 -66 404 -60 137 429 -172 381 333 -123
1178a23J90J7m99K55o7j5K78k21k3J63m38O96Mn31O44j68L9J80k37k25L28k67
1200b0l7K87o39J76M60n89L13K45m29K92j51M1L68m84L87K4k85R8J97l35L84k0
1222B83k30O0j43J10N7l96K65J67o54L92P3k97O61k19J01j78j90J83J68k91J4
1243f4K15k47K81o9j44M00l10k88L91m63j0L20l49O8L01l69O08j20m40M90N7k31
1265B7J01No6J67j77r9Q7l06K43o9l36L59k8n2J56k01K30J38l25L80Rj12R5J02
1289C28j71K94l45m93M43o8j41mj22R0J61l41L92j8j76K08J66k5J3j45J57k77
1311g4j31L67n5j54j6K09o00N21j28j11R4J99k05K28l22J39P9j50L17k9j59J58
1333A77k3k68K69j65j38K91l48J26O0l96M35L1l41J57K25l50M93j26j60L67m38
$$ plain form
1178 -123 67 84 -415 -160 -227 -242 36 -185 -208 -45 -483 213 217 -314 330 162 201 381 144 -81 247 -20
1200 -20 -57 230 -409 -233 227 -362 -49 196 -233 59 -92 -51 317 -167 220 244 -41 57 254 -81 303 283
1222 283 53 113 -30 80 137 -259 6 173 -481 -89 -16 -313 348 129 230 52 -138 45 213 -78 -64
1243 -64 151 -96 185 116 -28 372 62 -226 165 -298 -308 12 -337 -269 32 -337 271 151 -289 201 258 27
1265 27 128 133 67 234 57 -42 45 -261 -18 -87 -423 -64 -92 -144 12 -189 41 179 -146 234 243 131 226 328
1289 328 157 451 106 -387 56 -12 -153 -157 -279 -189 -28 -369 23 5 -171 37 203 178 191 46 203 -74
1311 -74 -205 162 107 -47 -63 146 -454 67 -61 -172 -78 121 -84 144 -178 -39 40 -110 207 178 19 177
1333 177 154 -114 155 -10 -148 143 -205 -79 -19 -415 20 51 -290 -133 92 -258 235 109 -51 316 -122
1354a22J43J73j69J74q7m49N71j76l49N34n09J27J03j42K94J32l46M53j19l75
1374a39L80j97p3M36m12q6o9J1K26M7k23N6q3k30N64r4k26K53r8NJ19j77K17O
1398B13l18L42k27j12M13l61j77K93k41o0K67k18L00j51K7L2j05M8J62l7kK6O5
1421A79K0M1m47K97j01P6M1j37j23K9J01j28K24m02K73k0r7K70k31K8J55j76O1
1444f7J83J6k22L37l03O2J10m84K62L9j17Q2k1J36J37j97J07J70k81J53p4J6q3
1467c9L50m01K06J3j81J22j1k48K88j19l3N4l05P1K91k40K12K2l22L38r7K08j2
1490A67j47j7P4k4pq3j79L62k38j04L70k55J32K9k70K75Qj04n4M2QJ40j49N8J73
1515B07j96j82N40m19N4j14j61K18P0n3r7K19l20R1J37k11M67k44J63R8j41j40
$$ plain form
1354 -122 21 194 25 199 112 -337 234 58 -291 243 -266 -139 -36 -178 116 248 -98 355 236 -139
1374 -139 241 44 -29 407 -5 -91 -160 -149 77 124 -99 -43 -126 -356 208 114 -112 141 43 48 167 -10 207 213
1398 213 -105 237 10 -102 311 -50 -227 66 -175 -235 32 -186 114 -37 -10 22 -83 -35 127 90 88 114 179
1421 179 199 240 -207 90 -11 65 106 -31 -154 -125 -24 -152 72 -330 -57 -77 -174 96 -135 -107 48 -128 -67
1444 -67 116 132 -90 247 -56 6 116 -368 -106 -67 -184 -102 -123 13 150 -47 60 230 -51 102 28 44 -39
1467 -39 311 -90 116 129 -52 70 59 -189 99 -20 -53 1 -304 -233 58 -182 30 52 -270 68 -29 179 167
1490 167 20 3 77 53 46 -37 -216 146 -92 -196 174 -81 51 80 -190 85 93 -11 -65 -23 -15 125 -24 34 207
1515 207 11 -171 369 -50 4 -110 -271 -53 17 -36 -133 86 -234 -143 -6 -217 250 6 169 267 126 -14
1537a4Lj53K32O8k12O0q9J27L8l17M9L57k36J08k4j04J94L3j13J44k0o3K01k42
1561B7M8%k7j80j9k20L43P3j35J64o7j43J78q0J65N8k75K06l6L6j09m6J25pj82
1586a03P9J00l27K43J57k20QR6j07M4O9L6K49k04J76r2j98L4J63j43K0k01k8J14
1610c5j5r6Q2P4j60L59k51J05J78l59L19k12j8L83l35K1J81m16L32m9l75L50j97
1633a34O8J16r9p5P6J96k73L17k51K11r0k76L57j07p1J02J98n76L75j37j07K73
1655I3l29J9O5O0J47j23o8J42Q0j41L4J43n1o6l3j60N76n15J00q0J63L4m15L25
1679@M2k19J86J74k22L9J76j72L2K1j8K47m93L19o4k10J93O6j45R2J41l02K06
1702H9k15O6J66j37j05K95j70K35J8j73K12j53k86K73q7k26M33k62l0L14m08L2
$$ plain form
1537 -14 -11 -164 68 136 -76 -16 -105 22 60 -257 -208 149 -87 21 -3 -107 87 120 7 151 131 68 269 27
1561 27 75 75 48 -132 -151 -371 -28 45 -90 74 7 -136 42 -38 127 185 -90 116 80 116 7 -39 86 79 -103
1586 -103 -24 76 -251 -8 149 -71 -63 33 -74 -30 39 75 324 120 296 204 6 40 203 60 80 -121 -149 -35
1610 -35 -50 -146 -64 10 -150 209 -42 63 241 -118 201 -11 -29 354 19 40 221 -195 137 88 -287 63 -134
1633 -134 -66 50 -49 -124 -48 148 -125 192 -59 152 62 -214 143 36 -35 67 265 -311 64 -73 -180 93
1655 93 -236 -217 -152 -92 55 -68 -136 6 86 -55 -21 122 71 5 -28 -188 388 -127 -27 -107 56 90 -325 0
1679 0 42 -177 9 183 -39 0 176 4 36 57 39 286 -207 112 48 -162 31 97 -48 44 185 -117 89
1702 89 -126 -60 106 -31 -136 159 -11 224 242 69 281 128 -158 115 28 -198 235 -27 -57 257 -151 -119
1724a19Q7j85L96q0o9J03N1l02J57m0K56m6j12K8j11m0j61K27k16L00j47j67J69
1747b1r6j0K93m73L55m1j06K62N9k47L91l78L7j43R7q0J14j60L86j82l0n6n6R8
1771A3j6n8q2L12j26M1kj12J07j0M7j14m1j71J45o9k16L86k42K5J51O7o2K7J17
1796A17n9Q0l50K53n0M0K22m79K28J04r5j97Jo8K99j58j10J77L4K2J00j21J09
1819I9N2k17K82Jl27J83o3J95m6k59q8R1J94j69L06l70Q4K6K61j80o6j15J27m2
1843d1J6o7Q0n2M39m23J29J13k57P0k64J97J7J8N0P6k08m3J57N7M0J15k69j2L09
1868B47l94J54RJ07r3j41r4L94m73N06n8m84K99j8k36L06q6R2q3J75q8Q6l6k14
1892a23K31oj61R1J0k1k03J31J6J06k53N01o23K28K22j33J25k41Q5n8oO5J66k07
$$ plain form
1724 -119 -32 -217 179 99 30 133 184 -118 39 -1 255 209 97 125 14 -26 -187 40 -176 124 -23 -190 -21
1747 -21 -117 -127 166 -307 48 7 -99 163 222 -25 366 -12 25 -118 -21 -101 13 -147 239 57 27 -29 -85 13
1771 13 -3 -61 -143 169 43 84 82 -30 77 67 114 0 -41 -212 -67 -136 -352 34 -208 -183 -32 35 -27 0 117
1796 117 58 138 -212 41 -9 31 253 -226 2 106 11 -186 -185 -253 46 -112 -222 -45 -11 11 111 -10 99
1819 99 151 -66 216 217 -110 73 10 205 159 -100 -188 -97 97 -72 234 -136 -52 -26 235 55 -11 -126 1 -41
1843 -41 -25 -92 -12 -64 375 -48 81 194 -63 7 -257 -60 -43 -25 25 101 -107 -150 7 64 104 219 -50 -62 247
1868 247 -147 7 16 123 30 -111 -205 189 -284 222 164 -320 -21 -39 -275 31 -55 37 -46 129 41 127 91 -123
1892 -123 108 102 -59 32 42 21 -182 -51 -35 71 -182 319 -304 -76 146 13 138 -103 -18 -76 -82 -17 149 -58
1916e8J03N4q5o2n7oK85l76j2Q5K78j04j64m0K6L3J6J23j5p1P0J78l49M1m7LN2
1943i9J90j50J37j55M0k16R3L00m23J79L28j88P0j64P0N5O0j25k1J10Ln8r7K6
1967c5J22m04J02K99l67K17O0j6q4O7p3p4L49k26K01K13n07k2J3j4K21k24K54
1990G2M0j62N5K2J3J98P3k57Q6m0j89K16q7j5N8o0n0K4R0j22Q7j24J36l87M72
2015A49j42Q1Qk65P6J95r9J52o3k02J76J20k4m5r6j26J7K63l68L37n1j87l2J01
2039b5J20l56M36k84K88j14L5o6k9N2L7j37J25j0k18K37k67nPL33k88J16o9L2
2063e0j47Q3J40q7m6J75j65K83n4q1L3j0L9K5m0k41O1L4r1q3J95J13m5k04L27
2088A64j22LO7q3j20J94j44j2J42L7k5m0k13r0L26J35j56m4j21K19j99O7l9J52
$$ plain form
1916 -58 45 99 14 -48 -105 -111 174 -202 -214 -129 149 45 -119 -159 -133 -100 -84 39 24 -47 23 201 -148 -107 -154 -151 -99
1943 -99 91 -59 78 -77 -37 -253 -160 140 -283 -104 224 36 106 -58 12 67 127 2 -19 91 94 36 -61 -35
1967 -35 87 -317 -215 84 -283 -66 -6 -22 -106 -39 -112 -186 163 -63 138 351 -156 -178 -165 -179 42 -182 72
1990 72 112 -50 5 27 40 238 311 54 140 100 -89 127 40 25 83 23 -27 -3 87 -35 52 -72 64 -323 149
2015 149 7 88 96 -169 -93 102 3 155 92 -110 66 186 162 117 21 -105 -88 175 -193 144 93 -94 -126 -25
2039 -25 95 -261 175 -109 179 65 100 34 5 57 94 -43 82 72 -146 91 -176 -181 -174 159 -129 -13 -82 -50
2063 -50 -197 -114 26 -61 -107 68 -97 186 132 51 84 74 113 138 98 -143 -82 -48 -139 -222 -27 86 41 -163 164
2088 164 42 45 112 29 -91 103 -41 -53 89 126 101 61 -152 -242 84 219 63 19 -102 117 -82 -15 -54 98
2112I8J51m01J72K89m05R1J43J1k84K80l05M48j97l08K30J08j50J86r5K0j8j28
2134f4K85j52k68K87j81M5L36k76K60k04j35J14j64l8J80j33o7R0L6m5j1L0K52
2157A77n4o7m9J74m00J46J18mM1o1k67K35K2j22O4n1J73j15k10L37n2k0M6N7k41
2182a23J36O0l7O5l5M3n0j61o5L11k71J24J54k43RJ77j42j09J0P8K25j62J95l4
2206A55j21Q5J0q7r0l9k35L25j01Mj15R4J37kl8J78k73Q7N3P7o9k0J34k51K76
2231A74j98N5l4L3J53j61j00k9m7o6K04J33l02K61l13M30j5j24o7m2j25K76j20
2254b4j3K67j95j14J7o1K1n6k51N34l19J59Q3J6p2Q2M0j77K7j3l8J93k12L29j71
2279E2j29N9P2r5K05j35r8K6K2Q0J68k99P1O0J03j72n6J51j67P1K2r8N7j11J27
$$ plain form
2112 98 249 -152 20 309 -96 -5 138 149 -135 145 -160 288 91 -217 13 121 -29 157 62 82 64 -64
2134 -64 221 69 -199 88 -93 -48 288 12 272 68 -67 47 -117 -155 25 -108 -175 -85 -49 -94 -105 -75 177
2157 177 123 56 7 181 -219 -73 45 41 82 21 -246 -11 11 -111 -47 -98 75 -40 -250 87 35 15 61 118 -123
2182 -123 13 73 36 101 66 109 59 -102 -167 144 -127 -3 151 -92 -83 94 -48 -157 -147 -69 156 -6 189 155
2206 155 34 119 129 42 -48 -87 -322 3 -98 -94 -209 -115 22 20 -18 160 -113 -26 27 104 35 15 149 -102 174
2231 174 -24 31 -3 30 183 22 -78 -107 -154 -220 -16 117 -185 76 -237 193 178 54 -13 -55 -180 96 -24
2254 -24 -37 230 35 -79 -62 -123 -102 -158 -409 125 -194 -35 48 64 -8 74 114 -63 -36 -49 -87 106 -106 223 52
2279 52 -77 -18 54 -41 164 29 -69 -43 -21 59 227 -72 -1 59 162 -10 -66 85 -82 -11 11 -87 -30 -141 -14
2304a4k0R4L0r8J36j27J56j53oL2L0N3ok32rL31k08r6J63k57P9pq9J35q0k8K31
2331D0K5l7R0j64Q1J64l94J70J39k02J43l4K84l93J54k43Q4P6j83L77j82j50J02
2354e3r1K7L27l37Q9J27Qn3j77Q9n1l2J11K59l05p4J40j7r3R9n1K32k55J00k7
2379hMQ1j02K9j22K91Qk20j34J36j1p7q8M20l53J54n8k2K8K14k15L9K25m79M16
2404A56j53k1K22l57K84j99OJ31j6j01p5K13n2P5m4j22J89l58J27J66r1J8P9r5
2428a8J20n2k52K47k33J70J83j35J01L5n3j26L9l5Q7o9l5O5j68K71K8j37J38k69
2452i8K2J02M9o3K75k79m6P4k68J42J0r7J46J30j47R8Q2k04rO1J57o8j49J02L4
2477E6j04j9L9R1j75JQJ6K02j35J14k7O2k40L30j00j63K9Q4n1J55j66j05L0Q4
$$ plain form
2304 -14 -34 60 90 -8 128 1 157 4 -2 30 60 113 107 -125 -134 197 -11 -107 56 -201 -122 -129 -218 -83 -163 -191 40
2331 40 65 28 118 -46 35 199 -195 -25 114 -88 55 21 305 -88 66 -177 -93 -17 -200 177 -5 -155 -53
2354 -53 -144 -117 210 -127 -38 89 97 44 -133 -44 -95 -127 -16 243 -62 -136 4 -13 -106 -7 -58 174 -81 19 -8
2379 -8 -4 77 -25 4 -118 173 181 -39 -173 -37 -48 -125 -213 207 -146 8 -50 -72 -44 170 -45 -6 219 -260 156
2404 156 3 -18 204 -153 131 -68 -62 69 53 -48 -123 90 38 113 69 -53 136 -222 -95 71 -20 -2 77 -18
2428 -18 102 50 -202 45 -188 -18 165 30 131 166 113 -13 26 -9 78 9 -26 39 -129 142 170 33 171 -98
2452 -98 -76 26 75 12 287 8 -38 36 -232 -90 -80 -177 -31 99 -48 50 132 -72 -81 -20 137 69 -80 22 56
2477 56 -48 -67 -28 63 -112 -111 -103 -87 115 -20 94 67 129 -111 219 119 -44 -15 69 18 173 7 -98 -68 16
2502A6j59R0K23k32J34k66L4J14J0J23j98K83l18K22m5o0O0j49J89j42RL4J54
2525A26k58P3q1N0J31k15J89o4N9L2k19L26o5k2j29M3L5J03j35j79J43Q6j05P7
2549AN2q7j67J70N1K3R8j99P4r5K98l6l3j79J33k3j12N2K3J16p5p7L8k35L76j51
2575C6r4n2J85r3j41J42J09K7j82j24J94L9%m8M3lm4K4k07J21J35o4k19J84K25
2600A93m15nK5R6lQ3J02j73J9P9Q6k7k62L72k2j85K7l2N2O4j63K97l34j37L08
2625D5L1p9M1J00k25J43p3K1l7k7O7p5N0rk2J81n3K4j10j02J75K1r9m3M5J48p
2652A31j08j89J75R1j15j8J16j49L9r0O7J01k62K72J1k09J08KJ09j30QL3r4L62
2676B61m39J50o1k5K20j48j69J42l5J96n3j17J99M6k10L4p1p0J86Q8j78j24L38
$$ plain form
2502 16 -143 -53 170 -62 72 -194 -160 -46 -36 87 -111 172 -146 76 31 -29 31 -118 71 -71 -62 -28 126
2525 126 -132 -59 -140 -90 41 -174 15 -49 10 42 -177 149 84 62 -67 -24 11 114 -21 -200 -57 29 -76 1
2549 1 53 -34 -201 -31 20 43 141 -58 16 -79 219 183 150 -29 104 81 -31 21 44 160 85 8 46 -189 187 36
2575 36 -58 -110 75 -18 -159 -17 92 119 -63 -187 7 46 46 -2 41 38 -6 18 -189 -68 67 3 -216 -32 193
2600 193 -222 -227 -202 -106 -109 -26 76 -97 -78 1 87 60 -202 170 148 -37 -10 -42 10 74 -89 208 -126 -263 45
2625 45 76 -3 38 138 -87 56 -17 4 -33 -60 7 -68 -18 -27 -49 132 79 103 -7 -109 66 87 -12 -55 -10 138 131
2652 131 23 -166 9 100 -15 -33 83 -66 -27 -117 -50 51 -211 61 72 -137 -29 -27 82 -48 -40 -7 -101 261
2676 261 -178 -28 -89 -114 106 -42 -211 -69 -104 92 39 -78 121 167 -43 -9 -80 -150 36 124 -54 -178 160
2699A60Qj49n8kP1J6J7o6p4n7m2L4M8J49k27J70r5J01r9J17qP2j50J3Q4J56M7
2726B36l10J96Q7k03j7P7J09l19M8j32P6J72J51j78j54J77J51j88p5Q2n8J18n5
2749iL9P5l37L15j06q6J22Np9j24K16j10j76K74o1j03L44p2j71L8J33j88J99j61
2773b3o9K70k6o6r0p3m0J18j02q7L80pj35o8J7J61k16L1K11j73m9J28j05J48k60
2798a25pP8P1J46r0nlk23J55J32m5L9k47M0P2m5l7K09j45L0j17J11m0j8N9J11
2824A06M2j45J28j56R8k6J16j49k43K02R8j76L0K41k5j82j8o0J82j61J6j00J76
2847fL5k5L0J48j09J10q2l09PJ50K4J86j84j27J27k2K21k37M4q5P5j46Q8K9K9
2872b9O8m2K1O2j17J8R5j9Mj9q1R3Ql26L02l3k2j72J39j2J31J2J48k60n6L46k69
$$ plain form
2699 160 168 19 -39 -41 30 46 63 -3 -77 -134 -176 -142 -94 55 -172 -2 -97 4 -95 22 14 86 -64 -51 33 189 236
2726 236 -74 122 209 6 -11 66 175 -144 -96 -228 -152 20 171 -7 -161 16 167 -21 -96 -14 -72 46 -9
2749 -9 30 105 -232 83 -23 -109 13 18 -61 -185 31 -79 -255 19 -42 -145 199 127 -44 -6 127 -61 138 -23
2773 -23 -92 178 152 86 -4 -77 -117 1 -101 -188 192 185 50 -18 -1 160 -56 -25 186 13 -36 92 -13 135 -125
2798 -125 -132 -54 17 163 73 68 65 -158 -3 129 84 123 -124 -84 -12 -57 -94 115 -30 0 -117 -6 -46 -64 -5 106
2824 106 148 3 131 -25 73 47 163 14 -229 -27 71 -105 -75 166 141 -41 -59 -119 63 -98 -82 -182 -6
2847 -6 29 4 34 182 73 183 101 -208 -201 -51 -27 159 -25 -152 -25 -47 174 -63 -19 -104 -29 -175 -87 -58 -29
2872 -29 39 -3 18 80 -37 -19 76 57 61 42 -39 54 62 -264 38 5 -17 -189 -50 -62 69 81 229 -31 -87 259 -10
2899a0k9n1J83o6n3M3n2Q5K28k07j61Q6r1j7J48k8j57K43k69K18M0q9q6p1K38
2924G5j66K3k5J2L27k19r8K45j40J78j87N3j35O4P1r3j16J46r1K4J30n4J32j44
2948A2J89j36J3j00Rp2O6O1k3Q1pk95K46K3j26J10l58M28j42J10k17K64k38L05
2972B03j03r2j7K25j72j78J99q9l8K8k8J14j5n4K08j22m3N1q0J81j38J02r4r5
2996d7M07k85l3k20J62n4K09k98P1K51j96p6o6Q7M6M4M0r0J95k83L34j10m8q0
3020d0q3J08l4j3J32l74L27P2k05J91j58O2K28l14J25P9q6j25O9j37Q2J21J53
3043A80j21k35J90J91j74J45j16qoM8j22r9k8J64J41j78J32q0J54k37j5J47j01
3066b8jL9n2l0r4L20k25k2M3P9r0J01J43k05j88K08M7m0k55K99kr2K87k06n5q0
$$ plain form
2899 -10 -39 -90 93 27 -26 17 -35 50 278 71 -90 -4 -95 -112 36 8 -149 94 -175 43 83 -6 -92 -163 75
2924 75 -91 -68 -93 -81 246 27 -71 174 34 212 25 78 -57 7 78 -15 -131 15 -76 -52 78 24 156 12
2948 12 201 65 78 -22 -13 -85 -19 42 19 100 93 -202 44 67 -59 51 -307 121 -21 89 -128 136 -102 203
2972 203 100 8 -9 216 44 -134 65 -24 -62 -34 -62 52 37 -17 191 69 26 77 -3 178 40 142 48 -47
2996 -47 360 75 42 -178 -16 -70 139 -159 -88 163 -33 -109 -175 -88 -42 2 42 -48 147 -136 198 88 40 -40
3020 -40 -123 -15 -49 -62 70 -304 23 95 -110 81 -77 -15 213 -101 24 103 17 -108 -39 -176 -94 27 180
3043 180 59 -176 14 205 31 176 60 52 46 94 -28 -127 -155 9 150 -28 104 24 178 -59 -74 73 -28
3066 -28 -29 10 -42 -72 -166 154 -71 -93 -50 29 -61 40 183 -22 -210 -2 45 5 -250 49 47 -45 242 36 -19 -99
3092i9j95J84R6M2Lj79K2L65l49J25L7j10Q9rK7p1OMJo4Q0j9J34q9o4Q3m1m8Q8
3121D9J88k38o9M1J90k49k0n2M1P9J15r5P2j36K1J2l4J43j81L57k34J19l0j16
3145b7l4J43m1k04K19j30L2K89l52J60k02K48m8qO4j57m5K4j1J16J7r3M5J23j68
3170d0J20Ok93M10j16l05J41J2K21k13j14K14j75Q2j43J09l1K17r2k3J39j79J8
3193c5K80j53K6k05q0R8N2Q9q8Kl6j69J65K02k40J51j12MJ07p5n3K3k8J14k4j55
3219a40J88j22K31j81k3J64j31j2j44RJ98o7j75K52r7O9qJ97j06q1J11J7j43R8
3243A04j29K3Q9r8o2K4k13K76n0J13pj45J28Qk81J63o8K34l7k6k0J8J5J31j67
3268B3J10j92j20L90k10R2j87L2O3J97m2K8k42J01P0o7O5j76J80j31j44O7J00
$$ plain form
3092 -99 -294 -110 -14 28 31 -148 -126 239 -110 15 52 -58 31 22 49 -22 -16 -12 -11 -75 5 -14 120 31 -33 50 9 -39 49
3121 49 237 -1 -70 -29 161 -88 -108 -160 -119 -40 75 -20 52 -84 -63 -51 -85 58 -123 234 0 119 89 -27
3145 -27 -61 82 41 -163 56 -74 -42 247 -105 55 -147 101 53 45 109 -48 -93 -69 -80 36 53 -40 5 128 -40
3170 -40 80 86 -207 203 87 -218 -77 -65 156 -57 -171 43 -132 -50 -193 -84 -115 102 10 -13 126 -53 -35
3193 -35 245 92 118 -87 -167 -69 -17 72 -16 -14 -50 -219 -54 148 -92 59 -53 -49 58 -17 -70 -47 -75 39 15 -140
3219 -140 48 -74 157 -24 -47 117 -14 -26 -170 -161 37 -30 -205 47 -50 19 11 208 102 21 132 149 6 104
3243 104 -25 -2 87 -11 -73 -49 -262 14 -36 77 70 -75 53 61 -220 -57 -125 109 72 46 26 44 59 190 23
3268 23 133 -59 -179 211 1 93 -94 -62 1 198 156 184 -58 43 113 46 111 -65 115 -16 -160 -93 7
3291Gj15P2l0J91j28kj86k3K69O8j7l77L71O0k72L5K70k54Rq6N4r7K81K0j53r8
3317a31J45J39k38Q3j10J31j21Q8P5j24J40k54P8Q1L4j24K83r2oj3j16M1r9n8
3341a68K36P3l72K65J02Jn4j27lJ73j22n3J29k9n2O3j5K9j63J74k85J0L76j78
3365A0O3k19J51J31k2k25J66J15j41p6J11m5J42P0j32j37L11k59J66k15n2k2j41
3388b50M14j41K29j90j85J18P4k16J62O2Q6o6j40J21J4Q3l48L09j06j17P4j69
3410a82L9J49k01K29m1LP6p3J11j57p4J14M6k45K84k23L07j19j13J59P9j88j66
3433a86K0J39k3j44M06j18k07J6O2N8K0j69l7J98M3n8k1M6j88n7O8k9O4N4K5M
3459a4M0Q7j02K6j8k00J07k5J77p0j16K9K9q3R8j35K10k40J84L3J0l7O9J90j73
$$ plain form
3291 7 -108 -36 -66 125 -3 -5 -191 -214 55 123 106 -271 100 160 -112 -77 193 -61 -52 -138 -84 -181 100 120 -33 -131
3317 -131 14 153 -85 -2 -112 19 -102 -14 61 -63 77 -177 -99 -18 16 -108 175 83 77 64 -52 -11 -110 -168
3341 -168 68 141 -231 34 136 137 83 -44 -47 126 4 -49 80 51 -1 62 47 76 -87 87 -198 -188 188 10
3365 10 73 -146 5 136 114 -111 55 170 29 -47 64 19 161 231 99 -38 273 14 180 -35 -87 -109 -250
3388 -250 164 23 252 62 -123 -5 69 -147 15 77 163 97 -43 78 92 175 -173 136 30 -87 -13 -182
3410 -182 -143 6 -195 34 -7 -4 72 -1 110 -47 -121 -7 39 -206 78 -145 162 43 -70 89 168 -20 -186
3433 -186 -166 -27 -50 -194 212 94 -113 -97 -35 23 43 -126 -163 35 78 20 -1 45 -143 -200 -132 -161 -97 -43 -18 -14
3459 -14 26 113 11 37 19 -181 -74 -99 78 8 -108 -79 -50 -133 -35 -170 40 -200 -16 17 27 -10 59 249 76
3484G6j69R9J03j83m1M14l12J11k10M1po2J79k71K14j29L2J29K96m55K26k04K73
3507A50k99K42j54J95q8oJ1n4K0j63P8N4Rj54J19O5n7N9k00J82j17NN7j86J15
3532a17J86N9k06K54k66M2J21k09Q1j44J26q8J63R4k12K59j9M5j11j1Q7j31k46
3555b43Q3K81Q9m40J36J62j55lJ17k9Lp9K8oj01o6Q9R2J30qr1QJ6N3j78J56p3
3582b9k7J84m8Rj44J59j93J58l2p8J40j18pL3mK8j62K03k14J71m4K18k18J20j53
3607d8P7K14k71R9j33P6k14K89k64J57J54k99O0J9l6N2J59J08k18j51K17o0MN5
3631D6j71J16q4j10J94l6Q0O2n2j53J96q7pQ9o6n8r9L02l05R8R6k50K87j58J06
3656C6j1j60K40j31j08J77m0j9mj19K89j62J2kj41K38k07N2P9N4J00j73J06j02
$$ plain form
3484 76 -93 6 109 -74 -115 299 -13 98 -112 -71 -78 -140 39 -232 -18 -147 -115 14 310 -145 81 -123 150
3507 150 -149 93 -61 134 46 40 51 -3 17 -146 -68 -14 -5 -159 -40 25 -32 27 -173 9 -108 -103 -46 -232 -117
3532 -117 69 128 -78 176 -90 -48 73 -136 -55 -199 -73 -161 2 96 -116 143 124 169 58 47 134 3 -243
3555 -243 -160 121 210 -230 -94 68 -87 -90 27 -2 1 -78 -50 -56 -157 -223 -134 -42 88 80 -11 -3 13 66 -112 44 -29
3582 -29 -56 128 80 89 -55 104 -89 69 37 -41 99 -19 -26 7 3 31 -131 72 -142 29 -15 203 -15 105 -48
3607 -48 29 243 -28 71 -62 14 -200 89 -175 -18 136 -163 -103 -84 -120 -68 91 199 -19 -170 47 -13 -9 46
3631 46 -125 -9 -93 -203 -9 -45 35 97 45 -108 88 1 -6 83 17 -41 -140 162 -143 -45 51 -199 88 -70 36
3656 36 25 -135 105 -26 -134 43 3 -16 -20 -139 150 -12 0 -2 -143 95 -112 -60 19 73 173 0 106 4
3680Dq8J7N4N6l7k28L77J10j28k38K15j49j46N75j44j25n5%J29j09j27n2M4L9
3704fq1K53j58J2j0O7j2j44K39j21n8Nj52O7J42j03K79p8j79M9l8k9K8K07m18
3729b39K70J04j42j20K03l31J70N6O9q3j42J21J51l6o9J41j61m2J51m7j13J61
3751G2nj23K4j3K52k3j49l4M2k0J02o9P2l21J98MN6P1p2m3j06M3J54J20k39m9
3777e6j00K86j34j1p5J61j28j10J64m2K33k60J9J58j14j63K15M7j93j81J48J84
3799D8o9k7J02M1j67j16L08j14J56M0j46j16J82q1Q0q8o0J7m7Q3o7k4k54L74J1
3824F6K2J1o5j47O9m4n3R7j98K90j85n8K04r7M6k0K9P7r2j19M57k31j77J30j42
3849a30K28j53q0M8K1R3Lk6M1n9K8L2l7j97K66rk7J30l96M31j38j11J74j50k5
$$ plain form
3680 4 -84 -67 -13 43 6 -222 155 265 137 -101 114 -35 -181 394 250 125 70 70 199 90 -37 -89 -45 -6
3704 -6 -87 166 8 20 10 77 65 -79 160 39 -19 -14 -166 -99 43 -60 219 141 -38 11 -27 -56 -28 179 -239
3729 -239 31 135 -7 -127 76 -255 -85 -29 40 -43 -185 -64 87 51 -18 123 -38 -80 71 24 -89 72
3751 72 67 -56 -32 -45 207 184 35 1 43 23 125 56 128 -193 5 9 65 136 64 21 -85 -42 112 232 -7 -56
3777 -56 -156 130 -4 -15 -90 71 -57 -167 -3 -45 188 -72 -53 105 -9 -172 43 90 -103 -284 -136 48
3799 48 -21 -48 54 95 -72 -188 120 6 162 202 56 -60 122 41 121 33 -27 -10 -57 26 -41 -65 -319 55 66
3824 66 88 99 34 -113 -44 -88 -141 -44 -242 48 -137 -195 9 -88 -42 -62 -33 44 -48 -167 290 59 -118 12 -130
3849 -130 98 -55 -135 -87 -66 27 30 4 45 -14 14 46 9 -188 78 69 42 172 -224 207 69 -42 132 -18 -43
3874d3J46k59J40l0J44r1K60k43j15J97k32L71j83j29j9N1n8L0K19k38J79J7j33
3897a9M6p3q1P6K42j49J8j78R4J46k30p5K22N8J50k56J51k72K23k8q0P6k06O9
3921g6K33k08k48J17L21j78J00j37KK33j70J83r2R1k08N5M4Q4m8j14j9j56K06
3944A5Q3j29k7P8K8M0k45J15J03M2k5l6O1j65J31j3p6j17J19N2l8KJ15k74L29
3969A68j78P2p5K08j33j14R5p8J15l41K09O6L9j87p3K84o5J23j68nJ89k44J22
3992B9om8Q4Q8j35o7J06Q7q1j70K21j84L18k10K53m18O3J29J40m4j70j28K76k56
4016a23J47J85j14n1k10k1J70l2p1M0J24J0J53k55J85q2P3l00R0j06j7J88j5J01
4040F9j09J53j44J80j03j65L0J42k28J84K6K9m9P0r3j03J29p5l7J57J01l04J02
$$ plain form
3874 -43 103 -156 -16 -46 98 7 267 24 -91 106 -126 245 62 -67 -86 -35 -93 -63 156 -82 97 114 -19
3897 -19 27 -46 -127 -51 191 42 60 -118 -24 122 -108 -183 39 97 247 -9 142 -130 93 65 -15 61 -145 -76
3921 -76 157 -51 -299 -182 139 -39 61 -76 -74 159 -11 172 80 171 -37 18 62 146 98 -16 -35 -191 15
3944 15 98 -31 -58 20 48 88 -157 -42 61 103 78 42 103 -62 69 56 -20 -137 -18 34 -4 -2 113 -161 168
3969 168 -10 62 -13 195 62 -52 43 -35 80 -261 -52 14 53 -134 -207 77 12 135 -33 -38 151 -93 29
3992 29 23 -25 59 147 12 -55 51 138 57 -113 108 -76 242 32 285 -133 -70 59 199 155 -15 -143 133 -123
4016 -123 24 209 95 44 -166 -187 -17 -49 -120 -80 44 54 207 -48 137 55 128 -172 -82 -188 -205 -17 -32 69
4040 69 -40 113 -31 149 46 -119 -89 53 -175 9 35 64 15 85 -8 -111 18 -57 -94 63 164 -140 -38
4063c8K31q8n5K0j20r3J82j32K46m2j47k3J33j98J44j80M4K15M2l07K47pj28M5
4087il6K89l45O3j79K28J14j86J5J99k36J91p9j6j83P6J2N4J04Jj64J86j26M1
4111A4J27j52q6L5j6n2J07L0j43J12K2q5M2r2N4P4q6J77j67J57J40k39k6q4O7
4136g0K9qJ20K9r0j41K96k58J1o9K28j15N0lj16J05r4J87mO9j93J25k24J06k18
4161b48K67j58J64L4n5P8J7l3P0p8j7J45l85j08J92K2q9K03p5Q7j04K18l10j61
4185c24M25k88L68k86j71K90q4j95K37J35p9K5K9k01J23r5pJ09Q9j75Q3o1M3m8
4209e8p0J42j8J41j88K48j71LpJ44k18J16j59L3j55K38l6n3q0J38M5n7J1K2l44
4234c33J45K96j03k2L9J77l12J62l14L01j49J57j37J72o4j8L6q0J67j48K23q0
$$ plain form
4063 -38 193 105 50 70 -50 -143 39 -93 153 111 -36 -59 74 -124 20 -160 -116 99 141 -166 81 74 -54 -9
4087 -9 -45 244 -101 -38 -217 11 125 -61 -46 153 -83 108 29 13 -170 -94 -82 -28 76 77 -87 99 -27 14
4111 14 141 -11 -97 -62 -78 -130 -23 7 -136 -24 -2 -87 -45 -137 -83 -9 -95 82 -85 72 212 -27 -53 -137 -70
4136 -70 -41 -49 71 100 10 -131 165 -93 -82 -151 77 -38 12 9 -107 -2 -96 91 87 156 -37 88 -136 -30 -248
4161 -248 19 -139 25 59 4 82 99 66 136 58 41 186 -199 -307 -115 -93 -182 21 -54 33 -71 147 -163 -324
4185 -324 101 -187 181 -105 -276 14 -70 -265 -28 107 28 53 82 -119 4 -91 -98 11 100 -75 8 -53 -10 -58
4209 -58 -128 14 -4 137 -51 197 26 29 22 166 -52 64 -95 -62 -217 21 -15 -68 -148 -10 35 -22 -11 11 -333
4234 -333 -188 108 5 -17 22 199 -113 49 -265 36 -113 44 -93 79 15 -3 33 -47 120 -28 195 115
4256A15k15J70n6J05k36J34R4o7K12k64J86k08J02J43L2k43p4K7p5K6J30J04r9
4279D3p3O2kk00J53j4J48j49K7J5j51J4J09P9j06J7K26k10K03j27pj16J31j02
4303c0m1j73L24r3j33L06k86Q5rrJ32p9LK5J61k3Rj07j7k9n3J78k8j68L7j54L08
4330A36P6m25M29j40j15P5J37k68R3Q1j43L82m79J86M7K9J18q8k77K30m5k27K68
4353H0k1k88L35J3q1J52j36Oo3Q5k0J6l2n0L0j5j09M07k91j58J6K48j18j67J49
4378a2R6j49J24j69l0K24j0j89O8J64k5j86P2M6r9M1r4j3K16r8j51k1K74Kk8o3
4404a0R2p6R6J09l38K12l16L56k16Q1L2K3j25P7N2J91m05K71k28m2J68J47k6q6
4428C9o3R0p6KK48l9l23j3K58o4p5K19l0j75j5j37J27%O6kl07J69jR8J03q5K4
$$ plain form
4256 115 -100 70 14 119 -117 17 111 44 256 -8 178 -30 72 215 247 4 -70 -43 -118 -92 38 142 43
4279 43 -30 32 30 -170 -17 -31 117 -32 -5 10 -141 -127 -18 61 -45 -28 198 -12 191 64 57 -59 72 -30
4303 -30 -71 -244 80 -13 -146 160 -126 -41 -50 -59 73 -6 -3 22 183 160 169 62 45 16 -37 141 113 -55 -18 -172 136
4330 136 212 -213 216 76 -39 36 173 -95 -2 79 -64 318 -161 25 72 101 219 131 -146 84 39 -188 80
4353 80 59 -229 106 119 38 190 54 60 -3 82 62 78 46 -4 26 11 -98 309 18 -140 -124 124 6 -161 -12
4378 -12 84 -65 59 -110 -140 84 74 -115 -47 117 92 -94 -22 24 -75 -34 -128 -141 75 -23 -174 -195 79 81 53 -10
4404 -10 82 6 102 211 -127 85 -231 125 -91 -10 22 45 -80 -3 49 240 -165 106 -122 -164 4 151 125 39
4428 39 -24 66 -10 -8 240 201 -122 -135 123 59 -16 203 173 -2 -17 -154 -27 -27 39 37 -270 -101 -102 -4 99 14 38
4455C8J14r1k44K94r3N8Q6l51K65R4%j50M0k12O7J48k35L13j46N8j45R8K6k3N4
4480F3k00J83o3L3j0j05%J97m95L59K2L0L3J65m00K97k56K73k18m4J06J8k1J5
4504a8O0j7N8j16L1J61j05j48M7j6l2K41l6o9j53R1K70O8l27K5L55m23q8M8K62
4529A69q6o4j22P3q6J03L9k5p8R8R9r6n9K58j13j32j91L00r7J22L9J5k80J23R2
4554A01k73K0oK52k26P4O2k7j06k8L2O6O0J32k93J46J9L7r1j77n7K05K45k26J0
4579d9N4j7m6K58Q7l80J47j26KL0K82j10M4l3k34K08k19L96j34j03K3j55J82N8
4603A65j64N7l0m0m1M4J7J20j70K7J12j0j39K8qJ68k16J28j67N6j12J14J58jp2
4628B4q9R7o5l2J94j02J84k15O1l1P8j31K8L5r7PK07o6j41J21m9j12L9O6k11k4
$$ plain form
4455 38 152 61 -183 111 18 76 162 -189 76 170 170 20 60 -152 -85 63 -172 141 -5 53 -92 6 32 9 63
4480 63 -137 46 -17 16 6 -99 -99 98 -397 -38 -16 14 47 212 -188 109 -147 126 -92 -136 -30 -12 -33 -18
4504 -18 42 25 83 -33 -2 159 54 -94 -47 -63 -95 146 110 41 -112 -21 249 317 -10 15 370 -53 -141 -93 169
4529 169 83 19 -103 -30 -116 -13 26 1 -77 21 120 24 -35 223 110 -22 -213 87 -10 112 151 166 -114 9 101
4554 101 -172 -152 -158 94 -132 -58 4 -23 -129 -157 -125 -59 1 133 -160 -14 5 42 -49 -226 -283 -78 167 -59 -49
4579 -49 5 -12 -58 200 287 -93 54 -72 -70 -40 242 132 176 143 -91 117 -102 294 160 57 80 -75 107 165
4603 165 1 58 28 -12 -53 -9 8 128 -42 -15 97 87 -52 -24 -32 136 -80 48 -119 -63 -175 -61 97 96 24
4628 24 -65 32 -33 -65 129 27 211 -4 57 26 104 -27 1 36 -61 -54 153 87 -54 67 18 -94 -55 11 -200 -224
4654b24J14J59k53J12pL9j79J68P6O1J77j05j83J57k6k2j74L0o4K39q9m9j38J61
4678b0JJ93j2l31K23N0o6m7r0J58j46J9J23j93n7J74J30j75J83k67J48k7Q7P1
4702A29m5m3kK8j82r5J64L2q8L08j49j33K01l03J66qJ12k45N6o0R3J32l0j33O8
4727b7n0J70j20Q9J43j46q0l6P4k4k53K74j59J08r7L9J05m1J05j41m7J29J43j82
4751b4l7J40j01J57j11k22K4J26%K42l88J92k2J06j77L9j7J9K03j88l8J46L6k7
4775G8k16J43J72o3m5n9K02j73J27j36j07K91k06m7P2l9N0l4j28LJ28m6J19q7
4799aj39mJ97o3M9o9J88r7m2o6J51j31k7K02j12j65J49J7R6l35J26j7J58m2l37
4824c14K72k2Q4m1N3k36J87P4n3l2m6O9j8J14j97J29M5k37J89j53P3J11p7P4j69
$$ plain form
4654 -224 -110 49 -204 -92 -99 -60 -239 -71 5 66 243 138 -45 112 86 64 -110 -80 -144 95 6 -43 -181 -20
4678 -20 -19 174 162 -169 54 104 38 -9 -99 59 -87 -68 55 -138 -195 -21 109 -66 117 -150 -2 -29 58 129
4702 129 84 41 39 67 -115 -210 -46 -14 -102 206 57 -76 125 -178 -12 -20 92 -153 -97 -157 -64 68 38 -95 -27
4727 -27 -77 93 -27 62 205 59 -21 -57 17 -7 -260 14 -145 -37 -134 -95 10 -31 74 -67 -114 15 158 -24
4751 -24 -61 79 -22 135 24 -198 -174 -48 -48 194 -194 -2 -24 82 -95 -56 -73 -54 149 -39 -77 69 105 78
4775 78 -138 5 177 114 69 10 212 39 166 30 -77 214 8 -39 33 -6 44 10 -118 -115 13 -33 86 -1
4799 -1 -140 -144 53 -10 39 -30 158 61 19 -47 104 -27 -54 148 36 -129 20 37 133 -202 -76 -93 65 23 -314
4824 -314 -42 -64 20 -21 32 -204 -17 57 4 -28 -74 -5 -23 91 -106 23 68 -169 20 -133 -60 51 -26 48 -121
4849a21K65l00K02P7l88N00j68p6k08J51J23j10J05o9j17J30J1j07R3k02M5P9
4871h5K74j37j19n1L17o1k67K21j32K00p9N7j52o0L64k33j46J41k3J6J4p3P7q1
4895a8JQ3Rj00J62Rj62k7j2Q6P6j69j98J95J40j45O7K26l10J15R9j20k69L29k2
4920D5L8j17J62Qj13%k72nK20J28j06L23l62M7j86J48j53O4J93n6j54R3J01j04
4944e8O4p4O3j78M2M1K46j3k60J08j55L33k54j35K80l9R4k72L01j40NN0o9o2J32
4969E0Q0j39J20k89J95J01j73qQ6o4j56J79Qr3J45J46k24p5K75k01k06J37O4J24
4993H2J9J5K8j19L5p6J55k45J61J29j1q0j09OO2Q2j8j13J15m9j0J44m38L83nj44
5019aN2j9N3j52O8J15j07Q7q3K01j17j94LQ0j98L10J57m05R9P5l10K39K67k11
$$ plain form
4849 -121 144 -156 46 123 -265 235 67 -9 -217 -66 57 -53 52 -17 -134 -4 7 -100 -7 -209 -164 -85
4871 -85 189 52 -67 -118 199 138 -129 92 -40 160 81 138 -14 -74 290 57 -89 52 29 45 59 -14 63 -18
4895 -18 -17 66 75 -25 137 146 -16 -43 -55 31 107 -62 -260 -65 75 -70 -3 223 -87 28 127 7 -262 67 45
4920 45 83 -34 128 136 23 23 -249 -254 -34 94 -12 311 -51 -4 -190 -42 -195 -131 62 6 -148 -55 46 -58
4944 -58 6 -68 -5 -183 -141 -100 146 133 -127 -19 -174 159 -95 -230 50 11 105 -167 134 -6 -1 49 -20 -82 50
4969 50 130 -9 111 -178 17 118 -55 -63 23 -41 -197 -18 -10 -103 42 188 -36 -111 164 -37 -243 -106 -42 82
4993 82 101 116 144 25 60 -16 139 -106 55 184 173 93 -16 -10 52 134 116 3 118 69 59 203 -235 148 143 -1
5019 -1 51 32 85 -67 1 116 9 96 13 214 97 -97 -94 -14 -212 98 255 -150 -51 24 -286 -47 220 9
5043IQ4j29J31J2L2m04J01K07l0j48K18P3j81j26K45m8k39J27J33J98l88N9k5
5066h9J21J52N4o9k07k5J81k7N4j49N0m5J83k68J58j23L2j8j10j3m7J70K0N8n
5091C8M2j9j34K51j12n1J45q6J6jn1MJ79k37R8j67J25K27l07L4Q8J8N0k08m1J0
5117h9K5K6KK40j50O1r7J16j50j64K20M5M7O4k94J25J77l43K37j59K8K54m23L97
5141A95r3P1m67K30J58j19n2K55j28q3J93l75L03j33j67L50r8j53OK38l7l7Jk05
5165a47R0O5J8o5J09j46r1O8L6l7J15j20P2K39j62k17K75l2K57k61K5J28k66j6
5189f3l6J88p2j46K49p4j93r9K38J13k52pO2KqO9J0j8%J28p4j00K82r7o9J4j54
5216a07K41j93O6o8PJ33m3j12O8J95j91l0pO9J1j91O2Q7J0O0J18j28j3r4K7o7
$$ plain form
5043 9 93 -36 95 107 139 -265 -164 43 13 -135 83 156 -25 -151 94 46 -193 -66 67 265 -123 -64 -89
5066 -89 32 184 238 169 -38 -63 118 91 145 -4 46 1 184 -84 74 -49 -17 -35 -145 -158 -205 -35 -15 43 38
5091 38 80 61 -73 178 66 15 160 74 90 89 38 42 221 -16 82 -85 40 267 -40 -6 82 100 150 -58 -99 -89
5117 -89 -64 -38 -36 204 54 115 18 134 -16 -180 40 85 132 196 -98 27 204 -139 98 -61 -33 221 -202 195
5141 195 102 173 -294 -64 94 -25 -77 178 50 -33 160 -215 88 -45 -212 138 40 -113 -107 131 94 57 58 -147
5165 -147 -57 8 26 -39 70 -76 -167 -99 -63 -100 15 -105 -33 206 44 -173 102 70 327 66 91 219 -47 -63
5189 -63 -99 89 17 -129 120 46 -147 -246 -8 105 -147 -154 -92 -90 -98 -29 -19 -37 -37 91 17 -83 199 102 33 47 -107
5216 -107 134 -59 7 -61 -54 79 36 -76 -8 187 -4 -34 -41 28 39 -152 -90 -3 7 67 185 57 44 -50 -23 -90
5242i0K9J12P4k51J24j07N5j80J34P5k9J39j06l7l9O4j10lJ29m2P0M0mL8r4j5
5268b4K37m82M20k33J40j9p1qj92K3J32J22k51K85j49l4N9j17J27N4m2O7j23p
5292h6K1N9j73L12j58J05l75L55q4on7P9J83j22l30K67m7K7J43j58J40q9J32q1
5316E7J14j53j09L6Q0j35J25l01M28k26l8J82p7j12J75j03Q2J00j76Q8m6O0o5
5339a4J04j54K1n0J92M0j76K3q2p0L17l9j41n7N1J08j43J83m9j83J54M5j51j7
5363h8Q4K68k39M8M8j70O4m2J91j52l3j35K10O8k1n4K5j29K12J6k65qN0K0j03
5388a35R5kj45K00m4K7J32q0j20j45R5M7q8J33j8N8l9l0J26l8J92m48L56r2o3
5413b6J08k03J22K1K15k69J16k14J39J31r5j53j13J37R7q0J69j70L3K4R0r6J8
$$ plain form
5242 -90 -61 51 125 -126 -2 -109 -54 -234 -100 -25 -54 85 -21 -58 -97 -33 -143 -146 -17 -59 11 51 47 85 -9 -24
5268 -24 213 -269 151 -82 58 39 -32 -40 -232 -209 -77 45 -206 79 -70 -104 -45 -162 -35 19 -23 44 -79 -86
5292 -86 -65 -6 -179 133 -25 80 -295 60 -24 -30 -87 -8 175 53 -277 -10 -57 -30 113 -45 95 6 138 57
5316 57 171 18 -91 -55 25 -110 15 -286 142 -84 -122 60 -17 -129 46 -57 25 125 -51 37 -9 51 -14
5339 -14 90 -64 -43 -93 99 139 -37 -14 -96 -166 151 112 -29 -86 -35 73 -70 113 64 -119 35 80 -71 -88
5363 -88 -4 264 25 73 121 -49 15 -27 164 12 -21 -156 54 122 101 47 72 -57 155 171 -94 -102 -52 -32 -135
5388 -135 -40 -42 -187 13 -31 -4 128 48 -72 -217 -122 -75 -163 -30 -48 10 -29 -59 67 29 221 -227 129 37 -26
5413 -26 82 -121 1 22 237 -32 84 -130 9 140 45 -108 -221 -84 13 -67 102 -68 -35 -11 79 -17 1
5436Aj39J09o6J02j34J34L0j54Q8J66j86j4k4K3J18j5L9N5k84l2J55P7K23k83
5460a1L3K20j25J3r0j66J65K8j23o3r2K87p7J7L9K3jo6J99l38P0Q7L15m14%K78
5486B08l38K21N8j51Q8j08o3J75j73J7l7n4J79P9K59n38K42k8J71j95j24J53m0
5509AJ80j26j42rJ31J46k09j23N6L6P8J4J26j71mJ21m0k50J43k05L41j10j0M2
5533A6k00K27l4j25J63J45k90K68l33L14k4m5M4l15L63O1l61J9j28L99j46j09
5555i1L2J32O7Q5k14Mn4q1J20r8J90l3J17j34k6J64l2m3j19MJ29j6j52J25j29
5580e3K29j16K1J53k45K0n8N8J17k81K25j26L15l69K58j64J47k5j25J85k38K81
5602B09k12k7J09j7j32M8J99l15J53j3p5J26j66N4J19j70J57J9N5k44K95j14k91
$$ plain form
5436 1 -138 -29 -95 7 -127 7 37 -117 -29 137 -49 -63 -87 -64 54 39 78 133 -151 -183 -28 49 272 -11
5460 -11 22 242 117 130 40 -126 39 67 -56 -119 -211 76 -1 16 55 78 77 11 210 -128 -58 29 344 -70 -70 208
5486 208 -130 91 149 -2 86 -22 -85 90 -83 -66 -103 -157 22 101 360 -178 64 36 207 12 -112 41 1
5509 1 181 55 -87 -96 35 181 -28 -151 -95 -59 19 33 159 -12 -16 105 65 -185 -42 -247 94 -16 -26 16
5533 16 -184 43 9 -116 47 192 -98 170 -163 151 127 82 126 -189 174 235 -126 -107 -235 164 18 -91
5555 -91 -59 73 140 225 11 15 -39 -120 0 -98 92 59 176 42 16 180 148 105 -14 -10 119 103 -49 76 -53
5580 -53 176 60 81 234 -11 9 -49 9 126 -155 70 -56 259 -110 148 -16 131 106 -19 166 -72 209
5602 209 -3 -30 79 62 -70 -22 177 -138 15 2 -73 53 -113 -59 60 -110 47 66 121 -123 172 58 -233
5625b33K26P1K65k86R4o3o2O1r7nM1r2l1P8M6OpL4j50N0p0J04m9K2J09j39k9q0
5653a86K50J9l50J58J80j3k23P3J52L1q8r0J31j03Oj9rK67j92KO3j61K00j34J19
5678H3j40PJ17k60J82K85l76O5n9M9J41l17J84l32L24J29l74L89j15P9j37J2l5
5701i9J65K3j49L00m81K94l4N4J33l66J28l2Q4l9oj4O5o2p2Q1J70r1K9k6O5l4
5727H6r4P9Q9j46j77K05k53M5J35JJ8m2l8J85j45J58J38k90k9P6l0J7PJ28j59
5752c6p3Q3j08L1kJ25p2n6K12j44J07j85O2P6q2J2J45n6r2j20J64J2r3J54j38
5777g4k2k8P9N5j60Q3p9K12j96J87j13L0j28J08P3K07l17J45k08J90j53J61j38
5800h6k5L70j72k07K34j46l4K53j43l9R6r0j08J2J21m4j50L23j97J83j95M9Q5
$$ plain form
5625 -233 -7 64 329 43 137 74 12 73 -24 -29 12 -80 -111 -33 13 19 12 46 -104 -54 -124 -20 -69 -47 62 -77 -106 -186
5653 -186 64 83 -267 -109 71 58 -165 -92 60 91 3 -87 44 -59 -53 -72 -81 186 -6 -4 59 -102 98 -36 83
5678 83 -57 -50 67 -193 -11 274 -102 -37 -96 -47 94 -223 -39 -371 -47 82 -292 97 -18 61 -76 -64 -99
5701 -99 66 89 -60 240 -241 53 19 73 206 -160 -32 -64 20 -19 -25 -39 26 -36 -108 -27 143 52 81 55 120 86
5727 86 -8 71 160 14 -163 42 -211 -166 -31 -30 -12 -54 -92 93 -52 106 244 -46 -75 1 -29 -12 -5 123 -36
5752 -36 -109 -26 -134 -103 -105 20 -52 -108 104 -40 67 -118 -56 20 -62 -50 95 39 -53 -173 -9 3 -90 64 -74
5777 -74 -96 -124 -45 10 -150 -67 -146 66 -130 57 -56 -26 -154 -46 27 234 -83 62 -146 44 -109 52 -86
5800 -86 -111 259 87 -120 114 -32 -66 187 44 5 101 11 -97 -85 36 -8 -158 165 -32 151 -44 5 90
5823I0q5j80J59j58L90q3k57J84m6O5k51J32o3J09j13K32k03jK2N6Q0Q2r0Jk7
5848D5j13Q5kj77O9j2K60j40q9Q4o2k7rJ31j84N0m3Q0J62O0l58K04j6J74l23K26
5874G5Nj13J7J79j37L1k7L7l5j04j7o6L67n7k40J23J19k64M9J16m4o0nM2j2l3
5900e4n1j9M7k2K04j07jJ23k08J41l15M11j82l6R2j17K5K9o8J38j02J19MN8M8
5925A57k51J47k25J08P1J46k54n2K77J7m3j12O5p6K00j34O1M2q8p7m3J56k26l5
5949a69J09L07k88l4R8j44j4K43m2N0j49J01j12P6k3k1J66j43o4J5J7J06k48K01
5973C8r7Q3q9P0O1l9J0o0R5r0q4K2J65k15J79J8J83j16j81L83l27j61J70j13L9
5998e6J51L8k06M3m6j56K71J53k67O6J66k00K12L9m60K42M9O0l70K98k37L52j07
$$ plain form
5823 90 5 -175 -16 -174 216 133 -124 60 14 79 -172 -40 -103 6 -107 125 -78 -79 -57 -1 79 161 71 72 45
5848 45 -68 17 15 -162 -93 -105 155 15 -74 10 -52 -79 -88 43 -141 -91 -134 -54 108 168 -190 14 -2 172 -151 75
5874 75 80 -33 -16 163 26 57 30 67 32 -72 -89 -155 212 155 -85 38 157 -107 -58 58 14 -46 -51 -9 -21 -54
5900 -54 -105 -124 -77 -99 105 -2 -3 120 -88 53 -262 149 -33 -69 23 -94 -69 -40 -108 30 -72 47 51 109 157
5925 157 -94 53 -172 -64 7 153 -101 -153 124 141 98 -14 51 -25 175 41 102 144 56 -21 -64 92 -134 -169
5949 -169 -60 247 -41 -75 23 -121 -135 108 66 116 -33 68 -44 32 9 -12 154 11 -53 -38 -21 85 -163 38
5973 38 -59 24 -65 5 66 27 37 -23 72 -18 -102 -80 85 -130 49 67 250 134 -47 336 9 -152 18 -95 -56
5998 -56 95 133 -73 -30 -76 -232 39 192 -75 -9 157 -43 169 208 -252 -10 39 99 -271 27 -210 142 35
6021C5k3q1j92J59N7q8J87p2J67j16j64K48k22K45k01O3o8J63lk16J97j33J37
6044G9k25J03k2J05p8L6J83k55K05J1j50K95j89RM6K9j89j2o6J77m84K48L03J6
6068A75j6j76J83l79J86K02p7m5r3j8j42M16L0j52J2l55J90k5J09k9j5o2K9J5
6092c7L8k61L30j15j6k1J3P6l6K03k21l3J97j69n8m4J55R7k91K12q4Qp8O8J74
6117A07k37K06q7J7j80L01k78L75j39j33J35l21LN0J29J03k3J07j67j52J72J31
6139A19l77J82R5j53K84j28rJ86n4q5J19m6l03L22q1j23j52O2J54K1n9J03rM3
6163A11o8k52J98j80J26k7J54j41rK78j24k07R9K04K23m50J54j19L2m5n0J39j90
6186a44J71p6J22L5K1j39j73K17q5K2R6J30l98L29r1l7q5J06j78J91j62K6K39
$$ plain form
6021 35 12 -69 -261 -102 -45 -133 54 -18 149 33 -131 117 -105 140 -61 2 -66 97 94 -122 75 -58 79
6044 79 -146 -43 -65 40 -38 -2 181 -74 131 142 -8 287 98 107 153 182 -7 -19 -85 92 -392 -144 159 175
6068 175 159 -17 166 -213 -27 175 98 53 -40 -58 -200 216 246 94 106 -249 -59 -84 25 -4 -19 -81 -52 -37
6092 -37 1 -260 70 -45 -61 -82 -69 7 -29 174 -47 -80 117 -52 -110 -154 1 98 -193 19 -65 -57 -135 -67 107
6117 107 -130 76 -11 6 -174 127 -151 224 85 -48 87 -234 -231 -181 -52 51 28 135 -32 -184 -12 119
6139 119 -258 -76 19 -134 150 22 13 199 145 60 179 133 -170 152 71 -52 -204 -142 12 33 -26 77 68 111
6163 111 43 -209 -11 -191 -65 -92 62 -79 -88 190 66 -141 -42 162 385 -65 89 -30 2 -43 -93 46 -144
6186 -144 27 -49 73 108 129 -10 -183 34 -51 -29 67 197 -201 128 37 0 -85 21 -157 34 -128 -102 137
6209A37p4L7L8J0j51j34J03K09j38l9j07L61j98M3k01l6k4J27J69K2k42RO4j64
6233a79J01o4J6M7J22n2o9o2J44r0K01j04j56J45Q6r5R6rl66K16m9J19j03K33
6257A28j39j8j2o9Q8L1k4J99k64N3N0j53J06k34L52k33OK5L7j8n5R9n2o1J09q8
6283a37J44Q9r6K46q2m00J79q1J1R2N6K25m23K89k2j71J12j21J01K01k24M6j61
6306a27NL53j40JOp3Jp6Q6j23l2r0R7M6j69J89j01K70q6O6k24J14j74l9K01L9
6332B0j57J09l6J73l90L03J53j41m3N5%Qn6Q0j24o4j6J04N4J6m6r0N7n2j41K14
6358a0R3k16J57MN4j76J80m1j16J91j75j48J27O3K29r0j80J57q2j29O5%K14j15
6382E6j49k2L4J32J72l25J56K28m16J14J36n2J12k08J01p9J91m6j61J57n0j74
$$ plain form
6209 137 63 100 138 148 -3 -137 -34 175 37 -2 -109 252 54 97 -104 -140 -164 -37 132 154 -88 -79 -15 -179
6233 -179 -78 -142 -126 -79 43 -9 -78 -140 4 -86 115 11 -145 0 86 -9 87 78 -288 -72 -121 -2 -105 128
6257 128 -11 -29 -41 -110 -22 9 -15 184 -80 -27 23 -130 -24 -258 94 -139 -133 -108 -71 -89 -144 -45 -97 -158 -49 -137
6283 -137 7 96 0 246 164 -236 -57 -138 -127 -35 21 246 -177 112 90 -81 31 -90 11 212 -12 34 -127
6306 -127 -122 231 91 92 98 25 26 -50 36 -87 -119 -209 -112 -66 -235 -46 -147 123 37 103 -121 -7 -181 -220 -19 20
6332 20 -137 -28 -64 109 -281 22 175 34 -9 46 46 54 -2 78 -46 -110 -126 -22 32 48 2 -88 -31 -83 -224 -10
6358 -10 83 -133 24 28 82 -94 86 45 -71 120 -55 -203 -76 -13 216 126 -54 103 21 -108 -43 -43 171 56
6382 56 -93 -115 -81 51 223 -102 54 282 -134 -20 116 64 176 -32 69 -10 181 135 -26 131 81 -93
6404i3M8P1k9j4j56K14J11k21oK03j4oN3j13o2J37k57J28R1j62J92n6p2l8J7J4
6430b0O3n7r9K59l10R9M00l00N4j37l0K35k93J91n3k25O7l9K22K3n1N4q5K33k35
6455c4o2J8l0J59j13J1l3k6mJ38j71J03K12j37o6JR9J27k99R6R5j79J9J88k71
6480a59K43J7l82J55m1K69k43J39q0KO5j3J2k0K2rL9Q5k8Q4lP5l19m8q7L6J33
6507e6P3j19K85j28J69k11lj0l0m8q6K9J08J74k23M4L1N2M5j26k4oR4J84k39N6
6533C5l4J12q4J9J7n2N8j10J0J12k23L71j74l6J0L1n1M5q9j16j67K62J84k0K9
6558A39k09j48R9K00o6j53K13l47K3K77M4J17j51P1l59J93J03J6j00J27o1N9l3
6581E4oQ0k33L92l94N8J9l9K74j98N7j01j83L59n8nj31l2l4J46l8J34k92R0k4
$$ plain form
6404 -93 -45 26 -3 -17 -173 41 152 -69 -75 128 114 108 161 48 -14 123 -134 -6 85 -77 115 59 -13 -51 -34 -20
6430 -20 43 -14 -113 146 -164 -65 335 35 89 -48 -78 157 -136 55 2 -223 -156 -195 27 50 -1 53 -32 201 -34
6455 -34 -96 -78 -108 51 -62 -51 -84 -110 -114 24 -147 -44 168 31 -35 -34 65 192 -107 -11 84 -95 -76 112 -159
6480 -159 84 101 -281 -126 -167 102 -141 -2 -82 -80 -15 -28 -16 -36 -14 -23 16 101 73 157 154 229 -90 -138 -225 -189 -56
6507 -56 17 -102 183 55 224 13 10 0 -30 -78 -164 -135 -27 147 -76 -32 -1 51 96 -30 -54 -60 34 218 -21 35
6533 35 1 113 29 48 65 13 71 -39 -29 83 -140 231 57 21 31 62 11 56 -33 -149 -316 -54 130 110 139
6558 139 -70 -218 -119 81 15 -138 75 -272 -249 28 72 189 38 109 -250 -57 46 62 -38 89 28 87 54
6581 54 48 128 -105 287 -107 -49 -30 -69 205 7 64 -37 -220 139 81 76 -55 -87 -121 25 -13 121 -171 -81 -105
6606a05K57o2K1q2N1J39Q0l80K03Rk84K26n4J05l79K67J4j77R6K42j12r2l8J46
6630I1j76R9M6j14KM7J17j65QN4O9r3j97K60J58l74k2J49l2R6j14j04L04R7k08
6655bK11j31J92m07J21q2k2jl5l6L6R7K4J62q5Rj65M0M5R6j76lk0n6J11Qj07K45
6683F9j53J12K30k43O2r1j05J0K99n9j55rM2o4J9K38k34j30K10L9K4k44M24l00
6707io3M15m80J05Qp1J36j49J32QJ73m7j2r1j93J17l1k1M27j69m20J65r8M04j04
6732A32j62m4P1R0k1j57J05L8k4j07J51l9q6K57j03np7m9K2P6j98L00q2j14J04
6757G8j92M9k0R9nO1K69l00n7K51k77Q5j86K09n2j67L34k48J09kO4K30l71J95
6781A56Q1k22j17K06k97J16J3L07j07j81OJ8J07Oj62m6K01ml94L79j87L09l64
$$ plain form
6606 -105 152 90 111 29 80 219 299 -81 122 131 -153 73 19 124 -255 12 26 -151 -55 187 75 -17 -55 91
6630 91 -85 14 60 -54 -52 -5 112 -53 -45 9 78 -15 -212 48 206 -168 -190 -41 -73 23 -91 -195 109 206 -2
6655 -2 209 78 270 -137 -16 -98 -120 -121 -156 -192 -156 -59 -35 127 42 51 -114 -74 -29 67 -109 -112 -132 -188 -77 -69 -176 69
6683 69 -84 28 258 15 77 -14 -119 -109 190 131 -24 -33 9 -55 -36 202 -32 -162 48 87 111 -133 291 -9
6707 -9 -72 343 -137 -32 -24 -95 41 -108 24 32 205 158 146 55 -138 -21 -52 -73 354 185 -235 -70 -168 236 132
6732 132 -30 -74 -3 87 66 -91 14 52 28 -79 72 33 -53 204 101 96 19 -30 -8 68 -130 170 88 -26 78
6757 78 -114 -65 -85 14 9 70 339 39 -18 233 -44 41 -145 64 12 -155 179 -69 40 38 102 332 -39 156
6781 156 237 15 -102 104 -193 -77 -64 243 136 -45 -39 -21 86 92 -70 -116 85 81 -313 66 -121 188 -176
6804a76K19J1k26K53N7l10O9J66R6k14J93j14j4k03K16j35J71p0m1R2q2o0p2K27
6828E3N5m8k16J90k25L04k97K53J39k94N5J5J5J60j15p4l9K53j89j1K7k7n7j5
6852h8K2K9j67J35p3K48j08m4ln3J1L8L8J69r4l3n3j14J79J12p6N3o7j26k9k4
6878a18J3M6r4K43k8R5r9j74P6j02N5L4J61j3o1n7M7k04K9J62L2q6J35j28j92
6903b28L04j38K58j46j37K69k45J11p2j19K12j52P8j08m4O0J27m6Lk75K98Q6m8
6926D8k0K5J25o8k23K32k85J61q0M2J64qn3l1R0o4KK4q1J12k58L12j51o7K95j57
6952H6L8n3m5n3L18k24rj71K76j83J20j37K75k33j10J8L8K69k49L19l04p6J37
6975D7j8j14lq0P7R2l5p9K32j99j63J28Q1K45k25J8k7j1K70l62m6M10l01J39L28
$$ plain form
6804 -176 43 54 -172 81 138 -172 -103 63 159 -55 138 24 10 -193 23 -112 59 -11 -52 40 -42 -102 -174 53
6828 53 108 60 -156 34 -191 113 -184 69 208 -86 -31 -16 -1 159 44 -30 -69 184 -5 -16 11 -16 -73 -88
6852 -88 -66 -37 -204 -69 -142 106 -2 -46 -49 -102 -91 -53 -15 154 60 27 -26 -140 39 151 75 128 61 -65 -94 -118
6878 -118 -105 -59 -153 90 62 157 58 -116 -40 -142 -87 -53 108 95 34 -23 24 -180 -151 11 43 -43 92 -36 -228
6903 -228 76 -62 196 50 -87 182 -63 48 -24 -143 69 -83 -5 -113 -157 -97 30 -16 -13 -288 10 96 48
6926 48 28 53 178 110 -113 119 -166 -5 -85 -43 121 113 60 29 119 55 57 81 0 112 -146 166 15 -52 243 86
6952 86 124 71 26 -27 291 67 58 -113 163 -20 100 -37 238 5 -105 -87 -49 220 -29 290 -14 -90 47
6975 47 29 -85 -88 -168 -91 1 -34 -113 119 -80 -243 -115 -34 211 -14 4 -23 -34 236 -126 -172 238 -63 76 404
7000D04m41J32j75l6K80j14j64m8K13o7K24n9j37m4K7Nk96M12p6k98J43K07KP7
7024A71k79N3J4J65M4m1m61K73p1K21k27J15J45k58J86l3j00K58o8q7R6r1k95
7047b70J92p3J31O8m6K6j76nJ98M4q9j08O2K74k20r5J71l07J23j8J2K53j82J60
7071A25k30J14o0O8J01j58k6j09K01r0J19M6n0M2r3J22k51R3j75K96q1n6m7J37
7095C8l8Kq9L1J15o5J36k60K45j02N7j12J26j07J00r2j97J19J3O4j9K1q2K19j64
7120d1o2O7J01j12L6k4n8L1L07m44K09J01j39L5N6j46J80j73J40j02J52k32J13
7143ej95L21k27L9O4j0j8J39j65K0L7m3J07k36R2P1RL8o5j78K82j13J77j24J20
7168A37Rl07N7K46l32P6J73k6o2L37k33j12o8J22j16J15j78R0M5K68k03j66P1
$$ plain form
7000 404 -37 95 -80 -116 164 50 -114 -162 51 -16 208 149 12 -32 -5 0 -296 116 40 -258 -115 92 94 171
7024 171 -108 -55 -41 124 168 127 -334 -61 -132 89 -138 -23 122 -136 50 17 -83 175 107 20 116 25 -270
7047 -270 -78 -151 -20 48 2 28 -148 -153 45 89 0 -108 -46 228 8 -87 84 -223 -100 -118 -106 147 -35 125
7071 125 -105 9 -51 17 118 -40 -66 -175 26 -64 55 101 51 93 0 122 -129 -36 -211 85 4 -52 -99 38
7095 38 0 2 -87 -56 59 -6 130 -130 115 13 70 -42 84 -23 77 -15 -212 -93 -80 -16 -35 -14 -96 123 -41
7120 -41 -103 -36 65 -47 -11 -35 -93 -62 245 -199 10 111 -28 7 63 -83 97 -76 64 -38 114 -118 -5
7143 -5 -200 121 -106 -67 -3 -13 -31 108 -57 -37 0 -43 64 -172 -80 -9 0 38 -27 -205 77 -36 141 17 137
7168 137 146 -161 -104 142 -190 -114 59 33 -29 308 75 -37 -105 17 -99 16 -162 -72 -27 241 38 -128 -57
7191e7Pk8O4l4J6k5J71O9p5j91R3j41L11p6j20J43j67J8J16k29o3J31N1J25J9
7216A28j70l0O7j64K32k09L44k39j45L1J84N9j94K36J9k56K00k9l0j22K18l00
7238a70J91J12p1M6L2j44j6J50j24n2j22K49R7k65J62P0j57o6J36m1j00J22L4
7261G3o8K8K04k76J36r9N7j61J18O6k25J19ln2O4L9p8m8K36j73Q4M1m1k46J51
7286e4Rj00l7K87k20j28K84J4M1k99J33OM8R0J00J5j18M7k13M0j7O8q3L6R3o2
7312b0N5r1N2J49l5j2J67l19j07J84Q3j61J22k72J97M0j37R3oj72K31lJ65k48
7336d5Q5K00k72J97N8j91j70J14j00J09n0P3q7k1J57r4J08k18K55q5J48l36K02
7359C7k6L1j76MK61k33J57l6j26M0l4j37J27J43J7k40J82n2J81L8j33j87K11l1
$$ plain form
7191 -57 -50 -78 -14 -48 -32 -57 114 183 108 -83 10 -131 180 104 -16 127 -40 -22 94 -135 -198 -67 -16 109 128
7216 128 -42 -72 -5 -169 63 -146 198 -41 -186 -155 29 88 -106 130 149 -107 93 64 34 -88 130 -170
7238 -170 21 133 62 108 140 -4 -20 130 6 -46 -168 81 178 -87 75 145 -12 -78 58 17 -83 39 73
7261 73 5 33 237 -39 97 -2 55 -106 12 78 -147 -28 -31 -83 -19 20 -58 -106 130 -43 41 82 41 -205 -54
7286 -54 -45 -145 -182 105 -115 -243 41 55 96 -203 -70 -64 -16 74 174 189 71 118 -95 -55 -72 -4 -87 -51 42 -20
7312 -20 35 -56 -4 145 110 98 265 -54 -161 23 106 -55 67 -205 -8 32 -105 -12 -18 -190 41 38 203 -45
7336 -45 40 240 -32 165 223 32 -138 -24 -124 -15 -65 8 -79 -100 57 -37 71 -147 108 23 171 -165 37
7359 37 11 42 -134 -130 131 -102 55 19 -107 -67 -101 -238 -111 32 49 -191 -9 -61 120 158 25 -162 49 18
7383A8p0J88j65J41m19M88j45K28k59ln8J71pj63n7J87l3j19m4J74J42j52J86
7406B29k88J14j2r4NJ65Q5r0n0O3p2j72J02k9o3n2J97L7j76LK33j00j79K39M1
7431A36Q3k12j17J77n9M9j92JJ62J14j24j71J6P8k1k12L06j75P6OJ10p7L8qq2
7456i8K00m3m2p9O9j5l7j62L36j82K17l00J03Q9m5P5k26J93O0r4j53K06m2K1k1
7481C0K00k47j66J1J90K26l77P7r7J79l9j38K12j48L4J66r7KR7j43J37j90J22
7504D1r1O2N1R8L0j17k41Q4KJ12r1m0K00j71P0q9r7J96L7p7O5K9pj9j7Q6j61K77
7532B22l70R6P8k25L52j00O4j7j44N5j24J42Ln1M5j38J00q8K23j0p8n1j0j17J8
7557a25j31K14J39R2l04J64q9k3L6j31Q8lN2j2K0R4M7p7l6J11J08j18r4Mj72R3
$$ plain form
7383 18 -52 136 -29 112 -307 181 36 264 5 2 -56 115 108 -55 -112 75 42 -77 -121 53 195 43 229
7406 229 -59 55 43 -51 -46 119 204 114 64 127 55 -117 -15 -44 -107 -159 38 75 -101 -98 135 35 -144 95 136
7431 136 219 7 -110 67 8 57 -135 -134 28 142 18 -153 -137 -59 -80 -292 14 -161 -85 -79 31 -46 -8 -16 -98
7456 -98 102 59 17 -62 7 -8 -45 -207 129 -53 164 -136 -33 56 11 86 -140 53 113 19 -134 72 30 51 30
7481 30 230 -17 -183 -172 18 244 -133 -56 -153 26 -13 -151 61 -87 -53 113 16 18 115 -28 109 -81 41
7504 41 -50 12 63 161 191 74 -167 -83 -81 31 -60 -100 100 -71 -1 -90 -187 9 46 -31 34 63 56 37 20 106 -55 222
7532 222 -148 -52 26 -199 153 53 117 100 -44 11 -113 29 32 -19 26 -112 -12 -100 123 113 35 -16 -26 -143 -125
7557 -125 -256 -42 97 189 -115 49 -40 -63 -27 -158 -70 -73 -21 -33 -13 81 128 51 15 126 234 116 22 26 -146 -53
7583e3K19N6j05k93J52K8k7J95k53j32J67l4J86j38J03P1n9j23Q2n2J33r8Nj2
7607A8p1J71k29K45Nl0j89m1K57j31j22L4J70j07k1k07N76m74P3J37J16k66J61
7630G5ll11L00k0k63L32J22o10N52k25r0J02o9j40K28m6Q6KM7l1j90J94j26r6
7654a80M6J06k5pJ53M8j25o1o3J68l0N4j57J51j99N1P1M5k02R8K1r8J68J53k39
7679e3j10J1O2J17m5j31QJ37J15k02J62j94QK15k08Q1J56M7r0j30N4j47N5q0K15
7704E3r1n0K83k06l7J13L8k69O5K07j79Lj94R5K27P4m1k41Q1l6lJ22m4N7k23L22
7730A26k45J71J44l89J69J56j07m6J68l1j02n6j32K20q7J96j64J15k98L81k08
7751a9Q1k8j3j82J11j2Mn0J28K9j5Ml7j10K3j4J76j1j22J28J8o9k01J48Q7P8l1
$$ plain form
7583 -53 166 222 117 -176 -24 4 -23 172 -81 -213 -46 -80 106 -32 71 142 83 -40 42 -10 123 25 30 18
7607 18 -53 118 -111 134 139 109 -80 -121 136 5 -117 -83 87 -20 -41 -248 328 -146 -73 64 180 -86 75
7630 75 72 -239 61 41 -222 110 232 -378 174 -51 -141 -39 -108 -248 -20 -66 20 22 69 38 -152 42 -84 -180
7654 -180 -134 -28 -53 -60 93 141 16 -45 -108 60 30 84 -73 78 -121 -70 1 46 -156 -58 -37 -135 33 186 -53
7679 -53 -163 -152 -90 27 -18 -149 -141 -4 111 -91 71 -123 -115 100 -108 -27 129 176 86 -44 10 -137 -82 -162 53
7704 53 -38 -88 195 -11 -48 65 103 -166 -101 106 -73 -70 -264 -169 58 132 91 -150 -69 -105 -108 14 -30 27 -196 126
7730 126 -119 52 196 -193 -24 132 25 -21 147 116 14 -42 -174 46 -41 155 -9 106 -192 189 -19
7751 -19 62 34 21 -161 -50 -62 -58 -108 20 49 34 38 1 -109 -86 -100 76 65 -57 71 89 20 -181 -33 54 132 101
7778A01k7o4j57O6P9l3j0N7j40J67l5n2M5J5R3k5j15J00R0k03P9K7j64M0%J15
7804D9j3Rn5L7j40K19j77OK24j80Q1o3P0J04m3k47J27P8n2n6R3K3J18l61o7J64
7830e2O4j64J72k01m4L34j28N9m5k4J19k62J60M1J05k15L8l8jJ88Q4j72j36J10
7854ho8jO5K75l30R1K8L1j98JK66j69R9l2j21K2J86k08j88K46K38l44K0O3Q7q4
7880c3J10j56J61k04J95J00r5k45L38k73oJ22p4jP8P7n3j79K64j74J76j91m0J65
7904F2k57%J66J87k45J49k31K23j25%J18J13k70P6J24m4q8j39J03J07j48J83k56
7927a92L44j86J59l2k63J04O2R3j08m2L5QN7j5r1k8J47p4M9J79m20R2J69q8R3
7952E2j00j5J04J34r4q8l9K29j54j39J13O8k02K18M5l7o4q5K57j38m3J02j17j9
$$ plain form
7778 101 74 10 -147 -81 -2 -35 -45 12 -128 39 4 -48 -3 12 105 80 -35 65 155 -48 31 58 -106 -66 -66 49
7804 49 36 45 -10 27 -113 106 -71 -65 159 -21 60 -3 67 171 128 -119 8 86 34 -22 71 94 212 -149 -216 -52
7830 -52 12 -152 20 -181 -225 109 -19 40 -5 -29 90 -172 -12 29 134 -81 -43 -81 -82 106 190 18 -118 -8
7854 -8 -76 -77 -12 263 -67 24 52 83 -115 -114 152 -17 82 50 -71 -49 137 -71 -259 -13 225 -119 -99 -36 51 -33
7880 -33 77 -79 82 -122 73 173 78 -167 171 -102 -108 14 -60 -61 17 94 41 -138 126 -48 128 -63 -103 62
7904 62 -195 -195 -29 158 -87 62 -169 54 -71 -71 47 160 -110 -34 90 46 -42 -181 -78 29 -119 64 -192
7927 -192 152 -34 125 93 -170 -66 -4 89 -19 -61 -26 -18 39 24 -67 -95 52 -22 27 206 -214 -122 47 -41 52
7952 52 -48 -63 41 175 81 -7 -46 183 29 -110 3 71 -131 87 132 95 31 -54 203 65 22 124 7 -12
7976a2J3R8k56P7j1J4o8K12j70J50j26Q4N8j02L8R9k27K44r9j21J31K7q1M6R7
8001A15q4j43kq8P8j13J26R5J04j95J79J64j78p2J64l40K99j95J9J70j74N7J23
8024A09j34j10K34l3j98K02K7J05j47O9o7J45l31R2j93j0M2K92l0K35j31no6m03
8048c06L95L2k3k94J62k5J29J00l10K20K08j85k8j92m2K27R3r4k5R6L8j19O4k06
8072h5l4J70j08N6j4Q6k75K45M2K7k4J39l16m6Q3o6J56L4j31p0N8L6J78k07j70
8097b36J44N7J58n6q5j6L15j38j29P9k10K08K5k58j9J33o2M9j21J86k33K83j15
8120d1R3p3P3j62L42m53K84M8j53J70n5j40R8j33j00J49P8J2pqp7K66k40N6nj83
8146a61K19M1l0j09j74pR2J84j43J0N6J55Pk11K13r3M1poj10j12M2J06P4p2j57
$$ plain form
7976 -12 1 99 -157 -80 -91 -77 -145 67 -103 47 -79 5 63 -39 -1 98 -129 115 16 -105 26 53 -28 18 115
8001 115 31 -112 -114 -202 -124 -237 -111 -16 88 -107 72 236 58 -14 150 -190 109 -86 -67 103 -71 -14 109
8024 109 -25 -135 99 66 -132 70 97 202 55 124 57 202 -129 -37 -230 -240 -198 94 64 299 168 163 97 -306
8048 -306 89 121 98 -196 -34 -59 70 170 -140 80 288 103 75 -117 -159 68 161 67 42 138 176 57 121 -85
8072 -85 -119 51 -57 -1 -15 71 -204 41 83 110 86 225 -91 -137 -54 -120 36 70 -61 -131 -73 -37 141 -66 -236
8097 -236 -92 -35 123 67 -18 -34 281 143 14 93 -117 91 116 -142 -161 -28 -90 -41 -162 24 -209 74 -41
8120 -41 52 -21 52 -110 232 -221 63 111 -42 128 73 -67 31 -102 -202 -53 25 37 30 22 -55 211 -29 27 22 -161
8146 -161 58 99 69 -40 -214 -221 -129 55 -88 -78 -22 133 140 -71 142 49 90 83 77 -33 -145 -103 3 77 5 -152
8172a52J7j97M06l51K43j04J37l8J40j89l5Q1j61K30j05L2OJ4J20
$$ plain form
8172 -152 -135 -332 74 -277 -34 -138 -1 -39 101 -88 -123 -42 -203 27 -78 -46 -40 -26 94
8191I4
$$ Imaginary data points
##PAGE= N=2
##DATA TABLE= (X++(I..I)), XYDATA
0@%%%%%%%%%%%qJ6j6J6j6K4l2M0m8N6p2Q7j01J17j35J52j76K08k40K72l11L54
33A87m02M54n10N74o45P24q05Q94r96J107j227J356j496J653j825K011k214K439
51A279k689K965l270L610l993M427m924N499o173O976p951R167j0732J2830j5810
66h789K0407k8500M6913j67538p024K51998j41547j13693R6468J52120o0458p0821
78c0464O0481Q9320m9900o1176P611N0452k2373p6552q525P5287k4288r3632P466
91g6293R9757l051j15407j8007J34375M1727q8794o131Q8469R412n6588N233N9018
104G3720j5316o6799j0K5083l6896l8608J2497K9429m299l2825J0875N6243J3330
117B6424k3843o81K1037J3641p582p871M079j6163k3219P154J1722n807j4953
$$ plain form
0 0 0 0 0 0 0 0 0 0 0 0 0 -8 8 -8 8 -8 16 -16 24 -24 32 -40 47 -54 63 -72 80 -96 112 -128 144 -167 187
33 187 -215 239 -271 303 -342 382 -423 471 -525 582 -645 711 -785 868 -957 1054 -1160 1279
51 1279 -1410 1555 -1715 1895 -2098 2329 -2595 2904 -3269 3707 -4244 4923 -5809 7021 -8789
66 -8789 11618 -16882 30031 -137507 -144531 107467 -34080 -147773 -51305 100815 40357 -30464
78 -30464 30017 119337 69437 8261 15872 66324 43951 -32601 -41126 34161 9873 -83759 -76293
91 -76293 23464 20413 -94994 -113001 21374 63101 -25693 -31824 56645 66057 9469 14702 73720
104 73720 58404 -8395 -8405 16678 -20218 -58826 -46329 -16900 -21199 -54024 -43149 13094 26424
117 26424 2581 1900 22937 36578 28996 21125 25204 9041 -14178 -7024 4698 -1109 -16062
130a6062p681J6284M905k4262N463L1948J492j8613Q38K3460R350j7978K637J6942
144B8723j9757k0275J5181P275k3933k4334P795K0449q232p827J8801Q461j409
157I18R481N436M732O578n179n693l814p187n696m514K550l273k1763J206K4058
172b160l657j4249O799J0800L887L36N744Q850n836k307J1130l010q912R53l445
187D923m350n996r732K022N268l211k579n85P721J1050l625K029R597o212k362
202C958R383k914q456l593K273K276q945k144P791l223j992M531l716K358P180
217D767l591j431L082L35N93j223J945J90r625J147Q368r445n782O491R83k025
233e221J99M206N656k053J215O977m248j918M306n758m219P05m954k011J016j041
$$ plain form
130 -16062 -23743 -7459 -2554 -26816 -21353 10595 12087 -6526 -5688 17772 27122 9144 11781 28723
144 28723 8966 -11309 3872 11147 -12786 -37120 -29325 -8876 -17108 -24935 -6134 2327 918
157 918 10399 15835 20567 27145 21966 16273 12459 5272 -424 -4938 -2388 -5661 -27424 -26218 -2160
172 -2160 -5817 -20066 -13267 -2467 1420 1756 7500 16350 10514 8207 19337 16327 7415 8368 4923
187 4923 573 -5423 -15155 -13133 -7865 -11076 -13655 -14240 -6519 4531 906 2935 12532 6320 3958
202 3958 13341 10427 1971 -1622 651 2927 -6018 -8162 -371 -3594 -5586 -1055 -4771 -2413 4767
217 4767 1176 -255 2827 3162 3755 2532 4477 4667 -4958 -3811 4557 -4888 -10670 -4179 -3196 -5221
233 -5221 -5022 -816 4840 2787 4002 10979 6731 4813 9119 3361 -858 -153 -5107 -7118 -6102 -7143
249g143O17k030L252P098l505O69P022k147Q03L280k975L31M83k451L30k983k033
266a382J364m407j144J182m623J396L569k661K884L628N71M168K032J69J438j946
282F238J217k40p760M59J471p075q49K083j684N59N95K181K451j778L059L634
298D561l595K372K616m388J446K183l914p50M26j72j274l922K185J754n465J776
314d161L547l096J922K831p33J684Q25L70J240k739J447K35n204J598J273n027
330c988J016K117k260Q88N60R03J359j498K069J674l029K154J152l954J950J264
346B377l260L89O79m25l94j609J993Q28l251K272J612k836K364R93k718J754Q22
363A590j160m62p51K150n71l918L118J202l949J984J658k161J282L32M19L20j036
$$ plain form
249 -7143 -6526 -8556 -5304 1794 -1711 -1042 5980 3833 4636 7916 4941 5272 5755 3304 3634 651 -1382
266 -1382 -18 -4425 -5569 -4387 -9010 -7614 -4045 -6706 -3822 -194 377 4545 6577 6746 8184 6238
282 6238 7455 7215 -545 -86 1385 -5690 -6539 -4456 -6140 -5581 -4986 -2805 -354 -2132 927 4561
298 4561 966 3338 5954 1566 3012 5195 1281 531 957 785 -489 -4411 -2226 -472 -5937 -4161
314 -4161 -614 -3710 -1788 1043 310 1994 2819 3189 4429 1690 3137 3372 -1832 -234 1039 -3988
330 -3988 -2972 -855 -3115 -2227 -1667 -764 595 -903 1166 2840 -189 1965 3117 -837 1113 2377
346 2377 -883 -494 185 -240 -634 -2243 -250 578 -2673 -401 1211 -1625 739 1732 -986 768 1590
363 1590 430 -32 -783 1367 796 -3122 -4 1198 -2751 -767 891 -1270 12 344 763 1083 47
380D7J593J09k551K201j10l904K371Q29k934O23O50r1K81q75K024Q15j897K998
398B179K66k432K173Rk183J368n66j389M89q03P32q30j995K752k84k489K429L64
416b10j317J985j25j70J592k78Q32m01r80K072j326k864K280j139k704J429j54
433a478j114O53j10J379M23j189K667k34j417L191j004k009K507k35j661M42o42
450A69O33p43j536J549r60j971K430q57j505K294l59j38J995o08O62M30j14J442
468B813j746j423K386j486j822J436j247p63J536p32j77N95k63J690p59o57K324
485A705j615p75K756j384j498J647N6n05q39k22J296j183q56J978k115m59L094
502A081j324r39K118M36m73J39k16J352k049m32K259k838j528K512o31j206Q73
$$ plain form
380 47 1640 1749 -802 1399 1289 -2615 -244 585 -2349 -1726 -1076 -1167 -886 -1761 263 1078 -819 2179
398 2179 2445 13 2186 2195 12 1380 814 -575 -86 -889 -157 -987 -2982 -230 -514 -3003 -574 -210
416 -210 -1527 458 333 163 1755 1477 2309 1908 928 3000 1674 -1190 1090 -49 -2753 -1324 -1478
433 -1478 -2592 -1939 -2049 -670 -247 -1436 1231 997 -420 2771 1767 -242 2265 2030 369 811 169
450 169 802 59 -1477 72 -888 -2859 -429 -1286 -2791 -497 -856 -994 1001 393 1055 1485 1371 2813
468 2813 1067 -356 2030 544 -1278 158 -1089 -1852 -316 -1048 -1225 -630 -893 797 38 -619 1705
485 1705 90 -685 2071 687 -811 836 892 387 -452 -674 622 -561 -1417 561 -1554 -2013 1081
502 1081 -243 -1182 936 1372 899 1038 822 2174 125 -307 1952 -886 -2414 98 -533 -1739 -866
519h66k79K84P29p5J383j240J90K485k030j063K432q02q60K98m50O4n40m62J133
538C31j718j169K135j024m52J863q35P7J720j57L45l9J79J412j581j154J584j338
556A79m88R47j887l37J114r28M85J04o48R24K1j44J313j206O27J881j369J22J024
575A734n65L79k37j426O87n01m00M09j805J09J391j505N53J008j009O41P64l6
593A91L12k90M01J622j715K3R40r60J25P94k010j0Q68q58K05j322K20R93j301
612a772O64J263j261J073J165r24N29M94o52J004n41p51O69j181L66N81k222K16
630a280J227j152L58k46k93J248k98J15P06q33R67J319j357P78L47j535N53M05
648A029j124k33l50O7K42j351P27Q16j006J138M23j186J438O89j074N05j86j13
$$ plain form
519 -866 -1145 -861 -132 -207 1176 -64 126 2611 581 -482 1950 1148 288 586 136 200 -340 -802 331
538 331 -1387 -2556 -421 -1445 -1897 -34 -869 -792 928 771 1116 1077 1256 2668 1087 -67 1517 179
556 179 -309 638 -1249 -1586 -472 -1400 -915 -811 -1459 -535 -514 -658 655 -551 76 1957 588 710 1734
575 1734 1169 1548 1311 -115 572 71 -329 80 -1725 -1616 -225 -1730 -1177 -169 -1178 -537 227 191
593 191 503 213 614 2236 521 544 1484 524 649 1443 -567 -577 291 -567 -362 -1684 -1464 -471 -1772
612 -1772 -1108 155 -1106 -33 1132 208 737 1231 579 1583 1042 291 960 -221 145 726 -1496 -1280
630 -1280 -53 -1205 -847 -1093 -1386 -138 -436 -321 385 -448 519 1838 481 1259 1606 71 624 1029
648 1029 -95 -328 -678 -611 -369 -1720 -993 -177 -1183 -45 378 -808 630 1319 245 750 564 451
666D51M31q12K59Q5j321R27J20j462Q55Q6m34O42l25q3P38m79J114M1j217J326
686I42N86j430P50k04j070M75n94j39L7m26N97M00j020J026M73j094J667k41q97
705a62P02L60m61l3r32Q65N0j221P93K45j218J100l0q94Q97m03J13M33m83M59
725A80J23m70R71j36j049J165n7r25M10n75l9J49l41L67k7m32Q37R7q94J510m18
746D46r11R20k28o6Lm91L94M33j233J227K6q07J100o87m79J023n27m29K09l46
766d23M25j74n77J019k38o19J060l38m59O81j38j38K95l59K07R7m58O47m21p59
786f70J176o75n01P72n24j65M65m52M62K40m72R70l21j14O02m4p92J035o87n27
806b22L90m91Oj25l34P51k87m81Q97k30k07Q41l70o7M80j10j29Rl20Q74r49m21
$$ plain form
666 451 882 70 329 414 -907 20 140 -1322 -467 -381 -815 -173 -498 -581 157 -322 792 833 -384 942
686 942 1528 98 848 644 -426 49 -545 -684 -647 -1073 -476 -76 -1096 -70 403 -691 976 735 -162
705 -162 540 900 439 406 -526 339 389 -832 -39 206 -1012 88 58 -836 61 -342 -229 204 -279 180
725 180 303 -167 804 668 -381 784 727 -198 212 -363 -402 -253 -594 -227 -254 -686 151 248 -646 864 446
746 446 -465 455 227 161 164 -327 67 500 -733 494 520 -287 813 126 -353 670 143 -286 -77 -423
766 -423 2 -172 -749 270 32 -587 473 135 -324 357 219 81 376 17 224 321 -137 510 89 -670
786 -670 506 -169 -670 102 -422 -587 -122 -574 -112 128 -344 626 305 191 793 749 -43 992 305 -222
806 -222 168 -323 -317 -442 -776 -25 -312 -793 104 -126 -333 508 138 71 551 441 312 321 1 875 -74 -495
828d95R96q48l29O53o52Q4L50n37O09K60k41O18m67K9J112q16k77Q21r31m0N84
849D83o22M0k54l66N42l71j34Q43n39K74O40o74K85N48m70RK51j64M06o55l16
870b44Q76r98r3O41o67m7L95l48J92L26k29L00m19L03Q31r04J07P46q95N2M97
891D22n05K87r9m59N53m16j7N60p19n9P33q54O45J46n43L46J81m75N89m07J13
912B2O61n97LM01o91J39L89o86L42m0j31J94k57j40O41p83MJ020r34M51M05n77
934a64M64j36k93O30k95J07L25q96K42M60j124N34M26o60O0J96q0J60j76L24J99
955C03m19R7P59j098N53K94o88L41rk68J15k33o5K30p54L62M74m79M25K52n10
976c18N41qJ2L38j62J51p2l36J0J24p77L93J28q87O45N4j82K74l61L79L59l96
$$ plain form
828 -495 501 -347 -676 -23 -675 -591 -241 -778 -169 91 -150 468 1 30 1142 326 49 870 -61 -101 483
849 483 -139 -99 -353 -719 -177 -548 -682 161 -378 -104 536 -138 147 695 225 234 485 321 727 72 -244
870 -244 632 -366 -459 182 -485 -532 -137 -485 -293 33 -196 104 -315 -12 819 -85 22 768 -127 -75 422
891 422 -83 204 105 -354 199 -217 -234 326 -393 -452 281 -573 72 218 -325 21 202 -273 316 -91 22
912 22 683 86 89 490 -201 -62 327 -359 -17 -57 -188 6 -251 -391 250 -533 -529 491 -443 8 413 -164
934 -164 300 164 -129 501 206 313 638 -258 -16 444 -680 -146 280 -380 -320 -124 -204 -44 -220 104 303
955 303 -116 -19 740 -358 195 489 -199 142 133 -135 -20 -253 -318 -88 -842 -480 -6 -485 -60 192 -318
976 -318 223 215 227 565 403 554 482 146 156 280 -497 -104 24 -863 -218 -164 -346 -72 -433 -54 305 -91
998i1K71K06l97N55j09m79N46j59o65J71k4o6J00m39K54K83m83N12R7m27N60J71
1020C87l46L84j57J07L07o36L90j85n76M68j53p25P70q6n43O92k83m2K24O1mJ07
1042A61m43O43j41m23O56m9l55K33j90k89K72l49R7j20k20M36l15l29P34j18k45
1063c54O95j35J02O4m01J72N4l09N89k64n01M44l75l3M03n61J17K45k63L59j88
1084a40j28M35n5k15N76k29m36N98j03p7L23n43o5l6k52N77k48n07M64q7l05P56
1106C03o42K09M18m96N10P8l05L56j29l37N36l79k92M29m00k30N0P3l1M8k84L77
1128a38Q0l72P83j12k53O24m73j38M93k22j87J19l30K3k31o1L18l65j5O13l00
1149a44k7M83k76k5J89j15J83p6j74M23l20l00N78n59m9L48m61L81l18o1J91j11
$$ plain form
998 -91 180 386 -11 544 435 -44 502 343 -322 -151 -175 -241 -141 -580 -326 -43 -526 -14 83 -344 216 387
1020 387 41 425 268 375 682 46 436 251 -325 143 -10 -735 35 -51 -594 98 -185 -227 -3 58 54 161
1042 161 -282 361 220 -203 453 404 49 282 92 -197 75 -274 -177 -297 -517 -81 -396 -725 9 -109 -354
1063 -354 341 206 308 372 -29 143 197 -112 477 213 -288 156 -219 -252 151 -410 -293 -48 -311 48 -140
1084 -140 -268 167 112 -103 473 244 -192 406 303 226 549 6 -59 -95 -347 230 -18 -525 -61 -148 -453 303
1106 303 -339 -130 288 -208 302 380 75 431 302 -35 501 122 -170 259 -141 -371 -321 -248 -279 -231 -515 -138
1128 -138 -58 -430 353 241 -12 612 139 1 494 272 85 204 -126 -103 -334 -395 -77 -442 -457 156 -144
1149 -144 -171 312 36 11 200 85 268 192 18 441 121 -179 399 -160 -209 139 -322 59 -259 -320 -129 -240
1171b40o0M02j49j02M27j47Q9K66m64J84j39j31L8p4k28M34m20m1N35m58L6N30
1193B88l03kK53m09N89j04k12M38o72K16K73l84O2K24m76J71j77l3Q3q8K03M5
1215a5k33J37L48l41K1L81l30L7J07j94K49l63K54J78q5j35L78m35j59K75j29
1236e4J62j56LJ02k96J76N9k48M15R7k67k8M43k85k44J13k40M98l41j56K45k32
1258b34K00p7j36J87J81k25R9L3m3lm6J84J76m8k59M42l43j03K00l49J84k78n9
1281c17L56l52K19J58k97J02J58k17M21K4j81K93j93l26L43k1n5l6k71J47K13
1302A68m78L65j9k48K22J4k92K78n5J7K84l47L27K72o09K26R1l35j2K79l66J45
1324g3l72J73o8O5L15J35k71K58j09m20N67q3l49N73m32j7L84l11K24k29k18K81
$$ plain form
1171 -240 -300 102 -47 -149 278 131 220 486 22 206 67 -64 -26 -100 -328 106 -314 -355 180 -278 -242 288
1193 288 -15 -17 236 -173 416 312 100 538 -134 82 355 -29 33 257 -219 -48 -225 -258 -175 -263 -60 -15
1215 -15 -248 -111 237 -104 -83 298 -32 5 112 -82 167 -196 58 236 151 16 394 -41 -200 75 -54
1236 -54 108 -48 -45 57 -239 -63 -4 -252 163 260 -7 -35 408 123 -121 -8 -248 250 -91 -247 -2 -234
1258 -234 -34 -111 -247 -60 121 -104 -5 28 -15 -18 -64 120 296 248 -11 431 88 -15 185 -164 20 -258 -317
1281 -317 39 -313 -94 64 -233 -131 27 -190 231 255 74 367 174 -152 191 170 115 79 -192 -45 168
1302 168 -310 55 36 -212 10 24 -268 10 -45 -28 256 -91 236 508 -101 125 216 -119 -131 148 -218 -73
1324 -73 -445 -272 -340 -275 40 175 -96 162 53 -367 200 117 -232 341 -91 -108 276 -35 189 -40 -258 23
1346B3Qn31L96J15k72K97q6K24ll75L19J64k61K91O8n40K39q8j13K20l60O8J66
1369c1k64K56j18j03R3K63l20M03l1l08M14k38j03K62m34K79L76n94K48j41m91
1390e82O82j49j14R3oJ52q6k1K16n1j24M29j19l55J89J7l47J29p0R1J52l37K46
1413C5j86j25L82j92l04L84J2j44R2R0J13n1k00L18K9j92L33m32k74M64o4j16
1435b8Jj93J7K63k56K17J85j97P4J28j80J29J68l13Q8k7k65K81J40l13K68l77
1457a90K03l42J30J98j94j86N12j26j42K90j75K68j00k65M19j61j32J57J4k47
1477f9K1j94J5L81m64K48O8k80L85j84J52J03j72k01N39k21j86N52l78j53lJ79
1499A38l2l04o7K22nl00K92j29R6J87j29l3J76J5j6L1l61L49k14j07L58q9l18
$$ plain form
1346 23 31 -500 -104 11 -261 36 -50 174 171 -204 115 279 18 309 377 -163 76 -12 -125 95 -265 -197 -31
1369 -31 -295 -39 -157 -260 -167 96 -224 179 148 -160 254 16 -87 175 -259 20 396 -198 50 -91 -582
1390 -582 100 -49 -163 -70 -76 76 -10 -31 185 134 10 439 320 -35 154 171 -176 -47 -117 -26 126 -211 35
1413 35 -151 -276 106 -86 -390 -6 6 -138 -46 44 157 106 -94 224 253 61 394 -38 -312 152 88 -28
1435 -28 -27 -220 -203 60 -196 21 206 9 83 211 31 160 328 15 103 76 -189 92 232 -81 187 -190
1457 -190 13 -329 -199 -1 -195 -381 131 5 -137 153 -22 246 146 -119 300 139 7 164 178 -69
1477 -69 -48 -242 -227 154 -310 -62 6 -274 111 -73 79 182 10 -191 348 127 -59 493 115 -38 -41 138
1499 138 106 -198 -265 -43 -48 -348 -56 -185 -89 98 -31 -64 112 127 111 142 -219 130 -84 -191 167 78 -240
1522b40L08q0R1r5p5Q2k16K49p9p7JJ54k63J60L48k28j16K58k36K16j60k27L69
1545A44m01o5N66m77M8K37J2q3l4P7J48o4mJ59l18J1J87k85K19K0j86Q9M4j83
1569a39J08l5k28L48J7l71K71j4j45L59k20J05R6ON7J4N0%k55k4m5J70l47L03
1593H1m58J45J31k4M6MJ91l03L23k16K14j65K18j80o7J31N0k24J54n7k02L35l51
1616b24m8K08n1M6L2j15L21k45K2P5j16L31q3l07J2K72j65n0j21K6Q9%K1J17j49
1641a02J58L6k39K73On7j75L10j61J95j50PJ3N8k77J07k96K01J33k54J50R4j15
1664h5J06QK4J20M4k50J18J17j65j28J75k7M5j20J27j4k38K19k14J53J19k5J0
1687A19k58J52K07m4k03O5L6k28J15l2K8J47l04J85J18k80J60J69m12J90Q6l41
$$ plain form
1522 -240 68 -12 79 -16 -91 -9 -225 24 -55 -132 -131 23 -240 -80 268 40 -76 182 -54 162 2 -225 144
1545 144 -257 -322 244 -233 -185 52 64 -19 -53 24 172 108 104 263 -55 -44 143 -142 77 97 -89 0 44 -139
1569 -139 -31 -66 -294 54 71 -300 -29 -43 -188 171 -49 56 152 158 215 229 279 279 24 0 -45 125 -222 81
1593 81 -377 -232 -101 -125 -79 -75 116 -187 136 -80 134 -31 187 7 -60 71 121 -103 51 -6 -208 127 -224
1616 -224 -272 -64 -115 -69 -37 -152 169 -76 -54 21 -95 236 153 -154 -142 130 -35 -85 -206 -180 -91 -91 -70 47 -102
1641 -102 56 92 -147 126 132 75 -100 210 49 244 94 101 114 172 -105 2 -294 -93 40 -214 -64 30 -85
1664 -85 21 29 53 173 217 -33 85 202 37 -91 84 57 102 -18 109 95 -143 76 -138 15 134 109 119
1687 119 -139 13 220 176 -27 38 74 -154 -39 -71 -43 104 -200 -15 103 -177 -17 152 -260 -70 16 -325
1709c25K51J07J17Ll82L01J68m54M85k53J90Pr3k10J35j81J61J04l49L52l29J25
1731g0j0K00N1Q1k91j52K61M7n2l7j54K44R4l98L42r7j26J4q5j29J97q0o8K49
1755C1Q5j43J46k07J99n7Q3J4r2P5j48J14l04J26o7J08J12p6R7j81p9J20j0j03
1779a57K01o5m0J27L1k3p9j25K41K8l8o9n2kK32m63J79j43K55k04J69m7L11k15
1803E2k19K14P0j46l4O3j53K09q6Q0k48J34K17l1l96L23j01J84j40k8j53L47k63
1826a05K95j46P5k09N9k91M71k49kJ12L6r0J21j34j25K41r9K7r6K5N9L9Nl2n8
1851g1K89k81K60k33nQ0q9J9n2R1RJ05k04J08j55l1K98k55J87LQ9j94J11K14m21
1876a28J48K09j44j78J27j06R4q2r8qR2Q3rj75k3L19Q5l01N4O6j78L02J0J7o2
$$ plain form
1709 -325 -74 33 150 153 -229 72 240 -214 271 18 208 215 122 -88 47 -134 27 131 -218 134 -195 -70
1731 -70 -80 120 171 252 -39 -191 70 117 65 28 -126 118 212 -186 156 59 -67 -53 -138 -267 -70 -150 -218 31
1755 31 116 -27 119 -88 111 54 137 151 59 134 -14 100 -204 -78 -145 -37 75 -1 96 -85 -164 -44 -54 -157
1779 -157 44 -21 -61 66 97 74 -5 -130 111 139 101 32 -20 -22 210 -253 -74 -217 38 -166 3 -44 267 52
1803 52 -167 47 117 -29 -63 0 -153 56 -30 50 -198 -64 153 122 -274 49 -52 132 -8 -36 -189 158 -105
1826 -105 190 44 119 -90 -31 -322 149 -100 -102 10 46 -44 77 -57 -182 59 -40 -13 -109 -84 -25 14 19 -13 -71
1851 -71 218 -63 197 -36 -41 39 -50 -31 -83 8 17 122 -82 26 -129 -160 138 -117 70 73 162 -32 79 293 -128
1876 -128 20 229 85 -93 34 -72 22 -60 -158 -166 -74 9 0 -175 -198 121 206 -95 -41 25 -153 149 159 176 114
1901A14j0J55l90j4J58q6m9N1j20J73R3k02M5o8L04J7j18M5j22l4J02n8j03J02
1925a5J13j65q6K92k30K3l0j44J63J84j2o1q7KJ14L8J4J5j37P3k28J45J38j96
1949g7j41K02j5l7N4n3PL9k02K26o3K17Jj06J18L0j48p0K21l13Q7p2K43j09J14
1974A53O3k02k31L27Q2l19J12J13m3R5l14R6J48j00R1J45j09o3K5N1j92q1n6K93
1998H4j7J3L3l14O8K41n3k4K94l83J88r5J6O0j80K19k87j20Q7J69j33J10j7j74
2022b15kK62m3J90j71j70K28Oj25j29J68o5Lo7K79j12L5j62Q5j16J96j87O6o7
2046a13Q1R1O6j92L9L8P1K6k12K7M5J10L3P8l21K94j63O8N7j15qoO2j37L56k66
2072IQ9o6M4k6N0l42L27j7j61K9k0Q9j22J56j50J55k22L12j44j25L56k90NJ04
$$ plain form
1901 114 104 259 -131 -145 13 -73 -122 -71 -191 -18 75 -127 -82 -150 154 171 53 98 -24 -58 44 -14 -117 -15
1925 -15 98 -67 -153 139 -91 -68 -98 -242 -79 105 93 32 -55 -53 61 99 113 128 -9 64 -164 -19 119 -77
1949 -77 -218 -16 -31 -68 -14 -67 -60 -21 -223 3 -60 157 158 52 170 200 52 -18 203 -110 -23 -95 148 39 153
1974 153 216 14 -217 110 192 -127 -15 98 55 150 -164 -68 80 -20 71 216 107 44 69 120 -72 -153 -209 84
1998 84 67 80 113 -201 -133 108 55 31 325 -58 130 35 51 111 -69 150 -137 -257 -170 -1 -134 -24 -41 -215
2022 -215 -217 45 2 192 21 -149 79 85 -40 -169 -1 -66 -63 -130 149 37 72 -90 -5 -121 75 -112 -46 -113
2046 -113 -32 59 125 -67 -28 10 81 107 -105 -78 -33 77 110 188 -133 161 -2 66 123 8 0 -6 56 -81 275 9
2072 9 98 32 76 50 100 -242 85 68 -93 -64 -84 5 -117 39 -111 44 -178 134 -10 -135 221 -69 -64 40
2096D0J28j42K01l42J12J79j06PMj32M4L6k6L2n3K99k63k31J4J53J71o6R1k37
2120h7n0J80J42m8m4P3n5j55j16J28n2NM8jp1j08J7L01M3j19nK43k86J81k08R7
2146E3K1p0l0j47J71J03j83n2M6k15K87j42R3L6KR8n3K34k27O9j87LJ98k2l06
2171b20M19l23J64l25Q3L15j08J7j05N1Q4J68j91J40j7k57J84Q3j79n6j73M56
2193B10k03qK4k96K33N2N8j49K21j17j05O9qL3l2k0NK66l45K73l8p8m3j4l3L18
2219B73k45L2r1j26J90j30r0K04k63K56L80k83q0J24j32r4J28j16n1P4J38K2k84
2242a64J33J44J0l72J95Q1J13j84j85K1J0R8J55rK8j18R2qNl7j42K32r1j75J93
2267B5J54l46P2m3J64o3J36j58j5n0K61j06OJ63k84J88k63K88o8k3p4l10L97m0
$$ plain form
2096 40 168 26 227 -115 -3 176 70 77 81 -51 -7 29 3 35 -18 281 18 -213 -199 -46 125 59 150 -87
2120 -87 -137 43 185 137 93 166 111 -44 -160 -32 -84 -79 -31 -32 -103 -211 -194 107 150 31 26 269 -17 164 -44 53
2146 53 74 4 -26 -173 -2 101 -82 -134 -88 -303 -16 -158 -65 -29 -27 71 18 252 25 94 -93 -90 108 86 -220
2171 -220 199 -124 40 -285 -202 113 5 22 -83 -32 52 220 29 169 152 -105 79 162 -17 -73 -246 210
2193 210 7 -1 23 -273 -40 12 70 -79 142 25 -80 -11 -19 14 -18 -38 -33 233 -112 161 123 45 2 -12 -45 273
2219 273 28 60 -31 -157 33 -97 -187 17 -246 10 390 107 27 151 19 -75 53 -63 -114 -40 98 120 -164
2242 -164 -31 113 123 -249 -54 27 140 -44 -229 -208 -198 -100 55 46 74 -44 48 40 45 8 -134 98 7 -168 25
2267 25 179 -167 -95 -138 26 -37 99 -59 -74 -124 137 31 37 200 -84 104 -159 129 61 38 -36 -346 51 11
2291A1n0QK15k21L5OJ82k86J01m5J73k4l0L5j04L7k47K53p7L5J04J39m06P6LK71
2317A94k17K03rk46K61j65L2%J84l45K10M2n6q4k8J6j20Q7M7J61l52K38p9LJ41
2342A18j63J63j2j47j50N1J58J20nk41n1J44Q0k43J08J01k52K1M55%m25J37O3
2365C0J23q1j44O5J84j98j0K62l83J5O9J66j04j32j9J10j57O3J51K00j87O8j31
2388d0J27jj48JK93l71L87q5k94L19j75m6Nj61J32J09j07R5J39k35M9K0k3Q4K1
2413I5j24K9J26j34K78k91n2k24J70K45k32P1k08K44K22k64%j32O2J20L35k11
2435A25k44J55J71k92K65k13n7J17J46j44Jk51K64j24J42j81M2N6j80J36K07j52
2457a1K39k19j24J83O1r4n4K7J4k4RL4m60M25n2J22J25m05K76Nm5j9O7p8M9R5
$$ plain form
2291 11 -39 -31 184 -37 -2 4 186 -100 1 -44 129 105 75 110 6 43 -204 49 -28 7 111 250 -156 -80 -77 194
2317 194 -23 180 171 -75 186 21 53 53 237 -108 102 144 88 4 -24 -8 -128 -41 6 167 -185 53 -26 -23 118
2342 118 -45 118 106 -41 -191 -140 18 138 133 -108 -159 -15 65 -178 -70 31 -221 -200 255 255 -170 -33 30
2365 30 153 72 -72 -7 177 -21 -31 231 -152 -137 -68 98 -6 -138 -157 -47 -204 -141 10 210 23 91 -40
2388 -40 87 86 -62 -61 232 -139 248 163 -131 188 13 -33 -28 -189 -57 52 -55 40 179 -56 -7 13 -10 74 95
2413 95 -29 0 126 -8 270 -21 -73 -297 -127 118 -114 -43 -251 -7 215 -49 -49 -181 -119 1 336 125
2435 125 -119 36 207 -85 180 -33 -90 27 173 29 30 -221 43 -81 61 -120 -78 -22 -202 -66 141 -11
2457 -11 228 9 -115 68 129 35 -19 8 22 -2 7 41 -419 6 -46 76 201 -204 72 77 32 13 80 2 51 146
2483A46r9K1j4l07K63l2k3P8p2O8r9P5K5J9r4K97k95n0j27K85n1M1J15n3L7l20
2509a66Q3P6n8l4J07K3kj5k62L26j3J07k40J31L0J49j65k02R1J48k71K47k41Q3
2533f8Q4n1qj52O7N8M3Jm5P2J41o1p3J84j26K00l07J41j03j93J99J15n8j56P9
2558a7j62J09L2J72k93J82O7M5k74K88K90l21j12K03j23j50J25j09J07Jj12o0
2580a12J12J46j39k00P4K14p9J03j42P7N5j12LK82l82J79l36K58J21j85k4J41
2602E4J3j26K5l7L7P4J62o9mj71l2K44j93r9M7K94n0j06J8o9j33K58j3j75Q3J89
2628B21j31k22K39k16K16j29Q1r3Q3M8j0j18N5p2K8n5l7J25m0p7L7J3nJ19l2j60
2654a32J51mjN7q9j30R4J36j03pkN0o7j76K92q8J15o4m1l95M64j3J1k4j10K20
$$ plain form
2483 146 47 68 54 -253 10 -22 -45 33 -39 29 -70 5 30 49 -45 252 -43 -93 -220 65 14 55 170 117 154 -166
2509 -166 -83 -7 -65 -99 8 31 29 14 -248 78 65 172 -68 63 93 242 77 -125 -34 114 -157 90 -151 -68
2533 -68 16 -35 -43 -195 -128 -70 -27 -26 -71 1 142 81 8 192 66 266 -41 100 -3 -196 3 118 60 -96 -17
2558 -17 -179 -70 -38 134 -159 23 90 135 -139 149 439 118 6 209 86 -64 61 -48 59 60 -52 -112
2580 -112 0 146 7 -193 -119 95 16 119 -23 54 109 -3 0 282 -100 79 -257 1 122 -63 -87 54
2602 54 67 -59 -34 -71 -34 40 202 133 129 -42 -74 170 -23 -122 -75 219 169 63 81 12 -121 137 124 -51 32 221
2628 221 90 -132 107 -109 107 -22 59 -34 49 97 87 -31 24 -48 -20 -75 -112 13 -27 -104 -67 -54 -59 60 28 -132
2654 -132 19 15 14 71 -18 -148 -54 82 -21 -28 -30 20 -47 -223 69 -19 96 32 -9 -404 60 47 58 34 -76 144
2680A44J25j46j18K20k47KOM7K1O6Jl14J21J58lj23Q2j79O2J35r4J25j41k0K6
2705d4k0l5J86m9j40J0J24L7o1k2k4o2JM8J13m71L74J35p3M3j35j7L02j33j90
2730a03P1Q7j96J65j27M4n0Q0L2K87k51jk06J13J02n2J25j16O4j47J48j38J25
2753E6m6J6j47J40J9j6j39K20j13k4J63l4l20J39J77Rk78J11J2P8l9OK2n5R9J60
2779B16l71K42j43M7j5m9j53K38p5l7R8r7K93k45J32p9p6M9lQ3j01K83j24k50
2803a37K49k57J57q4mj43J81o2K58j34N8j3P6j93K72j86o8J67k36J58r8K15l00
2826a24k2K8Q5k70M31j20N6J68k98LK97l54k5K51j10m9N9k9m4N7J20l8Oj29J61
2851A10Jj67J38j17rJ08r8k0K4j26L20j75j16M3M6p5L3Q7J3j72J45K6J15j05R7
$$ plain form
2680 144 269 123 5 225 -22 -20 -14 33 54 120 121 -193 -72 86 83 -40 42 -137 -75 60 -34 91 -50 -70 -44
2705 -44 -64 -99 87 38 -102 -92 32 69 8 -14 -38 -100 -99 -51 62 -409 -35 100 27 70 -65 -82 220 87 -103
2730 -103 -32 55 -141 24 -103 -59 -109 -29 3 290 39 38 -168 -55 47 -5 120 4 68 -79 69 -69 56
2753 56 10 26 -121 19 38 22 -117 103 -10 -34 129 95 -225 -86 91 100 -178 -67 -55 23 -16 -10 12 -43 56 216
2779 216 -155 87 -56 -9 -24 -73 -226 12 -63 -100 -2 -99 194 -51 81 2 -74 -25 -28 55 -46 237 113 -137
2803 -137 112 -145 12 -72 -76 -219 -38 -100 158 24 82 69 145 -48 224 38 -30 137 -99 59 -39 176 -124
2826 -124 -146 -118 -33 -303 128 8 64 232 -66 -63 234 -120 -145 106 -4 -53 6 -23 -67 -10 110 72 78 -51 110
2851 110 111 -56 82 -35 -44 64 -34 -54 -30 -156 164 -11 -127 -84 -38 -113 -80 7 20 -152 -7 19 134 29 126
2876A26j45k0k1J97j73l8O8J87N0j55j19J14p3MM4k1L9L4p1p1J40j84J01M1N8
2901A12j51J26M1m0L3j30K3p8J92j30O3m9L0j30j8M0j27M4QM6K39O3k44kj01K66
2927A26J68j81k40k1J77p6r9P5l8J80l8J2K24l64k0J9J5L85k53j30n6J61l10L49
2951F5k57K72O8m0j32p3K19k89J46J60k47J60k8J5J3n0J21J0j61J1M2k5O4l4Q
2976C8PM6j53L5Q6kj3j24R7k8O0j11L4l4kr3j6K49k45J31M7j06p8J36p5n2J76
3003A0k19K64M3j41k26P5J43N6K11j65P4j10k04J73M4j76j32K56J66k30O1J83
3025A56j00K7j69J08R6j29J23k67qK92j60mJ18l6k25K96o9k84L31jj78m7N5J69
3049I4l89K49M1r6O6j86L54m02L51j03L5j79K95p7R6L1k8j06j04O2K3K8k26K45
$$ plain form
2876 126 -19 -39 -60 137 -36 -74 -6 181 231 76 -43 71 -2 2 46 25 64 98 27 -44 96 -88 13 54 112
2901 112 -39 87 128 88 121 -9 14 -64 128 -2 61 12 42 -88 -106 -66 -193 -149 -141 -95 144 207 -37 -39 -140 126
2927 126 294 113 -127 -148 29 -47 -146 -71 -109 71 33 45 269 -95 -115 -96 -81 304 51 -79 -135 26 -284 65
2951 65 -192 80 148 108 -24 -97 122 -167 -21 139 -108 52 24 39 52 2 123 133 -28 -17 25 0 64 30 38
2976 38 45 91 -62 -27 59 57 44 -80 17 -11 49 -62 -28 -62 -64 -157 -173 76 -169 -38 9 -97 -175 -39 -114 -166 10
3003 10 -209 55 98 -43 -269 -194 -51 5 216 51 125 15 -189 -16 28 -148 -280 -24 142 -88 -27 156
3025 156 56 83 -86 22 118 -11 112 -155 -163 129 -31 -35 83 47 -178 118 49 -235 96 95 -83 -130 -75 94
3049 94 -295 -46 -5 -101 -35 -221 133 -269 82 -21 14 -165 130 53 149 180 152 46 -58 4 27 55 -171 74
3073G4M3j19j72K76k05J69K3J45j65j68J26P2J16k29q3J15O3n9K4j80j9L50j80
3096A7n7rp2L72l04N6Q4j20J75J59k00r1N0R1j18k39L88r2j13L68l66j17l7J52
3120b3j21J41R2o3q9J09j27K36j7kj13J38r3j07L01k66J07J5l3k01QJ42k9p3L9
3145b9J7r1K03k00P5n4jK07j49Rn1K74k66O8K2j21J52K4j33O2k01L73q0j74P7
3170A3n3N6K25k45p0K14l5j82J36J42p8r4L1J90n60K11n5L65l05l9Q4J62j1j04
3194bJ06l5J8k04rJ53r8J51rJ42j55l02J94J47%k96K06J22k8j22q4j67L78J19
3218B25p1l12R0N2K5J20k11N5M9k6q1n0K31K6j24L6Q2k22L13j03K2j36K28j41
3242G7J5j64k4K94k80K98k06r6J16j13J58j04M7R4N3M2J4l16p6K26j76K31qj07
$$ plain form
3073 74 117 -2 -174 102 -103 66 89 234 69 -99 27 99 215 -14 -97 18 81 22 46 -134 -153 197 17
3096 17 -40 -49 -121 251 -53 3 87 -33 142 301 101 10 60 151 33 -206 182 90 -23 345 -21 -138 -175 -23
3120 -23 -144 -3 89 26 -63 46 -81 155 138 136 23 161 68 -39 262 -4 103 118 85 -116 -108 34 5 -68 -29
3145 -29 -12 -103 100 -100 -25 -79 -80 127 -22 -13 -64 210 -56 12 34 -87 65 89 -44 18 -183 190 110 -64 13
3170 13 -40 16 241 -4 -74 140 105 -77 59 201 123 29 60 250 -310 -99 -154 211 -94 -133 -49 113 102 -2
3194 -2 104 69 87 -117 -126 27 -71 80 71 213 58 -244 -50 97 97 -199 7 129 101 -21 -105 -272 106 225
3218 225 154 -158 -68 -16 9 129 -82 -27 22 -4 -85 -135 96 122 -2 34 116 -106 207 104 126 -10 218 77
3242 77 92 -72 -96 198 -82 216 10 -86 30 -83 75 -29 18 112 165 207 221 -95 -171 55 -121 110 102 -5
3266eJ54q9N6j62K68j25m2q6K8K8P4j69J63j74JJ07j7j97J44K30k23n5K23j58
3290b6j6J26o7OJ27j20k3n7N4m0J29j12p6R3m3N5P6j20q4m6L61k74N0J04j21L4
3316a0j11J47J7j9L4j7PK4l6n8P4Q1m6j92K27j37r1J77j40N7r0N3J77j80Q0L6
3342F4j44L9K32l06J53o6R1k19K90k5k26J97k62L46r1k4K54l43K0K04k01J33j10
3365FK20l08m6K39j92K4m6o0K73k18N7J79j92J75M5k03K24j55J4n3k8n9R8j27
3389a33P1J99j12J27l38J64J48j69K5J33R6j98j20L17k31J16m6q5J03mj49K35
3411A49j38j12O3L4O5o2O7j16j08R8K88p8k67O0NO2K43k83O1L6j05M2k0J05r8
3436ij14K03k40R0K7R2j05NJ07L3q0J45p3j67M5OL2n2p4J54K7k6P6j45R8M8j40
$$ plain form
3266 -5 149 60 116 -46 222 97 55 -31 -3 25 99 -70 93 -81 -80 27 10 -187 -43 187 -36 -91 132 -26
3290 -26 -42 84 17 23 150 30 7 -50 4 -36 93 -19 -95 -2 -45 10 86 -34 -118 -164 197 -77 -27 77 -44 -10
3316 -10 -121 26 43 24 58 41 48 72 36 -22 52 133 87 -105 122 -15 -106 71 -69 -12 -102 -49 128 -52 28 64
3342 64 -80 -41 191 -115 38 -28 63 -156 134 109 -117 80 -182 164 73 49 303 -40 -20 184 -17 116 6
3365 6 226 -82 -128 111 -81 -57 -103 -163 110 -108 -51 128 -64 111 156 -47 177 22 36 -17 -45 -104 -6 -133
3389 -133 -62 137 25 152 -186 -22 126 -43 -18 115 211 13 -107 210 -21 95 49 -36 67 63 -86 149
3411 149 11 -101 -38 -4 61 -1 66 -50 -158 -60 228 150 -117 -57 -52 10 253 -30 31 67 -38 4 -16 89 -9
3436 -9 -123 80 -160 -70 -43 49 -56 -51 56 89 9 154 81 -86 -41 -35 -3 -55 -129 25 52 26 102 -43 55 103 -37
3463c7J03M3j70J24o2J16r7j20K59m06J26O1J9R5QL8J6lk1p1j14j17J72M3l9L05
3489B71n50K20K46k65O8k20J94k5J25J37k38j3J31k27j5K68j95P7J58j83J5O2
3511D1ok4j04K69j88NJ14q2R3J9q9K5k45J51Q6n5O2j77J55j11Jl7K1O2j0l7L7
3538b4m9J02q2J16N7j31N2n0n8j7l4O8J68j9o0m6j2K67j92j25J01M6r7M1m8n4
3564h0J81j54Q1J27j55k0Q7K5l6o9P7K5j17j44R5K7j28K25j13J03Kj68L14k11
3588b6J74j28O1j4k42J90J05o7j26K04m30M84j70j17M02l71k0P3K7M7M8n0kL2
3612H4j47K44m0n8k45R3n9J84L8k64K42k06K5K00j38J40j11P2k73M75l21m6m9
3635a60O8J94j65P9kQ3j40K18j64r1J33n6r7kK39k79L51j26j82J74M7j93J00J35
$$ plain form
3463 -37 66 109 -61 63 1 117 20 -100 159 -247 -121 -60 -41 54 62 100 116 113 92 21 -93 -210 -38 5 -34 271
3489 271 -279 -59 187 -78 -10 -230 -36 -61 64 201 -37 -50 81 -146 -161 107 -88 -11 147 -36 -21 41
3511 41 35 11 -93 176 -12 -7 107 25 118 137 48 73 -172 -21 65 10 72 -105 50 -61 -60 -97 -76 -14 -24 -61 -24
3538 -24 -73 29 -53 63 120 -11 41 -9 -67 -84 -118 -50 118 99 39 -7 -19 248 56 -69 32 78 -19 22 -26 -80
3564 -80 101 -53 28 155 0 -20 67 92 56 -13 64 89 -28 -172 -77 -50 -178 47 -66 37 39 -129 185 -26
3588 -26 148 20 81 67 -175 15 120 53 -73 131 -299 185 15 -102 300 -71 -91 -18 9 56 104 54 52 84
3612 84 -63 181 141 83 -162 -69 -128 56 94 -170 72 -134 -109 91 -47 93 -18 54 -219 256 -65 -111 -160
3635 -160 -92 102 -63 16 14 97 -43 175 11 -80 53 -3 -100 -102 137 -142 209 83 -99 75 122 -71 29 164
3659A64l02K36J5j96J29l2L9O7P8k67J12o3O7j2j40J43O2M4j98j21NK79p7J17
3683A49k89K20j8q6J79J9k94J7L21j43j43R9Q7P8j62N7l8o7P1k14K25Q6j27k55
3707b28K15J96j88J06j28M7N4N5j90j16J84k7j13K21j15j6J65l3k3j28j00J94
3729C2K3J53k1N8k64J22j75J02o8N4j53K87k11Mq1J84j64M1k5J09o1N7k8K07k2
3754A60j06k4O0J08l45J97j97O0j9N4j8J69p3O4O9l07J44n4L9M9j38J29N9k0l46
3779b86J94k2M2J15j80O9M1k47K24J84k41K05j33J72k08pM2K37l38K18j03Kp3
3802i3j24K12j47J97k33J45r8K16j87K23j77Q2O3m6r2P3n8K39j70k76K71J54j57
3825A7k5n3J33j61n7J86j63r3L95kk75p1K50j08Q2M3k78K37j17R6n1K8m1O9m8
$$ plain form
3659 164 -138 98 113 -83 46 14 53 120 198 -69 43 -20 47 35 -105 38 100 144 -54 -175 -170 109 32 149
3683 149 -140 80 62 -24 155 174 -120 -103 218 75 -68 31 118 196 34 91 53 -14 57 -157 68 154 27 -228
3707 -228 -13 183 -5 101 -27 20 74 129 -61 -177 7 -20 -133 88 -27 -43 122 89 66 -62 -162 32
3729 32 55 208 187 245 -19 103 -72 30 -38 16 -137 150 -61 -57 -138 46 -118 -77 -102 7 -54 3 -25 182 160
3754 160 54 30 90 198 -147 50 -147 -87 -106 -52 -70 99 26 90 159 -148 -4 -58 -19 30 -108 21 80 60 -286
3779 -286 -92 -114 -72 43 -137 -68 -27 -274 -50 134 -107 98 -35 137 -71 -78 -36 201 -137 81 -22 -20 -93
3802 -93 -217 -5 -152 45 -188 -43 -141 75 -112 111 -66 16 79 33 -59 14 -44 195 25 -251 20 174 17
3825 17 -8 -61 72 -89 -146 40 -123 -216 179 177 -98 -169 81 -27 55 98 -180 57 -60 36 -15 13 -28 41 -7
3850gK7n8NL7K9j21J8K84l53J79M2p6P3n1j28m2K66k92K79l05P4K02k34O7J05
3875B0r7K68k97J69n1n3R3m2K2N9Lk9j25m8L4M01k85J16n7j49m8J76k29K2K31
3900A04O3m84K89K23k78k6L59j44j65k3n5L11j33j66P7J54k61J4N1K68r4M7j69
3923c8P0p6J70j95r2J86Q1j08K06L8l34J4k4j8K7J70P2k13J1rK41l16J35M2k56
3948b16K39j12M6j5j22J76O1O8R6p8n9l4K03j98ro1NQ2M2K8k21J40k39J09j16
3973a85J34r9J78L9l2K0j12J91j05J00j68Q8M1Mj76J07k34L32k3q1j55L44j66
3996D2k12K81m8j14K19k36n7R2J04j86K63j80J53j75k95L32P7j71oN9m6N6q0K21
4020I3K7j68l1J71P5k0m8L4k79K42k01p6R1R8k51R8R0J13o7R4k55P6M6P4K08l79
$$ plain form
3850 -7 20 -38 -33 4 33 -88 -70 214 -139 40 82 6 79 28 -100 -142 124 -168 111 -194 -120 82 -152 -85 20
3875 20 -77 191 -106 63 12 -41 52 10 32 91 94 65 -60 -108 -74 327 42 158 101 -48 -96 80 -149 -127 104
3900 104 167 -317 -28 195 -83 -109 250 106 -59 -82 -137 174 41 -125 -48 106 -155 -141 -90 178 84 131 -38
3923 -38 32 -44 126 -69 -161 25 106 -2 204 242 -92 -78 -102 -120 -93 77 149 -64 -53 -62 179 -137 -2 40 -216
3948 -216 23 -89 -43 -58 -180 -4 57 125 221 143 84 50 253 55 46 -15 -10 72 114 142 -79 61 -178 -69 -185
3973 -185 -51 -150 28 67 35 55 -57 134 29 129 -39 49 90 94 -82 25 -209 123 100 19 -136 208 42
3996 42 -170 111 63 -51 168 -68 -125 -33 71 -115 148 -32 121 -54 -349 -17 60 -111 -117 -58 -104 -48 -128 93
4020 93 120 -48 -79 92 167 147 99 133 -146 96 -105 -181 -90 8 -243 -145 -55 58 -9 85 -170 -94 -48 26 234 -145
4046a45N4K0J21M9j20o2J79j19K1q3J81j89o4K13p0J74j46J51n1K6j06r7nJ64
4070I6j11Q9o9q2l9O1m2K4m5j34L32q1j33n5K91q1o3j7K11m12O0K94k2k7o0OK35
4097B26k42J99mj68N7m4J30k9k42P8O1R0j05p5O1P7l9o6J0j54J90j63L04j82j45
4122a75J64Q6J4l9o5N5j0o1M3j9m9O6j75K33P1k13O7n5n1J77j80Q3l1j12L21j73
4148b8J54k41J66j00P0m8L5j28o2R5J90O8p8j74P0P2r8K08q6k13J68O0o9j88K87
4173A30r5NN4lj13j0Q9j21k2P3N4j7j72K10j63k2J69k05J92k60L59p0k46J02L09
4198B27k12N7j15m0J13j73J03J35j54OP5K5p7l3jPJ76j63J03k57J85Lj79J03K38
4223A52k52R9J33j08K2q3r2L82j27k80Q0KOj7O2RP0l69K24J19l5L9P7j77k4O9
$$ plain form
4046 -145 -91 -71 50 99 -21 -83 96 -23 -2 -85 96 -93 -157 56 -14 160 14 165 114 140 34 -63 -68 96
4070 96 -15 74 5 -77 -116 -55 -97 -73 -118 -252 80 -1 -134 -189 102 21 -42 -59 152 -260 -200 94 72 45 -15 -9 226
4097 226 -16 183 179 11 68 24 154 125 -117 -39 22 112 7 -68 -7 70 31 -35 -25 -179 11 -152 152 -30 -175
4122 -175 -11 75 89 50 -15 40 30 -31 12 -7 -56 10 -165 68 139 -74 -7 -62 -113 64 -116 -33 -64 -176 145 -28
4148 -28 126 -115 51 -49 21 -27 8 -120 -182 -87 103 171 93 -81 -11 61 -37 171 85 -128 40 100 31 -157 130
4173 130 35 40 94 91 -22 -32 57 -64 -86 -13 41 24 -148 62 -101 -123 46 -159 33 -227 132 62 -184 -82 227
4198 227 15 72 -43 -83 30 -143 -40 95 -59 -53 22 47 -30 -63 -64 -57 119 -44 59 -198 -13 -10 -189 -86 152
4223 152 -100 -1 132 24 46 -37 -129 253 126 -154 -74 -72 -66 -83 -21 -12 58 -311 -87 32 -3 36 113 -64 -88 -19
4249a9j17L12k81O1N0N8k28O9K00j25K0k8pJ12j1M0Q8j09J02q0j76O2q4O6K5L0
4275C0N2j74m6K25j48k15J16J14pJ01J4p1N3p1R0N3k67J64P0k56J94OP2j29r1
4300a21R4k03L34j87K02k11K27n7q2k5k1Q8k0o9J82p3m6R7k38MJ52j57J48K2M5
4325H5k8j59O7j57R4K48p7j47L04p8k34J38L7p9k0j56J13O7q2L02j80O5m0j43
4349f0m2R5Q0K5k46J10J14j53oJ31j62J04j92K70M8k43J42K12j42p6p6Q4J29j0
4373A36o4j00J05j0N3n6j53J69k65K19PJ07j42n3NJ15j39O5j5OJ12j42K20j35
4397D5j8o4q3K7L37j05L1k80P8q8K6J21m4n6J13j10n4QL70k89O8o5NKj38J66L4
4424C7m4Q9m6Mk14J7K56o9n8j08N3K63j12r8N2Q1o8j9j34L27k41J25j09J52k77
$$ plain form
4249 -19 -136 176 -105 -44 6 64 -164 -95 105 -20 0 -28 -35 77 66 106 194 85 187 107 -69 -7 -91 -25 0 30
4275 30 82 -92 -138 87 -61 -276 -160 -46 -53 48 62 -9 44 -27 63 116 -151 13 83 -173 21 27 99 -30 -121
4300 -121 -27 -230 104 -83 119 -92 135 78 -4 -29 -50 38 18 -51 131 58 12 109 -129 -125 27 -130 18 40 85
4325 85 57 -102 -35 -192 -98 150 73 -74 230 152 -82 56 93 14 -6 -162 -49 18 -64 238 58 123 83 -60
4349 -60 -102 -7 73 98 -148 -38 76 -77 -83 48 -114 -10 -202 68 116 -127 15 227 85 9 -67 17 146 136
4373 136 72 -28 77 67 120 64 -89 80 -185 34 41 148 6 -47 -42 73 -66 -1 -16 -10 102 -40 180 45
4397 45 27 -37 -120 -93 244 139 170 -110 -32 -120 -94 27 -17 -73 40 -70 -124 -116 254 -35 33 -32 -27 -25 -163 3 37
4424 37 -7 82 36 40 -174 -157 99 30 -28 -136 -83 180 68 -30 22 103 35 16 -118 209 -32 93 -16 136 -141
4449a41J37kK7O1p5J17k38KJ21Q2j88K49j86j5j33J54M9J10k53J96o4J31o3j86
4473a08N3K34k74J7J08r4M4JL1QK4Q2n7p6n9K62l62K21P6k37J97n6j04K8O7j18
4499i2L1j01J50k5j89K5K5K20k10K06Pl78N01l24J34q8K17k79o6K34J75j19K8
4522H2j14l3J12mK02k40j22P7N3o0M1L2r1J3J12P4r1m5J57q9R5%j63m7j5N3pR2
4550G4r7k92K11K48M9m28M71k89n7L13j25r0J01k12K13MJ92k46J29l55J25o9K11
$$ plain form
4449 -141 -4 -6 21 82 7 124 -114 -112 9 91 -97 152 -34 -49 -182 -28 21 131 -122 74 10 141 78 -108
4473 -108 -55 179 -95 -78 30 -64 -20 -19 12 20 44 126 69 -7 -66 196 -166 55 131 -106 91 35 -69 -41 26 -92
4499 -92 -61 -162 -12 -37 -226 -201 -176 44 -166 40 47 -331 170 -154 -20 -108 109 -170 -236 -2 173 54 82
4522 82 -32 -65 47 43 245 5 -117 -40 13 -47 -6 26 -65 -52 60 134 43 -2 155 66 161 161 -2 -49 -64 -11 -18 74
4550 74 -23 -315 -104 144 193 -235 236 -53 -110 203 78 -12 89 -123 90 94 286 40 169 -186 -61 -130 81
$$ [...]
8191A19
##END NTUPLES=NMR FID
##END=
