##TITLE=1H_DE-80H_X3
 200.13MHz, d2o
 8 sc
 
 19ns.26.2.2025
##JCAMPDX= 6.0         $$ Bruker NMR JCAMP-DX V2.0
##DATA TYPE= NMR FID
##DATA CLASS= NTUPLES
##ORIGIN= UXNMR, Bruker Analytische Messtechnik GmbH
##OWNER= pz
$$ XWIN-NMR		Version 3.5
$$ Tue Apr  8 14:30:50 2025 Russian Standard Time (UT+4h)  Yarkov@DPX200
##.OBSERVE FREQUENCY= 200.1313
##.OBSERVE NUCLEUS= ^1H
##.DELAY= (6, 6)
##.ACQUISITION MODE= SIMULTANEOUS
##.ACQUISITION SCHEME= undefined
##.AVERAGES= 8
##.DIGITISER RES= 18
##SPECTROMETER/DATA SYSTEM= spect
##.PULSE SEQUENCE= zg30
##.SOLVENT NAME= CDCl3
##.SHIFT REFERENCE= (INTERNAL, CDCl3, 0, 14.3821)
##AUDIT TRAIL= $$ (NUMBER, WHEN, WHO, WHERE, WHAT)
$$ ##TITLE= Audit trail, XWIN-NMR		Version 3.5
$$ ##JCAMPDX= 5.01
$$ ##ORIGIN= Bruker BioSpin GmbH
$$ ##OWNER= Yarkov
$$ C:/Bruker/XWIN-NMR/data/yarkov2/nmr/H-C/1/audita.txt
$$ ##AUDIT TRAIL=  $$ (NUMBER, WHEN, WHO, WHERE, WHAT)
(   1,<2025-04-08 14:29:21.56 +0400>,<Yarkov>,<DPX200>,
      <created by zg, POWCHK disabled, PULCHK disabled
       configuration hash MD5:
       00 E9 B6 7A A2 85 ED C7 34 08 36 98 17 FE 4E 26
       data hash MD5: 16K
       FB CD 89 B8 17 61 9F E6 1C FA 1F 72 8D 14 2C 1F>)
$$ ##END=
$$ 
$$ hash MD5
$$ 2D 0D 4C 9A 1D 6F 28 78 99 3A 09 01 34 6D A5 64
##$RELAX= 
##$RELAX= 
##$RELAX= 
##$RELAX= 
##$RELAX= 
##$RELAX= 
$$ Bruker specific parameters
$$ --------------------------
##$DU= <C:/Bruker/XWIN-NMR>
##$EXPNO= 1
##$NAME= <H-C>
##$PROCNO= 1
##$TYPE= <nmr>
##$USER= <yarkov2>
##$AMP= (0..31)
100 100 100 100 100 100 100 100 100 100 100 100 100 100 100 100 100 100 
100 100 100 100 100 100 100 100 100 100 100 100 100 100 
##$AQSEQ= 0
##$AQ_mod= 1
##$AUNM= <au_zg>
##$AUTOPOS= <>
##$BF1= 200.13
##$BF2= 200.13
##$BF3= 200.13
##$BF4= 200.13
##$BF5= 200.13
##$BF6= 200.13
##$BF7= 200.13
##$BF8= 200.13
##$BYTORDA= 1
##$CFDGTYP= 0
##$CFRGTYP= 5
##$CHEMSTR= <none>
##$CNST= (0..31)
1 1 145 1 1 1 1 1 1 1 1 1 1 1 1 1 1 1 1 1 1 1 1 1 1 1 1 1 1 1 1 1 
##$CPDPRG= <>
##$CPDPRG1= <>
##$CPDPRG2= <>
##$CPDPRG3= <>
##$CPDPRG4= <mlev>
##$CPDPRG5= <mlev>
##$CPDPRG6= <mlev>
##$CPDPRG7= <mlev>
##$CPDPRG8= <mlev>
##$CPDPRGB= <>
##$CPDPRGT= <>
##$D= (0..31)
0 0.7 0 0 0 0 0 0 0 0 0 0.03 0 0 0 0 0 0 0 0 0 0 0 0 0 0 0 0 0 0 0 0 
##$DATE= 1744108160
##$DBL= (0..7)
120 120 120 120 120 120 120 120 
##$DBP= (0..7)
150 150 150 150 150 150 150 150 
##$DBP07= 0
##$DBPNAM0= <>
##$DBPNAM1= <>
##$DBPNAM2= <>
##$DBPNAM3= <>
##$DBPNAM4= <>
##$DBPNAM5= <>
##$DBPNAM6= <>
##$DBPNAM7= <>
##$DBPOAL= (0..7)
0.5 0.5 0.5 0.5 0.5 0.5 0.5 0.5 
##$DBPOFFS= (0..7)
0 0 0 0 0 0 0 0 
##$DE= 6
##$DECBNUC= <off>
##$DECIM= 32
##$DECNUC= <off>
##$DECSTAT= 4
##$DIGMOD= 1
##$DIGTYP= 9
##$DL= (0..7)
0 120 120 120 120 120 120 120 
##$DP= (0..7)
150 150 150 150 150 150 150 150 
##$DP07= 0
##$DPNAME0= <>
##$DPNAME1= <>
##$DPNAME2= <>
##$DPNAME3= <>
##$DPNAME4= <>
##$DPNAME5= <>
##$DPNAME6= <>
##$DPNAME7= <>
##$DPOAL= (0..7)
0.5 0.5 0.5 0.5 0.5 0.5 0.5 0.5 
##$DPOFFS= (0..7)
0 0 0 0 0 0 0 0 
##$DQDMODE= 0
##$DR= 18
##$DS= 0
$$ [...]
##$SUBNAM2= <"">
##$SUBNAM3= <"">
##$SUBNAM4= <"">
##$SUBNAM5= <"">
##$SUBNAM6= <"">
##$SUBNAM7= <"">
##$SUBNAM8= <"">
##$SUBNAM9= <"">
##$SW= 18.0517328524113
##$SWIBOX= (0..15)
0 0 2 0 0 0 0 0 0 0 0 0 0 0 0 0 
##$SW_h= 3612.71676300578
##$TD= 16384
##$TD0= 1
##$TE= 0
##$TE2= 300
##$TE3= 300
##$TEG= 300
##$TL= (0..7)
0 120 120 120 120 120 120 120 
##$TP= (0..7)
150 150 150 150 150 150 150 150 
##$TP07= 0
##$TPNAME0= <>
##$TPNAME1= <>
##$TPNAME2= <>
##$TPNAME3= <>
##$TPNAME4= <>
##$TPNAME5= <>
##$TPNAME6= <>
##$TPNAME7= <>
##$TPOAL= (0..7)
0.5 0.5 0.5 0.5 0.5 0.5 0.5 0.5 
##$TPOFFS= (0..7)
0 0 0 0 0 0 0 0 
##$TUNHIN= 0
##$TUNHOUT= 0
##$TUNXOUT= 0
##$USERA1= <user>
##$USERA2= <user>
##$USERA3= <user>
##$USERA4= <user>
##$USERA5= <user>
##$V9= 5
##$VALIST= <valist>
##$VCLIST= <CCCCCCCCCCCCCCC>
##$VD= 0
##$VDLIST= <DDDDDDDDDDDDDDD>
##$VPLIST= <PPPPPPPPPPPPPPP>
##$VTLIST= <TTTTTTTTTTTTTTT>
##$WBST= 1024
##$WBSW= 4
##$XGAIN= (0..3)
0 0 0 0 
##$XL= 0
##$YL= 0
##$YMAX_a= 159715
##$YMIN_a= -183447
##$ZGOPTNS= <>
##$ZL1= 120
##$ZL2= 120
##$ZL3= 120
##$ZL4= 120
##$ABSF1= 10
##$ABSF2= 0
##$ABSG= 5
##$ABSL= 3
##$ALPHA= 0
##$AQORDER= 0
##$ASSFAC= 0
##$ASSFACI= 0
##$ASSFACX= 0
##$ASSWID= 0
##$AUNMP= <proc_1d>
##$AZFE= 0.1
##$AZFW= 0.1
##$BCFW= 1
##$BC_mod= 2
##$BYTORDP= 1
##$COROFFS= 0
##$CY= 83.5205535888672
##$DATMOD= 1
##$DC= 2
##$DFILT= <>
##$DTYPP= 0
##$F1P= 10.8118882576601
##$F2P= -7.23987719738617
##$FCOR= 0.5
##$FTSIZE= 0
##$FT_mod= 4
##$GAMMA= 1
##$GB= 0.15
##$INTBC= 1
##$INTSCL= 1
##$ISEN= 128
##$LB= 0.25
##$LEV0= 0
##$LPBIN= 0
##$MAXI= 10000
##$MC2= 0
##$MEAN= 0
##$ME_mod= 0
##$MI= 1.114404
##$NCOEF= 0
##$NC_proc= 0
##$NLEV= 6
##$NOISF1= 3.799351
##$NOISF2= 2.8
##$NSP= 1
##$NTH_PI= 0
##$NZP= 0
##$OFFSET= 14.38212
##$PC= 1
##$PHC0= -1188.005
##$PHC1= 7.392291
##$PH_mod= 1
##$PKNL= yes
##$PPARMOD= 0
##$PSCAL= 0
##$PSIGN= 0
##$REVERSE= no
##$SF= 200.129724274929
##$SI= 16384
##$SIGF1= 3
##$SIGF2= 2
##$SINO= 400
##$SIOLD= 16384
##$SREGLST= <1H.CDCl3>
##$SSB= 0
##$STSI= 0
##$STSR= 0
##$SW_p= 3205.1282051282
##$SYMM= 0
##$S_DEV= 0
##$TDeff= 0
##$TDoff= 0
##$TI= <>
##$TILT= no
##$TM1= 0
##$TM2= 0
##$TOPLEV= 0
##$USERP1= <user>
##$USERP2= <user>
##$USERP3= <user>
##$USERP4= <user>
##$USERP5= <user>
##$WDW= 1
##$XDIM= 8192
##$YMAX_p= 0
##$YMIN_p= 0
$$ End of Bruker specific parameters
$$ ---------------------------------
##NTUPLES= NMR FID
##VAR_NAME=  TIME,          FID/REAL,        FID/IMAG
##SYMBOL=    X,             R,               I
##VAR_TYPE=  INDEPENDENT,   DEPENDENT,       DEPENDENT
##VAR_FORM=  AFFN,          ASDF,            ASDF
##VAR_DIM=   8192,          8192,            8192
##UNITS=     SECONDS,       ARBITRARY UNITS, ARBITRARY UNITS
##FACTOR=    0.0002768,     1,               1
##FIRST=     0,             0,               0
##LAST=      2.2672688,     0,               0
##MIN=       0,             -183447,         0
##MAX=       2.2672688,     159715,          0
$$ Real data points
##PAGE= N=1
##DATA TABLE= (X++(R..R)), XYDATA
$$ [...]
1635A02q0j25K74j37k27M14j92j03R8l6r3M35m02J6J69j8j42M2Jnk44K76K08l73
1659a42J66K65k12Q9m0q3J03j42M2J58l68J66J18k60K08r9O0k69J43j19q4K61
1681c9J10r7k90J51J73j5K4OR6O4j18k05m5Q0p5J98j02L9Q8j00PP9k91M86j72
1706E2j58J59K4o3p7P1j69L99j27k01J05J24m6r5j20L45l35R5J2q4N2jL7lj41
1731a45J64j57K48j97J49M5j18J57j11J09k8N2P3j51k29k3L18l63J89O0j83J27
1753a4J21R9Q8l84K42J71m50J26R7Q4l09K08j59J53O7r4Mk24J24J18M5m2r0N5
1777C6K6r0m2R9N9J59j38k68J62J30j09l4jo1J93j85J65n8j4j08J40n7M3J31r9
1802G9p8J71k12r4Q5o6L45k54N0j89K28o2j08J54J7j16J51l55L15j94J57j86K87
$$ plain form
1635 102 22 -103 171 34 -193 221 29 -74 24 -12 -105 330 -72 -56 113 95 -47 -5 -4 -9 -253 23 231 -142
1659 -142 24 289 77 166 126 43 146 4 46 204 -164 2 120 -140 68 -31 29 -240 -97 -216 -300 -39
1681 -39 71 -26 -316 -165 8 -7 17 23 119 183 65 -140 -185 -105 -180 18 -84 -45 43 -57 -50 29 -262 224 52
1706 52 -106 53 77 14 -63 8 -161 238 111 -90 15 139 93 -2 -122 223 -112 -17 -5 -89 -37 -38 -1 -4 -145
1731 -145 19 -138 110 -87 62 107 -11 146 35 144 116 168 241 90 -139 -162 156 -207 -18 42 -141 -14
1753 -14 107 206 294 -90 152 323 -127 -1 96 180 -129 79 -80 73 140 46 50 -174 -50 68 113 71 -19 36
1777 36 62 -28 -70 29 88 247 109 -159 3 133 24 -10 -11 -72 121 -64 101 43 29 -79 61 4 47 178 79
1802 79 1 172 -40 -134 -49 -115 230 -24 26 -163 65 3 -105 49 66 -50 101 -254 61 -133 24 -162 125
1825A25j39P8o8J2j07P3K04j78K24k53R4j00o5J90k98J90K94m45J77j24J66j56
1847a06K02j6l19L39n1q4J7K3Q5j05j55J94j45j67L94k7j32O9Q3j52J67k09K66
1870A71p2P7j57JQ8j27p3Ro1%O2J55k17R6J21l30J98mj54K94J39k42P4J49j01
1895I6J08k29j05M0K13r0k01J36LJ57k71J00rn0N6l7K03j30J95k39P6l4L7j14
1919h9K78j84o3L1j17J02n2J79l31L51j81L4Q4o0J62q0n2J38k48J46l6J16j08
1942B0j97o4J89J04j71J80j72R4l9k9O2j6k8l8K54k56Q0J32q6j00J08k30L09k3
1966H3K5n3m2P3N9l31j50K39l3J61n4j60J92M2j45J82j80J35j1jk5J20k12J28
1990D2k06K88o3r6Q2J72k65J18l12J90K3m1Q3K34j49o1P3Q3k55K81n3j98j01o6
$$ plain form
1825 125 -14 64 -4 8 -99 -26 178 0 224 -29 65 -35 -100 90 -208 -18 276 -169 8 -116 50 -106
1847 -106 96 80 -239 100 49 -35 -18 5 90 -15 -170 24 -121 -288 106 79 -53 16 99 -53 114 -95 171
1870 171 99 176 19 20 108 -19 -92 -83 -144 -144 -82 73 -144 -48 73 -257 -59 -63 -217 77 216 -26 48 197 96
1895 96 204 -25 -130 -90 123 33 -168 -32 -29 128 -143 -43 -52 -102 -46 -83 120 -10 185 -54 22 -12 25 -89
1919 -89 189 5 -58 -27 -144 -42 -94 85 -246 105 -76 -42 42 -18 144 64 12 150 -98 48 12 128 20
1942 20 -177 -241 -52 52 -119 61 -111 -17 -56 -85 -23 -39 -67 -105 149 -107 -27 105 19 -81 27 -203 106 83
1966 83 108 55 13 86 145 -186 -336 -97 -130 31 -23 -183 9 51 -94 88 -92 43 32 31 6 126 -86 42
1990 42 -164 124 61 -35 47 219 -46 72 -240 -50 -27 -68 15 249 100 39 112 195 -60 221 168 -30 -131 -197
2014a97J62k23q0K58J09p4L34k80j42J87k8L7M4J00j23j95p5J58M5l6k9Q9j73
2037a32J00J30k73Q6j28K42m3k07J94m1n8J84O3o9j15Q2j6J02k17O2J86l52P9
2060a41O1m1K36k38J74k2K4K9n2o4K43k09rJ74q1Ok15J35N3k7N4J0j66j45J94
2085a7J72k5k5Ok33L5K20L9k08K10k46M8P7j01j14K51k32K53n0J26j06r5J7j01
2109i9k19O62l87N5r1J01L6k13K77j23Mk41J90J16Rm4r8k22L45Q9k53l8N8J81
2133I5k69N5K99J2r2k99M00n2j81P2J67j27r2J29j60o7J09L2j4J14j91J72j60
2156d8j0J07j27M3J29l6n2L4n9M5P0k15K78j00k53K47m6j19O9J89k60J85j15q3
2180a27J19k2l6O2LNk20J90j00K95j47m4m7Q8K3j40J3j22K9J74R1j84J84j94L2
$$ plain form
2014 -197 -35 -258 -338 -80 29 -45 289 9 -133 54 26 63 107 207 84 -111 -186 -28 17 -19 -48 41 -132
2037 -132 -32 98 -175 -89 -217 25 -18 -225 -31 -72 -130 54 117 48 -67 15 -1 101 -116 -54 132 -220 -141
2060 -141 -80 -121 115 -123 51 29 53 82 30 -34 209 0 -9 165 84 90 -125 10 63 36 90 100 -66 -211 -17
2085 -17 155 130 105 111 -122 -87 133 172 -36 174 -72 -24 53 -48 -162 89 -143 110 60 186 80 -15 2 -99
2109 -99 -318 344 -43 12 -79 22 58 -155 122 -1 3 -238 -48 68 77 33 -65 -287 58 147 -106 -144 -86 95
2133 95 -174 -119 180 192 100 -199 201 149 -32 40 207 80 -12 117 -43 -110 -1 31 17 131 -60 112 -48
2156 -48 -58 49 -78 -35 94 58 6 40 -19 26 96 -119 159 59 -194 53 7 -112 -43 146 -114 71 -44 -127
2180 -127 -8 -30 -66 -4 -1 4 -216 -26 -126 169 22 -22 -69 19 42 -98 -85 -207 -178 -4 87 -97 87 -107 -75
2205g5J08j33Q8j2n5n7O0l6K40j90l8J07P3j00m1L1j45K2R3P0J4L8R3Mj39N0k03
2232a33Q2j61J37J2J55J8k81J41q4k0J4J45J01k02Q9J32j63P2j10M0OJ58j89N7
2256A6j62J96m0K13k82J52m28K80m1M5o1J96M1j19K8L8K36l93J80qq0j60J78j77
2280a52L29q9k19J84m0k03J85N4k35M5mK50k1p8K14k8m7j66k63L89j16o5J88r5
2304A7j39K9J8l0m9J02Q2j70J4J59J14j30O9j19J48j97O9m5J25J85k46j52J12
2327c4o7K51j40J70j31k57n8L45r5K02l83L19j8r8Jj32J41J19k4K1k33J52j46
2350i5K0r7O0L60j53p5K4l8K1NK17j92o4J3kK8p9q4K29L6L2k96J32L6j60J40%
2377A8l5j00O8o4J55J05k6k09n2j3K61o7j41k1nn2K33j97M18k24k06L9J1K73j89
$$ plain form
2205 -75 33 -100 -12 -24 -79 -136 -76 -112 128 -62 -100 7 80 -20 -61 -30 -175 -153 -60 10 24 62 155 159 20 70 -133
2232 -133 -51 -212 -75 -63 92 110 -171 -30 -114 -134 -120 25 126 -76 13 145 -18 54 -56 -16 -10 148 -41 16
2256 16 -146 50 10 223 -59 93 -335 -55 -96 -51 -112 84 125 6 34 72 308 -85 95 87 7 -153 25 -152
2280 -152 177 88 -131 53 13 -190 -5 49 -186 -141 -145 105 84 6 220 192 145 -21 -284 105 -11 -76 112 17
2304 17 -122 -93 -75 -105 -154 -52 30 -140 -126 33 147 17 86 -33 115 -82 -13 -58 67 252 6 -146 -34
2327 -34 -101 150 10 180 49 -208 -266 79 -16 186 -197 122 104 6 7 -125 16 135 111 132 -101 51 -95
2350 -95 -75 -172 -112 248 95 20 44 6 27 32 249 57 -7 6 4 32 -47 -131 98 134 166 -130 2 38 -122 18 18
2377 18 -17 -117 -49 -113 42 147 121 -88 -140 -153 108 41 -100 -121 -126 -178 55 -142 276 52 -154 -115 -104 169 -20
2402b0Jm6J84k18j34K44k6J54k45M0k8J64k61K26k4L3M1j36Q0J1j38J56j0k4M
2427B8k43M62k66l1J38R0k01r7M2Lj58O8J36kQ0k31M66m14N5J04j57J04K04j60
2451B0j99k9K03J91j13Mq0J3k7r2R3N6L5r4L9j27K31j46N7mO9p7p6J42l57K36
2477c2K23l50L8J00K80k71M9j85O6j7J16L9P3q3o9M0j97K12j15K46k22k8R8K15
2501B26l91n0K40j97m1R3J90k35L54j88k16K63n3q0J28l0m4L1J42l53J36O7N6
2524D8L9j59J25J87n4m07L16j91K13kp2J94j50k13K29n3J69j69j17J26J81l09
2546f9J46p3K62j81k30PJ40m4L9M3j27J20N1o2N8r2J80j24n4j75L26n3k22L5q
2571a07Q7Lj22R6Jr9J19N5k21K16m7j27K72k49J67o0k3N9r3J15m0R4j21J19j36
$$ plain form
2402 -20 -19 -65 119 -99 -233 11 -15 139 -106 -66 -94 70 -191 35 11 44 85 -51 29 40 -98 58 48 24 28
2427 28 -215 247 -19 -50 88 178 -23 -120 -78 -75 -233 -165 -29 -31 49 -182 284 -130 -75 29 -128 -24 180 20
2451 20 -179 -208 -5 186 73 77 -3 10 -17 -109 -16 40 75 -19 20 -107 124 -22 35 31 100 23 -53 89 -268 -32
2477 -32 191 -159 -121 -21 259 -12 37 -148 -82 -99 17 56 129 46 -23 17 -180 32 -83 163 -59 -87 11 226
2501 226 -165 -215 25 -172 -213 -120 70 -165 189 1 -215 48 -5 -85 43 13 -31 0 142 -211 -75 -8 48
2524 48 87 -72 53 240 186 -221 95 -96 117 115 43 237 87 -126 103 50 219 50 -67 59 240 -69
2546 -69 77 4 266 85 -145 -138 2 -42 -3 40 -87 33 84 22 80 -12 168 44 -10 -185 141 88 -134 -99 -107
2571 -107 -20 -17 -139 -43 -42 -141 -22 33 -188 28 -19 -146 126 -123 44 -16 -39 20 -73 42 2 96 -25 94 -42
2596d2J35j3J84k95L4J26k11M3P4Q3n4M9j96L00k13O4o1j08M6j75K08j77K63p6
2620a2N6l3L7p5k5J68j38J6J9J0J79l6m5o4j79J56J12j91K63k58j7O5K3j90K75
2645A16j61J02j86R6j8M4M2J5o1L4M6nM1P5l12J57O4j53j19J42j5M6R9m7J22j3
2671A51n9j03J28r4K3p8J77k2p5km3J22j90o0K01k16JK72j98RJ76k25o2J32Q0
2696D5j4N2K0j25j9j60J96ll15M36n0jj32M2J83J01k97J95j23J12m5k77L27k56
2720a08K6K13j83J60k62N2J54r6J29j13%j98J91j34K89j16j3K05k52m4K06k70
2742a64L6J49N1jj05K1NK97r9q8k50P4J64m47K11L21L6m40k5M00j32p6P0J30k34
2767i6J79L0k20J03j75J49q9j13M19k03n3P0M0M2j62K13r8j37J08r4J66n3j14
$$ plain form
2596 -42 93 80 264 -31 3 129 -82 -39 35 118 64 113 -83 217 4 68 7 -101 -55 -230 -22 -199 64 -12
2620 -12 44 11 48 -27 -52 116 -22 -6 13 23 202 166 121 57 -122 34 146 -45 218 -40 -57 8 31 -159 116
2645 116 -45 57 -129 -33 -51 -7 35 50 -11 23 69 64 105 180 -132 25 89 -64 -183 -41 -56 -10 89 42 164 151
2671 151 92 -11 117 23 46 -32 145 123 48 46 3 125 -65 -125 76 -140 -139 133 -65 -56 120 -105 -167 -35 45
2696 45 31 83 103 -22 -41 -201 -5 -8 -323 113 63 62 -70 -28 155 256 -41 154 31 143 98 -179 148 -108
2720 -108 -82 131 -52 108 -154 -102 52 -44 85 -28 -28 -226 -35 -169 120 4 -9 196 -56 -100 106 -164
2742 -164 -128 21 72 71 -34 -13 -8 289 190 102 -148 -74 90 -357 -146 175 211 -229 -254 146 14 -62 8 138 -96
2767 -96 83 113 -107 -4 -179 -30 -119 -232 187 -16 -69 1 41 83 -79 134 36 -101 7 -87 79 26 -88
2790h8J72L5m3j32J43L4j01r2J13j3jr1R3j18M3OrJ42j24J9q7K28j14l6J56l53
2816b18M12j49k92K05k8O7K2J0j68K99l45L22K2j34N9k15K67j95J18l1J7q0p8
2839a13K47k74J28k35L40L06l61j4P0m5k19J08L28m23j6J23J32j36L0J19p4R5
2861A16k47L02j51l0Kj40J05j17J79J33j31j82J59K03k67J18j27M7j9K6P3M1j1
2884H2k03K59k73K02j04R0M3k14J87j65J96k37K48m3J2l14O8R8J7m1m8R0m8K65
2908A67j09J06j81P7k61J55m6K57k52K19q6k00J46Q2l3J46j2j67j05J57k02K07
2930F5p6j26k2K97o5j82N5K3O0k2j82J11n2J54J6l0P4j69O0m1QJ21k12L51l27
2955a11L25k37k67J43R6k5N9j72K32r6j7P0N3Q8r5k48Q5K81j19j71J00K4j89O6
$$ plain form
2790 -88 84 119 76 -56 87 121 20 -72 41 28 27 -64 29 -89 -46 -40 -49 93 -31 -12 -99 129 15 -21 135 -218
2816 -218 194 45 -247 -42 -70 -3 19 29 -139 160 -185 137 159 25 84 -131 136 -59 59 28 45 -35 -113
2839 -113 134 -140 -12 -247 93 399 38 24 94 49 -170 -62 266 -157 -173 -50 82 -54 -24 95 21 116
2861 116 -131 171 20 -10 -8 -148 -43 -160 19 152 21 -161 -2 201 -66 52 -75 -28 -47 -21 52 93 82
2884 82 -121 138 -135 67 -37 53 96 -118 69 -96 100 -137 111 68 80 -234 -166 -68 -51 -92 -140 -50 -98 167
2908 167 58 164 -17 60 -201 -46 -92 165 -87 132 46 -154 -8 74 41 187 175 8 -97 60 -142 65
2930 65 -11 -137 -159 138 73 -109 -54 -31 29 7 -175 -64 -116 38 54 24 98 -71 -11 -52 -44 77 -135 216 -111
2955 -111 214 -23 -290 -147 -51 -76 -17 -189 43 -53 -70 0 53 141 46 -202 -117 164 45 -126 -26 -2 -191 -125
2979a25K06J95k22l0k04K16R7j83L36m42J84K9k01K52l3q2o5m6J10n2j93K74j9
3002Bp1r6L64k00L7M6j4n1n0O6J07j97j4R7L5p9j37K96k81J08j30L45k36l5k9
3027a17J31j63P5J57k36J23n5J16PO5j91p5P1J22j55J15K7K1q9r5K03j17J53j9
3051G4Mk06P3K97j20j49K1j27l3L21k08J79k19L36k57o1o5J36K39j77j00M4j68
3074a66J75R0k86J06Q7p4J84o9j41j5J5P9k49J05K55j64k67J99M7N8J11j06J01
3097G5O0j48J91j45j61Q2J15k97K92Q2j09k12P0K10j9k70J88j50N1Q7K3Qj4j3
3121dK12j75r8Qo5J00j53m1L44J5k63J18k22J19P3K8j0M1j01O7N9j51K3K00L2
3146A56o7m1p4r7K04k55J16J40j63R4l4L1p8J13p7J80r1j24j4n9J68p3K16j12
$$ plain form
2979 -125 81 276 54 24 -180 36 133 -50 286 -156 28 57 -144 108 75 -7 -72 -118 -8 -60 -253 21 2
3002 2 -69 -165 199 -1 36 82 68 17 -33 33 140 -57 -71 26 61 -18 -155 141 -140 -32 -162 183 -53 -88 -117
3027 -117 14 -149 -74 83 -153 -30 -85 31 38 103 -88 -163 -92 30 -125 -10 17 38 -51 -146 57 -60 93 74
3051 74 78 -128 -55 242 122 -27 -6 -133 -166 155 -53 126 -93 243 -14 -75 -140 -4 235 58 -42 2 -166
3074 -166 9 99 -187 -81 6 -68 116 47 -94 -109 -94 -15 -264 -159 96 -68 -335 -136 -89 -31 80 -26 75
3097 75 135 -13 178 33 -128 -46 69 -228 64 146 37 -175 -105 105 86 -184 4 -146 -95 -8 15 23 9 -4
3121 -4 208 33 -65 -57 -122 -22 -175 -216 128 143 -120 -2 -224 -105 -32 -4 -14 27 -74 -7 52 -99 -76 124 156
3146 156 89 48 -26 -123 81 -174 -58 82 -81 13 -21 10 -68 45 -32 148 57 -67 -81 -140 28 -45 171 59
3170E9j26K16j89J09p1J8m3J27N6k14J88j48R7Q9q7k05M3J44j20j13PL95k54n2
3194g4qN2l1o2K75k19j6O7J51Q5k04j27J85L6N4l46J37J28L5m7O0L0l23J36K44
3219B18k65n8J61K7MKj32N0N6j57J46j1o0k7L2R6j68Q9p0J93r6L3q8Q0q9k1K7
3246b8J40m8O8k06n1q7P0J28K6N8j9l21M1J95P5P9O6j74j07J65j29J62k91K44
3270E6k05K32k79j1K72J45l12m1J65J40k59o6J07PJ20o9j64J97j23r7J26m7P8
3293b8P0L2J2j72R7r1J15L1j22J11j96J06p9J59N3k6n5q7KJ43k27Q3N2J42o1J34
3319A98j15j65J71j13o5lJ58j39P9J2N8j87J61l8J73r7l8K7j49J20j27N9J43j11
3343A2p8K19o3n8j03K51j17RJ02k39q4J98o9J84k55J91Rn6O6j42k9K28k59j34
$$ plain form
3170 59 -67 149 -40 69 -2 16 -27 100 156 -58 130 -18 79 168 81 -124 -81 63 -57 -170 -163 232 -22 -74
3194 -74 -82 -30 -61 -123 152 -67 -83 -16 135 220 16 -111 74 110 164 -182 -45 83 118 71 131 161 -162 -26 218
3219 218 -47 -105 56 83 87 89 -43 7 63 -94 52 41 -19 -46 -14 82 -86 3 -67 126 30 63 -25 55 -34 -55 -28
3246 -28 112 64 132 -74 -125 -212 -142 -14 12 70 51 -270 -229 -34 41 120 186 12 -95 70 -59 103 -188 56
3270 56 -149 83 -196 -207 65 210 -102 -143 22 162 -97 -163 -56 -49 71 2 -162 35 -88 -185 -59 -106 -28
3293 -28 42 74 86 -86 11 -80 35 66 -56 55 -141 -35 -114 45 98 72 17 -70 -68 75 -152 -69 -17 125 64 198
3319 198 83 -82 89 -24 -89 -92 66 -73 6 18 76 -111 50 12 185 88 50 77 -72 48 -79 -20 123 12
3343 12 -66 153 90 32 -71 180 63 72 174 -65 -149 49 -20 164 -91 100 109 53 119 -23 -52 176 -83 -217
3367b17L12j08p6k6oJ08L1p2J70J22j84j50J89j78n5R0n6K23m3j01J5J06m4j81
3391a31j13K5L03j30O8Q1o4m2p6m6%J15N6j03Q6r5o6RK7J60n5Q8l8M6l24J07l5
3418a47J57k3R7k58J73Rq7K85k59K85p1j45Lp2K07j38K0O7j23J75q8j32J73k42
3442a34J60j35J63l6o6J43lj32k4K4O9J04k16L3J76k09j93M26j43%J14p9J4Q7
3466A43K3k00L0j4J47k62J28O4p0o5K10m0j17j06J59N9k29J96K9j07mJ59k92J86
3490B7l24J39J88k67K99j59J59l9j83K00k1R6l18p7L57k32Q4O8K42m72K92N0o3
3513D6J15r3J9j50J82j30l6k31R0K08J43p3j28N6p9J22j00J80q1j85r3M5O4J05
3537dJ11J6m8j12k09L10n8J8Q1r5j2j00L37k72P3r0P1o0J02k1j7m7j7l7K91m15
$$ plain form
3367 -217 95 -13 -89 -115 -121 -13 18 -54 116 238 54 -96 93 -85 -140 -50 -106 117 74 -27 -12 94 50 -131
3391 -131 -244 -219 84 -46 22 103 39 -3 -79 -125 -125 -10 46 -57 29 -66 -132 -123 -96 64 9 97 59 105 -219 -112 -147
3418 -147 10 -13 84 -174 -1 8 -79 206 -53 232 161 16 19 -53 154 16 36 103 -20 155 67 -65 108 -134
3442 -134 26 -109 54 18 -48 95 92 -40 -64 -40 29 133 -83 -50 126 -83 -276 150 7 7 121 42 56 143
3466 143 166 -34 -4 -18 129 -133 -5 59 -11 -76 134 94 -23 -129 30 89 -140 56 85 -22 -26 133 -159 27
3490 27 -297 -158 30 -237 62 -97 62 23 -160 40 19 115 -203 -280 77 -155 -71 -3 239 -233 59 109 46
3513 46 161 68 87 -63 119 -11 -47 -278 -188 20 163 90 -38 18 -61 61 -39 141 60 -125 -218 -173 -109 -4
3537 -4 107 123 75 -37 -246 64 6 24 105 10 -2 -102 235 -37 36 -54 17 -43 59 38 21 -26 -43 -80 211 -204
3563b04K76j46l7Q8L5P4N6j96p0J34j69M4L7J31lj30K09k70J55L7j58J63l6q2
3587f2R0k77L2J62J18J22l22K24LK00k7m14K51n7o1j42K46j26j70L32L8j23m8
3610a1qJ74l2p0J36k44J28l7j0J28j26n3Q1j12J09k00K14P3Qn9j58N3l0q7J07
3635b6N6O3R9j10NJ22j97qO1K04l06k27J78J56j98J73J72k62n1Pq9L0J46RmO6
3661F9L9j51K44j4j71j03K19J16j49j73K3K48n3r9P5K8j12j09k8J9J7r9M7J18
3685AOo6K17k43K15n0J5o0j9q5J72j36o8l4j13L32p5j28J04Q9k58Q8K37L5j21
3710E5J01k7j94m6o3J71J00J09j51j04n7l2K82k4q6j31o6K09J2K4k25K2J42p9
3734e8K55k79K4L7Q3K48k76j63K50l7j26r1K49k2j31p5k1P0L9j08rJ29n6K9R9
$$ plain form
3563 -204 72 -74 -111 -23 12 86 142 -54 -124 10 -159 -115 -78 53 50 -80 129 -141 14 51 -107 56 20 -62
3587 -62 28 -249 -217 -55 63 185 -137 87 90 290 263 -151 100 43 -18 -160 86 -40 -210 122 160 37 -11
3610 -11 -19 155 123 53 189 -55 73 36 26 154 28 -25 56 -56 53 -147 67 140 148 89 -69 -16 -46 -133 -26
3635 -26 30 93 192 82 87 209 12 4 65 269 -37 -264 -86 70 -128 45 217 -45 -96 -89 -178 -148 -2 7 3 69
3661 69 108 -43 201 187 16 -87 132 248 99 -74 -51 197 144 45 120 148 36 -73 -101 -82 -65 -164 -117 1
3685 1 7 -59 158 -85 130 80 95 35 16 -69 103 -33 -101 -135 -248 84 9 -119 -15 74 -184 -96 141 176 55
3710 55 156 129 -65 -111 -174 -3 97 206 55 -49 -106 -138 144 120 34 -97 -163 46 58 82 -143 -121 21 -58
3734 -58 197 -82 -58 -21 62 310 34 -129 121 84 -42 -133 116 94 -37 -112 -133 -63 -24 -132 -141 -12 -68 -39 60
3759F0q0r6q8J67J06J2m7O3on8o1j85K03N5P2N6l91O0L44k96J14j61K64j92K41
3784A56k1j54J28j76n5M1J23j40KL09l19K12j40j64L49j39M5j4J29k10o8N4J39
3807H7j91P6J80n8k2l6j99J65J50o2r8M4k77K50r1R9L4j5l50K15O5J01o5J07j51
3832d2m4J58j04N2q0J12j40J40l01L23J11j05j83J01P1j58J5K28l93K63J18j15
3854B7J5nP6K9k76J43L6o6q3J1K54j72K36k28j8j06R5n1k3J09J04j58K44k16Q3
3879F0L8q3J04j43j77K75O0J48m49J43P6j50j6J11k8J51k30K00K20l44r1K92q2
3902H5l24K40P1j53J4K29j82J08j85K27O2j56q1J67k50J94r8J27N6j80k44L54
3924H1J11n8k96K06j53m9P1K0P0j43K71k32JJ22l1J0m1%J45k39K72j85J18Q6k01
$$ plain form
3759 60 -20 -116 -204 -37 69 81 34 97 91 33 -28 -213 -10 45 117 173 -218 -158 186 -110 4 -157 107 -85 156
3784 156 135 -19 109 -67 -122 -81 42 -98 -96 213 -106 106 -34 -198 151 12 57 43 172 -38 -106 -52 87
3807 87 -104 -28 152 94 72 36 -163 2 152 90 -8 36 -241 9 -82 17 51 36 -314 -99 -34 67 2 109 -42
3832 -42 -86 72 -32 20 -60 52 -88 52 -249 74 185 80 -103 -2 69 -89 -74 154 -239 24 142 27
3854 27 42 37 113 142 -134 9 45 -21 -104 -93 161 -11 225 -3 -21 -127 -32 -83 -106 3 107 -51 193 -23 60
3879 60 98 15 119 -24 -201 74 134 282 -167 -24 52 -98 -114 -3 -31 120 -110 90 310 -34 -125 167 85
3902 85 -239 1 72 -81 -67 162 -20 88 -97 130 192 36 -45 122 -128 66 -32 95 151 -29 -273 81
3924 81 192 134 -162 44 -109 -158 -87 -67 3 -140 131 -101 -100 22 -9 1 -40 -40 105 -134 138 -47 71 157 -44
3949d4J30j87K41j32j85K63j49J38k63M31m15J43L10j15j79R8J19k91J69l9p2
3970b9M3p7Q9k3O3QL8j82R8J78j40p7ro5P7J32k7j12K36p8j92R4j89J12j08J31
3996ij20K06j88n8J35J34o3O4j15J25k2k67J02K34k09J48j4J2j92J01j29Q1Q9
4019D5L7P9k57K9P0J23r9o6J19p2q8K03j20j1k4J61k53J79k2r9o6N9r0l3j3K04
4045ej57K68M2j53OK9p4o4OK26n1j88K5j56K78m1m9P6k5J25r9j37J38k54L28j32
4071c8K11j49m2J33k49K11r7P9K5pJ94k26K6k4J26l0L5l24J80N9j23Rn3J46p1
4096Aj64K20k31K27%p0R0k8P8k84L26k32k2j18l4K37K73l66J24j11K56j01K1j09
4120a7j04J21J43o8R3j10o9j30K4jK16k29K2K3K99k19K0J05j05J5k09L3p1L15
$$ plain form
3949 -44 86 -101 140 8 -177 86 -63 75 -188 243 -172 -29 281 166 -13 85 204 -87 82 43 -29
3970 -29 14 -63 26 3 66 74 112 -70 28 206 66 -11 -20 -85 -8 124 97 -15 221 143 -49 45 -144 -32 -140 -9
3996 -9 -129 77 -111 -169 -34 100 37 101 -14 111 89 -178 -76 158 -51 97 83 95 -97 4 -125 -44 45
4019 45 82 161 -96 -67 3 126 27 -39 80 8 -80 123 3 -8 -32 129 -124 55 33 -66 -132 -73 -163 -196 -209 -5
4045 -5 -162 106 148 -5 1 30 -44 -108 -102 124 73 -115 -90 -246 32 -9 -58 18 -7 118 19 -118 20 -234 94 -38
4071 -38 173 24 -18 115 -134 77 -20 59 84 77 271 45 71 47 173 143 178 -146 34 93 -30 -21 -74 72 1
4096 1 -163 57 -174 53 53 -17 73 45 123 -161 165 -67 -89 -207 -241 -4 269 -97 27 -84 172 71 92 -17
4120 -17 -121 0 143 75 168 58 -11 -141 -117 -118 98 -131 -109 -86 213 -6 14 119 14 29 -180 -147 -218 97
4144I7j22j14J69J71k5k62J89k18N5r1r0L31o3j30J77J48k18O2j69J61K2l7l33
4167b90kM91j51j44j82M51k84N5q6O8Q6O8p5j32K33j01j14J02J22P7k32J52k38
4190a26J24j24j28L79j40L2O6j91J77j44J25J0k19J48M6%k7q1J54j47Q0pm8J54
4214A13p5k29M41l42M3Q6mj76L04k81j3l3K28o8m3N5J0R3o3j50K8K06k39K06r6
4239AO7l11J96J44J23m33L42K4q8o1ok00J57K38l56L11l25K04q2l4J06p7J83q0
4263D3Q6j59Qk0J62k50L16p8j30j23J32j28P9J8Q0K7J81k15j38M4J84k38J00o5
4287h4j3q0o6L36j50K92k57p5q5J63k9J07m6p7n7P6q0O1J07q8l06L21No5k7rK69
4314A43K3k98Q3k23L86k16J91Q9l65K88k31K3K6R5r6J40l83J73K78L1k16K68j08
$$ plain form
4144 97 -25 -139 30 201 176 -86 103 -115 -60 -151 -241 90 27 -103 74 222 4 66 -103 58 80 43 -290
4167 -290 -292 199 48 -96 -278 173 -111 -56 -142 -74 12 80 5 -127 106 5 -109 -7 115 192 -40 112 -126
4190 -126 -2 -126 -254 125 -15 17 83 -108 69 -75 50 60 -159 -11 35 35 8 -73 81 -66 14 7 -41 113
4214 113 38 -191 250 -92 -49 37 33 -143 161 -120 -133 -166 62 -6 -49 6 16 109 46 -104 -76 130 -109 97 1
4239 1 68 -243 -47 97 220 -213 129 153 65 4 -2 -202 -45 193 -163 148 -177 27 -55 -89 17 -60 123 43
4263 43 129 -30 -22 -42 120 -130 186 108 -22 -145 -13 -141 -62 -44 36 63 244 29 -109 -65 119 -119 -19 -84
4287 -84 -97 -177 -243 93 -57 235 -22 -97 -182 -19 -48 59 13 -64 -121 -45 -125 -64 43 -45 -351 -30 -25 -90 -117 -126 143
4314 143 166 -132 -49 -272 114 -102 89 178 -187 101 -130 -107 -81 14 -82 58 -325 -152 126 157 -59 209 101
4337A01R4j30k14J51P9k12J28j8O2j5j06j82L89l08J62j46Q3M03l76j5J95j72
4359d7qJ20j30kJ95j96J26o4j04N5n3Q2o6J63n5O4Oo1l2N2K22l13p6j10K20k6
4385c8k4N0RJ8r8k0R5P8j68P2O1j36P2N4n6Q0J5j51r1J87j24K11j58jM4N3n5n4
4413g5j2J86n0J0j9l7J50j48p4r3k0J59j04K32l50M15k76J67j7l2J15j07J76k9
4437A67j31P8N1k00J11l00J00K70N1k53N7J1j44R0n5K25j97%l2MQ6j20L83k45
4461Gj8pp6MK47j77r9J58m7K33k32j37N3J01J22j97j95L27Nm5N4j86J94o6j14
4486i1N6j36L14k27J66P4o7o3K67k33r4k29L77j7j03j07P9J91Q8j67j77J96j79
4509h2q9Q0K9Q3O3N5j25k1J14k6j4J9j88K65k72O7O4J50j68rj40K84j77N1j49
$$ plain form
4337 101 195 65 -149 2 81 -131 -3 -21 41 26 -80 -262 127 -181 -19 -165 -82 321 -55 -70 125 -47
4359 -47 -55 65 -65 -67 128 -68 58 -6 -110 -55 -108 -26 -92 71 16 80 86 25 -7 45 267 -46 -122 -232 -12 -38
4385 -38 -62 -12 -3 15 -83 -103 -8 70 -98 -26 35 -101 -29 25 -31 49 64 -87 -178 9 -115 96 -62 -63 -19 34 -21 -75
4413 -75 -87 99 49 59 40 3 153 5 -69 -162 -182 -23 -127 105 -245 170 -106 61 44 12 127 20 196 167
4437 167 36 114 165 -35 76 -224 -124 146 197 -56 1 12 -132 -42 -97 128 -69 -69 -101 -97 -11 -131 252 7
4461 7 -11 -18 -94 -90 157 -20 -119 39 -8 225 -7 -144 -91 10 132 -65 -260 67 72 27 81 -105 89 23 -91
4486 -91 -35 -171 143 -84 82 156 89 26 293 60 -34 -263 114 97 -6 -113 -34 157 245 78 -99 97 -82
4509 -82 -171 -91 -62 21 84 139 14 -7 107 81 67 86 -102 163 -109 -42 22 172 4 -5 -145 139 -38 13 -136
4534a36K13p2k28R5L69l27Q2R0k6j60r5O8J32J09j99n2M5P8kj07N7K09j55P7p4
4559in8J42K8q9q6j40K14m8j8K44L2k07n9Q9Nj07J18r8J01qpl6J2K5ljk7M5m4
4588A0J9k8R6k7j23J4J26r0k1R1J19l49K26j05o8J35Ll2J52j39K0J14o6J36k47
4613c4o5Q6j41J15j5J83K40l38N4o1N5j88K42l50J59j63J80J04r3k6l1L12j71
4636E4o2%k2J19j3n0j11J54r6L5J31j5j48P1j34o8K90j28J8j8M3k2p4J4J09j60
4662h3J0R2PR2j96L51m05Q2j8K20j64J24o5K32j81j90J49k34K61q6k04P7R0J38
4686I9q9o1J02k95K81R5l62J04J23j54J52q3N2J4J46j82L67j38l82L23k92J80
4708@J8Jp7J61k57K42m2o1J82k22n9J37k1K44j30r6m6L7j7n1M9j21R2J51j27j42
$$ plain form
4534 -136 77 5 -223 -128 241 -86 -4 86 60 -100 -195 -127 5 114 -85 -137 -92 -14 -16 -123 -66 143 -12 65 -9
4559 -9 -67 75 103 14 -72 -212 2 -46 -64 180 212 5 -54 35 40 -67 51 -47 54 46 39 3 15 40 37 36 9 54 10
4588 10 29 1 97 70 -53 -39 87 -3 -24 67 186 -163 63 -42 -110 25 28 -4 148 9 29 143 77 213 -34
4613 -34 -99 -13 -154 -39 -54 129 369 31 85 24 79 -109 133 -217 -58 -221 -41 63 -30 -56 -87 225 54
4636 54 -8 -8 -30 89 76 26 -85 69 -27 8 139 124 -24 47 -87 -155 135 7 25 7 50 28 -46 -32 77 -83
4662 -83 -73 19 26 118 -78 273 -132 -50 -68 152 -12 112 47 279 98 -92 57 -177 84 -2 -206 -129 -39 99
4686 99 10 -51 51 -244 37 132 -230 -126 -3 -157 -5 -88 -36 -22 124 -58 309 171 -211 112 -180 0
4708 0 18 19 -58 103 -154 88 46 -15 167 -55 -114 23 2 246 116 20 -26 11 -6 -57 -8 -129 -37 114 -13 -155
4734a55J91j03K75k35J5J35j43j88J69J04j80L9J60K7Q2j49r0K44j63L1j75N4
4756e5K2J22j18l0k00O8J32k0J17J19k71L70k52q5k5k1J29K38P9k91r0M4L8J67
4780A87k08jJ39j99J45j43M7j0K33l17K47mn7j6Kk2O4j58k6M7K1J01J48j30J61
4805B51l17J13j46K47j54J86k23o5J83j18R6pj5j0L7j04J85k10M5J07k1J1j35
4828f4R8R1j10K05j02q1j35J91K9o4q8J97j31p0O8k59L97l39L50l03r4K48p8J0
4852c4r6r2K60l89L10j76J81k75J85m4K5L8J37j44J8J43j63J62R8O0j77P7j87
4875h3k3R4k9K22j24j92R0J39l30L01p9J04j66K21m29K58Q8k68K14j9J3j43M2
4898i9P1J51j20R9r8j68J77K06k95pJ39r4K4J33j07J27j31j63nR6L7O0k6pq4K34
$$ plain form
4734 -155 36 -67 208 -27 -12 123 -20 -208 -39 65 -115 -76 84 111 193 44 -46 198 35 66 -109 -55
4756 -55 -33 89 -29 -59 -259 -191 -59 -79 38 157 -114 256 4 -81 -106 -127 2 240 319 28 -62 -18 20 187
4780 187 -21 -22 117 -82 63 -80 -33 -43 190 -127 120 116 59 43 45 23 87 -71 -97 -50 -29 72 220 90 251
4805 251 -66 47 -99 148 -6 180 -43 -108 75 -43 53 46 31 21 58 -46 139 -71 -26 81 60 71 -64
4828 -64 34 125 15 220 118 37 -98 93 122 58 -30 167 36 -34 34 -225 172 -167 183 -120 -214 34 -44 -34
4852 -34 -130 -222 38 -351 -41 -217 -36 -311 -126 -170 -145 -107 30 -114 -96 47 -116 46 144 204 27 104 -83
4875 -83 -106 -12 -41 181 57 -135 -45 94 -236 65 -14 90 -76 145 -284 -26 62 -206 8 -11 2 -141 -99
4898 -99 -28 123 3 102 4 -164 13 219 -76 -83 56 -38 -14 119 12 139 8 -155 -160 -64 -27 33 7 0 -84 150
4924A50Q3k78M7o5q7O9J2K9K2K02k03k4N0L8k28M5j30M69o6P1m49L12l6J41j37
4949C7L9k09K87l63L77k34O5r7K05N7k59K24Q1j20j78j15J67J90j83M6j56K39
4971A00nr8n5J26j83l4J22M4o7J46j51J8k6M7%m5J61N0j42L1J4q9p3J98J51k21
4997A9J15j02r9m6J14n8K18k48L63l50P3m3N7J05k14m7L83k23p9K16j14j59L26
5020B07k97K14k45J32j45m5P7K09j90J16n1l0Lj17J75L8K86m00J00L1P4m1J03
5043B04j25j92J55L6j35J6N3NJ08l94K69j6r5K03l4L5P0m6j3k58L11j55k0L50
5067C32m86J83L8j19j18K01j21J27k06K17J19p7j69J95j58j2L5P2O0j69J23o7
5089@P5k69L6J95O6j44K58j29k20j26J54O4J86r8Q0k32J03N1J34m3j91J12n2j25
$$ plain form
4924 150 233 -45 2 -63 -150 -81 -69 -40 -18 184 -19 -43 7 45 -183 -138 -268 201 135 206 -243 69 33 174 37
4949 37 76 -133 154 -209 168 -66 -1 -98 107 164 -95 129 210 90 -88 -203 -36 154 -29 17 -139 100
4971 100 95 -3 -58 68 -115 -149 -27 17 -50 96 -55 -37 -63 -16 -16 -61 100 150 8 39 53 -36 -109 89 240 19
4997 19 134 32 -67 -113 1 -57 161 -87 276 -74 -1 -44 13 118 -96 -143 240 17 -62 154 40 -119 207
5020 207 -90 124 -121 11 -134 -179 -102 107 -83 33 -18 -48 -45 -162 13 51 337 -63 37 68 142 101 204
5043 204 79 -113 42 78 -57 -41 12 17 125 -269 0 -16 -111 92 58 93 163 117 104 -154 157 2 -18 332
5067 332 -154 29 67 -52 -170 31 -90 37 -169 48 167 90 -79 116 -42 -54 -19 53 113 -56 67 0
5089 0 75 -194 -158 37 103 -41 217 88 -132 -258 -104 -40 146 48 128 -104 -1 50 184 141 -50 62 10 -115
5113a15Q6q2j7Q0p3n7K54n1p0K58j49o4K4j0j15P2K61l46k76K89M03m63N5M3j00
5138a63J86mJ47l37L90k98J68l15K47m9J72j48N6n0q0RN5j29Q9M0J81l9n9l1j59
5163a21K31p3r3J17J74k42j17L28k57J46K42k00J38J2l35q1J71J08k16M0j0q2
5185a20O0j11J53J69j74j37N5J14k17K57R1j10q4j10M82j87j84J6Rj48K74j02
5207dr1R5N4j23J59k59K56J13k78K54j97J18p2K7k6K6J70l39J49n1r1J03m4r4
5231a45pK44J30l31J8K26k22j02L80q5k71R5K16l24K09q0K31j23j3o6k6K23j71
5254FN3j95J07Q9p8J14o9m0M0M7n9m7l9J38l24K77n0K92m48J28q3J83J50j85j7
5279a0j78P2K47k13Q0j45N0K02j09k9J66m44K27J52j46j3M6P5j4l4J29n2Q4j29
$$ plain form
5113 -115 -29 -111 -128 -48 -121 -178 76 25 -45 213 64 0 24 14 -101 -29 232 -114 -390 -101 302 -161 -106 -63 -163
5138 -163 23 19 166 -171 219 -79 89 -226 21 -28 144 -4 52 2 -78 -69 -14 -143 -54 -14 167 128 69 38 -121
5163 -121 110 37 -56 61 235 -7 -124 204 -53 93 335 135 273 285 -50 -131 40 148 -68 -28 -38 -120
5185 -120 -60 -171 -18 151 -23 -160 -105 9 -208 49 140 30 -54 -164 318 131 -53 -37 -28 -176 98 -4
5207 -4 -95 0 54 -69 90 -169 87 200 -78 176 -21 97 25 52 26 52 222 -117 32 -19 -110 -7 -51 -145
5231 -145 -152 92 222 -109 -91 135 -87 -189 191 106 -165 -70 146 -178 31 -49 182 59 46 -20 -46 177 6
5254 6 59 -136 -29 60 -18 96 27 -13 27 74 15 -32 -71 67 -257 20 -30 262 -186 -58 -141 42 192 7 -10
5279 -10 -188 -116 131 -82 -2 -147 -97 105 -4 -33 133 -311 -84 68 -78 -91 -45 30 16 -18 111 59 143 14
5303A4q7J46r9j48K59j06o1M0O1k6k7K34k45J59j16O3L1j80K4O6j7m9K15k45J12
5328A8k90K05p4J08o4K35j96J88r6K6j4K03m67J51M4ml7m0J82o9j8o5k4rJ74j85
5354a18m6L55j60p7R7J7j38J19j62J97j73k07K86j73L48r1p9r1q4J26M3j08J83
5377F4K04l12Q4Q7j72K01j78J5Jn7J63Qk00Q9K01m10K68nj64q7L88j27j31K55
5401A85m34J53n3M2M9MN6Jl3J23N4k59J12J04k57K1K80k61P2J95q2j73j73L71
5425I7k39K10j67j00O6J30K7k95K34O3l2jO3oJ95m98K13O3j4j43J33P1R3k51M1
5450d7K44j57m9rJ9R2p4P9j35k5p0J50K75k73j25J97j21J44J04k12K4q6q5R2l5
5475h3Lj43L73k80Q3O3K7j13J52J3j79J00n3N9j25K01k79J33N1N5j69J75n5r4
$$ plain form
5303 14 -73 73 -26 -174 85 -21 -82 -42 19 -7 -34 200 -45 114 -2 61 92 -88 -64 2 -15 -64 151 -94 18
5328 18 -272 -67 -141 -33 -97 138 -58 130 34 60 46 249 -218 -67 -23 -27 -64 -104 78 9 -9 -74 -98 -107 67 -118
5354 -118 -164 191 31 -46 51 68 -70 49 -113 84 -89 -296 -10 -183 165 74 -5 -96 -180 -54 -11 -119 64
5377 64 268 -44 40 127 -45 156 -22 -7 -6 -63 100 108 -92 -3 198 -212 56 51 -113 -200 188 61 -70 185
5401 185 -249 -96 -149 -107 -58 -54 2 3 -30 93 147 -112 0 104 -153 -132 148 -113 -41 154 72 -101 -274 97
5425 97 -142 68 -99 -199 -133 -3 24 -271 -37 26 -6 -7 56 50 245 -253 -40 23 9 -134 -1 70 163 -88 -47
5450 -47 197 40 -9 -18 1 93 19 98 -37 -62 -132 18 293 20 -105 92 -29 115 219 7 31 -55 -140 -48 -83
5475 -83 -80 -223 150 -130 -47 16 43 -70 82 95 -84 16 -37 22 -103 98 -181 -48 3 58 -111 64 9 -85
5499h5j54M2L13o4j50J68j70J17O7j96J72j54Q6LQ2%J02j21j68K30j27J8R4M3
5523A48p6K98k77l0j7l2K1k4j6Q1k28K98l45K79k56J51q1N6j8j76J71L8om6Q1
5548fj70J86p9j32K25J62j80k9J19k05L09l08Q0J05j08J04P2k12J96k11R6j35
5570a21R4J96l21J50J62j90o6j3J86l0k39J97k19K70k47K28j60R0p0J81j95r3
5592b10L34j46K12m64J05L33j93p3J6K27j6k12L0P4O4q5q3J02p3J59p5n2P8m9
5616Cl3o6J72j57P3j35N2J00M0j55J81l2K5Nj31p2L6J10j07K44k47J35R3o4l0
5641D0L5j9mj78K80r0j07O8P4j43L4J63k34P3j18J11l4o8J33n7l6M14m19Q1J7
5666A6k9J83j7k00O4R7J05l90L51j14R9j65k23K89n31L11q1J90k0J39p9j35j15
$$ plain form
5499 -85 -239 -197 116 52 -98 70 -100 17 84 -112 60 -94 -8 -5 77 77 179 58 -110 120 -7 11 105 148
5523 148 72 370 93 63 46 14 35 11 -5 76 -152 146 -199 80 -176 -25 -106 -50 -68 -244 -73 -35 -41 -87 -6
5548 -6 -176 10 -69 -201 24 186 6 -23 96 -109 200 -108 -28 77 -31 73 145 -67 129 -82 14 -121
5570 -121 -27 169 -152 -2 160 -30 -96 -109 77 47 -192 5 -214 56 -191 37 -123 -33 -103 78 -117 -210
5592 -210 124 -22 190 -274 -169 164 -29 -102 -86 141 125 -87 -57 17 81 -4 -87 15 -58 101 26 -26 52 3
5616 3 -30 -96 76 -81 -8 -143 -91 9 49 -106 75 43 68 73 -58 -130 -94 16 -91 153 -94 41 134 70 40
5641 40 75 56 52 -126 154 64 -43 25 99 -44 -10 153 -81 -8 -126 -15 -49 -117 16 -41 -77 337 -82 -1 16
5666 16 -13 170 153 -47 17 114 219 -171 180 66 165 0 -223 66 -465 -154 -235 -45 -65 74 -5 -140 -255
5689b55L77j30Mj31o7nR0L9q8J55J10p6J55k03k12K37K6K01j01j86n4K8o5K79
5713A28k61N2M0J96K7Q2pj83l36L21L0r1j3j20K65n4k09K31l6mj11q1J09P1j72
5738a26P1J74l8Qo5q3n5K12p4J89Lm4j99K62m83J86m5J04J12k28J24L5M8J75n7
5763B06k35l1K4Q9N7j73O4K56j64j26LL2R0j76Qj01J70L8M4j08M1j58L66l28K11
5788I9j63m0J77j22K83k29j6j74J40nM4J2q2J32k62L29p0L9k17K74j77O2l0L0
5812C4L2m7j37J15q7qL7j82K36j74k2L30k31Q5n5J60j54N9R1P4j40M3l7K5j24
5837g7J4J13l0J20k69J94k75K48k4J06k26J33J24n20N09k70N8k0J77k82K64j62
5859i5nK24k60K95j98K4P8J16j62j80J86k01L32j46R7j09k66J32L28K1j73J49
$$ plain form
5689 -255 122 -8 -4 -135 -202 -207 -117 -78 -166 -11 99 23 178 -25 -237 0 26 227 126 -60 -114 -86 -151 128
5713 128 -133 -81 -41 155 182 264 257 74 -262 59 89 -2 -15 -135 130 76 -133 98 62 58 -53 -134 -25 46 -126
5738 -126 -55 119 81 89 24 -59 -114 98 24 213 216 172 -27 235 -248 -62 -107 -3 109 -119 5 40 88 263 206
5763 206 -29 -60 -36 53 110 -63 1 257 93 -33 -30 2 92 -84 -76 -177 -7 31 75 -33 8 -150 216 -112 99
5788 99 -64 -104 73 -49 234 5 -11 -185 -45 -50 -6 6 -76 56 -206 123 53 92 -125 149 -28 34 4 34
5812 34 66 19 -118 -3 -90 -98 -61 -243 -7 -181 -203 127 -104 -19 -74 86 -68 -9 82 156 16 59 22 47 -77
5837 -77 -63 50 20 140 -129 65 -210 38 14 120 -106 27 151 -369 140 -130 -72 -92 85 -197 67 -95
5859 -95 -100 124 -136 159 -39 -15 63 179 17 -163 23 -178 154 8 105 -4 -270 -138 190 211 38 187
5881A87q3j94J85m2j85J47N8k28K22j17k3L34m32K99j35m6l9K11k7k02j33J71
5903g2k4j44K63L5p5j59J09Q8L0k90L25j00j88J13l1n0R4o9L1P6J09j67l8P0K84
5928B20j62j02j36Q2q1J76L3r5J58q3o5J70j58K1k9R3R1l4P8k62R2L9Q9j06j15
5953h6J02j50qJ52k17L16q0j6m5r4M19k84J4Qpj18K49l19J38K23j63J24j63p4
5977g9m2N1J07Kj08RM3J19RO1l2j75M8N9j27jP8j12J77Qq4J08n9J12j91p8J68
6004G1j31R0r7J66O1J2k64j7J13j4J04j10j9j2J03j9MJ7k24K29o5R4j79J85j82
6029h4PK77q7l9j58J40j16K27j06j88J29J69j99J07j53O0R0J40k78L2k0K9N9J80
6053B18k82L5Q7m9K24k71Q6j67K09j08r2KJ61Q3n0j27J77k90J95Kp0J06k05K75
$$ plain form
5881 187 104 -90 95 53 -132 15 73 -155 67 -50 -73 261 -171 128 -7 -53 -92 119 92 -110 -243 -72
5903 -72 -96 -240 23 58 -17 -176 -67 21 51 -239 86 -14 -202 -89 -120 -170 -76 -145 -114 -38 71 -96 -134 -64 220
5928 220 58 -44 -180 -98 -179 -3 30 -65 93 10 -55 115 -43 -22 -51 42 133 99 177 -85 7 46 135 29 -86
5953 -86 16 -134 -142 10 -207 109 29 13 -32 -126 293 9 23 31 24 -94 155 -164 -26 197 34 158 -5 -79
5977 -79 -121 -70 37 39 -69 -60 -17 102 111 172 140 -35 13 72 -55 -56 22 -90 87 95 11 119 60 172 -19 -97 71
6004 71 -60 30 -67 99 160 172 -92 -109 4 -10 94 -16 -35 -47 56 37 41 58 -166 63 -2 92 -87 98 -84
6029 -84 -77 200 113 74 -84 56 -60 167 61 -127 2 171 -28 79 -74 -14 76 216 -62 -30 -50 -21 38 218
6053 218 -64 -29 58 9 233 -38 48 -119 90 -18 -110 -108 53 136 86 -41 136 -154 41 43 -27 79 -126 149
6077A49L3q6j77q9K57ok62L03l00J53N9j2O5L0k00J2J21L6P9k02J11l5J77j49
6101F7l5p9Q6j54K39k1o3O0p1R3j03j43J35k44M53p2l11J16J22j02m5p6K20r8
6125b6K83l55J25J73k66K43q9l49J56k3M42l65J13N6k02K25o3j01J26J75k75J01
6147A04J07k87L3K78k78O2J0j18Q4l9N8K5N5Kk2k27J56j56K86k78J57j17J39l
6171C1J67l68p1J33J99n3Lj3M4N3j74qj82L69l58L78j86J29k8l7j41M2K9L7j1
6196a6J5K68l42L3l7J03n6j6Q0J47o8O2o8N5q1j11O3l8Pp1O7N0J49l43K22Q6j22
6223C8n9P8q3l2kM1o3L10j28n9k75J04K4J99J83j67p8o3m9O3J17J0k19K30pko9
6250D2j29O5k95J22J74j20J23M8Q7j76R3J46k74KP7J00Q2j33Lp3O1o2J28k10J21
$$ plain form
6077 149 182 96 -81 -170 87 81 -181 122 -178 -25 34 22 87 117 -83 -71 50 86 165 -37 74 39 216 67
6101 67 32 -47 39 -115 124 103 40 100 29 122 19 -124 11 -233 220 148 -163 -47 75 -27 -72 -148 72 -26
6125 -26 257 -98 27 200 -66 177 88 -261 -105 -128 314 -51 62 118 -84 141 78 -23 103 278 3 104
6147 104 211 -76 -43 235 -43 19 29 -89 -5 -44 14 39 94 96 74 -153 3 -153 133 -145 12 -105 34 31
6171 31 198 -170 -241 -108 91 38 41 28 72 125 -49 -57 -239 130 -228 150 -36 93 65 28 -113 -71 -42 -5 -16
6196 -16 -1 267 -75 -42 -79 24 -32 -48 32 179 111 173 105 160 79 -32 31 -7 0 -71 -4 46 195 -148 74 160 38
6223 38 -21 57 -26 -58 -60 -19 -82 228 100 41 -234 -130 -106 93 276 109 31 -32 -81 -18 99 109 -110 120 113 111 42
6250 42 -87 -22 -317 -195 -21 -141 -18 30 117 -59 34 180 -94 -92 -15 85 167 34 37 -36 25 -37 91 -119 2
6275BjJ56k93R1r2K71j78j19J98r2Q0k8N1m5M08m57l41L35J8K51k31j30J68M4
6299F6j3k3k06J59q6M0J23k08M3K60j61j57J05L22k12j73K95l05K77k33K2LK07
6322A45k28PN6O1l33K75J41j89k07L87o2n0k44J74L13j51j92K11k24J45j96J40
6344b1k50L00J14j23l6J5j4j7J98k42l7j05R4J79m3o7Q1R6o9p3NN6j78K08o8l8
6370c5J18r1k01K20j83k9P8mR5J11O4p7l8k88P5Q3J28J4m7m7Q3j65J72P7j73j36
6396a96K45k7L1j08J29k29j54M08q2J92k65K65p2Qj69j34J35J7j49P1j4n2J4L34
6420A98p9j12n1q3Q7J35R0l17k03M17j51n2J33j11J79k2O0j56L7j14J34M0L1j39
6444d9l5K8J26j2r6L2p9J14pJ57k35rK46l12J42j36K45M2l25J41M4k14OJ40J27
$$ plain form
6275 2 1 157 -136 -45 -137 134 -44 -163 35 -57 23 -5 46 1 409 -48 -389 -54 -36 215 -16 -146 22 66
6299 66 53 30 -176 -17 -103 -63 60 -148 -105 155 -6 -163 -58 264 52 -121 174 -131 146 -87 -65 -62 145
6322 145 -83 -76 -20 41 -292 -17 124 -65 -272 115 53 3 -241 -67 246 95 -97 114 -110 35 -161 -21
6344 -21 -271 29 143 20 -16 -1 -15 -32 166 -76 -113 -218 -124 55 12 -55 26 122 53 -20 -15 41 -137 71 3 -35
6370 -35 83 -8 -209 11 -172 -201 -123 -127 -32 79 143 66 28 -260 -185 -102 26 40 -7 -54 29 -136 36 113 -60 -196
6396 -196 49 22 53 -55 74 -155 -309 99 17 209 -56 209 137 145 -24 -158 -23 -6 -155 -84 -98 -150 -136 198
6420 198 119 7 -44 -127 -40 95 185 -132 -335 82 -69 -121 12 -99 80 58 118 -38 -1 -115 19 59 90 -49
6444 -49 -84 -56 70 58 -38 -6 -85 29 22 179 -56 -65 181 -131 11 -125 120 162 -163 -22 22 -192 -186 -46 81
6469H1l53K04p7J89j6J8N9j28O5O4k93O7MJK1J87N4j78R5K1kj5r9q3K21N9k52
6496h6O9j3p3L99k10j28j82J88O2j30m5N9k2J31j45J2K74j44J23j13P4j80J80
6519A00J6j20J65m4j67%Q2J4J53P0m40R1k2R4l3j6O6J31n0j16k1J61p2j68L56
6544B30j06j53l4Q3J28k74J27K26k87J87l22Q1j9K19j12j09J39J92o8l8K1j29
6566a8j2M9k3j49J69P1o7p9oJ44k32J2K82l6j3M1j77K3j25M19k65q6O6J67k75
6591a20O5K15j53j45n2K19m6K35k21k65J38J52j1o8r0J13P1j37J18l1N8k81n2
6614b88M18j27O3k0j65q9K76qJ05k77p0J61j72M13r7k32J45o7o3k4J98j21J65
6637A24K9j11l9O7j76K51q5j80L24k26J18k74K02k3o6K04m69L96j60K37j45p4
$$ plain form
6469 81 -272 -68 -145 44 28 46 105 -23 42 106 -187 -120 -116 -115 -94 93 147 -31 64 85 83 68 -31 -114 107 166 -86
6496 -86 -17 -30 -103 296 86 -42 -224 -36 26 -104 -149 -90 -112 19 -126 -114 160 16 139 26 100 -80 100
6519 100 116 -4 161 117 -50 -50 32 46 199 269 -171 -80 -102 -8 -41 -57 9 140 90 -26 -47 114 42 -126 230
6544 230 124 -29 -63 20 148 -126 1 227 -60 127 -195 -114 -133 86 -26 -135 4 196 128 90 111 -18
6566 -18 -30 19 -4 -153 16 87 20 -59 -65 79 -153 -141 141 105 92 133 -44 -21 -146 273 8 -78 -12 155 -120
6591 -120 -55 160 7 -138 -190 29 -17 218 -3 -268 -130 22 11 -57 -147 -34 37 -100 18 -13 45 -236 -288
6614 -288 130 3 66 46 -119 -208 68 60 165 -112 -182 -21 -193 220 123 -109 36 -31 -94 -118 80 -41 124
6637 124 153 42 3 70 -106 145 60 -120 204 -22 96 -178 24 1 -65 139 -330 66 -94 143 -2 -76
6659g6M1N3m4P2j10K60k39j33K24P9Ol07K97m4K0Nj45J71J9k56m6O4p6J4M14j41
6685A22k86K3L62q6o5j28MJ08o4j94M26l35L9K40nM3j43k4Lk5j01J84j70J9O3
6710A0l75K56K21p5j33J28k85K80j4k9j49L00j03j07J04J31q0Nj58l1k4J90m7
6733A5%k11K82M9o3j6M7n7j94o4R2p6J12J52q8m5L6j8j93K65j28K33M3k14j98
6758b39J33j1Q4q4K65j2j84M2N6o8n8M2R3n1R0j12j8J72j43J8n7J45k12m4J16
6783c7J1R3M8l42J55m8pJ24l9j51K39J2J12m46J91j07L16M2j77J0j57l1J09K58
6807A78l26J75kk75J33K23n0j75O1J97j01l6J78j04l1j34j9O0J41l0m5J23k17
6830g6J52O2l26M2K08p9j30R7Q8m6J80l16K96l19L36K4k67K48j3j16j0J73l27
$$ plain form
6659 -76 -35 18 -26 46 -64 196 -43 -176 48 127 133 -174 123 79 99 104 -41 130 149 -107 -153 -89 -165 -151 263 122
6685 122 -164 -141 221 135 70 -58 -54 54 -10 -204 222 -113 -74 166 161 204 61 37 40 15 -86 98 -72 -53 10
6710 10 -365 -109 112 37 -96 32 -253 27 13 -16 -165 135 32 -75 29 160 80 85 -73 -104 -128 62 15
6733 15 15 -196 86 135 72 56 103 46 -148 -212 -120 -196 -84 68 -20 -65 -29 -47 -240 25 -103 130 173 -41 -239
6758 -239 -106 -117 -33 -117 148 136 -48 -6 50 -18 -76 -34 59 8 98 -14 -32 140 -3 15 -42 103 -109 -153 -37
6783 -37 -26 67 115 -227 -72 -120 -127 -3 -42 -193 46 58 170 -276 -85 -192 124 166 -11 -1 -158 -189 -80 178
6807 178 -148 27 25 -250 -117 106 56 -119 -58 139 38 2 180 76 45 -89 -108 -48 93 63 18 141 -76
6830 -76 76 138 -188 -146 62 -17 -147 -50 38 -8 172 -144 152 -167 169 193 -74 174 161 45 35 208 -119
6853a19pJ95P0j67k7O5J63j94l1M8o0n0L40k31o0N7J10K1j44Pq5J99p4m1lk3j28
6880a69L4J30q6K10Nj48o5j20K30Q1J9k48K49j36n0J70j72K24j04j23O5j1q5N6
6904d4J8J7M6o6J69j22j63o2Q7J03J25j41o0M6rn1k2K59k78J21J11o9k2j0k53
6929b70L57k20J71Nm3J49j84K4K6J94r9k44J10QK6j20K69J84m55J39j26J27J9
6952D7nq7J12j71j42J97r0J64j25PJ08j62J79J27k74J7m2Q5O1O3l2P9K9j59j4
6977b8j76K65J03m0r7j90J34J23k59J67Q6k33K08P1q2m7r3L9M1O1L3j44J71R4
7001B07m03K9J00N5L7k9K00j08J02jnj59j70M9J32M1K5k67J30r2J46j04J35L7
7025H7q9m8J23qj02O2p6p3J46L5m4j36O7m8J92j14n0M0Nj35K85k12l5J47O7P2
$$ plain form
6853 -119 -126 69 139 -28 -55 10 173 -21 -52 -4 -64 -114 226 -5 -65 -8 102 123 -21 -14 -99 100 26 -15 -18 -41 -169
6880 -169 -135 -5 -91 119 124 -24 -89 -209 21 102 121 -127 122 -14 -64 106 -66 158 54 -69 -4 -15 -100 -44
6904 -44 -26 -9 37 -29 140 18 -145 -207 -120 -17 108 -33 -93 -47 -56 -107 -129 130 -148 -27 84 15 -7 -17 -270
6929 -270 87 -133 38 43 0 149 -35 -11 15 209 110 -134 -24 -16 10 -110 159 343 -112 27 -99 28 47
6952 47 42 -45 67 -104 -246 -49 -139 25 -100 -93 15 -147 32 159 -115 -98 -140 -55 6 69 37 116 145 -14 -28
6977 -28 -204 61 164 124 27 -163 -29 94 -165 2 88 -145 63 134 52 5 -88 -49 -8 53 86 -58 113 207
7001 207 -196 -167 -67 -12 25 -4 196 88 190 189 184 25 -145 -96 36 77 102 -165 -35 -127 19 -85 50 87
7025 87 -2 -50 73 65 -37 25 -51 -124 22 57 13 -123 -56 -104 88 -26 -76 -36 -31 -166 119 -93 -128 19 86 158
7051A58l9n7j26M3J11Q5m1r6P3J00j67o7p8Q5p2O6J02j63J50r4J00J3k63K41k47
7076a83K50J2m3j9p6K67l40J37j71J67oN2k06J38O4K6o6j82K43j0J7j15J0m8J48
7101F6o2n1J8J04r1NQ3n8j73J37L6j0j3J34j29n0K9O3k36J16K15j8r7Q5m19M17
7127A01j86R9O4j64J15j82R1J46j02j77O4K60l18J67M9j30KL31j62j42P0K15j93
7150A8K6j5K1j05K93l29J18J92l18J16j09J24p5n5R1k0j45L18k44m3J8K06r6j4
7174b7J41k51L6J36n6K5M1l7j30K38j74P5n2j07J10KNp9l8l7K65M3j78Q6O0m9
7200D8j09R6m1J49l8j05k8j10K42j91K09k11Q2j0J58j7k13O1N0o2q4K74J7k39
7224g2J07j32mK4l1J11J1Jl2p1j71L75N0j95N3K08q8j75J17k5R9k43R6l2j35K12
$$ plain form
7051 158 119 62 -64 -21 90 175 134 38 111 211 44 -23 -101 -16 -88 -22 80 -83 67 -27 73 86 -177 64 -183
7076 -183 67 79 36 17 -59 208 -132 5 -166 1 -5 47 -159 -21 43 69 3 -179 64 54 71 -44 -34 -82 66
7101 66 4 -47 -29 75 -16 -11 72 14 -159 -22 14 4 -9 125 -4 -54 -25 38 -198 -82 133 115 18 103 -316 101
7127 101 -85 14 78 -86 29 -153 -62 84 -18 -195 -131 129 -189 -22 27 -103 -101 230 68 -74 -4 211 18
7150 18 44 29 50 -55 238 -91 27 219 -99 17 -92 32 -43 -98 -7 -27 -172 146 -98 -141 -123 83 -13 -27
7174 -27 114 -137 -101 35 -21 4 45 8 -122 116 -58 17 -35 -142 -32 -30 -25 -104 -142 -179 86 129 -49 37 97 48
7200 48 -61 35 -6 143 105 0 -28 -138 104 -87 122 -89 -7 -17 141 124 -89 -28 22 -40 -124 150 167 -72
7224 -72 35 -97 -101 -77 -108 3 14 15 -17 -88 -259 116 166 -29 24 232 144 -31 86 61 160 -83 13 -19 -154 58
7250E8j8j72K7K33n2k4PM4K4j23j32QJ39j5N9l4j55J05NQ4J36q8n7O1k22K75l6
7277A37j19q7N9J10r3l3j2P4O7m20L86j05K6k6J20j12mK6M4K15k4k74r4K95k6
7302A30j66L4j30J48o8R1M5j11j41m1K80k03P7K15l9l9k53L55j55k0l1J8o1J23
7326E8k82K85o9l5j44L06j03k2j53J90K7o4m6M8o6K9R5m50N69j29q2R3m5O5jj35
7352f1K71j46j7k07P4P6nj18R7J87k74L82j88p0J5q9n0r6L69Q3l23J4k5k3o2M06
7378B20l52J00M1M3m1j08J61M4m6k03o8K19Kj34J73K2J79k85L7l1l6K00k34P8
7402a9L2J12k62K05k25J01O0N1n7k2J67p4j72J51L4j49K18q0j04j67K10N2n0K20
7426B32l81J67oJ7P9j02k55K14K73l94K06l8lP3K4k69J51J21j87J59j55O6j71
$$ plain form
7250 58 40 -132 -105 128 76 52 59 103 127 4 -128 -120 19 4 63 29 -126 -21 -16 68 204 116 59 120 -102 173 137
7277 137 18 -69 -10 100 7 -26 -38 36 103 -317 69 -36 -10 -36 84 -28 -32 -6 38 253 229 -45 -139 156 130
7302 130 -36 -2 -132 16 -52 39 84 -27 -168 -209 71 -132 -55 160 121 82 -171 184 29 9 -22 -4 -65 58
7326 58 -224 61 -8 -43 -187 119 16 -6 -159 31 58 -6 -52 -4 -70 -41 54 -396 173 44 -38 55 10 75 74 -61
7352 -61 210 64 47 -160 -86 -10 -15 -133 -36 151 -123 259 71 1 16 -73 -123 -219 150 233 -90 -76 -101 -124 -186 220
7378 220 -132 -32 9 52 11 -97 64 108 62 -141 -209 10 12 -122 51 73 252 -33 4 -27 -63 137 -97 -19
7402 -19 13 125 -137 68 -157 -56 4 55 -2 -24 143 69 -103 48 82 -67 151 71 -33 -200 10 62 12 232
7426 232 -149 18 12 29 108 6 -249 -35 238 -156 50 12 9 82 106 -163 -12 109 -78 81 -74 -8 -179
7449a79J29J30O4r7K2m0j67j8J66PJ68k82k72L40J47k61K70j35k88K20J3mJ45
7472G8j21J4R6O2j86Q2j30m7K09n4k9o4L01k06K72k23j59Q6K0j01J93L2j77j13
7496a65L44j59J54j98K60l15k3K63k15J9J67j80jO1j06k5Q5J12k23L08j74N3M9
7519I1o9j66P4QQ2n8N9P1j30p0J97n3k8k11J58j2J13J95k97r7J17o5l2l9J99O6
7545A03k81QL1K11r5r2K05J08j56j21n1L44l04J97R2j38J03k06k3K12k89J20J63
7568A41pM6J25j80p3k13J28n5P8m1pj65N6J39K5p9K94k09K11o7J9k00N4J21o3
7593G8J22j45J6j20J57JK10l71m5L28j83k35J51l1j95J87J66p6K9J40N2k47j08
7616a19j11K75r1m9K12j33R9K2j0q8j4l4J22k32J08K13l36L5L8J10N8j50J61j69
$$ plain form
7449 -179 -50 80 144 47 69 29 -138 -156 10 17 185 -97 -369 -29 118 -143 127 -8 -296 -76 -63 -67 78
7472 78 -43 -29 67 129 -57 25 -105 -152 57 3 -26 -90 211 5 277 54 -105 -19 1 -100 93 125 -52 -165
7496 -165 179 20 174 -24 236 -79 -102 161 -54 -35 132 -48 -49 12 -94 -119 -34 78 -145 163 -11 42 91
7519 91 22 -144 -70 -62 20 -38 21 92 -38 -108 89 36 8 -203 -45 -57 56 251 -46 -143 -26 -91 -123 -162 37 103
7545 103 -178 -170 -139 72 -23 -115 90 198 42 -79 -130 214 -90 107 199 61 164 -42 -65 147 -142 -22 141
7568 141 134 180 305 125 52 -161 -33 -88 -10 -51 -58 -223 -167 -28 -3 -82 212 3 214 147 166 -34 20 141 78
7593 78 200 55 71 -49 108 109 319 -52 -97 231 48 -187 -36 -67 -262 -75 91 15 44 184 236 -11 -119
7616 -119 -230 45 -46 -95 117 -16 83 105 95 7 -7 -41 81 -151 -43 170 -166 -131 -93 17 75 -75 86 -83
7640h3L42k48Q6k25K76j01K9n8l5J54j01P6k85Q2J80j1KM3k73K87j37OJ02Lq2
7665B9j89j16L1L46m59L75J02j65O5J9P7l15K65O4j22p3R5j19l1J54q7J36K2n5
7689D9n1l5J39q3j71m3O8P5J60p9J70j27j82K82k80LJ36k24L77k75Q5P2O6k65
7713a33K1J47l8J49j67j18J59k6J3k12J94k41J56P8J95M0k50J49j97l2J2Q4J41
7736A24P8l30J5O6lK07P0j06J28k03J51l24J77o8j88L87O8j54r0j08J73r5L1l0
7760b4J19k43K20M8l3j31J1K33j87l0O7q9J97j71K8Oj19K31j52J93k28J80o9q6
7784b9K45l51J13M9k1q9K51K4j58%R3j87J6J19j14j6M0P0J2J28K7k81K4J98j48
7809A5M0k70K11j19J55j45K58l9k59K27J5j39J23j54j43K92R1j39K35k0k29J01
$$ plain form
7640 -83 259 11 97 -128 148 47 76 18 -17 137 36 112 -173 -91 89 78 80 123 -150 137 0 6 108 111 29
7665 29 -160 -276 -245 101 -358 17 119 -46 19 38 115 -200 65 129 7 -66 29 -90 -121 33 -54 82 104 49
7689 49 -2 -37 102 19 -152 -195 -127 -52 108 29 199 72 -110 172 -108 -105 31 -193 184 -91 -6 66 132 -133
7713 -133 -112 35 -3 146 -21 -139 20 -6 7 -205 -11 -252 -96 -18 177 217 -33 116 -81 -113 -101 -17 124
7736 124 202 -128 -113 -47 -50 157 227 121 249 46 197 -127 50 -18 -206 181 249 95 5 -103 70 -25 6 -24
7760 -24 95 -148 72 120 87 -44 -33 200 13 -17 50 -39 158 -13 15 21 -98 133 -19 174 -54 126 57 -29
7784 -29 216 -135 -22 27 6 -83 168 192 34 34 127 -60 -44 75 -39 -55 -15 55 67 195 222 -59 -35 163 15
7809 15 55 -215 -4 -123 32 -113 145 106 -153 74 89 -50 73 -81 -224 68 159 20 255 235 6 107
7831A07r3j15L6J51Q1L5k49L5n7J23n2L0J01n0R0j88J53l4k28J04J48l31R1J20
7855Hj76J52l7j46J51j05K61l16M98l24N5j2K45l03J19p8o9M0J2K97j97j62k7
7878a14o8J53L5J38j38m1J15P1r4p8Rp9J43l1l5J73k52j72N55k35j0j12J44N8
7902A35q3j57K2K30o6j63K23j76j38%J11M2O3k4q6K16k01K15J8o9Kj16L0j8k54
7927b44J00J03q7J22r8J31j1k6J45PN5j32q6J44j76J33j02qp1P5L03m00M4l4J07
7952fo4K2l3J15J7K18k60j11L7n2L05j58j4J82m0l20J84j93J12J18l58M17m9l7
7976C2J03j37j27k8R9M32m15n1J38n2R4J5j88L3L7N8m3Jk1J75j40K3k38K62k33
8001a71N6J63o3Qj23M7J65j84Q7R4j48L51k36M0j27O1o2p5K41K9r7o4j47J58j30
$$ plain form
7831 107 14 -101 -65 86 167 202 -47 -12 -69 54 2 32 133 83 173 -15 138 104 -124 -20 128 -203 -112 8
7855 8 -168 -16 -53 -199 -48 -153 108 -208 290 -34 21 9 254 -49 70 -8 -77 -37 -25 272 75 -87 -114
7878 -114 -182 -29 6 144 6 -35 80 151 57 -21 -12 -91 52 21 -14 159 -93 -265 290 55 45 -67 77 135
7902 135 52 -105 -83 147 81 -82 141 -35 -173 -173 -62 -20 43 19 -67 149 -52 163 181 112 114 -2 28 10 -244
7927 -244 -144 -41 -128 -6 -104 27 16 -10 135 142 197 65 -21 123 -53 80 -22 -30 -101 -26 277 -123 -79 -113 -6
7952 -6 -70 -48 -81 34 51 269 9 -102 -65 -117 188 30 16 198 158 -162 22 -171 -59 59 -299 118 69 32
7976 32 135 -2 -129 -157 -58 374 -41 -92 46 -6 88 103 -85 -52 -15 43 0 1 -20 155 15 38 -200 62 -171
8001 -171 -115 48 -15 -7 -130 -83 82 -102 -15 79 -69 282 46 86 -41 20 -42 -117 124 153 56 -8 -155 3 -127
8026a27K30j07j95L42j23q7J5o1K7o0K06J0RO6j59P5l8R2n4k40K61j54J23n9J51
8051A43q1J52l99L39j91j69L19j65J65j50r2K78k84L56j07k16P0M2k40M45r1j84
8073f0P9J5k78K97j31J58J23j72P9k72L04l8Q4k54R1J69j37l5q8N4m4j15J99q4
8097e6J77j28J04m4J12J05j82m0p1O9j87J68j93J16n6R3j6r6K71j4k09J71j65
8120g1j19J48Ojm3J73k08R3J02j04j7R6j9r7j10J01J39J21k70Q3J22j24l5q0Q6
8145b8N1j80J52j19J52q2m4R4j0l1j69K41j44J57k99K67J8k24K47p6P9j32L10
8168B30l43K79p5k5l4j20o9J04J73o6J05k02J68k30K03j42J35k26N2J29L4j68
8190h8l1
$$ plain form
8026 -127 103 -4 -199 143 20 -67 -52 -113 -86 -146 60 70 79 145 -14 61 23 115 61 -179 82 -72 51 -8 143
8051 143 62 214 -185 154 -37 -206 113 -52 113 -37 -129 149 -135 221 114 -102 -32 10 -230 215 124 -60
8073 -60 19 34 -244 53 -78 80 203 31 110 -162 142 104 188 -66 25 194 57 22 -66 -12 -56 -171 28 -56
8097 -56 121 -7 97 53 165 270 88 48 -23 46 -141 27 -166 -50 -106 -13 -29 -125 146 132 -77 94 -71
8120 -71 -190 -42 -36 -37 -80 93 -115 -22 80 -24 -41 55 36 -61 -171 -70 69 190 -80 3 125 1 -34 -114 -28
8145 -28 23 -157 -5 -124 28 -54 -98 -4 -14 -45 -214 27 -117 40 -259 8 26 -198 49 -27 52 -80 230
8168 230 -113 166 91 66 32 -88 -157 -53 120 54 159 -43 125 -105 98 -44 91 -135 -83 46 80 -88
8190 -88 -119
8191a19
$$ Imaginary data points
##PAGE= N=2
##DATA TABLE= (X++(I..I)), XYDATA
0@%%%%%%%%%%Qj6J6j6J6k4L2m0M8n6P2q8J04j20J44j68J92k24K62l02L44l92M48
33B40n12N76o48P31q21R19j026J144j272J411j563J730j911K108k327K566k828
50a483L115l430L782m172M607n097N651o285P016p874Q898j0140J1687j3676J6342
65H941k0121K5931l6103N9033k06193K6071L02156k53021r0141K11768R5745j72621
77d8555K8361J54315k4727j35466O2752P7277q1023r1983O0941N0685o9858p7412
89i4693O1624N0736n9583l0143N6487n738l7753M2540P7132j7636o4500K7183
101E656Q5809k3874q0264K4886O2959n6854q9142L5063N3691p0000l7938Q5116
113d892J3718p4921L5969R3345k0409n9810L0444M6822k5574k7495J9426o985
$$ plain form
0 0 0 0 0 0 0 0 0 0 0 0 8 -8 8 -8 8 -16 16 -24 24 -32 40 -48 56 -64 80 -88 104 -120 142 -160 184 -208 240
33 240 -272 304 -344 387 -434 485 -541 603 -669 742 -821 909 -1002 1106 -1221 1345 -1483
50 -1483 1632 -1798 1984 -2188 2419 -2678 2973 -3312 3704 -4170 4728 -5412 6275 -7401 8941
65 8941 -11180 14751 -21352 37681 -168512 -142441 159715 -93306 -183447 28321 124066 -48555
77 -48555 -20194 134121 109394 -26072 36680 113957 32934 -59049 1892 52577 -17281 -94693
89 -94693 -33069 17667 -41916 -72059 -15572 -21310 -59063 -16523 60609 42973 -21527 5656
101 5656 91465 67591 -12673 12213 75172 18318 -70824 -35761 17930 -52070 -90008 -4892
113 -4892 8826 -66095 -30126 63219 42810 -17000 13444 60266 34692 7197 26623 19638
125A9638m1618k676K5637k109k8058k579L3556J768l7520J2326M7551p010l2251
138a3345J4389L1961j2326k6175K1806K2131l9173k8418L3648J5835m3111k3024
150d5802L3935J0970l5500J2369M6992j6500k2970M1859J8196l6219K47L5507
162D3084j2188m2012L616J9958k2964j7255J8073k484j8217Q978J8157L424q135
175g965j344J7120J0067r333k142Q104L681o525j0281N234N212j6293o569J0487
189e47o298j3885N200J4465l023j3075J2348J8486j2579j647K1597q429j8000
202e387J4305R154k0812j1456J4694M289j9742M4J7859m978o748J1669J204m248
216a53N069K137k330j671j529J76j757K76J47p044J391P100o204l192P831q35
$$ plain form
125 19638 -21980 -24656 981 -1128 -29186 -31765 1791 3559 -33961 -21635 25916 18906 -13345
138 -13345 1044 33005 20679 -5496 16310 38441 -732 -29150 4498 20333 -22778 -45802
150 -45802 -11867 -897 -36397 -24028 22964 6464 -16506 25353 43549 7330 7577 43084
162 43084 30896 -11116 -7500 12458 -10506 -27761 -9688 -12172 -30389 -21411 -3254 170 -7965
175 -7965 -9309 7811 17878 8545 6403 14507 18188 11663 1382 6616 11828 -4465 -11034 -547
189 -547 -6845 -20730 -15530 -1065 -4088 -17163 -4815 13671 1092 -555 21042 12613 -5387
202 -5387 8918 18072 -2740 -14196 498 4787 -14955 -14911 2948 -2030 -8778 2891 4095 -153
216 -153 4916 7053 4723 3052 1523 1699 -58 218 365 -6679 -5288 1812 -4392 -7584 247 -588
232e88l346L989M784j617k583P127L845j1268J312J0540j1219r719R356j080j2620
247a3087O38R847j438q366O929J2148n153r90R253j589k172M193l936m755J201
262B723q30m350l630J778J697n327J996M397l887J752N691l073l94N838l32k871
278A178J781N444k900p160N005M675j1066k068P671m947o433M660K866l842o33
293e769O872J788n187M716N619o996K02O098n461m244L519K89m709j642M490N85
309A70n134K961M567m219J764L584m533M33M461l050l584K226L510l245m856O246
325A301K954p775J404O023m373k015M009q60k308J329K441k289k794N300P94o621
341c480K951M774n644k048M762j117k690J119K619q67k297L825J310m536K884
$$ plain form
232 -588 -3934 55 4839 3222 639 7766 11611 343 1655 12195 976 -8743 613 -467 -13087
247 -13087 -12449 -2602 -4040 -12406 -5477 6671 1518 528 9781 8192 6020 10213 6277 1522 2723
262 2723 1893 -2457 -6087 -4309 -2612 -7939 -5943 -1546 -5433 -3681 2010 -1063 -1457 4381 4049 1178
278 1178 2959 8403 5503 -1657 3348 8023 -3043 -5111 2560 -2387 -8820 -4160 -1294 -5136 -5769
293 -5769 1103 2891 -2296 2420 8039 1043 1245 7343 1882 -2362 1157 1446 -3263 -4905 -415 170
309 170 -4964 -2003 2564 -1655 109 3693 -840 -407 4054 1004 -2580 -354 3156 -89 -4945 1301
325 1301 4255 -3520 -2116 3907 -466 -2481 1528 668 -1640 -311 2130 -159 -2953 2347 3141 -3480
341 -3480 -529 4245 -1399 -3447 1315 198 -2492 -1373 1246 379 -1918 1907 3217 -1319 1565
356A565K743n782L70L955m236k718K997J674l214j770N573J151n553L652M188
371D595m701P76L194l151j385K481l49l231n30M157j081n518M172L523n644l4
387b726L788j460j038J305M98l42J12K403j147k687M603N36n891J611L603m360
403a192j529K185L88k087j01L067n45k380L907L37m363K990J692m079O52K771
419A713j322j904J235L521k304k846M368P36m625J396J460l111n5R48r02o91J240
436a143J497j481n24M506q34m063L792K056m280J9K183p91j010m5J345j579o81
453a033K871k613l080M272J83m956J950K561j046l39J878J789j113n4K733j456
469B547k548K638j276l882J665N93l051K61K109O96k077P20M056j261k441L342
$$ plain form
356 1565 4308 -1474 -1104 2851 -1385 -4103 -1106 568 -2646 -4416 1157 2308 -3245 407 4595
371 4595 -106 670 3864 713 -672 1809 1460 -1771 -2301 1856 775 -4743 -571 2952 -2692 -2726
387 -2726 1062 -398 -1436 -131 367 25 137 2540 1393 -1294 3309 3845 -2046 -435 3168 -1192
403 -1192 -2721 -536 -148 -2235 -2336 731 186 -2194 1713 2050 -2313 677 2369 -1710 -1058 1713
419 1713 391 -1513 -278 3243 939 -1907 2461 3197 -1428 -32 1428 -1683 -1738 -790 -1692 -2383 -1143
436 -1143 354 -1127 -1651 2855 2021 -2042 1750 3806 -474 -455 1728 937 -73 -118 1227 -352 -1033
453 -1033 1838 -775 -3855 417 600 -4356 -2406 155 -891 -1230 648 2437 1324 1270 4003 2547
469 2547 -1 2637 1361 -2521 -856 -263 -3314 -3053 -944 -248 -2325 -1605 2451 1190 -1251 2091
485B091M42l437J637J341k208k23J315l21j689L53K405k886j796M335j291m245
501d177L077K622k678j54K306J454j498K10J837k139j167K639k151l721K735O23
517a82k959J2K453P32j111N20L044j163j331L151q98k608J344L57k165J98Q61
534B55r68j248Q87K113k414j364L610p93k287K733M21k156J624J483m07j115R29
551A303R73j702m81J704k735j799L320j078k810J444J909k81r99Q20J742q91P
568D46J422j561q18K537j442k109J648O92j020k77P89J025k258l18K747j641j810
585a948J936k84j124J468k7j076N56J794J47k245Q03K358k235j044K458j030j502
602i95J710J78j426j94Q74L36j289j39P13j465M12J889j666n65K480K82q96L12
$$ plain form
485 2091 2533 -904 733 2074 -134 -357 958 637 -1052 -699 1706 -1180 -2976 1359 68 -4177
501 -4177 -1100 1522 -1156 -1310 996 2450 952 1162 2999 860 -307 2332 181 -3540 -805 -182
517 -182 -3141 -3129 -676 56 -1055 -535 2509 1346 15 3166 2268 -340 1004 1361 -804 -606 255
534 255 -713 -1961 -1074 1039 -1375 -2739 871 78 -2209 524 945 -1211 413 1896 1489 374 1303
551 1303 2276 574 93 1797 -938 -2737 583 -495 -3305 -1861 48 -233 -1232 -412 1330 439 446
568 446 1868 307 -511 2026 584 -1525 123 815 -205 -482 307 1332 -926 -1244 1503 -138 -1948
585 -1948 -12 -296 -1420 48 21 -1055 -499 1295 1442 -803 0 2358 123 -921 1537 507 -995
602 -995 715 893 -533 -727 147 483 -806 -945 -232 -1697 -1285 604 -1062 -1627 853 1135 239 551
620E51J004M29j021k46P43j624o36J159j405q44J263l89n90R01O96l62q66J392
638A55J959k446j12K106n08r23J113p08q13J390o42j365n48R36J39k042O50J955
656B96k009O74K168r37j14J116M37k93m08J09m9j211L16J82k075M04J424j007
674i77o76J622J83l75o2Q55M36j658Q03J698j863k33J560j231k48J169o52j078
692g27J82J027j038j286J263J184k053M60J762p39K62J286q19j24K59J79p21q11
710d54N43j4j617M90J158j066R1J139P6k69J92L91N5r03O93R1j396N34J165j639
730g40q7J544m40n36L62N21p28p51J036L37j594P08J066j010K42R26j038K53P17
749G88n57l24o44J114k15j552J164J007j459O56Q47m76L8O2j89j02m69L06k45
$$ plain form
620 551 1555 1984 963 717 1460 -164 -800 359 -1046 -1890 -627 -1016 -1606 -705 -9 -371 -1237 155
638 155 2114 -332 -444 1662 1154 231 1344 636 -177 1213 571 -794 -1342 -406 -267 -2309 -1659 296
656 296 -1713 -1039 1129 192 78 1194 1631 1338 930 1039 990 -221 95 277 -1798 -1394 30 -977
674 -977 -1653 -31 152 -223 -285 570 1006 -652 151 1849 -14 -247 1313 82 -166 1003 351 -727
692 -727 -545 482 -556 -1842 -579 605 -1448 -988 774 35 297 1583 764 640 899 1078 357 -454
710 -454 89 75 -1542 -1052 106 -960 -869 270 346 77 269 660 715 -188 505 596 -800 -266 899 -740
730 -740 -827 717 277 -259 103 624 -104 -855 181 518 -1076 -368 698 -312 -70 856 -182 71 788
749 788 231 -93 -737 377 162 -1390 -226 781 -678 -22 825 349 387 449 260 158 -311 -5 -250
768b50j110J042L84j119P26R88m93j95O39L53l37n43P70l00j091J019m4j679J013
787b27M58j343M18O15m5m44K92N20j78p36J474J10j023Q66K34o35K39n9o54j22
807b40j66J50n69n37J077Rj144J433N57o62L70J74K93J4j45p7q3o22P55l91j194
828i98J104J43j200L82N55m76K0J71N60o7k56O45j81m46R66o6j078Q28nq66L7
849b28r5K58o33j72J006n50n97J247M1m90Q76Qo26K58J33n7k25l91O52n13n98
870f96J098m1j165Q70O1m84K85K2R4j16l97P56k32l53R27m82m44O17M71j050K17
891d2N6Kl59J72L03m11j76R68k37m91N43l0m99K53J04l62k29L82K91l89l29J174
913F94j32q24J057m06l89N8O5j83j54p0K04m52j73J055m81m88J215l01p32P67
$$ plain form
768 -250 -1360 -318 66 -1053 -327 661 168 -27 612 965 628 85 855 555 -536 483 439 -1240 -227
787 -227 231 -1112 -694 -79 -124 -568 -276 244 66 -670 804 914 -109 757 991 356 595 536 -118 -240
807 -240 -406 -256 -825 -1362 -285 -276 -1420 13 570 -92 278 452 745 759 614 537 454 -168 587 196 -998
828 -998 106 249 -951 -569 -14 -490 -470 -299 261 194 -62 583 402 -44 922 856 -222 606 601 -265 -228
849 -228 -323 -65 -698 -870 136 -414 -1011 236 277 -213 663 671 45 303 436 379 154 -237 415 -98 -696
870 -696 402 361 -804 66 127 -357 -72 -50 44 -72 -469 287 55 -298 629 147 -297 320 791 -259 -42
891 -42 14 16 -343 -171 132 -279 -455 513 276 -215 328 298 -201 52 156 -206 -435 -53 238 -151 -480 694
913 694 562 -262 795 389 0 58 123 -60 -214 -284 -80 -532 -705 350 -131 -619 596 295 -437 330
933C30k28J07j98R3J61l50K56K93m81j44P80q07m36N71n0m37j71N17K86n39L33
954a14P47l34L3N06l89K1%j08n22k40K04J23n88lQ33o30J14Q86m41m11P21p4l81
977d7L14O5K73q62M62K49p19J9O47o57k80M96l61J8q2Q4O23n58L03P33m81J4N55
1000H08m24RK45o60M3j79J5l07j53O1O54l68m23Q85l10j15P28m85j31N68Ll80
1022H4k56N73O1n93ON39p13k74P55m20k32L07l1O5J43L2L65n27L52M95o43l0M88
1045E46n37kK26k18j67p7j6O00p48L07R9k69p8M23n62L47L20l05J03l6L63rl95
1068h5P2N46m16o6K15m33p5M14n61L5L75k46L79j26j7K33p69P23M2l34K6K33l97
1091b32L89J19l22J13p4K14o0m75L22q3m55K20K31k35Q6N19j76j64K07K4K92n03
$$ plain form
933 330 102 209 11 104 265 -85 171 464 -17 -161 619 -188 -624 -53 -103 -540 -711 -194 92 -447 -114
954 -114 633 299 332 838 449 470 470 362 -160 -400 -196 -73 -661 -664 169 -461 -347 539 98 -313 408 334 -47
977 -47 267 332 605 -257 205 454 -265 -246 401 -256 -536 -40 -401 -383 -465 -381 242 -316 -13 720 239 253 808
1000 808 384 393 638 -22 21 -158 -143 -450 -603 -542 112 -256 -679 206 -104 -219 509 24 -107 461 464 84
1022 84 -172 401 462 -131 -125 414 -299 -573 182 -238 -470 -163 -194 -129 14 46 411 -116 236 731 88 58 546
1045 546 9 7 233 15 -152 -229 -245 355 -393 -86 13 -256 -334 89 -473 -126 194 -111 -8 -44 319 310 -85
1068 -85 -13 533 117 51 266 -167 -242 172 -389 -354 21 -225 154 28 11 244 -525 198 240 -94 -68 165 -232
1091 -232 157 276 -46 67 -7 207 147 -328 -6 -89 -544 -324 -93 -328 -242 277 101 -63 144 168 460 -43
1113d3K03L22o53K68J2m47Q7J13n2k47J71K40N7k92L71r1l78L51K64m00L51J31
1135C38k52J38n9K29n0o78K92K16o39J0K18k64R7N06j39L4J96M1j41k42O13l8
1157D26n56K88k5n42K62K20k73K48l66L40j46q6L35k3m22N01p7k32J90J47k20
1178a1J68K8o6mk15L90k52n20M93n2l79M26k86O1K22L6Mj05P2L11l78j38K50m7
1202Hl82L84J93k16j14J70j76K84l27J64j33k0L70l00m18O82j37j38J53j13Q2
1223A6j61J63K81r2l10K13M9m01N29k28m52N18j72mL5k52L64Mk92L55j16k94K95
1246D8M8N4J87k69J19j0j5M7l63r8L43l82q3L90r9l21M76k58J51j85J50J87p9
1269C8P4Q2k25qL13l36k13L12j47J21j85j09K23j56p1L21J50m24L92o5j39M07
$$ plain form
1113 -43 160 482 -171 97 109 -338 -251 -138 -190 -437 -266 -26 31 -261 110 19 -359 -8 256 -144 207 338
1135 338 86 224 165 394 344 -334 -42 174 -465 -455 -237 -501 -404 102 -37 -3 193 234 93 -149 464 426
1157 426 -130 158 133 -409 -147 73 -200 48 -318 22 -124 -210 125 102 -320 181 104 -128 62 209 -11
1178 -11 157 185 119 115 -100 290 38 -482 11 -41 -420 6 -280 -219 3 39 43 -62 10 321 -57 -195 55 8
1202 8 -374 10 203 -13 -127 43 -133 151 -176 -12 -145 -165 205 -95 -513 169 32 -106 47 -66 16
1223 16 -145 18 299 207 -103 110 159 -242 287 59 -393 125 -47 -51 -16 -268 96 100 -192 163 47 -247 48
1246 48 96 150 337 68 187 177 162 209 -154 -252 91 -291 -374 16 -83 -404 72 -186 -35 -220 -70 117 38
1269 38 112 194 -31 -39 274 -62 -275 37 -110 11 -174 -283 -60 -216 -287 34 184 -240 152 87 -52 355
1291C55M1k44J62n2k3Pl78K70n15Q7M60j40l74K71j90L76J13k93K49j48k01J54
1313a3j9O6R1j80N7L05k03R6k44RN0r4J03L6l19M03j70M8j6K39j51K12j72J2N8
1338B04j56j24K43l35K13K33k36q0Q5k45N3L88k57q6k7O1L4k17K07K57l70O9L60
1361B74j27J70k58L2o3n1QL5j89L6K17p6o6P4J25j84J78j41N1j40K91l7j94p6
1385a11L20q2k44K81k46R2L29l55R1j6j02J01l67N6J97j0J06J03n9K6P6N7p3l97
1409b27L4L33q1k72K81p3J5L7q6J37j51k30M23k89L23j29r4K6K19l32L24k8k72
1432a12K69p8k44J08j27R8L7l92L04NL5o3K55j13Q7Q3k57L32K29l68p5K1J58k28
1456c6j14l0J44j17Kj10K49K58m89K91O4j9k09J20P4K9j71J93QLj21M1q1R0j48
$$ plain form
1291 355 396 152 314 262 239 246 -132 138 -377 -290 170 30 -344 -73 -263 113 226 -67 182 34 -167 -13
1313 -13 -32 34 125 -55 2 307 104 200 -44 -35 15 -79 24 60 -259 144 -26 22 6 245 94 306 134 146 204
1338 204 48 -76 167 -168 45 278 42 -38 47 -198 -145 243 -14 -100 -127 -66 -32 -249 -42 215 -155 -86 274
1361 274 147 317 59 91 28 -23 -15 20 -169 -133 84 8 -58 16 141 -43 135 -6 45 -95 196 159 -35 -111
1385 -111 209 127 -117 164 -82 10 339 -16 75 59 -43 58 -309 -253 -56 -66 40 143 84 110 186 243 170 -227
1409 -227 -193 140 59 -213 68 -5 10 47 -39 98 -53 -283 140 -149 174 45 -49 -23 196 -136 188 160 -112
1432 -112 157 79 -165 -57 -184 -86 -49 -441 -137 -132 -97 -160 95 -18 69 152 -105 227 456 88 13 34 192 -36
1456 -36 -150 -180 -36 -153 -151 -261 -12 246 -243 48 112 93 -116 4 78 107 -64 129 137 140 19 60 -21 69 -79
1481g9o8K71k68L5J41m5j15J80J16kl88M34r5q0l05O10k68KQ6l02R1l2J50j09
1505d0J66k93J23j71R6J96J15l14J48N9j29M53l31j31N9m1N3O8j45N6R9Q1n3k35
1529a11N5K92l23l3kq2J66o9Q7J29l9K3J08r8j60K39p8k13K96j55l6n6m3K4L3
1554d6q3R0j6J99N7Q9j28n0j08m1j8j0K18k27M2L00j61Qo2Q5l73K54j48J2k3J73
1580C3n5j12J69O3N2j06J44l25K89j3j93j1J0k1j25o2K05L3j12J27K21j43K09
1603B77k96J08j7j70K32j20o3K38k08PP6O6l20J49J14J9l47L20j77L22l4k51J88
1626A13j87K97oo4j30P3K11l82P8J28k52L26k48o0J58j99R5N1j48K88p8P4J53
1649B91l3k43O2r0M9j05K3J69j65P7J31j65k13K77j70j65L24L3J20k89P7J12j40
$$ plain form
1481 -79 -147 124 -144 -109 32 -13 -128 52 168 166 -222 212 117 37 -268 342 74 76 162 -140 -49 -81 69 -40
1505 -40 126 -167 -44 -215 -119 77 192 -122 26 85 -44 409 78 -53 6 -35 18 86 -59 -3 96 177 124 -111
1529 -111 -56 236 -87 -120 -122 -204 -38 -107 -20 109 70 93 201 103 -57 182 104 -109 187 32 -4 -60 -103 -79 -46
1554 -46 -129 -39 -55 144 201 290 162 112 4 -37 -55 -65 153 -74 -32 268 107 115 53 138 -235 19 -129 -117 -140 33
1580 33 -22 -134 35 98 150 44 188 -137 152 139 -54 -65 -55 -76 -201 -263 -58 -25 -137 -10 211 68 277
1603 277 -19 89 72 -98 134 14 -49 189 -19 -12 64 130 -190 -41 73 92 -255 65 -112 210 176 -75 113
1626 113 -74 223 217 153 23 96 307 -75 3 131 -121 205 -43 -103 55 -144 -49 2 -146 142 64 138 291
1649 291 258 15 77 -13 36 -69 -46 123 -42 35 166 1 -212 65 -105 -270 54 87 207 -82 -5 107 -33
1672c3j0l0O7q3J89o4n8L11m17J93k18J95M3q9R5J46k16j69P6k02K88l2j34J71
1696A9Q0k18K72j49R2l3l5j54K35k54l8J07J84j02k98L26Q2k73J51K70k09J65
1718B20j69k42J34N9Q7L5m6o2J20J20j88k36o8J43K34j73j31K25K0L2J07l1J01
1741B91k47J8J48l06L2K06j60q5J22P9j05o4J68j60j48O2K63k46Q4P5j3K72j50
1764A36l47L06J41k28J04l3P5j77N4k05M8j3K24j4Lk79K91j1p2K23k11Q0k0k13
1788a38R4R5O5k38Q3J09j24K9k9R6k79J43J49J65k54j53K19J86j22j04RK8J85
1811B14p4o7j22J30o2Q5l53J34L32l30Q9j22M4J85j47K3P2O2j02m8j0K3J55p4
1835C7N1K22l26q8J71k62K05j52J44p4k16M24j18k6J18j08J07o1P2M8n1l5M2q2
$$ plain form
1672 -33 -43 -73 -6 -89 100 36 -22 289 -128 65 -153 42 85 -4 91 237 21 -148 -72 -274 14 -18 -152 19
1696 19 99 -119 153 4 96 63 28 -126 109 -145 -183 -76 108 6 -292 34 116 -157 -6 264 55 220
1718 220 51 -191 -57 2 89 124 78 16 136 256 68 -168 -236 -93 141 -32 -163 62 82 114 221 190 291
1741 291 44 62 210 -96 -64 142 -18 -103 19 98 -7 -71 97 -63 -211 -149 114 -132 -48 27 14 286 136
1764 136 -211 95 236 8 112 79 154 -23 31 -174 -126 -139 85 71 74 -205 86 75 3 226 15 95 75 -138
1788 -138 -44 51 116 -122 -39 70 -54 -25 -54 42 -237 -94 55 220 -34 -187 32 218 96 -8 1 29 214
1811 214 140 73 -49 81 19 104 -249 -115 217 -113 -24 -146 -102 83 -64 -41 31 93 -9 -57 -67 -44 111 37
1835 37 88 310 -16 -104 67 -195 10 -142 2 -72 -288 136 18 -8 110 2 109 48 120 168 117 82 124 42
1859D2k44K60o4R5q9J83j87p4k4M1p5J22k53K67l40L29J63k44J16R8j10LJ69j21
1883F3k18n5O9K35j37r5L0j94L75k3J59j79L6R4m4k82L50k48K09o0k13P4r9N5
1907i8K02o8k8J35j39j73K39o8M3j14Q0J14j9J0l3J44j02m00M28j44n4O5k31N4
1931a57K48j92%J00J2l3M0J23k27L43ll86Q4J25k8n1J78l60J14P8K1Q2j30j18
1955a37J37j43P8P6Q2j29J23L3j51K32k22J27q6j6r6J36k7r2J3J2J32j43J89k2
1979A06j39q3L9K89j22j59k51N30k39k6N03m13n0L58n83L13L9j37q9jj75L38k82
2002b34K86J85k05J29l5J38j78r5j64J89n0j04J62J2k7j44O0j5N7l7K5mj7n5R1
2027c0j12K58n1N0K27k93k2J33l91J94j36K36j44J06j7M9j58N9mJ04j04J07m0
$$ plain form
1859 42 -202 58 -6 89 0 183 -4 -78 -102 -61 -136 -14 -267 0 -340 -11 152 -92 24 122 12 15 184 63
1883 63 -155 -210 -141 94 -43 -138 -108 -302 73 50 209 30 66 160 116 -166 184 -64 145 85 -128 -54 -153 -98
1907 -98 104 36 8 143 4 -169 70 2 45 -69 11 125 106 116 83 227 125 -275 153 9 -45 20 -211 -157
1931 -157 91 -101 -101 -1 11 -22 18 141 -86 257 254 -132 -48 77 49 -2 176 -184 -70 8 29 111 -19 -137
1955 -137 0 -143 -65 11 93 -36 87 120 -31 201 -21 106 20 4 -92 44 17 -75 -62 -50 82 -61 128 106
1979 106 -33 -116 -77 212 90 -69 -320 210 -29 -55 448 35 -15 343 -240 73 112 -25 -114 -115 -290 48 -234
2002 -234 52 237 32 161 126 264 86 -9 -173 16 -34 -138 24 36 9 -135 -75 -90 -33 -70 -45 -49 -66 -121 -30
2027 -30 -142 116 65 115 342 49 27 160 -231 -37 -173 63 -81 25 8 57 -101 -42 -46 58 -46 61 21
2050B1L0j54J14J6Lj47J17P4KL8o7r8M3n1K14q0r3p9K51k53J74M4j30P8l09J82
2076f0J20j32K60Pk79N3k83J71J82k5Q1j95L7R5P1j89P8K6L6O6pl5q9K7n0mq0
2103a18K80k10m4J44J36j11j14j12K5K05K6k21L55l73J6J08j89K55km2J84j30
2125F8k03P1J88j03M4j7j36K2Q7M8q1J9nL8j65rj7J37K26l2k21J51k09J91j45
2150e3K24k43KL7J51k09n7J04L2J9J83k89K38j16K9k5q2k5K50j43J97j26J32j95
2174C5k3J39k71K7m8J15O3o8j06O2q0L57R5k37R6k92K79Nk3L8ok5k48L1J37l18
2200b66P4M8K11j19k5O8J50k67j24K33O6j55K15J40l21J45k23J77k98J69J95j73
2222h0l8J38K2j68L76j96j40J68R9j11%j70K5J56k99M2J03M6J29j09J04M3k33
$$ plain form
2050 21 51 -103 11 27 30 -117 0 74 76 114 47 -51 -8 -59 155 75 -18 -97 154 -99 75 119 -11 67 -242 -60
2076 -60 60 -72 188 195 -84 -31 -314 -143 39 14 95 -100 -63 32 103 -86 -8 18 54 120 113 78 -11 16 -34 -38 -118
2103 -118 162 -48 -92 52 188 77 -37 -149 -124 81 107 -114 241 -132 -116 -8 -197 58 56 14 198 68
2125 68 -135 -64 124 21 65 48 -88 -66 21 69 -12 7 2 40 -125 -134 -151 -14 212 180 -41 110 -99 92 -53
2150 -53 171 -72 -70 -33 118 -91 -148 -44 -12 7 190 -99 139 23 52 27 -55 -80 170 27 224 98 230 35
2174 35 12 151 -120 -93 -141 -26 37 -31 -137 -75 -155 202 297 60 156 -136 143 148 125 163 157 132 -116 -85 52 -266
2200 -266 -192 -144 67 -52 -77 -9 141 -126 -250 -17 49 -106 109 249 -72 73 -150 27 -271 -102 93 -80
2222 -80 -118 20 42 -126 250 54 -86 82 181 70 70 -100 -75 81 -218 -176 -73 -27 102 -7 97 140 -93
2245i3K41O0j96J74l01J14K6j47J32p8J08J7J25rk48J76j56K66p1J6j45m5j09
2268a43R6J74j76J52L5k34J2K21k40K35ok28M4M4j35K34j17J58j06k07L21k32
2290i8K48q7K7M4j22q1J7Q4j31J26Nm6O5l8r5J60J63k63j56M8J29L0r9J07Rk9
2316A7j5J11j43M4%ON2n6J66j3J9j24N8j27o5l0Q4Oo6J20j59J95j90L24j09k34
2342a29J48k7l2J56j99r2J75K22m6j56j03n6n4K29l7j26l9J96j7k46K35m8L5l75
2366c86J59K63lJ40j24j9J11j01o1o3J58j24j27L15k12J04M1j7j38R1j55N3Q6
2389iJ19r6k80K92j1l0N6k46l2P7p2K75NK0k22J58j0k87K00K14p4J12N9k47j0
2414c9q8oK03j73K2J57j37K79j03M3r9m7k09K69j88O4j00P7n4M01k06J31k10R7
$$ plain form
2245 -93 148 208 12 186 -115 -1 25 -122 10 -68 40 57 182 173 -75 101 -55 211 140 156 11 -34 -143
2268 -143 -47 127 -49 103 138 -96 -84 137 -103 132 126 -102 -58 -14 -149 85 -32 126 20 -187 134 -98
2290 -98 150 63 90 134 12 -69 -52 32 -99 27 32 -14 51 13 -82 78 241 -22 -178 -130 -1 29 -70 37 46 17
2316 17 2 113 -30 14 14 20 72 16 182 169 188 64 122 -5 -70 -100 -16 -10 -76 44 -115 80 -110 214 105 -129
2342 -129 19 -8 -40 116 -83 -175 0 222 176 20 -83 -139 -193 36 -1 -127 -166 30 13 -233 2 -46 -11 -386
2366 -386 -227 36 33 173 49 30 141 40 -21 -84 74 -50 -177 138 -74 30 71 54 -84 7 -148 -95 -9
2389 -9 110 14 -266 26 15 -15 41 -205 -237 -160 -232 43 48 68 -154 4 -6 -293 -93 121 47 159 218 -29 -39
2414 -39 -127 -133 70 -103 -81 76 -61 218 115 158 59 12 -197 72 -116 -52 -152 -75 -129 272 66 197 -13 84
2438H4n6j5J44k19J3P0k4j23Q5P5J00l27J65nJ67j88J55k46P5J39O2k0j8j2k26
2463a45j84M10n3K7O0o8k24K64j0K9m5k66J29kM6K43r2k30K51p2M1p6j66K09r5
2488a9j06n0K10qn4pJ50j47L8j0K17j73j35R9j05K56l76L43p8l4j13R0n9MK46
2513A79j2j8j08o6J23j00o9K12k57L04j96r7K2J45r2q0O7K6k4q3J91P7l51O8M8
2538i1J00j65Q9OJ78k47R4n3l1K4J17p1q2O7J28m2J40j32j32J12J2k5j7j12J34
2563Al8K1O3K50l67K18k05mK9k53N00r5M0j10R5q5p5j00j28M8pK62P4j58J7K9
2589B2KK2nN8l13K04K64k37n6P0J07j57m8n2m3J22K15k42J6j84L9L47j94Q1k6
2614A2p9J28o9j33J91j03J76M5j02k79J99K4J62j73o7l3j15J64j52K97j69j38
$$ plain form
2438 84 28 13 157 -62 -49 21 -3 -126 -41 34 134 -193 -28 -33 134 -54 101 -145 -70 69 131 111 93 81 -145
2463 -145 -329 81 28 55 115 47 -177 87 77 106 61 -205 -76 -78 -32 211 119 -111 140 68 109 33 -133 76 -19
2488 -19 -125 -175 35 27 -27 -34 116 -31 7 -3 214 41 -94 5 -100 156 -220 123 45 11 -102 -12 -71 -67 179
2513 179 167 149 41 -25 98 -2 -71 141 -116 188 -8 -105 -83 62 -30 -110 -43 -17 -41 -124 67 144 -207 -139 -91
2538 -91 9 -156 -67 -61 117 -130 -36 -89 -120 -96 21 -50 -132 -65 63 21 161 29 -103 9 21 -4 -21 -133 1
2563 1 -37 -16 47 297 -70 148 -57 -61 -32 -285 215 120 160 50 145 60 -15 -115 -243 -195 -202 60 134 -24 -7 22
2589 22 24 46 41 99 -214 -10 254 17 -39 31 138 -19 -67 -119 -162 -40 175 -67 -51 -235 -196 151 -43 38 12
2614 12 -67 61 -8 -141 50 -53 123 168 66 -213 -14 10 172 -1 -68 -101 -216 -52 -204 93 -76 -214
2636b14QL28J06j40k37j42K45pN8O0l8qM8j98M1K05Rq5k15J58k63M38lk14J37
2661G7k41j0J01R0J2Mo2L5j64L02k16K08k30M6J29j15N6p6J69K02l51o1Q3j85
2685a97J53K22k82l4L6J50J18l12K89j78J79l6k7j53J94k29m8J15L1j20Q6PP8
2708D2K13k99R5K4j85NK30k04L19j27j15N1l1J25o9k34M6K52M9K8K6k02J90m41
2732b12K29N6n4L7K5J3k18J17j7J9j27nJ62l5o8n2K1J46R5j84Q0J15j21Q6j70
2757f2K97J27n86J27J90j76J77l0N4q5N6m3N7k39J65q6K78k38L7p3R1mN0k22J7
2782a21J6K54J96k80j45L8N6j34J09R4r5j54L38l46J88j3O0p3K42m9j45O2o5p
2806B6q1J25l5j66J19q7j42L66j17j17r3N1N8p6L2J84J22k25L6k8J66j04p3J7
$$ plain form
2636 -214 -206 122 228 88 -149 -291 -46 -53 5 65 27 19 67 -131 -90 115 124 39 -176 -18 -281 157 154 -60 77
2661 77 -164 -174 -73 17 29 33 -29 6 -158 144 -72 136 -94 -48 81 -34 22 -54 115 317 -34 -95 -12 -197
2685 -197 -44 178 -104 -138 -102 48 166 -146 143 -35 144 108 81 -72 122 -107 -155 -40 -9 -129 -43 -36 42
2708 42 255 -44 51 75 -110 -105 125 -79 240 113 -2 49 18 143 74 -160 -114 138 187 215 241 39 229 -212
2732 -212 17 73 19 56 81 94 -124 -7 -24 -5 -132 -137 25 -10 -78 -130 -109 37 132 -52 28 143 22 108 -62
2757 -62 235 362 -224 -97 93 -83 94 64 118 33 89 46 103 -136 29 -57 221 -17 20 -53 38 34 84 -138 -121
2782 -121 -105 149 345 65 -80 -42 14 -120 -11 83 -12 -166 172 -174 14 1 61 -12 230 181 36 98 33 26
2806 26 -55 70 35 -131 -12 -99 -241 125 8 -109 -202 -151 -93 -169 -137 47 169 -56 -20 -48 118 14 -59 -42
2830d2L1J09j69L7m2p1K48j29N3q5m6K01n1m6J50j92j95M2K29r2J09p1K14j88
2854DK70k89J16l7k38K58o6J9Mj38L4J67k2j29O7j80K19o4q6J02l8J8r3J58j10
2879e4R1j51J25p1j4K20j37j6o8O6Q1mj73J73k8p0K31l28O8M4J16j05K66l90j8
2904a46K83p3j3m7J18M1k07J25j12J09n5P7k20J06J23l56K54M1q1K0N2qO2j17
2928b4J4K36k95l05K70K28o5N8l1j99O2N6k6oP8r0p3J14N2r7n7P1R3j40Q0J55
2954A59j17o0Q6P5k04R0k40L8N3L88l18J68k22r6J30O2N4l20J88J44q0O8j45J21
2978B2p1J21n9m9J03o2j03j66R4J95J86j72j54J01q2J16o7Q4j17K3j14K13j02
3001f0K26Lk99N6J0J16k4j24J69n4o8j1K41j82J69j55p2K01r0k62L97p9l26L86
$$ plain form
2830 -42 -11 98 -71 -34 -76 -147 101 -28 25 -60 -106 95 44 -2 148 -44 -239 -197 32 -60 49 -22 192 4
2854 4 274 -15 101 64 -174 84 18 37 41 -97 -63 104 82 -47 20 -160 59 -5 -91 11 -27 -9 -102 56 -54
2879 -54 37 -114 11 -60 -74 146 9 -7 -75 -9 72 68 -105 68 40 -30 201 -127 -59 -15 101 -4 262 -128 -146
2904 -146 137 64 51 4 122 163 -44 81 -31 78 23 100 -120 -14 109 -247 7 48 -33 -13 39 31 93 -24
2928 -24 -10 226 -69 -374 -104 124 59 117 86 -113 -51 5 -21 -27 51 -39 -112 2 54 -43 -100 -29 64 -76 4 159
2954 159 42 -18 68 143 -61 29 -211 -173 -120 268 -50 118 -104 -200 -70 -8 46 -274 -86 58 -22 46 -99 22
2978 22 -49 72 13 -36 67 5 -98 -264 -170 25 211 39 -115 -14 -96 20 -47 37 -80 -57 -171 42 -60
3001 -60 166 169 -130 -74 -64 52 28 -96 73 19 -49 -60 181 -1 168 13 -59 142 52 -210 187 108 -218 168
3025A68k95J89j89o2J47J59j18j59K49j22J72k04P2O5k36R1j10J82j7j08J3J8
3047i5Q9k3K9L00k51j15J2K56j34k18o7J27N6N3j11O2L4j49L77l4k59J99j87n8
3071a07K47j0k29L8K20l21O8L21k54j8M9K07l03J9O6J97N1k32K4m5J34k32R5o
3095b1J7J5Q2l9q9P9pJ49n4o2O4l0J7k8k70O6J40m8N9l68L32K34m77K37O5j74
3121a11Q7k2l9O5l4N9M4k6Q7l4j62K31k38R7k32K15J33j85p1J29j40J22q5O8Q3
3146D1R3p2n6j49K40Ll12J98j2l4J27Lk31J89R7k7Lo1k24L5P5L1O2J40j81r5L5
3173h2J42j98M9L91j71k34J35R1j14j05R6L1k07J09P0n6OP6J48O6k70O6j31L10
3197B18j89O9j56m4L33q1l0j37O2p6O2q9o4L5Q7L2k06J56O0N5O0k56K9o2J80N3
$$ plain form
3025 168 -127 62 -127 -189 -42 117 -1 -160 89 -33 139 -65 7 72 -164 -73 -183 -1 -18 -126 -113 -95
3047 -95 -6 -29 0 300 49 -66 -54 202 68 -150 -217 -90 -34 19 -92 -30 4 -145 232 198 -61 138 -49 -107
3071 -107 140 130 -99 -61 159 -162 -94 227 -27 -45 4 211 -92 -73 -7 190 241 9 33 -12 122 -110 -15 -21
3095 -21 -4 11 93 54 -35 44 37 186 132 70 134 104 121 93 -177 -111 29 -19 40 -328 4 238 -239 -2 63 -111
3121 -111 -24 -46 -85 -20 -54 5 49 23 110 76 -86 145 -93 4 -228 -13 120 -65 -136 -7 -147 -25 -110 -42 41
3146 41 134 62 6 -143 97 100 -212 -14 -26 -60 67 70 -161 28 125 98 101 40 -184 -149 -74 -43 19 159 -22 -117 -82
3173 -82 60 -138 -89 302 131 -103 32 123 9 -96 0 31 -176 -67 3 -53 -47 29 177 243 -27 39 -92 218
3197 218 29 98 -58 -102 231 150 120 -17 45 -31 31 -58 -122 -87 0 32 -174 -18 42 97 157 -99 -70 -132 48 101
3223A01j68k8Q5J55k14Kqj56N08k53k3j13K28j89O3K50o9k85J23J55j09j53k1
3246a19J86Jj74K78k8k63L8J38r6O5K8j1j70qJ42j50kn4L0J42J79j35K20k85J59
3271A11j70p3K58N3m50K18l8J97q2n5P4n7J13k00L15k10k3N8Rl0j44K35o5j82
3295a38J60n1J3j1J22k34J53J09l00K37k51M12l29N1j30Q0J57J59k47j19K05j98
3317a50L24j77J8j02K4J56K2L1j07j84J81l9j51O9P2J49j56m8Rp8K27j05l8R7
3341D4K8r9N3j08P6J6J79k27j63J66J21K34l46j17K67k30j15R1J55N8k65K03O8
3364H9K5q5O2r3j12K0P5o2M9kL37k46o0l75K97N8r9J42o7K1P6j31Q5K02l39J0
3390a23J22K58l15k8n3J97J03l61K7r5J21J56l2J1N8k26OJ8j0NL70J18m70L1m9
$$ plain form
3223 101 -67 -95 -10 145 -69 -67 -75 -231 277 24 1 -112 116 -73 -10 240 171 -114 9 164 55 -98 -119
3246 -119 67 68 -106 172 144 -119 -81 57 -39 26 54 43 -127 -135 7 -143 -145 -199 -169 -27 152 17 237 -48 111
3271 111 -59 -132 126 179 -271 -53 -91 106 24 -31 43 -14 99 -101 214 4 -19 39 48 18 -126 109 44 -138
3295 -138 22 -29 -16 -27 95 -139 14 123 -177 60 -191 221 -108 -57 -187 -107 50 209 -38 -157 48 -150
3317 -150 174 -3 15 -87 -63 93 115 146 39 -145 36 -3 -154 -85 -13 136 -20 -68 -59 -137 90 -15 -53 44
3341 44 72 -27 26 -82 -6 10 189 -38 -201 -35 86 320 -26 -143 124 -106 -221 -130 25 83 -182 21 89
3364 89 114 29 91 -2 -114 -94 -19 -81 -32 -34 303 57 -3 -378 -81 -23 -122 20 -47 -26 50 -81 4 206 -133 -123
3390 -123 -1 257 -58 -86 -139 58 161 -200 -173 -268 -147 9 -23 -12 46 -180 -174 -156 -166 -161 209 327 -143 -112 -161
3415a61K34m4o5J00O4j31k2L6Q3pj16J9Mj42J67J7N5j39K28j75P6K6k00L29j84
3440E2n4J20m3p5Q4l75K29k7K56r8j28J31k50J42J03j6j48K95m02J37j5p9K38
3463G7N4k57J29k5R8k6k18K0L75m52K41j12K34j99J25J60l90K38k26L41j59J40
3485A68j65j24k0K54k08K02j07j34K10j33K27j16p6N8L1M7j14K7j36K07P2l36
3507a66P4K7Q3j24J4mN6J80QM2j80j01pM6J85k20K39k63PN7m3P6r9K80j04R3o4
3534I2l6oJ1j21J16j37l8Q7j24L35k28j76K88j45J19q3l7P8Q0Q1j28j15N7K6J02
3559I8j56J82L1l33K14j47J51j85K49k25K18j61l1lNL06k83O1j0Oj07J81j67l3
3583a39J72L0j07J44k04K00j74N4j01J43J5K0p2l38L56k0J96k05J21nN1j16j38
$$ plain form
3415 -161 73 29 -36 64 128 -3 -25 11 94 87 -29 -10 -6 -148 19 36 91 -48 180 5 81 107 -93 236 52
3440 52 -2 118 75 0 84 -291 -62 -89 167 69 -59 72 -178 -36 67 51 -97 198 -204 -67 -82 -161 77
3463 77 131 -126 3 -22 76 50 -168 -148 227 -225 16 -96 138 -61 64 224 -166 72 -154 187 28 168
3485 168 3 -121 -141 113 -95 107 0 -134 76 -57 170 54 -22 36 67 114 0 27 -109 98 170 -166
3507 -166 -92 -65 18 -106 -92 -96 -40 140 148 190 10 -91 -98 -52 133 -87 152 -111 -104 -47 -90 -14 -113 167 63 156 92
3534 92 56 50 61 -60 56 -81 -119 -32 -156 179 -49 -225 63 -82 37 -46 -83 -5 75 156 28 -87 -30 -4 98
3559 98 -58 124 155 -178 36 -111 40 -145 104 -121 97 -64 -95 -98 -93 213 -70 -9 -19 -13 -120 61 -106 -139
3583 -139 33 63 -44 100 -104 96 -78 -24 -125 18 33 53 -19 -357 -1 -21 175 -30 91 86 137 21 -117
3606a17J60j6Po0K17n0l2j02j09M4P2mk32K05N7KK30j19j53J5m7K1l5J23L7l05
3632a91J19J77m0l3k08J90o7J7J39o0m4p7J47j71J28n7j91J35K20j45j08P0L8
3655a2l0R8r5j14K74j41q0K64n6n2n5Q7k00k0J30n0J37L1j13j23j80L38n1jo4
3680g8J84k41J52j61K3j4J17K24l32J43r6Q3l9Q3nJ31k29J74r2O7l85K21J56J47
3704B33k10o5Rj39M35p5j40j24j4K32Q3j76j62j73J31L28j52k37K14k2L1N9k43
3727a77J74o4k1p3J16J30k28J68m1n5K07k89K93J96m76M5J25q5J20N4j61L4J43
3750A35K1j58J0o6K9j80K56k01J75l3j28J16N1n7K4K21k79j75K19Lmj9K2J12N4
3775A48l21K8R1M2l0K50j13l7J50k62Q9J48k49j8L8k8J54L9r6j28J01Rl10K62
$$ plain form
3606 -117 43 27 34 -26 191 141 109 7 -102 -58 14 10 -222 -17 40 42 272 153 0 15 -32 -11 -46 77 114 -191
3632 -191 -72 105 65 32 -176 14 -53 -36 103 43 -1 -78 69 -102 26 -31 -222 -87 133 -12 -120 -50 -12
3655 -12 -42 56 -39 -153 121 -20 -100 164 108 56 1 88 -112 -132 -2 -52 85 116 3 -120 -300 38 -13 -14 -78
3680 -78 106 -135 17 -144 -121 -135 -18 206 -126 17 -79 4 -35 48 43 174 -55 119 27 94 -291 -70 86 233
3704 233 23 -42 -33 -172 263 188 48 -76 -90 142 225 49 -113 -286 -155 173 21 -216 -2 -24 7 66 -177
3727 -177 -3 -67 -88 -161 -45 85 -143 25 -16 -71 136 -153 140 336 -140 -95 30 -55 65 119 -42 -8 135
3750 135 156 -2 8 -58 -29 -209 47 -154 21 -12 -140 -24 27 -30 -6 215 -64 -239 -20 -17 -21 -40 -18 94 148
3775 148 -173 -145 -54 -12 -42 208 95 58 208 -54 35 183 -66 -84 -46 -74 80 119 23 -105 -4 5 -305 -43
3799d3Q5K4j31J32l7J20j15Pr3qJ98k43Q0J8j13J97j96Q2KL0k1q4j28M55k12J05
3825A11j19q9O2J25K7k18J78j35N8qp9k6R5m6R4j3N8l6R4K9j37j46j19J99J24
3850H3J59m50K24o4L7J48j58J15k2j34J30k57Q4Q9M4O0r6J40J09k26J32j71n1
3873g5k9J56j26m0J88k56J98k74L61j56J11p3L7j03kq5J6j6K20J05k01L4j2J7
3897ek9R2j08N4P5j41K37j78K16k98Q3q8qPJ04J5r2l9Lm1j9J61j35K45k25J47
3923C3O1J86l77r1K06P7l2j24J49j47N1L6J68k78N4LQ0r5j04K31J82r1p8n2j86
3948a38rJ96n9Jj9o4K3O7J24j48k07J03R2M5r5J46l2M1N0q5J37j05k5k6k6L7m3
3975a9J20N9j15M4lj56J47M4k30J8K12l23O4K27k32J08j4Q9j08K0Q9J4l1R9k01
$$ plain form
3799 -43 42 66 -65 67 30 150 35 42 -51 -59 139 -104 -24 -6 -119 78 -118 -36 -34 -4 -25 -109 -237 218 6 111
3825 111 -8 -97 -35 90 117 -101 77 -58 0 -8 -87 -113 -18 -64 30 17 75 39 133 162 25 -121 -240 -41 83
3850 83 242 -208 16 -48 -11 137 -21 94 72 -62 68 -189 -105 -16 28 88 -8 132 241 15 147 -24 -75
3873 -75 -104 52 -74 -114 74 -182 16 -258 103 -53 58 -15 22 -81 -83 -168 -152 -168 52 157 -44 -10 -22 -5
3897 -5 -34 58 -50 4 79 -62 175 -3 213 -85 -2 -90 -98 -91 13 28 -64 -103 -100 -141 -160 1 -134 111 -114 33
3923 33 94 280 -97 -188 18 95 63 -61 88 -59 -8 28 196 -82 -28 -25 55 -40 -144 87 269 178 100 48 -138
3948 -138 -147 49 -10 -9 -28 -92 -69 -2 122 -26 -233 -130 -38 7 -88 58 26 67 117 32 169 64 39 13 -13 24 -19
3975 -19 101 160 45 89 86 -70 77 121 -109 -91 121 -202 -138 89 -143 -35 -49 40 -68 -48 41 55 24 123 -78
4000g8L4N9K45m40N5J50p2QJ57j49k28J49j38K66r8J69q6m2Q1q4O7O4j68J38J18
4025A77k62n0j20M37l93M60l51l3J49j24mL0L30k70J46j60j7J04N3j52N8J13k16
4048i5J70p8J02K9k24L1J50K0k6j39J50L3j47N0J14k75J53oJ2Q4j67L6J41j8j77
4073g7J15l3j19K84j73Op0N3J5J40P4k33K1Q5K6j77r8K10k71J4L18J68j99j30
4097e1N1n0j8J57j03J41l27J14K46Po6O9R0k12j03J6Q7oKj09J94k45J15J51q9
4122F1k09K35p6lLQo0K15L6k32k32l8L06j17J1p5K67M6o9n5P3M0m6j01n2J6J65
4149A17k63k5J96p2lP8j59K89M6l04L5J33jm8mJ18k49J90J6k7J31p4n2l6N0j89
4175a07q1J94k06J89J04k60K96n4j42J75j91L3np1K1R3q7j2J75p6N6L1j1M6k30
$$ plain form
4000 -78 -44 15 260 -180 -125 25 -47 -39 118 -31 -259 -110 -248 18 -80 89 3 -39 42 -42 25 89 -79 59 177
4025 177 -85 -135 -255 182 -211 249 -102 -135 14 -110 -114 -84 246 -24 122 -38 -55 49 102 -50 8 121 -95
4048 -95 75 -3 99 128 -96 -65 85 105 79 -60 90 123 -24 26 140 -135 18 12 24 108 -59 -23 118 100 -77
4073 -77 38 5 -114 170 -3 3 -67 -14 1 141 215 -18 3 88 114 -63 -161 49 -222 -208 110 278 79 -51
4097 -51 0 -50 -68 89 -14 127 -200 -86 160 167 101 170 260 48 -55 -39 48 42 44 -65 129 -116 -1 150 61
4122 61 -148 87 11 8 11 19 -41 174 210 -22 -254 -292 14 -103 -92 -167 100 146 77 22 95 135 89 -12 -64 -48 117
4149 117 -146 -171 25 -47 -50 28 -131 158 204 -100 -65 68 67 19 15 133 -116 74 90 63 194 120 68 32 82 -107
4175 -107 -188 6 -200 -11 93 -167 129 75 -67 108 -83 -50 -55 -126 -105 -12 -99 -111 64 -12 44 75 64 110 -120
4200a20J49o6J97k47J52k1KK74k07j78l5J43q1M1Q9J78k47J85p7o6p0o1N8M8N2
4225I2ll5r5R0O6L7k22Lj4J59J6k28K2P2P6J84k36O2k93K34M0o7J45p6r7%K23
4252A55k17J73J46j85q8r5P6l9J61j29n1R2r9M01l47J10l77N43j53L3p1K78k98
4275A9K9L6j23k7m5P3K3r3J26j24q5R9J44Kj74L6K18K3j6q7q4j6J05j75J55q2
4301d3j13nl0J42o6K9KK8j09J29O3j46P4mk03K37J43j15K8j49m2p4K87K75m00
4326f2M9P1P2M5j55J26j72J29j22Q3k19M2O3L6J4J48k61O9J00j3Q4m16L51j92
4350a30%J88j65j2J25O0k5l3N4j07K27k38L41k05ok68K85J4k40L55m13K18j10
4373h5j44K51J47j56N4N5r0N2k23J10MP4r8R2K02rl09P5j04J53k25K06j52K32
$$ plain form
4200 -120 29 -37 160 -87 65 44 46 320 113 -65 -100 43 -38 3 92 270 23 208 131 65 -5 -66 -8 40 92
4225 92 89 54 -41 49 115 152 -70 -67 -81 78 94 -134 -112 -40 36 220 -16 46 -247 -13 27 -40 105 29 -68 -68 155
4252 155 -62 111 257 72 -16 -111 -35 -74 87 -42 -93 -1 -100 301 -46 64 -313 230 77 110 39 317 19
4275 19 48 84 -39 -66 -111 -38 -15 -108 18 -106 -191 -92 52 54 -120 -84 134 157 141 54 -30 -46 59 -116 39 -43
4301 -43 -156 -161 -191 -49 -115 -86 -84 -56 -165 -36 27 -119 -45 -49 -252 -15 128 13 41 -108 -150 -224 63 338 -62
4326 -62 -13 58 130 175 20 146 -26 103 -19 64 -155 -113 -50 -14 0 148 -113 -44 56 43 127 -289 62 -130
4350 -130 -130 58 -107 -119 6 66 41 8 62 -45 182 -56 285 80 74 -194 91 105 -135 220 -193 25 -85
4373 -85 -229 22 169 13 67 122 32 84 -139 -29 -25 49 -49 43 245 236 -73 2 -102 51 -174 32 -120 112
4397A12j63L8rnj04J29J49j79q6J25J53k61K89l58K39j30m7J55k40J52R7k49K46
4420E3k00J16J98q2j65Q7J17j39j3R6j19k6J32Q5n8m4j18l3J64l3J4n3P5M1J99
4445B94k70j1N0p7j65K88o6k25J68k57K39mJ85j04o4J08k66J55P5j4j58k04K20
4468a03J10R6o4j72L15p6J14l88J40N5n1K4R0k7j46P2j03J07lJ5j65O6M7j20K38
4493G1J7R3m24L53j68P6j71K80k11L6n8K1q6K78k92J59K20k02K29j55j42J59j76
4516i3J40p4l3K84j91N6m6k26kO1J20m8Q9j44J96k1j89O5J24k6q1J7J9J95j33
4541E9R3k54J46N2l68J0K89O3p0J56k81O0J60r0K9J39j38o1l06J82K88j39k11
4564a92J23n7J4J43K28k46j08J3K07k33J2O7P8j21qK46p5j80J69r2j10J89k0o9
$$ plain form
4397 112 -51 -13 -22 -27 -131 -2 147 -32 -118 7 160 -101 188 -170 69 -61 -108 47 -193 -41 56 -193 53
4420 53 -147 -31 167 85 -80 7 124 -15 -28 68 -51 -77 55 140 82 38 -80 -113 51 18 32 -21 54 95 294
4445 294 24 13 63 -14 -179 109 43 -182 -14 -271 -32 -36 149 45 -19 89 -177 -22 53 39 -119 -323 -103
4468 -103 7 103 39 -133 182 106 220 -168 -28 27 -24 0 90 63 -83 -11 -114 -7 -10 5 -160 -94 -47 -167 71
4493 71 88 181 -243 110 -58 18 -153 127 -84 -48 -106 -85 -171 107 -185 -26 194 -8 221 66 -76 83 -93
4516 -93 47 -27 -60 224 33 89 43 -183 -185 -124 -4 -52 37 -107 89 68 -121 -56 68 42 -39 -22 -3 192 59
4541 59 152 -102 44 96 -272 -262 27 90 20 176 -105 -45 115 25 54 193 55 -6 -312 -130 158 19 -192
4564 -192 -69 -126 -112 31 259 13 -95 -82 125 -108 -96 -29 49 -72 -80 166 91 -89 80 -12 -122 67 47 -22
4588b2M8L8k3l9m6K9J29J6j14R6j08l0O2J89j0k30m0M4J52k46J16N6J9j36p2K50
4614A28k16J14R5k55L6j9K21j88K55k38O1K27l24K00m1j31J84l3J5l28Q8J84O1
4637I6j4Ll43L09n9J99r0j14o8j8N7oj47L49r7j25J17j05j17J03J69k0l4l9j3
4662gO9j19Q5kq8P5j72J81M6K4k12N6N2j27K08J35m2j10o7LP3m2k40J82J52j81
4688f8N5J04m8j99L03k68K51Rl24K15l7O8j96J13J93k03K5n8%n5L2K44j53k24
4712b21K57n8o7N2m8m8J98q4P7j50R7j3m3J25K7o0j79J37O3R5k05q2J80L37k06
4737A81j46J01j80j08J48R7O2m23L10j11R1l5QJ57j06Q0j72R3j02O4q1P3p1R3
4761B3r0M3R3j8j19o6O8L9J71p4j81J18J32j37P4j53M8k3J42j00J01n0O5J04k28
$$ plain form
4588 -22 26 64 41 2 -44 -15 114 130 16 112 4 -26 36 225 215 -15 -55 -11 141 -105 11 67 86 -50 -122 128
4614 128 -88 26 121 -134 -98 -117 104 -84 171 -67 -6 221 -103 97 56 -75 109 76 91 -237 -149 35 96
4637 96 82 85 -258 51 -8 191 101 -13 -81 -99 -42 -48 -195 154 57 -68 49 -56 -173 -70 99 79 45 6 -7
4662 -7 62 -57 28 26 -62 13 -159 22 68 92 -120 -64 -12 -139 69 204 162 52 -15 -12 61 19 -221 -39 113 -68
4688 -68 -13 91 43 -156 147 -121 130 139 -185 30 -7 61 -135 -22 171 -32 -7 -65 -65 -120 -88 156 3 -221
4712 -221 36 -22 -89 -37 -85 -133 65 -19 58 -92 5 -8 -51 74 101 41 -138 -1 62 157 -48 -130 50 387 181
4737 181 35 136 -44 -152 -4 93 155 -268 42 -69 22 -13 -5 152 46 126 -46 47 -55 9 -72 1 -70 23
4761 23 -67 -24 69 51 -68 -134 -66 -27 144 70 -111 7 139 2 76 -77 -29 -52 90 -10 91 41 106 210 -18
4786a8lk44K46p2j6J33k04J84j70J29J7n7P0K4J5j87J76j9J25j34j38m3K15r6
4810f7J89p0j31K62j23k80L76k65J24P3n9q5J30o9J33%k08L00j55j67q6L50j13
4833E9pn5j4J14l22L91j43r8j26J66J58k12J28j21o3Q5J22j54N0J17m6K67l07
4856a1r9J50q1l9j2j27L33K0l06J87l5J32k55J00n3K20J48l33n7J94j04j06L09
4879A75j55j13m8J62%j88J76J79k47N3r9R7r7j12K06Q6k51J90j52J12j7k5Q4J37
4903A53k09Q5k8p1L35l60J67j68Q3o1J06P0k80K72j13j58J54m0J01J9N9l02J16
4926g0rj8J89j34j37P2K85k18L7j34j3J21J19j58J53oK6l5j29K43j36r7J44j95
4950a00k7L5K09Lq2K1j83J34J54o5L8k44J92J3J1l75L48j50kP3j32L2J4j3J41
$$ plain form
4786 -18 -21 -265 -19 -91 -107 26 -178 6 -164 -35 -18 -75 -5 19 34 -153 23 4 129 -5 -143 -186 29 -67
4810 -67 122 52 -79 183 60 -220 156 -109 15 88 29 -56 74 5 138 138 -70 230 75 -92 -178 172 59
4833 59 52 -3 -17 97 -225 166 23 -75 -201 -35 123 -89 39 -82 -145 -60 62 -92 -42 75 29 296 -11
4856 -11 -110 40 -41 -80 -92 -219 114 134 -172 15 -20 112 -143 -43 -96 124 272 -61 -118 76 -28 -134 175
4879 175 20 -93 -141 21 21 -167 9 188 -59 -6 -105 -8 -105 -217 -11 75 -176 14 -138 -26 -43 -68 16 153
4903 153 -56 29 1 -70 265 -95 72 -96 -13 -74 32 102 -178 94 -19 -177 -23 -63 38 57 116 -186 -70
4926 -70 -79 -97 92 -42 -179 -107 178 -40 -3 -137 -150 -29 90 -68 85 79 105 70 -59 184 48 -49 95 -100
4950 -100 -127 -92 117 120 38 59 -124 10 164 99 137 -107 85 98 109 -266 82 -68 -70 3 -129 -97 -83 -96 45
4975D5K03l65J69J91k10l2J4p3J26P2k88J03J55k82K20r6L8M2n3Q9k6N3j44j1
4999f0K46j80P5m6J13j61J3j4j21j3K25r7qL1R9j08L1K02k23k12K25k42K98P3
5023A46j95k3N2l5l8K58k15J86j02m2l1RP7j44O4J68K9j79j56K12j15M09l50j35
5047a50J10Rq8L55j83j87K42J01m29L75J2k73K8j63O3J76j04O9K34j78j7P9n6
5070B5n1m0K36j69O2M8j58J10J8J46k9k05nP5N4Nj37J15j66k04J98J26O5k25Q2
5095b4L5q5K85j34r5j91K57R7j98R1k6P9p2p3J14j70K81k96J50M0k24J37R1n1
5119A8k1j73K87M3k15J45p5J48k94K22j20j02r3K80o1P6n6j09R1P4k12J28J88
5142A69j79L3R3j82K3J99p5k8J05J88m27J85k57l3J81o7J99p4k10J50N4j76K21
$$ plain form
4975 45 248 -117 52 243 33 1 15 -58 68 140 -148 -45 110 -172 48 -48 -10 32 -21 68 42 95 -49 -60
4999 -60 186 6 81 35 148 -13 0 -14 -135 -148 77 -20 -28 3 102 -6 25 227 4 -208 17 -225 73 146
5023 146 -49 -72 -20 -55 -93 165 -50 136 34 -8 -39 -30 47 -97 -33 135 164 -15 -171 41 -74 335 -15 -150
5047 -150 -40 -31 -119 236 53 -134 108 209 -220 155 167 -106 -78 -241 -178 -2 -106 -37 197 19 2 81 25
5070 25 -26 -66 170 1 63 111 -47 63 81 227 198 -7 -12 63 117 122 -15 100 -66 -270 -72 54 119 -106 -24
5095 -24 11 -74 211 77 -18 -209 48 145 -53 38 12 91 19 -54 60 -110 171 -125 25 65 -159 -22 69 18
5119 18 -3 -176 111 154 -61 84 9 157 -137 85 -35 -137 -230 50 -11 65 9 -100 -9 65 -147 -19 169
5142 169 -10 23 116 -66 -43 156 81 53 158 346 -81 104 -153 -186 -5 -72 127 53 -157 -7 47 -129 92
5165I2j97K93l42K66k53N5j31K26q2K51k13L2J15j32j8pj19P2R7j05j8oN8J33
5189F7j51K11j00j28Q7P7K7j13o6m5J00J86j26P4n0r6j7J14j02j94L28j71n7J14
5213c1J78j28j1Q1P3Kj53k13L08j8j27R0n1K37k32M9J18j86J9ql8K0R8j37J49
5238H9j98K32k67M07k16q4J7N3K29l50K71m7l2p6J28k04J25j21p4L05j41j40J29
5261C5J31j80J43k05J6L5o5K29O6j3l51J6K30j11J35m6K5k52L22l22K80j16LK45
5285B50m14N4P8l0M6J72k62J01m5l5j0N7j4o7R5j45J14J91l18K53k55J28J38j47
5309f5J20J41k66J7R4j28K25j95N9o7K35j17n2J20k26M2R3LJ16r0l2k0J3k1n4
5334e5j67R4L6J36j9K07k98Q4O5k24J04k6O6M7J43p6j90R0K97l43J86l32L32r5
$$ plain form
5165 92 -105 188 -154 112 -141 -86 -217 9 -73 178 -35 -3 112 -20 -38 -45 -164 -92 5 -100 -118 -124 -66 67
5189 67 -84 127 27 -101 -14 63 90 -23 -89 -134 -34 152 26 100 50 -46 -63 51 -51 -245 83 -88 -145 -31
5213 -31 147 19 8 89 162 164 11 -202 106 88 -39 51 0 237 5 54 172 -14 5 -3 -41 -21 77 -60 89
5238 89 -109 123 -144 263 47 -37 -20 33 262 -88 183 136 104 28 156 -48 77 -44 -118 187 46 -94 35
5261 35 166 -14 129 -76 -60 -25 -90 139 205 192 -159 -143 87 -24 111 65 90 -162 160 -162 118 2 5 250
5285 250 -164 -110 -32 -62 -16 156 -106 -5 -50 -85 -95 -38 -52 -119 -24 -169 -55 136 -182 71 -184 -56 82 -65
5309 -65 55 196 -70 -53 41 -87 138 -57 2 -65 170 53 1 121 -105 -63 30 33 149 59 27 7 20 -1 -55
5334 -55 -222 -128 -92 44 25 232 -66 18 83 -141 -37 -63 3 50 193 117 -73 17 314 -29 157 -175 157 62
5358F2k6j09J57jo4Jq2O4j13K38p3J23n9k21L52l28K12j6p1j13K39mk15j29P5
5383a01L42l99K10j02m0K08j39j12J32J02j74p5J07K1P4j04j39J61j97J51J55
5404H1j15O5n6j55K40L1L5k23o9O1J37j71J60j76K26M6j30P1j16j5N8L1q7R8K4
5429E1J42j29O0j13K03j34k52K28n8O3J01k98J83p9L3p1J5K7m4L31m24K41NL1
5453A12j55N7K14k30J93m13L91k03K83k45P9k43J87j93J93k9o5K73k47J0l3r4
5475a58O4n9J82K6M6j59N8k36M4K84M4r4m6M2J4j47J83j1Ol03N3J62j58J03LM
5501e3J82nj82K8J87j5j29O3j67J50q3o6J63o0j93J01J6j75K49k61K91j07J01
5524C5K48j09j88j90J03K25l5j83KJ13M0k05K9K04j75J18J7k21K65j13Q9M0m3
$$ plain form
5358 62 36 -73 84 83 19 20 -62 2 -111 127 54 177 118 -103 249 -79 133 117 46 -67 172 168 -47 -176 -101
5383 -101 241 -158 52 -50 -90 118 -21 -133 -1 101 -73 -148 -41 -20 54 -50 -189 -28 -225 -74 81
5404 81 -34 31 -25 -180 60 91 126 -97 -166 -105 32 -139 21 -155 71 117 -13 58 -58 -73 -15 16 -71 27 51
5429 51 193 64 124 11 214 80 -172 56 -2 61 162 -136 47 -32 1 -70 -55 -28 -72 259 -165 76 81 112
5453 112 -43 14 228 -2 191 -222 169 -34 249 4 83 -160 27 -166 27 -2 -67 206 -41 -31 -64 -158
5475 -158 -94 -153 29 55 101 -58 0 -236 -192 92 136 42 -4 38 52 -95 88 77 83 -220 -167 -5 -163 -60 -57 -53
5501 -53 129 124 -58 -30 157 142 13 76 -91 59 -24 -90 73 13 -180 -79 -63 -238 11 -250 41 -66 35
5524 35 283 174 -14 -204 -101 124 89 -94 -92 21 61 -144 -115 89 -86 32 49 -172 93 -20 69 109 66
5547F6j62K21k02P8o1P7J5j36j12J79J02L2k8k75J72K03j15M5m8J41r8j30J70
5570A34n1j79J8J57l28K66O4M0O2j78J5p0J10j57K48r0j44Q4m1k40J73K87r8R5
5594A77k32N9L22l99n5J61q3MJ83j99k27K84R8k23R1P9J7k49L40j94R5j3j45J34
5618B5r0N5m2m2K77k25R6j30N4J16j67K43j54l7m4K38j32j58PK40j39N6K3j7r0
5643c7J04j87L17oj67r8N7O9j74J23J78lm83K27J6J10k03k4J40P6p5J51P2p1j84
5668g2k0L30k19l8n9L4J09j55O7n4Q8k68R5K45r6l5J39L7l9j72p1M2m9J89K7k0
5694C5o5p2J28K35m43J82k3N8Lk25K62l8J4n1M5Q3j62J50j7J70k09J24p1j67j76
5719b30M38k01q5K86k17q0l7J60Q6m8j12Q2j47J03k07R6J18Rr6j9qL05k25J74
$$ plain form
5547 66 -96 125 -77 1 -60 17 32 -104 -216 -37 65 97 69 -206 -34 169 54 99 51 192 94 -36 134
5570 134 83 -96 -78 79 -249 17 81 121 183 5 20 -50 60 -97 151 61 -83 1 -40 -280 -107 180 82 177
5594 177 -55 4 326 -73 -128 33 -50 -46 137 -62 -289 -5 93 -130 -39 40 57 -192 148 -46 49 36 -109 25
5618 25 -65 -10 -52 -94 183 -42 54 -76 -22 94 -73 170 16 -21 -65 173 41 -117 -110 130 -9 47 70 53 -37
5643 -37 67 -120 197 191 24 -74 -17 52 -122 1 179 176 -307 -80 -64 46 -157 -181 -41 35 -40 111 183 112 -72
5668 -72 -92 238 19 -19 -78 -44 65 -90 -23 -77 11 -257 -162 83 -13 -48 91 128 89 -83 -154 -112 -161 28 55 35
5694 35 -30 -102 26 261 -182 0 -23 35 38 -187 75 37 51 0 45 128 -34 116 99 269 60 184 113 -54 -230
5719 -230 208 7 -78 208 -9 -89 -126 34 120 72 -40 42 -105 -2 -209 -113 5 14 -82 -101 -109 196 -29 145
5743A45q8j32L52l63J15J17j17j97j10L70k59K71j50k8Kj4p0Q1J89q3m8mP5o8
5767a4K90m57J61j02J21p3L3J59n7M0j93j9M0k8J96j25P3q8K59l70L48k20LR6
5791G3j28o4J48j0O2l48J95K16l36J61n2K32j06j01J8K83k61L6R6j2m49O22k00
5814G5k43K50j01p8J4p6K09j55P3K12l86K62M0q4Q1r6mJ18j91J1J70l1p4Q8Jp5
5840A0j00O3j57J2K03j75K28J49k30J72k14K3L1N8j77J45k32O7M05k93q4k9K09
5863H4k00Q7j45K20K2k92K44Nk00J11K30Ql61O1K29k14J87N7k54P3K03o4k57K41
5887G5k66K22L4j12P8j30k1Q5J81k16K7N0j9o9L70l02R1J7j77j16K11j3R3j89
5911i6J16o2p9J35P5N6j61J07j03Km4J44q0o0M8K78k05m6M5J0j6j71o6J32R9K03
$$ plain form
5743 145 57 -75 277 -86 29 146 29 -168 -278 92 -167 104 -46 -74 -72 -86 -156 -75 114 31 -17 -21 54 -14
5767 -14 276 -181 -20 -122 -1 -74 -41 118 61 101 -92 -111 -71 -99 97 -28 45 -43 216 -154 194 -26 -23 73
5791 73 -55 -119 29 19 81 -267 -72 144 -192 -31 -83 149 43 -58 -40 243 -18 18 114 102 -347 275 75
5814 75 -168 82 -19 -97 -83 -159 50 -105 -32 180 -206 56 96 12 93 -3 -7 111 -80 -69 101 70 -4 84 85 10
5840 10 -90 -27 -184 -172 31 -144 84 233 3 175 -39 -16 15 73 -104 41 -191 -124 281 -12 -96 -125 84
5863 84 -116 -29 -174 46 68 -224 20 25 -175 -64 166 174 -187 -126 103 -111 76 133 -121 -48 155 91 -166 75
5887 75 -191 31 65 -47 31 -99 -120 -35 146 -70 -43 7 -12 -81 289 -13 78 95 -82 -198 13 0 93 -96
5911 -96 20 -42 -121 14 89 145 -16 91 -12 -10 -54 90 10 -50 -2 276 71 25 70 80 64 -107 -173 -41 58 261
5937B61l17J71m9l3Q6j45o7K27L6l6k30J73p1J6K16k42j10N0J09KP3j74K8L51
5961C25k83O3M6j63m7L02k28k63J37K17j07K15k66J14j25O7p9J23k05L78l26o
5983a11K98k26j8K7R7j19q5J83k2oN3n1r7J68j24N7P5k31J1N6l2L2M3J61r1M9
6009I7j4J24k55N5k46L16n4o8Q5j28n3O0J82r9K1k4J25j04q7K23j39J50l07J67
6033B7l1PO9j30R3r9J22r9r9J77q5J23K0O6k14J22J05j31j88J15pkj09Q6J0RQ2
6060C9J4j8k8j20J25P7k11K58j02NPj11L0O7o4q8K52mk19K66j49n8J67k13P4m8
6086e2L6M4lk4p7L08l93Q8p5J12j51J93l3j59K02j14P8j7j07J78J26j67k5j38
6110a70K44Kj36J12J6j54K10j58j3M8n2p1K69j26L05m63J26j07K92j11j15Q9p
$$ plain form
5937 261 -56 115 66 33 119 -26 -93 134 170 134 -96 77 6 22 238 -4 -114 -64 45 47 120 -54 -26 325
5961 325 42 105 151 -12 -59 243 15 -248 -111 106 -1 214 -52 62 -63 4 -75 48 -157 221 -105 -111
5983 -111 187 -39 -57 -30 67 -52 -137 46 24 18 71 20 -77 91 -33 24 99 -132 -121 -65 -97 -65 -22 139 48 97
6009 97 83 207 -48 7 -239 77 23 -45 40 -88 -141 -81 101 2 23 -1 124 20 -67 156 17 167 -140 27
6033 27 -4 3 72 -58 35 -64 58 -41 -140 37 -48 75 95 161 -53 69 174 43 -145 -30 -37 -39 -148 -62 -52 -43 39
6060 39 53 35 7 -113 12 89 -122 136 34 39 46 -65 -35 32 -32 -120 132 128 -91 175 26 -32 135 -78 -4 -52
6086 -52 -16 28 25 1 -76 232 -161 -73 -148 -36 -187 6 -27 -186 16 -98 -20 -37 -144 34 160 -7 -32 -170
6110 -170 74 76 -60 52 68 -86 124 -34 -47 1 -51 -122 147 21 326 -137 -11 -118 174 63 -52 37 30
6133C0n7m7K44k92pJ95j48K1PJ21j25J57Nm0j70J52J90p9k12R5j79L04l23qP8
6158h8P5o4n0q0L06j83O1J21op6lo3n3M1r9J48r8L26k59nj51K55j79P5R3Q7j51
6185b0k16mr4M19l5R6k69K20q0Lj23N4K6J69l5k17O0J13o3j10R3R6r2J2J2R4j62
6212e3K31o8j49j45O2K8J59N9k39K66k21R7l9j0J20l05L26K2k18J29m2J39r1j43
6236h5K37k86J33K2M0P2m6q7RQ4o7j23J46p2l7L4K26l20J91j06O1K11j14j19K15
6261B19q4j08k6P5o9r1K9P2m4pK24j9k30nK9J26J19j80qN9O4j89K0K7r9J67j09
6288c8O6P2o3J3J22r7k1j21o2J9K1K38m22L83j30M1l5M8OJ92J44k41j47L0l0j37
6314a49M07k31m8nJ13P4j18qL7r6Q4qqK09k14r2l3m8L0J49k50O0J76o9n7Q5K8
$$ plain form
6133 30 -27 -74 170 -122 -129 66 -82 -61 -54 67 -58 99 104 64 -106 46 236 157 -55 40 -139 165 -158 -166 -88
6158 -88 -13 -77 -127 -207 99 -84 -23 98 92 16 13 -50 -103 -62 -161 -13 -111 215 -44 -49 -200 55 -124 -49 44 131 -20
6185 -20 -236 -240 -334 85 50 146 -123 97 17 20 -103 -49 -23 146 111 -106 -46 67 4 -106 -13 83 -9 3 15 109 -53
6212 -53 178 110 -39 -184 -122 -94 65 124 -115 151 -70 27 -12 -22 98 -207 119 141 -77 52 10 149 58 -85
6236 -85 152 -134 -1 21 61 133 87 0 9 93 26 -97 49 -23 -60 -26 200 -120 71 -35 26 237 123 4 219
6261 219 135 27 1 76 7 -84 -55 17 -27 -34 190 171 -59 -64 -35 91 210 30 22 81 145 -44 -24 3 -96 71 -38
6288 -38 28 100 37 50 172 75 54 -67 -129 -110 -89 149 -273 110 -20 21 -14 34 40 232 376 135 -12 18 -12 -149
6314 -149 258 27 -21 -26 87 161 43 35 72 -24 60 52 44 253 39 -53 -86 -134 -104 45 -205 -145 31 -38 -95 -10 18
6341A8r8p0J47J73k95K11j25J36k1J8o1j22K76n2j52LJ86k56J31o2J32k42J50
6364B5N7j07j55O7J60q2oJ77j14K8o0O8r5k0RJ30m8J64j87j08J29K4M5n1k52M31
6390B29j06l8j35O1j51N4J42k5J55j70j72J27J15o7j77J42j99J14K00R1j55r6
6412f1J03J1l56K24J12%k05r7J82l4K25j99K04O5j22O9n4q3J00K16l16k2R1l5
6436A8j0Q4k14K39j34M7j9r4Q2K72k50j04N4J17j58J22J34q3l78L32J80q9j5K
6460A35lj22K5K8l4m7j69K95j23j45L24J81n38K37m3N3R7j95K4J49j01J07k19
6483h4k0J29L5k18r8L14J05j84J7o3J06j46K37k24R1N3Q8k5l65J98J03j6l8k76
6507b81M22l63J56L19l49M6k9K0P1j13Q9r7N5K3qP6m4j34K01r9J37j76KJ27j04
$$ plain form
6341 18 -80 -150 -3 170 -125 86 -39 97 76 94 33 -89 187 135 -17 -14 172 -84 47 -15 117 -125 25
6364 25 82 -25 -180 -113 47 -35 -41 136 22 50 -10 58 -37 -57 -48 82 34 198 11 -97 32 56 101 50 -202 229
6390 229 123 85 -50 11 -140 -86 56 31 186 16 -156 -29 86 19 -158 -16 -215 -101 99 190 35 -61
6412 -61 42 53 -303 -79 33 33 -172 -269 -87 -121 104 -95 109 174 52 121 67 -16 84 300 -16 -38 53 18
6436 18 8 92 -122 117 -17 30 11 -83 -1 271 21 -83 -29 88 -70 52 186 103 -275 57 237 148 133 135
6460 135 132 10 35 63 29 -18 -187 108 -15 -160 164 345 -193 44 1 54 151 -44 -20 129 28 135 -84
6483 -84 -104 25 60 -158 -256 58 163 -21 -4 -67 39 -107 130 -94 -3 50 138 113 -252 -54 49 33 -5 -281
6507 -281 141 -222 -66 253 -96 -50 -79 -59 12 -101 -12 -109 -54 -31 -39 37 -7 -141 60 -39 98 -78 -76 51 -53
$$ [...]
8191b13
##END NTUPLES=NMR FID
##END=
