##TITLE=1H_DE-80H_X3
 200.13MHz, d2o
 8 sc
 
 19ns.26.2.2025
##JCAMPDX= 6.0         $$ Bruker NMR JCAMP-DX V2.0
##DATA TYPE= NMR FID
##DATA CLASS= NTUPLES
##ORIGIN= UXNMR, Bruker Analytische Messtechnik GmbH
##OWNER= pz
$$ XWIN-NMR		Version 3.5
$$ Mon May 19 14:12:02 2025 Russian Standard Time (UT+4h)  Yarkov@DPX200
##.OBSERVE FREQUENCY= 200.1313
##.OBSERVE NUCLEUS= ^1H
##.DELAY= (6, 6)
##.ACQUISITION MODE= SIMULTANEOUS
##.ACQUISITION SCHEME= undefined
##.AVERAGES= 8
##.DIGITISER RES= 18
##SPECTROMETER/DATA SYSTEM= spect
##.PULSE SEQUENCE= zg30
##.SOLVENT NAME= CDCl3
##.SHIFT REFERENCE= (INTERNAL, CDCl3, 0, 14.3821)
##AUDIT TRAIL= $$ (NUMBER, WHEN, WHO, WHERE, WHAT)
$$ ##TITLE= Audit trail, XWIN-NMR		Version 3.5
$$ ##JCAMPDX= 5.01
$$ ##ORIGIN= Bruker BioSpin GmbH
$$ ##OWNER= Yarkov
$$ C:/Bruker/XWIN-NMR/data/yarkov2/nmr/H-C/1/audita.txt
$$ ##AUDIT TRAIL=  $$ (NUMBER, WHEN, WHO, WHERE, WHAT)
(   1,<2025-05-19 14:11:15.32 +0400>,<Yarkov>,<DPX200>,
      <created by zg, POWCHK disabled, PULCHK disabled
       configuration hash MD5:
       00 E9 B6 7A A2 85 ED C7 34 08 36 98 17 FE 4E 26
       data hash MD5: 16K
       70 59 D9 73 5E 47 C5 38 33 01 15 15 36 13 8D 9E>)
$$ ##END=
$$ 
$$ hash MD5
$$ A5 79 5F FC 3A 6A BA 53 8D F7 6C 6E 98 80 72 5C
##$RELAX= 
##$RELAX= 
##$RELAX= 
##$RELAX= 
##$RELAX= 
##$RELAX= 
$$ Bruker specific parameters
$$ --------------------------
##$DU= <C:/Bruker/XWIN-NMR>
##$EXPNO= 1
##$NAME= <H-C>
##$PROCNO= 1
##$TYPE= <nmr>
##$USER= <yarkov2>
##$AMP= (0..31)
100 100 100 100 100 100 100 100 100 100 100 100 100 100 100 100 100 100 
100 100 100 100 100 100 100 100 100 100 100 100 100 100 
##$AQSEQ= 0
##$AQ_mod= 1
##$AUNM= <au_zg>
##$AUTOPOS= <>
##$BF1= 200.13
##$BF2= 200.13
##$BF3= 200.13
##$BF4= 200.13
##$BF5= 200.13
##$BF6= 200.13
##$BF7= 200.13
##$BF8= 200.13
##$BYTORDA= 1
##$CFDGTYP= 0
##$CFRGTYP= 5
##$CHEMSTR= <none>
##$CNST= (0..31)
1 1 145 1 1 1 1 1 1 1 1 1 1 1 1 1 1 1 1 1 1 1 1 1 1 1 1 1 1 1 1 1 
##$CPDPRG= <>
##$CPDPRG1= <>
##$CPDPRG2= <>
##$CPDPRG3= <>
##$CPDPRG4= <mlev>
##$CPDPRG5= <mlev>
##$CPDPRG6= <mlev>
##$CPDPRG7= <mlev>
##$CPDPRG8= <mlev>
##$CPDPRGB= <>
##$CPDPRGT= <>
##$D= (0..31)
0 0.7 0 0 0 0 0 0 0 0 0 0.03 0 0 0 0 0 0 0 0 0 0 0 0 0 0 0 0 0 0 0 0 
##$DATE= 1747649474
##$DBL= (0..7)
120 120 120 120 120 120 120 120 
##$DBP= (0..7)
150 150 150 150 150 150 150 150 
##$DBP07= 0
##$DBPNAM0= <>
##$DBPNAM1= <>
##$DBPNAM2= <>
##$DBPNAM3= <>
##$DBPNAM4= <>
##$DBPNAM5= <>
##$DBPNAM6= <>
##$DBPNAM7= <>
##$DBPOAL= (0..7)
0.5 0.5 0.5 0.5 0.5 0.5 0.5 0.5 
##$DBPOFFS= (0..7)
0 0 0 0 0 0 0 0 
##$DE= 6
##$DECBNUC= <off>
##$DECIM= 32
##$DECNUC= <off>
##$DECSTAT= 4
##$DIGMOD= 1
##$DIGTYP= 9
##$DL= (0..7)
0 120 120 120 120 120 120 120 
##$DP= (0..7)
150 150 150 150 150 150 150 150 
##$DP07= 0
##$DPNAME0= <>
##$DPNAME1= <>
##$DPNAME2= <>
##$DPNAME3= <>
##$DPNAME4= <>
##$DPNAME5= <>
##$DPNAME6= <>
##$DPNAME7= <>
##$DPOAL= (0..7)
0.5 0.5 0.5 0.5 0.5 0.5 0.5 0.5 
##$DPOFFS= (0..7)
0 0 0 0 0 0 0 0 
##$DQDMODE= 0
##$DR= 18
##$DS= 0
$$ [...]
##$SUBNAM2= <"">
##$SUBNAM3= <"">
##$SUBNAM4= <"">
##$SUBNAM5= <"">
##$SUBNAM6= <"">
##$SUBNAM7= <"">
##$SUBNAM8= <"">
##$SUBNAM9= <"">
##$SW= 18.0517328524113
##$SWIBOX= (0..15)
0 0 2 0 0 0 0 0 0 0 0 0 0 0 0 0 
##$SW_h= 3612.71676300578
##$TD= 16384
##$TD0= 1
##$TE= 0
##$TE2= 300
##$TE3= 300
##$TEG= 300
##$TL= (0..7)
0 120 120 120 120 120 120 120 
##$TP= (0..7)
150 150 150 150 150 150 150 150 
##$TP07= 0
##$TPNAME0= <>
##$TPNAME1= <>
##$TPNAME2= <>
##$TPNAME3= <>
##$TPNAME4= <>
##$TPNAME5= <>
##$TPNAME6= <>
##$TPNAME7= <>
##$TPOAL= (0..7)
0.5 0.5 0.5 0.5 0.5 0.5 0.5 0.5 
##$TPOFFS= (0..7)
0 0 0 0 0 0 0 0 
##$TUNHIN= 0
##$TUNHOUT= 0
##$TUNXOUT= 0
##$USERA1= <user>
##$USERA2= <user>
##$USERA3= <user>
##$USERA4= <user>
##$USERA5= <user>
##$V9= 5
##$VALIST= <valist>
##$VCLIST= <CCCCCCCCCCCCCCC>
##$VD= 0
##$VDLIST= <DDDDDDDDDDDDDDD>
##$VPLIST= <PPPPPPPPPPPPPPP>
##$VTLIST= <TTTTTTTTTTTTTTT>
##$WBST= 1024
##$WBSW= 4
##$XGAIN= (0..3)
0 0 0 0 
##$XL= 0
##$YL= 0
##$YMAX_a= 99874
##$YMIN_a= -107533
##$ZGOPTNS= <>
##$ZL1= 120
##$ZL2= 120
##$ZL3= 120
##$ZL4= 120
##$ABSF1= 10
##$ABSF2= 0
##$ABSG= 5
##$ABSL= 3
##$ALPHA= 0
##$AQORDER= 0
##$ASSFAC= 0
##$ASSFACI= 0
##$ASSFACX= 0
##$ASSWID= 0
##$AUNMP= <proc_1d>
##$AZFE= 0.1
##$AZFW= 0.1
##$BCFW= 1
##$BC_mod= 2
##$BYTORDP= 1
##$COROFFS= 0
##$CY= 83.5205535888672
##$DATMOD= 1
##$DC= 2
##$DFILT= <>
##$DTYPP= 0
##$F1P= 10.8118882576601
##$F2P= -7.23987719738617
##$FCOR= 0.5
##$FTSIZE= 0
##$FT_mod= 4
##$GAMMA= 1
##$GB= 0.15
##$INTBC= 1
##$INTSCL= 1
##$ISEN= 128
##$LB= 0.25
##$LEV0= 0
##$LPBIN= 0
##$MAXI= 10000
##$MC2= 0
##$MEAN= 0
##$ME_mod= 0
##$MI= 1.114404
##$NCOEF= 0
##$NC_proc= 0
##$NLEV= 6
##$NOISF1= 3.799351
##$NOISF2= 2.8
##$NSP= 1
##$NTH_PI= 0
##$NZP= 0
##$OFFSET= 14.38212
##$PC= 1
##$PHC0= -1191.366
##$PHC1= 10.33376
##$PH_mod= 1
##$PKNL= yes
##$PPARMOD= 0
##$PSCAL= 0
##$PSIGN= 0
##$REVERSE= no
##$SF= 200.129724274929
##$SI= 16384
##$SIGF1= 3
##$SIGF2= 2
##$SINO= 400
##$SIOLD= 16384
##$SREGLST= <1H.CDCl3>
##$SSB= 0
##$STSI= 0
##$STSR= 0
##$SW_p= 3205.1282051282
##$SYMM= 0
##$S_DEV= 0
##$TDeff= 0
##$TDoff= 0
##$TI= <>
##$TILT= no
##$TM1= 0
##$TM2= 0
##$TOPLEV= 0
##$USERP1= <user>
##$USERP2= <user>
##$USERP3= <user>
##$USERP4= <user>
##$USERP5= <user>
##$WDW= 1
##$XDIM= 8192
##$YMAX_p= 0
##$YMIN_p= 0
$$ End of Bruker specific parameters
$$ ---------------------------------
##NTUPLES= NMR FID
##VAR_NAME=  TIME,          FID/REAL,        FID/IMAG
##SYMBOL=    X,             R,               I
##VAR_TYPE=  INDEPENDENT,   DEPENDENT,       DEPENDENT
##VAR_FORM=  AFFN,          ASDF,            ASDF
##VAR_DIM=   8192,          8192,            8192
##UNITS=     SECONDS,       ARBITRARY UNITS, ARBITRARY UNITS
##FACTOR=    0.0002768,     1,               1
##FIRST=     0,             0,               0
##LAST=      2.2672688,     0,               0
##MIN=       0,             -107533,         0
##MAX=       2.2672688,     99874,           0
$$ Real data points
##PAGE= N=1
##DATA TABLE= (X++(R..R)), XYDATA
0 0 0 0 0 0 0 0 0 0 0 0 0 0 0 0 0 0 0 0 0 -4 8 -8 8 -8 8 -10 16 -16 16 -22 24 -25 32 -34 40 -44 49 -57 61 -68 77
41 77 -85 94 -106 117 -130 142 -158 174 -192 212 -232 255 -282 312 -344 382 -427 476 -535 604
61 604 -691 796 -935 1120 -1386 1798 -2534 4257 -18850 4098 9908 -27411 35074 87180
75 87180 22673 -25206 56486 91140 -4640 -48829 36577 45761 -63949 -77213 14425 -5284
87 -5284 -86747 -42133 40222 -6010 -56965 32009 99874 8760 -47478 44975 85395 -1992
99 -1992 -28907 35592 27620 -47273 -35081 26012 -6673 -59480 -11536 29234 -26276 -53141 11387
112 11387 40155 -15116 -28340 32756 42399 -7473 2222 45045 15269 -31307 -1404 37706
124 37706 -3573 -50224 -15635 16764 -21702 -38154 8630 25845 -7856 -10488 26795 28412
136 28412 -5199 1813 31799 9819 -26210 -9093 15584 -6976 -33041 -14345 5886 -13384
148 -13384 -21932 8013 14389 -13458 -10111 22782 22843 -5183 -389 28927 17578 -14201 -1848
161 -1848 21157 519 -22469 -6762 4716 -18589 -27456 2507 9476 -19969 -16458 18233 18103
174 18103 -4542 3305 23293 12509 -6223 6950 18591 -4789 -17061 2009 4484 -16569
186 -16569 -18000 2632 4138 -15081 -12299 9546 6380 -7321 2567 14785 4229 -4805 7742
199 7742 17525 1038 -10427 5354 10072 -8750 -12339 2223 1808 -12433 -9867 6323 2856 -9585
213 -9585 1191 13763 775 -6745 6651 11523 -2735 -9196 2543 4459 -9578 -7616 4992
226 4992 -234 -9356 -767 8360 2073 -4996 3350 10423 462 -4693 5255 6542 -3230 -4584 2208
241 2208 1826 -6400 -6026 2583 -1053 -9344 -3541 3911 -178 -4175 1481 7759 3488 -328 7159 8944
257 8944 -230 -919 4550 872 -6407 -6052 -953 -3730 -9693 -4886 1698 -2025 -3590 2844 5372 2219
273 2219 820 5634 7102 294 -964 4875 2660 -3253 -2569 948 -824 -5608 -4152 975 -2485
288 -2485 -6518 -399 2165 -2157 -2148 3437 5056 880 584 6496 4495 -1723 935 3585 -1906 -4750
304 -4750 -1818 -668 -4153 -5651 -336 1321 -2893 -1216 3723 2354 437 1666 3535 2313 -839
319 -839 548 2572 -781 -2657 -341 64 -1655 -2768 -799 933 -1724 -2288 1446 1099 -1517 458
335 458 2716 1579 -355 750 3277 199 -2091 1052 1390 -2609 -2134 304 -137 -2204 -1462 1408
351 1408 705 -1505 839 2585 243 -75 1233 1006 52 -982 -94 438 -1500 -1471 209 -472 -871 -306
369 -306 454 817 -471 -25 2272 771 -353 1146 1177 -174 -835 -260 649 -1352 -2007 436 -171 -1984
387 -1984 -276 951 109 -331 470 1890 1002 -221 1579 1554 -359 231 695 -291 -523 -1084 -684 -552
405 -552 -1993 -1328 -395 -1052 -987 -7 464 910 572 1210 2335 728 579 2140 1328 -294 -526 -119 -299
424 -299 -1605 -1693 -210 -1287 -2068 -125 -185 -786 -83 600 1044 559 381 1738 1193 361 1121 798 52
443 52 387 23 -346 -599 -1362 -874 -700 -1855 -1172 -465 -100 111 -300 535 1589 482 867 1749 370
462 370 24 682 432 -94 -1013 -632 235 -967 -1292 79 -521 -781 136 -6 -456 22 506 904 -3 -122
482 -122 1274 507 -25 689 -91 -316 101 -456 -469 -481 -745 -325 -204 -346 319 -153 456 1370 207 126 1018
503 1018 504 -7 -114 -356 -339 -724 -588 66 -1067 -919 488 -47 -459 121 276 433 524 297 773 252
523 252 43 1134 389 -474 199 85 -508 -629 -1028 -429 -633 -1026 -398 -389 -628 237 530 406 783 551 852
544 852 1282 416 580 571 2 107 -288 -725 -413 -681 -701 -468 -1131 -652 97 -371 -351 -61 72 575 1021 780
566 780 1053 556 844 1002 233 14 71 -283 -436 -611 -1080 -743 -636 -536 -478 -858 -497 273 99 187 538
587 538 137 693 1146 564 639 685 508 413 -197 -158 -136 -522 -425 -133 -1093 -922 -319 -381 -352 -336 -197 719 478
610 478 497 805 581 752 1005 180 373 326 -223 -46 -424 -886 -358 -571 -665 -323 -807 -483 -1 -145 191
631 191 309 33 751 687 535 602 237 550 233 -218 -180 -192 -755 -293 -308 -732 -295 -318 -379 126 -179 60 483
654 483 238 478 421 44 511 513 13 -43 -247 -57 219 -347 -397 -277 -578 -89 -52 -476 333 241 -66 398 262
677 262 235 330 253 398 243 -261 72 17 -461 -90 -289 -333 34 -149 -276 37 122 237 353 -45 268 423
699 423 -57 288 162 -85 106 94 -29 -81 -299 -227 -38 -218 -70 -114 -187 139 167 -277 257 406 -57 205
721 205 242 345 209 -256 164 11 -371 33 -119 -401 -105 -164 -178 261 -25 -67 168 -144 103 292 -233 142
743 142 98 -205 193 -148 -100 139 164 62 216 -99 -29 23 -77 147 -120 -112 -61 -256 -387 -71 -126 -72 126 173
767 173 109 130 -80 388 81 -63 184 138 93 111 84 83 -107 -352 -47 -34 -291 -131 -85 -166 -50 -44 10 435 266
792 266 133 240 91 558 197 -198 64 -319 -510 -53 -220 -353 -54 -84 -202 -71 -190 162 260 46 390
813 390 341 204 403 89 47 282 38 79 -31 -215 -91 -225 -329 -119 -138 -167 92 9 -75 167 243 188 360
836 360 210 398 201 70 360 -82 -397 -141 -260 -321 -98 -393 -274 48 65 76 10 115 361 104 121 555
858 555 301 44 224 37 98 -61 -149 -176 -127 -275 -3 -217 -240 186 -109 28 238 6 158 305 167 271
880 271 182 -144 122 57 -161 38 -113 -316 -46 -120 -115 -29 -184 -64 -33 204 143 -133 -108 141 -175 -67 329
903 329 22 63 166 60 102 -103 -125 -37 19 -373 180 -50 -56 -94 -248 -86 48 -59 -103 -17 25 161 -78 10
927 10 184 112 139 122 -85 32 -43 -88 1 -45 -321 -55 -328 -290 1 -27 -137 157 -85 124 128 124 204 270 263 237 155
954 155 -22 140 -50 -15 61 -127 -99 13 -118 -21 -41 -195 44 6 -49 297 -33 48 401 81 -6 418 -2
977 -2 -99 39 -324 -180 -267 -182 20 -118 95 121 -215 94 248 2 272 228 125 271 124 85 62 -103 -133 -52
1001 -52 -199 -141 -166 -348 -86 -159 -48 -90 -49 107 261 54 243 183 168 104 90 -49 12 -219 -76 -113 -219 -57
1025 -57 7 -198 -22 -72 -196 -6 44 -145 312 235 99 64 167 195 158 -80 169 -1 -191 -113 -56 -269 43
1048 43 -28 -238 148 9 -117 -75 30 218 106 159 198 231 17 25 138 -157 15 -102 -157 -60 -287 70 101 -195
1072 -195 84 -149 -40 111 50 -49 301 38 -95 112 245 123 148 9 230 -27 -143 6 -185 -346 24
1093 24 -123 -73 33 -302 -76 175 156 236 171 39 103 122 -33 85 -77 -68 -22 22 -25 -176 -231 -75 41 -272
1117 -272 -155 -47 -102 -19 105 158 -1 136 107 92 146 299 -65 -68 40 -17 -121 -114 -195 -237 -189 -95 24 20 -104 77
1143 77 -128 -27 184 184 68 121 -44 -66 25 -135 -75 2 -176 147 -247 -231 63 -85 -216 125 82 161 168 38
1167 38 173 64 234 126 125 -172 119 57 2 -9 -115 -154 -248 -128 -267 -19 -161 -168 38 -74 182 129 128 96 24
1192 24 101 198 53 191 70 -74 60 1 -80 78 -61 -256 8 -54 -49 -64 25 77 154 -9 66 -5 -9 171 5
1217 5 -30 -6 28 -54 -146 36 -183 -55 -104 -52 -168 -55 28 26 -124 85 -75 -96 21 69 214 -13 57 278 -34
1242 -34 -105 46 174 -10 22 -142 -63 -166 -240 -116 86 40 -253 63 3 25 124 -14 133 107 -30 96 -188
1265 -188 30 203 -142 31 -95 -72 -116 -263 -79 -4 -208 -41 -75 -179 123 185 163 141 54 -55 85 58 -28
1288 -28 160 -144 39 141 -178 -177 77 -99 -57 120 47 85 49 111 106 -111 -29 157 -78 -11 61 -75 96 -100
1312 -100 179 -79 -6 -11 -248 -100 -49 -134 -100 -50 -62 -26 -35 -3 -20 69 132 42 127 82 -2 134 67 -19 -163 -209 -118 -93
1340 -93 44 119 -71 45 61 -72 260 81 -92 183 136 -75 211 26 109 53 -146 -202 114 -173 9 62 -158
1363 -158 113 26 58 41 40 145 110 -60 -1 212 -119 -50 -35 -52 -8 51 -43 -104 -52 -82 80 -255 12 96 -91 277
1389 277 156 148 133 76 -18 162 120 -81 -38 20 75 -64 -217 90 1 -73 29 -117 -240 35 75 11 90 52 95
1414 95 176 -2 97 48 33 32 -58 -36 8 -90 187 -33 -189 -132 98 -135 61 -9 -20 -39 73 -12 -76 45 51 108 104
1441 104 67 54 9 -32 -243 -143 86 -168 -245 -240 -125 -140 34 -48 65 -27 -118 173 -38 154 133 72 -37 -58 10
1466 10 -183 114 19 -65 -194 -61 -5 -157 -141 -4 -102 -149 156 -57 -34 150 70 53 75 23 0 63 -16 -119 -34
1491 -34 -80 123 -97 -74 123 -229 -154 14 -43 77 27 -68 -65 101 28 107 95 15 -82 53 119 83 -159 -9 -100 -329
1517 -329 61 -71 -109 -136 -47 -50 129 -33 58 101 23 150 96 -28 46 -82 64 11 -5 -94 -73 -82 29 -68 -128 -36
1543 -36 -91 -109 -86 16 152 239 234 -26 -144 -1 15 19 -71 47 37 -69 -7 -41 32 -66 -28 6 -83 -10 -100 -74 62
1570 62 -34 -6 150 112 -131 -34 50 160 -157 67 -154 120 -71 -97 116 -25 -205 -63 -5 32 112 -33 147
1593 147 19 -25 -25 112 -16 91 55 -31 133 -119 18 -94 -210 82 -76 -80 -91 41 150 113 115 50 165 206
1617 206 -28 -112 75 61 3 -51 -98 -43 10 -130 8 123 -107 -116 -89 -23 -13 -110 -37 -132 58 -29 -23 -99 -64 73 47
1644 47 -142 -138 21 -22 21 -66 -25 314 20 -155 -24 -78 -134 132 17 -17 -50 -99 52 -50 -121 40 85 -24 -39
1669 -39 -144 -118 45 279 -21 98 -45 -66 252 51 71 128 -155 -137 -130 89 35 183 -18 -89 112 -78 -106 -53
1693 -53 -89 -130 116 71 -83 84 168 20 -42 -182 -17 33 153 87 19 24 -33 -60 80 -28 -201 -113 82 -107 -30
1718 -30 9 53 -42 72 -66 -48 120 -63 4 86 92 -7 114 -166 -27 -34 -43 3 -6 -87 -27 -173 71 -146 -95 -105 -151
1745 -151 -257 170 43 -53 109 148 170 73 51 192 71 -67 -2 54 47 3 88 -81 33 37 26 -141 -35 -36 80
1770 80 99 82 165 71 3 106 7 -11 -51 71 15 -64 -84 -127 111 36 138 -88 -31 108 -128 77 200 -36 90
1795 90 -93 -117 13 -26 62 50 -116 86 -119 -47 -177 25 74 -97 -165 57 64 15 -109 -52 117 6 46 114 2
1820 2 -101 -38 -64 9 105 -46 -64 -83 52 -43 18 121 183 2 8 -85 -81 -130 -79 -3 -2 -62 78 122 12 3 64 38 -80
1849 -80 -162 -153 -29 -67 45 -157 48 -64 -133 93 99 -115 5 -29 83 29 -3 -146 -169 72 -155 -69 167 41
1873 41 -95 -243 -18 154 4 63 -28 -103 -1 19 80 21 -5 40 8 82 59 -94 29 -101 -118 -172 113 27 50
1898 50 244 2 130 8 -125 -68 106 -133 30 -191 -71 97 -53 27 -1 -13 -174 177 50 -24 -218 -145
1920 -145 68 -196 -189 -32 -92 17 -7 -3 18 220 -118 104 -28 23 -64 3 77 138 30 -103 26 -100 -5 -209
1944 -209 -94 -80 -162 82 12 -168 65 54 37 -63 48 21 31 59 -82 85 -87 -129 191 -91 48 -19 35 138
1968 138 52 -102 73 45 -34 -6 -98 67 -21 -100 -23 -54 -23 12 84 21 -112 37 64 21 -106 -11 -3 -240 0 18
1994 18 -101 -52 47 -58 97 13 -2 -4 -104 98 130 122 -26 36 46 -11 -64 -144 -38 9 14 22 -80 47 -40 77 194
2021 194 -124 32 47 116 -109 21 -2 -122 -103 88 65 -73 -88 1 44 -3 -28 -156 -39 120 128 102 31 -108 -21
2046 -21 79 43 -49 -30 -46 -137 118 -45 -72 161 -98 55 -69 95 110 -119 33 248 -180 184 -117 29 35
2069 35 -36 24 -89 100 226 -54 -69 -20 -68 -19 -130 86 -38 25 -66 52 15 22 -21 -125 62 75 0 -41 -15 -4
2095 -4 -4 96 -61 61 110 -108 -2 -25 -38 -112 143 -65 -65 112 93 -7 55 52 139 -29 12 160 -69 -71 7 -40 66
2122 66 208 -176 120 -14 -61 -89 130 -64 183 -35 27 159 37 11 63 -12 24 -82 -84 -33 -11 80 27 165 -46
2147 -46 -29 28 -58 47 7 211 59 -52 98 -142 59 -133 7 28 -164 23 29 -111 -99 64 -75 -102 197
2170 197 -22 29 -42 32 74 96 17 -125 77 -27 -55 0 -10 63 65 -11 -6 -16 20 -4 -38 115 -53 -15 -91 92 57
2197 57 76 -34 94 50 -125 -10 -44 61 107 -162 -22 31 37 22 -77 68 -39 -129 -28 60 99 63 -52 8 -57
2222 -57 25 44 -129 -116 34 -37 -87 -16 -89 -74 36 216 75 -126 157 -29 -98 63 -19 -124 -68 57 154 -15
2246 -15 106 59 -54 10 -101 -60 -60 -65 -68 131 112 107 138 61 -98 12 -79 86 -17 153 68 -70 -49 65 -143 -217
2272 -217 133 -127 61 -200 41 -62 46 9 -165 -48 -21 -72 -60 103 109 -63 72 -69 36 -28 161 59
2294 59 -13 -68 -11 -63 -17 20 -111 98 43 33 -92 31 89 151 96 59 34 29 -152 -135 55 6 126 121 25 69 76 110
2322 110 54 -162 -40 -72 -192 127 35 -66 26 -31 -212 -71 -22 279 -175 50 -53 -90 -133 -29 43 68 -177
2345 -177 -20 61 -82 85 -25 -151 -12 92 24 203 118 17 -128 37 -58 -22 10 20 -94 67 -92 -53 -74
2368 -74 82 -10 -143 61 -87 32 154 -129 -54 52 -19 13 35 17 90 -69 70 -109 52 216 -15 -144 2
2391 2 -21 107 -65 150 92 36 -182 -38 -20 21 88 161 21 -2 45 -24 77 -91 83 63 103 158 12 123 141
2416 141 53 -37 -36 7 -52 -84 -76 3 -55 28 11 -115 -76 -55 68 -48 -200 -88 -80 16 133 -2 -61 113 122 38 158
2443 158 -49 147 -28 9 -63 17 5 16 -70 -78 -82 105 -131 -59 28 -24 -24 -56 -54 35 61 -211 20 13 13 -19 64 -226 -80
2472 -80 96 -21 151 -6 105 6 125 -62 -100 -3 39 226 57 2 -50 66 2 86 103 -149 -46 116 67 -67
2496 -67 115 139 49 -18 36 73 -15 -28 -88 -19 -223 150 36 2 -110 3 -31 62 -4 34 -148 -130 55 12 128 -287
2522 -287 26 127 31 -192 -55 20 -35 -166 137 109 129 4 90 -2 164 97 31 25 -41 -150 17 26 -58 -109 -84 12
2548 12 -47 39 -96 -57 -49 -27 -253 46 -184 -68 107 33 -2 -35 -106 16 -66 67 76 -139 -118 35 46 -31 138 129
2574 129 -35 70 47 -92 -217 -61 18 155 -8 -15 93 26 21 -208 -22 219 36 11 -46 98 143 -122 -8
2597 -8 18 106 138 -74 -4 45 60 -70 -95 -168 -21 -87 -31 16 12 -87 41 -20 40 87 -12 76 12 -156 37 119 -24 -89
2625 -89 -126 -38 -116 -15 -149 -189 192 -23 -35 -154 -8 -19 -41 21 -41 -156 -66 9 -2 64 77 76 82 -93 -60 -33 219
2652 219 -57 -89 114 141 -60 118 38 66 -162 -154 -155 55 -65 -183 48 -250 -42 26 58 -100 21 -105 113
2675 113 121 -1 -33 139 -84 131 1 -54 120 -86 -71 -66 11 25 -127 -103 -34 113 -63 -41 87 31 22 -21 85
2700 85 11 -29 -28 14 -113 131 118 177 -25 135 126 -62 -51 -121 40 98 -5 174 -66 -75 -30 47 47 47 32 -27 137 -84
2728 -84 20 -72 -6 214 -85 207 163 -102 120 169 -24 68 -13 59 169 -119 99 104 174 -29 -46 -79 27 86 116
2753 116 145 -143 125 -5 195 -3 -17 66 46 -131 -139 25 -84 81 190 98 47 -154 -24 54 61 112 2 -46
2777 -46 -171 69 -42 -33 159 39 -84 55 136 -2 -64 -202 -88 46 -42 231 -167 26 85 -34 29 -99 57
2800 57 -81 4 -42 -17 25 52 -68 -172 103 -2 13 -9 140 12 141 -78 30 -61 -9 -37 5 -93 54 -78
2824 -78 20 -6 -38 -106 -102 60 84 53 -49 -46 41 10 71 -61 69 -117 -175 70 59 -43 -68 31 -88 -52 -11 -27 -83
2851 -83 66 168 104 21 101 -72 50 -9 156 82 51 -123 13 -38 -2 69 -180 103 -21 67 -5 -1 -45 59 -64
2876 -64 119 44 -149 62 112 28 3 -35 -37 -142 53 25 -9 40 16 -95 -110 -28 -44 77 3 -111 73 102 65 43
2902 43 75 -73 -152 38 -116 -108 47 75 -37 41 49 34 -36 36 -5 -189 -2 31 132 -16 -133 83 -6 156 68
2927 68 75 -105 11 -113 -36 0 9 -18 -70 117 9 103 -123 -13 141 142 -91 92 38 181 30 -141 20 -50 159
2952 159 136 -39 8 -12 -11 24 -15 143 3 31 -20 85 9 -33 -68 125 -56 -25 -51 -50 96 -174 13 -69 -16 -40
2978 -40 -125 -12 84 131 -58 38 -51 -66 59 -104 -39 115 -7 54 24 110 -52 -4 -117 69 2 89 81 -14 172 31
3004 31 46 -5 100 -93 86 -124 -30 -21 80 30 -5 0 36 -291 24 -48 98 168 15 35 -26 89 120 50 -74 42
3030 42 -130 -25 -48 1 79 -124 -34 42 -78 -162 177 -108 -5 -65 -156 26 -103 -7 34 71 -29 -54 29 -45 21
3055 21 -12 -78 148 23 -36 63 50 -8 140 120 -17 94 8 65 -39 -4 4 117 85 77 92 110 -31 -131 60 -61
3081 -61 119 16 89 131 -214 37 49 -117 -135 125 -3 -33 -79 10 -212 -93 3 37 152 -68 -20 -20 37 119 -1
3106 -1 169 58 19 142 16 -32 139 -183 -262 -73 -103 -26 -162 -5 79 -81 -2 -19 -40 -108 30 17 -16 -68 -77 11
3132 11 41 -131 -81 86 -18 -7 134 -37 -9 -113 65 -169 -233 33 -75 134 -12 -28 -130 9 89 36 -46
3155 -46 -89 65 72 -26 96 6 -20 7 -66 8 43 32 -115 -69 112 84 -11 127 -124 -39 -123 -185 -71 28 7 -6 93
3182 93 104 -14 -27 13 250 62 53 -27 18 -86 -36 35 -35 -75 87 -68 73 146 112 69 89 108 -90 11 -44 10
3208 10 38 -67 -60 30 -7 148 -91 -24 -39 -119 46 112 30 -217 100 -24 -125 49 -16 -133 60 -82 114 -23
3232 -23 -88 -21 -31 21 -55 144 -82 -112 -43 13 -171 33 -43 -80 6 194 13 -241 20 -182 124 3 88 16 14
3257 14 -177 -167 -129 -44 -75 10 58 26 -119 -148 -106 -6 169 -42 -91 -132 111 -63 -8 -37 134 -39 28 -16 -179
3282 -179 -43 -73 -74 -34 201 22 48 77 -58 3 23 106 -163 121 41 92 22 47 -194 -72 99 -26 178 -184
3306 -184 -16 100 127 -77 -80 -41 145 49 27 120 -27 -37 132 -66 64 103 -38 -6 -68 -73 -230 121 -114 73
3330 73 -60 61 57 -59 63 82 -73 73 36 -79 86 21 15 138 -16 -100 -22 9 -89 9 -91 98 32 74 19
3355 19 103 47 -202 58 7 -197 -52 -187 -114 -70 -27 -61 25 64 -41 75 -149 54 -109 -123 -8 -3 113 24 203
3380 203 80 31 157 119 75 16 -121 -68 -60 -71 123 -27 181 211 3 -143 -87 -225 35 80 -18 -105 37 -159
3404 -159 55 -44 66 89 -8 49 98 172 -40 -29 5 10 13 61 48 70 -95 6 133 -56 16 -23 -18 -16 49 73 -107 -57
3432 -57 -176 -84 43 -107 55 133 49 -117 20 -108 -64 21 -122 -10 136 -37 -74 -11 -128 65 110 -157 104
3455 104 0 -96 -34 36 -65 -88 29 -95 114 46 -1 -56 3 -115 -48 -105 12 -13 -118 -8 -14 -30 -4 1 -22 -91
3481 -91 -47 26 -112 35 10 29 40 -75 -197 -10 -32 72 -48 86 93 -45 37 227 81 -28 -57 4 -176 -33
3505 -33 44 135 -50 56 -4 -44 -171 -51 -53 14 77 -138 16 42 -20 -13 -67 -12 128 -205 -149 78 -54 -135 -120 43
3531 43 56 -155 -41 -63 -139 -168 79 218 16 0 132 -108 294 -43 -121 -111 -20 -14 -16 -166 -151 -117 -133 52 1 35
3557 35 -97 -18 -45 -136 -43 113 -55 0 -82 -113 -85 -123 -114 -104 -27 10 -120 -78 -44 -90 -66 78 -38 -124 88 -59 0
3584 0 -53 -1 34 39 -70 0 100 -12 -140 17 -90 -3 12 -161 100 11 -66 6 -104 12 -11 -85 -15 -6 112 -125
3610 -125 76 -38 57 10 114 0 12 5 62 82 -107 53 26 -3 -149 105 -94 6 98 42 -27 153 -22 -183
3634 -183 -15 -181 -40 33 11 -105 243 17 73 95 -34 34 -92 -147 137 -69 61 -8 -65 -21 -55 99 -33
3657 -33 -141 32 -158 55 -7 -27 30 -57 22 -90 -50 52 48 -136 23 -148 78 107 -146 67 -115 -71 -101 -131
3681 -131 148 183 -7 12 -66 24 83 -29 -6 -47 -37 80 116 -2 31 -23 -50 60 -15 -116 101 94 -36 -40 161 87
3707 87 250 61 -39 169 -23 -9 63 106 -11 -106 -10 28 -154 -82 -6 -24 65 -64 45 -111 -205 -48 139 73
3731 73 -57 78 135 -55 53 -42 -130 -16 -43 -91 -32 92 40 -181 4 145 82 -124 7 25 10 31 -125 -155
3755 -155 -131 21 -80 4 136 -21 -83 -45 -94 9 -106 -42 56 -3 -67 -97 -139 32 60 -64 115 14 -94 -157
3779 -157 -90 51 -81 82 -26 -130 195 86 53 -65 -99 -98 129 80 25 171 -23 48 -65 37 -2 -54 -99 -9
3803 -9 -29 -67 4 -41 80 -116 191 40 -29 -120 41 11 -49 -13 38 97 6 59 -29 -48 -15 -123 73 -86 -204 72
3829 72 69 119 -168 -12 106 -45 59 -30 89 -122 -33 -151 -135 57 80 32 -36 -36 153 55 -102 -160 -25 -29 -66 -74
3855 -74 -142 -126 144 -44 2 38 45 7 -17 -16 -95 -29 23 -169 132 115 48 -81 -119 66 133 -57 -84 66 116 183 6
3882 6 128 -103 85 -53 21 -31 96 -3 -31 177 100 -18 6 -6 180 30 -110 95 34 -42 13 149 -114 100
3906 100 -10 -17 -102 -25 -146 -26 -62 29 35 -28 22 99 20 -21 49 -161 33 56 154 -65 91 -120 -128 -71 94 178 -90
3933 -90 -3 -306 71 44 -40 148 -9 89 7 -12 39 -57 28 -91 21 -95 -107 -36 -64 -90 -27 14 -56 -14 20 -64 55
3960 55 -124 -18 -55 124 -141 48 100 -33 32 234 85 73 89 151 77 -19 57 189 0 -90 18 74 -99 16
3984 16 99 -175 0 152 -49 -92 -28 74 -111 -35 65 20 45 37 -132 -144 -55 58 -85 -58 10 -70 -135 36 -78
4009 -78 51 12 -114 -165 -13 70 7 31 -49 -26 -23 174 17 -9 -142 4 118 8 50 -6 14 10 81 8 -139 -57
4035 -57 -90 -45 54 -98 100 -150 -85 -47 -15 -13 24 -98 -19 -22 43 53 62 60 -79 36 -5 57 -80 190 52 -82 -126
4062 -126 -20 91 -55 111 -2 88 -75 99 11 10 78 -204 -44 40 -55 -2 -111 -6 -29 100 48 -69 5 -117
4086 -117 -32 -19 80 50 23 0 59 -51 4 2 41 -22 47 40 -3 -94 -37 12 -40 89 131 -23 -51 -18 -162 83 61 -49
4114 -49 139 160 30 41 104 -39 -204 -174 -79 -2 -198 84 91 -32 151 45 -127 146 -65 47 -69 141 59
4137 59 -41 104 86 61 41 -24 38 -100 -66 166 51 19 -92 106 -30 166 -140 -71 6 -33 -3 -35 37 56 -43
4162 -43 127 76 124 -22 -127 -2 74 -14 -7 -163 -34 135 114 225 24 -66 0 -22 -34 -1 -83 -10 72 -126 -35 17
4188 17 -58 94 42 34 26 -32 -8 -177 -67 4 2 18 8 -38 -72 63 -90 -31 -31 3 -60 72 -28 184 -76 -68 86 -89
4216 -89 -13 -138 -21 139 18 -36 97 56 31 -6 -59 -19 84 185 47 78 -67 -87 -29 59 18 -78 13 -211 -65
4241 -65 44 -93 40 -67 -48 -73 64 -15 130 -31 -97 177 131 33 -110 65 66 -106 -4 -8 15 -178 47 46 -15
4266 -15 -79 -59 -32 18 6 75 -41 64 -21 -69 -41 -149 -53 33 105 80 69 53 10 -48 266 -8 43 45 -2 59 -102 46
4294 46 183 -4 112 73 -42 66 135 19 -146 52 91 50 143 -59 -3 -59 -86 68 -74 94 154 53 -21 64
4318 64 17 -29 64 103 -155 -19 38 27 21 -81 15 80 -33 -73 -96 134 53 -193 -52 45 -165 -13 33 4 80 47
4344 47 5 79 155 -11 -30 -22 27 -93 122 -13 -2 28 49 -74 27 100 -86 29 -53 33 -6 -43 31 -77 63 11
4370 11 28 136 62 -134 92 77 -107 8 42 97 49 6 8 -140 -163 -17 -38 175 40 12 -126 -53 36 -42 -84 -110
4396 -110 177 107 81 70 42 -141 187 1 -36 -35 -91 -13 -35 -114 -26 33 61 -118 -42 3 -119 -52 18 -37 18 -145 8
4423 8 -14 -114 -176 -85 -124 100 -31 -12 -38 -163 -42 -47 42 -125 73 -35 156 -106 -29 -17 35 -12 149 65 -98
4448 -98 71 57 -80 213 18 -38 -200 -40 91 144 56 -54 -24 -48 75 -68 77 260 -85 73 90 -49 -87
4471 -87 25 34 34 -92 46 136 30 0 -163 74 122 -10 4 9 90 -101 -23 52 -47 -59 39 70 125 -62 -4 91 112
4498 112 8 -140 89 -196 69 -96 -122 -49 57 51 -37 -63 26 129 -20 -1 74 37 -36 78 -118 -13 -12 -108 -83
4523 -83 -107 28 168 -54 -138 86 -24 -101 -68 -86 -42 -38 -65 25 -160 64 87 -36 84 32 -8 12 -70 151 139 42
4549 42 -140 -62 -48 -90 -102 169 -54 -100 -31 33 32 97 -35 106 -3 -67 -11 -119 -80 -60 18 -9 44 -70 25 179
4575 179 141 17 -72 82 -68 -84 -47 -180 32 -49 18 92 124 118 61 -3 143 -20 -46 19 -44 59 -235 70 42
4600 42 43 -36 71 45 -26 96 94 -3 -241 -148 45 29 8 188 -101 -84 37 -49 125 152 -80 103 -51 -48 -33 166
4626 166 17 7 -137 -17 175 76 -47 32 203 -14 -69 -81 -36 37 40 68 21 -72 21 71 140 -16 -20 25 -17 -4 129
4653 129 -141 -33 4 73 -8 -100 56 -6 75 167 73 -5 47 54 164 -41 -23 -60 -80 -124 -41 -175 -43 -27 6 30 69
4680 69 129 77 -80 190 -32 57 7 99 94 77 -91 -28 40 32 -73 -93 17 171 52 221 25 -90 -163 -79 143
4705 143 -212 77 -185 97 -35 -41 26 -14 -19 -175 -42 -111 98 64 100 -71 29 -79 43 -17 -18 48 -7 160 31
4730 31 60 132 -152 -81 -30 -75 -17 -126 5 16 57 -100 -37 -61 31 -136 172 9 -107 93 -31 159 145 8
4754 8 -134 86 -59 17 -46 74 32 92 -189 -22 21 82 10 70 -147 -154 87 81 -50 -97 47 7 -21 -17 -27 -16 47
4781 47 -53 -53 53 165 97 115 -120 54 -61 -157 108 12 -31 172 -34 25 -118 53 45 -59 0 -132 10 65
4805 65 89 -88 99 -51 109 -42 -126 21 38 -86 -23 109 -7 47 75 138 8 71 -68 -138 -11 63 27 5
4829 5 22 -114 84 -19 12 -49 -35 1 -62 11 108 69 -44 65 -206 46 -19 -102 36 81 -120 54 -95 86 -48
4854 -48 3 109 22 36 -54 -99 81 56 167 17 108 50 107 184 116 27 65 130 47 78 -172 -81 -124 78 -199 -48
4880 -48 -191 -40 -19 -237 -225 123 -46 74 52 -195 15 -66 -136 50 -52 53 117 -9 103 115 224 -34 89
4903 89 13 -21 56 -55 39 58 21 -56 57 -163 -6 94 -27 -109 21 147 -73 110 -64 -98 -55 36 68 76 -29
4928 -29 261 17 68 4 141 111 -36 1 47 45 46 26 -3 62 -18 -1 -67 75 -82 105 136 51 1 70 -6 -90 135
4955 135 -86 -133 42 100 -82 127 -16 -142 -1 1 -50 79 47 87 -39 -51 -124 154 -107 80 -23 -157 -27
4978 -27 -185 35 196 11 -140 73 -43 -58 69 3 145 21 -14 -33 0 -18 67 -135 5 -146 -27 29 10
5001 10 -8 -120 42 -30 67 44 28 50 32 -101 66 35 10 -72 -5 18 -4 -149 42 33 11 157 38 -91 -51 86
5027 86 -2 -32 105 -62 1 -108 -17 -120 100 58 29 16 -184 64 43 -154 -20 -18 -127 116 -180 137 87 25
5051 25 22 -26 -22 26 12 56 -86 -90 -24 0 -39 31 128 166 77 65 -31 23 265 45 55 81 -240 -132 18 106 -77 76
5079 76 -71 18 -146 -115 59 -247 169 -2 -32 17 -1 74 29 209 25 103 113 -6 -50 41 26 -147 -265 -3
5103 -3 -32 71 -67 -90 -46 104 -21 -105 31 20 10 -7 47 19 7 -149 15 169 90 -26 35 93 -27 93 -147
5128 -147 75 172 -92 -35 24 45 -136 -75 10 132 -18 -271 59 92 -45 -20 104 75 -50 105 201 -12 38 -2
5152 -2 118 39 -171 38 4 118 -98 -31 15 122 65 -16 38 -68 69 166 -4 -75 2 -125 1 79 -79 -94 67
5177 67 146 -44 2 -65 25 -173 -89 209 -121 64 -50 -23 67 -25 -81 -7 -54 29 122 -65 6 85 -55 -52 10 -66 -18
5204 -18 -219 29 25 112 -24 -52 -93 -107 123 73 -224 73 -152 40 -38 -123 67 79 -85 -3 -216 -63 -56 -138 -141 -2
5230 -2 85 14 1 -29 198 61 -54 6 -21 -31 72 87 49 84 -17 17 69 -160 26 16 183 127 122 8 -33 9 94
5257 94 108 25 -37 -54 -91 8 46 -95 68 -75 -86 15 -53 -29 149 50 110 -87 -23 -89 -56 -129 -14 -39 -6 -13 33
5284 33 -56 92 123 -63 -35 63 -102 -44 -99 -2 95 12 58 -48 67 -139 60 -53 -44 1 -6 -182 -69 53 100 152
5310 152 -117 6 86 135 -90 18 18 47 67 119 -165 187 -138 -296 -111 59 -78 -43 -118 -114 46 -19 6 54 19
5335 19 55 129 181 -25 41 -64 -71 33 257 60 -33 -84 134 -98 -169 61 -47 1 -201 41 -44 -98 -27 7 -118
5360 -118 -50 -85 84 153 146 77 98 -141 74 79 127 -61 -55 -143 -163 35 -89 -62 42 54 140 -40 -27 168 205 -6
5386 -6 -41 87 -60 229 139 70 39 1 7 44 38 -31 112 -38 31 -2 25 -49 131 -55 -94 105 -31 -45 39 3 58
5413 58 -48 21 109 61 9 -109 59 104 -84 65 -65 -41 -80 60 -15 26 -95 -158 15 -120 -23 5 121 -104
5437 -104 28 -63 0 59 18 -29 89 66 -110 -5 -33 -29 -65 181 16 25 88 -60 -125 -81 -79 9 -131 5 101 -115
5463 -115 -10 101 -46 38 21 -56 -124 -36 -130 119 -80 -77 97 -104 -98 -57 -45 -176 -142 -76 54 55 -221 147 -77
5488 -77 11 12 -37 -56 -38 -135 -191 -64 1 29 41 147 14 -16 106 -18 -17 38 83 -163 71 -58 -101 -80 22 19 -51
5515 -51 -12 30 -181 -55 158 -143 -73 -41 -18 80 11 -53 38 -7 27 16 67 -4 32 -164 -25 91 -6 46 -59 -38
5541 -38 -162 24 -2 -121 -70 2 -215 171 -20 -88 62 -4 113 -76 -63 -108 -16 14 167 50 -62 -165 -45
5564 -45 51 78 -33 -71 103 4 21 -75 11 9 -92 -4 -96 4 -69 -99 -48 52 -99 -6 6 20 128 28 168 -52
5590 -52 -211 -79 -122 -210 -122 -14 -28 137 -186 12 -70 103 -124 105 13 1 63 122 116 -145 13 -84 16 52 50
5615 50 -150 88 -58 64 -64 7 -63 -7 8 7 87 -37 -126 81 63 28 -160 27 -112 -10 41 -145 -51 -121 106
5640 106 -89 3 -2 -69 -108 -7 -250 -72 -186 -15 129 -23 100 -149 87 198 -47 -49 87 -80 74 144 45
5663 45 -76 -25 33 83 -140 -55 -262 54 79 158 -123 -8 -126 154 115 -117 30 -87 -38 62 -61 1 171
5686 171 -64 -68 29 75 -45 33 166 -78 12 10 95 79 -43 15 -68 -22 20 3 37 22 -68 -181 -118 70 -135 70
5712 70 -7 162 200 72 -103 51 135 3 -72 11 -38 -82 60 41 -52 122 -70 -97 81 -10 -44 -75 -35 -60 4 37
5738 37 -18 102 44 45 -106 3 -107 -79 113 30 -211 -212 -45 52 -29 -16 -92 -51 197 -95 106 -3 32 58 32 61
5764 61 -82 167 -21 56 2 -48 23 104 4 57 -21 -234 -22 -35 107 130 126 -73 -208 -2 -78 339 -79 -29 48
5789 48 37 -50 -157 -48 -36 -180 181 89 2 68 68 -58 5 17 47 -17 -55 182 -99 -3 78 -127 -43 53 34 -51 -2
5816 -2 142 -71 -71 44 -118 110 -58 -74 -20 38 21 51 11 174 248 145 -26 -66 -91 -43 -9 -83 -111 -71 88 126
5842 126 -79 -52 -27 34 -126 111 14 96 72 61 225 -55 13 -124 -101 -161 13 -29 1 44 84 -38 123 34 -189
5867 -189 -146 -153 -52 49 -32 -267 -47 174 -39 -151 149 25 -126 -32 76 150 92 -99 -22 94 14 16 9 76 28
5892 28 162 47 49 77 221 -5 4 -98 3 223 25 -43 -6 -113 8 83 30 177 11 -63 -55 12 -63 68 90
5917 90 6 36 104 -40 81 39 -78 -43 -67 -11 65 60 -82 -43 -107 42 -32 150 81 66 -107 17 35 110 117 40 -15
5944 -15 -94 5 3 -73 79 35 -216 47 -13 -39 89 6 22 -87 -66 -14 72 50 -13 67 133 -64 -53 -58 28 -10 -18 50 89
5973 89 41 61 52 -5 111 152 -6 -79 7 -45 10 29 44 45 39 -45 -32 93 131 83 -55 -4 -55 19 229 -9 30 89 103
6002 103 -60 -100 -69 -101 63 -95 33 -21 -14 -55 70 46 -86 50 -95 5 -51 89 6 91 62 73 -123 100
6026 100 -106 -46 111 41 -103 40 22 1 84 -15 -26 -76 141 -102 28 -181 35 -43 23 -4 -81 23 -62 34 -21
6051 -21 -214 -80 34 88 -81 -74 -14 131 150 48 51 19 136 -116 -21 58 -187 -83 76 181 32 168 -72 3
6075 3 -51 -11 122 48 -70 105 89 120 -72 -141 -11 -221 74 16 -88 88 18 -29 -55 -20 -46 140 -67 99 30
6100 30 40 14 -77 -76 148 -232 87 -107 -86 -46 -44 -20 -57 201 62 -78 87 34 -81 45 123 22 -31 142 -38
6125 -38 -55 31 17 -61 -25 104 -146 -26 197 183 -2 10 -105 -218 -51 148 -98 132 118 10 -59 136 -52
6148 -52 120 -75 -127 47 -107 32 119 58 -91 -62 -101 154 -130 17 -2 2 53 59 9 -66 64 70 -26 -202 -56 -43
6174 -43 135 -127 51 117 97 107 -61 -57 3 69 230 21 16 101 83 -9 145 184 7 -35 -39 -15 -6 89 8 -68 57 -50
6202 -50 -4 62 11 2 -137 5 -203 -6 -51 -28 -86 -71 -126 -163 -91 -183 -106 99 95 -50 -55 117 -98 121 -65 -230
6228 -230 113 62 26 -29 56 -15 134 -100 5 -15 -71 -116 -22 120 74 110 -112 -53 50 -15 150 -179 146 75 -1
6253 -1 180 30 -40 57 -108 -23 165 170 56 -157 -44 -52 52 -37 44 -76 9 -67 -119 -111 11 111 -153 -37 63
6278 63 -168 33 30 -141 65 84 -177 -208 -66 -71 -89 10 50 -21 -17 -83 46 -5 -4 91 32 85 -83 -156 76 197 52
6305 52 13 37 205 -67 88 33 -38 37 -6 -22 75 -13 199 -8 4 -61 50 -103 14 -14 39 -19 -47 -65 -133 -45
6331 -45 38 27 -46 196 -62 0 42 88 43 106 93 44 158 16 -206 -48 -54 115 -61 -69 -118 -4 -106 232 -88
6356 -88 36 149 -4 6 10 131 -52 -156 -31 -28 -10 -1 127 123 2 43 -22 -10 37 115 13 43 -44 -14 121 -57
6382 -57 -134 28 2 34 -160 83 -28 110 29 145 -23 47 25 -103 117 52 135 115 -65 43 -96 -99 41 -86
6406 -86 -130 21 -24 15 72 -37 27 -74 -13 37 -292 9 161 -131 49 26 -99 80 21 -105 -104 51 106 103 105 66
6432 66 -79 -43 -188 35 -88 -105 -191 100 198 161 7 71 124 -79 -48 12 -79 -68 88 71 -6 -113 -198 -31 131
6457 131 -2 39 13 -54 -220 -13 -79 -81 39 45 98 -110 -95 71 39 43 -156 10 141 -106 -64 -18 -73 110 48 -75
6483 -75 9 145 -62 -39 -57 121 282 42 71 23 30 -36 21 7 55 36 -27 60 0 17 144 5 -16 -27 -69 219 172
6510 172 -29 185 31 36 -99 76 -77 -18 48 16 128 62 114 153 -82 55 140 -126 -112 -11 -4 -111 -147 -5
6534 -5 -2 27 -31 42 -54 -43 91 -56 126 -129 -37 -26 -107 -41 3 39 -55 -59 4 169 -60 -21 -1 -31 23 -87 3 -73
6562 -73 -11 -60 -18 -17 89 -44 -117 198 -68 -204 38 -82 -30 -83 104 -13 40 25 -154 130 9 -69 191 -114
6586 -114 -1 -99 -143 -139 -87 27 104 -6 -148 142 -66 -103 -30 33 15 132 94 -65 19 23 -13 75 75 -112 -59 -58 -2
6613 -2 -223 -19 -67 17 97 14 125 -200 -117 -76 -118 -87 50 103 -25 2 -34 8 104 11 -129 64 36 -22 -63 -112 -33
6640 -33 40 11 -58 -40 -60 44 -36 126 34 62 21 -137 16 -110 -13 109 -120 101 -34 90 36 11 46 -179 136
6665 136 -81 49 -75 -77 116 -67 22 -37 64 -100 19 -74 318 -56 -80 110 87 -68 133 -38 -73 32 -120
6688 -120 -50 15 -137 -94 28 63 137 -31 -51 -233 -80 -43 77 -102 -67 45 144 -103 -13 61 150 91 10 -12 135
6713 135 58 -41 67 10 -103 -15 223 -71 -156 -18 88 34 44 77 -49 7 22 -3 38 7 176 -219 -27 -153
6737 -153 90 -58 -117 -5 96 -11 72 -9 5 -145 -72 -204 -140 5 20 110 -54 -41 -171 1 -45 -54 45 66 -137
6762 -137 -5 74 77 78 33 -28 -13 134 50 -13 55 -34 -97 -200 23 -58 205 -14 104 151 -144 -26 -21 36 -162 -97
6788 -97 -70 21 -115 1 -141 -203 -28 -105 -124 -24 87 -31 -223 52 84 55 -12 86 7 -30 68 -27 40 -99 126
6813 126 -19 41 -113 7 64 -23 59 76 100 -113 -119 106 108 79 27 73 122 -69 108 -49 16 -21 -80 143 44 40 -37
6840 -37 -32 10 -29 119 -85 -140 -104 -44 -35 14 51 43 117 -88 -35 11 31 -34 -76 66 -76 -3 -140 -73 117 -127 159
6867 159 -56 -166 -91 -108 -52 -14 -71 125 78 -95 -43 -17 -85 101 -3 -92 -17 -135 31 -1 -93 -115 -95 -86 114 -56
6893 -56 12 -35 -102 -15 61 -42 -96 -37 22 -131 -18 48 -55 -113 39 -28 -53 -48 -43 55 -11 -64 33 -4 -19 -19 28 110 -62
6922 -62 -4 -39 -43 -135 -14 -25 8 -82 82 -74 -77 -23 -64 79 56 -76 66 158 -118 -105 48 -43 12 60 38 97 91 -71
6950 -71 -198 49 -165 -39 -37 -202 28 -68 -59 -1 -56 -52 -20 29 0 7 -62 25 51 -67 -21 38 54 -35 117 97 -148 81
6978 81 69 -44 33 -5 -177 -102 -35 187 -84 4 92 -46 17 60 159 -28 64 -30 -109 -33 -40 24 -9 13 138 26 -180
7005 -180 23 48 -105 200 64 -29 176 -74 0 67 101 67 88 39 -84 -83 -79 44 47 -59 -71 -83 128 42 -63 39
7031 39 -51 -64 99 -37 -112 -41 32 0 -58 101 24 47 12 -46 25 -4 125 58 54 -100 -58 -77 8 18 -55 2 54 35
7059 35 -50 58 -131 -118 -169 -21 -77 95 -32 82 27 -57 82 60 140 -141 -13 -183 74 17 127 53 -63 -200
7083 -200 -172 2 -9 7 11 66 -32 -56 43 79 -141 79 -24 -106 -142 37 6 -23 -11 70 -51 -8 -57 -46 89 112 29
7110 29 116 -38 44 72 -10 -76 69 59 115 -246 69 38 -177 155 73 41 109 -10 -8 131 -146 5 -59 60 80
7135 80 -117 -35 67 75 -121 110 -75 -18 -30 -6 -98 -89 -14 -94 -106 32 74 -56 -58 -83 -156 -60 89 -68 -25 39 -89
7162 -89 74 12 31 -59 -35 -5 -19 29 88 -27 -85 17 -18 160 -96 -86 54 81 7 56 -112 71 -15 -25 -10 -47
7188 -47 41 -66 -98 130 -143 28 61 -150 1 -169 -89 164 -51 2 15 -33 -75 39 11 42 -28 160 -21 -35
7212 -35 135 -125 199 18 -28 -66 -175 -80 56 -44 -114 181 -119 -64 -79 99 65 11 -120 54 -59 -41 24 -99
7236 -99 45 108 -35 25 33 0 42 -138 -112 124 84 -73 89 -121 12 98 -106 -55 44 -51 -149 -62 70 -154 -52
7261 -52 -43 -153 -105 -60 34 -33 95 -50 -10 -64 14 6 -170 -83 -75 158 0 28 -120 -117 120 -43 -50 2 64 -19 64 -64
7289 -64 -53 83 -68 -40 -95 -22 37 31 -81 32 89 47 -88 140 35 -107 9 48 -23 11 28 69 68 181 -101 -172
7315 -172 -71 -41 112 -64 -125 -160 60 -100 -90 60 -56 -42 -106 -91 75 69 -28 -20 -18 -76 89 -124 1 16 -1 73
7341 73 -16 106 -17 -101 -29 -6 12 99 17 -25 -143 -23 -5 -70 4 88 197 19 -82 -23 -141 -14 39 -18 1 -26
7367 -26 43 -114 -4 -69 125 -50 41 -19 67 28 -33 122 -117 24 6 88 0 101 116 5 -52 200 -39 -21 10
7392 10 -65 17 123 22 -137 -10 50 44 -140 -1 -8 -120 -113 162 -243 64 8 154 -123 21 -6 -129 94 -88
7416 -88 -8 124 26 31 73 -1 -95 -82 109 -134 -32 -190 106 -64 -142 -98 -94 -131 40 107 45 106 7 28 8 -34 8
7443 8 93 -99 -148 70 1 75 265 14 113 148 -21 122 55 5 -133 -61 -21 -47 -106 -130 -88 -1 -1 -113 29 108 -102
7470 -102 80 -108 -15 -20 106 -65 -61 119 -198 -11 93 114 -57 -14 -208 -87 45 82 -111 -45 5 -77 57 -112
7494 -112 -36 49 14 -106 -71 -114 -121 -129 19 80 -101 -85 -93 87 -23 -44 1 91 44 14 -187 211 42 0 -50 16 -138
7521 -138 -147 -127 -13 103 1 132 -99 97 -30 -31 -7 -15 51 -40 112 63 138 194 -26 25 -34 -134 -96 31 -49 44
7547 44 158 -33 120 8 -66 36 -139 77 -79 -66 57 -41 -148 24 63 -54 190 2 -179 -97 64 -52
7569 -52 40 -102 179 -46 -87 19 -201 -43 93 133 -56 33 111 13 172 39 27 -9 63 52 -89 -60 -188 2
7593 2 -124 -111 30 -207 -69 -44 43 95 190 24 -135 109 16 65 -62 44 -175 -75 111 135 230 30 -19 -219
7617 -219 -148 68 61 17 58 4 -80 -95 145 21 -48 -36 34 -3 -81 129 30 -27 183 6 -52 144 -96 -170 -58 -98
7643 -98 -103 57 87 71 106 -92 74 53 38 55 15 2 -13 -16 8 163 75 126 -100 -123 29 -25 -6 -26 86 -183 -123
7670 -123 48 -140 11 107 -99 72 -36 -189 -5 -171 63 102 117 -117 -115 154 -4 -124 32 -10 30 86 -25
7693 -25 -23 -1 104 -12 2 -65 26 116 22 9 68 30 39 209 5 96 51 115 94 80 -130 67 39 10 -85 24 131
7720 131 -14 44 -172 -114 44 46 -147 -48 -111 -48 142 -104 35 -28 -6 37 -7 36 -72 -20 -164 -24 -155 -11
7744 -11 188 98 110 21 29 94 -71 -94 -6 -146 -86 -52 -38 117 38 -143 146 205 1 -60 -95 132 -137 27 33 116
7770 116 70 -21 -22 164 101 -27 26 -45 37 7 -142 -76 -53 -2 37 26 -130 -53 -44 52 -75 -88 -29 78 117 158 -35
7797 -35 200 23 -22 -94 65 -54 155 -127 -40 114 11 79 -35 -53 -148 -23 59 124 29 -73 -134 -79 37 -55
7821 -55 -43 -39 -57 74 -52 76 -65 -112 -96 17 -58 -117 -120 0 -102 35 -45 -29 65 74 10 41 40 113 -13 -75 -10 -33
7849 -33 41 152 23 0 -138 13 -33 -18 46 -1 -93 -17 -51 -42 -80 10 47 97 -18 -216 -41 -26 17 -113 5 -71
7875 -71 -86 129 3 -39 231 -72 38 -37 146 -73 -35 51 -114 30 -69 -69 75 132 -20 13 -128 -88 -27 -18 8
7900 8 -103 -113 118 34 -83 -99 -90 -35 111 -1 -54 -53 -22 -84 -5 -83 13 -71 59 122 -73 -161 5 -3 -95 22 -100
7927 -100 16 -12 11 -69 -64 249 74 56 74 264 22 -43 25 -85 59 -10 -88 21 -31 30 -38 -111 -152 -14 -11 99
7953 99 -4 -51 99 49 16 166 86 160 100 49 79 31 -8 69 140 -108 -173 -23 316 58 42 -140 78 -215 -62
7978 -62 40 -31 149 -44 45 -18 -5 34 -82 -7 -67 -41 -174 -10 27 -27 6 -181 3 -101 55 -68 -117 23
8002 23 126 -27 43 89 -119 63 23 1 189 166 62 35 -42 28 -12 -146 -86 -78 -1 87 -120 61 -11 66 -121 -135
8028 -135 -57 131 117 17 34 62 128 -59 55 -69 5 108 -145 7 40 0 97 -63 34 7 3 38 59 239 -26
8053 -26 -37 -45 23 175 -29 109 144 -28 32 62 -62 14 -110 38 3 -110 39 44 -42 -10 74 56 162 -98 43
8078 43 28 117 -178 86 14 29 80 -106 -242 39 -143 -189 -38 -79 110 -84 -39 -1 -58 -74 -28 5 138 -126 -110
8103 -110 68 -23 76 -41 16 34 -50 -234 -32 14 7 -68 -120 55 82 -40 21 -32 -60 111 24 63 14 -27 -46 44 -20
8130 -20 7 -15 -91 -181 -18 -3 -93 78 -147 -59 -124 -14 12 104 29 -21 91 -80 -1 9 8 -72 -82 100 51 128 -10
8157 -10 36 23 -132 4 44 -24 206 -7 42 210 -12 -72 -21 -62 -9 4 60 -40 8 -76 2 -88 -30 5 88 -36
8183 -36 23 111 -33 10 -73 -2 -120 129
8191A29
$$ Imaginary data points
##PAGE= N=2
##DATA TABLE= (X++(I..I)), XYDATA
0 0 0 0 0 0 0 0 0 0 0 0 0 0 0 -8 8 -8 8 -8 16 -16 24 -24 32 -32 40 -48 56 -64 72 -80 96 -106 120 -137 157
35 157 -176 199 -223 248 -277 308 -342 379 -421 464 -512 565 -624 686 -757 835 -917 1013
53 1013 -1117 1236 -1369 1519 -1694 1894 -2132 2418 -2768 3212 -3790 4582 -5736 7587 -11025
68 -11025 19611 -90665 -88193 79545 -32132 -107533 -10313 76431 -13774 -35427 62245 81242
80 81242 -14745 -461 74679 41070 -42889 -8152 52249 4134 -67318 -22523 27837 -18844
92 -18844 -59478 -19248 -2970 -35740 -24546 36397 32899 -23190 -6075 63335 47205 -13572
104 -13572 5347 54542 19024 -44530 -24636 18225 -19548 -57767 -14344 12722 -29723 -34441
116 -34441 25673 37664 -16016 -18296 41059 41754 -9415 -2627 30882 4290 -29690 -944 25513
129 25513 -11774 -37107 3647 18677 -28028 -31198 20473 21350 -22208 -13438 30825 20946 -14517
142 -14517 7611 37089 1959 -25065 10236 25142 -17920 -36843 -3128 6512 -26881 -24528
154 -24528 13015 7756 -18026 1414 28521 12438 -5175 16147 30511 1533 -15838 8930
166 8930 15730 -12401 -19714 -1092 -1571 -19360 -14296 6562 -1082 -20808 -4235 19005 5964
179 5964 -8774 7763 22590 6848 -5878 11148 18609 -4299 -10726 5997 875 -18309 -12538
192 -12538 5066 -2763 -19889 -7358 12831 1943 -8361 7115 14161 384 -2266 10663 10180
205 10180 -6289 -6165 8580 2416 -12033 -4500 6779 -802 -10094 -2767 6976 258 -7049 3252
219 3252 8340 -2957 -3924 7526 7735 -3921 -5741 5404 4030 -9373 -6498 3917 -2437 -9931
233 -9931 -1648 5804 -64 -4466 5869 11002 -212 -1979 9399 6389 -5045 -4085 2716 -1606
247 -1606 -9859 -5545 2204 -4464 -9180 863 5214 -1782 -2544 5370 7725 376 -805 7449 5850
262 5850 -2826 -87 5340 274 -5548 -2188 1665 -3983 -9402 -2515 1226 -5838 -5405 2413 2911 -824
278 -824 1926 7587 6150 247 3595 7355 423 -3801 180 366 -4615 -6182 -2460 -744 -4617 -3800
294 -3800 1834 1108 -1713 1081 3918 2948 99 896 4348 1886 -1885 891 2471 -1325 -2490 -638
310 -638 -17 -2897 -4338 9 263 -3914 -1384 2922 994 -815 1674 4271 2006 -873 2093 3041
326 3041 -1962 -2273 881 -881 -3186 -2481 -217 -471 -2492 -832 2358 359 -749 1814 2031 873
342 873 16 806 1717 -249 -1581 709 524 -1972 -1249 118 -93 -1238 -1160 1259 780 -1610 817 2478
360 2478 -345 -463 1579 1477 -598 -1445 1132 691 -2371 -1169 1061 -864 -1441 288 817 127 -604
377 -604 986 1873 -173 -108 1846 618 -387 -166 -54 -37 -1332 -1425 -150 -1234 -1938 -219 300 -345
395 -345 -416 746 1933 980 111 2095 1817 -357 200 815 -222 -1061 -1042 -137 -1174 -2526 -580 -82
413 -82 -1555 -676 420 -39 398 492 940 1349 669 1199 1712 507 331 731 67 -127 -1029 -1344 -724 -1499
433 -1499 -1942 -798 -794 -896 -199 484 1028 510 494 2140 1432 -181 1042 1040 229 -176 -215 -241 -685 -1266 -215
454 -215 -441 -1783 -438 -161 -646 -348 -186 174 564 322 610 1013 488 986 764 122 243 -221 -493 90
474 90 -947 -1521 -126 -200 -740 -435 92 700 290 270 1338 499 -415 914 769 -520 -178 149 106 -635
494 -635 -789 65 -274 -695 388 165 -948 108 561 256 182 127 937 713 -50 614 333 -398 111 -139
514 -139 -772 -579 -846 -500 -303 -852 -313 66 192 571 639 24 1052 914 447 589 143 -110 249 -146
534 -146 -463 -511 -808 -397 -509 -941 -449 -538 -380 147 166 -9 409 764 835 1100 353 920 838 287 2 -477
556 -477 -371 75 -889 -810 -713 -1109 -681 -122 -293 -274 -68 93 696 169 493 967 507 630 810 57 283
577 283 317 236 -141 -729 -797 -219 -690 -1080 -713 -714 -765 -1 -224 214 490 342 888 667 319 854 595 409
599 409 672 -95 -10 171 -399 -641 -554 -742 -419 -445 -884 -433 -507 -43 328 -122 424 766 557 745 639 305
621 305 468 508 21 -34 -517 -689 -216 -714 -696 -428 -542 -243 21 -362 3 91 194 468 393 347 756 290
643 290 429 627 -39 -33 194 -281 -358 -419 -446 -391 -504 -346 -173 -330 188 749 -105 402 677 432 375 201 30
666 30 124 -185 -252 -133 -529 -223 118 -380 -23 -113 -194 190 207 -56 197 184 369 566 222 129 229 -75 -17
689 -17 70 -467 -114 -120 -457 -125 -378 -102 96 -219 151 160 -63 171 558 82 196 149 109 63 -184 -35 -129 -353
713 -353 -326 -12 -378 -59 38 -54 242 21 79 94 -16 261 58 -186 -39 148 -173 200 230 -63 40 163
735 163 -141 -33 -200 32 -2 -207 -17 152 -215 63 25 -27 101 87 36 202 -122 -24 94 -271 16 49 -185
758 -185 32 182 -288 28 96 -55 65 -282 -250 99 -287 -165 105 -24 -21 129 -201 251 403 -118 258 -76
780 -76 117 74 -250 26 -76 -380 -84 -201 -400 -90 -60 -234 94 -39 48 161 11 254 332 -6 308 299 -42
803 -42 202 -232 -263 67 -369 -200 -235 -252 -166 -115 -125 284 122 61 493 317 79 497 149 185 75 -49 245
826 245 -30 -319 -54 -190 -496 11 -159 -206 42 -17 -71 305 143 451 405 141 366 227 -49 232 21 -256
848 -256 -308 -125 -373 -58 -378 42 -140 -317 95 162 35 408 229 101 282 67 254 56 -74 182 10
869 10 -212 2 -297 -409 70 -106 -369 -5 -113 -44 -49 -10 -3 78 108 207 195 -95 289 13 -185 97 -127 -139
893 -139 -103 -178 -189 -70 -119 105 0 -33 227 -35 -18 54 -79 -161 49 -6 -5 177 36 294 -37 -32 210 30 -152
918 -152 60 -151 -223 -73 -216 -221 -42 -156 56 7 -36 142 7 20 94 87 20 210 -24 181 68 -128 -41 -110
942 -110 -264 49 -251 25 -39 -190 -225 54 -176 -46 168 -46 266 89 185 250 43 31 91 -159 -46 45 -300
965 -300 -122 -288 -141 35 -257 -97 227 -23 305 272 44 300 210 115 135 147 52 120 39 -51 4 -370 -222 -39
989 -39 -243 -63 64 -110 88 23 65 278 266 19 292 -173 134 134 -151 -123 23 -283 -107 -43 -171 -93 -142 -191
1013 -191 -70 -96 12 228 48 -3 321 49 116 102 -26 142 -136 30 -207 -164 -118 -226 -257 -193 -87 -161 -75
1036 -75 -42 52 -20 117 157 365 102 252 338 -75 65 49 -171 -11 -108 -175 -42 -123 -95 -55 -163 -27 -4 -46 212
1061 212 271 52 97 173 -1 189 115 -63 -54 14 -28 -8 -175 -26 136 -172 -283 -130 -169 89 23 141 33 140
1085 140 179 122 -66 255 248 50 -93 -61 -50 -28 -210 -121 -85 -44 -21 -30 -268 -198 132 -73 115 111 160 33 190 144
1111 144 144 -128 58 172 -289 -49 -146 -274 -241 -161 22 -113 84 -18 -7 -111 11 -17 -100 112 194 -42 106
1134 106 171 -167 134 -29 23 5 -107 -42 -18 -202 -10 -51 -140 63 10 -46 140 -47 127 214 -58 155 180 26
1158 26 26 59 -162 -50 -57 -125 -103 -76 -19 -91 -235 -55 74 -79 66 131 71 211 -24 107 72 -164 -70 -103 -180 -97
1184 -97 13 -141 -196 97 -224 56 18 71 20 -139 45 79 281 34 152 18 -39 242 59 161 -181 -107 -8
1207 -8 1 -234 23 -44 61 36 -85 110 -51 -6 33 53 94 155 -34 -62 144 -4 -26 97 -91 47 20 -48 12
1232 12 -15 -166 39 -275 -20 44 -1 85 268 95 129 -72 78 145 9 203 161 23 -6 36 -21 -39 17 -219
1256 -219 -7 52 -148 -95 63 64 25 -65 151 202 98 219 33 225 49 157 167 -41 7 -105 -73 -30 -150 -169
1280 -169 -145 -77 -58 53 -59 -26 -96 108 33 -79 38 -122 218 32 -51 -25 6 -198 -13 9 -193 55 -454
1303 -454 -46 55 -25 73 159 163 48 -195 97 139 146 44 90 -103 -42 91 -4 -46 -10 -135 -19 172 96 50 101
1328 101 2 60 -62 -27 161 0 -70 119 -54 -191 1 -101 79 -153 -28 -46 -233 -80 69 -79 9 180
1350 180 -44 110 112 -21 -14 -35 157 225 -142 -69 165 -170 113 87 -77 144 -58 -129 -85 8 -3 121 -43 175
1374 175 121 65 120 55 20 115 -33 91 1 -95 -91 36 -95 -114 78 14 -98 221 59 55 -27 -247 -162 -36 170
1399 170 50 -136 116 237 -17 256 -126 -63 -11 -105 13 3 -90 -52 -44 -31 55 -85 -204 -84 -23 59 -74 -18
1423 -18 54 16 66 122 0 -108 88 -21 -47 12 120 -172 -170 -66 -110 -56 -64 -51 17 -6 11 147 -138 162 -77 -118
1449 -118 -72 89 22 7 -183 -55 170 -123 -31 19 -95 -13 -140 -66 78 -52 50 -26 30 254 109 1 -71
1472 -71 -216 -248 14 -149 -157 70 -198 -179 -49 129 -85 49 106 11 133 -29 -1 141 36 78 70 -82 -3 5 -32
1497 -32 164 -34 -103 -179 -96 159 -75 -359 -56 19 38 -54 39 18 20 58 18 14 -40 -72 84 220 109 -6 -117 -144
1523 -144 -40 -202 -41 -8 11 21 -53 31 -72 -5 122 26 186 131 34 49 -197 -107 -12 24 -74 111 -54 -50 73
1548 73 57 86 -76 -71 -91 26 -10 159 115 30 -2 -28 -91 72 -66 -167 -10 -123 -83 75 -2 -5 -46 -172 75 129
1574 129 -124 175 20 -61 78 140 16 127 -84 -95 25 132 -162 -23 -110 45 -77 -72 -41 -25 69 -69 16
1597 16 63 -133 -35 -59 146 18 62 45 -45 24 -56 -72 -34 -150 -68 15 -120 36 -95 -13 -55 -80 -40 12 83 125 14
1624 14 133 -6 49 -46 -225 -90 -255 -95 -20 24 13 -84 -149 -70 124 125 -52 65 124 95 -36 152 -79 19 17
1649 17 -296 41 42 -84 -22 -136 -23 -70 -118 -42 78 -51 -100 33 22 134 -166 114 -44 130 -66 -69 -112 26
1673 26 105 47 -64 54 -40 -160 -79 -38 -180 22 -1 -88 62 17 29 37 56 239 -212 -10 42 -59 -92 -36 -134 52
1699 52 -129 -30 -122 -78 -128 53 6 -103 117 14 -50 27 -25 106 -4 71 1 -51 110 -7 26 -21 -141 -2 68
1724 68 -111 130 5 112 174 -33 -185 -3 -10 -74 15 131 8 73 -100 130 93 -126 -135 17 180 25 -110
1747 -110 -118 50 -25 2 47 70 -77 51 -17 83 56 -42 -103 196 -113 -57 121 -118 88 83 138 32 -21 42 -142
1772 -142 -85 -23 92 -62 -9 189 -2 40 107 114 128 -91 37 221 -62 -30 -29 -192 -8 -116 -51 -51 114 28 -66
1797 -66 28 43 137 -43 -8 -182 -31 128 -58 -35 174 170 42 -16 35 -156 69 -69 -206 3 -16 -86 -94 -4 94
1822 94 -20 -91 62 -38 50 80 -14 27 -79 -65 22 131 -73 29 -51 -91 121 -40 -287 -75 -96 -20 91 -92
1846 -92 20 -67 69 -35 63 16 -43 -115 -66 105 -10 75 90 93 165 -153 75 144 2 216 -13 29 41 34 68 37
1872 37 -114 71 44 -137 -149 117 -4 -2 -115 -97 -34 -11 27 -43 -101 -68 128 -107 262 -19 -129 16 65 -38
1896 -38 -92 49 -63 60 -99 -74 43 190 12 -1 -29 0 -62 50 -180 41 -24 -71 46 -137 -25 92 193
1919 193 16 -163 -36 27 -45 146 -158 73 -88 -113 -73 144 49 93 -90 58 55 57 -42 -92 -35 -4 118 -56 -78
1944 -78 -27 -195 -154 62 -26 -46 -30 -20 -109 -68 4 -57 -51 21 12 60 -95 92 -34 -129 127 -50 13 -30 -302 -5 95
1971 95 3 -122 -56 -12 190 2 -121 -63 115 -145 60 -32 21 -70 -57 -72 -64 -36 -65 -22 82 -179 73 -101 -91
1996 -91 -53 13 147 -124 29 -128 24 274 95 -8 -97 -11 17 35 88 85 69 -21 18 -18 -161 -133 65 41 13 71
2022 71 57 63 -3 115 44 46 42 -91 29 40 -52 102 20 -47 44 35 -148 -123 29 26 107 117 54 -86 1 -92 121 -26
2050 -26 67 37 -57 -115 18 -8 -40 47 0 11 -96 66 -12 -92 50 -24 12 -92 -69 -45 47 7 34 -6 -152 -41 40
2077 40 -57 183 162 24 20 54 14 42 95 -51 -55 113 114 125 -55 18 43 -12 -32 117 99 135 -34 -65 -90 -154 -33 2
2105 2 55 19 -9 -112 -214 12 73 94 -81 49 128 4 79 30 56 45 -21 -5 -69 -152 -5 24 -32 -35 4 30 -79
2132 -79 51 45 -39 -223 96 16 137 -115 -5 2 -94 -9 -108 -80 -23 -120 88 16 47 45 161 -75 238 47 -159 -61
2158 -61 93 53 -26 107 72 -84 3 49 -168 26 118 -7 -178 267 -31 116 48 77 -45 -119 -47 38 122 -60
2182 -60 -106 -43 187 -20 65 -40 100 27 57 -21 -78 -62 5 -169 233 -57 -32 -102 44 150 28 -46 -118 -138 12
2207 12 -2 31 43 81 34 -102 82 10 -23 -106 -71 -110 -86 -11 -100 -21 -107 132 -18 -3 -74 33 -37 -26 52 -49 -92
2234 -92 -108 14 -172 -45 -41 -77 -82 55 -55 73 -54 -66 37 -46 129 87 132 86 72 50 -158 17 9 128 -181
2259 -181 100 7 30 45 57 35 -71 -3 -42 -173 3 0 72 -61 -98 183 21 -10 -76 4 41 120 85 -24 -183 -10
2285 -10 30 -99 1 126 -183 -101 40 46 33 108 138 -8 -32 -76 1 92 57 -204 -78 -31 60 31 4 18 -24 83
2311 83 -61 125 -95 162 -42 -19 48 -173 14 -160 -196 -62 30 -7 -39 -173 117 77 -71 11 -133 183 -73
2334 -73 121 12 29 62 -28 -15 104 -19 56 -47 -60 39 -101 30 2 10 115 -72 45 28 -30 -46 123 5 37
2359 37 -4 -108 -43 34 0 -25 120 -77 -15 -75 36 -115 4 64 32 -115 12 -75 -34 -63 -46 -112 101 32 -19 116
2385 116 -20 -96 -50 111 31 -115 -102 -106 -51 -58 64 -32 -49 28 -173 12 -75 -45 8 -33 -12 -10 -278 -36 98 143 -43
2412 -43 46 -244 29 -107 165 -84 162 16 -21 103 81 -230 -76 -113 32 32 160 103 -157 69 -27 68 -59
2435 -59 -29 -162 -59 -28 27 33 31 -7 -184 91 3 40 17 94 -16 -18 -8 66 -57 3 -136 -313 -13 92 -101 -79
2461 -79 -69 -77 -119 11 61 91 -59 2 11 62 -85 -60 46 107 -3 -84 -76 34 3 5 61 59 -102 -132 118 73 -75 -148
2489 -148 34 24 -63 135 48 -98 77 82 9 -95 -13 -6 -152 -95 127 43 74 -75 -64 -65 -29 -69 48 -13 -9 185 -66
2516 -66 25 -11 -74 108 -24 -43 56 40 -24 20 83 -240 -97 -117 20 -64 14 91 14 92 68 -25 -42 -5 99 -45 107
2543 107 237 222 213 141 -2 -15 22 -23 -43 -124 -132 4 -99 -95 44 99 89 -42 -135 39 -18 76 -33 106 13 -63 52
2570 52 -111 -65 -160 -97 156 58 -115 -32 -42 18 -48 31 -110 59 87 -35 -29 -32 -78 146 -89 -41 27 132 -157 -27
2596 -27 -60 -97 93 94 210 56 -36 105 -22 -10 35 75 26 -24 25 -56 -86 -2 50 -218 -13 -68 -135 152 -16 -6
2622 -6 13 19 -36 -58 -212 -92 120 144 25 5 3 57 90 89 -31 -187 56 -180 -28 -142 59 68 80 -50 34 -99
2648 -99 55 -15 -76 138 0 67 -93 9 65 -150 -43 2 -89 -8 111 -115 -33 -10 -73 -18 -31 -134 -105 -16 57
2673 57 108 72 11 -23 105 -51 -73 -2 -100 -211 -14 70 96 -82 0 99 -52 -59 70 -4 54 106 -11 104 87 19
2699 19 -173 -46 -8 -122 24 7 -132 -89 -81 -42 -162 160 -24 88 7 96 7 -130 -83 4 37 88 -6 114 -48
2724 -48 -138 -60 -160 -18 -184 164 14 -22 7 -1 -132 -43 158 161 -42 160 80 16 -8 34 139 23 63 -42 -100
2749 -100 -38 51 -136 159 -158 -54 52 137 90 -160 -7 114 -32 204 133 57 -153 -176 227 -18 66 21 -43
2772 -43 -71 -138 14 -24 -122 43 -11 -28 126 -97 -104 -150 -121 67 -254 -100 -170 114 103 3 120 -164 -44 102
2796 102 -59 -12 51 2 -66 -105 -99 19 73 -83 -176 -51 14 97 -13 234 15 2 -112 -92 -51 -83 6 3 66 15 -110
2823 -110 16 11 -71 -157 26 82 77 22 33 45 -36 -57 -32 64 44 -129 -31 -158 -86 67 -12 -80 -110 50 -10 89 107 25
2851 25 54 -67 -34 97 120 9 79 51 13 -72 72 -51 24 -41 -164 -119 -18 24 -111 -10 -105 -45 -20 15 10 19 103
2878 103 -73 -198 -58 64 -29 -56 -107 141 118 -95 -77 -8 -103 16 -14 34 -93 -37 58 9 160 54 -68 -43
2902 -43 -132 163 129 -124 29 84 107 48 -26 -33 -115 126 -59 18 22 -73 53 -146 -13 -32 114 -22 63 -5 -21 -113
2928 -113 103 -20 -3 8 150 101 104 -120 -55 -42 58 197 -61 14 37 -10 92 75 -21 -55 -133 62 -119 -9 99
2953 99 -62 11 -67 56 206 -42 109 117 94 -90 34 -7 -216 -155 -72 -97 -42 -87 53 -63 -214 -77 20 107 -211
2978 -211 68 -47 157 -57 -37 -34 77 107 20 -122 68 154 123 112 117 106 115 -60 -147 88 -107 60 56 61 -21 44 12
3005 12 -6 34 -102 59 -104 -17 205 165 24 172 -204 -46 -103 -69 -3 61 7 5 13 44 2 5 -41 -50 -79 -36 -281 -9
3033 -9 175 8 -7 -3 30 8 155 8 -172 55 -9 2 10 -156 -113 -18 -166 -27 -42 118 -8 -24 32 92 -23 -78
3059 -78 -61 7 -118 -27 120 29 -82 -60 42 -40 39 24 -31 -18 94 -35 173 -178 -60 22 17 -16 -78 34 70 61
3085 61 33 -48 38 -121 -16 25 89 151 -28 -18 86 -30 -1 -104 129 246 17 -107 30 78 67 -26 -64 -44 18
3110 18 22 -57 59 34 201 -139 -67 52 37 92 11 -28 -183 -6 -18 -30 -18 -52 93 -53 -32 -3 -120 -22 25 -47
3136 -47 41 -85 -75 0 -131 -140 -43 60 6 -39 124 19 -90 -13 -108 -5 -47 72 -20 107 44 -134 -78 133 67
3161 67 -39 70 99 140 102 188 -64 60 -108 -32 66 39 88 33 13 -28 -51 62 28 29 -185 -99 -123 16 220 -92
3187 -92 150 -115 7 -66 -53 90 -199 52 5 79 -147 -188 -71 106 -2 -7 -135 -80 37 4 77 136 90 -72
3211 -72 231 -81 -54 81 -92 -8 -21 84 -40 -130 -149 -162 -14 103 -172 -6 -216 20 84 -13 24 108 -46 210
3235 210 -14 -44 -53 63 98 -64 -10 44 -41 -27 -8 -56 40 -219 -108 -102 -25 127 -4 171 91 -120 -111 -62 85 -74
3261 -74 -64 112 -35 7 47 -45 -40 50 18 4 54 -154 179 83 127 10 -25 -122 34 -138 -118 12 47 -113 -122 0
3287 0 115 -72 71 29 -39 -85 -111 -85 -149 -29 37 -75 -82 102 -13 -12 -126 34 -67 -115 24 85 -30 107 -96
3312 -96 27 -177 -100 -42 -135 60 -37 -54 88 -47 11 -50 -76 -30 72 75 36 245 165 119 -71 -5 -88 61 52 -31 -73
3339 -73 91 -99 129 74 -78 24 -32 -181 107 -78 -72 203 33 16 -50 -159 33 -1 37 15 177 110 -88 -90
3363 -90 -12 98 -23 41 176 46 -27 -9 9 -64 -87 -101 -9 1 -5 -54 51 24 41 163 24 -66 37 44 30 22 -71 1
3391 1 44 33 -202 172 20 -37 -6 82 23 -25 -61 -161 -27 130 189 -22 164 85 10 -160 75 37 -101 43 95
3416 95 -97 -53 -82 58 75 122 20 -71 31 9 71 54 61 22 -58 56 165 -96 87 45 -35 25 136 28 8 -7
3442 -7 23 23 -48 30 1 23 129 -158 -47 -60 -17 -34 16 -4 -17 41 -1 -15 -5 -190 85 -32 -83 52 40 -121 92
3469 92 54 74 113 -38 -41 -88 -15 79 -33 -97 122 74 -168 115 -122 71 -126 11 60 -53 -111 -49 -17 37 146
3494 146 -20 1 -37 78 72 -55 34 -64 -59 -165 -64 -146 15 -140 -52 -86 30 103 -16 -45 -74 74 -34 -11 -167
3519 -167 74 -65 76 19 -3 95 62 35 65 -21 48 78 -82 -69 111 -86 -87 120 -125 39 -177 49 -111 -55
3543 -55 55 44 22 40 36 -118 47 1 68 -60 41 -36 -36 72 32 51 182 -64 79 1 -42 -32 92 45 -69 -56
3569 -56 -8 -41 -199 61 -58 43 26 -3 237 57 110 103 6 -55 43 15 66 -87 -85 -3 3 135 93 100 -65 39 -63
3596 -63 34 106 -64 -88 -82 -26 113 -106 -72 -152 73 -40 9 137 45 -77 46 -228 -33 183 49 -52 116 -8
3620 -8 -35 -108 -44 208 -89 80 21 83 101 -111 -58 133 -85 6 -190 -87 -43 -42 26 159 120 -81 -106 -142 -79 -192
3646 -192 -166 -91 77 -26 68 33 7 3 -84 -170 -174 -41 -35 129 172 24 84 91 70 -115 -22 3 -135 -23 44 107 106 -96
3674 -96 -9 -55 18 141 128 68 94 93 -122 38 -47 -17 43 53 -72 37 9 -42 -139 -7 -29 -134 42 -150 120 -3
3700 -3 -132 11 -101 152 72 125 30 7 -131 155 94 114 -17 59 -224 6 63 116 -80 -92 77 -97 74 -89
3724 -89 -80 -171 -67 163 -11 -61 -3 -24 160 38 -19 -42 -52 24 -28 26 58 22 -2 -120 -40 -22 22 90 -92 21 -93
3751 -93 209 -149 131 30 43 62 20 86 -4 39 -11 74 -108 232 73 13 -4 -98 -32 -102 8 -173 101 19 -106
3776 -106 -37 -77 -57 -43 38 124 80 -187 8 -42 -18 -117 15 -207 36 21 -8 -205 -133 34 55 60 -3 172 -81 -4
3802 -4 13 -35 71 -39 83 83 33 -136 -62 20 21 15 100 -187 38 -170 35 8 48 272 -38 184 36 -190 139
3827 139 -57 97 20 64 -36 -94 39 -89 36 72 234 201 48 83 107 -102 79 124 43 39 -68 65 42 105
3851 105 -11 -20 -218 39 104 25 -27 -26 24 -39 -7 62 16 -205 -14 116 88 -72 137 -139 -17 -29 133 52 190
3876 190 65 27 186 11 10 42 -21 47 6 -33 75 -98 101 -208 81 199 -74 -90 -34 43 49 80 -75 -16 31
3901 31 -68 54 -80 130 40 51 -29 51 -75 -4 -167 23 -182 36 61 -81 -28 -67 12 -66 70 0 -165 74
3925 74 -99 -59 160 92 39 226 58 -145 -32 -84 -53 -96 90 12 75 129 92 -39 278 119 -77 -85 -63 -117 11
3950 11 -107 -108 -92 15 29 13 88 33 47 -68 -119 63 -112 -24 -13 11 185 -102 12 118 -43 10 -19 51 33 -63
3976 -63 -85 50 43 -2 102 31 105 -110 2 -70 25 62 -6 -58 0 -76 -161 -115 -95 -107 61 -162 73 94 -17 13 13
4003 13 202 184 -85 -3 -110 -111 -23 -75 160 6 152 -111 -3 -33 -11 111 157 -34 36 -27 -9 -163 -9 -11 20
4028 20 105 -28 -33 19 0 45 -118 -93 -3 -177 15 238 152 12 20 65 11 -9 -18 31 -48 71 155 44 74 -36 64
4055 64 -25 25 -34 186 15 -15 -41 176 186 -137 103 -17 178 73 5 -74 55 35 89 -13 -129 -80 -50 260
4079 260 58 4 120 -20 -87 -74 -62 -26 -14 45 -48 15 72 -220 -87 56 109 75 -55 -156 111 97 48 19 -18
4104 -18 -41 104 5 -168 -105 -245 -31 15 107 -39 -45 153 -54 -37 -67 162 146 13 -3 -77 34 119 -3 -19 56
4129 56 -162 -53 -147 10 -130 -21 71 6 106 -74 141 -174 -73 -36 -130 -108 -78 15 102 97 65 -148 -54 -225 45
4154 45 22 -179 -47 -93 5 -94 112 28 -91 0 -73 -75 91 57 118 0 -7 -122 91 -110 -54 -39 -120 -31 -149 152
4180 152 -23 -27 -94 275 87 35 -97 -110 33 -2 27 -73 140 72 -299 50 15 -37 -9 -42 -102 33 -51 196 267
4205 267 -19 -93 66 -25 -96 40 -84 -144 56 214 105 -146 20 -80 -113 52 111 183 10 96 31 -196 112
4228 112 78 145 -92 -90 -1 120 60 120 127 53 -97 116 -38 -12 -140 -57 154 98 -52 -22 65 83 85 7 -147 99
4254 99 21 -201 -74 155 -51 55 103 24 -66 -198 39 -50 -64 14 162 -62 -17 -172 -39 1 43 -20 79 -131
4278 -131 -10 -101 -165 63 -81 -39 21 -10 51 -45 -17 25 39 40 128 -60 -199 -2 43 34 159 31 -48 224 -118 -228
4304 -228 60 -26 33 21 42 8 -43 -72 -77 -11 146 -153 6 65 -95 -74 124 112 58 94 131 49 69 111 125 122 -134
4331 -134 -136 70 152 54 12 -43 -11 -67 -142 -50 70 -24 -49 -95 -3 -5 8 166 -33 -189 41 -3 -44 -24 -95 -62 75
4358 75 -16 -90 -73 40 14 103 16 18 -18 56 17 -21 -94 -17 121 -65 -15 112 -35 29 172 -87 10 53 -116 -72 117
4385 117 143 5 -140 -4 10 59 97 98 89 -85 -85 -150 -94 10 61 99 -39 113 -26 -84 -52 6 25 -145 156 104
4411 104 8 157 62 105 45 127 113 -55 70 128 93 144 38 -54 120 33 -126 -103 12 87 52 100 -189 66 16
4436 16 81 114 72 131 -33 51 -75 -25 92 54 59 82 130 126 -99 -7 10 135 -93 45 -67 44 -29 -108 91 72
4462 72 -100 42 -36 -92 -222 32 4 45 49 155 34 30 72 -49 -134 -44 -26 -69 -23 -94 -9 198 28 34 -170 31
4488 31 77 68 52 51 -115 -47 32 -29 121 75 73 93 -106 -67 88 30 -73 224 -22 67 -134 -23 -45 -1 204 -56
4514 -56 57 98 108 204 47 -9 -229 49 55 -7 -83 37 -56 -31 33 -65 -93 -93 -16 -73 -44 -149 203 54 -49 -82 -9
4541 -9 -83 108 -93 -59 -78 -33 20 106 59 -48 119 62 -28 -134 84 18 26 -100 136 -154 -37 -49 -44 22 64 -19 106
4568 106 -87 -80 -75 -90 94 -27 15 101 124 -10 100 187 -186 -88 9 148 -76 -60 -107 37 15 9 -116 237 29
4593 29 7 -4 -85 88 57 -151 -1 3 15 -97 -17 -36 67 114 -1 130 -135 73 84 -8 -151 140 8 68 52
4618 52 25 30 36 -39 -67 9 0 64 -141 139 5 41 92 -46 34 -19 16 -76 120 -35 -67 168 -1 43 135 99 33 44
4646 44 -121 28 -116 79 -87 -219 -83 -122 -77 181 31 -41 -78 -137 -45 98 -42 -63 -36 -13 -15 17 -3 19 36
4671 36 -28 52 -128 57 65 203 120 -2 21 -69 -100 132 117 65 15 177 -3 -18 -29 -205 -239 183 61 -130 23
4696 23 -92 -2 153 -100 -89 0 50 115 -139 -32 -83 79 51 71 -108 -113 -10 43 -73 -44 110 -125 32 -26 48
4721 48 -135 33 40 32 177 60 17 -57 -145 -30 -60 14 129 -70 -77 -48 132 61 -169 -126 -103 -11 -51 -35 -70 -11 -180
4748 -180 -166 133 -35 11 -58 84 48 -139 28 -10 74 35 -107 -3 6 118 -29 -17 73 -1 136 90 -43 95
4772 95 -19 52 -16 115 -100 -57 150 223 -72 31 58 -76 -17 123 -159 -208 -66 -16 149 18 114 -51 -28 2
4796 2 -37 59 197 -49 -79 136 82 -198 111 -50 -113 -29 26 79 -17 -10 180 -64 -75 -147 -25 -60 74 6 -155 -76
4822 -76 73 -5 98 -134 -157 139 81 -144 47 -10 -94 33 -97 14 119 191 44 -121 -82 -96 -158 -70 116 -65
4846 -65 11 125 -4 -32 10 -15 70 -235 -45 -194 -121 -99 -56 214 -94 -74 175 29 -83 -126 10 -118 37 -98
4870 -98 -24 95 -8 21 -67 -22 -24 81 -37 -44 -7 -67 -168 48 101 14 50 -77 114 15 -136 -46 137 186 -162 -5
4896 -5 -12 31 40 -83 -111 -151 -125 76 58 -54 34 -70 76 -70 -44 -38 40 165 18 -69 34 -48 -5 -13 70 122 76 -67
4924 -67 46 -149 235 83 12 -2 -29 28 102 53 -28 3 22 -43 -6 -34 -56 26 81 -111 90 -163 70 52 -38 -71
4950 -71 -1 4 -85 -84 70 37 27 33 -2 1 11 109 -132 -39 -106 -23 -61 34 -50 77 169 -29 67 -36 15 41 31 117 79 38
4980 38 97 79 -13 -185 -47 34 -58 -45 -58 27 56 75 -190 -14 92 -112 123 -66 140 148 9 56 130 -61 -11
5005 -11 -185 -106 -89 -4 -14 66 23 -18 -61 -164 11 -29 -99 -76 -4 37 -68 143 77 -3 -182 50 -20 -9 114 -134
5031 -134 -207 -175 -47 -80 12 -5 42 68 167 29 160 -38 129 -174 190 49 91 -32 10 11 9 -230 -34 169 -60
5056 -60 -18 -46 152 -33 -44 86 -50 -40 144 48 -89 67 -13 -67 166 -14 128 -75 -30 -89 -3 140 -163 156
5080 156 -78 -52 50 -89 36 -15 72 10 -134 -61 23 -29 132 131 -124 107 6 123 51 -97 -247 122 51 91
5104 91 178 129 -45 -42 -234 -104 -99 -41 24 60 31 -86 -92 110 -8 39 82 64 117 -97 -95 -3 -26 50 37 -54 31 -37 -53
5133 -53 -93 -107 130 7 14 -39 49 -90 46 136 -77 44 -9 -109 58 -36 120 -19 129 22 -55 -93 -182 -145 -79
5158 -79 32 -85 25 61 52 -127 -6 -128 130 -33 -9 -43 -147 65 -63 -116 -52 -25 35 -4 31 100 -103 -36 21
5183 21 91 22 -33 -132 136 36 81 98 -34 -197 -37 -10 -46 -108 41 -127 75 -76 8 24 8 -73 28 -167 53
5208 53 54 128 -43 44 -6 60 77 -77 -150 -71 165 171 -7 -101 -17 -69 -10 36 -29 -95 -49 -16 12 -39 -27 -74 -77 -28 -112 -37
5238 -37 -19 -41 80 -42 61 103 60 3 195 -128 136 -73 -93 -41 51 22 32 -57 -13 -5 -45 139 -7 -1 218 73
5264 73 -39 -113 14 -35 7 122 53 -40 -127 -1 -95 98 42 -13 -39 -106 33 27 88 28 -88 139 23 15 27 -209
5290 -209 56 93 94 -79 22 -80 -22 -19 18 39 -66 34 64 -89 -130 -32 -130 46 -11 73 -36 8 67 -54 104
5315 104 51 210 -83 19 159 -36 88 3 11 -27 -3 -1 171 43 99 12 40 5 -69 9 -60 -152 29 93 80 -46
5341 -46 110 16 46 134 -27 0 -5 124 61 14 -194 -86 41 88 -72 114 72 77 76 -150 -81 -164 37 -44 67 -109
5367 -109 155 95 41 -85 -114 22 86 -39 -33 68 -27 -18 -32 -12 95 137 -3 53 35 -139 72 10 -10 -29 -69 28
5393 28 -124 -158 -178 -75 -52 -57 47 48 64 -191 -122 77 -74 40 145 53 -13 13 -22 18 -65 -23 -141 -22 -56 128
5419 128 -63 27 99 50 98 7 -17 201 -42 -89 -151 -168 80 -173 71 -6 45 -43 196 -53 15 66 212 -123 79
5444 79 86 -50 19 -19 -286 -11 88 -15 -42 -112 -13 -76 -102 -94 -57 13 39 86 -9 28 -70 -152 -63 -64 -6 -36 -15 -10 -11 -126
5474 -126 17 101 35 -57 -95 -107 -48 87 126 76 85 14 5 -59 109 -140 12 17 -35 -170 -49 116 -123 -25 -28 55 97
5501 97 -29 114 60 -134 -74 12 -33 -94 43 -50 -120 130 -34 -81 -45 -204 -94 -60 -94 124 134 7 10 -28 164
5526 164 -31 -36 -5 100 121 117 14 -85 -62 22 -200 56 -24 140 -48 196 -159 70 53 104 17 -51 -21 -162 -118
5551 -118 88 -71 100 25 -40 131 -156 -85 146 33 64 9 -27 44 -119 113 10 -43 157 34 -45 -14 -14 104
5575 104 -51 82 55 -20 23 62 -58 2 57 56 175 -9 -95 51 -119 52 81 -24 -71 136 -99 -12 50 93 -37
5600 -37 51 -23 -51 -249 -157 104 -44 -126 -6 -38 20 -56 24 47 15 10 92 -20 191 -130 -45 47 -156 -22 -113 -20
5626 -20 39 -129 -12 65 11 -85 -83 214 -59 -23 -128 -26 -166 -29 -142 4 -51 20 149 29 -192 -57 77
5649 77 -75 14 239 -48 106 70 -155 -65 -74 144 -51 -57 -69 87 284 -39 -36 8 93 -45 -133 -127 -60 -70 -72 87 -8
5676 -8 90 93 -180 51 123 55 -11 121 206 120 -228 -135 -51 39 -66 -26 52 -167 35 59 -116 -49 51 -25 17 -103
5702 -103 1 189 -12 -161 88 82 85 159 -99 -20 141 -137 6 65 -62 70 -183 17 81 71 55 122 -11 -44
5726 -44 120 -13 54 -59 56 -129 37 -5 267 36 17 106 113 -44 81 38 86 -103 37 -63 -46 135 36 42
5750 42 -55 -102 -10 -35 -145 34 -106 -19 -12 -12 -32 -21 155 -26 -94 105 -23 36 0 -161 13 -41 -134 -54 -85 -183 -77
5777 -77 -113 -73 61 -9 14 26 -93 107 -20 196 -55 -9 -154 54 53 18 -103 65 161 -29 -256 87 -68 52
5801 52 -9 15 -62 7 109 11 156 129 -84 -35 28 24 23 -47 -199 -56 -126 -14 -110 37 -43 48 -19 -108 -93 -132 15
5828 15 92 150 29 -112 -27 -41 50 -10 146 -4 -54 7 94 0 143 -100 -86 -64 72 27 46 254 -55 -60 -19 -41
5854 -41 -149 -39 25 -6 -37 15 93 22 -139 -112 87 -15 47 69 -44 -38 -6 -71 50 23 26 -179 -66 7 -79 -61 102
5881 102 20 45 -188 19 -68 -34 61 -82 -76 -77 171 -92 -51 66 11 -5 38 10 119 -27 -163 -23 171 117 35
5906 35 203 57 59 48 11 68 39 -29 17 -173 83 168 -70 128 32 24 -50 -102 -112 -4 -149 80 -129 -77 -17 78
5932 78 159 -34 161 -23 -127 273 -48 59 -2 89 28 3 -3 52 -66 -28 161 168 -136 -24 -172 -101 -47 -40 -10 78
5958 78 145 -180 91 22 37 -215 0 -67 -38 -131 -18 120 5 -167 82 59 20 -50 137 -107 -8 -48 -157 -102
5982 -102 38 80 28 -98 46 101 -37 -62 -22 61 47 -17 -66 -194 -34 -155 -95 48 12 65 3 -20 -136 87 -149
6007 -149 38 -18 15 107 -245 34 139 -81 -11 -113 89 116 -13 35 -22 89 -2 122 196 -22 75 3 1 -56 -124
6032 -124 63 -214 -216 93 6 63 -92 -67 57 -2 -92 172 120 -30 -162 -51 128 -91 64 126 -14 119 -16
6055 -16 65 17 -28 -38 36 18 -31 -123 9 -5 -45 58 -188 -99 -151 94 184 -6 32 -53 -133 -28 -163 -68 91 -30
6081 -30 42 7 210 87 -68 -10 44 135 -134 -67 45 49 32 -76 5 -114 -9 -35 139 -185 67 -97 21 -116
6105 -116 99 -50 -12 -101 11 41 87 -138 103 -64 43 -14 -63 128 -80 116 -91 -52 36 -63 75 166 -104
6128 -104 2 -15 -80 -64 52 93 80 90 -96 58 -84 33 -29 -89 -14 7 138 52 -52 -98 234 103 -48 110
6152 110 46 -53 50 143 -34 -38 -77 -32 57 68 117 -24 82 9 -39 -95 120 -90 37 -111 34 -32 237 -20 -104
6177 -104 55 22 116 23 55 -17 -115 16 -25 27 -32 -130 -31 -217 50 -61 -32 70 -53 59 2 27 -71 -96 -85 63
6203 63 85 -105 154 153 79 151 -36 -192 -97 210 9 -26 85 215 17 29 -64 88 -100 -89 -151 -64 51 138 87
6228 87 78 -27 121 -63 -106 63 111 75 105 6 39 81 27 48 6 -134 -7 -13 50 49 128 -51 210 -101 89 -74
6254 -74 58 153 29 -20 26 -80 -77 10 10 47 90 25 68 -53 -37 25 -43 7 -38 76 -45 38 86 120 -160 -136 -26
6281 -26 52 60 74 -127 234 -125 -45 100 -47 -34 49 83 54 -34 -110 -7 152 -41 -105 -71 -80 -1 18 -53 -55 21 93 113
6309 113 -27 -148 5 -75 19 176 81 7 26 14 -21 33 18 132 40 132 -113 3 -17 -28 -7 -36 -170 -117 4
6334 4 -94 50 107 100 -1 -55 15 64 -63 46 107 144 -4 50 77 -3 53 129 14 -121 -104 151 -61 45 78 9
6360 9 -9 79 108 -95 120 197 -67 -78 -33 101 -5 62 62 -16 -60 -35 -75 110 -164 30 25 158 -61 -119 -2 90
6386 90 1 -63 -80 52 114 -91 -75 66 -12 24 -18 67 73 147 0 2 132 156 -36 -44 -82 1 -36 -129 -133 -46 102 -24
6414 -24 14 17 -42 18 174 -89 -5 -22 91 20 -147 1 15 -183 -36 -23 -18 53 -62 -40 -82 140 -2 58 -39 -97
6440 -97 32 221 185 16 -96 69 69 53 88 83 44 -81 -61 170 -39 -43 -134 -102 -210 -24 210 -78 -31 35 -160
6465 -160 -57 -68 6 4 117 -28 -1 33 -9 12 -65 12 -29 46 12 -63 63 -28 -14 -20 -69 -97 -157 -111 28 -24 -69 70
6493 70 -93 111 151 36 40 -43 -36 -18 96 -133 -114 46 -36 -78 81 -23 -108 -18 -42 70 -39 -66 -72 62 43 67
6519 67 13 142 -44 -113 -86 -56 -119 -11 -6 -51 -39 -49 42 -100 101 76 91 54 -61 107 113 -23 -59 -68 4 173 -47
6546 -47 -28 -23 -5 -28 -107 -13 99 -10 111 45 -61 -21 -93 17 102 55 -27 73 -28 -54 -17 1 18 -216 29 48
6572 48 -79 -117 61 -213 21 -16 33 48 3 55 -200 -197 97 -43 -103 -30 137 30 -50 -87 -190 124 98 99 -34
6597 -34 32 155 -126 14 -90 -67 17 19 1 -110 22 -89 74 -20 83 176 -131 -140 -20 -61 36 14 -73 -58 34 -108
6623 -108 5 -8 -266 16 11 -171 169 -27 129 -46 -42 26 -66 -83 8 -54 -71 19 -102 -95 -31 -39 1 -252 -15 74
6649 74 171 15 23 -117 17 -109 -28 43 27 -37 -100 60 -148 147 11 178 211 132 6 -23 72 -15 76 25 67 -38
6675 -38 55 -60 -86 9 -22 55 -9 15 59 -23 16 -148 68 -118 88 2 32 28 -121 -55 -65 14 -76 5 -150 194 35
6702 35 131 122 -60 23 211 163 141 3 -245 -26 -123 52 25 -60 124 -5 18 -27 -45 11 121 -19 -13 -52 -39 43
6728 43 -69 74 34 -90 44 33 67 60 -68 -12 -85 -33 5 -135 75 36 -37 -63 97 -189 -89 14 -68 6 -53
6753 -53 47 23 6 98 -116 80 115 96 62 -61 32 -89 204 195 -169 127 26 -126 52 92 -30 -84 -89 -2 -7 -170
6779 -170 -69 -229 -30 3 70 169 48 97 -217 -24 53 -14 -90 91 63 36 49 -35 -49 199 -90 -55 181 150 0
6804 0 -40 31 16 114 44 36 241 86 91 -34 -9 -30 -26 -11 -9 5 -42 54 -166 -15 -18 23 -82 -21 164 1 -134 225
6832 225 -32 -86 -45 -111 30 17 187 -70 125 -89 -88 60 22 -74 133 13 50 23 20 84 72 -129 -11 213 -173
6857 -173 42 -22 -37 54 10 8 120 39 20 140 -70 141 -95 -19 -20 106 -119 97 -18 -58 -74 -32 84 40 -33
6882 -33 112 -7 -245 -72 150 -48 113 39 -115 58 69 143 91 150 -51 37 139 60 27 -110 -31 28 -130 54
6906 54 7 73 -9 66 74 -3 -7 138 125 23 -198 19 101 -99 113 58 -32 99 124 -22 87 -45 22 68 -129 13
6932 13 31 -137 -66 4 -58 -9 72 122 -66 20 -33 146 -119 101 44 36 -42 -58 -16 -20 84 45 -69 14 144 21 1
6959 1 -18 92 -24 -19 151 113 55 -38 51 -23 51 -50 0 -191 46 -11 -35 64 -85 181 2 -21 50 49 -201 -64
6985 -64 140 -54 -249 143 -111 117 100 18 -66 -54 74 62 25 110 28 95 171 14 -122 14 54 -5 104 -104
7009 -104 -49 -87 196 -97 159 -7 125 54 -14 -46 -16 5 4 73 -171 181 72 -85 2 -61 13 -109 83 -84
7033 -84 131 -65 -73 -34 57 145 191 110 27 64 84 91 95 -58 31 -146 25 11 87 22 -54 -53 -44 87 -169 -34 -20 90
7061 90 78 43 48 74 -97 -107 43 38 -27 72 96 186 92 -4 -20 5 -51 -50 -37 -116 -28 9 90 20 15 -64 3 30 -12 -23 60
7092 60 -116 71 -66 -66 16 -83 271 104 29 -54 -47 -242 -13 136 22 78 -14 -113 -15 -15 95 -44 -80 98 109 -41
7118 -41 58 24 148 -7 -188 107 72 -84 22 -49 161 -101 116 128 173 41 -15 111 133 191 110 43 -31 -27 -58
7143 -58 99 11 54 -10 48 69 -18 31 138 40 -200 68 14 -26 -27 156 108 -149 -14 39 -84 69 -92 1 -88 86
7169 86 -43 -138 -123 -61 -40 74 149 -132 1 148 93 -107 -54 113 50 33 -49 -17 64 -84 249 -57 39 -176 8
7194 8 0 -12 -1 136 -77 -29 -90 -32 3 60 107 -110 -40 21 27 -53 21 -21 -193 101 -16 -19 -77 -101 -108 -146 -74 -321 -67
7223 -67 16 149 158 29 88 -81 -11 -38 -152 1 3 -83 -117 48 -46 -68 -113 16 -38 165 -1 98 81 -29 -136 -30
7249 -30 -102 -29 109 -14 -32 -123 -9 63 91 31 74 157 140 25 103 -123 29 52 -104 -98 -15 26 -12 71 -18 -26 151
7276 151 -6 3 164 -66 -107 -24 -36 -43 -87 97 -98 96 218 -114 -74 48 26 -146 3 22 154 -144 -181 153
7300 153 128 -24 42 -109 -149 16 205 52 83 12 200 123 -193 31 10 49 -66 76 42 24 43 -57 -26 16
7324 16 -28 -101 151 -38 -27 2 5 -60 172 -111 -140 112 -11 -60 -69 18 -19 -51 111 -52 -32 126 73 -20 171 -19
7350 -19 91 -5 41 3 81 77 123 -120 -88 80 19 -38 -77 82 -15 -9 -155 -163 90 131 67 28 80 -99 -83 113 47 -210
7378 -210 29 151 -10 122 -58 -248 -33 77 -94 90 -20 -33 85 78 -25 17 -105 -37 -25 -224 13 -20
7400 -20 -273 44 -147 -27 -46 57 -125 14 52 -33 47 -12 16 21 105 -126 -26 0 -101 116 -118 -10 -62 -56 239
7425 239 -65 23 166 -45 -72 -75 45 20 -103 -163 84 45 11 126 57 -73 124 -18 39 64 2 102 15 142
7449 142 1 -64 14 36 -45 -90 97 -100 37 -115 100 -103 25 56 63 38 -35 -48 -124 -54 71 -69 -88 109 -97
7474 -97 71 37 -1 -27 1 -24 11 -102 101 48 38 24 -17 -10 18 -67 30 -60 38 0 44 23 -164 -4 -67 -62 51 -18
7502 -18 13 -19 8 -89 -21 79 -15 -60 121 -16 27 22 -112 122 28 -64 -143 20 -9 250 2 25 -66 -100 19 -63
7528 -63 129 98 -101 89 120 -96 -27 -43 -18 93 -87 -115 -29 126 188 -104 124 -17 155 96 -158 -306 -39
7551 -39 42 -57 -10 -106 -126 -107 108 75 23 -23 -171 -63 -16 -5 4 -260 84 -29 -82 177 -133 85 -4 -69 -126 79
7577 79 -75 -2 -58 -232 86 -80 -7 16 178 -10 -52 -51 -11 -155 -20 -84 81 33 130 -29 60 16 -19 -171 -151
7602 -151 -120 117 203 -98 -170 39 -60 -29 36 79 -69 -4 -71 -102 67 -85 45 -22 -142 16 107 78 19 -204 -7
7627 -7 -84 -128 105 40 -58 66 -57 93 -77 44 -80 70 -55 -76 -19 81 -70 -7 47 -124 -127 -55 -69 -78 -91 3
7653 3 140 -77 44 -23 -78 8 -17 -157 -99 -51 90 97 60 -30 28 -55 48 -127 -61 137 -75 -42 -78 59 102 33
7679 33 185 20 -107 23 71 20 -124 183 166 -24 -67 -51 110 89 78 45 73 14 4 -98 6 -71 -136 -141 105
7704 105 -221 -62 -99 -47 105 -211 235 -86 -65 -156 -274 57 -61 52 -97 -122 -139 46 19 0 -43 -106 -74 -30
7728 -30 -44 -22 106 17 -318 149 0 -38 -20 16 -38 -109 35 187 26 0 17 -39 -20 -22 124 -51 36 62 -26 -196
7754 -196 28 95 -71 2 -7 -69 -43 -103 8 37 -104 -78 -23 32 12 -20 148 28 -122 -16 1 26 -13 -148 -29
7779 -29 -26 50 30 -14 119 11 -81 68 49 -9 47 -81 115 6 3 -138 75 8 -23 -15 -71 54 -5 -47 -70 -8 -151
7806 -151 122 42 36 8 -2 71 -163 -45 42 -18 28 -69 59 1 -88 35 49 -5 -24 -135 16 0 41 6 -16 81 15
7833 15 -96 40 -83 20 -80 53 20 121 77 -141 19 -114 -82 64 116 -56 0 5 41 -69 23 -41 133 -41
7857 -41 8 68 -116 6 -100 77 50 -13 -39 -155 76 -80 24 -40 26 -63 -42 -39 31 -37 31 -126 -110 -17 24 -5
7883 -5 48 32 99 90 -106 124 88 140 -26 -25 -43 87 175 -36 -30 135 15 -20 58 22 31 130 -22 -117 -174 303 -63 78
7911 78 80 -14 -73 -121 -141 24 110 -36 24 63 -61 184 122 50 -23 -51 -31 -54 93 -24 135 1 45 83 98 2 30
7938 30 -46 -171 47 100 -13 52 -25 -40 137 -49 171 174 -1 59 61 59 -50 79 -8 18 -187 70 3 -30 50 -3
7964 -3 32 -21 71 -139 163 69 160 50 -16 -20 -98 149 45 -139 68 -33 24 -11 85 138 71 -11 17 -2 13 39 19
7991 19 -101 -14 -159 25 57 -68 56 79 -73 53 18 -144 74 138 308 -53 3 56 -113 37 62 144 14
8014 14 69 58 126 83 -1 27 42 -21 124 89 25 -49 209 77 -51 23 6 153 2 17 -78 20 -127 82 -25 128
8040 128 -50 8 41 -81 -72 -28 -23 155 -91 -81 -77 8 -186 -37 127 18 47 67 40 -210 15 52 -188 -54 182
8065 182 19 -2 -196 -23 39 163 -59 30 -7 90 -100 -43 98 59 -193 5 -98 -18 -124 -38 87 69 223
8088 223 -69 -106 -41 137 82 -225 -73 -126 -202 -7 -88 250 -52 20 39 96 -15 83 53 103 8 27 -38 92 -8
8113 -8 111 -233 -65 147 -68 -29 123 64 -28 -46 106 -68 -127 27 -40 4 32 -14 -23 110 -32 154 134 33 -68
8138 -68 -78 -54 -53 15 57 -90 -58 87 -65 4 22 81 33 63 -25 31 6 4 -161 -163 39 97 -15 -139 -123 133 -46
8165 -46 -55 131 18 47 -40 35 47 23 114 101 109 -156 -127 187 -66 28 237 37 69 -35 -42 112 -145 61 -8 128
8191A28
##END NTUPLES=NMR FID
##END=
