##TITLE=1H_DE-80H_X3
 200.13MHz, d2o
 8 sc
 
 19ns.26.2.2025
##JCAMPDX= 6.0         $$ Bruker NMR JCAMP-DX V2.0
##DATA TYPE= NMR FID
##DATA CLASS= NTUPLES
##ORIGIN= UXNMR, Bruker Analytische Messtechnik GmbH
##OWNER= pz
$$ XWIN-NMR		Version 3.5
$$ Thu Apr  3 16:45:54 2025 Russian Standard Time (UT+4h)  Yarkov@DPX200
##.OBSERVE FREQUENCY= 200.1313
##.OBSERVE NUCLEUS= ^1H
##.DELAY= (6, 6)
##.ACQUISITION MODE= SIMULTANEOUS
##.ACQUISITION SCHEME= undefined
##.AVERAGES= 8
##.DIGITISER RES= 18
##SPECTROMETER/DATA SYSTEM= spect
##.PULSE SEQUENCE= zg30
##.SOLVENT NAME= CDCl3
##.SHIFT REFERENCE= (INTERNAL, CDCl3, 0, 14.3821)
##AUDIT TRAIL= $$ (NUMBER, WHEN, WHO, WHERE, WHAT)
$$ ##TITLE= Audit trail, XWIN-NMR		Version 3.5
$$ ##JCAMPDX= 5.01
$$ ##ORIGIN= Bruker BioSpin GmbH
$$ ##OWNER= Yarkov
$$ C:/Bruker/XWIN-NMR/data/yarkov2/nmr/H-C/1/audita.txt
$$ ##AUDIT TRAIL=  $$ (NUMBER, WHEN, WHO, WHERE, WHAT)
(   1,<2025-04-03 16:43:50.62 +0400>,<Yarkov>,<DPX200>,
      <created by zg, POWCHK disabled, PULCHK disabled
       configuration hash MD5:
       00 E9 B6 7A A2 85 ED C7 34 08 36 98 17 FE 4E 26
       data hash MD5: 16K
       8A 53 57 81 9F 84 D2 A7 1B 91 0D F1 C4 E2 23 11>)
$$ ##END=
$$ 
$$ hash MD5
$$ E9 0C 31 1D 79 23 ED 38 14 EB 91 12 5D 2D 99 B2
##$RELAX= 
##$RELAX= 
##$RELAX= 
##$RELAX= 
##$RELAX= 
##$RELAX= 
$$ Bruker specific parameters
$$ --------------------------
##$DU= <C:/Bruker/XWIN-NMR>
##$EXPNO= 1
##$NAME= <H-C>
##$PROCNO= 1
##$TYPE= <nmr>
##$USER= <yarkov2>
##$AMP= (0..31)
100 100 100 100 100 100 100 100 100 100 100 100 100 100 100 100 100 100 
100 100 100 100 100 100 100 100 100 100 100 100 100 100 
##$AQSEQ= 0
##$AQ_mod= 1
##$AUNM= <au_zg>
##$AUTOPOS= <>
##$BF1= 200.13
##$BF2= 200.13
##$BF3= 200.13
##$BF4= 200.13
##$BF5= 200.13
##$BF6= 200.13
##$BF7= 200.13
##$BF8= 200.13
##$BYTORDA= 1
##$CFDGTYP= 0
##$CFRGTYP= 5
##$CHEMSTR= <none>
##$CNST= (0..31)
1 1 145 1 1 1 1 1 1 1 1 1 1 1 1 1 1 1 1 1 1 1 1 1 1 1 1 1 1 1 1 1 
##$CPDPRG= <>
##$CPDPRG1= <>
##$CPDPRG2= <>
##$CPDPRG3= <>
##$CPDPRG4= <mlev>
##$CPDPRG5= <mlev>
##$CPDPRG6= <mlev>
##$CPDPRG7= <mlev>
##$CPDPRG8= <mlev>
##$CPDPRGB= <>
##$CPDPRGT= <>
##$D= (0..31)
0 0.7 0 0 0 0 0 0 0 0 0 0.03 0 0 0 0 0 0 0 0 0 0 0 0 0 0 0 0 0 0 0 0 
##$DATE= 1743684230
##$DBL= (0..7)
120 120 120 120 120 120 120 120 
##$DBP= (0..7)
150 150 150 150 150 150 150 150 
##$DBP07= 0
##$DBPNAM0= <>
##$DBPNAM1= <>
##$DBPNAM2= <>
##$DBPNAM3= <>
##$DBPNAM4= <>
##$DBPNAM5= <>
##$DBPNAM6= <>
##$DBPNAM7= <>
##$DBPOAL= (0..7)
0.5 0.5 0.5 0.5 0.5 0.5 0.5 0.5 
##$DBPOFFS= (0..7)
0 0 0 0 0 0 0 0 
##$DE= 6
##$DECBNUC= <off>
##$DECIM= 32
##$DECNUC= <off>
##$DECSTAT= 4
##$DIGMOD= 1
##$DIGTYP= 9
##$DL= (0..7)
0 120 120 120 120 120 120 120 
##$DP= (0..7)
150 150 150 150 150 150 150 150 
##$DP07= 0
##$DPNAME0= <>
##$DPNAME1= <>
##$DPNAME2= <>
##$DPNAME3= <>
##$DPNAME4= <>
##$DPNAME5= <>
##$DPNAME6= <>
##$DPNAME7= <>
##$DPOAL= (0..7)
0.5 0.5 0.5 0.5 0.5 0.5 0.5 0.5 
##$DPOFFS= (0..7)
0 0 0 0 0 0 0 0 
##$DQDMODE= 0
##$DR= 18
##$DS= 0
$$ [...]
##$SUBNAM2= <"">
##$SUBNAM3= <"">
##$SUBNAM4= <"">
##$SUBNAM5= <"">
##$SUBNAM6= <"">
##$SUBNAM7= <"">
##$SUBNAM8= <"">
##$SUBNAM9= <"">
##$SW= 18.0517328524113
##$SWIBOX= (0..15)
0 0 2 0 0 0 0 0 0 0 0 0 0 0 0 0 
##$SW_h= 3612.71676300578
##$TD= 16384
##$TD0= 1
##$TE= 0
##$TE2= 300
##$TE3= 300
##$TEG= 300
##$TL= (0..7)
0 120 120 120 120 120 120 120 
##$TP= (0..7)
150 150 150 150 150 150 150 150 
##$TP07= 0
##$TPNAME0= <>
##$TPNAME1= <>
##$TPNAME2= <>
##$TPNAME3= <>
##$TPNAME4= <>
##$TPNAME5= <>
##$TPNAME6= <>
##$TPNAME7= <>
##$TPOAL= (0..7)
0.5 0.5 0.5 0.5 0.5 0.5 0.5 0.5 
##$TPOFFS= (0..7)
0 0 0 0 0 0 0 0 
##$TUNHIN= 0
##$TUNHOUT= 0
##$TUNXOUT= 0
##$USERA1= <user>
##$USERA2= <user>
##$USERA3= <user>
##$USERA4= <user>
##$USERA5= <user>
##$V9= 5
##$VALIST= <valist>
##$VCLIST= <CCCCCCCCCCCCCCC>
##$VD= 0
##$VDLIST= <DDDDDDDDDDDDDDD>
##$VPLIST= <PPPPPPPPPPPPPPP>
##$VTLIST= <TTTTTTTTTTTTTTT>
##$WBST= 1024
##$WBSW= 4
##$XGAIN= (0..3)
0 0 0 0 
##$XL= 0
##$YL= 0
##$YMAX_a= 150505
##$YMIN_a= -140921
##$ZGOPTNS= <>
##$ZL1= 120
##$ZL2= 120
##$ZL3= 120
##$ZL4= 120
##$ABSF1= 10
##$ABSF2= 0
##$ABSG= 5
##$ABSL= 3
##$ALPHA= 0
##$AQORDER= 0
##$ASSFAC= 0
##$ASSFACI= 0
##$ASSFACX= 0
##$ASSWID= 0
##$AUNMP= <proc_1d>
##$AZFE= 0.1
##$AZFW= 0.1
##$BCFW= 1
##$BC_mod= 2
##$BYTORDP= 1
##$COROFFS= 0
##$CY= 83.5205535888672
##$DATMOD= 1
##$DC= 2
##$DFILT= <>
##$DTYPP= 0
##$F1P= 10.8118882576601
##$F2P= -7.23987719738617
##$FCOR= 0.5
##$FTSIZE= 0
##$FT_mod= 4
##$GAMMA= 1
##$GB= 0.15
##$INTBC= 1
##$INTSCL= 1
##$ISEN= 128
##$LB= 0.25
##$LEV0= 0
##$LPBIN= 0
##$MAXI= 10000
##$MC2= 0
##$MEAN= 0
##$ME_mod= 0
##$MI= 1.114404
##$NCOEF= 0
##$NC_proc= 0
##$NLEV= 6
##$NOISF1= 3.799351
##$NOISF2= 2.8
##$NSP= 1
##$NTH_PI= 0
##$NZP= 0
##$OFFSET= 14.38212
##$PC= 1
##$PHC0= -1191.158
##$PHC1= 24.99226
##$PH_mod= 1
##$PKNL= yes
##$PPARMOD= 0
##$PSCAL= 0
##$PSIGN= 0
##$REVERSE= no
##$SF= 200.129724274929
##$SI= 16384
##$SIGF1= 3
##$SIGF2= 2
##$SINO= 400
##$SIOLD= 16384
##$SREGLST= <1H.CDCl3>
##$SSB= 0
##$STSI= 0
##$STSR= 0
##$SW_p= 3205.1282051282
##$SYMM= 0
##$S_DEV= 0
##$TDeff= 0
##$TDoff= 0
##$TI= <>
##$TILT= no
##$TM1= 0
##$TM2= 0
##$TOPLEV= 0
##$USERP1= <user>
##$USERP2= <user>
##$USERP3= <user>
##$USERP4= <user>
##$USERP5= <user>
##$WDW= 1
##$XDIM= 8192
##$YMAX_p= 0
##$YMIN_p= 0
$$ End of Bruker specific parameters
$$ ---------------------------------
##NTUPLES= NMR FID
##VAR_NAME=  TIME,          FID/REAL,        FID/IMAG
##SYMBOL=    X,             R,               I
##VAR_TYPE=  INDEPENDENT,   DEPENDENT,       DEPENDENT
##VAR_FORM=  AFFN,          ASDF,            ASDF
##VAR_DIM=   8192,          8192,            8192
##UNITS=     SECONDS,       ARBITRARY UNITS, ARBITRARY UNITS
##FACTOR=    0.0002768,     1,               1
##FIRST=     0,             0,               0
##LAST=      2.2672688,     0,               0
##MIN=       0,             -140921,         0
##MAX=       2.2672688,     150505,          0
$$ Real data points
##PAGE= N=1
##DATA TABLE= (X++(R..R)), XYDATA
0 0 0 0 0 0 0 0 0 0 0 0 0 0 0 0 0 0 0 0 1 -8 8 -8 8 -8 10 -16 16 -16 21 -24 28 -32 36 -40 45 -52 59 -67 75 -83
40 -83 92 -102 112 -125 138 -154 170 -186 205 -225 249 -274 302 -333 368 -406 452 -500 558 -625
60 -625 706 -801 919 -1073 1272 -1546 1956 -2629 3990 -14327 51742 15151 -77998 37188
74 37188 126151 3032 -61752 77809 99907 -49985 -60157 74619 36408 -106108 -55467
85 -55467 57549 -28662 -109081 2586 69141 -31579 -58471 54157 75253 -24663 -15910 77427
97 77427 36614 -55460 -6335 55321 -11977 -59380 8458 29319 -47466 -49903 32304 24108 -41672
110 -41672 -10638 47001 11006 -32781 7994 45957 5144 -23944 17938 29669 -21988 -26871
122 -26871 22449 17042 -33815 -26776 16894 132 -36293 -4729 28258 -5374 -21215 19560
134 19560 29720 -6506 -5875 30288 19559 -21135 -9396 19759 -4031 -28065 -1852 12626
146 12626 -16237 -24077 8840 15070 -12880 -6624 20707 6914 -14697 3308 18503 284 -11099
159 -11099 4417 10267 -7980 -11364 6883 6170 -9537 -6329 5669 1326 -8155 -1368 10779 2755
173 2755 -8192 2738 9771 -2371 -4830 6847 5258 -8371 -8390 4466 1311 -11287 -3486 8025
187 8025 -1837 -8388 3717 9933 546 -2218 8423 7697 -5946 -3287 7551 -22 -8159 -1253
201 -1253 1484 -6062 -7015 1863 3665 -3666 -2407 5075 1986 -2441 2588 5699 1883 -1648 395
216 395 3010 -972 -3550 1432 1712 -4197 -4678 -758 -14 -2540 -1429 3378 2062 -2489 1169 5761
232 5761 2569 308 2791 2899 -1747 -3630 650 378 -4880 -3000 759 -3057 -4714 845 2980 192
248 192 -214 3412 2903 -1148 1041 4838 1477 -1610 146 318 -1614 -1953 -270 307 -2177 -2551 -644
265 -644 -1025 -1242 533 1146 894 264 228 1903 1648 826 1709 1683 -648 -1484 -913 -49 -915 -1802 -65 -509
285 -509 -2613 -583 1787 774 110 1407 1617 -32 -807 1372 1487 -1162 -509 591 -1120 -1373 171
302 171 748 -155 -462 242 121 -812 255 1392 10 -421 282 -213 -358 171 251 472 -170 -485 -283 -236
322 -236 -243 -50 -57 178 -210 -817 305 935 172 291 733 30 -556 -480 139 -219 -921 -74 -58 -940 -35 909
344 909 409 305 783 635 18 -149 545 496 -774 -289 148 -922 -949 108 -15 -157 -263 -2 359 298
364 298 301 758 149 284 348 -86 29 397 -86 -151 -184 -288 -219 -414 -290 -170 -328 -181 -88 -218 515 496 -186
387 -186 312 509 175 23 130 257 84 -762 -312 -146 -744 -231 22 -188 -264 60 145 207 470 468 146 -114
409 -114 145 329 -197 79 451 -217 -249 -89 -114 89 -205 2 -9 -272 -48 30 -47 343 445 -40 -63 199
431 199 -105 112 59 108 -131 -267 -136 -15 -339 -18 10 -184 -16 165 -202 -39 174 280 -5 -203 124
452 124 -9 -72 31 344 -221 -100 113 26 133 63 138 88 -57 -147 73 -87 157 56 -323 72 65 26 101 92
476 92 234 272 -130 82 188 -68 203 -97 -66 -70 -77 -205 -152 109 188 -47 -233 63 32 -159 87 270 -138 65
500 65 83 283 208 107 70 -172 22 -68 -149 -234 -45 73 -138 -77 -140 -37 -50 214 307 84 190 88 -2 -31 112
525 112 -1 -201 -191 6 -111 54 -92 -121 -132 -114 18 75 -120 247 35 87 151 132 127 -8 29 33 -105 43 21
550 21 89 -195 158 -46 -30 49 146 117 97 243 35 55 61 -4 149 3 -44 103 77 14 83 -140 34 -69 -127 -34
576 -34 -203 4 -75 -223 268 135 -140 -5 130 -5 79 106 61 92 2 81 -112 -126 -61 -39 -63 36 -200 -39 69
601 69 -18 66 154 -115 67 -42 91 -136 -13 57 63 151 -42 2 -110 -59 -175 -54 44 -40 -142 -56 -75 -199 111
626 111 -1 -2 86 -100 34 -101 122 -8 60 65 -11 -48 44 139 -108 124 -127 122 -90 -86 174 -262 101 -19
650 -19 89 -16 141 130 86 12 -8 52 69 79 90 51 -127 -114 -125 4 19 -67 60 -16 -99 8 42 214 50 57 77
677 77 77 135 0 128 -28 20 19 198 -43 -36 -29 21 -226 -107 -78 -151 -31 -186 176 -1 -6 99 124 119 174 43 37 -74
705 -74 -142 -100 -94 -81 24 -56 -18 -56 38 48 91 83 -51 141 61 22 -23 -85 37 -69 -85 50 -74 154 -33 -30 -15 -73
733 -73 -89 26 -41 35 -42 -112 -41 -31 11 250 164 -23 -52 277 -85 -108 -100 1 106 -98 65 14 -5 -62 -174 49
759 49 0 -154 215 42 38 128 -57 -64 -13 143 -15 217 -113 -186 -60 -19 75 112 -140 -136 -223 -277 -4 15 -170 -54
785 -54 -21 -44 91 173 -44 -3 61 71 -34 21 -18 -6 85 50 20 39 -150 -88 -27 9 -51 -121 136 145 244 -21 46 275
813 275 62 98 -30 -46 -55 19 -43 158 52 -75 -131 164 -43 -10 -79 -221 114 20 82 102 -60 112 -64 -116 -57
838 -57 -75 7 151 -87 48 -69 -156 24 -62 31 -82 -110 69 0 53 115 36 313 29 -101 -32 134 -220 -241 -26
863 -26 39 -68 160 54 185 -166 17 -207 -88 -22 -2 -38 -157 117 23 -181 88 211 -139 144 4 -28 -54
886 -54 15 -240 -15 -84 21 39 38 48 19 48 57 11 232 165 94 210 -191 59 -53 -176 77 245 204 -144 -1
911 -1 23 -33 20 -119 84 0 -50 -162 19 73 64 -127 -68 246 9 157 10 209 151 156 25 28 231 -105 84 -199
937 -199 -37 13 -157 37 33 27 16 228 -89 14 -6 -179 16 27 12 -14 -230 6 74 -136 49 -30 -31 -11 97
962 97 157 169 115 -140 68 -32 100 13 34 104 31 69 -186 -8 43 -71 81 -7 13 -19 22 -52 -223 -50 113
987 113 104 166 78 59 134 89 -84 -97 -160 30 59 -57 55 -104 -43 15 -65 -40 -207 -39 -122 53 -3 140 -92 115
1013 115 -96 -94 -81 14 46 -78 -31 -20 20 81 6 166 24 56 165 -142 -6 38 83 25 -46 -18 -111 119 102 188
1039 188 150 6 -110 63 -31 -104 -60 57 -103 -95 24 30 89 -90 -143 31 276 30 132 206 162 18 128 192
1063 192 48 52 -159 -64 -84 -125 75 39 -69 -88 29 12 91 71 -75 -96 15 -2 103 28 11 70 -115 -100 -22 -67
1089 -67 -87 -48 11 15 114 159 46 -132 -190 102 -69 -33 126 146 6 -35 -220 4 -76 -171 33 24 120 -154 57 56
1115 56 -125 -65 -57 -62 2 -145 14 101 20 -115 -48 145 -11 55 -33 -25 -260 -123 -90 -136 -101 -56 44 -26 -34 135 -15
1142 -15 91 37 46 -76 -54 -62 90 146 31 36 -157 8 62 -63 34 -113 -64 9 33 145 109 7 43 96 79 -48
1168 -48 109 -108 -12 -5 -101 -70 19 25 -11 102 -36 -111 189 84 5 -32 103 135 54 127 173 69 25 -73 -101 -111 -39
1195 -39 4 -150 20 56 -161 55 61 -5 55 2 138 -5 203 -47 -91 94 -22 125 -106 -185 -128 55 23 12
1219 12 130 99 27 -80 14 0 95 136 0 62 48 80 -37 104 80 124 -66 -37 86 -98 -15 -4 -67 -206 -21
1244 -21 91 36 49 -12 80 143 -109 -35 47 39 162 -17 35 -6 46 -83 104 -12 42 132 54 -44 -109 -19 4 -69 71
1271 71 -32 -61 100 -172 64 -27 100 116 -58 55 -53 -76 -9 -6 31 18 -85 128 81 -4 -184 -68 130 62
1295 62 -49 -43 59 -53 46 126 -88 31 249 53 5 -33 85 97 59 79 5 78 189 36 90 89 -6 47 106 -95
1321 -95 -50 139 -55 44 79 30 14 -16 60 45 40 71 -16 -18 14 46 97 -128 -100 116 118 93 -36 18 17 17 -83 54 -30
1350 -30 -22 -114 -47 -95 43 161 212 -27 15 14 69 169 29 12 -16 -123 7 58 -36 55 77 36 122 -41 -54 12 -69
1377 -69 33 109 215 52 101 -147 52 -27 -135 52 -19 0 -12 16 36 97 -68 71 -8 33 5 -105 -7 33 13
1402 13 -2 -227 -50 93 -124 -141 -63 165 -96 -52 113 -27 127 33 78 99 83 33 -29 -130 127 -140 -139 -82 -66
1427 -66 -198 27 -88 15 35 -71 235 81 61 -48 -139 -49 93 115 -44 -111 187 37 102 89 -77 63 51
1450 51 147 -14 -58 -77 19 42 38 73 -78 -103 -58 -72 -85 -61 -149 -26 -68 -53 -146 208 -64 -36 143 -15 -52 10 -92
1477 -92 -150 24 89 22 -82 125 53 -37 85 -122 71 36 67 -159 176 47 13 6 33 140 -77 61 -117 8
1501 8 -7 42 -88 22 -148 -54 97 39 -119 35 -41 -40 -49 -65 39 -137 -25 -35 54 -47 59 8 135 27 13
1526 13 53 16 -128 -5 93 -32 -25 -15 -79 35 -10 4 40 -159 -60 77 62 2 -53 -73 -37 87 -97 -60 86 -35
1552 -35 -68 -107 -79 14 -276 22 25 -41 -5 192 -117 -18 -93 -72 90 -119 -81 92 -49 -16 -45 -4 172 48 -48 -69
1578 -69 -93 -103 73 19 -57 -129 -115 -28 14 6 -87 8 2 45 4 -20 -61 30 153 -161 35 -121 -100 67 158 -37 125
1605 125 173 -62 169 -22 -136 -110 87 -18 32 -31 -197 44 -86 -31 -163 94 118 -112 -97 4 -157 -40
1627 -40 -16 137 -53 -84 105 -152 33 28 193 18 -38 58 -13 -17 -89 18 196 -62 22 -35 -88 116 17 130 -1
1652 -1 -40 -39 -104 29 -194 67 196 21 -11 -33 1 26 137 -144 -69 -54 -23 -108 -50 157 71 -91 71 -42 -53 -189
1678 -189 -10 -106 -15 -135 118 126 -69 182 -12 9 -1 -97 -111 -40 57 -133 -97 27 -73 -70 96 215 -1 54 -10
1703 -10 -11 8 20 -66 -210 114 97 -59 -168 -118 39 6 181 -23 -83 -6 -15 -68 -78 -130 -115 58 84 145 -39 68
1729 68 8 -6 -26 -29 76 53 -134 -72 4 1 -12 -62 14 45 156 73 52 11 57 -174 -55 -29 22 -217 -36 -156 37
1756 37 2 -42 -73 -13 157 5 -12 198 -95 -76 -42 -34 60 -36 -41 49 41 6 135 2 103 -49 -73 -62 -145 73 172
1783 172 -110 -48 -45 115 34 96 45 2 -54 102 -239 -96 -33 10 -38 -43 -50 -93 66 31 -66 35 49 32 -114 -38 32
1810 32 104 46 167 -31 -155 198 113 40 -4 -77 16 -18 84 -10 124 -12 -4 -6 18 -21 32 0 66 36 -50 -13 -107 -122
1838 -122 -141 60 77 30 -54 49 128 -134 158 42 111 108 -73 109 -22 -50 -49 -71 -60 55 -41 -20 -163 211 -18
1863 -18 10 48 3 162 153 -30 3 10 -73 -8 51 -30 52 46 -76 31 -184 73 124 90 -33 35 97 -92 -1 15 -70 -58
1891 -58 -237 -48 -150 95 -52 16 -60 -143 78 47 50 -92 97 63 0 7 -25 127 90 32 84 142 -40 45 -28 -32 -144
1918 -144 108 28 -108 -62 -89 59 -68 25 -194 -5 -14 174 5 129 39 14 11 -7 -10 -83 -108 -62 155 17 -33 -26
1944 -26 90 56 171 15 68 -18 90 -206 -61 -109 -80 -56 -162 -160 -62 17 -51 -113 62 -146 138 -126 33 -39 15
1969 15 -15 115 168 12 -105 -45 348 -202 -87 -158 -21 -131 -5 146 47 262 -167 -27 -9 17 8 87 94 22 109
1994 109 72 102 -97 -134 -105 147 -7 -63 11 -74 49 46 -40 6 -72 52 -1 22 -69 110 -20 48 42 64 32 307 -75
2021 -75 53 68 -119 -20 -133 124 208 -90 -162 -7 109 -31 -154 16 105 -81 -77 3 147 53 140 -86 18 -3
2045 -3 122 57 -74 61 -43 -65 -16 125 -111 65 135 -2 73 11 95 -59 -138 -152 6 -22 -124 8 -17 -51 -49
2070 -49 -5 -20 44 -103 58 130 51 117 -3 63 -64 93 -19 -27 124 -47 122 13 55 24 53 21 -57 -108 -17 94
2096 94 -12 155 -49 -164 6 23 140 -60 39 -10 -134 12 12 25 104 -108 15 84 -2 -58 -107 -148 -174 -177 15
2121 15 -46 -5 -193 65 -16 -202 -127 191 -93 -60 193 -42 60 -136 66 99 -19 -56 24 131 -34 50 106 22
2145 22 -38 -105 -220 -34 131 -12 -177 -76 -2 43 -46 86 30 22 87 54 182 -12 3 56 -129 135 141 -34 -97
2170 -97 1 -113 23 95 -55 -99 107 -16 28 165 177 -131 67 147 -5 104 -20 -7 8 -116 -31 -87 -10 177
2194 177 159 72 52 -58 -59 -69 -28 -75 -49 -166 -75 -6 92 16 -36 45 68 99 107 249 -168 -32 -63 16 93 112 36 -70
2222 -70 18 -75 15 79 -116 -49 -170 -47 111 -91 -42 -81 -190 213 -195 -196 -38 78 -17 -54 -70 -72 -114 58 186
2247 186 9 -49 -143 -52 28 -46 -188 213 -13 -84 -45 1 83 -28 -19 147 146 135 19 15 -71 66 66 -84 176 -167
2273 -167 69 -70 -210 64 -51 43 -92 243 -20 146 -61 179 89 -28 -28 -28 23 7 20 -116 -51 -114 94 -84
2297 -84 10 -17 8 59 -17 -15 -70 22 102 115 -36 14 -107 -12 46 128 243 -92 53 -56 24 -15 140 211 177 -150 -63
2324 -63 2 44 -35 -28 -74 -37 -95 -63 92 -118 101 -145 -58 0 82 -6 105 87 10 43 -59 -97 162 -111 -51 -66 9
2351 9 -91 -55 -59 -20 125 -3 -35 46 -4 23 -113 -31 -83 30 101 97 -21 94 -77 62 64 -17 65 -61 118 -171
2377 -171 39 76 93 -32 21 37 -21 -12 138 4 75 70 137 56 -51 4 -39 114 -110 120 106 -118 -81 -33 -10 -78
2403 -78 67 46 -6 -98 16 26 139 103 65 117 -165 116 -15 56 19 -127 -11 -129 58 17 96 84 0 -50 83
2428 83 -39 12 -16 59 41 144 -54 97 131 181 -32 -47 -40 -93 71 78 -174 -82 -46 -8 39 -45 -116 -11 -34 -72 116
2455 116 -119 67 -160 19 -187 -51 -20 179 73 58 168 147 60 -69 -24 172 -71 35 -166 -174 -77 133 -37
2478 -37 -67 4 102 62 -60 67 -192 81 -83 21 17 40 -34 -74 -56 -34 87 -35 77 50 -82 -93 54 48 -43 71
2504 71 -48 46 -74 119 -13 75 185 101 52 48 5 -83 155 -63 28 113 151 44 39 81 -34 -7 -74 86 55 -91
2530 -91 -113 -98 129 97 -121 20 -73 -87 69 21 103 13 40 30 69 115 -110 157 -14 96 -58 -31 101 22 -68
2555 -68 49 -48 58 -72 -70 -47 139 134 38 -87 -14 -48 -68 28 -187 -114 100 6 37 19 12 -75 87 55 21 -144 -13
2582 -13 9 -112 140 -42 -29 -35 -102 -82 104 104 -60 -15 210 -86 -109 64 -91 -61 22 -25 46 117 104 -12 1 -11
2608 -11 93 -93 -5 169 -9 -35 131 65 -27 -124 -29 1 -28 -105 -7 -59 142 74 41 -88 85 100 -136 214 71
2633 71 -65 58 -204 152 -26 26 -17 -149 -44 -15 55 56 -103 36 -48 -114 8 13 29 -63 36 75 83 -12 90 -13
2659 -13 -165 -78 -41 28 -13 -24 67 6 -129 4 -47 -23 -26 2 -5 -12 69 -43 234 60 -68 129 -28 -57 59 31 3
2686 3 30 98 0 39 -128 58 -105 -48 31 110 90 -10 -12 47 -54 -116 -104 123 -125 62 -35 0 89 -149 -138 -119 77
2713 77 173 -15 -61 160 154 167 143 152 -4 14 77 -59 -33 34 104 41 16 -35 22 30 -24 -48 -5 -1 18 -188 14 69 -25
2742 -25 -125 -70 31 46 -64 54 -89 -57 73 -6 48 -62 -14 105 48 -55 -104 24 12 -109 51 51 146 150 -8
2767 -8 -42 10 -104 162 -60 140 -85 -105 189 -22 36 -122 111 73 -45 28 -22 33 48 22 -45 -130 -57 -43 3 20
2793 20 23 -65 24 -4 130 -137 -100 92 76 47 135 -12 101 -19 93 307 -77 -134 6 -150 78 -66 97 40
2817 40 -25 11 63 -65 36 -84 -2 -16 -53 -72 -31 75 -7 145 3 -34 -37 -99 48 103 5 115 -220 -101 -25 108
2843 108 115 68 76 124 101 35 14 -134 112 -87 -18 24 75 88 -71 35 85 59 24 -70 94 -41 63 180 -49 45
2869 45 138 99 -160 102 -15 85 63 -64 -45 53 37 -48 241 -59 -68 58 -31 -27 -77 -2 91 -5 -160 187 13 -101
2895 -101 -37 95 -59 64 -38 50 75 55 -156 -198 -50 -14 41 -64 -105 112 99 23 146 10 -49 57 -1 -67
2919 -67 -101 46 -26 151 57 -33 -41 -132 85 143 -124 -137 65 64 -89 10 -34 -108 59 56 86 -40 -25 4 88 -22 -96
2946 -96 -17 -125 153 24 -121 -69 11 38 65 15 -23 -119 -28 -46 19 -75 -4 27 71 153 42 -28 -64 26 20 43 -62 31
2974 31 200 -112 -2 102 -40 90 27 57 -61 -71 -25 104 -88 45 48 23 -44 134 138 49 143 15 59 -10 -136
2999 -136 -23 -70 -83 -85 -137 -103 3 47 -91 45 -67 -65 -52 3 189 -14 34 -84 36 -89 -81 94 -70 31 75
3024 75 74 123 -214 -93 27 -115 -99 -102 27 -48 115 -103 33 -63 -159 -29 -29 -55 9 126 -19 38 -19 26 29 -44 -14
3051 -14 -40 8 171 -81 61 2 55 26 -6 -38 -255 144 13 131 158 40 -76 111 38 12 -7 8 -36 71 100
3076 100 -27 182 -32 90 -43 -26 -36 29 -82 59 -21 96 99 140 98 66 103 -39 -25 -149 21 -11 -55 61
3100 61 -51 140 6 35 96 -18 50 103 -98 51 67 -31 -118 -7 -168 8 -82 -34 14 52 -24 -155 23 45 -18
3125 -18 107 -179 -192 -78 173 -24 -96 -74 -94 163 92 -2 38 -156 41 -82 -160 -43 -177 95 -15 -194 -41
3148 -41 -41 -76 -89 46 -8 -103 41 8 48 36 -72 28 2 10 113 -111 78 26 -35 84 62 -35 -82 -118 125 -117
3174 -117 149 44 121 -66 -74 58 8 149 -22 49 -41 -103 3 7 61 98 -68 51 -18 -24 -75 55 -106 -51 -36 -70
3200 -70 -42 36 -69 -44 -83 -194 -241 78 40 45 -120 -119 -37 -141 153 -163 88 56 0 91 91 -48 113 38 25 -76
3226 -76 -109 61 -128 -36 32 -23 -89 -97 100 11 -69 8 8 55 -145 7 -65 25 -172 4 -112 102 140 -11 61 -14
3252 -14 8 74 -48 14 33 200 20 188 164 -49 32 1 25 -20 138 -51 143 148 -8 -45 -93 -27 -82 241 -73
3277 -73 -25 48 13 -78 37 32 -56 2 -27 -202 -17 83 -114 109 -172 30 86 52 205 88 115 -51 87 -6 -55
3302 -55 -25 -234 -126 76 14 -57 4 -10 -27 0 62 166 76 -261 28 -62 -35 1 -30 191 -106 83 43 -127 196
3327 196 -25 59 -103 115 143 61 -74 -125 73 -42 -106 -21 78 2 65 79 3 142 -26 59 -86 -15 181 94 -33
3352 -33 -15 14 -33 96 17 -63 -32 -121 132 203 59 -64 -12 31 -70 -65 45 10 -32 -65 -15 -63 -98 237 43 -103
3378 -103 -14 73 36 30 -76 100 -13 67 -4 48 -121 -9 -26 87 -94 112 101 -42 -29 52 119 166 137 -83 -150
3403 -150 66 -161 39 -22 61 -55 54 10 -17 -9 123 -72 -110 -65 4 54 43 -23 -54 -62 109 199 -71 -38 17 14 -159
3430 -159 42 -65 101 -62 -8 110 -52 18 43 148 -4 -98 -46 12 -33 -118 -42 -3 -133 82 -157 -27 50 95
3454 95 37 -8 92 -60 100 170 -47 71 0 -5 -70 30 205 -32 129 -2 -123 -63 28 16 31 -44 126 -34
3478 -34 46 72 -9 35 -184 -133 -65 11 -77 -46 -181 -31 -35 152 138 95 -101 116 25 -48 54 85 -74 -46 -28 31 93
3505 93 -101 12 194 16 -159 25 10 103 20 -45 138 4 141 -1 -87 -145 -169 253 -30 9 106 -62 -28 19
3529 19 -53 10 -42 -11 -32 22 34 139 -65 -167 -15 14 72 -60 -58 139 -8 27 -4 49 32 -32 55 98 -32 -124 289
3556 289 -70 -35 0 -84 232 45 162 10 -34 -124 -116 37 74 62 -90 -72 28 25 -19 -135 -86 -95 0 40 28 128
3582 128 -68 -94 -30 -3 -138 84 -70 33 14 38 -18 65 -32 -26 130 -23 249 -51 122 10 73 -69 12 26
3606 26 -41 -22 26 57 20 34 45 -121 9 43 -75 96 -70 85 94 -36 -91 1 130 68 -196 0 -22 36 7 42
3632 42 26 -187 -59 -109 -75 13 -15 -24 -7 66 26 15 -46 -69 154 -152 -60 -66 144 51 -10 -75 20 -148 -4 11 -198
3659 -198 -52 -151 -138 -42 156 -30 131 -43 80 20 79 52 -50 136 77 -56 -106 -67 14 107 36 -83 -48 -90 -13
3684 -13 -81 -36 72 3 -54 17 -124 -109 27 100 -38 -26 65 -52 62 23 -68 33 33 -61 -9 -101 5 -106 -114 5
3710 5 49 19 73 77 -185 -9 13 131 189 249 37 -63 61 60 149 -2 -14 -94 67 -94 -59 33 146 38 89 -12
3736 -12 -15 -5 -143 220 -108 176 -64 20 124 -27 -45 11 -94 -68 -42 87 -110 -104 29 -111 25 -108 116 153
3760 153 -49 32 17 34 -34 22 185 -192 -85 132 99 113 144 97 48 -54 -143 -71 54 17 58 -83 69 39 75
3785 75 -10 -151 -79 -54 99 69 180 -9 -125 -43 97 62 109 68 49 -61 -43 110 79 -1 59 18 -78 86 -68
3810 -68 -31 -128 60 4 16 -114 44 51 79 -70 52 33 -60 59 -46 -17 -39 -69 -63 16 96 50 110 -135 -19 -10 -160
3837 -160 44 97 -1 28 104 197 28 31 -18 61 141 112 31 63 102 107 -24 178 92 17 89 87 -34 -10 -31 -49 81 119
3865 119 31 -32 228 64 24 46 -92 58 -28 54 34 -38 167 -60 27 232 27 -16 -150 -144 -79 -29 173 -1 48
3890 48 68 84 10 72 62 -78 176 4 5 -47 -47 -10 135 -166 -134 69 -161 -250 -134 105 72 -218 -94 -102 -101 -47 32
3917 32 -26 57 -38 80 42 92 -173 -170 -40 27 -51 108 -155 105 61 -135 42 50 -75 -11 -20 2 -15 -81 8 -114 -23
3944 -23 1 152 -109 -65 -112 130 79 -40 -98 85 56 55 107 25 -118 -160 -20 108 -40 -66 70 27 51 -86 91
3969 91 -1 -86 -77 5 -73 60 -78 -12 -140 -157 -32 -2 -62 23 150 -86 213 -120 102 94 68 11 -31 6 137 -136
3995 -136 -66 -4 4 84 -35 64 61 48 -71 -14 -1 44 2 -59 4 -51 -146 74 7 -94 134 -149 22 -40 -40 -14 73 210
4023 210 -49 44 177 -63 41 -64 44 50 -75 -86 105 45 90 -84 -39 61 -5 41 -143 -74 -78 -37 -126 62 74
4048 74 -88 166 51 -196 -36 -106 63 18 -185 92 69 -142 164 101 67 16 136 29 -64 40 210 -49 -112
4071 -112 79 -131 -155 -72 67 55 -47 -119 88 -165 20 -100 42 121 83 -15 -61 31 -23 -22 55 -23 5 -12 119
4096 119 -49 -75 -45 217 75 25 -46 -52 148 -99 4 -70 -45 -35 -72 -129 76 125 -64 -183 -178 -146 111 123 -91
4121 -91 -184 48 79 35 -7 147 -127 31 0 36 43 -128 31 10 72 135 -46 -66 140 19 46 3 109 189 -14
4146 -14 -28 -7 -35 64 91 -20 224 34 -112 62 -92 -36 -238 90 174 -77 -168 27 43 20 1 -18 -47 -44 41 12
4172 12 40 -51 70 2 30 -181 64 -16 -3 8 55 27 -105 -17 84 50 86 -19 -60 76 104 -66 -13 -136 24
4197 24 -99 94 1 -49 71 104 25 52 -37 47 -24 72 10 -242 -21 -28 117 -12 128 -33 97 38 86 -128 20
4222 20 -48 -2 177 58 18 134 81 163 51 74 5 -112 -66 74 -168 16 -42 -25 5 -206 43 -12 -166 41
4246 41 34 -73 -189 -15 33 -52 139 29 55 -100 8 -57 2 -65 -59 150 30 -21 -30 -107 66 52 2 136 21 83
4272 83 90 80 -54 150 27 149 -6 -118 -38 -141 7 111 16 -63 -84 146 -51 200 -126 -24 278 -11 118
4295 118 66 -78 60 -127 113 88 -75 70 -45 -137 85 -208 -2 285 14 27 -86 -109 -172 -108 -82 128 106
4318 106 -107 45 18 71 0 -88 98 -2 -23 -5 -100 25 -233 -28 54 53 -98 -60 -24 0 -9 -69 -5 118 -5 -34
4344 -34 -43 -20 -80 19 47 100 59 135 129 20 24 -210 -43 -26 43 81 120 -144 35 17 -24 -130 -15 96 149 -23 46
4371 46 161 -98 -88 52 12 24 -29 -100 -57 -57 23 -137 -63 96 69 -116 11 52 36 63 -126 -25 57 67 132 -10
4397 -10 16 55 111 -24 101 104 -148 70 -213 -51 -207 27 52 -91 -106 -163 44 57 62 43 4 95 -199 10 26
4422 26 -88 142 44 81 116 17 -40 -99 -15 13 -43 -86 47 129 -140 11 -62 -108 174 119 -28 -37 -128 36 55 -117
4448 -117 -68 78 -81 72 15 25 -63 -73 -66 -107 -103 -105 -135 -68 36 -25 120 -60 2 -124 56 -8 -47 -202 -94 28
4474 28 140 -121 -67 60 65 -33 -5 49 -46 2 -3 121 135 15 57 -21 -48 -3 -32 73 -257 -14 -68 -239 183 -41
4500 -41 -98 81 12 43 -66 -113 -136 53 -34 24 -22 -96 249 -57 9 -20 -26 111 35 -14 24 99 -7 -5 188 32 125
4527 125 42 -71 -84 -136 -172 39 -212 35 33 4 30 -16 42 14 -43 -18 87 75 12 6 -33 -150 13 172 -92 32
4553 32 69 -191 -104 38 -36 140 -69 138 124 -16 35 -34 -26 9 131 16 66 -186 -51 -45 -33 -35 -13 -25 65 196
4579 196 -73 -18 98 112 -71 -46 45 144 -2 -58 32 -58 99 -128 -100 56 3 -6 2 44 -67 -78 -94 -65 -67 22 -11
4606 -11 -40 49 102 6 -32 -88 76 -121 27 -81 6 70 121 64 10 -42 -30 -46 -145 16 -80 -55 -51 -121 15 93 -26
4633 -26 40 -199 35 88 44 -57 -33 35 95 -170 69 187 -171 159 114 4 21 62 -123 92 -79 -38 -155 -85
4657 -85 -180 -104 -53 41 -22 125 61 -42 147 13 -109 105 26 -74 66 -106 -14 98 -111 -137 -68 111 -51 105
4681 105 5 144 -21 8 201 73 -107 37 -20 -79 -74 -11 81 -58 46 -102 14 -45 44 -100 -18 6 42 200
4705 200 -115 -29 -104 -204 133 -109 -36 -115 -168 81 -40 104 -126 34 57 14 152 126 -169 -28 -47 -15 -119
4728 -119 -151 -61 128 29 2 16 22 -200 -114 46 133 -28 30 91 -172 -94 -97 -82 -121 -133 -122 47 -125 -267 -170 -182 -133
4755 -133 53 -65 -127 96 -8 -16 -136 -33 100 -77 61 20 10 -81 -85 136 -261 -14 33 -149 -9 -32 239
4778 239 10 101 -22 -4 108 41 -72 100 -72 -140 -53 -55 60 -29 -102 -47 -95 81 -21 21 278 -88 33 -35
4802 -35 160 92 99 110 87 -10 -84 26 73 11 -56 -1 91 -88 -5 62 -27 -23 97 -12 -41 14 55 -11 -97 -49 -62 -26 146
4831 146 -162 -50 -111 17 -175 16 -107 88 185 0 76 -187 -76 112 58 159 104 -210 133 1 -38 159
4853 159 -81 -6 206 -140 85 130 72 -38 49 69 -53 -83 -3 -46 113 14 46 42 -75 -6 110 -202 -40 -39 3
4878 3 76 50 -89 -11 100 52 97 -62 116 -19 -10 53 -70 101 78 15 -30 -79 -11 -102 182 -90 -60 147 -1 -90
4904 -90 -125 -135 8 71 76 -6 34 6 163 87 71 -14 10 -103 76 81 64 77 11 63 -87 -98 32 -96 -5 49 -112
4931 -112 21 -10 -65 -26 -99 -6 72 123 60 14 -2 -125 -25 -63 95 157 -110 -8 105 167 -44 33 -16 6 -123
4956 -123 112 -155 65 54 -11 214 22 104 3 14 41 41 86 76 -53 76 116 1 -48 60 119 -70 -243 -16
4980 -16 -68 71 21 40 -159 55 77 47 -72 -15 -43 -60 5 10 -25 -27 14 -69 -90 24 -78 -69 161 36 117 34 153
5007 153 66 31 225 15 -113 -155 -11 9 6 -42 -75 -40 -71 -112 -64 13 -146 -50 66 -47 -54 -152 56 -16 -35 -100 -32
5034 -32 -56 -78 -75 71 27 170 -44 44 -72 -111 91 77 -28 64 112 -170 51 -50 -50 -89 -106 -18 -47 84 65 86
5060 86 -50 10 -38 83 18 -105 200 105 -119 -12 7 -9 -2 -203 198 -131 169 90 37 -143 -21 88 32 59
5084 59 -127 -64 -3 16 75 -20 -170 14 -22 -45 19 1 63 -52 16 77 109 -7 -90 -27 -90 -73 130 56 -8 -28 -10
5111 -10 -28 14 -8 -65 -65 78 20 101 -33 54 -120 35 6 33 -118 103 -10 -173 -133 -81 -57 -29 52 77 104 0
5137 0 60 -110 -284 121 -40 -117 12 66 62 -29 -20 12 53 53 109 -34 -125 -16 67 143 66 7 108 36 65 -44 -58 29
5165 29 -78 90 -4 -149 114 96 -176 138 -27 -5 22 -42 121 -64 -107 45 169 45 -84 46 47 -20 -81 28
5189 28 76 -129 22 59 -30 1 -59 -243 -92 -92 -95 87 25 -64 75 229 -40 -29 32 -13 -50 -59 -12 -97 -6 107 197
5216 197 24 -108 -2 175 -46 26 88 45 -32 -70 46 -91 -58 -17 123 -44 7 118 33 27 -156 38 -28 12
5240 12 253 151 -135 -81 -59 -66 52 92 67 -51 -28 83 -16 1 -139 156 61 -94 236 -115 -57 28 -67 83 47
5265 47 57 -219 -14 -6 -13 194 23 18 34 -47 -35 175 -59 -155 -69 21 42 66 41 -107 83 28 -64 -32 45 3 22 73
5293 73 -77 31 55 -185 42 77 -5 -8 -5 -156 -27 133 -50 194 101 110 -1 155 -13 -60 -82 70 8 -74 -97
5318 -97 125 -35 36 77 -56 -56 32 157 -168 -1 1 -78 32 258 -123 -99 -21 33 26 11 85 35 -74 35 23 53
5344 53 -184 19 -58 68 -71 -24 -26 14 -8 -52 49 89 102 -17 -79 25 -91 0 -160 -150 84 51 -3 38 -62
5369 -62 -112 -113 -36 -2 -25 204 -34 -13 -133 -42 109 117 -52 45 -2 -261 138 -102 70 169 82 66 -126 -23 -147
5394 -147 25 114 33 100 75 127 192 -84 75 67 43 163 151 -89 68 27 41 20 -129 44 -16 14 -51 88 -170
5419 -170 -86 -80 -15 1 61 22 71 56 15 -75 -29 -67 73 13 34 279 -42 -14 100 -40 2 -55 -72 25 -97 -11 128
5446 128 -115 94 27 33 132 79 -20 -11 -101 -28 6 112 -42 130 65 -97 -24 144 -4 24 54 9 -30 -130 17 -36
5472 -36 70 -35 75 -93 85 41 -1 60 72 92 53 -89 -41 -49 -18 123 39 79 79 86 7 -53 -30 -104 46 53 -25 -13
5500 -13 42 106 -88 -66 -85 -26 -101 6 -32 -47 -41 -71 105 65 -183 -124 92 -103 94 -16 -26 63 -139 -270 -32
5525 -32 144 -30 -167 -19 -185 43 129 -101 -78 -132 -167 5 -45 -14 -119 20 -12 -101 28 -62 -63 141 -37 -112
5549 -112 77 -37 207 141 34 99 62 1 32 -110 85 41 -83 -141 70 81 -110 71 -114 35 -1 100 136
5572 136 -12 -55 -129 -132 -106 -23 -32 6 53 -59 -69 -85 -117 65 -67 93 -72 -142 1 -101 91 -32 -101 -43 68
5597 68 -96 -78 -107 7 168 -49 11 -85 55 -95 -42 -75 4 -142 -102 93 64 -58 85 167 -25 -29 62 22 74
5622 74 -77 -26 -90 48 50 -58 44 -52 33 93 -108 -42 -232 -70 93 40 55 7 164 4 273 -184 82 -129
5646 -129 11 -174 -79 123 92 113 56 45 88 56 -99 180 138 4 38 14 104 -110 57 49 125 9 74 70 40 30
5672 30 -49 15 125 -181 22 -108 -57 37 -1 -57 -108 -7 -68 79 -24 -69 89 58 45 99 119 83 64 32 -72 -83
5698 -83 -65 96 -53 50 169 -105 129 63 -124 -72 128 120 -85 -22 -11 -17 71 4 55 -7 205 -30 -40 24 -85
5723 -85 36 -65 37 -101 -123 28 -335 -139 160 117 127 -86 53 88 136 -79 -15 0 -157 -51 24 79 -227
5746 -227 -55 27 84 3 17 -82 -126 44 209 -134 -12 8 91 -12 -73 38 124 18 87 65 103 -8 -50 60 -190
5771 -190 -43 18 -179 42 -29 -60 -146 -62 -105 -6 27 -16 -57 34 5 -55 -97 -48 -62 -19 73 44 -35 -57 211 107 26
5798 26 -118 37 84 -87 -2 103 -7 14 104 -147 45 200 -47 -29 -4 -68 -49 123 145 -9 9 50 37 -42 -12
5823 -12 120 -53 17 -28 70 77 -93 77 -46 20 -143 -27 29 187 -14 -118 91 -57 17 103 -125 -14 -125
5846 -125 -50 -13 80 -88 30 -111 -159 -121 -89 20 -251 -18 -78 -85 28 -63 75 -54 88 63 28 15 -22 -110 -28
5871 -28 -47 -97 -14 -125 1 -149 -6 39 -168 -74 -90 7 -79 71 10 -124 -62 -18 38 -97 -99 112 8 -147 -54
5896 -54 110 42 58 -70 92 7 68 -27 156 -157 -15 24 -4 151 115 147 -77 11 -114 40 -194 -11 -73 -173
5920 -173 8 18 46 -14 46 -160 -231 5 -79 12 33 56 -170 -89 -178 -100 94 118 -15 73 -4 -90 -61 7 92 74 67
5947 67 192 48 -12 104 14 79 146 40 -70 -148 -115 -67 134 19 111 134 -76 148 -43 37 -19 104 -85 69
5971 69 -56 94 65 26 64 54 -35 -296 46 126 58 -63 -14 168 -100 -10 -16 -117 117 -128 -127 116 43 7 48 -39
5997 -39 104 15 -12 -159 35 -29 -69 79 -74 -18 -288 -118 57 -59 37 27 -38 155 161 67 -126 66 75 -54 40
6022 40 -56 44 -47 47 -75 -51 -85 -8 -201 -39 20 -15 -89 -90 -67 51 -171 -65 -37 -78 -63 -55 -79 107 -111 -46 20
6049 20 105 -58 -18 31 -79 -26 -15 -92 -100 21 -70 71 85 -77 289 -31 138 40 43 72 -42 17 7 141 -59 80
6075 80 -117 127 -142 163 101 -38 -152 128 -1 -117 107 38 54 11 -19 116 -141 29 -54 147 -130 -89 35
6098 35 17 191 -53 -56 4 78 -147 119 207 81 376 -93 50 16 -118 -114 71 81 47 96 47 27 28 -132 94 38
6124 38 35 -51 159 -5 15 -67 -46 -54 -137 21 -6 -119 95 -183 24 -55 -61 -92 24 86 7 -42 -32 74 110 19 -104
6151 -104 -102 75 -7 -51 7 86 -7 64 -35 105 13 126 -106 -111 99 -65 -49 -89 27 -193 87 -124 -160 -41 13
6176 13 -10 -121 -23 -12 -34 -28 35 3 4 -8 148 -162 186 50 64 -123 20 190 30 -116 195 5 97 -142 -62
6201 -62 30 -145 27 -59 156 -141 108 -202 -58 -40 -52 12 141 -85 26 -45 -46 -99 -153 -56 -44 72 -16 -140 77
6226 77 -29 -29 15 93 -16 -79 42 104 99 -80 123 -50 110 -36 0 -29 -11 41 -29 -73 162 151 81 -128 -95 78
6252 78 7 -57 17 -14 24 -70 45 160 71 -85 -9 76 -42 46 2 51 72 13 131 -71 168 145 41 20 62 35
6278 35 -77 -24 78 -116 -3 -59 -53 67 84 -8 -171 -70 111 85 -115 -3 -5 -1 121 76 -174 -41 -56 99 -114
6303 -114 92 -111 -106 -43 84 94 -103 -49 25 48 -131 142 81 213 160 -31 3 12 -131 161 -90 38 119 72 -131
6328 -131 -81 -162 9 -62 2 35 -101 106 96 -28 6 -62 43 -111 -88 -17 -89 106 -121 -79 69 155 85 -89 -6
6353 -6 -33 34 -48 253 -1 -30 -20 -53 33 -158 -58 -37 180 -251 -133 -26 -69 93 -61 -30 14 79 44 -114 142
6378 142 11 -50 -37 -57 8 -45 23 -27 142 -129 23 89 49 -187 -11 74 2 -49 0 82 -4 -4 1 -18 -2 77 93 -3
6406 -3 -178 24 -31 147 -70 17 -27 104 -49 -40 75 13 232 117 3 27 16 14 0 -73 -79 -56 61 -41 86 121
6432 121 -162 61 -26 38 14 62 53 -20 -23 34 52 145 -68 -56 118 101 131 -109 153 -51 43 -371 131 -45 -172
6457 -172 -114 76 -20 141 169 -41 139 -59 21 -93 -6 -38 -242 64 -9 -61 -51 -96 17 22 193 61 -17 134
6481 134 -67 -1 -40 -265 -29 -67 66 -61 20 -113 -203 36 2 92 -79 -91 2 -52 257 -72 82 44 10 -27
6505 -27 -63 -182 118 120 46 -82 -92 -62 -232 189 5 86 -84 -47 -11 155 -87 34 -77 105 29 93 -16 -217
6529 -217 63 -74 37 2 127 -2 64 -96 -30 1 -39 -13 225 -64 -31 -134 -135 174 61 117 -49 178 -5
6552 -5 -173 -110 -95 68 208 108 106 -88 -121 88 84 -66 126 186 -28 33 -106 51 -70 191 -163 -19 -165 66
6576 66 -82 -122 84 106 -147 -57 -114 -262 -6 -59 -15 -53 -165 -66 -42 21 70 -32 133 -58 -74 127 90 19 46
6601 46 -57 -76 168 9 48 -67 -171 108 142 -11 -69 -6 179 78 41 3 -190 -7 189 1 -58 -84 -155 24
6625 24 5 -76 6 104 -30 -69 -138 124 164 85 -62 87 -2 -60 1 -48 -4 -221 -44 62 -10 7 -36 -50 273 -234
6651 -234 -76 66 -72 127 41 -28 84 -51 68 105 43 -16 34 -80 -36 -21 -129 102 -63 -223 -111 -140 -17
6674 -17 51 112 -132 -36 -40 -27 223 106 -81 -236 -84 -52 -13 177 103 2 -4 55 -1 27 -95 31 -75 23 -27 -40
6700 -40 173 123 -143 77 96 58 121 -90 220 -27 82 -187 -38 22 80 92 24 23 -148 -32 157 -129 12 -128
6724 -128 26 -30 7 -47 -68 -103 118 -5 60 56 -229 28 20 94 58 -90 -20 59 -102 -15 12 29 -45 -139 -102 48 14
6751 14 91 -80 19 -63 86 -117 24 172 -94 -17 -70 -97 -71 22 137 81 60 -100 36 -40 26 75 52 -15 -155
6776 -155 -57 9 95 12 -101 3 -66 -100 24 39 -21 -45 -38 -5 -64 -1 -132 21 -127 -233 19 -64 -132 57 -29 -131
6802 -131 185 -225 -82 -119 15 -44 32 -85 -6 90 45 -176 -15 -88 -59 128 -94 -110 10 160 -21 -111 -63 118
6826 118 -99 63 81 -36 -103 -18 -148 35 66 207 -12 -52 -62 -68 19 -191 -45 -139 -41 13 -88 184 -47 107
6850 107 45 114 26 -161 -184 121 99 -187 -2 86 -10 140 132 -115 48 -29 -78 64 -19 48 -51 -154 122 -54 -100
6875 -100 88 116 -11 56 -27 111 70 49 19 67 92 0 -223 162 -14 51 24 -82 -61 -3 40 -48 -148 -143 1 -171
6901 -171 -26 -10 221 134 -95 -72 7 -151 124 -101 63 -101 -80 48 -38 65 -22 34 -98 79 -42 147 134
6924 134 -223 -42 47 42 138 96 12 68 127 -67 25 -2 91 -215 28 82 113 -25 93 -4 -155 -104 -182 -81 25
6949 25 -22 27 47 152 -242 -14 -29 -94 -15 -104 205 -129 -53 -183 57 124 20 82 175 -119 -53 -163 -13 -107 39
6974 39 151 -52 218 23 -143 115 -10 147 -44 -126 62 32 -57 -15 17 79 -46 -65 58 49 -147 -98 51 -68
6998 -68 100 33 -20 -55 -85 8 -82 -136 10 229 105 -55 261 -18 35 71 44 -65 -32 58 -72 -43 58 -131 -34
7023 -34 -155 -60 -85 93 14 -103 -41 39 -54 38 -18 -72 -30 56 111 -75 1 92 -27 -78 116 -14 -61 -166 -28 94
7049 94 -13 -127 140 -54 -73 -9 144 5 -49 47 -68 74 -39 8 59 -15 7 -31 -78 -27 69 27 101 -128 -73
7074 -73 44 45 0 108 -11 -76 -62 97 12 64 -9 -129 33 22 107 157 98 14 -116 66 -17 87 -2 43 162 -87
7100 -87 3 30 38 -103 -55 50 -94 -30 -78 -173 -77 67 -128 25 93 -94 117 -113 -90 -216 -133 -92 -26 79 -142
7125 -142 -69 -227 -1 -155 23 52 143 83 8 81 24 28 -59 52 -143 63 56 81 -132 -50 37 25 -7 6 8 -93 -54
7152 -54 44 70 -145 45 -211 33 -75 60 25 -17 -71 -34 67 26 -146 -8 33 -77 60 -19 28 -131 -55 32
7176 32 -154 -102 18 42 -43 138 116 174 92 82 175 40 -73 6 -48 100 87 -160 -60 65 44 -183 1 -142
7200 -142 18 -42 -41 -212 15 39 36 82 15 -93 -73 -38 111 36 -91 -15 -94 54 -150 133 -44 -142 35 12 -22
7225 -22 -105 -125 -44 -5 54 70 -130 -83 -32 -26 34 273 94 45 -122 -35 111 46 4 -59 42 -3 70 186 -121 -17
7251 -17 76 -33 1 -40 -88 119 -61 -10 -231 -15 -15 12 -90 24 -5 38 -95 70 -57 77 -49 6 250 -11
7275 -11 215 -66 -50 65 184 6 56 57 -207 -45 -14 -15 -112 -70 78 47 -39 105 -151 138 99 3 -150 -32 44
7300 44 19 -48 -203 -187 -15 34 42 139 -93 -118 64 28 28 102 -32 5 -7 -69 75 36 20 165 -79 47 30 60 58
7327 58 162 -10 26 61 -40 -123 57 -74 -114 -44 82 -55 123 -153 -31 163 -213 -48 -145 5 127 17
7349 17 -85 -170 16 122 -25 52 73 -249 -95 133 44 -149 53 1 146 -119 -100 -93 -51 -88 -131 -53 -9 -75 -12
7374 -12 -38 52 59 -245 -129 -129 38 3 -104 14 -50 -113 16 -110 -235 -56 40 98 -67 51 -184 6 -83 11 -40
7399 -40 -68 191 -14 29 -116 7 -1 -16 -25 -88 -170 -83 2 140 94 -19 67 88 59 -37 -10 -119 -106 76 66 -47 67
7426 67 32 230 53 -18 -150 -92 47 153 63 27 2 105 73 149 272 19 -16 -264 -60 -11 39 -41 73 -37
7450 -37 -171 54 -101 31 115 -116 36 -96 -60 34 -133 -75 -62 67 29 -46 11 -95 184 -68 -79 51 -15 64
7474 64 44 -114 204 80 68 83 -20 -67 136 -131 141 -23 -132 28 -136 -5 -128 15 -43 113 8 -125
7496 -125 158 -69 -112 -92 147 -64 -233 38 -36 -76 62 -136 -48 23 49 -10 141 129 4 -49 -46 72 35 80 -256
7521 -256 -54 5 10 -83 -183 39 -65 31 -113 16 -89 67 -95 121 -177 -128 -32 -132 65 -102 -115 8 -33
7544 -33 111 67 -80 -48 70 -60 -63 79 -56 79 -59 -15 155 -151 -111 -38 25 1 101 126 -38 -4 107 -38
7568 -38 48 70 95 41 -2 -48 -11 -12 -48 -100 85 53 8 59 123 96 11 70 -146 -87 113 -80 -5 58 5 51 102 23 36
7597 36 24 -84 45 -66 129 109 85 -52 18 185 149 101 50 108 6 84 -124 -1 4 206 -144 98 -57 -18
7621 -18 137 -20 -158 -65 -109 -83 50 -4 83 -59 32 -16 8 -23 -133 -15 103 -8 -137 158 -110 -13 -42 75
7645 75 148 37 -59 95 7 64 -68 -19 -43 78 -19 86 82 79 -3 -106 28 16 -40 70 54 -121 65 90 86 -105
7671 -105 94 63 -96 -88 -34 45 -74 90 40 -12 18 41 49 27 -149 14 57 24 -73 -2 89 -9 -14 -7 103 158 -78 18
7699 18 53 -14 146 40 -106 -137 -2 -40 113 172 -40 1 -49 173 -99 34 -135 29 59 9 9 199 68 -112
7723 -112 -135 -98 -5 0 108 -168 70 37 147 -51 -13 102 -27 -109 59 -15 -27 124 -17 98 -35 -129 -23 -85
7747 -85 22 -47 38 -36 15 86 -17 4 -22 -125 -23 21 -75 52 9 107 7 -65 2 -239 -104 79 -43 -61 -70 -54
7773 -54 171 -95 -57 106 111 102 -6 -3 -29 -10 -12 18 60 -53 -105 89 154 136 141 -29 -39 -52 -172 90 67 166 9 103
7801 103 -65 -5 -59 -122 30 98 133 -21 91 26 22 -66 18 85 -45 49 -59 -68 8 177 134 -7 59 -76 -183 -45
7827 -45 -101 -59 23 105 -82 22 135 12 -66 2 -43 17 40 -53 -42 -164 -18 97 -16 211 82 -99 -132 9
7851 9 -134 -11 58 50 10 44 -161 45 -38 60 -45 -86 -85 -21 76 38 -80 48 120 -83 -130 93 -56 52 6 -23
7877 -23 67 46 -95 43 156 -25 -39 -171 -41 -113 -105 -34 109 92 15 63 -108 -41 -26 49 -2 -65 67 -28 -108 -138
7903 -138 20 20 -2 39 -93 -58 21 218 45 10 217 13 -197 62 97 65 -13 214 106 -139 -148 12 -27 -188
7927 -188 122 -105 6 -92 -61 -180 113 -64 -61 1 -30 282 -6 2 30 18 55 -101 82 190 -80 -45 34 -56 -182
7952 -182 -80 -51 -112 83 119 1 4 -83 144 62 -38 -198 -6 -36 101 1 -59 -157 -18 -65 -99 61 -62 19
7976 19 16 -71 -111 196 30 -205 -60 -21 92 -17 -70 -61 9 -65 81 -132 -48 60 -142 -64 -114 -85 60 198 146
8001 146 -118 6 -47 -140 -107 95 -60 82 56 -136 -2 -35 -25 79 -34 -26 -35 -113 5 5 116 40 3 -41 -24 -4
8027 -4 -8 -42 -20 56 -54 -8 171 41 -84 89 -10 -176 31 -80 5 106 98 -1 -42 3 -20 78 -74 -59 42 -3
8053 -3 -81 -73 -33 -98 -132 -137 -30 -31 -185 79 37 -72 103 126 -69 18 16 -14 -109 143 -18 35 -56 -91 -11 -34 -28 -44 98
8082 98 -24 -40 -57 1 18 6 76 48 -105 -62 124 -10 -68 79 -10 -18 -104 56 47 2 74 163 -4 -46 141 -84 117
8109 117 122 -30 -10 -123 -3 -18 92 -18 -46 87 -47 -68 11 -79 71 -16 -32 93 114 -105 -46 -270 -11 -38
8133 -38 -28 -55 92 -64 -98 65 -79 12 92 60 -40 -85 -104 72 -189 -242 51 6 -116 -38 -11 62 103 139 -5
8158 -5 -44 -39 28 111 -41 -6 -46 -68 23 -100 -48 -7 -69 -6 128 98 35 20 6 111 0 13 -13 -15 44 -74 -32 159
8186 159 -16 13 -27 12 -3
8191c
$$ Imaginary data points
##PAGE= N=2
##DATA TABLE= (X++(I..I)), XYDATA
0 0 0 0 0 0 0 0 0 0 0 0 0 -8 8 -8 8 -8 16 -16 24 -24 32 -37 40 -48 57 -72 80 -95 105 -121 141 -160 183 -207
34 -207 232 -262 294 -329 368 -410 456 -508 562 -623 689 -763 841 -925 1020 -1125 1239 -1365
52 -1365 1505 -1660 1837 -2030 2255 -2513 2811 -3165 3589 -4107 4764 -5621 6790 -8493 11210
67 11210 -16228 28597 -126638 -96007 150505 -55743 -140921 39098 117623 -57144 -51949
78 -51949 106363 88686 -60486 -2458 99934 17561 -80054 6209 66180 -25024 -79300 15842
90 15842 36532 -61591 -57917 44529 20442 -62396 -21313 57412 15105 -39434 20498 71142
102 71142 667 -40444 24807 44621 -25345 -37375 21533 13121 -52986 -34263 27281 -1521
114 -1521 -44064 9534 46169 -6734 -25030 32061 41867 -9774 -9139 31631 7832 -35144 -8082
127 -8082 21726 -11514 -35092 -2178 15780 -15175 -23742 13911 19835 -13011 -8528 20759 11076
140 11076 -11887 3077 24501 5733 -15456 2859 15777 -7291 -15327 5281 6042 -16390 -16919
153 -16919 6344 6369 -13688 -3671 18078 3493 -11897 7955 18181 -2549 -9639 9622 8388
166 8388 -15193 -10830 10885 773 -15511 -675 10099 -3708 -8580 7759 13054 -2753 -5448
179 -5448 8689 5412 -7879 -1466 6907 -1773 -8785 -2184 3156 -4164 -7019 3377 4585 -5261
193 -5261 -3365 4988 3727 -1121 1282 6987 3382 -4621 168 6892 -386 -5858 -4 1178 -6017
208 -6017 -7260 1424 2973 -5194 -2432 6323 1600 -3084 4204 7563 882 -1710 2506 2242 -4538
223 -4538 -3435 2845 -901 -6327 -2036 835 -2280 -2326 2530 3624 -795 -1413 3673 2869 -337 1756
239 1756 3510 518 -1657 -1435 451 -737 -2744 -1324 -570 -3226 -3590 -713 998 514 -146 2149
255 2149 2653 -260 1551 4648 1905 -665 713 581 -2347 -3038 -9 197 -3206 -2412 683 -1006
271 -1006 -2203 1410 2774 675 -282 1316 1479 -396 251 2274 404 -1710 -336 -46 -885 -621 35
288 35 -97 -996 -1385 -9 -43 -203 684 562 260 232 -6 852 1261 -103 143 336 -965 -1243 -446 150
308 150 -245 -1051 -212 729 -677 93 1686 824 -142 347 277 -443 -812 190 335 -1207 -686 211 -455
327 -455 -259 1066 827 36 150 502 218 -125 126 609 -360 -782 -79 -370 -227 198 -324 95 5 -388
347 -388 17 158 135 207 54 384 237 -143 158 645 -9 -328 -115 -486 -796 -339 -13 -344 -568 54 411
368 411 -492 288 1062 406 200 592 471 55 -45 48 -86 -806 -384 -111 -297 -229 247 -203 -197 275 88 373
390 373 131 467 407 -67 52 375 -65 -105 275 -390 -289 -47 -351 -239 -154 -89 -142 -338 9 427 -108 270
412 270 840 100 254 446 269 68 -54 5 -245 -425 -349 -17 -286 -134 114 -271 -168 281 178 33 9
433 9 122 57 -198 -271 177 -149 4 68 -238 -104 127 5 -168 66 -142 -161 -221 -4 116 -54 215 523 -68
456 -68 3 184 14 120 171 -53 39 -64 33 108 -3 124 165 -183 -53 113 1 -26 -54 -12 -10 -215 73 -16 101
481 101 110 143 41 169 335 -27 201 154 48 -162 -460 -101 -40 -232 -52 138 -148 -195 191 59 267 121
503 121 36 73 77 174 66 -91 -6 50 -262 -145 -6 -209 -291 -158 -24 41 -93 20 -66 77 258 261 24 112 351
528 351 224 119 46 -134 -190 -16 37 -24 -227 -27 -118 -96 101 31 -45 15 102 232 -9 44 274 59 -112 64
552 64 135 -178 17 -122 -189 -72 -219 -120 -211 90 -66 4 -128 141 7 -82 248 148 48 139 179 -39 1 24
576 24 83 -115 -135 138 -81 -200 21 44 -182 136 121 -180 -159 148 28 -19 17 -7 -42 153 94 59 89 198 44
601 44 -97 87 -19 116 88 -197 -48 -150 0 160 41 93 33 -138 -100 47 -61 16 -31 -274 -87 -183 132
624 132 142 -31 -16 -79 -88 -81 115 -52 92 17 -235 7 171 95 157 170 -65 70 77 -198 117 -164 -137 68 -9
649 -9 108 -131 -56 30 -43 -140 -3 52 126 59 112 108 82 153 211 95 44 100 -121 -26 71 -132 -71 -156 -17 -320 -108
676 -108 41 16 -44 33 156 145 148 296 101 44 -122 -35 -79 57 -55 10 -166 21 37 -72 109 222 59 46
700 46 99 50 186 124 101 68 -32 32 210 -156 71 58 -185 -145 63 -49 -229 -63 46 -141 -45 -226 -22 -72
724 -72 -24 135 -14 94 141 -79 -64 -83 103 -96 -76 -21 49 -25 130 70 -68 -116 61 137 11 -46 -47 -8 -94 79
750 79 97 -38 151 -81 -54 -97 -4 30 -59 4 15 -58 59 -40 -43 -181 15 -85 -34 -57 -76 35 61 77 118 20 -215
777 -215 -32 2 0 136 43 49 -109 -28 18 -27 38 -75 -19 -154 46 174 221 191 99 78 -68 -6 -73 -63 35 79 52
804 52 -134 27 -94 -34 -43 54 -30 95 -12 -38 -10 -32 -104 45 19 -16 6 81 248 -36 -118 7 -38 4 3 52 -121
831 -121 -114 -181 -101 2 -176 53 49 107 93 67 25 -187 103 65 -33 316 -84 -100 10 66 67 -122 167 -15 -130 4
857 4 -16 79 101 -68 172 74 207 20 -95 -189 51 39 1 -12 -105 -41 -19 -103 -154 23 -98 105 65 50 209 37
883 37 70 -1 107 -54 -6 57 82 172 -11 -83 82 -81 29 -1 -142 26 -69 -32 24 11 -56 1 27 -29 -91 -108 -2
910 -2 171 -158 12 -99 -19 143 -51 -63 102 -27 80 83 -75 70 -117 80 184 -58 38 109 17 100 6 16
934 16 -152 1 -50 27 -29 167 -101 -80 -36 -5 -27 -48 104 221 48 -54 33 -21 106 -155 156 -36 -25 -238
958 -238 46 -119 -55 4 -15 -56 125 -87 -26 136 119 -86 -7 19 157 68 120 -177 145 172 -255 42 -1 28 -75
983 -75 -41 -198 -83 -57 -78 -62 -73 -97 19 141 -99 44 228 86 125 40 -6 -122 183 54 25 128 -147 -70
1007 -70 -37 -58 -210 -52 -88 -82 7 41 3 204 50 68 31 -73 237 -135 17 -36 -184 96 -128 1 83 -71
1031 -71 -199 83 -240 16 72 35 48 175 -186 -41 117 1 45 35 89 -39 104 63 12 -284 -181 -12 -12 -75
1055 -75 -121 140 70 161 78 -46 -1 37 219 80 45 25 -13 -26 6 98 -49 -157 -8 -66 49 64 22 -11 78 -126
1081 -126 -285 191 90 3 -97 -144 -18 -64 84 -94 -119 -119 46 -30 -88 -74 -107 16 -57 -74 82 -64 81 -177
1105 -177 -55 114 48 53 70 -134 69 133 -144 38 51 -15 11 -114 108 -72 230 99 -41 54 -34 -84 69 -93
1129 -93 112 -329 -28 -12 52 91 68 -120 -62 29 -155 -81 -182 -7 -129 -31 -96 -112 -84 -1 -53 34 -130 -146 -26
1154 -26 80 85 66 -4 -110 -62 126 128 -37 79 100 -200 -55 31 71 34 73 -88 11 69 94 45 -13 -17 -170 82 101
1181 101 -39 -164 91 -7 -31 -66 -4 7 -80 -135 61 -17 101 118 61 -75 30 21 5 128 49 -108 15 85 26
1206 26 158 10 -80 -38 37 76 -27 33 17 20 -121 23 -55 45 138 20 152 19 -118 -44 -172 98 -115 -138
1230 -138 -33 41 64 59 -78 -57 -33 72 -139 127 -15 163 3 2 58 156 57 -54 -189 -89 -69 -32 -124 -110 -93
1255 -93 91 214 24 94 -62 -78 27 110 141 85 30 -57 -37 17 -13 -32 143 -135 -202 -7 -23 -146 -129 -140 -144 137
1281 137 139 112 -209 100 108 -79 194 6 -153 -5 153 -42 118 -16 -7 93 49 205 -28 103 32 40 112 -8
1305 -8 47 56 -158 117 11 -4 -44 80 -84 -110 74 -96 -97 106 9 131 0 221 -22 83 -20 163 -274 44
1329 44 -138 -62 38 9 253 -128 111 -6 11 -168 66 110 -103 -72 55 2 17 -47 -50 111 -40 9 51 -111
1353 -111 99 -131 67 -36 1 -3 -53 47 60 -24 40 -41 41 37 -95 138 -218 -30 -17 -32 1 -172 84 157 -9
1378 -9 68 47 67 -46 -7 17 -23 -10 17 -81 137 -99 36 68 26 -93 -9 1 101 11 68 65 20 88 21 -4 64 -119
1406 -119 -156 6 -5 -75 92 52 16 -152 8 -131 143 -89 98 -109 38 39 -2 -19 -114 -112 261 76 70 45 88
1431 88 -45 73 -77 6 69 94 -38 -103 -112 -22 -27 12 -42 23 91 44 -65 -4 66 54 51 -33 -6 39 26 -59 -122 -47 -111
1460 -111 95 14 -61 60 -30 7 92 -42 -82 -1 141 75 38 42 178 -41 -32 61 48 112 224 61 -107 60 27 135
1486 135 -24 15 30 43 -16 -84 80 -171 59 4 50 84 -13 184 -54 159 38 69 -38 -56 0 190 -46 -186
1510 -186 142 114 -85 -55 24 -128 134 90 25 -10 70 -92 -92 30 51 -86 34 6 75 39 19 -16 -103 -136 -78 118
1536 118 -53 93 85 -49 -124 -26 -55 -78 41 -40 -2 -79 23 -22 -87 -59 -45 -105 97 -41 -119 -14 -148 -93 -1 52
1562 52 14 180 -122 60 -58 -17 -53 51 246 12 166 19 -11 -2 -85 -85 -204 211 -37 141 -54 107 144 -93
1586 -93 40 176 29 -221 20 -76 -10 -26 130 -68 -123 12 -73 -99 143 -35 57 -76 -58 -69 -51 59 -71 70
1610 70 169 164 31 90 -48 -67 -49 -18 33 -114 134 -118 -44 74 142 48 80 -82 -9 -22 149 -30 77 -36 -67
1635 -67 60 173 51 -43 -132 -87 63 147 43 69 142 73 -3 -4 -135 -21 120 39 -19 -3 -5 -97 -39 -50 -52 17 144
1662 144 135 -82 -116 -110 166 -111 -50 114 74 42 -169 135 -111 -60 89 52 -8 15 72 152 104 -60 108 -66 -12
1687 -12 127 -40 90 37 -87 56 45 43 -7 -89 -129 -68 -20 -197 -43 -82 -24 66 -146 91 -124 76 3 143 -131
1712 -131 26 -39 -69 -109 -108 -124 131 -23 83 87 -123 92 -14 -121 -66 16 -83 134 -18 16 17 -16 -142 -50 -115 -38
1738 -38 -122 -83 52 124 19 -139 -41 -42 2 -20 -37 -32 37 -74 26 50 -10 -99 -62 143 -11 -116 182 2 -102 91
1764 91 94 94 95 68 17 -138 15 67 85 -38 54 -40 -111 -113 -157 44 -193 -64 133 -51 -13 -113 154 91 120 -131 19
1791 19 176 -164 -61 -164 51 -40 86 130 19 97 -10 -101 -22 82 -30 160 59 137 142 -99 9 47 -143
1814 -143 -20 -86 -108 75 -64 -87 73 -53 59 -210 -187 47 114 51 -142 -49 114 11 -52 41 -17 -86 122 16
1838 16 18 -76 72 -25 -78 79 101 5 8 -30 100 -26 93 2 103 104 51 31 -13 -60 0 93 42 192 58 42 -29 -109
1866 -109 -90 127 -82 -83 -10 -90 83 106 172 -64 -106 -10 69 95 7 128 -73 105 -164 -64 -116 12 -11 -16 -126
1891 -126 -131 -12 65 27 -131 -39 -56 -90 -95 -40 2 23 -93 -245 0 32 -64 144 147 -43 24 -12 -79 -57 4 6 -91 132
1919 132 16 -157 -96 -99 -75 -68 54 44 45 -83 -146 -78 -20 76 -81 -5 -33 60 70 62 12 -1 -8 -80 -51 47 -97 -129 -13
1948 -13 83 -155 100 -123 57 95 77 49 71 -87 -30 62 -10 -204 19 -158 -95 26 90 -103 52 -138 -189 -168
1972 -168 -115 -117 -77 123 -23 23 39 -28 87 -64 -62 -6 -83 -160 47 107 44 -99 -44 264 -49 93 -137 -115 -28 68
1998 68 241 174 6 18 20 143 -55 -17 54 -43 -108 6 -91 -41 87 -104 306 -41 -26 69 42 -20 -46 -107 -79 -37
2024 -37 18 -178 11 86 -53 -65 85 2 143 -2 -53 106 109 -3 -16 160 57 191 -145 -32 -163 24 -9
2047 -9 -16 -31 171 -74 -45 1 39 -28 -15 10 -112 110 89 -42 -84 238 141 85 25 -69 11 61 -121 -92 -92 -95 64 -5
2075 -5 186 61 -18 -36 -88 2 -6 174 -32 -15 -61 -94 -37 58 -177 -124 6 46 107 61 121 25 61 -1 59 -115 109
2102 109 183 24 66 26 -72 90 -54 201 141 43 103 -66 101 187 120 -76 -87 92 104 30 134 -101 53 194
2126 194 -173 -14 4 -128 27 71 -48 -11 40 -86 9 7 -34 -12 21 -145 -27 -78 66 -60 -104 -97 15 46 32
2151 32 -17 21 -125 -48 105 30 -50 42 -59 -75 -149 -40 -99 22 91 -29 -26 -49 -126 -68 41 67 -52 -14 107 9
2177 9 127 7 110 66 41 93 121 -111 -50 65 -46 55 80 25 13 24 114 -73 -91 -3 -32 48 15 -24 -149 -51
2203 -51 86 -119 -178 28 28 -44 -27 122 -197 24 33 -18 2 -46 -88 50 77 87 88 -43 136 18 -206 46 -179
2228 -179 -35 149 61 -16 -62 -92 -28 -48 270 -51 -97 -62 36 34 26 -127 47 22 37 75 -70 -11 -28 -37 187 27 -21
2255 -21 5 44 -3 87 33 -8 -100 -82 -37 -79 80 26 -65 5 46 27 157 100 50 -148 109 -142 -67 -9 120 -17 23
2282 23 -98 -169 -78 194 22 205 33 169 -107 -260 -13 43 66 -54 -76 121 28 -95 -52 26 41 -69 191
2305 191 -39 29 25 45 123 -118 56 -22 -5 -67 -131 39 103 211 -95 44 -176 41 14 70 -2 24 -161 109 -102
2330 -102 153 5 17 -42 64 -38 -62 -36 -170 8 -64 110 -34 -97 -57 -36 -10 -80 45 -111 20 21 -37 -166
2354 -166 191 63 63 55 22 90 -16 -126 -79 45 -58 -11 33 -178 -58 -146 -130 116 -66 15 21 -100 19 -231 153
2379 153 116 -103 -98 -6 28 -77 51 -105 108 -59 241 -91 56 72 6 -32 11 105 112 -107 -64 73 63 -58 73
2404 73 -15 173 103 10 9 178 75 10 95 -123 46 125 45 78 -37 24 23 -8 -276 -48 2 133 61 57 190 111 -31
2431 -31 25 54 -16 59 35 12 -25 103 -8 -192 -117 40 -139 49 -193 123 -126 -117 -32 -46 130 79 -140 -55 28
2456 28 -74 -8 23 -192 -47 -152 -132 44 144 -70 -53 27 225 -92 2 107 105 133 -146 -3 -66 235 -65 61
2480 61 -91 -73 29 155 -66 120 -98 -25 -24 24 -221 -88 -111 40 -26 8 -3 -20 54 -45 -35 -68 37 -43 -2 -22
2506 -22 -3 19 61 -134 -29 -113 -20 -11 -71 -166 -9 -3 -38 48 -75 -76 138 -40 133 -18 -18 135 65 54 165 14 -188
2533 -188 92 -153 -6 87 40 -253 -82 -42 -142 38 -82 74 -151 8 129 -50 -11 -25 -76 -173 -148 -74 47
2556 47 218 -52 -13 -114 -52 -41 2 94 -60 60 65 -100 -98 185 29 66 241 49 11 16 -36 59 -198 67 -7 -195
2582 -195 -111 -95 -100 88 -65 -51 0 -12 -7 -23 -23 54 131 -37 193 169 38 -61 27 248 -38 58 -17 22 -16 -147 57
2609 57 -17 21 -2 94 255 61 12 -134 -154 73 41 2 10 -176 -53 59 -42 -213 -104 -67 20 29 -149 -114 86
2634 86 -35 -61 127 -58 30 -47 -85 94 -37 -22 -41 -51 54 32 86 55 102 -94 -45 150 -29 -36 61 264 -5
2659 -5 -77 -2 -13 -70 -3 -18 -27 174 -73 109 95 -23 129 2 -118 -162 -94 64 36 -182 -59 -87 -113 -46 21 -153
2685 -153 -91 5 158 -41 -64 135 -50 -88 -19 -22 32 -180 -28 22 -133 -30 -114 44 -210 -127 21 -119 -102 -50
2709 -50 -98 -51 -25 87 209 -52 115 -69 -63 -35 -14 -35 -168 -168 -124 163 -33 73 91 -30 125 124 -8 109 -100
2734 -100 233 -106 62 -78 77 123 -105 105 76 -6 48 123 78 116 67 -45 -4 83 140 -9 107 97 -26 10
2758 10 26 -120 0 85 -10 182 -161 -55 -126 50 57 63 -20 146 -118 0 106 59 118 -53 -199 -133 62 132 -49
2783 -49 -12 -109 68 20 -55 107 -126 94 -99 -39 -160 -17 93 -151 79 -22 161 -44 105 -42 20 -207
2805 -207 -126 -69 47 -81 -83 68 -126 104 -125 -76 -58 -130 -126 -33 13 -74 66 16 -95 -5 -113 -14 -108 -32 -92 -64
2831 -64 -15 61 -10 11 185 0 160 -27 56 -32 -87 -2 -60 -26 -45 78 -131 -33 43 185 -56 56 -44 -74 -174
2856 -174 -99 -94 -121 53 32 -170 56 -85 -127 -69 133 -73 -78 -20 55 -64 -13 -19 53 1 -4 -18 -36 177 123 -121 -61
2883 -61 -24 5 151 37 -129 -126 -22 12 10 -30 -36 -1 124 -112 -84 -189 -272 298 -13 -75 9 141 4 167 27
2908 27 80 -32 21 -67 -2 -75 -5 -286 -52 46 174 -6 128 26 9 64 81 30 103 84 -212 23 -150 102 54
2933 54 226 137 114 -80 14 -43 1 -16 46 98 -9 -65 -78 19 105 -67 57 19 -27 -16 22 36 131 142 -70 75 -22
2960 -22 75 -58 52 35 12 -26 -107 -64 73 -7 -59 94 -64 86 -4 240 -39 38 -156 38 -36 -15 118 -67
2984 -67 81 -77 13 -10 -70 50 -110 184 38 -15 -25 -43 -11 81 -20 88 128 -3 -65 -20 68 -44 -71 77 -38
3009 -38 107 35 18 -90 17 -31 -9 47 43 120 -109 -176 -23 100 78 -29 -92 -100 -11 -24 -14 -118 122 71 -3 39 -81
3036 -81 -22 -64 -52 140 22 -127 97 -41 -6 14 -23 106 -131 16 -73 -36 227 83 -163 44 49 -59 33 -143
3060 -143 108 -10 104 -6 22 36 54 75 3 -31 -61 131 -97 -17 -4 98 121 81 51 -74 222 227 -20 3 -34
3085 -34 -3 80 139 -64 -176 -20 -20 46 -28 35 124 -41 -54 56 76 -192 -62 -28 -43 -42 14 8 55 -9 -105 120 30 -79
3113 -79 36 -34 -198 156 74 1 -84 -62 30 -48 106 65 3 34 -16 -41 18 22 -30 -60 70 -317 91 -31 104 -55
3139 -55 76 -45 86 -76 -56 56 155 0 -87 -47 48 42 6 67 -3 -94 -19 15 47 104 34 94 133 61 163 51 45
3166 45 105 -160 41 -97 85 79 294 125 126 133 221 83 -17 -55 -72 66 -15 3 12 27 -121 10 97 -9 90 8
3192 8 74 36 15 170 84 45 21 112 -5 155 -80 -33 -140 -149 -69 -62 -46 -23 202 -43 28 57 -66 -145 194 -39 -18
3219 -18 55 37 -18 23 -59 -49 -147 43 191 138 -26 -81 118 40 19 -122 192 -40 -131 -55 30 61 122 -75 -24 -26 93
3246 93 57 -134 -70 -50 108 -141 68 -24 -59 -74 152 -37 -43 17 30 163 -3 58 151 -14 89 50 -23 93 12
3271 12 111 -97 181 15 -136 20 88 -52 -30 91 -73 -107 -82 14 -185 -67 -70 -10 12 8 -17 -42 144 25 125
3296 125 -86 -152 104 -35 -205 -31 -57 8 -66 -61 -128 134 -62 -99 34 -14 45 -62 14 1 76 7 17 3 -22 29
3322 29 -56 -66 26 -103 8 80 32 107 112 -166 139 -78 26 -66 -256 171 -35 -59 -41 187 -105 6 -33 -112 -14
3347 -14 -18 -75 165 123 -134 -37 -134 -53 132 -162 -28 53 57 5 41 28 -110 -20 114 -18 -165 -122 7 81 121 74
3373 74 -211 162 -27 -159 -5 -132 93 -108 39 4 -32 160 -161 -23 -17 225 30 -203 -84 29 -141 -68
3395 -68 -141 108 -96 -84 -195 174 -34 1 158 -34 82 -151 45 -118 -43 -4 -85 26 -122 12 67 -37 -82
3418 -82 -3 -73 91 -56 80 9 42 84 29 -12 -99 71 -6 64 -106 -15 -56 -94 96 -99 -89 -185 23 -21 1 -99
3444 -99 -132 57 -137 -52 28 187 -51 -52 53 -15 -113 -206 -1 43 -33 172 102 133 38 -73 -42 75 -128 80 -49
3469 -49 88 26 62 223 10 59 -64 10 128 3 12 167 -60 2 -58 -75 -5 -49 12 -129 -13 171 86 -15 -83
3494 -83 42 -35 -174 -25 67 -31 -95 61 -41 -65 69 -59 -61 -148 -5 25 122 -6 13 3 67 -2 -53 -89 -56 -43
3520 -43 89 5 95 54 -59 31 -27 -42 28 -148 -181 59 -222 29 -78 -102 52 79 -19 -210 29 89 -90 155
3544 155 119 17 -50 80 47 -91 18 -49 64 -177 -21 -50 -39 9 26 -95 98 111 23 -124 56 14 -143 -120
3568 -120 125 -53 -140 27 13 223 118 -260 -62 65 163 20 -196 101 -13 24 -200 -29 -7 62 -166 150
3590 150 -133 38 -34 29 -44 -89 66 41 72 65 43 123 -14 -3 -59 128 -71 128 18 2 39 10 -39 25 -2 -174
3616 -174 91 -24 -15 19 -199 -171 -65 14 -5 -33 -12 112 -9 -86 -3 87 -43 -15 -22 0 16 -5 79 -139 -14 118
3642 118 240 -3 -36 -144 -189 100 -40 48 55 -54 -48 -34 142 11 -67 -6 -21 40 90 -149 77 -73 -63 67 -57
3667 -57 -125 2 -66 26 40 -1 76 -71 -75 -209 -7 -3 73 -34 -176 -26 52 -10 -96 104 85 -76 -1 -23 -13 -155
3693 -155 93 -34 84 39 39 106 55 12 140 -23 44 -81 87 87 -46 -68 -30 58 93 -89 -127 120 -113 -63 -84
3718 -84 101 -4 55 4 34 -125 -174 8 -27 -39 135 -43 -6 66 -39 16 -126 223 -1 108 165 170 -109 194
3742 194 42 43 40 -115 63 99 71 -67 -37 127 -124 -211 -10 45 43 126 122 -56 -151 -61 -160 -34 -64 15 -103 0
3768 0 -34 -53 -190 52 -93 -1 -52 24 -8 -37 -73 56 76 75 -62 -21 86 -65 -109 177 -6 111 4 144 66
3793 66 195 -19 -191 22 49 194 -77 34 -38 -55 -65 72 -136 5 -3 29 62 -82 -23 -8 30 157 5 -142
3817 -142 18 36 12 -62 -18 84 52 60 -154 -24 -18 -5 -49 -77 -14 216 71 7 119 15 -163 67 -142 -12 -29
3842 -29 -86 2 162 -189 -34 -54 21 -71 72 45 -120 227 -96 154 -124 -22 12 23 -32 88 -112 75 -13 3
3866 3 53 51 127 108 8 101 64 60 78 -291 164 -135 0 24 49 -2 -118 83 187 -23 -73 140 -55 17 60 -53
3892 -53 -65 41 -12 -76 10 -30 90 -30 -69 -20 2 51 -193 26 -21 47 -64 -8 -47 62 -37 -106 33 -167 103
3917 103 -66 82 203 102 -43 125 5 21 -3 80 22 95 70 -96 5 -100 137 5 61 -90 -28 3 -55
3940 -55 -161 0 -3 36 181 127 68 -51 -74 -34 -148 99 71 -40 63 -173 22 119 19 -24 -10 -110 9 -86
3964 -86 12 19 3 139 -84 52 -78 -189 83 83 -38 54 109 -162 -126 -25 -36 -187 -2 -127 -33 -205 174 52
3988 52 199 -69 -45 132 54 144 -2 136 27 20 43 -56 -23 103 28 -79 -168 43 -154 -148 114 132 -100 45 -24
4013 -24 -28 4 -60 117 42 -37 -131 90 -85 -134 -32 -12 -45 44 56 39 61 -20 83 -67 -55 -239 23 16 -48 186 50
4040 50 83 100 -83 -51 -145 -64 99 63 -89 -67 95 -100 72 21 -15 -40 -68 -218 -248 -64 185 -81 89 37 2
4065 2 -76 -18 93 87 151 77 25 83 59 -98 -48 103 -58 172 18 37 4 101 -99 21 -28 17 9 -226 -87 -62 -38
4092 -38 -62 55 -3 -16 16 -88 206 48 123 -175 -24 -31 146 -17 226 99 -105 87 -62 -116 95 108 -98
4115 -98 124 84 0 57 -186 22 34 -2 119 0 11 56 44 -64 7 -116 -103 26 -31 -15 -22 -56 30 59 -76 -34
4141 -34 21 -57 2 7 -28 202 -33 102 112 41 104 21 -84 98 2 11 -30 80 27 25 -85 124 81 42 -101 143 -107
4168 -107 -17 -2 137 48 22 -33 -107 -7 -34 -2 -58 66 -271 62 -93 -100 -126 -12 -79 -43 26 -72 5 123 25 -83
4194 -83 165 35 88 63 -113 -8 -39 9 117 14 149 68 70 47 -5 -19 -118 -22 20 -89 -149 -87 -62 -203 10 112
4220 112 -41 -53 -284 -25 27 -197 14 64 109 -39 -198 -136 147 97 -11 160 57 -57 186 -88 50 28
4242 28 -83 -256 58 42 94 -97 -221 65 -78 110 -29 -59 -108 -94 116 14 -85 -95 -115 92 3 67 2 148
4266 148 100 17 47 -30 95 48 -78 55 28 -81 -13 -211 84 69 -75 -96 15 93 51 75 80 27 -63 105 74 22
4292 22 -4 256 51 -110 -161 -122 -63 -120 -45 -33 -67 -15 78 -186 88 -188 65 45 -89 -43 -51 138 -48 107 -106
4317 -106 92 -91 -86 66 -116 -254 -24 -26 93 41 -50 33 11 0 -72 -99 119 -2 185 -22 -38 73 -84 -10
4341 -10 114 134 30 71 101 30 -110 -147 -4 -67 -203 52 33 135 129 96 -10 51 -98 -107 21 124 58 84 127 -93
4367 -93 12 3 -45 -92 -65 -1 104 32 80 -231 102 -5 -147 5 59 -94 7 -8 -64 26 137 67 -161 -38 156
4392 156 -101 63 -17 60 7 68 -100 -65 -35 -63 10 140 -64 28 35 77 17 -131 14 -44 31 140 -279 34 132
4417 132 -89 15 -83 -9 -224 52 -98 -23 49 -66 -62 -173 -43 20 12 117 34 -91 -117 -162 127 15 68 -27 -68
4442 -68 161 67 -27 108 -22 150 -34 -83 39 45 61 24 13 -18 -95 -30 116 58 -112 -15 63 60 195 -80 22 -82
4468 -82 36 -3 17 61 54 44 -56 -10 -174 -14 -117 -48 24 -27 51 19 97 -63 -115 46 116 -3 142 -8 -25 -138
4494 -138 -104 212 20 47 131 -12 -149 -27 -77 5 3 155 107 -73 -89 -63 -91 13 22 -15 -47 24 -164 25 38 38
4520 38 200 252 -61 -45 -13 -109 148 156 -122 -86 -59 133 -113 98 88 80 -78 -122 10 66 -34 34 109 -94 52
4545 52 103 -100 29 12 -55 41 45 -124 71 89 -42 -71 35 166 20 66 -2 -23 50 -8 74 228 -79 -97 -30 -33
4571 -33 -95 41 -55 -111 -19 141 -49 -156 16 -15 -56 -110 143 -92 -116 -17 -130 -33 -90 75 66 -116 -11 -52 -91
4596 -91 -9 -116 209 -67 4 3 0 27 -133 91 186 -86 -4 129 -25 58 8 17 -60 50 198 57 -188 56 -94
4621 -94 -53 -96 -22 95 75 -20 35 -58 -64 -97 -109 104 127 60 -47 -48 94 -25 135 2 67 -83 -81 -127 -73 -204 -9
4648 -9 270 54 -4 46 86 -115 47 -86 -99 -77 -62 -69 24 -7 13 -72 -140 -41 -215 74 -28 -115 13 40 3 -66 11
4675 11 87 134 -67 -144 -85 19 52 -57 -87 -103 36 -137 -137 130 -84 90 55 27 -91 -65 22 -16 106 -140 -56
4700 -56 -56 -6 78 -83 38 285 -71 -177 138 50 51 50 220 -44 -127 -108 -38 -56 104 75 8 98 22 127 -73 114
4726 114 -15 72 -96 19 -62 -110 -30 -21 -23 -107 104 -4 46 -53 36 -5 258 -8 -13 -70 -52 6 -94 196 -36 -64
4752 -64 -8 6 -28 -4 -26 142 -60 9 127 -10 -24 67 -46 -24 50 -22 -74 136 178 10 -144 12 125 -58 -93
4777 -93 -3 12 -17 20 -81 -27 -125 -35 117 25 120 -66 40 32 81 107 123 56 -113 -54 -160 93 -79 -53 -64 68
4803 68 -34 135 93 30 -18 83 -47 -24 63 -66 -1 -15 -139 6 98 -79 -49 -30 82 52 -5 134 -51 -67 -70
4828 -70 10 107 27 -70 -31 93 -20 142 20 111 37 -6 -30 -128 -30 93 -48 -10 -21 56 -6 62 -49 -73 -108 -15 121
4855 121 -26 -110 -7 64 191 50 -132 144 75 65 -97 -131 -78 49 -50 22 7 -47 16 -8 -22 8 20 -192 -112
4880 -112 103 -17 54 7 -116 47 100 33 147 -37 -140 75 15 -36 29 -154 -56 -37 -63 14 76 96 -158 -42
4904 -42 -129 -12 66 93 -20 -227 238 159 10 -134 56 -40 -10 109 -101 -41 -96 116 -8 -21 -10 31 146 192
4928 192 -134 38 12 94 -33 -203 27 53 116 -47 -195 -98 12 1 -8 -104 -41 -39 -123 44 114 -92 130 -17 34
4953 34 -58 -3 123 -9 -24 77 90 24 -82 -110 112 -9 -95 165 -178 65 30 -151 -35 32 15 -1 -57 37 82
4978 82 0 195 -106 91 46 -38 -104 -15 30 -68 149 15 91 -74 -41 8 43 1 -97 105 74 34 -154 -80 -73 105
5004 105 -110 -231 -123 -23 94 -6 174 -77 34 135 13 -57 124 -3 119 -42 -108 9 10 -19 61 -280
5026 -280 -32 53 -59 21 -44 -20 -139 -102 -30 54 -167 47 0 -112 -68 30 -55 -114 163 -186 -19 -76 -118 -82 98
5051 98 -91 -114 144 10 20 -28 -4 -30 -46 58 13 -23 -23 49 107 -102 -65 -25 46 -99 -78 24 81 -37 36 -33 78
5078 78 -61 6 158 129 -55 -91 111 -113 -36 -3 90 -87 27 -68 103 51 -143 42 30 -70 12 -96 39 110
5102 110 78 61 -125 8 -109 53 86 -55 -43 -26 -11 14 39 43 -48 210 182 101 116 -74 143 31 2 53 -121
5127 -121 49 -31 -145 89 -80 97 -186 -35 170 -53 -68 -81 -98 175 -55 233 -69 -70 0 43 29 107 172 -18
5151 -18 -93 -6 -75 -58 -43 -47 -10 171 43 -71 1 -235 -9 -124 67 -72 83 -61 -8 -33 214 130 155 45 -85
5176 -85 76 20 238 -118 15 71 -17 173 -51 -122 -17 -86 -16 4 -1 -75 -13 -47 121 -54 -8 105 -35 -67 -174
5201 -174 11 64 35 18 154 10 21 -40 57 -155 38 -13 26 -75 -19 23 -3 -44 -9 26 61 -6 46 -29 -53 -37 30
5228 30 -67 -20 56 -42 88 -70 -83 155 -11 -92 216 -94 25 -79 -5 -3 -11 26 76 -143 -34 150 40 -5 180
5253 180 4 -47 116 -59 48 -85 28 -41 34 25 -45 -31 89 -192 54 -135 159 -190 -21 -15 69 -41 105
5276 105 103 -33 -209 -19 34 62 -196 51 22 -43 90 -36 -25 -1 37 -75 38 33 -10 -84 1 -15 -110 -95 -27 25
5302 25 2 -63 143 31 50 37 -121 10 -134 59 -80 -30 95 -21 98 -69 29 57 83 211 115 -59 -40 -152
5326 -152 169 -47 85 -38 131 114 -62 -126 -46 39 52 -139 -41 -110 -5 44 -130 -10 5 6 -39 4 -127 -55 85
5351 85 102 101 -53 83 -273 130 84 -3 -4 -109 62 39 -2 -30 -129 -104 -86 -123 -28 49 2 136 62 -226 -11 -57 127
5378 127 -84 -110 -121 -69 122 -48 165 -23 74 -146 -100 -34 25 71 -158 128 -23 129 121 45 -89 4 -56 113
5402 113 31 35 32 -89 -12 -1 79 14 -125 -115 -12 -19 -224 71 5 33 27 -83 6 -4 -77 -42 -144 -117 49 40 29 60
5430 60 -32 12 -291 -104 67 -169 -78 35 144 100 56 -57 99 -102 25 38 132 38 28 105 66 -33 -244 -89
5454 -89 -137 8 -76 -26 160 20 -42 -23 -28 4 -37 -266 75 -176 17 -102 80 -28 19 -49 62 -30 -101 -108 130
5479 130 32 69 203 142 156 -88 94 97 91 -25 30 55 2 30 -5 -29 -1 -113 29 168 -91 142 -93 77 76 47
5505 47 -79 59 -62 -30 15 -16 -9 107 62 -70 63 39 48 31 57 60 -81 -13 -62 83 70 42 2 86 131 -19 217
5532 217 -112 46 -180 28 -9 157 -54 112 92 -96 -183 102 -96 -91 -15 -48 -49 -217 4 -207 -4 -131 -82
5555 -82 -115 9 71 -32 24 -51 -54 -20 50 -123 -27 29 -15 -4 -6 -97 50 -85 -24 -38 -80 -28 44 -68 -63 70 -10 -223
5583 -223 93 -4 -92 -115 47 61 -81 -161 -24 41 150 56 82 -2 101 -53 -51 41 101 66 27 110 -144 -149 15 107
5609 107 127 -5 48 2 -147 -35 30 -4 11 107 76 -66 -101 -87 27 -4 -40 128 -87 -90 -31 12 87 102 -93 51
5635 51 35 42 -22 59 -72 -172 -63 -90 -125 -143 96 -20 9 42 -127 45 -48 -21 -50 86 3 48 21 -176 76 -193
5661 -193 -48 10 -26 3 -80 106 -83 -87 17 9 -109 -6 203 -37 58 -97 42 158 -1 117 -181 -94 22
5684 22 -76 -12 39 -87 -88 -37 -28 -114 37 89 -26 85 76 -43 124 -25 155 -3 -70 -121 15 -149 -11 90 15
5709 15 50 -261 -72 -84 7 -79 70 -95 -100 -9 14 155 -49 14 120 -32 29 52 9 237 -32 69 -57 43
5733 43 155 -4 192 -39 30 -24 31 -171 121 -31 -8 -167 -33 -240 -106 122 -42 45 -112 -95 -109 51 -36
5756 -36 96 12 0 227 157 15 -63 24 -229 -42 -54 -108 -63 122 -7 -137 63 23 -30 -12 15 179 26 43 28
5781 28 67 -22 65 -79 23 -66 7 135 143 183 48 -250 39 -16 -170 18 -68 -138 -169 36 45 -118 -86 -77 -100 -131 60
5808 60 47 64 -14 -170 18 7 -150 32 41 19 -24 -219 104 163 -38 95 -21 48 -98 -72 -83 -33 -132 -116 -14
5833 -14 18 37 10 -104 -145 50 18 -218 -50 -19 7 115 -3 -38 -80 -184 -31 -3 24 -66 -75 46 -124 -28 32 65
5859 65 62 -19 -125 105 3 -31 -233 79 201 117 3 -151 -34 -22 -84 -52 -89 -82 118 8 -219 49 -116 -34
5883 -34 -122 37 69 -213 88 -62 65 -6 -17 48 110 -58 -115 -180 -169 69 50 -14 -155 -57 93 -105 62 27 -126
5908 -126 70 26 -22 -143 -31 -112 -29 -27 1 -27 -4 -10 -101 51 87 34 59 50 77 -81 77 62 -95 -62 134 -75 -21
5935 -21 26 34 -17 -119 -8 16 -7 -52 -90 -68 25 -100 132 65 97 -77 120 87 -61 75 -48 -5 145 -43 1
5960 1 -6 -39 153 -137 170 170 -39 131 -147 35 -249 70 155 63 -53 25 -114 92 -111 -106 -104 66 36 149 48
5985 48 -44 1 117 -63 1 36 -69 24 118 19 61 -78 -143 86 20 171 -70 16 20 -55 50 55 -5 21 22 108 6
6012 6 105 -125 -198 -27 99 36 113 32 -28 129 18 77 -77 -114 96 -133 80 163 158 -26 -62 99 226 -69 27
6037 27 -46 55 52 80 3 -73 254 80 68 96 93 -112 -32 -5 -22 -57 152 1 -22 130 163 -69 -88 123 -52 86
6063 86 19 -123 36 20 -45 -48 -19 132 16 -71 -65 56 -24 -44 153 -21 -79 -46 -88 -48 -113 -73 98 34 109 129 -46
6090 -46 -55 13 -94 -12 4 25 111 128 68 109 69 -14 -96 -86 -154 187 -26 12 162 -138 57 113 21 0 103 107 -25
6117 -25 43 -51 2 34 3 76 -17 -44 -17 4 -107 -94 -26 66 -202 1 33 48 -58 49 -23 38 82 0 -121 -63 -110
6144 -110 85 50 -77 28 -63 211 -3 26 -15 142 -79 4 71 -14 -91 -128 4 -37 2 51 84 85 -31 -38 -16 -38
6170 -38 -48 96 -62 -6 -101 -43 22 -47 4 49 25 91 -50 -141 38 -139 89 145 -2 12 63 49 115 147 32 20
6196 20 -54 -41 -16 -179 -47 -73 15 39 115 -33 -13 68 -84 -31 58 -83 -55 -63 -284 -26 6 72 -114 -111 -121 -46 -7
6223 -7 -151 -43 75 208 -72 86 -25 61 132 -33 -3 144 -113 -137 25 141 59 22 -54 99 2 -111 0
6246 0 5 -75 -59 102 -137 -48 108 65 19 -13 18 -56 -162 112 -15 132 103 49 -38 -26 210 -121 -111 -89 -24 78
6272 78 -49 -109 -155 63 56 -28 -120 251 0 -105 -21 -119 -74 -62 76 87 47 43 -108 19 -48 -145 -110 23 133 108
6298 108 49 -123 -105 30 59 -11 -40 -28 -43 102 19 -40 -13 22 224 57 -88 -181 -79 15 -18 53 7 -92 -58 36
6324 36 9 -148 -29 61 26 64 -49 -66 -31 52 2 -152 -71 121 50 -18 29 32 139 -97 14 56 3 51 -48 23 28
6351 28 132 75 108 99 37 -12 -134 -178 -59 93 110 -70 -26 -15 -64 -51 60 -52 -91 -148 189 21 -63 -1 -34 -9
6377 -9 155 129 -172 -158 136 -23 -1 99 27 -123 -172 48 -121 -111 -37 -43 -61 89 -9 10 -11 66 -36 -114 -170 -172 -4
6404 -4 108 71 27 -16 -126 124 -50 -35 93 94 180 -17 9 -35 18 -24 -7 -34 249 -15 76 36 4 25 15 8 -76 101
6432 101 -64 104 42 254 -62 -4 86 -151 -13 216 42 -39 74 65 0 19 26 -29 50 115 51 110 183 -35 59 127
6458 127 -65 106 21 85 -108 -28 -33 -96 145 -47 -164 34 -76 99 -41 -77 -112 89 41 56 70 -22 -64 -123 -48
6483 -48 43 -54 30 -87 -41 -121 63 68 -28 -58 70 -95 42 -315 -198 -107 -93 -23 142 26 47 -12 -98 110 92 81
6509 81 24 13 -33 84 -182 87 -130 28 -42 79 -41 -23 127 64 21 4 -50 28 13 27 14 27 -118 27 -44
6534 -44 -1 -43 -39 21 -4 38 153 -133 -96 32 136 27 145 -8 19 45 -15 83 18 -17 -48 -190 13 -156 1
6559 1 -4 -196 -18 -40 -7 60 -14 81 146 -130 148 -51 -3 78 -93 60 -7 85 -42 18 -6 108 -78 103 45 -30
6585 -30 -47 109 -92 124 -56 55 24 -15 121 121 116 -139 -126 118 -14 -59 -7 -84 -43 166 -84 59 -72 137
6609 137 39 -161 19 14 172 -39 -109 -21 -71 -103 6 -38 92 28 -107 74 -60 -80 32 -32 103 -153 41 87
6633 87 28 -28 7 90 105 2 5 -79 127 -145 27 185 27 12 23 130 -187 -39 -127 -53 -68 12 40 -116 -77 132
6659 132 68 -16 -35 -19 3 -42 -14 64 199 -131 -26 -20 2 0 -84 -9 -59 8 -29 -43 49 32 72 -42 28 109 -111 91
6687 91 83 -180 191 0 43 142 -106 120 -63 -99 -15 24 16 -50 113 -12 -69 -130 47 7 -82 -111 -120 -54 105 -10
6713 -10 -31 -59 -126 312 -9 -7 -73 107 117 -51 -85 -66 21 -90 -64 -214 -59 -48 -63 -92 -21 -138 171 184 82 -135
6739 -135 -16 -35 16 -99 -78 -111 -84 -55 46 -35 -98 -46 -77 16 -49 -21 -45 121 14 -63 -36 73 -69 -36 24 -62
6765 -62 50 44 -181 -7 -31 75 134 -11 57 177 218 137 -85 62 -58 19 7 -87 -19 -93 -13 25 58 196 165 -42
6791 -42 24 -39 183 70 19 42 56 23 -20 -49 61 129 206 34 -30 -82 125 64 -17 154 25 -127 19 -40 -70 -230
6817 -230 25 60 24 -15 149 -139 124 0 -148 112 -34 72 -52 50 -40 -91 88 -44 90 -24 163 14
6839 14 69 -7 -30 6 -27 -36 -96 13 26 -78 -64 122 -95 -43 -29 -106 -130 71 -96 -67 -177 32 73 -37 45 -103
6865 -103 -57 -44 82 106 -90 -185 43 40 28 54 -31 144 26 -28 -205 73 -168 -103 -56 21 -107 8 -120 -32 143
6890 143 113 -70 -54 -66 208 -84 -48 -138 60 -53 -224 -26 14 -109 44 14 63 -38 -100 22 -11 18 3 -32
6914 -32 83 198 -84 49 -109 13 21 -180 104 -173 -130 127 9 80 80 -18 3 -141 60 23 121 144 -59 -14
6938 -14 8 -298 196 -13 -72 -164 -43 75 8 -11 -102 -24 -20 67 -106 -160 -92 -98 -28 14 133 62 39 89 9 134 34
6965 34 11 -103 -183 131 -115 26 150 21 -48 17 -64 -170 99 52 -15 -149 -24 -65 26 40 -92 -16 -36 -168
6989 -168 -110 177 -74 -8 16 -63 -188 -114 134 15 205 -28 -94 30 62 -6 -3 66 -23 -81 -18 -32 35 -103 138
7014 138 94 -14 38 -144 90 -188 -56 168 -39 107 -75 9 -17 -97 -91 12 -75 200 77 -34 -55 -97 -63 -122
7038 -122 -79 -121 64 113 -84 -162 -17 -180 -64 -103 40 14 -6 -81 3 -98 -94 -65 -86 -60 64 65 -8 -62 23 -46 99
7065 99 -173 -23 158 57 38 -2 62 50 -126 59 108 10 56 -138 117 -25 -179 -31 177 -6 -11 -7 99 -90
7089 -90 -78 -122 7 -32 27 -21 -181 97 124 34 34 163 -21 1 -52 64 -41 -16 -63 11 7 -28 88 167 128 58 58 -146
7117 -146 101 -136 22 285 66 -11 -7 17 -11 125 -87 144 -93 -40 42 147 -5 -136 -69 -13 73 60 55 -177
7141 -177 -153 131 75 42 -32 12 -26 -44 10 29 147 148 -13 106 10 -118 54 -66 118 -26 -41 27 -91 -107 -10
7166 -10 46 52 204 105 -82 39 69 41 -29 49 -38 -88 -87 115 -109 39 25 -104 -38 29 -48 -16 -100 -41 93 22 -191
7193 -191 -42 129 173 -44 -65 26 20 63 19 133 -25 -21 46 136 86 -44 -56 90 -139 -187 -77 78 -100 68 68
7218 68 67 -94 -88 75 83 118 57 187 -106 67 -125 -186 37 15 57 -126 21 -8 -212 25 71 -45 -87 55 -49
7243 -49 -42 -1 121 51 78 -13 60 -23 -42 104 51 -41 20 45 -233 47 -16 -16 60 94 -18 51 -109 48 -132 61 183
7270 183 42 -8 -69 -33 -48 -100 43 17 -135 -71 137 131 9 -1 -24 8 -168 129 -50 83 -117 -93 -37 69 -43
7295 -43 -117 114 27 -136 76 53 91 -59 -62 103 70 -26 15 -43 43 5 12 -9 -6 77 -3 0 40 -57 105 69 -30 8 -199
7324 -199 -55 5 17 -98 42 35 -43 159 -11 -83 -88 47 5 -57 -27 -162 12 49 -26 -125 94 142 2 -96 -67 -9
7350 -9 -43 89 -187 -58 68 -103 42 -80 33 54 152 -27 -30 5 -1 10 -204 -126 218 -90 -65 155 78 69 -47
7375 -47 -48 -127 -4 -59 17 33 -258 127 88 -18 12 87 100 38 -95 -61 -33 -75 -30 -176 -6 -71 -1 86 47 -3 48
7402 48 -25 -102 71 -95 33 -79 60 178 41 -84 128 -96 130 20 -134 -21 155 61 8 -125 -2 -144
7424 -144 70 44 79 29 81 121 128 35 114 62 -126 -4 -90 159 72 -48 -50 -104 -122 3 51 94 -99 112 -57 53
7450 53 68 32 96 226 97 70 110 12 -186 -95 -82 -2 12 -68 -14 -123 88 147 99 -133 -154 -87 109 157 79 70 -5
7477 -5 45 124 93 43 64 70 43 24 33 -52 -54 -130 -1 -63 -71 55 38 59 -36 173 50 -59 -29 -203 -46 39 9 -45 -102
7506 -102 -47 -18 122 141 -86 8 -1 -9 -28 -100 209 -80 -141 66 110 85 19 -64 -94 42 -114 -83 -24 91 -57 -33
7532 -33 146 62 57 13 79 -17 0 32 -54 -35 -28 56 -69 13 192 -163 -126 -94 -19 -43 -18 -103 1 40 -126 -73 -13 -43
7560 -43 148 25 -20 -83 -142 -4 32 -13 28 71 64 -147 -197 77 85 -72 13 -75 43 -10 -60 -54 62 -29 44 108 16 4
7588 4 -26 -30 85 50 63 66 84 -96 -13 77 52 57 54 -10 10 -21 -94 27 -36 70 -162 -69 -104 114 -131 -176 115 71 30
7617 30 -76 -49 -44 26 -45 8 29 176 -15 -18 119 57 188 175 30 52 -91 -14 -135 -199 -29 -140 -8 -47 54
7642 54 -52 -51 -68 70 -33 -37 100 26 -123 88 -65 -53 -13 -40 195 -90 15 -52 67 31 -19 -95 69 13 252
7667 252 106 106 -94 147 169 -23 82 -122 80 1 42 -112 121 28 133 -14 -85 -84 -23 71 -62 68 -106 -100
7691 -100 16 2 94 148 48 -82 -98 126 -84 176 39 -12 52 128 79 -7 -90 -64 -82 50 -33 -59 -4 30 -140
7716 -140 227 62 61 -44 74 107 -278 53 -138 136 -158 139 17 -62 -86 22 131 116 -283 6 163 -53
7738 -53 -188 -43 -22 68 -9 54 30 -49 36 75 -32 -10 169 114 70 -73 119 -21 -147 72 140 4 -92 42 125
7763 125 -73 -34 -73 28 -134 48 20 102 39 187 69 -16 -239 16 -162 -95 59 29 -19 -137 43 -121 83
7786 83 -84 45 -44 -27 75 -1 12 -54 -102 -170 -144 -46 -27 104 -18 91 5 -61 43 -37 -132 117 63 -187 8
7811 8 -107 54 42 -10 83 9 28 124 15 183 82 40 -58 -72 84 -25 29 134 -66 -173 61 102 66 61 31 -73
7837 -73 -21 147 102 137 -147 90 -31 -71 -112 -92 26 61 -117 -42 -37 -98 -76 81 112 -108 -56 41 43 108 27 43 184
7864 184 249 56 -33 21 81 -38 -4 32 -44 -1 -140 48 163 -84 50 29 -124 -237 30 69 -27 -16 204 -63
7888 -63 71 -7 93 -75 100 -42 177 -44 166 47 61 -133 20 -34 22 43 55 -10 54 -3 127 113 97 153
7912 153 -47 -33 -4 -3 -74 92 -106 -176 -26 122 -171 50 12 -169 59 40 -126 165 111 -158 -84 -15 1 58
7936 58 1 -3 43 -124 44 -34 -18 51 89 6 17 -235 -50 -73 37 105 -99 -74 -14 -22 -112 1 -88 -185 4 48 21
7963 21 -21 -18 14 -257 -50 -58 -142 127 -7 78 80 -158 -90 63 -20 -95 81 -20 69 -142 -13 105 41 216 84
7988 84 110 120 -29 -15 -127 -192 -19 29 -10 21 89 -218 -147 44 -50 105 6 -132 -44 -55 113 -16 6 56 14 -10
8014 -10 -66 -168 39 -169 -42 -66 97 -128 79 -115 231 -92 196 -22 -152 -83 178 -60 58 -17 113 153
8036 153 -69 91 100 260 -198 17 -116 35 -28 7 6 36 -77 -14 41 -56 -100 42 -32 119 -142 -7 -69 76
8060 76 -7 106 -95 95 59 -65 -7 56 22 -123 87 -44 30 -215 -23 58 2 131 8 -12 -123 -118 16 -18
8084 -18 -15 64 59 37 -220 178 54 -52 -61 4 86 95 -13 2 111 -61 -34 82 -87 239 -10 61 15 27 -43 82
8110 82 -10 71 -1 69 56 15 95 -84 250 -55 66 22 23 65 18 143 90 14 123 -136 -42 -63 -13 105 64 14 -62
8137 -62 -90 8 -212 -109 130 32 -37 -117 -75 88 -125 61 133 -9 50 -151 97 126 -105 81 28 66 21 -73 -12
8162 -12 226 95 -126 -55 98 27 17 -103 1 -60 83 -11 -70 -46 8 -124 -39 111 54 -73 -27 -24 -19 81 -55
8187 -55 71 28 -55 175
8191A75
##END NTUPLES=NMR FID
##END=
