##TITLE=1H_DE-80H_X3
 200.13MHz, d2o
 8 sc
 
 19ns.26.2.2025
##JCAMPDX= 6.0         $$ Bruker NMR JCAMP-DX V2.0
##DATA TYPE= NMR FID
##DATA CLASS= NTUPLES
##ORIGIN= UXNMR, Bruker Analytische Messtechnik GmbH
##OWNER= pz
$$ XWIN-NMR		Version 3.5
$$ Thu Apr  3 14:45:52 2025 Russian Standard Time (UT+4h)  Yarkov@DPX200
##.OBSERVE FREQUENCY= 200.1313
##.OBSERVE NUCLEUS= ^1H
##.DELAY= (6, 6)
##.ACQUISITION MODE= SIMULTANEOUS
##.ACQUISITION SCHEME= undefined
##.AVERAGES= 8
##.DIGITISER RES= 18
##SPECTROMETER/DATA SYSTEM= spect
##.PULSE SEQUENCE= zg30
##.SOLVENT NAME= DMSO
##.SHIFT REFERENCE= (INTERNAL, DMSO, 0, 14.3821)
##AUDIT TRAIL= $$ (NUMBER, WHEN, WHO, WHERE, WHAT)
$$ ##TITLE= Audit trail, XWIN-NMR		Version 3.5
$$ ##JCAMPDX= 5.01
$$ ##ORIGIN= Bruker BioSpin GmbH
$$ ##OWNER= Yarkov
$$ C:/Bruker/XWIN-NMR/data/yarkov2/nmr/H-C/1/audita.txt
$$ ##AUDIT TRAIL=  $$ (NUMBER, WHEN, WHO, WHERE, WHAT)
(   1,<2025-04-03 14:43:33.82 +0400>,<Yarkov>,<DPX200>,
      <created by zg, POWCHK disabled, PULCHK disabled
       configuration hash MD5:
       00 E9 B6 7A A2 85 ED C7 34 08 36 98 17 FE 4E 26
       data hash MD5: 16K
       E1 97 53 6F B9 D1 DA 64 12 2D 13 69 86 37 5D A6>)
$$ ##END=
$$ 
$$ hash MD5
$$ E1 F2 E5 CD 08 9C 0C 2D 79 60 31 BB FB 5E 2B 3C
##$RELAX= 
##$RELAX= 
##$RELAX= 
##$RELAX= 
##$RELAX= 
##$RELAX= 
$$ Bruker specific parameters
$$ --------------------------
##$DU= <C:/Bruker/XWIN-NMR>
##$EXPNO= 1
##$NAME= <H-C>
##$PROCNO= 1
##$TYPE= <nmr>
##$USER= <yarkov2>
##$AMP= (0..31)
100 100 100 100 100 100 100 100 100 100 100 100 100 100 100 100 100 100 
100 100 100 100 100 100 100 100 100 100 100 100 100 100 
##$AQSEQ= 0
##$AQ_mod= 1
##$AUNM= <au_zg>
##$AUTOPOS= <>
##$BF1= 200.13
##$BF2= 200.13
##$BF3= 200.13
##$BF4= 200.13
##$BF5= 200.13
##$BF6= 200.13
##$BF7= 200.13
##$BF8= 200.13
##$BYTORDA= 1
##$CFDGTYP= 0
##$CFRGTYP= 5
##$CHEMSTR= <none>
##$CNST= (0..31)
1 1 145 1 1 1 1 1 1 1 1 1 1 1 1 1 1 1 1 1 1 1 1 1 1 1 1 1 1 1 1 1 
##$CPDPRG= <>
##$CPDPRG1= <>
##$CPDPRG2= <>
##$CPDPRG3= <>
##$CPDPRG4= <mlev>
##$CPDPRG5= <mlev>
##$CPDPRG6= <mlev>
##$CPDPRG7= <mlev>
##$CPDPRG8= <mlev>
##$CPDPRGB= <>
##$CPDPRGT= <>
##$D= (0..31)
0 0.7 0 0 0 0 0 0 0 0 0 0.03 0 0 0 0 0 0 0 0 0 0 0 0 0 0 0 0 0 0 0 0 
##$DATE= 1743677013
##$DBL= (0..7)
120 120 120 120 120 120 120 120 
##$DBP= (0..7)
150 150 150 150 150 150 150 150 
##$DBP07= 0
##$DBPNAM0= <>
##$DBPNAM1= <>
##$DBPNAM2= <>
##$DBPNAM3= <>
##$DBPNAM4= <>
##$DBPNAM5= <>
##$DBPNAM6= <>
##$DBPNAM7= <>
##$DBPOAL= (0..7)
0.5 0.5 0.5 0.5 0.5 0.5 0.5 0.5 
##$DBPOFFS= (0..7)
0 0 0 0 0 0 0 0 
##$DE= 6
##$DECBNUC= <off>
##$DECIM= 32
##$DECNUC= <off>
##$DECSTAT= 4
##$DIGMOD= 1
##$DIGTYP= 9
##$DL= (0..7)
0 120 120 120 120 120 120 120 
##$DP= (0..7)
150 150 150 150 150 150 150 150 
##$DP07= 0
##$DPNAME0= <>
##$DPNAME1= <>
##$DPNAME2= <>
##$DPNAME3= <>
##$DPNAME4= <>
##$DPNAME5= <>
##$DPNAME6= <>
##$DPNAME7= <>
##$DPOAL= (0..7)
0.5 0.5 0.5 0.5 0.5 0.5 0.5 0.5 
##$DPOFFS= (0..7)
0 0 0 0 0 0 0 0 
##$DQDMODE= 0
##$DR= 18
##$DS= 0
$$ [...]
##$SUBNAM2= <"">
##$SUBNAM3= <"">
##$SUBNAM4= <"">
##$SUBNAM5= <"">
##$SUBNAM6= <"">
##$SUBNAM7= <"">
##$SUBNAM8= <"">
##$SUBNAM9= <"">
##$SW= 18.0517328524113
##$SWIBOX= (0..15)
0 0 2 0 0 0 0 0 0 0 0 0 0 0 0 0 
##$SW_h= 3612.71676300578
##$TD= 16384
##$TD0= 1
##$TE= 0
##$TE2= 300
##$TE3= 300
##$TEG= 300
##$TL= (0..7)
0 120 120 120 120 120 120 120 
##$TP= (0..7)
150 150 150 150 150 150 150 150 
##$TP07= 0
##$TPNAME0= <>
##$TPNAME1= <>
##$TPNAME2= <>
##$TPNAME3= <>
##$TPNAME4= <>
##$TPNAME5= <>
##$TPNAME6= <>
##$TPNAME7= <>
##$TPOAL= (0..7)
0.5 0.5 0.5 0.5 0.5 0.5 0.5 0.5 
##$TPOFFS= (0..7)
0 0 0 0 0 0 0 0 
##$TUNHIN= 0
##$TUNHOUT= 0
##$TUNXOUT= 0
##$USERA1= <user>
##$USERA2= <user>
##$USERA3= <user>
##$USERA4= <user>
##$USERA5= <user>
##$V9= 5
##$VALIST= <valist>
##$VCLIST= <CCCCCCCCCCCCCCC>
##$VD= 0
##$VDLIST= <DDDDDDDDDDDDDDD>
##$VPLIST= <PPPPPPPPPPPPPPP>
##$VTLIST= <TTTTTTTTTTTTTTT>
##$WBST= 1024
##$WBSW= 4
##$XGAIN= (0..3)
0 0 0 0 
##$XL= 0
##$YL= 0
##$YMAX_a= 53337
##$YMIN_a= -73866
##$ZGOPTNS= <>
##$ZL1= 120
##$ZL2= 120
##$ZL3= 120
##$ZL4= 120
##$ABSF1= 10
##$ABSF2= 0
##$ABSG= 5
##$ABSL= 3
##$ALPHA= 0
##$AQORDER= 0
##$ASSFAC= 0
##$ASSFACI= 0
##$ASSFACX= 0
##$ASSWID= 0
##$AUNMP= <proc_1d>
##$AZFE= 0.1
##$AZFW= 0.1
##$BCFW= 1
##$BC_mod= 2
##$BYTORDP= 1
##$COROFFS= 0
##$CY= 83.5205535888672
##$DATMOD= 1
##$DC= 2
##$DFILT= <>
##$DTYPP= 0
##$F1P= 10.8118882576601
##$F2P= -7.23987719738617
##$FCOR= 0.5
##$FTSIZE= 0
##$FT_mod= 4
##$GAMMA= 1
##$GB= 0.15
##$INTBC= 1
##$INTSCL= 1
##$ISEN= 128
##$LB= 0.25
##$LEV0= 0
##$LPBIN= 0
##$MAXI= 10000
##$MC2= 0
##$MEAN= 0
##$ME_mod= 0
##$MI= 1.114404
##$NCOEF= 0
##$NC_proc= 0
##$NLEV= 6
##$NOISF1= 3.799351
##$NOISF2= 2.8
##$NSP= 1
##$NTH_PI= 0
##$NZP= 0
##$OFFSET= 14.38212
##$PC= 1
##$PHC0= -1165.505
##$PHC1= -29.80774
##$PH_mod= 1
##$PKNL= yes
##$PPARMOD= 0
##$PSCAL= 0
##$PSIGN= 0
##$REVERSE= no
##$SF= 200.129724274929
##$SI= 16384
##$SIGF1= 3
##$SIGF2= 2
##$SINO= 400
##$SIOLD= 16384
##$SREGLST= <1H.CDCl3>
##$SSB= 0
##$STSI= 0
##$STSR= 0
##$SW_p= 3205.1282051282
##$SYMM= 0
##$S_DEV= 0
##$TDeff= 0
##$TDoff= 0
##$TI= <>
##$TILT= no
##$TM1= 0
##$TM2= 0
##$TOPLEV= 0
##$USERP1= <user>
##$USERP2= <user>
##$USERP3= <user>
##$USERP4= <user>
##$USERP5= <user>
##$WDW= 1
##$XDIM= 8192
##$YMAX_p= 0
##$YMIN_p= 0
$$ End of Bruker specific parameters
$$ ---------------------------------
##NTUPLES= NMR FID
##VAR_NAME=  TIME,          FID/REAL,        FID/IMAG
##SYMBOL=    X,             R,               I
##VAR_TYPE=  INDEPENDENT,   DEPENDENT,       DEPENDENT
##VAR_FORM=  AFFN,          ASDF,            ASDF
##VAR_DIM=   8192,          8192,            8192
##UNITS=     SECONDS,       ARBITRARY UNITS, ARBITRARY UNITS
##FACTOR=    0.0002768,     1,               1
##FIRST=     0,             0,               0
##LAST=      2.2672688,     0,               0
##MIN=       0,             -73866,          0
##MAX=       2.2672688,     53337,           0
$$ Real data points
##PAGE= N=1
##DATA TABLE= (X++(R..R)), XYDATA
$$ [...]
1309G8J2n3n1L2k2j2L3r9P9p0Q0j9N7p4l4L9M7L5o6J16j14j6O3j08K1J79k15k5
1337a07K27j78O4j1l7M6L1O3l9j58J19J3L2QJ24k91L8Q2N0j03J26k19J79O8j53
1362b6P0NJ7R2j66m5J08m5J59kj33K54j41j59P5j04J31j52J65j60K2J66m5j30
1386d4M8K1n2M1k1P7J2j07P6rj33Q9q7L5L7J12q6j10n1K29j34j7K6o0K16j1qj19
1414c0L3L8J18j70jJ51j84mJ0N6m9n1oQ4J32r8M8l0M9j31Q1o9l2J97j19K6O6q1
1442C4O0j52J04jM6j47%m3K24j27o7Q0n6p2L3P4p7K41j36M0l9J32J04l09j94K81
1468C3l4J11p0q0o6O2J66j34J15O1k47J03j33Q2lr2K8L3P1j5Om2K74j42j4K7m9
1495E1K2J1j73J51q5K9l8P6j87K03l2lK8J15n6j41K14q3%k2p7j0M8J9k55K12j04
$$ plain form
1309 78 90 37 -14 18 -4 -16 17 -82 -3 -73 7 -12 45 -29 -63 -24 23 58 -8 108 -6 -22 41 -67 -46 133 -82 -107
1337 -107 120 -58 6 -5 -42 4 35 98 59 -99 20 33 65 73 197 -94 -56 26 76 -27 99 -120 59 127 -26
1362 -26 44 49 66 158 -8 -53 55 10 169 167 34 288 147 -12 63 -41 90 -62 103 -57 -35 131 86 -44
1386 -44 4 25 -27 14 -7 70 82 -25 51 42 -91 -2 -89 -54 -17 95 9 -101 -152 77 -57 -74 -48 -108 108 97 89 -30
1414 -30 3 41 159 -11 -12 139 -45 -49 -39 17 -32 -83 -89 -5 127 29 77 47 96 -35 46 -23 -55 142 23 49 115 34
1442 34 94 -58 46 45 91 -56 -56 -99 125 -2 -69 11 -45 -117 -84 -10 -87 154 18 58 19 151 255 -54 -248 33
1468 33 -1 110 40 -40 -106 -44 122 -12 103 164 -83 20 -113 -31 -34 -126 -98 -65 6 -9 -3 -45 229 87 73 100 51
1495 51 73 84 -89 62 -23 6 -32 44 -143 60 28 25 53 168 112 -29 185 102 102 80 3 -7 41 60 -195 17 -87
1522h7L6J69k49J13J10j33N7q4L3QM7l4Q9J8p6o7P5p8j6J70j50M0J7k2j1j00K40
1549A15r2j02J03M6J4n2O4N2k30R7j01J14m7kl4L1m0J28p3N6J20k97j30K34j61
1574a87J71K5p8R4j87O7l4J56k2k0k4R8o3N0O9l3j58N8J6o2J22j26Q2O4o7N5o6
1601@Om3J37j07O0j43Jlo6J68l3k4J29j64N1J8k9m3L5J36J14k54j57K57R6j21
1627B1J7j40J64j12j07J39n8O8k87L29j40K1M0o0J10j84J89r9L3N8P2n2o5nK87
1652B39k40P9l13L59p9j38K24m7p0M4m1j18J01N3R0j41O3k43P6QK48l02J49J07
1676A08k31J56j7J47k57J90j27K9Q9j05q0J8J32j36J34J46j54k02K79k9rk8n6
1699cj5J6or4J86J52j43j89K02l73J86J56o1K04j34j09K75k48O3M8j91O9k0KN9
$$ plain form
1522 -87 -51 118 -131 -18 92 -41 16 -68 -35 -27 20 -14 75 93 17 -50 25 -53 -69 101 -49 -9 8 -14 -25 -125 115
1549 115 23 -79 24 70 84 32 96 148 -82 15 -86 28 -19 -21 -55 -24 -64 64 -9 47 167 -130 -260 -26 -187
1574 -187 -16 9 -69 25 -162 -95 -129 27 5 -15 -39 59 -4 46 115 82 -76 -18 -2 -64 58 -68 14 78 11 66 0
1601 0 6 -37 100 -7 53 -90 -89 -92 -158 10 -23 -47 82 -82 -31 -13 -42 -85 -50 86 200 -54 -211 46 142 21
1627 21 38 -102 62 -50 -157 -18 -76 -8 -295 34 -106 -85 -45 -105 5 -179 10 -89 -56 2 74 22 -43 -48 239
1652 239 -1 78 -235 124 45 -93 131 84 14 58 17 -101 0 53 143 2 65 -178 -102 -94 154 -148 1 108
1676 108 -123 33 16 163 -94 96 -31 -2 87 -18 -98 -80 52 -84 50 196 42 -160 119 90 81 53 -3
1699 -3 -18 -2 -8 -102 84 236 93 -96 106 -267 -81 75 14 218 84 -25 250 2 65 113 -78 -9 -29 -27 32
1724C2poj4n7o4K03j9k05K69k13p2K13j65J52kj90K90k09J9M4lP3K4k10o4J04
1750g7J81K0p7J2m8m1J79j61J16k32J12k2J06j57J05qJ44o8j35J87n8j92L31r3
1774A24k45L10l30R9Pl9J02j26J03j06k5J54r5KL0J1q7J90r5l4N2m6R0L9j75J42
1800E2N9j64K09p0J27j58r7J09k0j07Q2j58J33n7J72j70r3J07K6RQ5O5m7J02j56
1825D0j03J67j21KJ41j07K6l0Q1k51P0J68n3K5r4MQ2m4n9p4M1K9J01j21M0m9p
1852i6K68k20p8K67j10O8j08q5L9OO0P5q0L1l9J9J7k43K57j36K3J39J5j05o1M7
1878c0qj8J46j07kJ96j72N1m9o7J31J38j65J2jK4op9J44m07L40l2O4j20MK7m0
1905b6mQ8q7JJ2k1J33j92%P7K4J2J51k55J43Kr2J65k52J34N1j10M4J08n6L7q5
$$ plain form
1724 32 25 19 5 -52 -116 87 68 -137 132 -81 -153 60 -105 47 45 -145 145 -64 -45 -1 -4 69 93 -117 -181 -77
1750 -77 104 124 47 59 11 -30 149 -12 104 -128 -16 -38 68 -89 16 8 152 84 -51 136 78 -114 217 124
1774 124 -121 189 -141 -42 -35 -74 28 -98 5 -101 -126 28 -67 -65 -35 -24 -111 79 -16 -50 2 -44 46 85 -90 52
1800 52 111 -53 156 86 213 55 -42 67 47 -60 22 -136 -3 -60 112 -58 -151 -44 -18 -9 76 141 94 196 40
1825 40 -63 104 -17 -15 126 19 45 15 96 -155 -85 83 30 55 -39 -35 47 3 -56 -130 -89 -60 41 -80 -40 -89 -96
1852 -96 172 -48 -126 141 31 99 -9 -94 -55 -49 11 86 6 37 -2 17 34 -209 48 -88 -65 74 89 -16 -77 -30
1878 -30 -38 -56 90 -17 -19 177 5 56 7 -60 71 209 44 56 55 79 73 -6 138 -269 71 39 103 -17 -13 14 -26
1905 -26 -30 58 -29 -28 -16 -37 96 -96 -96 -19 5 17 168 -87 56 58 -34 131 -121 13 64 -46 -2 106 50 87 2
1932BJ1K5j43pK14j92J45Q3j80J2QO3Q3l79K97j41J41o6j57J98O7O9j17j41P3
1957c2M3N8J0j88j0k1K46l7L2p2k3j24J26r7R8q1o1K26o1n6n8K25k08M4K28m12
1983b05K79j56J64j50j10J48K9j10K58j95j12K06j20M4P5OK2q7q6L61l89J53q1
2006e6O3l9N9jR4k6%l4j19L21k96MMN0koK7K9K8j19M1kJ5o3Q9j04j4j0J06O7m7
2037E9J67j66K8l8L5l8j97L5J38j14P6J07pp0K9q7Q1j8j8q8R1j93Q2J39q3n5K54
2064A49j07j61K02J43r8p2j44J32P8j31n7N4J60k29J20J10k8j92J0J9O0M6r2J22
2088I4L3p4j29O5p0KK14j54K17j83Q9p2j54Q6o0J0mJ29p4N4P7R3k28j13P7J62
2114H7o3N1J1j41N6ML7k9M1m8J06J5r1N7j93J99j34L2P9l7p2J42o3n5m6L4qR9
$$ plain form
1932 2 13 38 -105 -112 102 -90 55 138 -42 -30 -22 41 124 -255 42 -99 42 -24 -181 17 84 153 36 -105 -32
1957 -32 11 69 79 -109 -119 -140 106 69 101 29 6 -118 8 -89 9 -72 -133 93 32 -24 -82 143 -65 -21 207 -205
1983 -205 74 -82 82 -68 -178 -30 -1 -111 147 -48 -160 46 -74 -30 45 51 73 -14 -100 261 -128 25 -56
2006 -56 7 -32 27 26 120 94 94 60 -59 262 -34 -30 -26 24 22 16 43 72 100 -19 22 20 35 -28 61 -43 -57 -67 39 106 59
2037 59 226 60 88 50 85 47 -150 -115 23 -91 -15 92 85 15 44 -43 38 20 2 -86 5 -188 -106 33 -50 -105 149
2064 149 42 -119 83 226 128 56 -88 44 122 -9 -66 -12 148 -81 39 149 121 -71 -61 -42 18 64 -28 94
2088 94 127 53 -76 -11 -81 -79 135 -19 198 15 104 32 -122 -36 -96 -86 -90 39 -35 19 96 189 -39 -152 -75 87
2114 87 24 75 86 -55 1 5 42 13 54 6 112 127 36 93 -100 99 -35 -3 76 39 -33 109 46 -9 -55 -21 -29 70
2142G0m0J55p0k04Q8M4k4k91K31J1r0K83j39r1j7J75p7K5Oj28J55l04K73q0m0
2167g9l3R0J02P8n5j39M3J94k34j94L55R2j13O4j66l9Q6n1J21p5J17j80q9P1k3
2192e7j82J59M3J38r0Q4j68M7K8q8n4N9MJ3k4N2m1N6J0r0J49j35l9P2L4n1R3p2
2220e0J33j53M5P9j58J34j28J87j88J08oQ4n9k05J26m6J97j88J19J3j11Oo8r2
2244b21Q0N9J51L4j81j3N4L5k28L58m3j63J12Mj04J17j78J23j6N0L1J10k28qJ17
2269E2j23p5K66k02K0R6J41j78k8p0O6j20pK62j86M4K8N2o7P9%r3J66q5J9J00
2295A57j75J9p5L7p0rP1R3j47Q0J36J4j05O6n0K7p5k1o9O5L6j25K55j58qJ7J46
2322A32k30p6J23O8j22M4J11r4j55N5J49N8j43m0K35j28Rj56K05j36K71j37M9
$$ plain form
2142 70 30 185 115 -89 -1 43 19 -272 -41 -30 -120 163 24 -67 -84 91 14 39 45 -83 72 -232 41 -39 -79
2167 -79 -112 -22 80 158 103 -36 7 201 -33 -227 128 220 107 171 5 -34 52 1 122 47 164 -16 -105 -34 -57
2192 -57 -239 -80 -37 101 11 95 -73 -26 2 -86 -140 -81 -77 -64 -88 -36 -77 -21 -11 -101 48 -87 -126 -54 -20 -71 22 -50
2220 -50 83 -70 -25 54 -104 30 -98 89 -99 9 3 87 28 -177 -51 -97 100 -88 31 44 -67 -61 -129 -221
2244 -221 -141 -82 69 103 -78 -91 -37 -2 -230 128 85 -78 34 38 -66 51 -127 -4 -20 30 61 171 -57 -65 52
2269 52 -71 -146 120 -82 -62 34 175 -3 -31 -101 -35 -155 -162 100 -86 -42 -14 38 -29 50 50 -43 123 38 57 157
2295 157 -18 1 -74 -37 -107 -116 -45 48 -99 -19 117 131 26 92 42 69 -6 -27 -96 -31 5 -120 135 -23 -31 -14 132
2322 132 -98 -174 -51 17 -105 -61 50 -44 -199 -144 5 63 -80 -120 115 -13 -4 -160 45 -91 180 43 92
2345I2j07M4k7J47q8n4M9n3M4k9m2J13k20J66m7M9k0n7J03j72K48j16q0r0J67
2370B0j08J85k42J38R5P2j65K35k97J15J4J50k97j28K41j47P6j8J40N4j58K37
2392B12l05K07R8j34q3N5o0N9l5K6N8j07p0Q3P7j63P3M7j8k36O9K39p1Jj42Q9
2418c1MJ94j40n0j40R2J10j8Q5k4j25M4o3M4K88k06j37J59j60J7p2K16j34M5j8
2443b0p6O1L8J75j01j52J15j22O2r2J43q2J10j85M6m9J3L11k94J30j09N5j03J44
2467A8j63K38q2R3j38m7M7N4j80Q5R0k2J16k34J93n1J07j19J2p3N5qk8J19m0O7
2493A09j12L1j69K03p9J01j71J92k92K38j39q6J85P6k23l2Q2J3K2P5J36j99o5
2516a04J04J09l8j44K06k51K01pj4l5k1P8k06K11k06K1L%J1J09o6J24j25o6Q8
$$ plain form
2345 92 -15 29 2 149 61 7 56 3 47 18 -24 89 -131 35 -12 37 17 -40 63 -109 139 23 -57 -147 20
2370 20 -88 97 -145 -7 88 160 -5 230 -67 48 62 212 -85 -213 28 -119 -43 -61 79 133 -25 212
2392 212 -93 114 212 78 -5 50 -10 49 14 40 98 -9 -79 4 81 -82 -9 38 20 -216 -147 92 21 22 -120 -31
2418 -31 -27 167 27 -23 -163 -71 39 21 106 82 -43 1 -62 -18 270 64 -73 86 -74 -57 -129 87 -47 -2 -20
2443 -20 -96 -35 3 178 77 -75 40 -82 -20 -112 31 -51 59 -126 -80 -129 -116 195 -99 31 -78 -23 -126 18
2467 18 -145 93 11 104 -34 -81 -34 20 -160 -75 15 -7 109 -125 68 17 124 5 17 -56 -1 -9 -37 82 42 109
2493 109 -3 28 -141 62 -17 84 -87 105 -187 51 -88 -174 11 87 -136 -168 -86 -73 -51 24 160 -39 -104
2516 -104 0 109 71 -73 133 -118 83 76 62 27 6 84 -122 89 -117 -96 -93 -93 -82 27 -39 85 -40 -106 -18
2541a8L6m6Jj4J05O5k63J28J3L2j2l4j4J46K5R0o0l10J23N8ko0l4J3P7q2J43k5
2569H1p6J19j27j23J29J6j05K07o2r6J17o8L7j47J62q6j06K25j15Or4J84j48l
2593g3K3n0J50j19R6o7j0K4J06P1k02J72k22J66l55M47r2o5j13K00o9l21J66J61
2617B4r5R5J65j78q7J02o2q5K01j25J8j02J52j6r5Q6k3l1J48n3j23PL1K7J19j75
2643g5k9K11j13l0o2j4J16L8q3P0k44K57J36k72j6J48j61J57j62J23m0J29l7k3
2667B4r3R2Mj83Q6J24mj8L9m0k6R0M5j51o2J08o7K7O3j98K22j50J06Ml1m3J80
2694A48j57oO8k06K1L1J26nq4j0J28M8q6j28nR7oJ5R4j58K45j99l0kO5m7J19j31
2722e5N3J04j06m3n0J80M1J21j29k29J24L5m9m4p2J93J6k15J10N3j45J95k51K21
$$ plain form
2541 -18 18 -28 -27 -41 64 129 -134 -6 7 39 27 -7 -21 125 150 240 180 -130 -7 51 49 -11 -45 -32 45 -37 106 81
2569 81 5 124 -3 -126 3 19 -86 121 59 -37 80 12 49 -98 64 -22 -128 97 -18 -12 -106 78 -70 -73
2593 -73 -50 -100 50 -69 27 -40 -50 -26 80 151 -51 121 -101 65 -290 157 65 0 -113 87 18 -303 -137 24
2617 24 -71 24 189 11 -76 26 -36 -121 80 -45 -27 -129 23 7 -88 -2 -25 -56 92 39 -84 -77 -46 -19 100 -75
2643 -75 -104 107 -6 -36 -98 -112 4 42 -41 29 -215 42 178 -94 -110 38 -123 34 -128 -5 -45 84 47 24
2667 24 -69 23 27 -156 -70 54 50 32 71 31 5 95 140 -11 -73 35 -32 -5 58 -140 82 -68 38 42 11 -32 148
2694 148 -9 -15 53 -153 -132 -101 25 20 -64 -74 54 102 16 -112 -117 -20 -26 -11 83 -75 170 -29 -59 -61 4 -43 76 -55
2722 -55 -2 102 -4 -47 -97 83 124 245 116 -113 11 46 -3 -47 -119 74 90 -125 -15 38 -107 88 -163 58
2746E8j79J13k4R8n1ql2M0j03R0J05r7%j12J99q8o5J7m9k0PJ28j15J91k10J08
2772AJ3J0O3j25m9J13j34Q3J2kK9M6j64O8P5J7j46R4J82k19k04L42po6j22k6J46
2799C0l8Q9l6J2n1j62J91j06O6J3J23k73J10J55j93R1j6J41j54O3kp6m2m1l1J03
2825c4N7j23P7j35K16j97J08o4J72k39j2J28j42J55Q8j07J89p7j8k9l3j8J27L5
2849A24j28J57j57N5j01k1K65k13L1n7K10j18OL2m3q7L01k63rO4P9j91Q9j37M6
2874f6l0Q1r5j9J79q9jp5J9j9J3J81J16k11j9JP9j77K88m7j70p0K17L6j87M9P
2901iP4O0l6o2q7J59J20k32o5R2j5l0k0J20K4L9Q8j32m0k44K41Qk39J80J06o7
2927C3Pr6K47k14K2j31K51r2nL2j04J8J8J90j96j29J83K14l43J56k3j29k0J26
$$ plain form
2746 58 -121 -8 -32 66 15 7 -25 15 -88 2 107 10 10 -102 97 9 -56 -39 -88 -108 -101 27 -88 103 -107 1
2772 1 14 24 87 -38 -87 26 -108 -25 -13 -15 14 60 -104 -36 39 56 -90 4 186 -33 -237 105 98 32 -90 -116 30
2799 30 -8 81 45 57 6 -156 35 -71 -5 8 131 -142 -32 123 -70 21 5 146 -8 55 53 -23 -65 -106 -137 -34
2825 -34 23 -100 -23 -158 58 -139 -31 -95 77 -162 -174 -46 -188 -33 55 -52 137 60 42 13 -20 -38 89 124
2849 124 -4 153 -4 51 -50 -71 194 -19 12 -45 165 47 53 85 42 -45 256 -7 -16 48 127 -64 25 -112 -66
2874 -66 -96 -15 -110 -129 50 -39 -40 -115 -96 -115 -102 79 195 -16 -35 -34 45 -132 156 109 -61 -131 86 122 -65 -16 -9
2901 -9 65 125 89 27 -60 99 219 -13 -78 14 -1 -31 -51 69 93 132 220 88 48 -196 45 53 -186 -6 100 33
2927 33 40 -56 191 -23 -1 -132 119 27 22 54 -50 -32 -14 176 -20 -149 34 248 -95 61 38 -91 -111 15
2951A5J17k36K02m6j9jJ9L5J8p4j08Q4j58K83Jl03R8J2N7l6pK9L5l1R9q3l8P6
2979D0q6l1J31j07p2K00O9m7p3q0J23k1j49KJ22P9j28J16p4q5nM4l34L36K9n2
3005e3KJ46j74J57r7L8J91j04Lj28J47j51Qm2K9JL2RJ62j66j92P2K21j78N4p7
3031i0J28j06j07J09rJ91P5k45R6n3l6kqJ85j83jN8pQ5R8l07Q7R6j43K01j63J99
3058A48j45m3J32j83J12o1N1J51j33n0RJ14j54q1Q7Q2j01J2Q1q1J21k19L15p9
3082H5j36L6n5j6j73K77n0j47J14O3pM9O1j30Q3M7J7k4m7j26N8Qm2K3M0R9o0J50
3110A97k94J27j8Kop2R4J03j10n0J45j18n2O6j16P2M3kj00J41k04O3J01l3J0O9
3136E8p7J4J01n0k16K82j4M4k33K01J4q8M7q1K4j76J40j40K40j62r2J10Q0L3j59
$$ plain form
2951 15 132 -104 98 52 33 32 51 86 104 30 -78 6 -152 131 132 -171 -73 -61 -4 -40 -47 -18 17 -14 85 2 -36 40
2979 40 -46 -77 54 -53 -125 75 144 97 24 -56 67 46 -103 -101 21 100 -28 88 14 -71 -76 -32 -366 -30 -1 -53
3005 -53 -51 95 -79 78 -19 19 210 106 109 -19 128 -23 -15 -57 -28 -27 5 14 176 10 -182 -110 111 -67 -13 -90
3031 -90 38 -68 -175 -66 -75 116 191 -54 42 -11 -47 -49 -57 128 -55 -56 2 -5 80 178 -129 -42 54 -89 112 -51 148
3058 148 3 -40 92 -91 21 -40 11 162 29 -21 -12 102 -52 -133 -46 36 -65 -53 28 -53 68 -151 164 85
3082 85 -51 -15 -70 -86 -259 18 -32 -179 -65 -2 -9 40 101 -29 54 101 118 94 47 -79 -21 -13 -55 -32 8 107 47 197
3110 197 -97 30 12 14 8 -64 30 133 23 -27 118 0 -52 14 -102 -30 13 11 -89 52 -152 -89 12 -21 -11 58
3136 58 -19 -5 96 46 -170 112 98 142 -91 110 124 36 83 2 26 -150 -10 -150 90 -72 -164 -54 26 59 -100
3161a00K27j92K25o4Qp0p0k06L92k45J4J72J25k69mN1j63K38r9k9J46j05N0o0
3185b8j7J98j65J55j7j45K1J26o1l8j27J25J64k23j04J6R2j6L3N5J03n0K4k87
3209a66L47j67K1j12J69p8o3Q7k9M6j19L5Q9n0R5p5J24j16N1M6n6p9J05q9o9l1
3235h4R8O4q7j35l4L33k64Q8j4m4J39m6L8k26L04r9j78K58m5q7J77k26O7J1m2
3260c4L5lqj36J10L8m6P3q8P2j20K23j12k9K52k57JJ19j41P2l2k8Q4n7J99j91
3286dl3LJ08L3L7k33oJ12j7n9j22K32o7m9q9j9J99OL9oJ5j4j78O1J92k48K25q7
3314C1J13j16q8O7O0j47N5P4L2q6n1kkn9K05p1jK7n0Rn9L5mq5OP0n3N7J89j80
3344b4J85j91j9n4K62j46n4j5L5O3j88N5R0Lq4R1j32J97J48l80J40j68L91j90
$$ plain form
3161 -100 127 -65 160 96 104 34 -36 -242 150 -95 -81 91 216 -53 -57 -6 -169 69 -30 -59 87 -18 32 -28
3185 -28 -45 153 -12 143 126 -19 2 128 67 29 -98 27 191 -32 -136 -120 -28 -44 -11 44 147 97 121 -166
3209 -166 181 14 35 -77 92 14 -49 38 9 55 -64 -29 60 10 105 30 154 38 89 135 79 0 105 16 -53 -84
3235 -84 14 78 -9 -144 -178 155 -109 -21 -35 -79 60 14 52 -174 130 31 -147 111 66 -21 156 -70 -3 8 -34
3260 -34 1 -2 -10 -146 -36 2 -44 29 -59 13 -107 116 4 -25 227 -30 -29 90 -51 21 -11 -39 45 -12 187 -4
3286 -4 -37 -34 74 107 144 -89 -95 17 0 -59 -181 51 -16 -65 -154 -173 26 32 71 65 80 66 -112 -51 141 -107 118 31
3314 31 144 28 -60 7 67 -80 -25 49 81 -5 -56 -58 -60 -119 86 15 14 41 -9 0 -59 -24 -28 -113 -107 -37 -90 -33 156 -24
3344 -24 161 -30 -49 -103 159 13 -41 -56 -21 42 -146 -91 -1 2 -82 9 -123 74 222 -158 -18 -186 205 15
3368A5j61J29j3L11k64J30j22L0k33K5J40n3K87k94R3q4P1Q0o2o3J8Q6n9J6J75
3393A98j24rj38R0n4M1J13o6l0Mj8j17Q0OO3p0J05j31L8J40j61J07m5j17K16k42
3419a21J25J18j00J62j77N8M4j95K2Q4j57J88O4j38k1J13p7j35J80J47j49K7N2
3442A14j50O2n1n8J47m2P3j06Q6j39J69l93M27j47p1J60o0J15q5j7j07j21J96
3465Bj72J22k9L9Q1JK2p2Q5p7J36j44N1j5j17J52K6j26K39k72QP4O4j18Q7Q2p2
3492E7j45oJ56k77J54RO9J56j79Q8N0oj55j74K89J84l41N4j7j38K21j63J90j48
3516g2J12Q7po5L0P6k07O4j2K4o4P3N1j43J24Jk40K88k55J14Q3k02R0q6N4O5K51
3543B34j85j0l8m4%J12j23M5p1J68m9o1j5Nm6K22M4l07K54q2Q6r2j46R6l0N3J3
$$ plain form
3368 15 -146 -17 -30 281 17 147 25 55 -178 -153 -13 -66 221 -73 20 -64 7 87 25 -38 -20 66 7 23 198
3393 198 74 65 -73 17 -37 4 117 51 21 25 7 -110 -30 -24 39 -31 74 -57 -19 121 -40 67 22 -95 121 -121
3419 -121 4 122 22 184 7 65 109 -86 -64 20 -137 51 115 -23 -44 69 -8 -143 37 184 35 62 114
3442 114 -36 26 -25 -83 64 22 95 -11 75 -64 105 -288 139 -8 -79 81 21 136 51 34 -73 -194 2
3465 2 -170 -48 -77 -38 43 44 66 -6 79 2 138 -6 45 30 -87 65 91 -35 204 -68 -60 14 78 -40 47 129 57
3492 57 -88 -94 62 -215 -61 -52 17 173 -6 82 132 126 -29 -203 86 270 -71 -17 -34 -172 49 -114 76 -72
3516 -72 40 127 120 55 85 161 -46 18 6 30 -34 39 90 -53 71 72 -168 120 -135 -21 62 -140 -50 -136 -82 -17 234
3543 234 49 39 1 -43 -43 69 -54 -9 -80 88 39 -22 -37 -32 -78 144 188 -119 135 53 139 47 -99 -3 -33 20 33
3570C3J28q1j05K4Q7r8K21k27O8j5j46K34k35j0L80l85J86Klq0j16Q3lJ10k00
3595a48P9k0K80k04L6K9Ml4%N4j24J10j40P2N1m3Rk0M7k1r2K8N9J89j38k4j11
3622g2Lq0J65P4p9o2R4k5o3M7J31k41J71Ro1lk08M4R0J4J56o4j41P8N9n2m8Q7
3650B3K1j22J10Lk2K1J61k46n4K22Oj71J64j33R3o5j44O8J23j54K13q2j48l5J86
3675C8k0L3n7n3J80k24M8L8J93K4k32r4J07j34J04j06J08J40k59J89k1R4j14p2
3699i0J23n5j4L1k3r1K31j5MJ6n8Jr8P7o7mL9m4N7j89J48R6qN7Q9j75QJ8j7J09
3729A56j04m7K00r0j16N2RK3j05R5m2j49J43o9r3l4L23j66k9l3J23j05P4o5N0
3754AM8p2J65k13j33K33J15n8m0m5K3k12K84j64PK9k0L3J43k09K14k17J78j2j17
$$ plain form
3570 33 161 80 -25 -1 86 -12 209 -18 50 35 -111 123 -112 -122 258 -127 59 61 58 -22 -138 -55 -58 52 -148
3595 -148 -69 -89 191 -13 23 52 56 22 22 76 -48 62 -78 -6 45 2 11 -9 38 17 -75 -47 12 201 63 39 -72
3622 -72 -69 -149 16 90 11 -51 43 18 -45 2 133 -108 63 72 11 8 -200 -156 -66 -52 104 40 -101 -23 36 -16 -64 23
3650 23 44 -78 32 35 13 34 195 -51 -105 117 123 -48 116 -17 76 11 -133 -65 58 -96 117 35 -113 -148 38
3675 38 18 51 -6 -59 121 -103 -55 -17 176 200 -32 -126 -19 -153 -49 -155 -47 93 -166 23 2 96 -18 -90
3699 -90 33 -22 -36 -5 -28 -119 112 97 101 117 59 60 -38 39 -28 -32 7 -37 20 -169 -21 75 67 124 213 38 46 64 47 156
3729 156 52 5 205 115 -1 51 60 83 -22 73 31 -118 25 -44 -137 -171 152 -14 -43 -76 47 -58 16 -49 1
3754 1 49 -23 142 -71 -204 29 144 86 46 1 24 -188 96 -68 -61 -32 -52 -19 124 -85 129 -88 90 78 -39
3779c9P1J86k25j51K83k31k9J10r1J56r2P4o8j11J73J9K3j31j11K83m3j12J21
3802F5O3k27L06k31j60J02l9P1p4J00p6J6J71k08J27K0o5J37j77KJ0l0J72j39
3826f4Oj0J46r5p6q8J10j34K21O2Mr7n5j0J36r0L3j44J32J7m6Rn6K48m7r2l8K5
3854GO3j53J43pN9j37K3L0j07lK2k4O6p3J82l7o7r5NJ29N7q3J08j62j0J0Q9m2
3882gJ30j58J19o9rk9R5j60nJ89k6k58K05n3j04J65m9mo0J7N7j14J93p0N3r0R0
3909D8j2m7m8J7q5J15m9K38j07j79J30p6J60k02J00J03j46J9Om2j95K25J17j65
3933g5O8J19p3k27K45k15J90j05K24j59o6O7q8J02L5j72J35J59K1j54p6J01o8
3956a2q5L4P7r6O4k3pJ83j21P5j31L9J56k03j75K63j42p7J71l1m0R1L3k09N3J49
$$ plain form
3779 -39 32 218 -7 -158 125 -106 -135 -25 -116 40 -52 22 -46 -157 16 35 58 -73 -184 99 56 -56 65
3802 65 128 -99 207 -24 -184 -82 -121 -50 -124 -24 -100 -84 87 -121 6 26 -39 98 -79 -77 -67 -97 75 -64
3826 -64 -58 -68 78 -17 -93 -181 -71 -205 16 78 82 -15 -70 -80 56 -34 -1 -145 -13 4 -42 -33 -89 159 112 20 -18 7
3854 7 70 -83 60 53 112 -25 -2 28 -79 -82 -60 -84 -18 -91 91 54 -13 -108 -103 26 83 0 108 -54 -64 -54 35 -7
3882 -7 123 -35 84 15 6 -23 72 -88 -93 96 70 -188 17 -36 -140 25 -24 -28 -88 -71 -14 -128 65 -5 48 -42 48
3909 48 36 -11 -59 -42 -127 -12 -61 177 70 -109 21 -55 105 -97 3 106 -40 -21 -15 -57 -252 -27 90 -75
3933 -75 -7 112 39 -188 57 -158 32 -73 151 -8 -74 -7 -95 7 42 -130 5 164 185 31 -45 56 -12
3956 -12 -97 -63 14 -82 -18 -41 -48 135 14 89 -42 -3 153 -50 -225 38 -104 -181 -10 -41 -81 10 43 -166 -113 36
3982C6m5k5L5J60k3j50j6j03N0K17P6l45J72j16L3J20p4M7j78K40p8l6k5R3j0
4007E5L7p7l8oO5Q8lJ4j20n5o2K26j02q0L8%o4N6P5J50j89j7k0N6Qj02J06j07
4035f8L5K5oO9Lj2l6j5Rj54J70k5omL7J8n5q1J43o7P8L6j7j43J44j86J41j4J84
4064B03l33J09p8M2lK04j48k04J46N5q5K32j15O2p3r9K25j31o7R0o5O8J5r0J56
4089A16j51K8J18J09j27j73P4o4p7R4M4m5n3L9j65J47N4J12r2L7pJ06m67K97N6
4114A0J6j75K82k74J16J83k8Lj40j15J88j84j5K20j4j96K52j61pM9K7o7N7J42
4138A69n0k47J7J63j05k2O9lJ6j25K46m9j64Q1K7o0Q6m0q4K8J79j45P8L8p4j43
4164a14J18L7q3K5p1J05m4J41Q7k53K04j28j60N8o5J36j39P6l6P2N7j93J65k2
$$ plain form
3982 36 -9 -34 1 161 138 -12 -28 -131 -81 136 212 -133 39 -77 -44 76 2 49 -129 111 33 -3 -28 65 55
4007 55 92 15 -23 -29 36 124 121 135 15 -40 -102 124 22 -58 -20 -20 -84 -28 47 197 8 -9 -29 27 35 -67 39 -68
4035 -68 -33 -8 -14 55 58 46 10 -5 4 -150 20 -5 -11 -15 22 40 -15 -96 47 -20 58 94 77 -66 78 -108 33 19 203
4064 203 -130 -21 -99 -57 -60 144 -4 -208 -62 -7 -92 140 25 87 14 -85 140 9 -58 32 -33 35 50 -40 116
4089 116 -35 -7 111 220 93 -80 -6 -70 -147 -53 -9 -54 -107 -68 -233 -86 -32 80 -12 25 18 124 -343 -46 10
4114 10 26 -149 133 -141 -25 158 130 133 -7 -122 66 -118 -133 87 73 -123 129 -32 -39 10 37 -30 27 169
4138 169 119 -128 -111 52 -53 -75 -6 -9 7 -118 128 79 -85 -4 23 -37 49 9 -75 -47 132 -13 65 103 29 -114
4164 -114 4 41 -42 -17 -88 17 -27 114 201 -52 152 24 -136 -78 -143 -7 -146 -70 -106 -34 23 -170 -5 -27
4188b7R4J58p3k12J50Jj87N1J66K30l34Q6l8PJ2lM0j67P3l4o0J45j20j6p1J27
4214bj58L8J89O3k0j8j03L9K7m7J9j9m3Q0J54j82ML6J11l04J97n6q9J00J12j03
4240B5R3k19L6R2Pp5p9K34k39R5R6j21K34r6k7Jo9J74J9k15J2j1k9j12K08j86
4266a52N1n5K23jL6n3j35k1Q9N7N4k16k6J93k40J10J7N3M3On2r4L3k8K6m8J62
4293C2K6j1Q0j31J63k23K12k47K78k47P4J2j04J0P5k1P6rJ2K2q0j9M5O4j19J56
4319A26Mk0j31O7N2j18k3K01j21l3M7L9j34l4L5Q5N2m9j4q1P7J77k00J4m7J5k3
4346c7K1J28j83R6j97M9J75j11J24p2j17J34j52N7Nk3J21o0j29Q4Q4K1r1J10M7
4371H4o9Q6j47l3K14n2j05p2J93j06m5L2n6j52K35j59M8M9J95j6j05j06mj1J08
$$ plain form
4188 -27 67 225 152 -60 90 91 -96 -45 121 351 17 103 65 72 84 81 121 -46 27 -7 -67 78 -42 -58 -129 -2
4214 -2 -160 -122 67 130 110 92 -11 28 55 8 27 8 -35 45 199 17 21 57 168 -136 61 5 -84 16 128 25
4240 25 118 -101 -65 27 34 -41 -120 114 -125 -30 66 -55 179 83 56 57 -12 162 181 -34 -22 -33 -62 -174 34 -152
4266 -152 -101 -156 67 66 102 49 -86 -107 -18 39 93 -123 -149 44 -196 -86 -69 -16 27 33 -19 -113 -80 -108 -82 -130 32
4293 32 58 47 127 -4 159 -64 148 -99 179 -68 6 18 -86 -76 -1 -22 54 45 57 79 -1 -20 25 89 -30 126
4319 126 130 110 -21 46 98 -20 -43 158 37 4 51 90 -44 -78 -43 42 94 45 31 -50 27 204 4 18 -29 -14 -37
4346 -37 -16 112 -71 25 -172 -123 52 -59 65 -7 -124 10 -142 -85 -80 -103 18 -42 -171 -87 -3 18 -73 37 84
4371 84 15 101 -46 -79 135 83 -22 -94 99 -7 -52 -20 -76 -228 7 -152 -104 -55 140 124 19 -87 -91 -102 6
4396Fl2p4J48l5o2m4j01J87p5N4O2N9P6k01J00j24k4O9O7j27M4m3J25j20J6J02
4422E3r3K2J5J61j54l9O0j23J66j07J8R8j57K01j16k1j29J09J4q5K21L8j37k6
4446a1O1q9qJ9J42%j14kj36J35k1M1J3Km7o8M9n5o6L37l63J48o3N8j04N3m2Q6
4474d5P7p9Q7k01K89j38j35L09j17r8RQ3q1n9j2J78l6j69K05q0MJ03j51O3J24
4499A30j59J7J57j31P5O1n8O0j39m3M7r0J9J12j71J63j53O3%P7j37N1J33m5l0
4524IlJj09m5k3M9R6r7J22j36O1p4K10j37O3R1nJ11j84J21j0j42L0j70J62J49
4550A40j79p7l7J53O3j71P8n5J36j66R9N2J7j39N2J16r4n2qo6L60k37j90J23j4
4575i6J57j52J61j13K8O0l8j2j1mj1N0N3J0k06J21j24J12n9P2OJ25j27j37R1J42
$$ plain form
4396 6 -26 -100 48 13 -49 -93 -194 -7 -82 -28 34 93 169 -32 68 -56 -80 -11 56 -71 -27 -70 55 -65 -49 53
4422 53 -40 -18 -3 158 4 -35 25 -98 68 -39 -21 77 -80 121 5 -16 -145 -36 -22 -107 114 152 15 -11
4446 -11 50 -39 -47 -28 114 114 0 -2 -138 -3 -24 17 30 32 -15 -83 -34 -89 -155 182 -181 -33 -96 -38 -142 -89 -131 -45
4474 -45 32 -47 40 -161 128 -10 -145 164 47 -51 -42 41 -40 -99 -111 67 31 -138 67 -13 -9 94 -57 6 130
4499 130 -29 -12 145 14 89 150 92 152 13 -30 17 -73 -54 58 -113 50 -103 -40 -40 37 -100 -49 84 39 9
4524 9 6 7 -102 -147 -170 -121 -25 -122 0 -136 -75 -149 61 -76 -13 78 73 184 0 121 111 -31 -1 -171 -9 140
4550 140 -39 -116 -153 0 63 -108 -30 -85 51 -115 -16 36 53 -86 -34 82 -12 -64 -72 -138 222 -15 -205 -82 -96
4575 -96 61 -91 70 -43 -15 45 7 -5 -16 -20 -31 19 72 82 -124 -3 -127 -15 -74 -2 4 129 2 -135 -44 98
4601I8jj55rN5Q1j1l6q0j32K56ln1L0k39J86L11j24j77K1J49k50j23L47o2j28
4626d7J74j11j07M4J50j12J21J4j34j24l7N6Q6N2j47R4J03n2r9K0J96j95R0m8
4650a3J2j09P6N9o7N3rK25j68j23Q6q6N5N5p5j8k2P6J48o0p8j72J46J45j78j16
4676a58J49R7j91R7L0l1J18r9q3K0P3P2k37K07Pq8N5k17J25J75j43P2j12K36j60
4701A4RJ66k26j0Q0k7J0m3k5N9o3k8J77Mo7R6j67n8K01j51J60j31K11o3m4q2Q9
4728I1o3LPj1N5q7O7jJ9M5k5j66RJ35r6p8Q0L7jl4m4j81J61K16l9o9l3O8r6l0
4758f1K29j14j18J22j71lN0N8K6n4j19K68j3j28j10J70J37p1q7K0J79k66P1l2
4782a7J32j57J47j08j93L16j25Q3q3m4j04k0J10J06j32J54k10J19J15q3J06k80
$$ plain form
4601 98 97 -58 -67 -12 69 58 22 -58 -190 66 63 12 42 -197 -11 300 176 -1 20 169 -81 -204 143 81 -47
4626 -47 127 16 -91 -47 103 -9 112 126 -8 -132 -169 -113 -27 25 -122 -28 75 23 -76 -56 140 -55 35 -13
4650 -13 -1 -110 -34 25 -42 11 2 227 59 -64 22 -64 -9 46 -29 -47 -69 7 155 95 17 -155 -9 136 -42 -158
4676 -158 -9 88 -103 -6 24 -7 111 12 -71 -51 22 94 -143 64 71 -17 38 -179 -54 121 -22 50 -62 174 14
4701 14 23 189 -37 -47 33 6 16 -27 -52 7 -56 -84 93 97 30 126 -41 -99 102 -49 111 -20 191 128 84 2 91
4728 91 28 31 38 27 82 -5 62 61 80 125 100 -66 -57 78 -18 -96 -16 21 20 -14 -58 -239 -78 138 99 30 -3 65 -31 -61
4758 -61 168 54 -64 58 -113 -116 -66 -8 18 -36 -155 113 100 -28 -138 32 169 98 11 31 210 -56 15 -17
4782 -17 115 -42 105 -3 -196 120 -5 78 -5 -49 -153 -173 -63 43 -89 65 -145 -26 89 6 112 -168
4804a68J32r8J45J51k82J34mq3P1Pj33J1J88p2J00q7Jo7J42n8k0L4k5k51K91j41
4830h2R4r7M9Q6k55J27PN6K0m1QJ46p1j05R3j27k6J27k7Q1L0j01q8J19L1o1R3
4857H6j04m2l0J76j14k6J45j85R6m6nP5j19J41k9p7M2k8J36l5k4o5J43j36J9K60
4883B54k01K9L6j47RO7j12PR5q8k7K35j06j29J84o8j33J53m7kJ06j81L7J95j04
4908F2m8r5J92l0l7j47j1J23J7j3j29J07K1j33J23n6j29J08N4P5Q8j79oj27K26
4933E6n3r3K28k05M8N2p4K4NPm3m6MO7J02J37k86o1R0J2J1N8kn5j3M4m0K3j7K
4963a8J49J2p3L4j72J94k33J86q2M8p7m2j2J71p4j02R6m4k1K43k01R6j22J26k6
4988E6p5K6o1QQ0Mj29K19j60j05J63J13k71J26K4J4J4J6m0j41K16k27J13%l2q
$$ plain form
4804 -168 -36 -134 11 162 -120 14 10 -73 -2 5 -128 -117 71 -1 99 12 13 -54 88 30 10 44 19 -232 59 -82
4830 -82 12 -85 -36 50 -205 -78 -71 -15 5 -36 -28 118 47 -58 35 -92 -118 9 -18 63 93 -8 -96 23 54 -7 86
4857 86 -18 -60 -90 86 -28 -54 91 -94 2 -44 -49 26 -93 48 19 -58 -16 -44 92 57 33 -32 111 -25 -6 254
4883 254 53 82 118 -29 -20 47 -65 -58 37 -51 -78 157 51 -78 106 38 -95 58 11 9 115 -66 -29 166 62
4908 62 14 -81 111 81 44 -103 -114 9 26 13 -116 -9 12 -121 2 -54 -183 -75 -21 54 142 -37 -43 -170 56
4933 56 3 -90 138 -67 -19 33 -41 -17 -12 -5 -48 -94 -90 -23 79 216 -70 -131 -41 -29 -18 40 38 -17 -30 14 -26 -3 -20 -18
4963 -18 131 143 70 104 -68 126 -107 79 -3 45 -32 -74 -86 85 11 -91 5 -39 -60 183 -18 78 -44 82 56
4988 56 -19 7 -54 -46 34 38 -91 128 -32 -137 26 139 -132 -6 18 32 46 62 22 -119 97 -130 -17 -17 -49 -57
5014e7j21L23k44J46k2K1n0R2j89R4l4J90j45j18K30j77J07k3k5J05n4m9N4k1
5038C3p3J25l2J7R4j13J36k13j4J05l4k8L2m9J36j49j38J62L2p6J52j37j70L04
5062A02Pj06L6m8J4O4l4j89K01O2j17j06J51j69Q1j16J57K4m0M5j01J16J0R6l7
5087A03j60QQ5K6n8j12J59q2kk9o0Q6Q2N7q0j63j7J89j05P0R2j43J85j65J0J9
5113eo3K07j54K06k97J65J24l45J60n2P0J3rQ7m0j12O1l7J23j5j54o5J54k2k4
5138b4mj30K02jj31J79j54o4P8j52K82J1q3p7J70p6j9Q6k3j67j9P4J9R1p1l5K15
5165A77l50L4K29l26L79j74J1Nj22J34J39k44J52l8K4m4K0m1N6j4j82K32o6r4
5189a03J6q3L9j9J37J01p2o1pJ81j96m8J47J11k56J85j9n9J73j76l8nJ12qj68
$$ plain form
5014 -57 -178 145 -99 47 25 46 -4 88 -101 -7 -41 149 4 -114 116 -61 46 23 -2 103 49 0 54 33
5038 33 -40 85 53 70 164 51 187 -26 -40 65 31 3 35 -14 122 -27 -165 -3 29 -47 105 -32 -202 102
5062 102 109 3 39 -9 5 69 35 -154 47 109 -8 -114 37 -132 -51 -167 -10 14 -26 19 -82 34 44 140 103
5087 103 -57 -49 36 62 4 -108 51 -31 -33 -62 -122 -36 46 103 23 -140 -157 32 -73 -3 89 -54 131 -34 -24 -5
5113 -5 -68 139 -15 191 -106 59 183 -162 -2 -54 16 29 20 107 67 -45 16 -21 102 87 -67 -132 22 0 -24
5138 -24 -28 -158 44 43 -88 91 -63 -127 -49 -201 81 92 9 -68 102 26 7 93 70 -97 -116 -42 -23 68 -3 -38 177
5165 177 -173 -139 90 -236 143 -31 -20 -15 -137 -3 136 -108 44 6 30 -14 6 -35 21 7 -175 57 -9 -103
5189 -103 -87 -170 -131 -150 -13 88 16 -45 -52 129 -67 -115 32 143 -113 72 53 -6 167 -9 -47 -52 60 52 -116
5214a16J22R5l16K74j59P1j29J37R4j87R6M2J46k03K33j24k30J06J12r2m5N7r8
5237a14K11r8R6K5K0j26K1rj13R3q4J57j29l9J86o8j0j03N1Lj05J47j0k6m5K43
5263A74l2j82j05K54m3l8l0n3m9L9J42o8n6j60J64K42k64K19lq5R7j44p6L4o1
5288h4O0J44j06qpJ73nj88N7k5r2J56m7K5Q8j74p9M19l90O4J48j97K3O7J34k94
5314a38J90p0J7j50P9Q7q6J11p7nJ25k47K3JJ91j01J68j93J11m9J12N6K8j38j03
5339e8P0J43j57k5O5l5ml6o9J74j1%j18oJ18K9j04L0O0k7R1k12J2O5Q2q9N3L4
5367G5j30o9J40k9qo2L0J79r9P1mq6J7j0J66l23K92k85N0J50N1Mm0j05M6o0N6
5394A7j21J6K5Rk1J89j02p8M0J44k05J32q9P9p9N3R7k78J51J06k1q1J28j49P2
$$ plain form
5214 -116 6 101 -215 59 -100 -29 -158 -21 73 -114 -18 24 170 -33 200 76 -154 -48 64 -28 -73 -16 -114
5237 -114 97 -1 95 120 140 14 35 26 -87 6 -78 79 -50 -89 97 29 19 -84 -33 -30 -135 12 2 -24 -69 174
5263 174 142 -40 -145 109 66 28 -2 -55 -104 -65 77 9 -47 -207 -43 199 -65 154 151 66 163 19 -57 -23 -84
5288 -84 -24 120 14 6 -1 172 167 -21 36 11 -81 75 28 53 141 -33 -112 307 -83 -19 129 -68 -45 22 156 -138
5314 -138 52 -18 -1 -151 -72 15 -71 40 -37 -42 83 -164 -141 -140 51 -50 118 -75 36 -13 99 155 183 45 -58
5339 -58 12 155 -2 -27 38 3 -1 -37 -106 68 57 57 -61 -67 51 80 -24 6 66 39 130 -82 -70 -5 77 -12 41 75
5367 75 -55 -124 16 -13 -21 -83 -53 126 27 98 94 8 25 15 181 -142 150 -135 -85 65 116 120 80 -25 21 -39 17
5394 17 -104 -88 -63 -54 -75 114 12 -66 -26 118 -87 45 -44 35 -44 9 106 -172 -21 85 64 -17 111 -38 34
5419C4L1R0j74J83j58Q7J15j72m0k1J65M2j68k8K8pN4j32Q1N1r4o3J10K6K4j25
5445f1J08Oj33M6l4L2j07K45j25N6j44R4J69j68P9O0J14j20j27R5j18j25J82Q1
5469A05j70Q7J16p9q6Q8NM4j81q9J50L4Qr5P1p3o9P6J1l9O0K13o4k12l9K46k6
5496I2M9k49J17L2J48k40j45K05J9j21J89L0J2Lp6j29M4l7N1J17j22l0L6m2P7
5521C0j36O8Q0j66J13o1K6J32j0j46K50j30J71k76N3J38k13P3j40K11p6l0o1J58
5545E8j72N0J04R1M0j06j28J42m4J03j1q9k8L2j15JJ80j76P5K45k88m7J95j18
5569fnN3M6m3k03R6m3J44J48n4r9l8J07k47K37O2k79P4J13j24J56m6j29K89j96
5594A3N8J48m27K80n0J4omN3j82O1J10l4j34P2qj16J34m3J3p8J27o3Q9j66L05
$$ plain form
5419 34 65 155 -19 164 6 93 208 36 -4 -25 140 182 14 -14 14 7 61 -71 10 61 -33 -96 14 40 64 -61
5445 -61 47 53 -80 -34 -68 -36 -143 102 -23 33 -111 -17 152 -16 63 123 237 117 -10 85 -33 -158 24 105
5469 105 -65 22 138 59 -27 61 66 110 -71 -160 -10 24 32 -63 8 -65 -134 -58 -47 -86 -26 187 123 -89 -128 118 92
5496 92 141 -108 9 41 189 -51 -196 9 28 -93 96 126 138 141 65 -64 -20 -57 -6 111 -11 -41 -5 -47 30
5521 30 -106 -38 42 -124 -11 -72 -46 86 76 -70 180 50 221 -55 -2 136 -77 -4 -144 67 -9 -39 -100 58
5545 58 -114 -64 40 131 171 65 -63 79 35 138 127 38 10 42 -73 -72 108 -68 7 252 -36 -83 112 -6
5569 -6 -11 42 88 45 -158 -62 -105 39 187 133 34 -4 103 -144 93 155 -124 -50 63 -61 95 49 -80 209 13
5594 13 71 219 -208 72 22 36 30 26 79 -103 -42 68 34 -100 -28 -36 -152 -18 -61 -48 -126 1 -62 27 -139 166
5620A66p6L9j02o0O2nq2J31j63L0P6P0j00J19k24n2K73j65j05J66J1J83k25K25
5644A92k01J4J20o8j88J71m5N6k71M02j68j16J5M4j58J11J24j39k9J49K7r1J13
5667F4k5m2Q8j6l6J74j59k8j63p9J47J08j14QJ71N5q2o5%J9j19L82k42j51J60
5692E5j54j3K29l37L77l52K42k18Q8J46m1N8q4O3N2nk5j82K18j94N3q0K27j45
5716b2m0J2k37J76rJ46j61K28N9k79K49n4k17J36k9k8R4j5N0p5M6j0j16J56k46
5741a86J67N8k10J14L3J97o2K0k34m3P4M3p9J91j46J7MP7Q8q9J08j01j25kJ2R9
5767B5m2j12J04j24J84j5K69m44K38mj01N2j65O3Q8p4J20J7M1p3j40M0J21j53
5791h5L5J15j1n4R7j90J96m9L0l1R6k38lJ81o6R1k11J87j96n2K4r7K40%Lqo4j
$$ plain form
5620 166 90 129 27 -33 29 24 -58 73 -90 -60 16 86 -14 105 -119 -171 102 -63 -168 -2 9 192 -33 192
5644 192 -9 5 125 57 -131 40 -5 51 -220 182 14 -102 -87 -43 -201 -90 34 -105 -134 15 42 -49 64
5667 64 39 -3 85 69 33 207 48 20 -143 -222 -75 33 -81 -73 98 153 71 6 6 25 -94 288 46 -105 55
5692 55 -99 -112 117 -220 157 -195 47 -171 -83 63 22 80 -4 59 111 106 81 -101 117 -77 -24 -104 123 -22
5716 -22 -62 -50 -287 -111 -120 26 -135 93 152 -127 122 68 -149 -13 -42 -70 24 9 59 -16 30 20 -96 60 -186
5741 -186 -19 39 -171 -57 -24 173 111 131 -103 -146 -72 -29 -108 83 -63 -46 -42 35 123 34 142 41 -84 -86 -74 25
5767 25 -17 -129 -25 -149 35 20 289 -155 83 79 -22 30 -135 -72 16 -58 62 79 120 47 -93 -53 68 -85
5791 -85 -50 65 54 0 97 -93 103 54 84 53 149 -89 -92 89 23 114 -97 90 -106 -158 -134 -231 9 9 12 4 -60 -61
5819f1j14J32K7J45j83m5l5J05q1Q5n8M0K06k07NJ67k03K1J83j85R0K6j12J53
5843A01l44L81q9j83K19p3nK5j18J43J9n2L2L1j27p7J85j4p4n1o1K34Ok42K49
5868A15j53J27l0j37pM50m19m8K27O5k27K01k80Q5j17Q7P6j97J22OJ09Rl3Q0l25
5893b14J03J45j44K33j09j8r9j2M5K95k93R8q1q2n6K21o9pJ22M0j88Q7k6m2J41
5918I0M2j37n4R5r8Q7o5k2R8M7j59J8M3r6K52k17O0j28J57K1j13Q1mK65m38L43
5944A68j47J35j75n7J26n4O6o0J5J09k10O2p8L2J11J35j38j2j0Jj71N6KM9MJ76
5970A35q9p3n6K38k68p0J32J3l2jj05K29j84oQ8J02J18j86J3j10n0K34J5j40o7
5995a20j71K16J09l9K04k23R5j42J23j45l9J71Ln7PR1q6J12o4q7J79j26j84J50
$$ plain form
5819 -61 -175 -43 -16 129 -54 -99 -134 -29 -110 -25 -83 -43 163 -44 -39 128 -75 -54 129 -56 34 60 -52 101
5843 101 -243 138 49 -134 85 12 7 32 -86 57 76 24 56 87 -40 -117 68 54 -20 -71 -132 102 108 -134 115
5868 115 -38 89 59 -78 -85 365 -54 -102 125 190 -37 164 -116 -31 -148 -61 15 -182 -60 -54 55 64 31 111 -214
5893 -214 -111 34 -110 123 14 -4 -103 -115 -70 225 -68 30 -51 -133 -189 32 -37 -44 78 118 -70 17 -9 -51 90
5918 90 132 -5 -59 36 -62 25 -40 -62 36 83 -76 -58 -15 -111 141 -76 -16 -144 13 34 -79 2 -2 263 -175 168
5944 168 21 156 -19 -76 50 -4 62 2 17 126 -84 -22 -100 -68 43 178 40 28 18 19 -152 -96 -94 -45 -41 135
5970 135 46 -27 -83 155 -113 -183 -51 -38 -70 -71 -176 53 -131 -137 -49 53 171 -15 -2 -112 -162 72 87 -53 -120
5995 -120 -291 -75 34 -5 199 -24 71 -71 52 -93 -132 39 42 -15 -8 83 -3 109 45 -42 137 11 -173 -23
6019b3K3J77j78j33J64J32j01j57P3L0N7r5P1j5j67L56j32j70RJ92q4k5J2q2K11
6044A45l35K90j39L8J05j98J11l6p5J2J21L7k0j46R3M3k07J92M2j45J14j11m3
6067a12J65J07j23L6K3j64J39j51J62M7j68qm4Q1p4Q4j06J75l7l9J4j29K67k64
6091a19K88l6P0j30n3O7j24k78K25L3K1J70J5j71M7J19k83K7N0r4K65j6n3N2r1
6116Aq7J38j4n1L6J30j24Rmm6p2K8M3j42Q7R2M2j41K37p4R3k46L9J75q4k4J20
6143A61j59k9q0j67M26j61r1K5J5o1L6K07m9l3n0J77j97m5J28m6K3n2J09j12P4
6168D9k61J96k8Pj43J73o3J42m8l8KK21o9k39J74k45K24q9P2j03J14j84K38j40
6192c8l8J81j18j13J51o9J1j83K27N6j55N1R3j59Q7J35p1q6R4J8m6j26j39J79
$$ plain form
6019 -23 0 177 -1 -134 30 162 61 -96 -23 7 64 -31 40 25 -142 214 82 -88 -79 113 29 4 16 -66 145
6044 145 -190 100 -39 -1 104 -94 17 -19 -94 -82 39 76 56 -90 3 46 -161 31 73 -72 42 -69 -112
6067 -112 53 160 37 73 96 -68 71 -80 82 129 -39 -47 -91 -10 -84 0 -106 69 32 -7 7 -122 145 -119
6091 -119 169 133 203 73 20 87 -37 -315 -90 -57 -36 134 149 -22 25 144 -139 -112 -62 -156 109 93 40 92 1
6116 1 -86 52 38 -13 23 153 29 38 34 -12 -84 -56 -13 -155 -68 24 66 -75 162 88 181 -65 -26 149 65 41 161
6143 161 2 -27 -107 -274 152 -9 -100 -75 -60 -121 -85 122 73 40 -10 167 -30 -75 53 7 30 -22 87 -25 49
6168 49 -212 -16 -44 -37 -180 -7 -70 72 24 -14 -12 209 140 -99 75 -170 54 -35 37 -66 48 -136 102 -38
6192 -38 -76 105 -13 -126 25 -44 -33 -216 11 67 -88 -37 56 -103 -16 119 48 -38 56 74 28 -98 -237 -58
6216e8rP6N8M1j76J26k77J68K2K0J42j50J3J8n2J50n8l1j86K48r2JK1Q2j6k28
6242a47J83j2n8J29j57R4K7r3R7j6L7l4Q9mk72KJ01l4P9j31Q9n1N7M4m4P8p8n0
6270g5Q4K6p5r9L04j32M9j04J93L8j67L2lj45O3J08Kj15J6K4J4k02R5J54n7o6
6296c8q4J81J6n5J28n6j45M7j19K27j01Q1L5N4k23J12p6jq8O4Pj45J11M9m6K44
6322A79l60M8J33j18m4J68K0K3j19Qm5J58j15J48O1k95K6M3J01K3o3m7J45N6j40
6347fj35J40J48j25l4k4n4R5r1M0pK63j90j06O4J47q0ml9j20K93j68j08J2M9L6
6373dj12J17o3j4J2Q2J1j40O8l3J48k2m1j31J55n4J77k50J33j41n5K8J8k3J13
6398b1J65j56n2KO6j7j23J31J38K6j67k6j8n7p3K47O8l78K24N9l8j93K54r4M8
$$ plain form
6216 -58 -67 9 67 108 -68 58 -219 -51 -29 -9 133 -17 -4 14 -38 112 54 23 -163 85 -7 -6 15 97 81 -147
6242 -147 36 24 -34 95 -62 32 59 -34 63 47 84 50 139 135 -137 -135 -34 -68 11 -120 -31 -82 -25 19 -25 53 -25 -75
6270 -75 9 35 -40 -139 165 33 82 -22 171 209 42 74 71 -74 -11 97 99 -16 0 24 38 -164 -69 85 28 -38
6296 -38 -122 59 75 20 148 92 -53 -6 -125 102 1 82 117 171 -52 60 -16 -17 -105 -41 -34 -179 -68 -19 -65 179
6322 179 -181 -133 0 -118 -162 6 26 49 -70 -62 -107 51 -64 84 145 -150 -124 -81 20 43 -20 -67 78 134 -6
6347 -6 -141 -1 147 22 -12 -36 -90 5 -86 -46 -53 210 20 -86 -22 125 45 41 2 -118 175 7 -101 -89 -40 -4
6373 -4 -116 1 -62 -76 -64 18 29 -111 -43 -76 72 50 9 -122 33 -21 156 -94 39 -102 -157 -129 -111 -134 -21
6398 -21 144 -12 -64 -62 4 -13 -136 -5 133 159 -8 -34 -52 -109 -182 65 133 -245 -21 38 0 -193 61 -33 15
6423A5j0J00p9j08Q1m2K20k92J89K5n5R1j90R3P5n2j50j4J06RO7l7Q4n3j05Q2
6449E0j73Q9R7K8j03J20p1q4Q4J8j76J24j61J26J1J5J24m2kj27oN4J30j29J18
6474A14P4k25j2K7o7O4K2j44O7p2Q7J53j69K2M3P1k7j37K06qk42q8K69j27N5J6
6500b8RJ17q1j64J13q2K9J86p2n4jk7J00j26J39q4J45j70l7K46Q5j94j35N9O9
6525D2j80L07k93L9J48j14J59o4k21J13O3M8Q8j05Pr9J6j90K06j50J50NQ2o2O7
6550F2j74J91m4N3r7l6J58k59L74k60K38j63k2J34k06j38L04j51Q2O4j77l0R2
6573em9J1L3j78J26j00K33j01r3J41P2j3J00j61p8Q5k23J79P7j03R7k8j17j9K67
6598A53j56j32K4J70j17J43j83n4j18K29m8K3L4J2L4N5pl00J40O1J08n3n9J8k08
$$ plain form
6423 15 5 105 26 -82 -1 -43 177 -115 74 99 44 135 -55 38 113 61 -89 -103 3 12 79 42 126 73 -32 50
6449 50 -123 -34 63 91 -12 108 37 -47 37 55 -121 3 -158 -32 -21 -6 118 76 74 -53 -59 -5 125 -4 114
6474 114 188 -37 -49 -22 -89 -25 -3 -147 -80 -152 -65 88 -81 -59 -16 55 28 -109 97 89 -153 -241 28 -99 -44 -28
6500 -28 -19 98 17 -147 -34 -116 -87 99 27 -27 -28 -55 45 -81 58 -26 119 -51 -88 158 243 49 -86 -27 42
6525 42 -138 169 -124 -85 63 -51 108 44 -177 -64 -1 47 135 30 37 -62 -46 -236 -30 -180 -30 -25 57 -5 62
6550 62 -112 79 35 88 -9 -45 113 -146 228 -32 206 43 21 155 -51 -189 115 -36 46 110 -67 -97 -5
6573 -5 -54 -43 -10 -188 -62 -162 71 -30 -123 18 90 77 177 16 -62 23 -200 -21 56 -47 50 22 -95 -114 153
6598 153 -3 -135 -111 59 -58 85 -98 -152 -270 -41 -89 -66 -32 -20 14 69 62 -238 -98 -37 71 18 -41 -23 -231
6623b31L63r7M9m8N6j21q4J11j43J58K69l91J91N3j42J69j52j12K67o1n5J1J35
6646A95m09J38K3k6J95j2j00l9J67k20rJ19p3J47j7j18p9J07n1k7J79R1j94J25
6670A12j94M6J69j85N1Q5Oj46m6l2O1lJ12l3j19L5O0m1N8J10j03k1P3m1K51k79
6696a4J6L6p7J06j00J4J48p5k61J89M1l0K63k76J27m6k0k7j4J14m4q7m3j73N1
6721a82J34N3j74J56K2k5J87j04N2j56J8L9L1P3m44K50R7K0l1Qk5K4Q9j49kM2
6747Cj4K3Oo8l9L55p4p0j98k8J85j6O0k73L93j41m1j14m4l4j2P1J56p8O1k33J42
6774b2J26j88L10k87J06j03J86m33L13o7Qk3J15j94J85K6j86J92j31m4J10J38
6796A37p6r7M3rL4p2l0J19m2J08j28p1L4K7oK24k67O5L8k12jO8J95j20N7j66P7
$$ plain form
6623 -231 132 35 84 36 92 -29 -113 -2 -145 13 282 -109 82 135 -7 162 10 -102 165 104 49 60 195
6646 195 -214 -76 -53 -79 116 104 4 -35 132 -88 -97 22 -51 96 79 -39 -118 -11 -62 -89 90 181 -13 112
6670 112 -82 -36 133 -52 -1 84 90 -56 -102 -134 -73 -76 36 3 -116 -81 -21 -62 -4 106 3 -18 55 14 265 -14
6696 -14 2 38 -39 67 -33 -19 129 54 -207 -18 23 -7 256 -20 107 61 41 14 0 114 70 -17 -60 -233 -182
6721 -182 -48 5 -169 -13 9 -16 171 67 119 -37 -19 20 51 124 -320 -70 27 47 16 24 -1 23 112 -37 -39 3
6747 3 -11 12 18 -50 -89 266 192 122 -76 -104 81 65 125 -148 245 104 63 -51 -95 -129 -141 -70 86 8 69 -164 -22
6774 -22 104 -84 226 -61 45 -58 128 -305 8 -59 -51 -74 41 -153 32 58 -128 64 -67 -111 -1 137
6796 137 61 -36 7 -2 32 -40 -70 49 7 115 -13 -84 -50 -23 -29 195 -72 -7 31 -181 -182 -114 81 -39 18 -148 -71
6823g1M9l5Q2N0j31j41J63r2N3K5Q2k09K8K53k18Q1P5j29K01j63Q7j28M0l0J25
6848D7J59j27o2k4oKJ8m5k8M3J04j10jJ16j07m3J2J85j75J05P9k38J15J3j1k0
6874Al8L8K1j03K26m7m4j11j16L55k67J20L5m7J1mk02J23J43j54J73k79J66J0
6898A0P5r9r8L3p5J25K8J4L3k6j23K33j91m0J79j02j26J21q4J52j16J0j49K10
6922fm4q5J51j8q2J87R5l42J80m6J15j21q0J47j97R1N4l4P1j08J97R3k85J46m5
6947C4j02N9j7J05j83m6J18p0P7O9om8j0m2J26o1Q7m3J51k29K13l17J45j90K37
6972E7jL4j54p5L3J66N1j12M4M4l6j50J52j36J51n8J05r6K55k95M8J27j37r1R6
6997B2j03jO8j24J52J0qJ49j09o2n6j8J62r3J16j67L8L9K2P5j63p6J40j12K18
$$ plain form
6823 -71 -22 -57 25 75 -56 -197 -34 -126 -73 -48 34 -175 -147 106 -112 -31 44 -85 116 -47 40 -88 -48 -78 47
6848 47 206 79 17 -7 -13 -11 7 -38 -66 -23 81 -29 -30 86 -21 -64 -52 133 -42 63 142 -96 19 32 21 1
6874 1 -37 1 22 -81 145 98 54 -57 -173 182 -85 35 70 23 34 30 -172 -49 94 -60 113 -166 0 10
6898 10 85 -14 -112 -79 -154 -29 -1 13 46 20 -103 130 -61 -101 78 -24 -150 -29 -113 39 -77 -67 -216 -6
6922 -6 -50 -135 16 -2 -84 103 198 -144 36 -10 105 -16 -96 51 -146 -55 -1 -35 36 -72 125 218 -67 79 34
6947 34 -68 -9 -26 79 -104 -150 -32 -102 -25 44 38 -10 -20 -62 64 3 90 47 198 -31 182 -135 10 -180 57
6972 57 56 90 -64 -139 -106 60 111 -1 43 87 51 -99 53 -83 68 10 115 19 274 -21 27 154 17 -74 22
6997 22 -81 -82 -14 -138 14 24 16 165 56 -6 -62 -80 82 -11 105 -62 -24 15 37 112 -51 -127 13 -99 119
7022A19j95J5Q1l6Q4k5o3m4Q8J31o0K7k37O1K31k44N4M3K2Oj68N1L3J06l2k23
7048a75J67n1M5J60j07j50K08m4p4q7J04K4J40j55j56L8J77j64K51k35o9O2K23
7071A32j91M4k4K22j36n3r0J11j8k7K8r8R4k35K08j15O1R2O3r5j19J74P9j78o1
7096a32J92j41J3K10j16R8j00M1n3j25O9R8m3N9Q7k20J28J2j54M4Q4j07j45K1
7120a80J60l5L9l3J99k79J65m8p6j2N5J85n1Kl8j48J27p6J21k14K30Oq9p4J67
7145A03M4j17J28j33M0q0RJ10mk23J39K1K9K18k26p8J77k76J12N4j98Q9r1J76
7169B3k4J38rk26Q3J91k28J1M5J00j9j1p5n0P2j0j59J49J7o2J01K13j95k6j02
7194e3lJ65j68K10j77M3j35K42m0j3M6N2j31j07J14q4K1j54J16N1N4k1nL6K2j50
$$ plain form
7022 119 -76 -61 20 -16 68 43 -20 -64 24 155 95 122 -115 -54 177 -67 -13 30 52 58 -110 -59 -26 80 48 -175
7048 -175 -8 -59 -14 146 39 -111 97 53 -21 -108 -4 20 160 5 -151 -113 64 -100 151 -84 -153 -91 132
7071 132 -59 -15 -39 183 47 -6 -96 15 -3 -30 -2 -100 -6 -241 -33 -148 -87 5 68 -27 -146 28 107 -71 -132
7096 -132 60 -81 -68 142 26 124 24 65 12 -113 -44 54 11 70 157 -63 65 77 -77 -33 51 -56 -201 -180
7120 -180 -20 -55 -16 -49 150 -129 36 -12 -88 -100 -45 140 89 91 53 -95 32 -44 77 -137 93 99 10 -64 103
7145 103 147 30 158 25 65 -15 -6 104 100 -123 16 37 66 284 58 -20 157 -119 -7 47 -151 -62 -153 23
7169 23 -1 137 128 -98 -15 176 -52 -41 4 104 85 74 -1 -51 21 11 -148 1 18 -44 57 270 75 49 -53
7194 -53 -56 109 -59 151 -26 17 -118 124 84 71 117 169 38 -69 45 -39 -18 -172 -56 -5 49 28 23 59 81 -69
7220f9J43O2o0j23L1k6jJ6J85k29l2R1j85J58J00j20L2J88k01p1N1Q4m7J10j02
7245a5K06m96J81R3K03p1RLk5k98J02M9j32J23K06j16r9K34j65Q8r8J23k4ml3
7270D4j5L8k96K81r9Jj5j3J87q4k4j19K10r2p1R8j8J6N4j46J28m5M0m4m4L6j60
7297a52P5O6k47L82j62K6mk4J65q8q0J35K0r6N5K3m3j57J44q7%j9k6O6k8N7l0
7324b9P9ok0N7p1K7j84K05k29J07QJ19rn9j16L6J60m0L3j40O3k2p7J01n2o9j6
7351a44J44O5J54r3k59L51j11p9j21P1J3n3q4P6P3K3P7m2M7j91j04J03L8J10k23
7376a59J92J08j25j86J13K0P9j70J93j83J16J69k59J69r9O8j66J15M6r8L3Ko1
7399h3l4P1lO6j26J63O6k17J50o1J69j78M9m3J9J52k40J0M7L6m2J14j45j04K24
$$ plain form
7220 -69 74 136 76 -47 -16 -42 -43 -27 158 -71 -103 -12 -197 -39 61 -59 -27 161 -40 -111 -60 24 -23 87 -15
7245 -15 191 -305 -124 -31 172 101 110 113 88 -210 -108 -59 -191 -68 138 22 -77 157 -8 80 -18 105 81 77 44
7270 44 29 67 -229 52 -47 -46 -61 -74 113 29 5 -114 96 4 -67 31 13 29 83 -63 65 20 60 16 -28 8 -152
7297 -152 -77 -11 -258 124 -38 -12 -16 -40 125 37 -43 92 112 16 71 94 51 -106 38 -49 -49 -68 -94 -28 -56 1 -29
7324 -29 50 44 24 81 10 37 -147 58 -171 -64 -56 63 54 -5 -121 -85 75 35 68 -72 -9 -31 -108 -7 -59 -128 -144
7351 -144 0 65 219 126 -133 218 107 28 -93 -22 -9 -62 -146 -70 3 26 103 61 108 -83 -187 -84 -46 64 -159
7376 -159 33 141 16 -170 -57 -37 42 -128 65 -118 -2 167 -92 77 -22 46 -120 -5 41 -57 -24 -22 -83
7399 -83 -117 -46 -49 17 -109 54 120 -97 53 -8 161 -17 32 -11 8 160 -80 -70 -23 13 -29 85 -60 -164 60
7424F0p1j7J36j6j96J11n3j53Q8J1Q3l0J8j26J64p0L2K1O0j97L6J33R5j02l1N
7450ik9L2k1K8J6r4j6l2M3R1q7K8P4m9r2j23K32l2LJ34k85L21%k09N7r4P2l7k8
7479a06Q3J86K6j71N7l9p0l5l6J29k3Q0j02pL0j9Kj09q3L46k01J80j25jNj15P6
7506d2J10l27J51J8%N1l7J30k0q2k2q3J65j04J05j62J05o0J08J58j46K9q3J45
7530A07j12J10j71M2KJ40j78k7J52qk6r9n1K82k03P3p9J07j06N0P7n4k2L7Qk20
7556a69K02K4m7L2j10J43k26K86r4n5P3r7M9m7Q6p3r4N0J00m9J72l22K59L8r0
7581D1K5l4Q8j80O7J25r5j57J60j47J28l03J57K17j06L5J34k32K29j06k4J72p8
7604A16j37j7J4p9n3J24J96r4k7Q0j31j05M2N8P5j50R1%j8j9J74k80N5P6j37J07
$$ plain form
7424 60 -11 -28 108 92 -104 7 -46 -199 -111 -100 -17 -47 -29 -155 9 -61 -29 -8 52 -145 -109 24 119 17 -14 -9
7450 -9 -38 -6 -27 1 17 -77 -93 -125 -82 9 -78 -50 24 -25 -117 -240 -8 -40 -37 97 -188 133 133 -76 -19 -113 -41 -78 -106
7479 -106 -23 163 189 18 75 36 -34 -69 -105 24 1 81 -21 -28 2 -17 -15 -124 -207 139 -62 118 -7 -8 -3 -118 -42
7506 -42 68 -259 -108 -90 -90 -39 -76 54 34 -48 -70 -153 12 -92 13 -149 -44 -104 4 162 16 45 -38 107
7530 107 -5 105 -66 -24 -22 118 -60 -87 65 57 31 -68 -119 163 -40 33 -46 61 -45 5 82 28 6 43 51 -169
7556 -169 33 57 10 42 -68 75 -151 135 41 -14 59 -38 11 -36 50 -23 -117 -67 33 -16 156 -166 93 131 41
7581 41 66 32 120 -60 7 132 37 -120 40 -107 21 -282 -125 92 -14 21 155 -77 152 46 22 194 116
7604 116 -21 -38 -24 -103 -156 -32 164 70 43 123 -8 -113 -71 -13 62 -88 3 3 -15 -34 140 -140 -85 -9 -146 -39
7630c9J04N2r6j0l6P6o3L1q5k8J4JK35l16K62oj23J05o3O1j29J99p1Q5j20q3n7
7657a00%R7j37P0M0P3L4j39p7l1J5K02p1JL3M2j07J63j47R2M9j31M0J00K9R0k15
7684A5j31n0J88J02j55J61k55J75M1p7p4R5j60K26j81M4j26K33k4q5L9R4j06j41
7708a52K47j02j57mJ32p8O9J67j45j0m7K33j53L7O0q7J4k28J93p3J54j25K9O6
7732D0k0j10o3J75p4m1L4M5J40q3j02J49k08K20j08joJ03j95L7M8QJ66k92J46
7757Hj41J01J29p7K5j34K3J00k9j09R8q9J07j25K18j44J84P8k86J62q5k39L48
7780A23M2l11J7L3J69q1M7O5j09R4j80MqK37j48l9P4J48k99J49k15J97qJ9j0m3
7806c3j32O4M0q2P2qR2q8J15J46j26j7j4k46J77K1J10j36K8N1r4J7N1k0r5K10
$$ plain form
7630 -39 65 117 21 11 -25 51 -12 19 -66 -94 -80 -79 156 -160 102 96 -27 78 15 76 -53 146 75 160 40 -43 -100
7657 -100 -100 -3 -140 -70 -30 43 77 -62 -139 -170 -155 47 -24 -23 10 52 -55 108 -39 53 102 -29 11 111 140 230 15
7684 15 -116 -166 22 124 -31 130 -125 50 91 14 -60 35 -125 101 -80 -36 -162 71 47 -38 1 95 -11 -152
7708 -152 95 -7 -164 -168 -36 -114 -45 122 -23 -33 -80 153 0 37 97 10 24 -204 -11 -84 70 -55 -26 40
7732 40 20 -90 -153 22 -52 -93 -59 -14 126 43 -59 90 -118 102 -6 -7 -13 90 -105 -68 -20 -12 154 -138 8
7757 8 -133 -32 97 20 45 -89 -66 34 5 -104 -6 -95 12 -113 105 -39 145 223 -63 99 14 -225 123
7780 123 165 -146 -129 -96 73 -8 39 104 -5 89 -91 -87 -95 142 -6 -45 29 177 -122 27 -188 9 1 20 10 -33
7806 -33 -165 -101 -61 -143 -71 -79 13 -75 40 186 60 43 29 -217 -40 -19 91 -45 -17 34 -60 -43 8 -12 -107 103
7832A03j18m9P4j44J17j48J25J37k31J36O2j70K56Ll64K23J2N7k3R6k71K99j69
7855A3P0j82Q6K7P8k29K66j87l7J13O3j14Q5K8J8o9j05J83k58K2L3o0J8P4J64
7880A00k30K55j56N9j6r5K11J6k87J88q9l6K30l04J47o9m0M17l49j18J61j23J93
7903F5N9j5r9Q9k20J23j3j5nP8n4j9J33n9j10j10J50L5J12k8j31j20O6J14J03
7928A29j27J17p2J44k12K5j12Q9RJ66j88P3Kp1O7J2m4m6p2q0K35j24J39r4o6O1
7954d0o7J3N7qp8J52JM3j6j80J07L7k8P0J47j22j96K77r9O0l07J12j46L23j00
7979A2J4q9j2P9p5N9K4q4J17J63l51J03P5r9J08J35l9q8p2l8PJ7L9K2n7o1J0M6
8007c5J78Kj94P8l0j64M6N9M8J81k05K08j28n3M9pr7J70K5p6kK5q8O4r0J10j52
$$ plain form
7832 103 -15 -64 10 -134 -17 -165 -40 97 -134 2 64 -106 150 153 -211 12 24 81 58 154 -117 182 13
7855 13 83 -99 -13 14 92 -137 129 -58 -95 18 81 -33 52 80 98 29 -76 107 -151 -129 -96 -156 -138 -64 100
7880 100 -130 125 -31 28 12 -83 128 144 -143 45 -44 -80 150 -154 -7 -76 -116 301 -48 -166 -5 -128 65
7903 65 124 109 10 99 -121 2 -11 -26 -31 47 -7 -26 107 48 -62 -172 -22 13 125 97 -34 -154 -88 26 129
7928 129 2 119 47 191 -21 4 -108 -19 -10 156 -32 41 43 -28 39 51 7 -39 -111 -191 44 -80 59 -35 -101 -40
7954 -40 -107 -94 -37 -45 -123 29 30 73 57 -123 -16 21 -7 63 210 88 -108 169 70 130 -177 -65 -211 112 12
7979 12 26 -63 -75 4 -71 -12 12 -72 45 208 -143 -40 35 -64 44 179 140 52 -20 -58 -51 -34 5 27 -30 -91 -81 -35
8007 -35 143 145 -49 29 -1 -165 -119 -60 -12 169 -36 172 44 -9 40 33 -64 106 131 55 53 78 -10 54 -36 74 -78
8034g8J2K14j92j4J22j57l2J77o5J27k32L1k5OO3p7J08L6N3j61L6q9J49k0N0j7
8060B5o8K8J31r4l2J67j68j34L14k25J31q0J0j18O8O5r8K3j0J56R3m51K34J31
8084I8N5j26k4p9O8L1J7N6j55o6K51k51Q3J2j14J1M5P7j07J15p7N6J42j87R3j49
8110a25J98m6P7m1j43J83q5m4M8L5j64J31K6k1k27J28P4N8j54M6r0J00j9q2J88
8135E1j65L2J14p6R7n7O2j60J64n4q0K82k76K01j02j47N0L02r8j42J73q2k01r5
8159b07L07j11r6J59j64O0n2mJ30j2K6j12J32J00q7j54oL6Qk4J17r7pJ15k2PR
8186E1r3QK77k47J32
$$ plain form
8034 -78 -66 148 -44 -58 64 -93 -125 52 -13 114 -118 -87 -112 -106 -43 -120 -12 24 77 -84 -48 -137 12 -8 42 25
8060 25 -43 -15 116 22 -10 157 -11 -145 169 -56 75 -5 5 -113 -45 20 -78 -55 -65 91 184 -267 -33 98
8084 98 153 27 3 -76 -8 23 40 96 -59 -125 126 -125 -42 -30 -144 -133 -88 -11 -118 -3 -80 -24 118 -69 24 -125
8110 -125 73 27 104 63 -80 103 18 -26 22 57 -107 24 50 29 -198 -70 4 62 -92 -46 -136 -36 -55 -137 51
8135 51 -114 -82 32 -44 53 -4 58 -102 62 8 -72 210 -66 135 33 -114 -64 238 140 -2 171 89 -112 -207
8159 -207 100 -11 -107 52 -112 -52 -104 -108 22 10 36 -76 56 156 69 -85 -91 -55 -47 -71 46 -51 -58 57 35 42 51
8186 51 -42 -34 243 -4 128
8191A28
$$ Imaginary data points
##PAGE= N=2
##DATA TABLE= (X++(I..I)), XYDATA
0@%%%%%%%%%%%%%%Qj6J6j6J6k4L2l2M0m8N6o9P7q8J04j20J36j56J80k04K28k56
36a36K89l26L66m09M56n06N63o25O91p64Q43r30J025j128J244j372J511j666J841
55I67k037K257k510K804l145L551m048M663n451O512q012J0317j4360K3518q5040
70g0014k852R0942o0807J5534M2559k065k1678L5917J5523j5567k178J9615k8307
83A6622j6775K3386l075l0224J1260K664k5162j0697J3392p3j3834L322K5122
96d072l737r697L0256K2388k0382o540J5786L793q733n433q598j6244k653R016
110d850j1774p374J8605j184j7141J4452J8764o804j511J1513j130j2009L039
123B596J2539l387p030L523n363q793K663Q04m048k184m176k770K641P110P810
$$ plain form
0 0 0 0 0 0 0 0 0 0 0 0 0 0 0 0 8 -8 8 -8 8 -16 16 -16 24 -24 32 -37 40 -48 56 -64 72 -84 96 -108 120 -136
36 -136 153 -173 193 -216 240 -266 297 -328 363 -401 442 -488 537 -591 653 -719 792 -874 967
55 967 -1070 1187 -1323 1481 -1664 1887 -2161 2502 -2949 3563 -4449 5868 -8492 15026 -70014
70 -70014 -72866 18076 -42731 -27197 15362 13297 -8381 27536 43059 27492 25314 44929 16622
83 16622 -153 23233 20158 -10066 1194 3858 -21304 -32001 -18609 -18682 -32516 -29194 -4072
96 -4072 -7809 -17506 12750 35138 14756 8216 24002 27795 19062 13629 5031 -11213 -13866 -4850
110 -4850 -16624 -23998 -5393 -6577 -23718 -9266 9498 2694 1183 12696 11566 -443 2596
123 2596 15135 11748 4718 8241 2878 -5915 -3252 -2448 -6496 -8680 -12856 -15626 -12985 -5875 1935
138A935r37R1R100J168m440M047J886o136n598o17j22m944q76M503m632m315N162
155d725K80q53N671p27m495L420M462O55p6K792J089n689n38N044l128l907J196
172D71l721k898K475K07L79J156L33J042q9J529K956j712o90J380l919q47L860
189A912o33k395m32R34Q65k160J023L447l944j606L538q09L8L035r06j812J293
206A388J137p38j775O52K53m282K06L185k218k25K764j334p87K205J296Kr75K56
224A010M72j707M66J890j958l67J065j957p1J898m3j656j265J274N49k060J512
241i48K837k237r05K548p2J25R27r43j157q59P12J67j630Q93P58k338O49K212
259G39r20J81Q76q58o46M64J118K3j171N00O44j607O26J649j224n19j8j290K33
$$ plain form
138 1935 998 1089 10189 11357 6917 10964 12850 6714 1116 499 377 -4567 -5443 -940 -5572 -9887 -4725
155 -4725 -4445 -5298 373 -354 -4849 -1429 3033 3688 3612 6404 7493 1804 1266 6310 3182 -725 471
172 471 -3250 -6148 -3673 -3466 -3087 -1931 -1598 -556 -645 884 3840 2128 1438 2818 -1101 -1948 1912
189 1912 1279 -1116 -1548 -614 251 -1909 -886 2561 -1383 -2989 549 -260 -222 2813 1907 95 1388
206 1388 2525 1787 12 664 917 -3365 -3159 26 -2192 -2417 347 -987 -1774 431 1727 1729 754 1010
224 1010 1482 -225 241 2131 173 -194 871 -1086 -1157 741 698 -958 -2223 -949 -400 -2460 -948
241 -948 1889 -348 -1253 1295 1223 1348 2275 1332 175 -684 28 195 -1435 -542 216 -2122 -1473 739
259 739 -181 0 876 18 -628 -164 954 977 -194 306 950 -657 -31 1618 394 -125 -143 -1433 -1200
278a200Q55M21n70q43Q97R73j072J506J480j702m71O39l91J02k65N7q17j212P08
297i05O10p76Q45M51j481L51Q60n2O85K14n07j55Q3R78J80q62N42k74j911O45
317d79O41n67m51l32k29P3K98J289J72o92Q51J49q64J240Q22j282j20j78l83k22
337b64K23K72n45j085N43J33n33R52L84q44J88N34M40P07K7j28l55l25N69m39
357D54p50P60m32j564K16Q72ok78J57L19m19j02J272K32l70M44j86o18P70K09
377I80m91j53n31l13k12j86O80l74n53P19J55l97Q85M06p4j97j66M24N6j64R7
398E91l33n22M35l91n52P42j47r77L36L20J59M0J99N61l03k77R68p5k60M47o19
419C42l18J27k56M3k43l26n0j22P5P29l05n7M77k09j07M40K96q0j46qL27j97k81
$$ plain form
278 -1200 -345 76 -494 -1337 -440 533 -539 967 2447 745 274 913 522 624 359 416 -401 -1613 -905
297 -905 -295 -1071 -226 225 -1256 -905 -45 -97 588 802 295 140 223 1201 1381 519 1061 787 -1124 -479
317 -479 162 -405 -856 -1188 -1417 -1344 -1046 243 415 -277 574 723 -141 1099 1921 639 519 341 -42 -264
337 -264 -41 231 -314 -1399 -856 -723 -1256 -304 80 -764 -576 -42 398 1105 1132 1004 649 324 893 454
357 454 -296 464 32 -1532 -1316 -444 -450 -728 -571 -252 -671 -773 499 731 361 805 619 1 771 980
377 980 489 336 -195 -508 -720 -906 -226 -600 -1153 -434 -279 -676 209 615 541 344 178 602 658 494 591
398 591 258 -264 171 -220 -772 -30 -177 -1154 -818 -498 -339 -299 -100 461 158 -119 849 774 514 961 342
419 342 24 151 -105 -62 -305 -631 -681 -803 -728 1 -304 -361 116 -93 -200 240 536 456 310 302 629 432 151
442A51K49k81m78P5k53q5L99m8k80l4K81M49m41N34N76n44k70P20j98n17M71l16
464A60l00o4J52l3k23l7L78l26r6M40r3q2M79l26J9M02j93p6k9RJ87n98k0M35
488A65l78k06K33j13K2J47j6l8o6L81P9o5L7J67j20j54K42n1k19o0j05L6l9K1
512a00J90m37J16J86q7r1J96J04n3J72k60R9R2J93j12l05RL57m39K6J72n7j31
535a60o6K5J56J23mo4j69J58K42j56J4J8j67j67M14j64J87j39j44J12l49K49K13
558A62l20m7K36j67K14L8j96L12j63j22J32J2O4J93m26pJ67k51J61J11k96K20
580B7P4k50J59L2J06Q8m55R9K57k57K54Kk1j21o0K69k18O0K9j08k04M6L94l31
604a29J07Q0j26r6R3Q1K33k0k82n1J3J83O7j10j41J98l15r5O21k13j13QM3k8j46
$$ plain form
442 151 400 119 -359 -284 -537 -622 -223 -271 -551 -585 -304 145 -296 238 814 270 0 720 522 5 476 160
464 160 -140 -204 -52 -85 -308 -345 33 -293 -389 51 -42 -124 355 29 48 450 257 181 152 161 348 -250 -270 165
488 165 -213 -419 -186 -299 -277 -130 -146 -184 -250 131 210 145 182 349 229 75 317 266 47 -13 -118 -82 -121 -100
512 -100 90 -347 -231 -45 -132 -223 -27 77 24 196 -64 35 127 320 208 -97 -88 269 -170 -144 28 -29 -160
535 -160 -226 -201 -45 78 74 10 -159 -1 241 85 99 117 -50 -217 197 33 220 81 -63 49 -300 -51 162
558 162 -158 -205 31 -136 78 116 -80 232 69 -53 79 91 155 348 -78 -85 82 -169 -8 103 -193 27
580 27 101 -149 10 42 148 236 -219 -120 137 -120 134 136 115 -6 -66 203 -15 45 74 -34 -238 -192 202 -129
604 -129 -22 58 -68 -164 -71 10 243 223 -59 -110 -97 86 153 43 -98 100 -215 -310 311 98 -15 -7 36 8 -138
629a38J80ok69J97J53j65Q1n2J03q7n2K21p2Lq8J16j71J17l7j72K20j36j72N8
653a68K0Q8K5qP2J6j71J36L2q1L04j26j11N6m9Kl8J07j02K5j74lJ51k31rL02r9
680c4M8l6O7L2j69J23Q0o3J14k44J70k01J2k4q7K18n4p0PJ18o1R8J6k2j70J79
706D7l0m9J39J18m36K44j45J08km2n4j51J34PL5l1K29j41M1p8L9J11J76l09J07
731F7q7O0J95j77N3j96R3p8J70m9n8N4j64J20k9L0m8O3k3J16L9j10r7O9p4J13
757E2J14j56K3k29J6K9n1J60o5J03O9O9j43J50l8Jj01PL0n8m4J02k7k5J59j94
783d7N3j57R3J75j39J63k78K08J13j01mm9p9J7J03P3q7l2j37q1K28o4Q8J9l12
808b34J91J4j47L89j28j41j52J77J35r0K8j18J30n5j50J79j40K38j38J02j05k5
$$ plain form
629 -138 42 36 -233 -36 117 -48 33 -19 84 -3 -55 166 94 97 9 125 -46 71 34 -138 82 -54 -226 -168
653 -168 -148 -60 -35 -43 29 45 -126 10 42 -39 265 139 28 84 35 37 -1 106 4 29 -145 -148 3 -228 -237 65 -34
680 -34 14 -22 45 77 -92 31 111 48 162 -82 88 -113 -101 -125 -212 6 -48 -118 -111 7 -54 44 60 38 -132 47
706 47 17 -32 107 225 -211 33 -112 -4 -6 -48 -102 -253 -119 -112 -77 -108 121 -20 21 -57 -18 93 269 -40 67
731 67 -20 40 235 58 111 -85 8 -70 100 51 -7 47 -117 3 -26 4 -44 19 -4 112 151 41 -56 13 -61 52
757 52 166 10 33 -196 -180 -151 -202 -42 -107 -4 65 134 -9 141 103 104 3 10 40 -18 -62 40 13 -12 147 -47
783 -47 6 -151 -58 117 -22 141 -137 71 184 83 79 30 -49 -32 71 144 57 25 -112 -193 35 -29 59 78 -234
808 -234 -43 -29 -176 213 85 -56 -208 -31 104 14 42 -76 54 -1 -151 28 -112 126 -12 90 -15 -40
830d0J41p0j82J73j8j4J58p8o3q7J1K25l12P6J44R8l50J47QO3p2J85r5m1J43j16
856C4q2o1K71j83n8L17j28j12l1J7q1m3J58oN7o1o8J3k07L13L5j59J69n0o7K07
882A94k14kJ04j07O2j75J76O4j23o6o2J29K40k45K2M7k22K23m3K6J8o7pO0M6k00
908a22L0O4M3M4p7l7J07J80k22k3P2o4R7m0Q7j51Q4j05l0p5J00p4J07j2k7JP9
935C6Q0k39J67J24k28M5K1p1R2R7l7j39P3O6j27n4J41J30j52o0o2L80n44J29M8
960h4K5N3k4R4OM1m5r1m7j72L47qj82M7J14l7n5j8J38n0k18K19j71J34r2j4J5
987g5q5K43O3j75j3O9j51J82j4M2j4l0p2NJ14N7k86J7J74pq7n2J62o9j69J89q2
1014f4M4j04K51j50p5p3J19J90j46m1L5O4j07Q2q2J1l0P7kk17J80J45q1l0J01
$$ plain form
830 -40 101 31 -151 22 4 -10 148 70 7 -80 -69 156 -156 -80 64 162 -188 -41 -33 30 -42 143 48 7 150 34
856 34 -48 -109 162 -21 -79 238 110 -2 -33 -16 -97 -140 18 12 69 8 -60 -47 -254 59 94 -65 104 54 -13 194
882 194 -20 -22 82 -25 37 -138 38 102 -21 -87 -149 -20 220 -25 -3 44 -178 45 2 28 46 -21 -28 32 78 -122
908 -122 -92 -28 15 59 -18 -55 52 232 10 -13 59 -5 92 52 139 -12 72 -33 -63 -138 -38 -112 -5 -17 -44 -43 36
935 36 116 -123 44 168 -60 -15 6 -65 27 124 87 -52 21 87 -40 -94 47 177 25 -35 -97 283 -261 -132 -84
960 -84 -59 -6 -30 64 70 111 66 -25 -72 -244 103 95 -87 -40 74 37 -18 -36 102 52 -166 53 -118 16 -76 -90 -75
987 -75 -160 83 146 -29 -42 27 -124 58 44 86 72 42 -30 -25 89 146 -140 -123 51 44 -43 -95 67 -2 -171 18 -64
1014 -64 -20 -124 127 -23 -98 -171 -52 138 -8 -49 -14 50 -57 25 -57 -46 -76 1 -1 -218 -38 107 26 -4 97
1039I7j41r2O1K39r6Q4j52K12k22M0Q7J08k74n8J99r3K2k16L07j98J23j23J53
1062F7j55J33R3j47P0l8j53J50j26J47j06J19K6o8j10J63r7M8o9K62k64J18j20
1085e7J71q7K8P8l64M40r1j75K14o9p0O6j20P7K8Q4j44N4p0K3k01J57Q0j60J66
1110E8l0j33J61P6q5j9P5Q0k26J53n3NK1j38R6q4Ol8J95Jk16R5K9M0j73J85j26
1137d5m5P6J66j84K19k20J88r7j80J25r2J03j13L11j74J45j92J62k37J9P7R7k41
1160a32J29r0J50l3j19J38P6j05J1o2J86k52p0J3J03L7k8j16J09K2M5j3n9j82
1184b42K16o2P4m7M5KJ02j21r2J86K0j23P6k13L16j45L6n3L6J02j47j11L44k10
1208a1K21n3j41o7n6J38n7j13J86j97J33O9j64N3K07o3o2r3L7K4J89k53k5J2J23
$$ plain form
1039 97 -44 -136 -75 164 68 152 0 212 -10 30 117 225 -49 -107 92 -1 21 -195 112 -86 37 -86 67
1062 67 -88 45 138 -9 61 23 -130 20 -106 41 -65 54 80 12 -98 65 -32 16 -53 209 -55 63 -57
1085 -57 114 27 55 133 -231 209 118 -57 157 88 18 84 -36 41 69 153 9 63 -7 16 -185 -28 52 -108 58
1110 58 28 -105 56 132 47 28 103 183 -43 110 57 62 83 -55 41 -43 -37 -75 120 121 -95 0 29 69 -104 81 -45
1137 -45 -90 -14 152 -32 187 -33 155 58 -122 3 -89 14 -99 212 38 183 -9 153 -84 -65 12 109 -132
1160 -132 -3 -93 57 24 -95 43 119 14 25 -37 149 -103 -173 -160 -57 -20 -48 -164 -55 -33 12 -1 -60 -242
1184 -242 -26 -88 -14 -61 -16 -14 88 -33 -125 61 81 -42 34 -179 137 -8 28 -25 11 113 -34 -145 199 -11
1208 -11 210 157 16 -51 -107 31 -26 -139 47 -150 -17 52 -112 -59 148 85 23 -70 -33 -9 180 -73 -98 -86 37
1233C7m0k2K44j57k9J08j18K1M3M3k54K15m3k31K71j59K34L3j92M8q7P8P0R8k34
1258b3J5j57K01R0j3j14q1m6J72j35P0l2n4P8J8p5K10j90R1K9j04o7R8P1j75O3
1284f0k7K34j49MO4k20J67k7J5J49k23J70Nj42J2l2K57j98j33M7J01r3K11j88
1308e6R5j20mJ07l2J02ro4R1j57J38L3j00l4J1Rkj7j90K32j8k8j31K14o7O9j43
1335g1Q0Q5k3k7j37J80r4J40j10n2P0l9N3q0O9n3m2J66j1Q9j57O1n8j95J75l0
1361a1L1J08k00n2J95n9K6L0p1j5J47j55J5JJK58k79R9o8O8l7J65m2k81J28j01
1387i9K4N6j06K12j18J12J35l56J72N0k67J89P3j30N3o2J48r4M0j21J8J11Jn3
1411a2k4j1J31N6o1j4j85Q7K7M3j90K43P4k04j7L0r7J92k70J45J67j84K05j82
$$ plain form
1233 37 -3 -25 219 62 33 141 23 44 87 130 -124 91 48 -183 88 -71 163 196 4 52 -35 43 113 211 -23
1258 -23 -8 -165 36 126 113 -1 -82 -128 44 -91 -21 -53 -107 -29 -11 -86 124 -66 25 54 -50 -117 -19 52 -123 -60
1284 -60 -87 147 -2 2 66 -154 13 -14 1 150 -73 97 102 -40 -28 -60 197 -1 -134 -87 14 -79 132 -56
1308 -56 39 -81 -85 22 -10 92 83 19 110 -47 91 124 24 -10 1 10 8 -9 -199 33 15 -13 -144 70 3 72 -71
1335 -71 9 94 71 44 -93 87 -7 133 23 -29 41 2 55 -25 44 -9 -51 115 104 193 36 97 39 -156 19 -11
1361 -11 20 128 -72 -124 71 12 38 68 -3 -18 129 -26 -11 -10 -9 249 -30 69 1 69 32 197 155 -126 2 -99
1387 -99 -75 -19 -125 87 -31 81 216 -140 32 82 -185 4 77 -53 0 -62 86 -8 32 -89 -71 40 41 -12
1411 -12 -36 -47 84 140 79 65 -120 -33 -6 37 -153 90 164 -40 -57 -27 -124 68 -202 -57 110 -74 131 -51
1435e1K74r1p7j37K42k94J53j53J51O6k81K28m7R4LJ05j53j21K4P4N3r8J35j40
1459d1J36j37n4P2nj42J40N5j28L5K09j09J9k0L2P6q9r5p6K5K40j07J0j82K10
1484G4J03j53j64k0K05j9po4Q7pOo0Q9jR0k79J13J8J00k7j45r0K31m1m1K46k62
1511a8j3J17k06K01pj93Q9l2N7j70J11q8J73J8p0j04J83N2J3j25qJ4o2o4N6K4
1537e2J93p7j53Q7Jj23L32j24j21N4L6j31K35j43q8K51l17J53P6O8j73K5k19L20
1561A10k42J14R1J3l0j11P0l9q0J47q2J29n3j35o4Q6p6J35k2O1l1K50l34J40k64
1586b17K41K9j36P5l7j7J27R1k48m7J45o0j41K55mo5N1r8L0L9j3N2m5M3j08J51
1612I3l15J76O5K7j06J92l12K25j17Q9k5O4j25P0o8j41J54J11j05j11J48n9J05
$$ plain form
1435 -51 223 132 55 -82 160 -134 19 -134 17 83 -198 30 -17 77 80 185 32 -89 -65 9 62 -36 99 -41
1459 -41 95 -42 -96 -24 -29 -171 -31 24 -104 -69 140 31 50 30 62 138 49 -46 -122 -97 143 36 46 -136 74
1484 74 177 24 -140 -160 45 26 19 -45 42 35 41 -19 70 69 159 -120 -7 11 111 84 -61 -151 80 39 -2 244 -18
1511 -18 -31 86 -120 81 74 -119 -30 -62 -5 -175 -64 -152 21 39 -31 -135 48 100 113 -12 -20 -6 -68 -132 -76 -52
1537 -52 141 64 -89 -2 -1 -124 208 84 -37 17 53 -78 157 14 -74 177 -140 13 89 157 -16 9 -210 110
1561 110 -132 -18 73 86 56 -55 15 -24 -104 43 -39 90 37 -98 -162 -76 -152 -17 -39 22 -9 241 -93 47 -217
1586 -217 24 53 -83 -8 -45 -62 65 156 -92 -139 6 -54 -195 60 56 -9 42 -56 -26 13 0 52 7 50 -58 93
1612 93 -222 -46 19 46 -60 132 -180 45 -72 17 -8 56 -69 1 -67 -208 -54 57 -48 -159 -11 -70 35
1635C5k01Q0J28K1P7j3m8j13O5m6J07j21R0j15K66p5k74J46r0M3J47L5p5j04J82
1660A47k32K06j06K6NR6k22J13Ql7l6R0p1N7l4m1Mo5J43q8J77j07Oj21O2P8oq8
1688c6J34P1Pj34j04j35O3J67n5mJ8l2N0J43j70l4K3L2L1j10L1Q9K7m4j14J78
1714I2j09m4J56k92K20L4j37j8L8J05mJ07j39l4p6J88n5J38j89J00j20J36L7j49
1738a5J74j02o8m6l9r4K82q8j40J17J70k45J88rj20r0N3J57J77k37O1j03kP3k5
1763B9j46L0K68n9j46R2o0n5l3J61k19J47N9J18j74j44K0J10q5O1P9o9m5K9J67
1788A35j12m8p1L27j84O3n0j18L8J03j90J31l4k9L6l9N5J27j04n1q2K33k88J75
1812B3Lm7K0j02R7MnM5l3k09K86j22R2J21k14L7q4K22l12K35j92M2J17k4n4n2
$$ plain form
1635 35 -166 -86 42 63 140 127 79 -34 31 -15 92 -29 61 -54 212 137 -137 9 -81 -38 109 144 69 -35 147
1660 147 -85 121 15 41 46 142 -80 33 41 4 -32 58 -13 44 10 -31 -27 -92 51 -37 140 33 39 -82 -20 58 52 -36
1688 -36 98 169 176 42 -62 -197 -134 33 -22 -26 -8 -40 10 153 -17 -51 -28 4 35 -75 -44 45 72 28 -86 92
1714 92 -17 -61 95 -197 23 57 -80 -98 -60 45 41 148 9 -25 -101 87 32 170 -19 81 -39 97 134 -15
1738 -15 159 57 -11 -57 -96 -190 92 4 -136 -19 151 -94 94 85 -35 -125 -72 85 262 25 86 -17 -19 54 29
1763 29 -117 -87 181 122 -24 68 8 -47 -80 81 -138 9 68 186 12 -132 -112 -2 -87 -26 53 -16 -61 -32 135
1788 135 23 -25 -96 231 47 110 60 -58 -20 83 -107 24 -10 -39 -3 -42 13 140 36 -15 -97 136 -152 23
1812 23 26 -21 -1 -103 -6 -2 -7 38 5 -204 82 -40 52 173 -41 -4 -88 134 -178 57 -135 -93 24 0 -54 -106
1838a06L9Q9K2L7j31jR4O1j8j10N3lJ7k3k1R5l57K21o4L4J33N3k88Q4N6O8L2j16
1866e0K13k20lK49j31l3L8j11J7Q0l9jL3o0O0j06jK76p4j39k6J55k3m3Pp8p6K75
1894A89k43O7J36k05K0O0j56J39j23J18O6l7p5k44L04q8J40k02K9K75j42N2m2
1917C8l3j1l24N22r8j55J41J12j04j27J11j60J35L1j78K47l41L59k0j10M0l5j91
1940a51K0J86l3P8j70R3p9M1N9p7r3K12j40J71r5l05J45R7L9J47r2j55J77o3L1
1965D3q4P2o2K5J41k92L09j15j9p6n4K98j19p4j09J21L5K4j49J67j09JN7p1J73
1990A33j04N0j03J32M8k89J44Q2j24Pk1o9J47m5O2j19J59r1o2jJ47j56J08N2k10
2015a23J93j64J26K66k26J22j22j90J79n7j11k1J22q7K1r3K40n9K9J46q6j07R7
$$ plain form
1838 -106 -67 22 44 81 -50 -51 43 104 86 -24 29 26 43 20 -1 94 -263 -42 -106 -72 61 114 -174 -90 -34 34 66 -50
1866 -50 163 -57 -60 189 58 25 63 -48 -31 49 10 9 42 -18 42 -64 -65 211 137 -2 -28 127 104 61 68 -10 -86 189
1894 189 -54 13 149 -56 -36 24 -132 7 -116 2 68 31 -44 -288 16 -72 68 -134 -105 170 28 80 38
1917 38 5 -6 -330 192 94 -61 80 192 88 -39 72 -88 47 78 -100 147 -194 165 145 35 75 40 -151
1940 -151 -131 55 22 100 -70 23 -56 -15 44 -33 -126 86 -54 117 22 -283 -138 -41 -2 145 53 -102 75 12 43
1965 43 -41 31 -31 -6 135 -157 152 37 18 -58 -112 186 67 -7 -116 5 40 64 -85 82 -27 -26 31 -40 133
1990 133 29 79 -24 108 156 -133 11 93 -31 -24 -45 -114 33 -12 50 -69 90 -1 -63 -64 83 -73 35 87 -123
2015 -123 70 -94 32 298 72 194 72 -118 61 4 -107 -128 -6 -93 -72 -165 75 16 45 191 105 -2 95
2038I5j86L04k95J26o3k16L06Q4j67n3O8j55K53j35J51j6p5j05j9J21o1J30o5
2061B7p5K9J37Pj52j1N8j95K67q5q9R4J03j41l7J44j19K50j57J69k21n0M0K2m6
2086c1L2P9j73J20J12j8M7j27N8j04O9jj8q5q0J73k5L9j25J24r1O3rrJ10j01l7
2113hl5N0j4N1J7N5j84J60n5k00J57J01m7N5r3J5j16J09K9j7k4j8J65k94K38j53
2139e6J53j4j7K5k01R7K8L5m0j8r6K44j68k9L64j21k10O7j05J30k2l9J00j63l2
2164h8J43j35J08J2o2m6O8L0r3J10m7o6J16k52P9K03j03m9J68j25L3J6P2j21j
2189c0j5m8K15j09J03j11O9q7N9q4J38j58O7o7O8j46J83N4J2j39j0K19k22M2j04
2214a01PJ97m9J5j3q2k5J73M9j07l2j30R7j2k8M4N8N1k48J99j19J75j25m2J63
$$ plain form
2038 95 -91 213 -82 44 -19 -235 71 155 -12 -65 3 -152 101 -34 117 101 26 -79 -98 23 -38 92 27
2061 27 -48 -19 118 125 -27 -38 20 -175 92 7 -82 12 115 -26 -63 81 -38 212 55 224 3 -47 -7 15 -31
2086 -31 1 80 -93 27 139 121 168 41 99 -5 64 63 45 -40 -120 53 28 67 -58 66 -25 38 29 20 130 29 -8
2113 -8 -43 7 -7 44 61 116 -68 92 37 -163 -6 95 48 103 10 25 -91 18 47 30 6 -12 153 -141 97 -56
2139 -56 97 83 66 91 -110 -13 15 50 10 -8 -104 140 -28 -57 307 186 -24 43 -62 68 46 7 107 -56 -88
2164 -88 55 -80 28 40 -22 -68 0 30 -63 47 0 -66 50 -202 -123 80 -23 -72 96 -29 4 20 92 -29 -30
2189 -30 -45 -93 122 13 116 5 74 -13 46 -38 100 -58 9 -58 10 -136 47 101 113 -26 -36 183 -39 3 -101
2214 -101 -94 103 54 69 56 -26 -51 122 171 64 32 -98 -1 -13 -41 3 61 112 -136 63 -56 119 -6 -48 115
2239A15j51nj27K76K9j8j71J00k56O5R0J61p0q6j7J33p2N7P4l20K73l8J95m89
2263b52K07j9J98o0p2Ro1q0J76o0K4J37J3q7n1N7J35o3q6k7J61j44p5J43j31k2
2289c0Q2k12R4R7m1K1l7K06j05j25J31j70n8Q0j8J58n2m2j39J84R8j31m4J03P
2314E7m8J1l6J42j47M0J04j28JN8k35K27q5J65l8k0m1j4Q1j87KO9j32O5Q3k2J20
2341I2J26l43J65j44q3N8J61R1n4r8L4J31o0N7j81M2N7J17k16J06j86J24J04K0
2365A20j17k45K64k4J54j87P8o4J12j85J71r1j22M8j48K28L7L0l7M5j85J06J2
2388@J09j57J36j69J52n4kOp2M1J8j36J42M6j23R5q5j6N0JL03k68mr4J3R2j4J16
2416A26j22JJ88l35J10J14j56N3J20o0j95M0K1O3j70K67n4k2M9j18MOM7L8r5J14
$$ plain form
2239 115 -36 -41 -168 108 137 119 -52 48 -208 -143 -53 108 38 -48 -65 68 -4 53 127 -193 80 42 237 -252
2263 -252 -45 -64 134 74 2 11 -50 -130 46 -14 10 147 160 73 22 79 214 151 65 38 199 55 -20 123 -8 -30
2289 -30 52 -160 -66 31 -10 11 -26 180 75 -50 81 -89 -147 -67 -85 73 21 -21 -160 24 122 -9 -53 50 57
2314 57 9 20 -16 126 -21 19 123 -5 -4 54 -181 46 -39 126 88 68 27 13 94 -93 -91 -22 -154 -89 -6 -28 92
2341 92 218 -125 40 -104 -187 -129 32 123 69 -29 5 136 76 133 -48 -6 51 168 -48 58 -128 -4 100 120
2365 120 3 -242 22 -2 152 -35 43 -21 91 -94 77 -14 -136 -88 -236 -8 29 59 22 67 -118 -12 0
2388 0 109 -48 88 -81 71 17 15 21 -51 -10 8 -128 14 60 -63 32 -53 -69 -19 -18 285 17 13 -81 -68 24 10 126
2416 126 4 5 193 -142 -32 82 -74 -21 99 39 -156 -116 -95 -32 -202 65 11 -11 38 -80 -76 -70 -23 15 -80 34
2442C4m5l6L4K3O6q7J3lo5J46m8m2M2o3L6L4k9J48o3j72K50M6k05L4J00j92J3
2469c1M3r7j0M3J02m8J35n9Nj22r4J87j01K27k49LM9m3j5O9j80J82o2J5P9q3N5
2496@j2O0Qo5j2j04K6jj12J65M3o8J31J18j64r4J04kk3J07j00J25q9p6N9K4p0
2523b2o1K38j96K37k38j4j83J75m3J32j06LM9N1p6J5J57k65J50j81J27J05J38
2546A92l19Q0J37L3j15L0p7K6J50j08MM9j06J3p9K15j50j57J85K9j76J30%M5m1
2571a0r8R4l0J78j58j1J44k5q8J16k65J5J91r6J36p8J9j11L8J18j34J04p3P9n5
2596@J78k18P7RO7l5j17M4J5K1j09J33k17Q9l0m4J99n5Q2J1r2J02k12P2J21j36
2622d5k7Q2k5J42j07n6J33J55l95J19r6P6n7J69p5J17L7m0l58L07n5m7l3Q6m3
$$ plain form
2442 34 -11 -47 -13 10 76 -11 2 -1 -66 80 32 -10 32 -31 5 39 10 158 95 -77 173 219 14 48 148 -44 -31
2469 -31 12 -85 -95 -52 50 2 137 78 83 -39 -133 54 -47 180 -69 -66 -17 -60 -75 -6 -186 -4 -66 -51 28 -55 0
2496 0 -12 48 56 -9 -21 -125 -99 -100 -212 -47 -4 -72 59 177 13 -81 23 21 -2 105 5 130 41 -35 24 48 -22
2523 -22 -83 155 -41 196 -42 -56 -239 -64 -107 25 -81 -78 -29 22 -54 -39 118 -147 3 -178 -51 54 192
2546 192 -127 -47 90 123 8 38 -39 -13 137 29 33 82 -24 -11 -90 125 -25 -182 3 32 -144 -14 -14 31 -10
2571 -10 -108 -14 -44 134 -24 -35 109 84 -4 112 -153 -138 53 -43 93 15 34 -77 -39 79 -55 49 -24 55 0
2596 0 178 -40 37 46 113 78 -39 5 20 41 -68 65 -152 -63 -93 -137 62 7 89 100 8 110 -102 -30 91 -45
2622 -45 -72 10 -15 127 20 -36 97 252 -143 -24 -120 -44 -101 68 -7 110 147 107 -251 56 1 -46 -79 7 -36
2647c6J1N6n1J28p6o7N0k2P0p6k7P7n6j7j5j0J71q2m4Q9n5q7K00k32J50O7j2j20
2675a6J20q1J18k99m4K96o3j07q3P2R2J5Q1l12J49J37j87J67p5Q7j25J91r3j21
2699h1K61j68q8J65Mj67J17m6k1RMQ2j47L47j80q6R1M4j79K1p0Q6P6j11J13j57
2725h1K10r3l3o4J14pK1q5J51j22J11j4j81N3MJ18k28K40j04j05P3J7lJ5k07J24
2751g6R7o7J6K3j32N9J50j65O8M4k2J02m8Qnj28K28k16n5J69k06J17R4p1K1j02
2777i7J0Q3M5j67J96r1p9P3Qrq1O4K66k05J65Ok21p4Q6QK1O7m7j8Q8q7j94K61
2805G7J60l96J90n8Q0J16j64p6l4J92j67N8j0Q4O9j72N8j0J78p1j95N2k2P6MJ80
2831A99k32L8j25Q6J81l16J15j55K00QN9j04P8l16J55K13m2J5n8J79l3l1j56J68
$$ plain form
2647 -36 -25 31 -20 108 32 -35 15 -7 63 -13 -40 37 -19 -36 -51 -61 110 28 -16 73 18 -69 131 -101 49 116 104 -16
2675 -16 104 23 141 -158 -202 94 31 -76 -159 -87 5 20 101 -211 -62 75 -112 55 -20 67 -58 133 40 -81
2699 -81 180 12 -76 89 93 -74 43 -3 -24 -15 -11 71 -76 271 91 5 96 140 -39 -18 -88 -2 74 -37 76 -81
2725 -81 129 36 3 -61 53 46 67 -18 133 11 122 108 -73 -20 -16 102 -126 114 10 -95 -22 -5 -8 7 -200 -76
2751 -76 21 -46 -30 -7 -139 -80 70 -95 -27 17 -5 97 49 57 52 -76 152 -64 -119 50 -156 -39 55 -16 5 -97
2777 -97 -87 -4 41 -126 70 -21 -100 -27 -19 -28 -109 -45 221 16 181 187 -34 -108 -22 -14 7 74 27 9 97 10 -184 77
2805 77 237 -159 31 -27 53 169 5 -71 -105 87 -80 -22 -32 52 121 -51 7 -3 175 104 -91 -39 -61 15 19 199
2831 199 -33 5 -120 -34 147 -169 -54 -209 -9 -1 58 -46 32 -284 -129 84 42 57 -1 178 145 114 -42 126
2855A26q5j07O8rk7j06KK09J25k86O0J5j9m9J61j17J4L7N6N8j38O7L6jj59K02
2881A33j72J13q9o2N6J81k09R3J7j01k5Q5N6l06J72J57j39O0j33R8m7P4k5QJ91
2906A86j57Q0Qj79P1j45K28o0j05J02O5oN3k27O1K52j21j76J05p4o3J01l9r7J99
2931F2k15K25k32K19J8j27j57J36j8N7n4M9L1m2J01j18J76k53L44j92m3o2J92
2954I7o2j12M1K1q6m4M1J11r4M0P5k37L26j16Q2l00J07J18Om2K11j81N9j91L6
2979i4J68r0N5n8R6r5l3N9j07m1J19j8p6R4J1j58L50j80k0m1K27p7k4K9k19J44
3005B1Q5o9m2j82J02P1q4O6M1J7j7P5j52R8p4Q2l7m7P1L3k3r6Q4m1J17j68n3J33
3033A1j11K83k93PJ19ol8K1n9l2J52pJj37K34j97J07Q9l3j94K34l1m0J8K0j66
$$ plain form
2855 126 41 -66 2 -7 -34 -140 -138 71 196 -90 -30 -15 -34 -83 78 -39 -25 12 68 126 -12 55 91 90 -69 133
2881 133 -39 74 -15 -77 -21 160 -49 44 61 -40 -65 20 76 -230 -58 99 -40 20 -113 -15 -62 12 -13 -5 186
2906 186 29 109 117 -62 9 -136 92 32 -73 29 94 88 141 -86 -25 227 106 -70 35 -39 -102 -1 -40 -137 62
2931 62 -153 72 -160 59 77 -50 -207 -71 -89 -32 -86 -37 -6 -48 53 -65 111 -142 202 10 -33 -95 97
2954 97 35 -77 -36 -15 -101 -145 -104 7 -87 -47 28 -209 117 1 83 -217 -110 8 14 -28 183 2 61 -130 -94
2979 -94 74 -16 39 -19 77 -18 -51 8 -99 -140 -21 -39 -115 -21 -10 -168 182 2 -18 -59 168 91 67 96 -123 21
3005 21 106 37 -5 -187 -85 -14 -98 -32 9 26 9 84 -68 30 -44 38 1 -46 25 58 35 -61 23 -18 99 -69 -122 11
3033 11 -100 183 -110 -103 16 10 -28 -7 -66 -98 54 47 48 -89 145 -52 55 144 111 -83 151 120 80 98 118 -48
3059d8J37j06m0m5jr4K46m1M3p0O6K5P1q5k55L92j46o2J3K3K1Q9j58J15M3j25
3085HJ03j18p6l1O5J39j97M6K7n0K33k13J69m2j06K2K2nP9p4O0Q1q4J1j06M4k2
3112a5J65j27n1l0M3k9jP1O1k49K88r4l1O2pj16P9j73J75J1j17K55j49P6l0j34
3138f7p4rK02J4n4J36j00k2r4m7J54Q6j11J17o2j10%N0J27k98K08j5j35J47r9
3163e6rk2J2K27O0k34O0J62j06j28j24K19j66Q4Q6J05M2j56M9J8l1K4q5j65K82
3188A48o0J4j42L8qJ22j57J01jL9j1n6J1Q6o1o2l7L3o1K6N4r8K18K9k29J42k02
3215a24N4J20j07J80l7j56l7J62j95P0Q8n7J6O8K3o5P0L1j87K45p0j34J19nPj48
3241f9J42Mj00r6M2J30q8N9o2J6m7K79l31K40l8K7k03m7J85p3J61j01j48MJ32
$$ plain form
3059 -48 89 -17 -57 -102 -103 -197 49 8 51 -19 47 72 143 58 -197 195 49 -13 0 23 44 133 -25 90 133 8
3085 8 111 -7 -83 -114 -49 90 -107 -61 -34 -84 149 -64 105 63 -43 -21 1 -4 75 1 61 142 58 69 -37 7 -15
3112 -15 150 23 -28 -58 -15 -44 -45 26 87 -162 126 32 1 63 56 -60 19 -154 21 32 -85 170 21 97 67 -67
3138 -67 -141 -150 52 66 12 148 48 26 -68 -115 39 125 14 131 69 -41 -41 9 136 -162 46 31 -104 43 -56
3163 -56 -65 -87 -75 152 212 -22 38 200 94 -34 -158 61 -105 -21 65 170 212 56 105 123 92 116 31 -134 148
3188 148 88 102 -40 -2 -10 112 -45 56 55 94 83 27 38 124 63 1 -36 -3 -64 -38 16 -82 136 165 -64 78 -124
3215 -124 -70 50 -57 123 86 -70 -107 55 -140 -70 18 -39 -23 45 68 3 73 104 -83 162 92 -42 77 72 79 -69
3241 -69 73 77 -23 -119 -77 53 -35 24 -38 -22 -69 210 -121 119 81 108 -95 -142 43 -30 131 30 -118 -114 18
3266A8J44j21p2J8n7O1j4K3o7J84j98qJ7l8J61o5J40n7l0K5o1J15q9j16K99k21
3292iJ66j72k8R3j48K1n4P3J41r2L6K0K0r7K7J59k63K63k13K74j49l7j42O6P3
3317B8p0J29RN2j6o6P0j41N4j56MN0O9l4N2m5K7R9l35k6L57r3j0j9K0r1J35k1
3345C2j84J38R2J3k05J64j09J26J1l18L48k04NJ85j92J15P8r8j42K06q3o7J70
3368H1j45R0j52N0J67k2N2k16J67r1j28J91L2k15N3K38o4j98J10K0n7P5m2J37
3392A33j36lm4J17m4j10K43Mj73K11k93J06j0Q4K6r3O0P3p2j17l6r8J00M2k3J29
3418G6J6l76J99J83k15K91j57L2L4n5n3l4o3K54n4N6r0j96M5J28rJ3j25K0M8L4
3444Bn1j3qJ80q3j47K42r0N8m0p7K9j77J76j2J44k61J42J24j94J18Q1j43l9n7
$$ plain form
3266 18 162 41 -31 -13 -70 -9 -23 0 -67 117 -81 -89 -72 -110 51 -14 126 69 39 64 3 118 29 -87 212 -9
3292 -9 157 -15 -43 50 -98 -77 -131 -58 83 -9 27 47 67 -30 -3 156 -107 156 -57 217 68 31 -111 -45 28
3317 28 -42 87 96 148 132 66 136 -5 49 -107 -103 -53 16 -18 34 -11 16 115 -220 -246 111 18 8 -11 9 -82 53 32
3345 32 -152 -14 78 91 -114 50 -59 67 78 -240 108 -96 -91 94 -98 17 95 -3 -145 61 -22 -89 81
3368 81 -64 26 -126 -76 91 69 121 -95 72 -19 -147 44 76 -139 -86 152 88 -110 0 20 -37 38 -4 133
3392 133 -3 -6 -50 67 23 -87 156 160 -13 198 -95 11 1 85 111 18 78 151 79 -38 -74 -172 -72 -30 -53 76
3418 76 92 -284 -85 98 -117 174 17 49 83 28 -25 -59 -122 132 78 134 44 -152 -107 21 12 25 -100 -80 -32 2
3444 2 -49 -62 -70 110 27 -120 122 32 90 50 -27 2 -175 1 -11 133 -128 14 138 -56 62 143 0 -39 -96
3469i6j1R3K4Pj34n0J82n5J10o8J33j63J55k9Rj92k5K57o0k21K40j52J58r3j04
3494h5R3K7K4J0j55o7Q6KJ55N1l9k40J66j01J15k0p9M0l3K60j54J7j91J53lp4
3520d2P3k6L4N3ro3P6j77kR3j3K07j51oN9j55R2j65J71j78R0J10j03M6K6n1R7
3547H6lm3O6j04Q1Qj8j10OR6P2L1j44j92l3J91j9P0J22j88j13M6M3r8J53j28K49
3574A27q5j00KJO7J02o2M3j6r7K19k47J9k82L16l5QJ5Q1p5P1RnJj44P3J10k03
3602h7M7J34o7o6P3N6k21P6o9J95k07J69l5o8M3J3p3%J16J77j91j7Nk48K60j62
3628a47m1J79j10O1N2LR2k9j08m7J79q6j28K15p7l7L9o6Q9JR1j62Pk1L4P3j23
3655f7J83Kj31J32k89K09%j0q9m4K57m7q3p7J45j48J18j20N8k24M11j8k75J49
$$ plain form
3469 -96 -107 -14 10 17 -117 -167 15 -40 70 2 135 -28 127 98 107 -85 -110 147 87 -134 106 -46 112 19 -85
3494 -85 8 35 59 69 -86 -153 -67 -65 90 141 102 -138 28 -73 42 22 -57 -17 -50 210 56 73 -118 35 32 -42
3520 -42 31 5 39 92 83 20 96 -81 -83 10 -3 204 53 47 106 -49 43 -122 49 -129 -39 71 -32 14 40 -11 86
3547 86 83 40 106 2 83 91 73 -37 -31 65 137 168 24 -168 -201 -10 -29 41 163 -25 -138 -92 -49 -147 6 -122 127
3574 127 42 -58 -56 -55 12 114 52 95 79 -18 201 -46 -27 -309 7 -28 -20 -5 76 1 72 81 76 77 -67 6 116 -87
3602 -87 -40 94 27 -39 34 90 -131 -55 -124 71 -136 33 -2 -70 -27 -14 -87 -87 29 206 15 -2 3 -245 15 -147
3628 -147 -188 -9 -119 -58 -6 -3 89 60 -48 -95 84 -2 -130 85 8 -29 10 -56 33 34 125 -37 -30 -51 -17 56 -67
3655 -67 116 118 -13 119 -170 39 39 29 -60 -104 153 106 23 -54 91 -57 61 -59 -1 -225 186 168 -107 42
3679D2O3j58P8o0J09r4K7J5j18J29k1o2J06k06K53j50L1N3J3J9j14K71j40j47
3703f1P4Q1j55j5J12m3l1O4j26J75j6l7k51K67l0J34j25j00J39j11Q9J23m7j01
3727IL4j91K38o8l0L4j11P9j64J89j00R9K4K3j74q6K55m4j19J54o8Q0J5n6j83
3752a61K43r9q3J72j99K67M7r8j07OK7l0R0k52L26j50m5q2j36L43j49K26j19R0
3776A27j85j24J43R6L2k29K4K16j16j26J56l3M2O5p1j77J15J44J12l16J23J04
3798A22j52J22k25J06RM3L9k03K94k38K31n2R6j39j84K29l8J2m8j67J40R5k4j95
3822a27J78q5P2k8J70l18J12p1O3M5p3p5k0J67K3O8M8j17q6Q5rN5j11J3O8n6q6
3849i5J46m7q8ok13L96l9m4l3lJ32r0J1P8Q4o6j26N4m8J11q5j4J2j61N7O7k7K10
$$ plain form
3679 42 105 -53 25 -35 74 -20 7 22 -96 33 12 -50 56 -150 103 -47 -16 37 50 69 -45 226 86 -61
3703 -61 13 94 -61 -76 36 -7 -38 26 -100 75 59 22 -229 38 8 142 17 -83 56 -55 34 157 110 9
3727 9 43 -148 90 22 -8 26 -85 -6 -170 19 -81 18 42 65 -109 -195 60 16 -103 51 -17 63 78 22 -161
3752 -161 82 -17 -100 72 -127 140 187 89 -18 -12 15 -15 75 -177 149 -1 -46 -128 -264 79 -70 156 37 127
3776 127 -58 -182 -39 57 89 -140 -116 100 -16 -142 14 -19 23 88 17 -160 -45 99 211 -105 18 122
3798 122 -30 92 -133 -27 -18 25 64 -139 155 -83 148 96 192 53 -131 98 60 72 24 -143 -3 92 68 -127
3822 -127 51 -34 38 10 180 -138 -26 -97 -34 11 -62 -137 -157 10 33 101 149 32 -54 31 22 77 -34 -21 47 -9 -95
3849 -95 51 4 -84 -90 -303 93 54 10 -23 -26 106 16 27 105 189 123 -3 51 3 114 29 15 27 -134 -77 -10 -37 173
3877A73l14J87K3pN8k02J05k6M8J09j42K3L3k26J73J93k88O1rJ22k35k2J15l8
3901h6N3P6J32m0n0r3N6j69J05QO6P1j30j59K14r0J23p8m3l2O0J6P9j84J99k55
3927a51J09R3j36J80k03L80k58j23MJ73k6Ol5R1j72P1J64k63K25j05N4j11J37
3950A04k37L16k54N6N3j2L9r2j7q2M8J03J39P5k38M1Mj46J86o1K7k4J9J4k9r8
3976f6J11j36M8N5j19J28L5j74K77j93L9J8J4J16n8o0K1j70mJ05J19j46R5Q4j46
4001gJ02Q6j73J18n6j08J46p4j29K82k85N3O9M1k11K21j03JK2j9M0O6j49M2o3
4026h8NJ28n1K2j45J55k9P1l2nj23R3K01l3o1j45J32r2M8J3o7OM9j13J01p0L0
4053@J02L2j78R7k8J0Mj2j58N2J90L5o5J4MJ5m3k33K31m6r3J12OO0o0lq1Q4J5
$$ plain form
3877 173 -141 46 69 62 120 -82 23 -3 45 154 12 35 68 -158 15 208 -80 -19 -28 94 -141 -163 -48 -86
3901 -86 -33 43 175 135 85 -8 48 -121 -16 -8 58 129 -1 -160 54 -36 87 9 -34 -66 -6 10 89 -95 104 -151
3927 -151 -42 51 -85 95 -108 272 14 -109 -105 68 42 48 13 104 -68 3 167 -96 129 24 78 -33 104
3950 104 -133 183 -71 -15 38 26 65 -27 -44 -126 -78 25 164 239 1 42 46 -100 86 25 52 28 47 61 32 -66
3976 -66 45 -91 -43 12 -107 21 56 -118 159 -34 5 23 37 153 95 35 56 -114 -118 -13 106 -40 55 139 -7
4001 -7 95 181 8 126 70 -38 108 34 -95 187 -98 -45 24 65 -146 75 -28 -27 -5 -24 16 82 -67 -25 -88
4026 -88 -83 45 -6 16 -129 26 -3 68 36 31 -92 1 202 169 108 -37 95 3 51 64 -3 3 52 -61 40 -30 0
4053 0 102 134 -44 53 25 35 39 27 -131 -79 111 146 81 95 99 114 71 -162 69 23 -70 42 48 108 48 45 -36 48 63
4082F3j64K45r8K2j04m1M6J9J26j52N7p8Q3nJ35j37p7J52j98L2N6L3k3j02M8N1
4108a1L0%j58P5J50n6k28Q3J15q6R9q7J59j76j42L96l67L95k14j14K48q8Q3r0
4132A6n8%n6J02n9L7k4m9O1Q4R7k09K46k04P9j71J4L8M9M2K1p0pj9j0%L8l4P2
4161B6J4M8j40R8j24J29m9Q4k2P9Q6j64j12K85k16q6J10J33k19J60k2nn3N0j23
4186c3l5J67k81L21m7p3k06K48r6P2J18j50k27L84l00J02R4n5O6j87J14k4Q2K
4210E6j53J9q2L23n3k35L57k49o4P7p9Q7j33Q4K18j75J6j4o5P9q2M1n9J67n7l5
4236a1J24l0j45J34j79O7M0J4J6M8j21L0O4j84L01k13N1J6P4j54N1P2j57J00o8
4261f0J00n3J51l7j87k2L2o6K19Q7k4k10O9L0Q9K0l20K38p3L2l0m5P0P2p6r0P8
$$ plain form
4082 63 -101 144 46 68 -36 -77 -31 -12 114 -38 19 -59 24 19 154 17 -60 92 -106 -74 -18 15 -8 -110 -62 -11
4108 -11 19 19 -139 -64 86 30 -198 -115 0 -86 13 -74 85 -91 -233 163 -204 191 -23 -137 111 23 106 16
4132 16 -42 -42 -98 4 -55 -18 -42 -91 -30 54 151 -58 188 -16 63 -108 -94 -56 -7 35 56 -14 -21 -40 -50 -50 -12 -46 26
4161 26 40 88 -52 46 -78 51 2 86 64 143 229 65 -47 238 22 -64 46 179 -40 120 98 93 40 90 -33
4186 -33 -68 99 -182 139 92 19 -187 61 -35 37 155 5 -222 162 -138 -36 58 3 69 -118 -4 -28 54 56
4210 56 -97 -78 -160 163 110 -125 232 -17 -81 -4 -83 4 -129 -45 173 -2 14 0 -65 14 -68 -27 -86 81 24 -11
4236 -11 113 83 -62 72 -107 -40 0 14 30 78 -43 -13 51 -133 168 -45 6 22 96 -58 -7 65 -92 8 -60
4261 -60 40 -13 138 101 -86 -108 -76 -142 77 164 140 -70 -1 29 118 138 -182 56 -17 15 -15 -60 10 82 6 -84 -6
4288fM7M7l6L2j00m6K1M9J60o7j43K9Pm2R1k9nr6J19N1j08J17q1j14J39r1P1n
4316A1j1p6l7L6P9l9J39k42K02n0m8M7J51r6j06O8L6Qj57L8O4k9J35j50Q0o1M5
4343C7M9L1j34o5jJ59k7n9j60J34M4J55j47R9q2p4qq1J50j13O4M0j42K27k63L16
4369A49j48m3%k0K36r0ol9O7N4j39j01M7j19J86j31J4R3K9N3k08J82j48J81J66
4394B65k21r2J6J22n1R1j68J05j2rr5K8j01L17n6o7o0k3m3l7J04k3j7j74K22O
4420B7K9j85K99k97P7j07J13P6p3k2j2K5qM6O3N7j56O5j00J28j41N4q1K52k0j71
4446f2J40Jl0m0q1J00j49Nn5J98l7MJ74j74J2J0n0K72m09K69K2j78j6J10j11Q9
4472A4mJ4j80J53M1L2l6j71L5K06J18k12Lk07P0J11P2j5q4J32r9q7K75j04n5j46
$$ plain form
4288 -6 41 88 52 84 -16 -62 -41 8 168 101 -42 -13 -6 -48 43 14 9 -87 32 83 -25 92 11 -103 36 -55 16 11
4316 11 0 -76 -113 -77 2 -37 102 -140 62 12 -36 11 162 66 -40 28 64 72 -85 -47 17 -12 123 -27 53 -8 37
4343 37 86 117 -17 -82 -83 76 49 -10 -170 -36 8 163 16 115 33 -41 -49 -130 20 -93 -29 11 -131 96 -167 149
4369 149 1 -42 -42 -62 174 84 78 39 106 160 21 -80 -33 -152 34 -97 -83 10 39 92 -116 66 -82 99 265
4394 265 44 -48 -32 90 39 130 -38 67 55 46 -49 -21 -122 195 139 72 12 -11 -54 -91 13 -10 -27 -201 21 27
4420 27 56 -129 170 -127 -50 -157 -44 32 -41 -63 -75 -50 -58 -12 51 108 -48 17 -83 45 -96 -42 -123 129 109 -62
4446 -62 78 79 49 9 -72 28 -121 -116 -171 27 -10 -6 168 -6 6 16 -34 238 -171 98 120 -58 -74 36 -75 14
4472 14 10 24 -156 -3 38 70 34 -137 -102 104 222 10 13 -194 -124 -13 59 44 -40 92 -7 -94 181 77 22 -124
4498a24p4K20Nj9o3O0N5M5n8l4l7ro8R1l6L3R5OK1j57J14R6j39r9J00K05k51j00
4526a22R3l0j3J62j41L0j69K70K12l52J94k81J31q9O2K94k26j2j20Q0N9O4k28
4549a32O8N5p5l3J43rK72k69j03J78j06m0J65j45O0j8K7j11L3J5J77j75n5J88
4573A10j32L9r4K1qK51k56M3k7O2J43l7q8o2m2K08Q7k18k5P6K5r1N4J12j00k5
4599B6N9j77J40k4j17RJ12l3j02J03J21n5K2j14J25k0j44K15o2k95K23O4j72R1
4623eQ4o4J34N3J8k48q2M7K60j90J70j70rL8O1q6j1p0LrJ00o1J12j69O5Q0M1k48
4651a56K38R9k70J18K0j08J20j3p2K21j06oj68J83j31l9o1L5j01J28N2K6M8j27
4675g0M9O1n5R2l3j44j0J86J05l11J53j55J60p7m0J38K2k2N0oj2o3jM5r0k05K35
$$ plain form
4498 -124 -198 22 27 8 -55 5 60 105 47 13 -24 -33 -101 -10 -46 -13 82 88 109 -48 66 162 23 -76 24 229 -22 -122
4526 -122 -29 -59 -72 90 -51 -21 -190 80 292 -60 134 -147 -16 -105 -43 251 25 13 -107 -27 32 96 -132
4549 -132 -64 -9 -84 -117 26 17 289 20 -83 95 -11 -51 114 -31 29 11 38 -73 -40 -25 152 -23 -78 110
4573 110 -22 17 -77 -56 -64 187 -69 -26 -53 9 152 115 27 -35 -77 131 218 0 -25 51 76 -15 39 151 51 26
4599 26 85 -92 48 24 -93 -84 28 -5 -107 -4 117 62 84 -30 95 75 -69 146 84 -211 12 76 -96 -5
4623 -5 79 15 149 202 220 -28 -110 -63 197 7 177 7 -2 36 97 11 0 -70 -67 -76 24 -37 75 -94 -29 51 92 -156
4651 -156 82 181 -89 29 49 -59 61 48 -24 197 91 85 -83 100 -31 -70 -131 -96 -197 -69 -17 9 57 -70
4675 -70 -21 40 -15 77 44 -100 -110 76 181 -130 23 -132 28 -49 -89 49 71 49 99 93 81 18 17 62 -28 -233 2
4702Bq1J13r9Q4j26J24j0j13N9P8Q0r4j18J51M5n5o4PN9j12o4P6K3q8J51kj12
4729h6O3p7J43l2km0J9pP1J20j66K2j1J3j46J01n1M9J62p5j15%Q2j24M2MR2O3
4757A14P6j56m1J07j3k9J6q7J86k90J80j55N4N1j0J56j63n1O6j25O2L3K8j53K30
4782H6r1p2P1N9j63J19J4j4m0Q4j01k0J32j63o8J10K39j26nj04Q0k9j13Q8k5J6
4808c6J77j50q8J28po4Rq4M3J73j92K36j98J17j65J56p2N2j8m7P1k3K52j23l06
4833a59J79R4k37P2j26J44O1j23K26j16j21J88o3k2j41J00J1J05Kj04J87k48J00
4856IK9l5L9j44O7P2k06J93P6l6L6j61P6M8j90p8K30l00K34J10j6k09K88o2j14
4881d4K7j2j31L04o7j27J01j22L62m01J8J92o2j91J68K0M0k01Q8J21k0Ok53K33
$$ plain form
4702 2 -79 34 -65 19 -107 17 7 -106 -47 31 111 17 -101 50 95 40 -24 -17 42 -70 -134 -58 -35 -123 28 26 -86
4729 -86 -23 -100 43 11 9 -31 -12 -19 52 172 6 28 17 30 -116 -15 -66 -17 145 70 -45 -45 37 -87 -45 -41 51 114
4757 114 190 34 -7 100 87 58 74 -13 173 -117 63 -92 -38 13 3 159 -4 -55 11 -114 -52 -19 9 -144 86
4782 86 -5 -77 -6 53 -110 9 23 9 -31 53 -48 -68 64 -99 -167 -57 182 56 51 -53 27 -2 -115 -27 -52 -36
4808 -36 141 -9 -97 31 24 -40 -31 -115 -72 101 -91 145 -53 64 -101 55 -17 35 17 -30 41 18 270 147 -159
4833 -159 20 114 -123 -51 -177 -33 28 -95 131 15 -106 82 19 -3 -144 -44 -33 72 74 -30 157 -91 9
4856 9 38 3 42 -102 -35 37 -169 24 100 64 100 -61 15 63 -127 -205 25 -275 -41 69 53 -156 132 70 -44
4881 -44 -17 -29 -160 144 77 -50 51 -71 291 -110 -92 100 38 -153 15 35 75 -126 -38 83 63 69 -184 49
4905D9j03j8K4M1R3P4R2l81lQ0O1n6K2M3o9m7L2K04j87P1N1j90J08o0J60o3p9
4932e1J40m3o9l7J1n9K85o7j19R2l3J8j34K14o9o2l5R1n8QJ06j09k7p5O4J19j04
4959ck7O9j6O8j0j65n5L1j2J24N6n6J00j46J79r7J10j46ln1K02k14N8M9j38J99
4985A06l6nJ0m4L3M2P4k31L3m1J28j64N4lr3P8J28l6j15p4K57L2q7p0l8n1K20
5012A07j24O4q5NJ9J39k78K62j32O4J8q4O0j17J51j24jJ29j10P6o1J04n5K04k03
5037B8n8o8N2m1J08k6j34K20RK0MP9j30j08n6K1J6l0M4J9J66k06R4k0p1M7l2J41
5065H8j31q4J81mK7k6j6q5P9o7R7j20R2q9p4J18K3J14r2K3k08J34K76m54K61N8
5091A21j84J12p9O7J05p0j17oK17j24l7q3J72j3l2n3p8K06J4r9L7K0k49J97q2
$$ plain form
4905 49 -54 -72 -48 -7 86 160 252 -129 -132 -52 9 -47 -25 18 -51 -98 -66 138 -49 22 73 -117 -9 -69 91 28 -51
4932 -51 89 46 -23 -60 -49 -108 177 110 -9 83 50 68 -66 148 79 17 -18 73 15 23 129 20 -7 -82 -18 101 -3
4959 -3 -30 39 23 91 81 -84 -139 -108 -120 4 60 4 104 -42 137 40 150 4 1 -50 152 -62 -4 45 -93 106
4985 106 70 65 75 31 64 106 180 -51 -18 -59 69 -95 -41 -44 -137 -59 69 33 -82 -156 101 133 46 -24 -62 -113 107
5012 107 -17 47 -38 -33 -14 125 -153 109 -23 41 59 -25 35 -82 69 -55 -56 73 -37 39 -22 82 27 231 28
5037 28 -30 -98 -46 -87 21 -5 -139 81 90 110 114 193 63 -45 -101 -80 -64 -94 -50 -31 135 -71 23 3 -68 -21 -53 88
5065 88 -43 -127 54 50 77 51 35 -50 29 -38 59 -61 31 -58 -132 -14 9 123 31 54 -154 -20 256 -198 63 121
5091 121 -63 49 -30 37 142 72 -45 -51 166 42 5 -78 94 81 49 -4 -82 124 138 39 76 96 -153 44 -38
5116c8m9M2k5LJ96r2N2j84J04P3O7q7L6r5K4m3o3Q8K4r5K48l26J39K1J2n1j8j26
5144a63J2K14r1J30j04l4K8k1j02K76k6k05O0P4j31o3K25o9m9O3k2m9L9n6K13
5169A49k21K60l12J36J19k25K36j96K33q5m3k01R8J21n1J65r1j82J98l8n4L6j4
5192C8m7l7N3Q7j7k5mPq6l7J6l9J01r6N9R4k62J82l6O2r1k5M0p3R7p6R2O8k3N3
5222G5j31O6k12R8J34J36j41J85l26K12j13J4K0k13J13K20o4j21K03j19K4j83
5244a23J3J9J65O8j14kQJ32k08K83j67K8J66l70K34j66k6K07k5n9oj02L1J13r8
5269AQ7j26J11M1J85m46K21R2j9j31K24j20j72j13L57q2k87J90Q2k40J68l1J24
5292A16j2k7L2j09O2j14J48j51R8m0QL0mj31K3J93p4N8r5r1J00J08l3k08M9J67
$$ plain form
5116 -38 -87 -45 -70 -67 129 37 89 -95 9 82 149 62 98 3 27 -16 -79 9 33 -62 186 -140 -1 20 32 -19 -37 -163
5144 -163 -151 63 -28 102 -2 -36 -8 -29 -131 145 119 -86 -26 48 -83 -146 79 10 -39 24 2 -47 -8 -64 149
5169 149 -72 188 -124 12 131 -94 142 -54 179 94 51 -150 -52 69 18 183 92 -90 108 70 16 52 38
5192 38 -9 -46 7 94 77 52 48 55 -31 -68 -52 -91 10 -86 -27 67 -195 -13 -49 13 -78 -103 -63 -136 -39 -115 -23 45 22 75
5222 75 -56 10 -202 -104 30 166 25 210 -116 96 -17 -3 17 -196 -83 137 73 -48 155 36 60 -123
5244 -123 -110 -91 74 142 28 26 34 166 -42 241 74 102 268 -102 132 -34 -60 147 122 63 57 -45 -14 99 1
5269 1 88 -38 73 114 299 -147 74 166 147 16 240 120 -52 -165 192 110 -177 13 95 -145 23 -8 116
5292 116 104 77 109 0 62 -52 96 -55 43 3 11 41 37 -94 -71 122 48 106 11 -80 20 128 95 -113 -64 103
5318A03p2j86K59M2k85J96J40n3j50m0q3J67L6k21J8K70m6j07M8J43j31j80J78
5341D6Kq1j06KJ10J32j43M7P3j11P5N6j3j12PnN9N4j89J93R7k75O3n3N6J69k47
5368i4j3J26QO4j56J20Mj82J41q4R0K5j20r6J96q3J36m9N1j26N9O1n2l5R0Jj76
5395i4L2Q9J06k4M0j57mj23O9N5k6k9K69j93p6J37q8R0j09M7j30J70J15l18J8
5420a34Q4O7J15j09P9P3m15K43j69P2K3J41q7O4M1Nol3o0n1pj28J16LoJ99l1n1
5448C8q1Q3j0J36M3k05k2Lm3K14j36p0K07l93K40P7q1j8r0n2O3PJ64N7j11k57
5474b37L10o1M2L5K5L3j29j41R4j64J53P1j3j50J56l7q5K98l11J05j15J88j08
5497d1K9MqN2R5k26L20k66R7Jk29K98k56R5M4k2o7J50j26kK27j23k21mOJ68m0
$$ plain form
5318 103 31 -155 104 146 -139 57 197 144 -6 -46 -129 38 74 -147 -129 141 95 -12 36 179 48 -132 46
5341 46 48 -33 -139 -137 -27 105 -38 9 82 -29 46 102 89 -23 -16 -21 38 92 -97 96 193 -82 -19 -72 -16 153 -94
5368 -94 -107 19 27 91 -65 55 59 -123 18 -66 24 49 -71 -167 29 -54 82 33 84 -42 17 78 26 -9 81 82 -94
5395 -94 -62 27 133 109 149 -8 -12 -135 -66 -11 -37 -66 203 10 -66 71 -17 73 -36 11 -119 51 166 -152 -134
5420 -134 -50 17 132 23 102 175 -240 3 -166 -94 -71 70 -17 47 88 93 87 54 -6 -57 -64 -192 -76 -73 -79 120 89 38
5448 38 -43 40 30 166 209 4 -18 -15 -58 156 20 -50 157 -236 4 81 0 -18 -108 -160 -97 -90 74 131 20 -237
5474 -237 73 12 54 89 114 147 18 -123 -29 -193 -40 31 18 -132 24 -13 -98 200 -111 -6 -121 67 -41
5497 -41 -12 -8 -16 36 131 -95 225 -41 56 57 -172 126 -130 -35 9 -13 -80 70 -56 -58 169 46 -175 -179 -173 -5 -45
5524d5r3K40o8j58R1L8n8PoJ55n5N7j62k3J37j61K56l9j41P1P2R1j04pj29K9J75
5551A70k12J2J07J1j11J19j47J18m7k7M4o4j0j31J88q9K6K57j70n8J9P0j86Q3
5575b8k13J41j30K54J08k09N7q6J14J84j11p6j03K10j32J20P7k56L8K8J13j45
5597d5M9k3n3R2r6kl8J25j58K39j83J10p2P5j00LP8j04R3j9M5k6k1K16k13M1P4
5624H7j87m3L1n5K34j07k56L42q2p7O3J03k06J09j12J82j0J05j03Q0p9p5J28N5
5648A27k07J55j49L6M5K4j6l1PM8o2j2n4n0J8P5J45jN7l04K09k44J68o5j8R8m3
5675d4O6j42L17j74j62J58n9O6P3o0o9M5J62j57o8J6J0J08M3j09j4NJ3j62mK26
5701H4j29o0N4l6L7R8Qj11P6J6R6p0p6j06J95j54K7JO8Pm3P4o1J11j5J3j22K29
$$ plain form
5524 -45 -138 102 34 -124 -33 5 -53 -46 -52 103 48 105 -57 -80 57 -104 152 113 -28 43 115 206 102 95 -34 -5 170
5551 170 -42 -30 77 88 -23 96 -51 67 20 -7 37 -27 -37 -168 20 -69 -43 214 44 -14 5 75 -111 -28
5575 -28 -241 -100 -230 24 132 -77 -20 -106 8 192 81 5 -98 112 -20 100 177 -79 -41 -13 100 -45
5597 -45 4 -19 -72 20 -76 -78 -116 9 -149 90 -93 17 -55 20 -80 -77 1 -103 -10 -29 16 -10 -31 185 -28 13 87
5624 87 -100 -143 -112 -167 67 -40 -296 46 -36 -113 -50 53 -153 -44 -156 26 16 121 18 98 19 -56 72 127
5648 127 -80 75 -74 -38 7 31 15 -16 -9 39 -23 -35 -89 -139 -121 -46 99 98 155 -149 60 -184 -16 -81 -99 -1 -44
5675 -44 22 -120 197 23 -139 19 -40 26 99 39 -30 15 177 20 -48 -32 -22 86 129 20 6 11 24 -138 -142 84
5701 84 -45 -105 -51 -87 -50 48 56 -55 21 37 133 63 -13 -119 76 -78 -51 -50 18 25 -18 56 -5 106 91 104 -18 211
5729B11k54l6K57l16J61N2r1J42l6n2n2k3K36m21Q7R9J48j7l6N0j98J8N1k00K20
5754@q6J30kL5p8L1M9r2Q9K4n5Nk3j48J08J05j87J12j10J80j26J02o8N9K7q3J
5781aM0p4k4N1K2K6K7L1P8k31PJ57m3r2j45J81J0j3k36L32j74J0J68j38J00k1
5807D8j1n1K5J18jo6k01J59K5j16l1J19j63M8K2M8J29j60J43j35p6N1J52P0k24
5832g8l2O9k4L5LK1R6j34J41Lk3j60K00K8j93N7J04j98M6K6K7k5l4Ko2P6J65j42
5860fj21l6J34L42l44j06J38j3j09M2M3RJ50K4j51L2k8j08J51k6K6P0j37k6L1
5885a9J84p2k08P8j39J53L7pj4j54O0J84j84Q6j09O8k4P5r1K42k24J43j20J36
5909H1m00K50K4k6J78p2j06q4K04Q4j60K62l54K6J46k40K65l7j88J26J53k27O9
$$ plain form
5729 211 -43 -79 178 -138 23 75 -16 126 90 38 -14 -37 199 -222 -135 -36 112 95 59 109 -89 -71 -20 -220 0
5754 0 -86 44 42 77 -1 30 79 -13 76 100 45 50 27 -121 -13 92 -95 17 -93 87 -39 63 -5 54 81 -2 -1
5781 -1 39 -35 -59 -8 14 40 67 98 176 -55 -48 109 66 -26 -171 10 20 7 -229 103 -71 -61 107 -31 69 48
5807 48 37 -14 11 129 128 62 -139 20 45 -71 -102 17 -146 -98 -76 -28 101 -59 84 -51 -127 -76 76 146 -78
5832 -78 -110 -41 -65 -30 -27 -6 90 -44 97 100 77 -83 117 145 -48 9 113 -85 -39 -13 14 -11 -45 -43 -105 -29 136 -6
5860 -6 -127 -163 -29 313 -31 -137 1 -12 -121 -79 -36 -27 123 147 -4 28 0 -108 43 17 43 113 -24 -50 -19
5885 -19 165 93 -115 -37 -176 -23 14 7 -7 -161 -101 83 -101 -15 -124 -56 -80 -5 -96 146 -78 65 -55 81
5909 81 -319 -69 -45 -71 107 35 -71 -155 49 133 -27 235 -119 -93 53 -187 78 41 -147 -21 132 -95 -26
5932b6j3J83j69q8P2J43j81J8k30L62Q3j26RO1k15J84O0k1m7j08o1J69K2rn3o5
5958d6RpL9R0l8j59M1N3r3P1QJ5L5j77J18n9K31Jk73J00J09J6j46M7r0J19k8K31
5986B17j06o4p7J47j70Q4Q2j01N7m4j31l4K58m3L3q2m7n5R2J8r4j19K84l1n8L
6012A9nO1k2R2j97pj6K09k10LJ80p1qj01K15k95J5R5j08K74j77J13q7oP2k08J48
6039b2k76M16j46r2O5Q1j28j1K47O2j76j54J56lJ10r3R7k39J4J21R6p8j05j12
6063a70O1J46n9K13j21j27R6j04P4rK8o2J06P4k20Q7N7J1k18J62l4R4k52J27P1
6088C1q2q4K00j49J00m5k3O3j5o2J2q2K87r4j97J71j51Q3K2l3j85J24J35k80M29
6113A75j78N%Q1j36kQ3m9P1nj71J15j1R0j3j18N9J4J03j15L1q9J95j63Ll8Q5q5
$$ plain form
5932 -26 -39 144 -25 -113 -41 102 -79 -61 -291 71 154 28 37 98 -117 67 127 106 59 -49 -110 59 81 72 19 -46
5958 -46 -37 -44 -5 85 47 -112 -71 -18 -111 -40 -32 -17 18 -159 -41 -100 131 132 -141 -41 68 84 -62 -15 -105 14 -14 217
5986 217 111 47 -30 117 -53 31 113 12 69 25 -106 -140 118 75 108 26 -21 -76 16 34 -60 -179 105 74 16 19
6012 19 14 75 53 145 -52 -59 -75 134 -76 -73 107 36 28 -73 142 -153 -138 -43 -151 123 -54 59 -28 -34 38 -170 -22
6039 -22 -298 118 -28 -120 -55 26 -102 -113 134 196 20 -134 22 19 129 36 133 -106 -92 29 125 47 -58 -170
6063 -170 -109 37 -22 191 70 -57 39 -65 9 0 28 -34 72 146 -74 13 70 81 -137 25 -9 85 -167 -40 31
6088 31 -51 -135 65 -84 16 -29 -52 11 -4 -66 -54 -136 151 57 -140 31 -120 -37 -15 -48 -233 -109 26 -254 175
6113 175 -3 2 2 83 -53 -55 28 -21 50 45 -126 -11 -22 68 55 -63 -4 10 113 -2 29 -60 135 -28 -25 -63 22 -63
6141f3J11o6n6k1k3J78JJ13l10J04L3J31k56N8l4N4R2L2n8P3K6k09J32n1r7K38
6167A32j29N8rk0j6k3r1M0J53k12K1n7K63k23J04o5J34n0j21J07j82J68N8P2l9
6192G3j0m1Ok8J1R1r7P2j25O4p9P1Oq7J68p3K4N2p0l7K9j03K11j39j47O9J42j2
6220D1o5m9J89K9j03M0k12J83j21J37j64M0j04m8J65j23K58k9q9o6J98j62J8L4
6244cK95j88j33J24j69K4J04r0j29K77k11j4K80k73M1J68j43J26j28J75k79J93
6266D7k76J52N7k4j43J96l6P3NN5k4K4JQ2k71j62K75P2Q5j81o1K2O1j60Q2n8K99
6293A92l1j25q0J15n9O5j51r5K20j02Q1j90K31P1k62K9k3l3l0K10o6K7K3n2r1
6318a26K73p0p2j3k11M22k12l7J05k8k1J7j12L07j63r0l9K57k50Q7J24k81N2J88
$$ plain form
6141 -63 48 -18 -74 -95 -118 60 61 174 -136 -32 1 132 -124 -66 -100 -46 46 78 20 93 119 -90 42 -9 -106 132
6167 132 3 61 52 32 16 -7 -98 -58 95 -117 -96 -153 110 -113 -9 -74 60 10 -111 -4 -186 -18 40 112 73
6192 73 63 22 28 0 11 102 5 77 -48 16 -63 8 14 -73 95 22 46 98 28 -9 20 -83 128 -11 -158 -89 53 41
6220 41 -24 -73 116 145 42 82 -130 53 -68 69 -95 -55 -159 -207 -42 -165 93 64 -25 -91 107 -55 -37 -3
6244 -3 292 104 -29 95 -74 -50 54 -36 -165 112 -99 -113 167 -106 -65 103 -40 86 -42 133 -146 47
6266 47 -229 -77 -20 -44 -187 9 -27 46 51 106 82 106 107 189 -82 -244 31 103 188 7 -54 -32 29 -131 -49 -107 192
6293 192 161 36 -44 71 12 77 -74 -169 51 -51 30 -160 71 142 -120 -91 -114 -147 -177 33 -33 -6 17 -35 -126
6318 -126 147 77 5 -8 -219 203 -9 -46 59 31 10 27 -85 222 59 -31 -70 187 -63 24 148 -133 -81 107
6342A07r8j87K60pr1J9K3j88K13m0m3kP7J66k90J52k68K60k4Qj95J42q9q8L86
6367B03k31L2K2m4M1j02P5J33j84J14q8q9Q4l1J42j23J38L5k67J44M1p0J47oj92
6392g6J60j80J48K5j36l1oK80k80K05j56j40J04R6L4m4M9J8m4nj22O1P6k6l9j0
6418c9J97n7o8O3j84J64L7p5q1j0M6J53o6l4j86J45R7k23L43j34l3j47K17o8K0
6443G7j00J3J18k4m9q4J39J3m6o9o1J46p1J2Rj32J35m3J43n7n1J1J20n1k7k3j19
6470g1mP6Rj30L9J48p5j08J52j6l1l2R7o5j08J72N1j47K12q7Pj96K20j63O4l1
6496a7J12k14L5L0M2Pj11J75j03jk53L07Nq8p1J8J34O6L5n9j02J83j29N4q0J23
6522I8r0p1K26n6L3k21L8Q2j15n0K53k93J55J44l77K85k34K71N5p3k37K73j59
$$ plain form
6342 107 9 -178 82 75 -16 3 26 -162 51 11 -32 -34 43 209 -81 71 -197 63 39 47 -148 -6 -95 -183 203
6367 203 -28 4 26 -18 23 -79 -4 129 -55 59 -29 -118 -34 -65 77 -46 92 127 -140 4 45 -25 122 116 -76
6392 -76 84 -96 52 77 -59 -90 -96 184 -96 109 -47 -187 -83 13 47 3 52 70 26 21 -101 -40 36 10 -29 -39
6418 -39 158 101 33 96 -88 76 113 38 -43 -53 -7 146 80 46 -140 5 102 -121 222 88 55 -92 125 57 77
6443 77 -23 -10 108 84 35 -49 90 103 57 -12 -73 73 2 14 23 -109 26 -17 126 69 18 29 149 98 71 48 -71
6470 -71 -75 1 10 -120 -81 67 -8 -116 36 20 -11 -43 54 -11 -119 53 104 -43 169 82 89 -107 113 -50 14 -17
6496 -17 95 -119 -84 -54 -12 -5 -116 59 -44 -45 -298 9 14 -74 -145 -127 7 73 108 49 -53 130 1 55 -25 98
6522 98 8 -63 163 107 140 -81 -43 39 -76 -126 127 -166 -11 133 -244 41 -193 78 133 60 -177 96 -63
6545f3j6J48j70K4J14O0q4o9j4O5n5r5K46k98J59K8l3J95k09J49j03J85j71l0
6569c7O8J47j12j49r3L12k64K16j47L5J28Ko0r4L0L0J5J9q4K56j43j39J41K6j32
6594b9N1q9K4j18j4L26k78j5Q6m0Q0j65K13Mp7K1K1j01r4K30o6OJ69k26J46k17
6620a52O1K3R4j53L10l00Q9R7j12M4r0K18j62M3J06j20Qj6K5J6p2O9j06J19p9
6645d0J37k24K86j71k7j3k05J82R3K6J69j86k44L49j66Qj38J09J25k31L69o0j01
6668D7J48q6j43l6J94k86K50o0j91K32k68K61kk7j87K14j33P7O7j5k8p6%J29r5
6693a4n9Q9j4oP8j19J42j16J35j46Q3J26l4j38qj67J88j74K48M9k78K06J27k21
6717b3n3L6M5j9K10j36p5J43R1k04J62k05J03j2j5j54J14j03J55J7j49J78r2J58
$$ plain form
6545 -63 -79 69 -101 -77 37 97 13 -56 -70 -5 -60 -155 91 -207 -48 -20 -53 142 -67 82 -21 164 -7 -37
6569 -37 31 178 66 -83 -176 136 -128 88 -59 -24 104 106 46 -48 -18 12 27 46 -38 218 75 -64 77 103 -29
6594 -29 22 -67 -43 -161 -175 151 -127 -142 -56 -96 -16 -181 32 36 -41 -20 1 -100 -194 36 -30 -24 145 -81 65 -152
6620 -152 -91 -68 26 -127 183 -117 -28 69 -43 1 -89 129 -33 10 116 -4 4 -12 13 29 -43 26 -80 39 -40
6645 -40 97 -127 159 -12 -39 -52 -257 -75 18 44 213 27 -217 132 -34 -26 -164 -55 70 -161 208 148 47
6668 47 195 109 -34 -70 124 -162 88 28 -163 69 -199 62 60 33 -154 60 -73 4 71 56 28 -48 -48 81 -14
6693 -14 -73 16 2 -4 74 -45 97 -19 116 -30 53 179 145 7 -1 -168 20 -154 94 143 -135 71 198 -23
6717 -23 -76 -40 5 -14 196 60 -15 128 219 15 177 -28 75 63 48 -106 8 -95 60 77 -72 106 14 172
6741A72j12k6Q4q1r9J37j11J22j57J56j3M6k01J45j5o9J06O7j11j1n1j07l7J50
6765a6m0J45j49J07rm8RK6K1p3L6j55J05J00jM5k0L0k15J20O7j09r1Nn9J47j03
6792a25N1K30k63J03P7j8j01J34k15K04j18K7o3R8k8n8L05j45j4j5j53P5RM9M8
6817I4l00L32j30j48Q7J20L6q0J30r2N2p1n6J31k11J38j01O2J37J0r2q4j0PJ5
6842b4Po4pJ86P9j04j9j31J25j00K22j13O8j47kJ20j32r8j0R4R2j97J83k8r9M9
6868e0P0J70k57K4q6O7K8Nk9rmJ10k79K53p4J08J04l09J49n6L6J89k68J28K9K
6894E1r1j8J48j70nJ67l8M5J0j23J92j78J16l4o9J14r3Q7l0j34J9Q2j18M9R7L5
6920A11k55K19j86M9%K63j45K3j39J46j09l4q8o5L44k91N7J82o9O3pn4K4J02k48
$$ plain form
6741 172 60 34 118 37 -62 75 -36 86 -71 85 72 118 -83 62 47 -22 84 151 40 29 -22 -129 -166 -16
6765 -16 -56 89 -60 47 38 -10 -1 25 46 -27 9 -146 -41 59 58 103 83 113 -102 18 85 -24 -115 -110 -169 -22 -125
6792 -125 -74 156 -107 -4 73 55 -46 88 -127 77 -41 -14 -77 21 -7 -65 240 95 81 66 -87 -12 -3 46 94
6817 94 -206 126 -4 -152 -65 55 91 11 141 49 101 30 -26 105 -106 32 -69 -7 130 140 48 -36 -46 -39 -24
6842 -24 -17 -81 -88 98 177 73 54 -77 48 -52 170 57 125 -22 -24 96 -36 -134 -144 -50 42 -155 28 0 -99 -50
6868 -50 20 190 -67 -43 -129 -62 -34 -29 -58 -67 -71 39 -240 13 -61 47 151 -158 -9 -65 -29 160 -108 20 49 51
6894 51 -40 -58 90 -80 -85 82 44 89 99 -24 168 -10 106 72 3 117 24 111 81 -53 -34 48 -70 -21 76 111
6920 111 -144 75 -111 -62 -62 201 56 79 -60 86 -23 -57 -145 -210 134 -157 -100 82 13 76 69 15 39 141 -107
6945a07J48r0L3l3Q9P2j16j00R3J2R0o5k7J25j47PM1k2J62j28n5k2r7P2j0L0J37
6972I2k12nR1nO2p4J22j21j5PJ21J28l44K03l8K3j2j25J32l5J73k84R0r6k2J69
$$ plain form
6945 -107 41 -49 -16 -49 40 112 -4 -104 -11 1 91 26 -1 124 -23 -16 25 3 165 37 -18 -40 -137 -65 -75 -45 92
6972 92 -120 -125 -34 -39 23 -51 71 -50 -65 -58 63 191 -153 50 12 35 23 -102 30 -5 168 -116 -26 -122 -144 25
$$ [...]
8191a6
##END NTUPLES=NMR FID
##END=
