##TITLE=1H_DE-80H_X3
 200.13MHz, d2o
 8 sc
 
 19ns.26.2.2025
##JCAMPDX= 6.0         $$ Bruker NMR JCAMP-DX V2.0
##DATA TYPE= NMR FID
##DATA CLASS= NTUPLES
##ORIGIN= UXNMR, Bruker Analytische Messtechnik GmbH
##OWNER= pz
$$ XWIN-NMR		Version 3.5
$$ Fri Apr 11 16:09:01 2025 Russian Standard Time (UT+4h)  Yarkov@DPX200
##.OBSERVE FREQUENCY= 200.1313
##.OBSERVE NUCLEUS= ^1H
##.DELAY= (6, 6)
##.ACQUISITION MODE= SIMULTANEOUS
##.ACQUISITION SCHEME= undefined
##.AVERAGES= 8
##.DIGITISER RES= 18
##SPECTROMETER/DATA SYSTEM= spect
##.PULSE SEQUENCE= zg30
##.SOLVENT NAME= CDCl3
##.SHIFT REFERENCE= (INTERNAL, CDCl3, 0, 14.3821)
##AUDIT TRAIL= $$ (NUMBER, WHEN, WHO, WHERE, WHAT)
$$ ##TITLE= Audit trail, XWIN-NMR		Version 3.5
$$ ##JCAMPDX= 5.01
$$ ##ORIGIN= Bruker BioSpin GmbH
$$ ##OWNER= Yarkov
$$ C:/Bruker/XWIN-NMR/data/yarkov2/nmr/H-C/1/audita.txt
$$ ##AUDIT TRAIL=  $$ (NUMBER, WHEN, WHO, WHERE, WHAT)
(   1,<2025-04-11 16:07:52.12 +0400>,<Yarkov>,<DPX200>,
      <created by zg, POWCHK disabled, PULCHK disabled
       configuration hash MD5:
       00 E9 B6 7A A2 85 ED C7 34 08 36 98 17 FE 4E 26
       data hash MD5: 16K
       6D 51 56 5F C3 00 50 58 37 CE F0 29 23 35 E0 61>)
$$ ##END=
$$ 
$$ hash MD5
$$ BE 3A 4A 12 59 90 F7 EC FD F2 77 A0 00 9E 02 F2
##$RELAX= 
##$RELAX= 
##$RELAX= 
##$RELAX= 
##$RELAX= 
##$RELAX= 
$$ Bruker specific parameters
$$ --------------------------
##$DU= <C:/Bruker/XWIN-NMR>
##$EXPNO= 1
##$NAME= <H-C>
##$PROCNO= 1
##$TYPE= <nmr>
##$USER= <yarkov2>
##$AMP= (0..31)
100 100 100 100 100 100 100 100 100 100 100 100 100 100 100 100 100 100 
100 100 100 100 100 100 100 100 100 100 100 100 100 100 
##$AQSEQ= 0
##$AQ_mod= 1
##$AUNM= <au_zg>
##$AUTOPOS= <>
##$BF1= 200.13
##$BF2= 200.13
##$BF3= 200.13
##$BF4= 200.13
##$BF5= 200.13
##$BF6= 200.13
##$BF7= 200.13
##$BF8= 200.13
##$BYTORDA= 1
##$CFDGTYP= 0
##$CFRGTYP= 5
##$CHEMSTR= <none>
##$CNST= (0..31)
1 1 145 1 1 1 1 1 1 1 1 1 1 1 1 1 1 1 1 1 1 1 1 1 1 1 1 1 1 1 1 1 
##$CPDPRG= <>
##$CPDPRG1= <>
##$CPDPRG2= <>
##$CPDPRG3= <>
##$CPDPRG4= <mlev>
##$CPDPRG5= <mlev>
##$CPDPRG6= <mlev>
##$CPDPRG7= <mlev>
##$CPDPRG8= <mlev>
##$CPDPRGB= <>
##$CPDPRGT= <>
##$D= (0..31)
0 0.7 0 0 0 0 0 0 0 0 0 0.03 0 0 0 0 0 0 0 0 0 0 0 0 0 0 0 0 0 0 0 0 
##$DATE= 1744373271
##$DBL= (0..7)
120 120 120 120 120 120 120 120 
##$DBP= (0..7)
150 150 150 150 150 150 150 150 
##$DBP07= 0
##$DBPNAM0= <>
##$DBPNAM1= <>
##$DBPNAM2= <>
##$DBPNAM3= <>
##$DBPNAM4= <>
##$DBPNAM5= <>
##$DBPNAM6= <>
##$DBPNAM7= <>
##$DBPOAL= (0..7)
0.5 0.5 0.5 0.5 0.5 0.5 0.5 0.5 
##$DBPOFFS= (0..7)
0 0 0 0 0 0 0 0 
##$DE= 6
##$DECBNUC= <off>
##$DECIM= 32
##$DECNUC= <off>
##$DECSTAT= 4
##$DIGMOD= 1
##$DIGTYP= 9
##$DL= (0..7)
0 120 120 120 120 120 120 120 
##$DP= (0..7)
150 150 150 150 150 150 150 150 
##$DP07= 0
##$DPNAME0= <>
##$DPNAME1= <>
##$DPNAME2= <>
##$DPNAME3= <>
##$DPNAME4= <>
##$DPNAME5= <>
##$DPNAME6= <>
##$DPNAME7= <>
##$DPOAL= (0..7)
0.5 0.5 0.5 0.5 0.5 0.5 0.5 0.5 
##$DPOFFS= (0..7)
0 0 0 0 0 0 0 0 
##$DQDMODE= 0
##$DR= 18
##$DS= 0
$$ [...]
##$SUBNAM2= <"">
##$SUBNAM3= <"">
##$SUBNAM4= <"">
##$SUBNAM5= <"">
##$SUBNAM6= <"">
##$SUBNAM7= <"">
##$SUBNAM8= <"">
##$SUBNAM9= <"">
##$SW= 18.0517328524113
##$SWIBOX= (0..15)
0 0 2 0 0 0 0 0 0 0 0 0 0 0 0 0 
##$SW_h= 3612.71676300578
##$TD= 16384
##$TD0= 1
##$TE= 0
##$TE2= 300
##$TE3= 300
##$TEG= 300
##$TL= (0..7)
0 120 120 120 120 120 120 120 
##$TP= (0..7)
150 150 150 150 150 150 150 150 
##$TP07= 0
##$TPNAME0= <>
##$TPNAME1= <>
##$TPNAME2= <>
##$TPNAME3= <>
##$TPNAME4= <>
##$TPNAME5= <>
##$TPNAME6= <>
##$TPNAME7= <>
##$TPOAL= (0..7)
0.5 0.5 0.5 0.5 0.5 0.5 0.5 0.5 
##$TPOFFS= (0..7)
0 0 0 0 0 0 0 0 
##$TUNHIN= 0
##$TUNHOUT= 0
##$TUNXOUT= 0
##$USERA1= <user>
##$USERA2= <user>
##$USERA3= <user>
##$USERA4= <user>
##$USERA5= <user>
##$V9= 5
##$VALIST= <valist>
##$VCLIST= <CCCCCCCCCCCCCCC>
##$VD= 0
##$VDLIST= <DDDDDDDDDDDDDDD>
##$VPLIST= <PPPPPPPPPPPPPPP>
##$VTLIST= <TTTTTTTTTTTTTTT>
##$WBST= 1024
##$WBSW= 4
##$XGAIN= (0..3)
0 0 0 0 
##$XL= 0
##$YL= 0
##$YMAX_a= 253377
##$YMIN_a= -228425
##$ZGOPTNS= <>
##$ZL1= 120
##$ZL2= 120
##$ZL3= 120
##$ZL4= 120
##$ABSF1= 10
##$ABSF2= 0
##$ABSG= 5
##$ABSL= 3
##$ALPHA= 0
##$AQORDER= 0
##$ASSFAC= 0
##$ASSFACI= 0
##$ASSFACX= 0
##$ASSWID= 0
##$AUNMP= <proc_1d>
##$AZFE= 0.1
##$AZFW= 0.1
##$BCFW= 1
##$BC_mod= 2
##$BYTORDP= 1
##$COROFFS= 0
##$CY= 83.5205535888672
##$DATMOD= 1
##$DC= 2
##$DFILT= <>
##$DTYPP= 0
##$F1P= 10.8118882576601
##$F2P= -7.23987719738617
##$FCOR= 0.5
##$FTSIZE= 0
##$FT_mod= 4
##$GAMMA= 1
##$GB= 0.15
##$INTBC= 1
##$INTSCL= 1
##$ISEN= 128
##$LB= 0.25
##$LEV0= 0
##$LPBIN= 0
##$MAXI= 10000
##$MC2= 0
##$MEAN= 0
##$ME_mod= 0
##$MI= 1.114404
##$NCOEF= 0
##$NC_proc= 0
##$NLEV= 6
##$NOISF1= 3.799351
##$NOISF2= 2.8
##$NSP= 1
##$NTH_PI= 0
##$NZP= 0
##$OFFSET= 14.38212
##$PC= 1
##$PHC0= -825.0377
##$PHC1= 4.933722
##$PH_mod= 1
##$PKNL= yes
##$PPARMOD= 0
##$PSCAL= 0
##$PSIGN= 0
##$REVERSE= no
##$SF= 200.129724274929
##$SI= 16384
##$SIGF1= 3
##$SIGF2= 2
##$SINO= 400
##$SIOLD= 16384
##$SREGLST= <1H.CDCl3>
##$SSB= 0
##$STSI= 0
##$STSR= 0
##$SW_p= 3205.1282051282
##$SYMM= 0
##$S_DEV= 0
##$TDeff= 0
##$TDoff= 0
##$TI= <>
##$TILT= no
##$TM1= 0
##$TM2= 0
##$TOPLEV= 0
##$USERP1= <user>
##$USERP2= <user>
##$USERP3= <user>
##$USERP4= <user>
##$USERP5= <user>
##$WDW= 1
##$XDIM= 8192
##$YMAX_p= 0
##$YMIN_p= 0
$$ End of Bruker specific parameters
$$ ---------------------------------
##NTUPLES= NMR FID
##VAR_NAME=  TIME,          FID/REAL,        FID/IMAG
##SYMBOL=    X,             R,               I
##VAR_TYPE=  INDEPENDENT,   DEPENDENT,       DEPENDENT
##VAR_FORM=  AFFN,          ASDF,            ASDF
##VAR_DIM=   8192,          8192,            8192
##UNITS=     SECONDS,       ARBITRARY UNITS, ARBITRARY UNITS
##FACTOR=    0.0002768,     1,               1
##FIRST=     0,             0,               0
##LAST=      2.2672688,     0,               0
##MIN=       0,             -228425,         0
##MAX=       2.2672688,     253377,          0
$$ Real data points
##PAGE= N=1
##DATA TABLE= (X++(R..R)), XYDATA
0 0 0 0 0 0 0 0 0 0 0 0 0 0 0 0 0 0 0 0 7 -8 8 -8 8 -8 14 -16 16 -21 24 -24 30 -32 38 -45 47 -54 62 -69 77 -86
40 -86 97 -107 119 -130 146 -161 176 -194 216 -235 261 -288 317 -349 385 -428 474 -528 592 -664
60 -664 754 -862 999 -1176 1422 -1776 2338 -3385 6004 -27878 -35435 -2070 25374 155129
74 155129 253377 171447 18750 1543 69063 62870 -28034 -54414 -29276 -76973 -137299 -86763
86 -86763 -8299 -13477 -66010 -54915 12597 17966 -25828 10250 95419 107390 38895 -10722 10819
99 10819 29595 7036 30447 80214 35951 -72758 -105457 -34505 20742 -15167 -52217 -37843
111 -37843 -43218 -59161 -15423 56647 72721 14273 -28995 11493 59776 49606 34275 41992
123 41992 28422 -27545 -68312 -31914 12597 -12228 -37439 -15745 -7925 -34732 -40697 9416
135 9416 58475 37280 -3715 1427 15765 10388 9763 25018 30293 -11760 -61737 -41593 10523
148 10523 19577 -1279 -10175 -6181 -17279 -29123 8515 56194 39115 -4880 -12869 1294 5547
161 5547 -1846 5626 19105 -4340 -40867 -36324 -6501 9692 1508 -8326 1756 -787 -19895
174 -19895 -2646 37546 44369 16427 -6319 -1472 5157 -4298 4066 22228 4617 -31435 -43168
187 -43168 -24084 -153 296 -7863 -2377 -5477 -16008 -4975 23261 41578 27169 268 2362
200 2362 12822 4969 5216 16099 9942 -16046 -37171 -27503 -6943 -7339 -9853 -3639 -6940 -15212
214 -15212 -13640 4982 30399 29533 10103 4843 7819 6253 7257 14875 18757 455 -27826 -26165
228 -26165 -7943 -4322 -5856 -5633 -8749 -15179 -18919 -3615 19572 21197 9674 3871 3647 7583
242 7583 8514 10544 18081 9349 -12562 -18478 -9712 -2624 -3141 -6351 -4288 -8874 -19986 -11375 8584
257 8584 15021 10960 3103 17 2992 3376 8269 17381 12154 -3187 -13587 -12129 -942 1608 -3466
272 -3466 -1720 -5401 -15256 -12317 1049 11820 10617 1018 -207 1896 45 5370 12811 10713 1990
287 1990 -8925 -11235 -2260 881 -700 -286 -3680 -9000 -11029 -5110 8324 10446 2142 672 1037
302 1037 -884 2689 8171 10757 5651 -6201 -9004 -4360 -1548 1032 869 -3001 -5885 -10243 -7903
317 -7903 4369 8943 4773 1022 -1092 148 1770 4989 11019 7651 -3564 -6611 -4524 -1894 1107
332 1107 0 -1978 -4296 -9257 -7148 193 4762 5519 1720 -1343 1031 799 2191 8830 8301 1747
348 1747 -3753 -5148 -2109 427 -85 1217 -2297 -8533 -7574 -2848 1991 5312 1865 -1122 -576 -961
364 -961 2163 6429 7479 4788 -1936 -4835 -504 963 270 1839 -933 -5419 -6864 -4761 853 3361
380 3361 1027 232 -1262 -2240 931 3500 5736 5987 298 -3254 -1470 -28 1349 2112 430 -1779
396 -1779 -6162 -6121 -58 2367 1381 817 -1575 -2695 -486 1783 4967 5113 1246 -1318 -2014 -626 2178
413 2178 1882 812 31 -4084 -5116 -1196 1105 1717 430 -1641 -1778 -1893 -477 4136 4280 1883 1
430 1 -2068 -1126 1700 1765 1997 836 -2696 -3649 -2941 -17 2589 398 -1055 -957 -2178 -1447 2398 3369
448 3369 2576 309 -2020 -781 432 1508 3102 1047 -1377 -2348 -3293 -626 2244 874 -106 -1091
464 -1091 -2250 -1450 330 2311 3321 162 -1561 -429 -476 951 2596 1681 4 -1710 -2760 -667
480 -667 829 1269 937 -1230 -2202 -1068 -962 1379 2878 397 -785 -765 -739 819 1682 1628 1154 -1458
498 -1458 -2118 -487 -64 998 1577 -688 -1365 -1316 -1260 785 1693 1242 157 -1733 -1186 599 484 1537
516 1537 1594 -885 -1732 -883 -234 1404 935 132 -493 -1780 -1165 787 1018 1423 1180 -1390 -1162 -83
534 -83 346 1425 1263 -114 -979 -2008 -699 1320 436 732 302 -1289 -1082 253 794 1358 825 -314
552 -314 -633 -1048 83 1356 559 332 -613 -2091 -800 394 345 760 -27 -682 -795 -681 720 1719 669
571 669 153 -32 -1053 -87 1072 606 812 -128 -1356 -1061 -719 402 830 -448 -322 -416 -1367 398 1437
590 1437 829 681 -274 -760 54 304 1103 1081 -354 -652 -762 -1185 58 561 -226 -386 -960 -1179 -307 520
610 520 1227 1006 -297 -57 182 -211 1159 1527 235 -56 -815 -821 144 38 38 -209 -1160 -848 -467 -378 1017
631 1017 886 -150 95 -133 143 1007 963 1015 312 -689 -347 -37 -124 442 -105 -1004 -1030 -597 -605 480 356
652 356 357 -268 -596 305 663 489 1133 567 -434 -307 -119 60 485 -27 -426 -521 -1196 -556 31 -62 418
673 418 -258 -698 -188 156 638 1047 376 216 -367 -383 326 646 -163 26 -539 -1327 -507 -84 -9 295 -234
694 -234 -336 -285 -233 581 540 145 438 -53 -334 485 369 345 462 -232 -551 -415 -577 159 211 -657 -203 -362
716 -362 -623 249 546 279 342 -237 147 235 13 477 509 -154 -23 -549 -566 255 -8 -117 70 -513 -367 25
738 25 209 692 327 -223 76 -126 106 527 427 60 -81 -340 -358 114 -10 519 -120 -641 -80 -362 33
759 33 479 160 97 -85 -130 104 551 396 153 -87 -389 -197 -11 39 483 129 -271 84 -207 -2 288 -32
781 -32 218 -124 -475 32 -118 186 771 114 -241 -10 -60 57 267 22 151 -431 -318 57 58 93 379 -146
803 -146 -161 -48 -169 237 353 -98 -42 -303 -356 88 58 54 336 -170 -155 57 75 168 272 -124 -260 -277 -15 181
827 181 81 -255 58 -514 -198 177 -112 19 178 29 -11 99 -85 299 257 146 19 -348 -145 229 -116
848 -116 123 24 -157 -99 -33 -113 376 3 -97 -86 -197 100 319 178 224 200 -125 83 -38 22 289 -196 -151
871 -151 -106 -420 -99 183 184 -72 69 -180 65 0 -5 540 38 -10 231 -174 123 471 -253 -60 -4 -501 -100
894 -100 134 -20 294 -5 -4 111 -75 195 272 -40 188 53 -166 300 220 232 312 -170 -79 -200 -550 -48 216
917 216 -417 -217 92 -180 173 213 53 344 -68 -62 252 22 147 164 -20 -61 -88 -269 48 -34 -28 -41 -170 -44
941 -44 -180 -56 372 163 -220 -120 146 237 164 -129 -82 -5 -116 -314 -111 1 -65 -186 -337 105 -177 -255 95
964 95 22 -115 -20 56 -90 216 58 199 20 -65 2 56 33 4 -91 -213 -57 -181 7 -31 -61 65 -186 -301
988 -301 -67 2 -31 219 14 62 186 -116 -134 18 -30 -71 -176 -238 -25 -336 50 78 -110 -41 42 -7 90 169 -114
1013 -114 117 88 16 276 232 66 180 27 -43 244 26 -82 200 -231 -233 -103 -162 249 92 -184 214 195 -300
1036 -300 18 97 191 15 70 -164 -75 -15 121 -4 -40 148 -186 -92 29 -143 32 -107 -270 -219 105 77 41
1059 41 144 -88 14 -13 -77 395 81 -52 -49 -100 -32 137 124 154 -155 -162 -86 -337 24 138 -16 49 -38 -131 178
1084 178 100 -13 1 -79 -205 203 -47 41 160 -76 -111 -347 12 -19 -137 175 -112 -94 -217 141 33 263
1106 263 218 32 75 11 -219 -115 66 67 -14 -134 -8 -34 -174 -104 -16 59 33 -87 -29 -21 161 -78 -108 -208 -96
1131 -96 -120 -97 -61 140 -175 -34 75 -175 55 117 -90 66 -290 53 206 99 112 248 228 82 110 83 119
1154 119 62 24 -15 -35 16 116 77 -14 -124 -131 35 83 -83 95 117 -70 -16 87 119 148 169 157 136 -167 26 -234
1180 -234 -213 -87 -127 84 -129 -66 122 -91 -87 -58 26 -66 106 120 -6 121 89 11 73 -49 -176 7 -217 9
1204 9 154 -382 -168 -116 -2 -233 -134 79 -28 -171 87 -38 51 37 -19 -178 300 70 -197 80 153 -142 -108
1227 -108 -106 3 -248 -181 42 152 -86 47 87 -93 234 101 -95 104 -288 -155 38 -112 6 -13 -61 13
1249 13 317 119 130 -222 -272 84 105 -104 252 -81 3 111 19 -97 -34 -273 -144 -27 -110 115 -62 -20 -46
1272 -46 114 66 60 6 128 186 4 55 -2 -191 21 147 -93 170 11 -72 -60 -110 -75 -138 148 -81 47 -124
1296 -124 -9 -135 -181 35 -22 92 156 -4 -209 10 9 61 39 98 151 -43 127 110 120 -21 -7 -129 82 22
1320 22 80 142 -25 60 -16 -42 26 -117 168 111 14 2 -23 16 -112 46 -19 -215 -24 -198 -208 77 -54 57 98
1345 98 -3 87 240 52 119 -33 -64 53 -44 -48 17 18 -112 -168 -76 -10 -104 181 67 54 -187 -72 -58 -174 88
1370 88 -35 153 12 -130 216 -58 293 -45 -226 173 -119 -189 5 142 71 80 -185 196 202 77 47 -78 84
1393 84 108 16 283 -95 4 -44 -93 106 130 -2 -227 97 101 70 -31 40 24 -79 -137 47 -35 -252 -19 0 39
1418 39 -32 152 -64 -94 -80 -50 130 -99 -254 87 -199 1 71 -30 85 -148 -109 21 158 147 -58 15 42
1441 42 -46 -139 -94 49 -165 -108 140 204 214 -98 47 31 50 17 -32 -23 -73 -10 -124 -62 149 99 -36 230 -3 13
1467 13 189 -204 66 53 -204 126 144 -206 60 -37 -104 254 -170 17 -50 -86 57 21 159 19 -1 -173 -112
1490 -112 96 63 38 -67 10 -120 30 83 -126 -36 -44 36 -139 41 35 -205 99 67 -133 141 194 -84 173 -90
1514 -90 -46 284 -136 -1 68 270 253 -98 -113 -30 8 -148 62 35 20 205 -5 63 -264 173 212 -213 56 -28
1538 -28 -104 -10 -14 -82 103 34 110 -118 -181 -148 109 4 98 -119 -30 437 159 -135 -60 -44 -182 -8 -95 7 -36
1563 -36 -162 -114 -34 -46 -104 -61 -46 -142 148 -27 141 -6 -45 -87 -47 81 -69 -106 -139 147 48 -4 -65 -8 -60 177
1589 177 -70 -26 28 10 -151 31 -144 57 108 135 94 200 -58 -114 -29 166 -35 -97 60 -159 3 161 24
1612 24 -28 -99 202 -142 -93 110 33 22 -91 164 19 47 10 127 -109 -58 152 135 -14 -14 64 -65 -44 -35 -51 -85
1638 -85 268 -65 16 42 86 90 3 -45 109 106 95 149 -21 145 -197 -28 -65 35 -63 271 3 -10 115 -203 -84
1663 -84 -121 248 75 39 100 66 -165 17 -109 96 -20 81 -131 142 162 -241 -73 -36 2 22 60 220 -127
1686 -127 -92 -79 98 -65 80 63 -34 -30 -121 -57 -125 -2 -46 57 -201 -57 94 43 -13 56 28 15 42 -8 -110 -1
1712 -1 166 29 151 137 3 -162 -123 -20 -127 54 -40 -115 36 -76 -17 -70 -70 -185 69 7 166 121 -56 -129
1736 -129 -61 -56 42 119 -155 58 22 -72 -4 -69 102 -107 -40 -92 182 -14 -30 -130 -155 85 -153 -36 -64 115 137
1761 137 109 -21 6 -146 97 -104 -11 -177 -178 94 -58 -105 14 -16 -8 125 44 10 91 -59 -147 -126 -253 228 46
1786 46 -193 -25 59 -106 15 39 -39 -14 118 57 -102 -100 -116 -74 39 -133 189 -19 -127 -83 83 212 -35 -185
1810 -185 30 135 -336 97 154 -94 -149 15 -2 11 12 -122 68 -31 83 51 -43 -8 113 -175 89 -26 126
1833 126 198 -50 -113 183 -94 209 218 37 14 69 39 -102 -94 105 4 -104 201 -4 73 -162 -38 158 75 -20
1857 -20 77 -61 -235 -149 -116 -118 235 -274 35 120 -101 -9 20 165 -83 -46 -82 216 116 -144 -198 -68 -107 121
1881 121 73 -186 -35 137 162 140 -35 -363 47 -40 -280 -201 127 -57 -7 -87 52 53 2 167 150 -19 134 15
1905 15 -140 19 -102 106 -37 -107 -176 179 128 -75 -136 -96 8 15 85 109 -93 69 -137 190 -45 -128 -35 65
1929 65 24 -173 133 47 -89 -124 -46 -77 -106 32 60 39 -48 -80 -30 189 309 -104 -72 85 -23 -153 63 -48
1953 -48 -181 -47 163 39 -40 -8 83 -105 31 -27 190 -11 245 47 -3 -33 92 99 13 204 -146 199 140 36
1977 36 -109 -51 -87 150 -105 -130 -107 -55 -27 -122 -18 18 181 67 108 8 -57 -178 92 55 -88 35 105 54 -121
2002 -121 31 119 -93 52 -70 140 92 146 26 -14 74 156 -73 -83 247 -55 -48 -142 -295 -36 20 -176 -158 70
2026 70 64 -7 45 -23 -40 -127 27 58 87 45 -238 -30 17 199 157 -116 8 -245 57 216 4 77 131 238 -6
2051 -6 49 12 197 -304 -46 61 141 -25 40 206 -232 -97 30 -56 14 -2 182 13 207 277 202 56 -89 124
2075 124 -145 199 -154 -185 -4 120 144 -46 8 152 -131 192 131 77 -121 -9 -144 -81 90 -2 78 102 94 -19
2099 -19 -31 -109 103 103 -90 20 9 -150 58 98 96 38 -18 175 -103 -39 -93 -33 -166 -156 -74 228 -262 88 -2 -139
2125 -139 -41 7 -143 -253 22 214 -58 -87 10 -41 -56 164 -119 -23 -73 -176 44 -202 92 -145 -132 32 44
2148 44 -81 -121 -47 193 -82 -23 -112 0 -197 -107 90 -107 138 -3 -91 -70 39 -122 -105 -151 95 26 -55 -160
2172 -160 44 184 -21 -6 43 -188 230 -120 -78 97 -4 4 90 160 62 -28 -120 -166 116 178 47 -17 28 64 -47
2197 -47 121 -93 -134 136 136 -33 118 -113 -9 -100 -110 74 133 -367 -76 -97 87 116 141 17 258 -199 -237 24
2221 24 -146 -114 -50 198 122 -216 43 -35 -123 -129 69 135 -5 12 -117 -84 -101 -4 -161 -116 -94 -230 109 36 120 145
2247 145 -134 -113 13 -104 -20 57 -1 85 -51 -63 -60 -171 69 -184 -173 -47 0 132 56 42 -25 -9 -234 -11 -23
2272 -23 -185 -2 -55 176 -90 -100 73 207 -111 82 110 117 73 -24 177 67 107 26 68 21 171 -137 119 191
2296 191 -11 51 -36 99 -5 -44 122 -19 88 -166 -84 111 -168 66 242 -164 -7 367 117 40 -66 312
2318 312 -115 -70 163 81 47 -124 -97 43 114 172 -42 45 58 -63 88 -104 -8 -34 49 -74 -90 -64 -1 -23 103
2343 103 73 46 18 119 42 22 114 201 -77 40 158 53 98 -4 7 -121 0 19 -12 137 157 8 -17 -10 -52
2368 -52 -185 29 -7 177 -164 5 75 -90 13 -5 24 38 -6 -117 -27 52 -48 65 13 -115 70 -97 0 14
2392 14 -37 -48 139 200 190 -21 164 71 90 31 -85 158 42 75 -30 -181 129 77 18 -23 -117 2 -97 -16 -96
2417 -96 117 21 83 -132 -87 3 305 -69 2 16 -11 -135 81 -107 1 8 -11 212 82 148 157 184 -119 84 87 -57
2443 -57 -52 121 -71 8 15 -303 -28 -16 142 121 76 -165 -152 -21 -262 -79 -75 -20 -9 63 -254 47 65 37 -21 -237
2469 -237 -61 46 -65 -59 -45 -122 159 97 -28 88 -80 -27 -223 70 -28 -109 17 9 -17 124 -163 21 -148 -139
2493 -139 182 -87 -39 80 -62 53 25 -192 -96 122 43 255 -11 -190 91 -65 -153 -3 54 -245 74 165
2515 165 129 -93 -96 97 -195 168 105 55 94 -58 -186 -154 205 -51 -21 17 -10 16 33 -53 -27 -17 -48 56 -10 -36
2541 -36 -71 -46 7 -118 -92 -181 -141 -113 -94 139 33 -119 104 -17 -31 265 73 16 62 99 61 28 -49 -30 59 82
2567 82 118 -98 21 -42 8 26 -130 171 97 12 23 -15 35 129 -18 164 -6 -110 5 -31 215 121 225 -22
2591 -22 -44 -93 -46 -39 54 15 -126 18 13 31 112 128 1 53 86 91 -39 -167 80 -13 -60 -27 137 -13 -69 145 117
2618 117 170 49 -140 149 -105 -101 6 -153 -113 171 189 -49 106 81 41 -85 -207 70 58 -196 207 25 19
2641 19 -93 -2 89 -77 102 25 26 -35 -84 2 12 -14 -44 249 142 -17 -211 -71 -28 72 148 223 -10 89 100 1
2667 1 62 0 -140 15 46 -9 218 -201 77 250 -66 -18 -133 130 156 -28 60 95 80 -34 7 -18 -35 -153 -161
2692 -161 73 -82 176 -43 43 3 45 92 77 -106 110 0 -64 130 -121 69 144 140 62 -81 -57 -58 18 -45 150
2717 150 -129 -43 69 -123 -51 208 40 82 9 -112 63 31 -27 51 104 -173 -154 -140 -44 107 -205 21 311 -8
2741 -8 -8 165 61 -83 16 -13 -138 2 10 24 -163 -146 85 51 2 22 -25 35 65 29 -127 -2 -105 27 87 23
2767 23 90 59 9 108 67 -55 66 60 102 -185 -200 -29 -20 2 -110 34 -12 108 55 189 77 -7 117 -157 118
2792 118 -75 15 -119 55 -193 25 -45 -94 -7 -54 -71 -16 -31 77 -118 314 61 -44 182 -77 -59 -96 120
2815 120 94 140 -183 -49 15 -199 114 25 8 -102 10 -84 -282 42 -137 -63 -77 161 -101 23 56 9 -65 156
2839 156 -47 26 -41 -62 151 -122 29 -93 -31 82 81 -148 -34 -117 -32 -176 -35 74 -138 -58 116 165 -186
2862 -186 -102 4 99 -10 154 -163 195 -138 105 -140 -202 86 -45 221 118 105 -250 19 24 -128 -177 6
2884 6 -70 116 -160 -156 137 55 -13 1 -93 201 -77 -238 9 9 359 43 273 -80 77 -177 103 -5 -13 95
2908 95 -54 -223 -244 10 78 3 186 91 -60 131 12 -110 114 0 -69 46 141 50 -116 149 -102 -124 29
2931 29 55 -18 -163 22 -12 -105 -24 30 -18 89 17 118 -3 0 69 -35 -76 -137 71 -67 92 82 7 -15 230 123
2957 123 114 19 35 35 -131 -29 55 30 34 -33 104 -82 42 78 137 -166 -38 76 79 -72 70 96 140 217 -133 64
2983 64 -229 -142 -50 -148 126 14 -206 -92 -28 -12 74 -83 -39 -27 28 167 -87 164 13 -61 -23 115 242 -8
3007 -8 -43 -15 109 -93 43 -73 -52 -189 108 -155 -42 -58 -88 -46 -20 139 -74 -64 -10 -85 33 49 87 185 18
3032 18 -96 -52 67 -154 78 270 -125 -45 -35 38 4 15 -160 40 -42 -80 75 -5 109 1 218 -43 23 119
3056 119 -119 -88 3 -75 -78 -136 -201 -79 -110 -47 -49 -100 -38 -46 81 21 -233 -64 5 9 99 74 -137 81 -85 -29 -111 -61
3084 -61 -103 140 113 106 81 17 -209 -17 124 -42 -106 10 165 77 -130 -22 38 175 23 67 -42 31 -40 -82 81
3109 81 -45 133 27 -204 -164 37 123 168 59 -36 121 161 33 -36 84 -259 -33 26 -46 -268 -11 -80 84
3132 84 -93 17 45 -79 -208 -49 -8 219 48 -83 -192 -111 35 -25 180 -88 30 40 60 -9 41 -11 396
3155 396 -27 264 -80 -47 -46 152 154 51 58 82 53 231 110 93 184 135 76 -108 -18 -3 149 181 -193 -28 20 5
3181 5 15 26 -61 -152 201 -137 -38 214 -63 153 187 -242 -5 209 -185 -104 158 -8 -96 -96 111 95 -32 -18 -119
3206 -119 -103 -153 -1 75 -151 116 -2 105 -75 -62 168 -110 20 271 120 -81 -93 -128 32 -82 1 39 157
3229 157 -41 185 82 -56 158 -61 22 -246 3 66 127 -155 79 33 -65 284 -86 45 6 -144 106 -85
3251 -85 106 130 -48 49 68 -98 -71 -102 -56 21 15 74 75 -1 106 -73 -10 -19 -213 225 -71 29 206 20 63 70 213
3278 213 -55 -111 -200 85 -259 -72 107 -179 -44 -93 -192 114 -22 -16 33 -23 -71 -4 -29 66 75 44 -191 56 -45
3303 -45 -87 71 27 166 -34 -21 -10 -184 -47 97 -143 100 10 26 -60 4 -2 1 250 142 -9 185 -14 -66 -140
3328 -140 145 -138 28 111 113 125 -104 -34 4 77 -81 5 -156 78 -226 144 -93 -45 -112 -68 33 114 150 70 20
3353 20 278 185 42 203 6 29 -60 34 -54 -166 -60 -141 -7 -193 -147 4 -271 124 45 -78 -58 176 -194
3376 -194 67 238 74 124 -163 -136 -50 42 -125 60 116 20 22 255 -78 -117 -104 -4 -211 -77 137 -110 4
3399 4 221 45 -82 -72 -245 101 143 -101 42 -33 149 -57 -182 54 -34 185 116 -99 -43 49 -76 90 75
3422 75 -136 107 -74 -83 -81 -25 -41 -93 151 -71 -13 -25 58 71 -66 -226 32 70 78 45 -3 107 -26 53 -76 -66
3448 -66 10 69 -170 86 90 21 -158 3 -78 -72 112 -18 5 224 62 107 -5 -3 -370 12 -226 -162 129 -105 49
3473 49 7 46 -57 -220 -24 34 95 116 -71 37 231 258 187 -55 -10 -160 49 83 -51 237 69 -36 -156
3496 -156 105 -51 60 -334 34 133 -58 31 52 206 13 105 -2 -105 -53 7 20 -162 -5 130 197 53 -92
3519 -92 -398 32 112 234 -41 -111 -19 28 -57 -27 21 21 65 101 74 190 34 -138 -55 61 16 -29 -150 333 -82
3544 -82 -41 34 -2 -229 48 135 27 203 23 287 -169 30 202 91 -80 44 140 -30 18 5 190 -90 56
3567 56 219 -35 -149 142 -13 75 -23 8 -196 -47 -104 -40 57 201 -52 -76 -26 236 58 -62 -61 -36 27 -52 36
3592 36 35 52 109 -86 -74 162 -48 158 260 -39 16 -145 -1 -323 -168 -204 14 39 136 -106 108 266 -32
3615 -32 150 -66 -47 32 -231 -124 261 -16 97 -157 101 57 -124 111 -74 -152 -1 22 -107 -197 119 180 38
3638 38 -70 63 -3 207 -83 -109 82 -94 -161 -1 -76 -4 -83 -62 166 34 82 -247 -157 16 45 -114 43 46
3662 46 15 189 34 122 -78 131 -161 84 -126 96 -129 -2 -81 7 -97 11 126 7 -79 -61 -113 105 -266
3685 -266 36 94 70 -22 -25 -129 -47 128 1 -37 -118 90 223 25 -171 -18 70 32 79 -115 -38 36 -149 -2
3709 -2 -215 -12 -259 57 161 0 151 -20 170 -58 41 -88 -50 -86 164 -102 -136 -63 1 -22 10 -60 -28 218
3733 218 -13 134 4 265 27 103 -57 -128 136 -111 33 -77 60 -18 109 -113 166 26 -128 188 -131
3754 -131 -62 52 -26 19 -123 -80 122 -163 37 51 -134 -121 13 -148 -41 -90 -223 -1 116 -161 70 195
3776 195 -30 -96 -70 23 42 -238 25 -182 137 24 -8 94 133 38 -101 93 26 -107 162 34 54 -48 -89
3799 -89 116 -28 -156 -51 -150 78 208 123 -124 -133 -22 -96 266 87 31 -5 246 2 -78 -239 -45 -65 121
3822 121 194 289 -158 -45 -27 -118 -46 42 63 -208 -15 91 -20 17 184 -133 -22 -18 198 98 -67 133 19
3845 19 -163 -162 140 88 -10 -270 95 -149 -136 14 2 -6 -91 -31 -4 -91 -85 96 -169 139 25 54 -179 -15 59 86
3871 86 -62 72 -15 -154 -17 141 393 100 110 -1 159 -108 26 -96 80 242 255 88 -51 133 -46
3892 -46 91 49 -130 -76 42 -6 -14 82 27 55 -160 -57 2 58 17 -36 -75 -12 -76 100 79 -107 119 20 -136 -15
3918 -15 20 -6 -45 112 107 5 230 372 -128 93 13 -10 3 44 61 21 -23 -163 192 2 -58 22 51 -97 29
3943 29 -33 -178 -46 -1 -127 104 -287 73 17 103 42 29 2 243 78 181 97 52 -84 -22 -15 -144 -74 -16 6
3968 6 170 -220 19 63 -129 54 -47 195 -95 -47 -22 0 4 111 -104 173 -26 -87 45 133 41 51 19 193
3992 193 -145 154 -37 -142 -39 38 -183 279 -21 -97 -153 -200 22 -57 -53 -29 108 -74 11 46 38 -121 -44 -35 62
4017 62 212 65 -245 24 36 89 137 98 14 36 -285 -41 2 -149 -29 -101 -77 -57 58 68 100 122 55 18 65 -56
4043 -56 -107 3 81 -40 -48 51 -55 87 -8 -8 -62 -60 13 152 108 155 -90 -75 -133 323 163 4 184 44 -28 156
4069 156 84 101 -170 93 -53 -107 95 -57 -91 -43 -69 -51 -39 5 84 -75 137 -98 15 -117 38 27 -38 -152
4093 -152 115 -1 101 -72 99 113 2 127 -52 57 9 -26 149 55 -6 -18 38 58 -40 36 -4 65 -91 -79
4117 -79 152 -107 -268 -81 -131 104 85 -139 140 96 -91 -79 -111 -113 137 -130 212 212 93 115 -106 -120 -36 1 -76
4142 -76 -88 38 -130 -22 243 71 72 174 -91 -17 144 -21 -26 57 -139 -54 14 -79 -39 15 53 -109 24 -1 -97
4167 -97 -35 28 159 113 -141 37 21 81 19 -19 -193 -10 25 -21 44 -98 -74 -82 -196 27 45 -29 7 99 -101 90
4193 90 123 17 97 333 42 -89 10 62 80 -115 148 -20 -169 110 59 -137 60 36 70 37 -134 -101 121 -219
4217 -219 99 -154 55 -15 71 -212 -238 70 96 -21 27 -223 4 15 101 41 -68 -30 85 87 303 180 -31 117
4241 117 4 80 131 -48 -267 85 26 14 59 -8 -85 262 109 113 -5 -43 -35 -100 28 -25 -8 -179 -104 89 -7 22
4267 22 113 63 -62 -89 177 108 84 90 27 -157 -100 -85 108 -78 -249 182 235 123 -3 -93 116 87 125 8 -68
4292 -68 -14 17 196 -40 64 -44 19 10 200 -4 11 -181 44 81 -5 -239 309 -147 -167 214 62 110 213 73
4316 73 -25 -4 -79 52 219 41 139 128 94 238 31 145 -34 -63 1 36 -89 137 -153 92 93 105 -147 66
4340 66 109 65 26 79 -69 -79 27 14 -220 130 58 195 156 -4 -120 9 208 25 189 -72 -129 -158 -16 53
4364 53 -35 152 55 -76 57 10 49 -77 -44 91 -151 121 52 -34 26 16 -106 107 32 -106 -59 98 84 68 102
4389 102 -108 172 11 -61 50 107 -40 -139 29 14 -120 70 49 34 -53 4 -63 -59 -45 -125 -13 51 -120 64 -11
4414 -11 8 -59 59 -221 -95 -18 34 -60 190 83 124 17 -68 27 -211 -162 -20 144 77 35 102 -95 -154 -24 10
4439 10 -9 62 182 -114 -112 62 -197 186 114 -59 -34 232 -22 -72 -81 14 -30 -154 27 -26 33 12 48 95 -25 109
4465 109 -57 -147 108 21 97 26 -145 130 -24 -88 -67 91 -159 -99 -51 22 -34 -85 -111 141 -43 -48 -34 108 -44
4490 -44 85 177 -13 227 -129 62 -116 -181 111 -190 -92 -101 131 -212 113 -22 -222 139 -188 -60 64 32
4512 32 -68 15 174 216 170 -188 -175 96 194 280 103 -13 52 78 -55 -185 -70 -72 119 107 114 134 -54 -33 75
4537 75 -312 87 -113 155 -69 61 225 -47 -70 -152 10 -116 -78 -19 -250 -132 -73 210 98 -80 69 -108
4559 -108 20 207 76 -209 141 -142 156 -74 59 105 -101 -156 -69 222 72 -108 108 32 100 -90 -117 3
4581 3 -154 61 -8 11 -65 -51 85 -130 41 177 22 100 -174 -94 -121 -51 -182 -189 56 -117 -172 102 3 157 156
4606 156 17 -45 -201 -19 29 77 -108 -9 21 -27 133 -41 -93 -55 -40 32 -95 218 44 -127 111 -40 -167
4629 -167 -73 -13 -68 199 0 -15 24 18 11 62 -223 -30 -1 -55 42 45 64 -49 -128 -169 0 -280 -75 -131 -160 -185 70
4656 70 13 22 -23 15 -37 -106 -164 214 -57 59 35 3 -52 -32 -26 -7 31 1 -51 76 -33 -38 -79 -93 79 190 -97 -16
4684 -16 92 -130 -54 -69 118 48 36 83 61 2 -127 -57 -5 -4 78 -123 15 307 254 4 -100 -216 43 -84 -13
4709 -13 -113 189 121 94 50 90 156 177 -8 -127 78 -88 171 -61 -193 -100 -62 -56 -152 -87 -45 -224 3 119 -73
4734 -73 -79 224 -178 73 22 -85 -124 139 25 -75 125 -8 -62 -27 17 30 49 -166 -62 96 -103 116 109 -24
4758 -24 -123 -128 -145 228 117 -125 -24 55 -183 18 63 -139 -157 36 -168 -25 111 85 -106 46 -2 -24 -22 21 38
4783 38 -2 46 -106 89 -122 241 26 165 139 -67 187 -80 13 116 123 -145 142 13 -18 67 73 -69 -27 -118
4807 -118 186 2 -146 135 -64 -24 -265 179 -18 -39 23 -198 -69 41 30 116 164 112 -229 31 10 134 300
4830 300 -61 131 -60 132 -16 -163 -128 48 -30 118 -160 -90 43 -94 118 175 -30 27 -6 123 63 -2 -55
4853 -55 30 -112 -171 -39 -20 13 193 102 22 41 -131 -23 -168 -48 -104 -19 161 20 -33 89 -241 -77 105 -28
4877 -28 50 -112 2 -48 -132 -159 -60 1 87 -144 38 -3 111 -82 -236 105 -249 339 40 260 -27 -27 2 22
4901 22 340 -60 178 -49 4 -17 -8 69 -176 -200 31 -81 319 57 24 -135 103 154 29 -56 3 62 205 -257
4925 -257 76 -111 -101 -57 17 92 -188 120 137 -162 4 88 75 34 118 109 -273 -94 110 -96 -140 212 -25 -97
4949 -97 -231 128 -64 -39 103 99 -129 -10 17 71 -79 -136 -225 118 2 115 -41 -96 -13 -7 32 87 -41 39 -17
4974 -17 -179 30 -211 -15 -27 122 105 -22 -173 -123 -35 -36 175 -49 -94 116 83 52 -215 28 -146 172 -113
4997 -113 -120 82 41 -20 -271 34 69 70 212 31 -6 2 27 -130 -75 15 20 -41 -280 152 164 -38 -148 87 -182 8
5023 8 -27 -147 22 -80 -137 140 -120 78 95 -28 189 105 216 17 156 -61 -61 -46 -42 -10 18 101 153 226 208 -99
5049 -99 -62 -123 75 80 -140 137 107 -120 -20 -57 160 -143 76 12 -152 45 55 154 66 -83 182 -24 16 -58
5073 -58 35 8 -50 57 -127 -276 -77 -73 80 48 -209 97 88 -62 -39 209 -202 -109 -208 61 190 63 101 129 151
5098 151 92 135 -21 155 -79 54 -131 -101 -64 -61 -16 -70 11 -107 139 33 -81 -110 -196 -90 -8 28 -133 -64 33
5123 33 54 2 23 -9 207 -4 156 -111 28 -31 181 -1 -60 73 40 17 117 -55 -18 182 156 -56 -8 97
5147 97 -139 156 95 -45 -95 -23 -232 18 99 -9 -110 -89 -89 157 89 -68 -156 106 -107 241 41 -31 -276 130
5171 130 -110 -21 67 264 90 38 32 -42 -141 115 83 127 -71 -81 68 -94 -72 157 9 111 -117 143 -145 -130
5195 -130 98 -36 176 -185 -178 -106 202 124 27 154 21 23 -23 230 -167 -46 148 -34 212 79 -65 -127 67
5218 67 -315 -247 -23 161 4 147 62 -94 -49 -308 -7 -238 -72 -65 205 -102 200 3 -196 62 -117 -93
5240 -93 -115 -21 -27 -138 -31 138 -67 3 -89 -170 -119 30 126 142 41 -62 167 -267 -64 -2 -170 -153 -30 -65 7
5265 7 -119 60 253 88 -134 -63 23 44 -183 50 -65 28 -215 7 4 -251 -262 40 -38 15 -59 -159 42 59
5289 59 39 126 -22 1 13 -70 171 50 -195 -88 80 3 -89 -80 50 -25 60 -111 -229 -177 104 -6 33 136 29
5314 29 104 -148 -112 29 -45 53 -131 136 -155 -208 9 252 -43 18 333 26 -5 53 141 -87 64 -117 -190 -58
5338 -58 -21 -153 -1 172 -17 -39 -31 -207 17 21 41 50 11 -66 -9 -199 -3 -9 -91 43 157 -64 97 15 -111 -36
5364 -36 90 99 106 -111 -36 -7 -71 -118 -255 -45 -90 57 44 104 -39 -62 85 69 33 108 -10 64 43 -28 -152 103
5390 103 -51 -202 80 44 -44 156 0 -26 -70 -41 -146 25 47 -34 -95 -2 -9 96 12 128 4 -105 6 -70
5414 -70 -86 77 -30 -120 -138 76 -49 -30 -95 -216 -139 81 96 74 189 -20 78 -84 2 -20 -9 -20 -109 -216 18
5439 18 -184 -156 56 39 92 126 30 180 99 292 16 -162 -13 -23 -168 32 19 -47 40 1 21 61 -141 -125 255
5464 255 -66 -20 158 20 63 -101 90 211 72 8 177 57 -105 72 106 310 221 -126 70 231 -52 -134
5486 -134 -169 114 51 6 -23 -43 -8 -14 159 -112 42 23 -22 -167 -60 -100 39 -36 -198 -16 200 -43 90 69
5510 69 200 140 44 -54 68 -17 47 110 216 -111 50 -32 -75 124 -6 13 -87 225 -18 156 -181 -149 120 74
5534 74 -66 -14 -5 114 -11 -31 -46 103 89 -68 -176 -299 -74 -43 10 49 -224 -149 100 -11 -95 -153 136 94 -53
5559 -53 -55 -160 85 -75 -54 51 141 -240 306 91 -23 23 142 -55 25 -178 -3 -110 -265 27 -39 -229 7
5582 7 -132 58 -2 -63 31 45 61 -288 46 -65 42 163 47 -187 -18 48 -152 45 -123 -84 -73 -67 72 -35
5606 -35 -35 -166 -56 -186 44 95 161 79 121 4 -81 -298 -103 3 -83 -227 -113 56 -210 17 74 228 78
5629 78 10 -57 -31 -22 88 76 -8 52 19 -114 75 -36 -157 -82 15 47 -170 67 -47 -170 -43 -44 -173 -36 -85
5654 -85 -41 -114 -96 113 144 135 37 131 -80 92 133 -88 86 -121 -268 71 84 -222 -204 -261 -48 -26 32 50 193
5679 193 17 -12 -84 -110 -6 -63 140 -11 226 207 -126 -8 -102 -67 235 56 130 -28 -74 285 -23 -99 2
5702 2 39 -113 -83 -165 -151 63 -108 108 -163 -58 -61 -163 5 -24 -1 -314 -39 174 26 18 146 -53 -82 147
5726 147 -22 -2 -65 -47 104 -7 -162 15 -61 77 -74 -8 -209 13 88 83 28 -40 153 19 33 4 136 -59
5750 -59 -62 -244 180 37 -44 198 -30 -117 19 -43 49 -204 80 -36 -245 -50 -238 -11 -220 -131 -56 -32 -81 -195
5774 -195 -17 126 -216 -117 208 -20 -102 92 -113 -101 -9 45 -41 -129 -101 -53 -96 -33 101 17 134 -99 -79 58
5798 58 -127 -51 -67 -63 145 137 83 -91 92 50 -85 75 4 -19 -112 -99 -24 50 -51 -18 -168 -18 -42 18 -79 -211
5824 -211 11 -13 -5 -86 -13 83 -142 44 121 -257 10 47 -2 -107 -104 7 183 -15 -170 -244 -65 -164 89 46 35
5849 35 -61 -64 3 42 176 128 -51 -67 78 -78 8 4 146 32 194 -5 171 -157 168 -79 75 -210 -52 60
5873 60 -49 -19 -155 -114 -49 101 -86 -91 75 117 37 -12 194 210 -99 -109 72 -238 -9 -4 47 -61 -13 7 8 23
5899 23 -48 14 -37 152 -231 -295 -9 248 -27 283 -51 21 -239 -21 -4 -127 -48 -50 107 11 111 85 -26 -180
5923 -180 31 1 65 -43 73 82 35 -345 240 -123 118 52 64 87 162 42 48 68 165 44 -17 -110 -133 27 -50 98
5949 98 -21 94 44 76 -225 -62 186 -144 49 91 -218 -16 -40 230 -42 92 -52 42 37 45 66 146 -79 -44
5973 -44 65 -89 78 -136 262 -61 -111 -21 -122 -128 -79 48 -50 132 134 18 49 -51 66 -19 -42 30 232 159 165
5998 165 -60 -120 61 55 -309 1 26 -29 -183 -261 186 169 24 -82 -2 86 131 37 44 -115 -151 -143 209 130 -83 105
6024 105 41 -24 171 107 -94 -87 -56 -23 -181 38 182 -32 25 200 63 55 27 294 4 88 198 42 128 9
6048 9 68 17 -4 200 30 10 -177 -54 9 11 44 1 2 -106 -193 152 -52 139 53 30 7 25 5 -110 2 -89 262
6075 262 -103 155 5 41 -65 76 -65 163 -38 12 -128 -157 -128 29 24 61 41 139 53 47 -46 -204 104 98 52
6100 52 -210 95 -67 -37 54 149 37 164 33 20 -150 -97 -183 -119 6 -248 84 193 87 -90 81 23 -134
6123 -134 -30 -78 -10 -78 -8 158 99 96 46 -66 -108 -5 -172 46 -15 -59 130 112 87 51 12 127 -145 110 18
6148 18 72 143 -83 2 35 21 70 84 -34 -102 -148 54 18 49 229 211 -201 -139 72 32 -66 -38 110 -144 -202 -19
6174 -19 -62 32 3 2 -101 -15 -29 137 -2 93 -2 128 62 116 -68 100 -59 -15 -156 325 81 191 152 64 235
6199 235 -67 -33 -161 52 19 -26 -93 -66 -67 9 -78 29 -144 41 170 -32 25 -62 -232 -191 -72 99 77 -45
6223 -45 19 -19 32 101 -142 -53 136 51 -104 -35 -114 -34 158 17 -78 57 105 67 115 -60 148 129 -67 37 -192
6248 -192 71 69 -3 97 23 19 66 41 25 -22 154 -200 145 -15 -138 -198 -21 27 -350 -26 -5 256 -93 156
6272 156 -67 75 38 69 156 144 48 84 88 -158 -22 -140 5 -165 214 354 -46 77 3 -114 -51 -72 293 191
6296 191 -122 -25 -28 16 -140 -96 -85 -168 62 60 59 -68 55 341 -140 -220 5 32 19 51 -73 -58 -48 31 -1 -74 -67
6323 -67 27 5 -195 -58 138 253 119 -23 18 -134 1 90 -6 67 -128 -16 -116 79 21 -296 -156 89 -110
6346 -110 -14 -35 -25 -41 1 -257 -26 -78 -110 188 -49 -7 -175 271 -61 -37 13 -196 13 11 -150 -113 23 39 -85
6371 -85 61 -122 142 -16 201 183 -7 -152 43 -114 -86 -104 -135 24 19 38 -50 2 -58 50 -124 -79 -42 -99 129
6396 129 -11 -39 74 20 -20 -164 149 -219 44 37 -162 -132 65 -48 215 46 71 -21 -246 -250 78 -84 146
6419 146 -43 5 -184 66 20 43 51 -106 -46 87 -72 -12 -87 -82 147 53 -51 -135 -48 7 -68 194 -94 65 10
6444 10 48 20 -20 10 -129 -249 -136 64 -107 67 -32 -11 -94 -81 216 33 -23 -52 137 -57 9 -128 84 185
6468 185 36 4 -100 142 157 110 -165 73 -127 -114 286 1 156 100 84 87 -94 -15 133 -20 84 75 -140 -24
6492 -24 98 -76 22 -231 -316 -4 -273 -29 -31 -82 -221 67 15 30 -56 17 112 -73 -9 106 -148 216 127 -92
6516 -92 52 -91 -108 -76 103 47 55 4 -59 -26 -87 -65 36 202 -108 -60 47 67 -60 -147 -24 -7 -59 115 54 3
6542 3 92 42 -13 -78 46 -86 73 69 -53 67 -115 -81 110 -204 -44 -45 -55 -66 -91 -69 101 53 46 164 -34 129
6568 129 92 137 -24 59 -76 -154 -75 -109 -87 3 63 -36 -165 32 -28 -5 2 -55 6 -28 -26 178 -7 -77 -13 -47 -80 31
6596 31 14 55 -151 116 -56 -77 106 -23 -73 27 -255 -226 -26 39 -68 -25 83 -387 100 -192 60 -9 -50
6619 -50 -52 -28 -8 87 21 -216 35 143 44 -23 26 -38 -111 21 79 100 -207 -176 -71 120 -60 -90 34 -76 39
6644 39 76 219 -6 246 41 -24 3 109 -145 14 32 -162 67 -194 127 5 -42 -76 16 -56 -55 -85 8 16 12 -67
6670 -67 -60 54 -122 11 -78 31 -79 -76 -307 9 155 0 345 114 97 -36 188 149 4 -40 217 139 -225
6693 -225 7 41 94 -280 0 80 -12 -153 -54 -44 -109 133 186 -77 -68 -128 -42 -155 24 39 -19 11 -106 174 68
6718 68 -237 205 -201 140 110 -108 -320 -70 -6 -141 168 -98 140 12 61 -54 275 162 70 227 -59 62
6740 62 122 -196 -44 -53 -147 163 174 44 110 -180 153 127 -84 19 -76 -115 26 -26 -173 285 365 43 116 4
6764 4 -216 -37 27 40 100 18 96 209 -215 -74 16 43 -72 -25 0 -123 253 -86 105 3 -114 93 -118 73
6788 73 -156 -66 80 -184 89 91 48 -118 -77 54 163 48 -196 24 26 58 202 -44 102 42 102 30 -287 -95
6812 -95 -282 141 82 30 10 -18 -14 61 -22 90 115 46 -69 281 172 77 159 79 40 -172 81 -110 115 -91 108
6837 108 -193 -10 -15 -104 -21 129 294 65 152 -102 -30 -46 35 -124 132 113 42 -133 66 -71 98 159 -69 38
6861 38 13 -70 -44 386 121 36 53 -57 36 -22 -58 12 -9 81 -41 -95 -67 -66 84 -223 72 -1 -46 212 -137 -56
6887 -56 -24 -107 -120 121 -64 -149 -98 107 110 49 76 -112 41 -117 -194 -172 95 146 132 -48 -148 -98 85 80 141 -86
6913 -86 -77 -117 86 134 129 -18 117 104 -163 41 95 74 83 18 107 245 -89 65 128 -148 117 -212 -138 9 -64 3
6939 3 124 -47 -10 -38 -85 -7 84 24 -104 18 7 -110 28 -67 95 120 -25 32 -98 43 -126 -27 -237 -72
6963 -72 -5 235 -42 8 -95 13 -132 52 38 -89 -27 90 19 -50 -34 53 -70 109 346 12 88 -38 -55 -176
6987 -176 103 98 81 -114 -25 24 -128 -62 15 2 -137 -11 17 91 -31 -125 75 -20 48 48 20 -206 57 -1 76 -55
7013 -55 -90 -87 59 -56 -43 -82 144 -57 207 -2 107 31 80 273 156 -127 -99 56 -10 228 -13 12 -50 -23
7037 -23 55 27 25 -23 -172 -96 11 -82 88 -87 38 88 -20 85 -124 -101 -49 -31 64 161 -54 23 -40 55 239 -158
7063 -158 -57 188 -43 -57 20 -154 -28 108 98 8 -74 -101 -35 81 -306 -134 -139 50 42 -278 23 268 1 -21
7087 -21 -143 8 -33 -137 118 -147 26 144 -28 46 126 39 -80 68 -42 160 176 11 65 -101 123 -42
7109 -42 33 121 88 23 126 -193 42 -78 -31 -41 30 -228 51 -52 3 81 32 124 -158 281 -57 -155 -248 -121 -141
7134 -141 109 -91 -143 13 42 47 86 -53 19 94 -15 -146 64 15 57 195 22 156 69 132 -121 150 97 49
7158 49 60 -298 -128 -3 1 -146 -25 223 154 -326 -102 3 -144 -268 71 30 -84 132 -188 39 -144 23
7180 23 98 -88 108 80 -3 171 -90 69 31 77 -75 -54 42 111 -119 115 -9 139 70 -29 -41 -175 82 48
7204 48 105 -129 -105 49 -159 -13 41 124 63 -68 139 -29 12 -147 54 79 193 -76 -42 -139 21 -27 87 120
7228 120 46 -45 61 120 154 -16 -91 40 120 -179 -74 -85 -46 189 -45 -142 50 -116 -217 -164 -85 261 39 91
7252 91 17 166 -96 27 109 55 87 -9 66 -23 66 -104 64 9 -73 79 -66 -65 229 146 -31 -53 -108 86 16 -1
7278 -1 -10 299 49 -25 -86 172 1 55 155 191 -154 131 -142 47 55 197 73 119 -37 66 128 14 1 89 -56
7303 -56 -50 102 31 77 -26 -68 -30 117 168 84 -49 -76 11 -47 179 78 -300 6 97 54 -147 144 94 -67 -9
7328 -9 36 22 32 55 -69 116 107 -106 -81 -48 -17 -213 -14 -24 -47 -111 41 -97 -256 24 75 -200 176 47 38 64
7354 64 109 13 78 69 -7 -69 124 18 43 -129 90 60 -32 80 -165 22 -92 -46 23 -5 -14 -20 -96 51 3 -29 -108
7381 -108 76 -59 7 -39 -185 148 -55 -77 -46 56 81 58 161 -45 121 135 26 -107 64 -32 -4 18 -162
7404 -162 52 24 27 -126 -140 44 323 -115 -138 124 160 -128 -109 -175 62 -79 171 -84 -60 -142 30 -26 268 0
7428 0 -40 35 21 -54 84 -66 -45 -7 108 55 181 -7 20 -93 -30 163 -18 -63 -55 -30 -114 -79 5 45 3 -19 71
7455 71 -222 -129 -165 -142 87 20 127 9 -241 112 -202 -37 149 -107 124 -34 46 -214 -46 -81 69 66 -134
7478 -134 -44 253 -201 1 -60 -164 11 -143 -92 39 -56 77 268 101 -58 -70 -79 17 -1 -94 69 -26 38 157
7502 157 -135 108 -88 131 -18 89 -24 174 8 -111 58 -52 35 -133 76 -37 51 -182 36 93 82
7523 82 96 4 125 64 47 -115 -83 -1 45 -8 67 -117 -114 129 -85 -73 13 22 121 42 89 75 -83 -34 120 -59 14
7550 14 -116 -135 -11 -75 -43 -83 204 118 79 -14 65 -10 185 110 108 -98 -2 46 28 98 44 77 -148 21 8 91 -143
7577 -143 172 20 229 -51 -138 -97 -171 80 65 202 51 105 11 -8 -34 -63 -61 8 86 -37 -187 -41 168 -9
7601 -9 -99 -164 -127 -62 -61 -69 74 -73 86 -49 -13 159 -32 -37 -11 -129 -57 80 -119 24 -42 -144 -178 -10 -158 41
7627 41 188 -198 -202 -154 56 -41 74 135 -118 -91 214 82 95 -109 72 -27 -143 43 -174 45 -56 -45 21 87
7651 87 -61 137 -158 38 3 -34 224 -164 16 -140 -120 -27 19 -97 91 6 -157 -158 138 15 12 144 89 -296
7675 -296 -123 -28 88 256 182 -70 -40 -16 -26 -39 63 111 -48 245 -70 43 63 -70 53 -12 23 24 142 65
7699 65 -75 265 91 85 -65 -251 -41 -36 -40 93 -111 -42 24 -98 -40 -118 169 -193 35 42 -21 21 -181 -144 -100 -78
7725 -78 157 34 -4 155 -122 -42 138 214 -191 -87 -322 85 99 101 -48 17 -240 67 95 -125 -105 -291 -34
7748 -34 -47 -124 83 -36 -112 -3 96 33 -49 75 -159 -117 94 -61 92 -103 -89 85 19 57 289 101 204 108
7772 108 -3 -79 151 50 12 -27 51 4 -20 132 17 -121 -55 136 -52 -77 90 201 63 -34 -99 130 -244
7795 -244 176 -135 17 -40 -203 -172 -28 -59 -86 -19 24 -144 -79 37 -67 108 44 257 -50 91 18 38 -70
7818 -70 -78 70 -46 -13 220 5 87 -16 -254 36 23 218 50 109 80 315 39 45 28 43 -200 81 -240 -53
7842 -53 -150 -117 51 -164 30 32 110 -137 90 59 -68 128 -119 -61 4 -81 -47 205 -94 -29 220 83 -47 -18
7866 -18 -83 104 -31 16 50 -308 7 21 14 49 -119 222 98 52 130 142 -4 -120 93 -11 -49 124 47 268
7890 268 30 11 -14 95 53 -5 -122 37 -166 86 204 460 66 12 58 -71 92 -44 -306 80 -149 -8
7912 -8 -60 -90 35 -137 -8 -381 3 44 -129 57 7 -171 -88 -122 125 167 -27 50 -94 -73 107 75 -117 -3
7936 -3 166 35 -91 -109 47 28 -89 109 23 80 23 16 126 231 127 -20 91 15 73 -214 206 -96 -70 -49
7960 -49 -23 -145 -75 -32 8 -330 65 -59 -268 -73 -162 55 67 -127 -3 57 -18 38 18 -138 19 -40 81 -89
7984 -89 34 49 118 77 -14 250 -68 17 65 83 -37 -58 196 12 104 -194 73 114 148 20 -30 -41 -139 29 -113
8009 -113 -42 250 127 16 64 -9 225 -33 -125 -86 63 0 -19 93 -96 70 130 63 67 -91 101 -274 -150 0
8033 0 170 57 -232 -34 6 -174 -109 -9 146 9 7 -40 -21 -74 153 -61 -209 8 -56 102 -56 -87 2 74
8057 74 -88 -64 -230 18 22 67 -38 27 -187 -200 96 4 123 -116 86 -88 25 12 16 151 -172 -15 106 -64
8081 -64 -117 166 -11 -144 230 -5 46 -117 101 -126 190 137 171 -76 -21 -130 -48 30 53 -205 126 -223 -17
8104 -17 -98 29 -13 -139 134 44 -165 40 46 138 63 -61 -59 -25 113 -100 -3 -28 -47 -271 -92 6 -35 11 20 -86
8130 -86 -113 99 -120 -92 -117 74 195 57 9 132 -102 -37 -42 24 33 36 -3 -154 103 -119 98 175 110 -85 -24 -84
8156 -84 128 96 79 111 -120 -162 -14 -69 -145 -180 9 -82 115 98 -215 179 13 43 -65 -23 203 8 149 -255
8180 -255 41 -174 -73 -6 104 -44 -112 134 182 77 -101
8191a01
$$ Imaginary data points
##PAGE= N=2
##DATA TABLE= (X++(I..I)), XYDATA
0 0 0 0 0 0 0 0 0 0 0 0 0 -8 8 -8 8 -8 16 -16 24 -24 32 -39 40 -48 59 -72 80 -96 108 -124 144 -160 184 -208
34 -208 233 -264 296 -333 372 -415 462 -512 568 -630 696 -768 848 -935 1030 -1136 1251 -1379
52 -1379 1521 -1677 1854 -2053 2279 -2539 2842 -3200 3629 -4157 4824 -5698 6895 -8647 11470
67 11470 -16779 30331 -145798 -228425 -1368 -3620 -42860 -57266 9642 17007 36373 114297
79 114297 187133 114184 19860 13488 78319 65499 -21011 -54931 -11651 -41048 -108896 -95089
91 -95089 -16632 3103 -37223 -40629 6649 -14685 -67404 -19699 87447 111280 44879 -10908
103 -10908 7679 31718 22939 40573 70005 27505 -59027 -87650 -22933 30568 -13754 -67456
115 -67456 -51848 -38585 -49221 -19329 48417 71817 17329 -22703 14276 46833 29937 23051
127 23051 39955 35341 -13542 -59474 -38908 2269 -7341 -25632 -12599 -5294 -26317 -37660 8219
140 8219 61938 39024 -11402 -10584 9280 9622 9367 25304 30062 -14053 -60578 -39734 6354 16985
154 16985 2822 -6914 -3786 -9608 -22541 3512 46667 38804 359 -12850 2451 8939 -4217
167 -4217 1516 20459 -1945 -41002 -38502 -10097 6684 2255 -4260 2478 -4146 -20522 -3595
180 -3595 32932 45026 23588 -3464 -2567 7416 -723 2885 19304 6539 -28308 -43526 -24237
193 -24237 730 -2961 -10942 -2965 -6596 -16808 -5428 20701 38186 27839 4759 3835 10609
206 10609 5533 6272 14007 12637 -8630 -34801 -29663 -7636 -6641 -10307 -3789 -6197 -16054 -17115 3254
221 3254 28761 26951 9833 5321 5339 5517 10069 15146 18050 2712 -23225 -25107 -8972 -2523 -4680
236 -4680 -7807 -7879 -12245 -19727 -6943 17081 19166 8418 4309 4203 6033 6195 10566 18418 9609
251 9609 -9239 -16277 -11279 -2765 -552 -5397 -4556 -7694 -18561 -13128 5840 15435 11079 1377 78
266 78 3199 1514 7342 17198 11493 -2675 -11698 -11177 -1935 1433 -1647 -1679 -5815 -13168 -11468 -1492
282 -1492 10920 11420 1078 -712 2272 -156 3733 11361 11459 2631 -8930 -9983 -2480 -762 -258
297 -258 723 -4154 -8748 -9951 -5449 6433 10204 3649 737 -61 -135 2425 6412 11140 7273 -5991
313 -5991 -8964 -3965 -2021 474 1288 -2319 -6254 -10753 -7141 3699 7443 5587 1710 -2060 -16
328 -16 2646 4126 10008 8274 -1911 -6322 -4778 -1022 636 -949 -490 -3111 -9607 -7517 39 3628
344 3628 5132 2438 -866 65 65 2450 7936 7848 2875 -2964 -5939 -1527 1266 -138 1041 -1428 -7912
361 -7912 -8115 -3633 2281 4618 1215 -363 -984 -1886 2234 6287 6560 5075 -718 -4443 -1324 718
377 718 1019 1482 -713 -3985 -6491 -5732 808 3472 660 282 -774 -2479 -34 3373 5663 5500 318
394 318 -2372 -1420 -559 2211 2148 -11 -1511 -4963 -5902 -809 2167 1508 204 -1965 -2120 -1116 470
411 470 5136 5250 713 -954 -1466 -1030 2036 2026 1384 -128 -3882 -4289 -1911 464 2489 725 -1995
428 -1995 -1257 -1885 -1056 3397 4512 1921 -395 -1933 -805 1068 1485 2560 915 -3073 -2981 -2679 -781
445 -781 2296 972 -946 -1281 -2377 -1111 1619 2845 3333 92 -2058 -420 170 911 2798 1429
461 1429 -1043 -2414 -2827 -551 1391 753 390 -1292 -2537 -1006 62 1726 3096 878 -1496 -1058
477 -1058 -349 915 2034 1351 623 -1837 -2730 -262 744 625 1284 -905 -2176 -1074 -735 1205 2207
494 2207 673 -488 -1431 -1379 1063 1299 1166 1381 -1166 -2360 -851 90 1255 1258 -273 -829 -1758 -1124
512 -1124 1119 1497 928 450 -1531 -1473 300 420 1488 1425 -657 -1322 -1445 -427 1462 773 139 171 -1592
531 -1592 -1431 596 1235 1296 493 -769 -730 -788 147 1651 749 -225 -374 -2082 -885 965 793 648 199
550 199 -931 -927 -539 855 1994 788 -449 -133 -1168 -127 1231 533 66 -606 -1644 -970 -148 354
568 354 913 -401 -719 -355 -873 304 1974 926 393 -325 -571 41 647 887 1086 -662 -1360 -800 -1213
587 -1213 298 1042 -259 -611 -962 -927 283 922 869 1016 -402 -480 477 42 916 1409 -314 -941 -711
606 -711 -862 134 231 144 -284 -1334 -1060 107 76 860 1311 -215 -329 112 52 1390 982 351 87 -1132
626 -1132 -743 124 -46 10 102 -1152 -1253 -606 -286 809 759 147 -156 -393 149 962 617 917 532 -934
646 -934 -446 45 1 449 -104 -721 -908 -1170 -566 406 111 336 225 -655 233 849 861 1049 736 -172 -299
667 -299 -133 238 703 21 -452 -509 -1391 -530 35 62 138 -189 -411 -246 -29 540 942 216 126 -46 -354 162
689 162 561 38 212 -427 -1015 -397 -250 18 313 -477 -319 -522 -433 517 754 303 515 -88 -332 280 287
710 287 631 479 -192 -276 -606 -523 211 193 -311 -202 -492 -547 141 427 784 295 -400 -20 287 269 465 340
732 340 -214 -186 -548 -358 50 -17 102 -213 -621 -284 92 -70 657 159 -140 -20 -55 51 513 395 111
753 111 -17 -630 -81 80 52 393 -64 -659 -132 -228 -140 504 316 131 -135 -400 122 249 51 614 -35
774 -35 -192 -65 43 -139 333 94 -286 -3 -247 246 242 -3 50 -116 -514 -7 12 -23 225 -33 -183 -25
796 -25 -119 355 315 224 234 -400 -455 11 73 159 246 -34 -437 24 -377 404 213 -266 101 -388 -150 212 115 100
820 100 230 -245 -136 42 187 261 328 -105 154 -28 -360 255 214 -215 250 -368 -259 87 176 241 -34 -30 256
843 256 -50 -42 406 160 178 219 -151 -220 -148 -143 71 -52 -436 -196 -334 -67 339 -265 -39 97 12 152 524
866 524 176 321 -113 -277 136 -127 -120 232 -105 -377 12 -174 -120 126 -156 -151 -202 -209 127 59 132 449 -100 -205
890 -205 172 127 -29 325 -170 55 -431 -390 -101 -206 -180 46 -368 -386 78 -64 129 404 307 -36 -122 81
912 81 237 145 -8 44 -147 -114 174 -234 -64 -17 -211 -56 -300 -103 83 181 2 276 -13 -85 310 175 251
935 251 129 65 132 -364 -81 183 -157 -282 58 -353 -166 87 -78 160 329 222 81 159 274 237 75 21
957 21 38 -105 74 32 -106 51 73 -61 -459 -325 -83 -176 -142 -75 69 -10 87 158 36 186 205 -241 113 178
981 178 135 103 -174 -110 -108 -240 10 9 -165 266 -27 -229 -9 112 159 72 -42 -6 17 -55 37 279 -84 -126 86
1006 86 -95 126 -167 -115 -94 -236 -331 -16 -124 13 101 -337 -41 136 -100 83 173 -52 185 -83 -183 27
1028 27 57 99 87 30 -273 220 -63 282 68 35 -30 102 -5 -42 21 128 258 -205 -95 -8 2 262 -240 208
1052 208 -83 -240 -6 -6 95 54 96 -270 193 -44 -230 288 -162 -32 -132 -36 -8 31 -34 -118 178 -160 92
1075 92 -175 -233 -103 131 -328 -140 11 75 47 102 21 70 -189 66 259 -123 -69 207 -279 53 -105 -30 106
1098 106 -150 108 -67 -157 -7 108 -99 166 -145 187 47 -43 275 187 -24 35 28 -28 -54 -83 -171 293 -282
1121 -282 -166 -41 186 42 125 39 102 43 -135 112 -9 -22 145 65 -259 -81 -123 -84 83 -94 -122 -226 -388
1144 -388 -6 -147 -17 -25 6 -85 22 -38 163 81 -99 228 -182 32 49 6 22 141 142 -131 331 -102 157 48
1168 48 -113 -161 -138 -199 -12 171 39 193 -41 20 229 -74 -24 -143 -34 227 -21 -29 -168 -129 10 -50 264
1191 264 -46 15 -91 -192 -143 -54 44 -68 -70 -31 77 -16 145 -180 -150 -16 -47 -21 -21 -35 114 -68 -34 -107 -172 -209
1217 -209 216 7 150 -5 205 104 178 107 -140 216 -19 -169 127 55 -128 -52 -87 272 -164 -8 -106 -67
1239 -67 87 185 -123 143 129 125 -21 133 -164 214 291 -85 218 -115 52 -7 60 158 115 -51 141 11 -89
1262 -89 -43 -128 138 -17 -78 212 3 -156 -184 -109 -88 44 148 95 -175 -6 -112 -90 -61 -301 15 -137 -1
1285 -1 26 -21 -66 -159 58 -34 -78 68 -45 -28 -37 187 -104 -226 -152 -71 -36 -203 -243 54 -96 22 49 -305 321
1310 321 -77 -202 117 -140 -25 -3 -162 49 300 -11 -27 9 -60 113 246 -74 141 41 31 68 -122 203
1332 203 198 -43 117 162 -100 159 153 66 -4 -329 199 -3 23 -142 -31 104 -122 219 3 -190 123 -193 27
1355 27 70 84 205 -122 -143 135 -6 32 62 -208 62 -3 -135 -101 76 -90 97 -53 41 -70 48 128 203 -63
1379 -63 45 -4 -36 46 122 189 -59 -76 44 146 -13 -86 -271 11 -231 -184 10 -104 -45 46 44 -152 -71 32 -51
1404 -51 37 102 33 -120 132 160 21 -393 71 -35 40 101 -42 4 184 -57 6 227 -78 59 131 92 -139 -57
1428 -57 -95 213 198 92 3 147 107 57 -116 32 215 -136 -244 -157 114 184 162 -87 44 77 6 22 -108 -28
1452 -28 -104 -66 -144 -97 -84 -172 -108 122 41 -158 242 154 -16 42 64 35 -285 -61 -32 111 48 -89 -155 -176 -108 89
1478 89 -38 6 -23 130 190 -141 163 -50 -11 -9 205 11 -131 -170 103 -36 -83 -128 132 -55 37 32 -192 -197 -115
1503 -115 16 38 115 -86 194 127 206 2 30 136 101 -40 -141 -48 42 -101 126 44 -212 29 -159 180 -24
1526 -24 118 -149 -121 -189 18 -56 9 -30 135 -3 -96 19 -186 -1 77 44 -158 51 11 70 -13 7 16 -134 -20
1551 -20 102 -128 172 271 -139 -6 38 -158 -106 39 -49 -103 -27 -22 -156 63 192 -55 59 -72 -113 -76 -55 59
1575 59 -83 -110 -36 -215 86 60 55 35 59 -64 -95 2 45 48 13 -17 -112 187 -108 -181 279 -90 -161 0 -36 210
1601 210 64 15 211 75 -171 7 163 -82 61 37 127 44 14 31 196 -33 189 -33 -174 252 -9 33
1623 33 230 -100 -228 130 -22 116 83 -177 71 -172 -154 83 -94 136 -153 -105 101 -25 -100 -161 11 -75
1645 -75 44 -36 214 -151 -144 5 69 -106 -101 -213 -80 -67 7 -89 11 146 -44 230 -128 -66 78 -121 137 -79
1669 -79 -15 58 -101 27 1 127 49 145 64 -151 24 -41 -179 -104 -47 -55 24 -177 44 155 58 4 -35 -45 -15 130
1695 130 208 -8 -159 19 71 -234 -115 -212 -148 -152 31 -246 -97 -159 -102 34 -8 -6 55 -91 48 84 51 57 66 110
1721 110 6 -81 216 63 -84 22 48 98 -75 -82 85 -120 -334 -113 11 35 155 -162 13 -18 -5 60 49
1744 49 -29 90 62 -129 193 110 29 -167 64 -118 131 -1 -111 -5 -158 -37 -141 3 -122 4 -73 -67 -116
1767 -116 226 -39 -112 -9 -119 -1 -59 112 69 147 35 -191 -29 -114 -47 54 137 -148 271 -195 -18 -40 -170
1790 -170 11 126 -67 204 -7 87 40 130 54 -124 240 1 64 75 85 61 110 -93 117 26 -27 -145 30 42
1814 42 53 97 26 127 101 -72 183 -95 23 122 51 175 102 -268 -104 -165 57 45 -138 46 329 -27 -10 -66
1838 -66 48 52 -4 -13 -94 43 -96 60 -23 -50 -68 271 149 -88 -145 53 4 -192 -148 -35 -52 147 -128 188 25
1863 25 -165 245 -109 241 168 143 -40 -46 203 141 -130 26 34 -136 -39 5 70 -233 17 237 49 71 368 108
1887 108 -75 33 -124 26 -72 -101 73 58 -199 -88 -47 -101 -141 149 126 61 6 78 8 -71 -111 110 -94 -29 -70
1912 -70 -118 10 123 123 38 -363 -86 -3 290 -139 262 159 27 108 -268 -131 13 -22 -6 -3 94 6 -199 28
1936 28 -48 -81 27 -147 -168 -52 -56 -85 -91 -7 84 68 21 40 -127 63 18 -60 3 54 -84 -185 -19 36 -7 -14 -265
1963 -265 35 44 -79 -108 64 -52 126 -82 -104 39 -9 79 1 40 -51 -61 -126 -91 172 67 -81 -21 122 -39
1987 -39 35 -62 96 -217 -178 272 -126 38 -54 9 88 -174 80 -11 29 76 7 -65 114 62 -102 -34 -25 32 35 37 -72
2014 -72 -167 -4 31 34 10 39 72 -178 -18 -54 42 -140 46 -251 -120 -175 -166 73 190 -133 29 117 -60 107 -32
2039 -32 -218 40 19 -50 -3 -28 182 -246 -43 -111 -48 169 -90 -188 63 147 -107 -11 -102 -149 -144 -200 43 -132 115
2064 115 -131 148 14 101 -26 82 99 9 -275 108 -96 2 -143 -28 -85 -33 215 -76 161 -156 139 103
2086 103 54 37 -42 34 -59 -95 184 110 -8 -124 216 -74 -216 -34 -153 -144 22 -53 -33 68 14 271 -38 -167
2110 -167 173 -46 77 53 59 269 -91 11 8 -93 87 -60 110 -60 47 30 -66 -110 -84 27 133 268 -68
2133 -68 -84 -82 -14 212 126 24 -118 -183 113 -12 -71 -48 43 -129 -115 56 24 14 12 -118 -92 137 -43 113 -151
2158 -151 -71 107 -27 72 -123 113 -71 -94 -149 -29 39 162 88 1 7 168 -36 -189 -117 338 78 22 290 -32
2182 -32 221 -104 110 -263 -223 -108 38 -60 102 -196 -172 -22 267 140 -32 -32 8 96 -18 11 202 -34 -48
2205 -48 10 59 -99 102 224 212 116 -64 -18 140 -13 -100 26 -11 141 107 130 35 -52 -66 -69 10 -35 -150 110 27
2231 27 -24 75 -43 -21 -217 27 -11 205 118 -124 -184 -209 -132 6 -133 218 110 94 89 51 -75 -23 87 -26 -131
2256 -131 226 -131 142 -156 -72 188 0 -161 122 -98 86 -45 -39 137 75 -111 -73 -55 -54 -72 -285 47 148
2279 148 66 -34 -181 -182 86 94 -103 318 -39 15 22 -2 48 -83 67 -51 -32 -109 7 -30 177 -339 -125 -37 -182
2304 -182 -85 -167 187 -238 -171 53 36 -104 -47 5 -48 -4 22 -48 -238 58 -100 -104 55 5 -137 104 43 -41 63
2329 63 -42 30 -41 -61 87 109 -153 -130 72 -12 -34 270 178 -50 -126 -82 -91 8 63 -30 -268 -72 7 93 107 32 102
2356 102 125 5 -31 157 -201 -150 -102 -277 46 52 112 -116 -54 -130 -229 -107 37 161 122 227 -77 -76 -197 162
2380 162 70 -145 38 74 10 -77 -9 118 -75 -157 -116 93 110 88 107 219 94 62 140 -105 -194 224 -141 -143 22
2405 22 47 90 -6 -50 -47 61 177 78 19 69 20 98 68 89 4 95 24 75 169 -26 -112 67 -45 -134 -10 -179 46
2432 46 -73 -6 -77 126 76 192 -27 7 -232 57 150 -50 131 192 -54 57 239 -69 50 99 -48 17 -47
2455 -47 -35 -8 43 -30 -245 46 91 103 -94 -122 131 39 -68 71 64 108 34 116 -2 -188 -85 151 -10 1 284
2480 284 -171 -153 -65 159 51 -88 -127 166 -100 -210 -56 97 251 17 51 -51 342 -81 56 63 -70 -54
2502 -54 81 63 -126 66 -108 -92 -135 -29 145 -154 -125 21 176 72 276 61 -69 -23 -29 -116 -2 -60 -179
2525 -179 301 -93 34 214 76 -35 -125 -50 101 -50 112 17 -260 76 92 239 -253 -13 -76 86 107 209
2547 209 -3 -78 -42 141 95 -170 -98 -90 152 70 -129 -93 -21 68 240 148 -172 148 -43 121 79 238 -17 -38
2571 -38 -47 -165 -154 -178 133 -140 -70 -64 120 -185 -132 147 21 -55 221 10 -181 -83 -47 225 55 140 -69 -27 -28
2596 -28 -2 -27 39 120 -65 201 80 -132 -206 -30 -63 -99 -191 -75 -14 -78 211 -12 -105 100 -70 -119 116 -163
2620 -163 -162 59 7 267 195 83 -260 54 182 105 -49 15 -14 -62 -71 68 12 -6 -205 -168 7 66 112 71 51 -263
2646 -263 -48 144 -153 -103 -48 -23 50 12 72 -139 90 -48 -102 -228 -25 -106 54 206 -34 76 -6 -84 9 -25
2670 -25 85 -75 140 46 -263 -209 -61 93 80 118 35 -97 49 -175 -128 45 36 29 190 -5 129 21 -9 -274
2694 -274 -94 138 -111 -174 -197 -24 -125 55 -47 -81 -8 7 -15 -10 28 -181 -313 22 -74 -53 -161 -91 -55 -117 261
2719 261 139 -19 -169 -38 -28 19 109 32 6 146 71 133 79 -71 -170 122 -18 -72 22 134 -25 78 -20 -138
2743 -138 95 -20 -263 -157 171 -96 -5 -61 -187 197 76 -11 244 193 32 -150 -219 -47 235 251 -46 18
2765 18 -16 -11 186 77 -9 -110 19 80 32 -111 -48 104 8 27 -166 -183 -16 -80 152 -38 -68 -217 18 -57 -152
2790 -152 -25 -4 -112 85 -104 26 -113 -195 -216 -159 81 -70 64 -189 -63 -24 21 168 58 115 -128 128
2812 128 -136 -43 114 -44 -122 -194 -98 30 155 -117 128 -127 13 98 150 69 -1 -2 64 19 -64 -188 -70 -66 15
2837 15 -67 95 3 43 94 75 -71 -89 7 -62 -123 154 -221 -9 -54 -84 107 -106 141 -74 124 -44 -11 -138
2861 -138 -120 -210 -19 95 -138 -73 -99 -94 77 -86 4 64 -38 7 -155 -38 -101 18 33 196 -55 126 119 -21
2885 -21 -133 45 130 75 -42 178 -100 -105 234 -129 24 54 76 28 260 85 -92 74 -92 -80 -58 11 74 -127
2909 -127 22 163 -142 -29 -101 112 -5 52 -89 -147 -48 156 80 -78 -19 -167 51 75 -256 98 -55 -72 210
2932 210 0 115 -20 188 9 -148 195 34 53 128 35 -102 136 14 -106 191 2 -121 58 153 7
2953 7 -50 -9 -49 6 -66 219 -1 30 155 -100 67 53 57 -124 53 -36 -78 28 -66 -7 150 -80 -140 137 -15
2978 -15 125 31 110 186 25 -36 -31 -160 22 -43 65 -149 -143 -92 -184 -41 -51 -31 69 -47 43 19 -46 182 127 202
3004 202 251 26 136 -61 -50 -3 -7 -108 79 -118 -152 169 115 -20 -336 -76 39 -186 191 138 -28 -115 98
3027 98 18 -27 -83 158 -39 -46 -107 100 -54 214 -10 48 186 -142 -44 11 46 -44 5 -99 56 -337 124 70 103
3052 103 40 -75 -95 -23 170 -77 -33 -58 57 -91 -7 -121 20 -126 46 -59 -60 191 71 -12 1 -5 -150 64
3076 64 -31 -13 164 135 101 -146 -149 -38 74 1 -26 97 52 -22 -50 -11 -25 -178 47 13 -108 180 213 87 -128
3101 -128 11 12 -147 -11 89 -197 14 -34 -48 167 -60 50 18 42 -102 -140 -8 280 54 -22 41 114 20 133
3125 133 136 20 109 -64 -90 35 -50 -20 -153 102 72 22 -4 -228 -180 -176 -25 -149 87 -179 13 29 -41 143 -25
3150 -25 151 -137 -15 165 104 56 36 -176 -244 248 -48 -113 106 -118 77 -82 109 200 -15 74 58 2 92 115
3174 115 65 227 80 -33 -201 112 -51 -61 -98 -7 57 -82 -163 84 -31 103 -115 -108 99 126 3 115 -101
3197 -101 70 227 9 25 -342 106 72 97 -99 181 -41 -28 55 -121 158 72 -94 31 58 -88 -56 -201 -170
3220 -170 21 -7 -139 102 -46 15 101 -172 -32 -47 79 48 -31 -137 -54 -130 -162 24 -118 -102 47 238 85
3243 85 -32 -87 181 -9 68 178 -48 -29 -261 116 -126 -57 28 -84 -32 79 -156 81 -14 -67 -82 -96 98 77
3267 77 77 66 -92 159 75 -91 2 -49 174 -33 57 -168 14 -167 -11 -127 -7 68 -69 -91 99 61 60 149 207
3292 207 -53 -102 -17 -24 -36 -28 -10 16 143 -96 -36 -175 -111 -115 0 28 -61 35 101 -108 -53 78 124 -51 -129 37 157
3319 157 61 204 71 -92 100 136 175 186 -14 90 -28 -180 -15 37 -96 50 101 122 79 124 -138 70 136
3342 136 -193 -13 -10 59 -53 -58 -159 -151 80 100 -24 2 -34 -70 243 -62 48 -111 -122 -11 109 207 114 -200 101
3367 101 45 149 -25 -99 -142 97 -24 86 -38 -60 -111 260 34 74 -54 -79 239 -48 -125 -255 281 50 -59
3390 -59 -311 -71 72 -146 -163 -132 -117 -30 118 177 -245 68 241 -89 234 -16 -52 -48 54 89 -136 73 59 -155
3414 -155 -67 172 63 -4 -116 -132 -58 45 169 -107 111 69 -18 88 126 87 -105 44 -40 -185 48 -94 11
3437 11 142 -46 -93 154 110 57 -95 266 52 -116 -110 76 -114 -149 45 -96 -121 -83 9 -136 -94 -64 -162 -42
3461 -42 185 130 -36 -99 83 -105 -142 64 240 15 -198 5 -69 -21 -77 -302 -127 -67 -1 -24 -276 88 55 -124
3485 -124 25 108 126 19 2 142 78 -217 -4 20 170 158 97 -94 -30 -91 83 254 126 132 -191 32 23 -100
3509 -100 18 -435 232 -15 -49 81 -196 -89 -26 35 186 0 66 126 -3 -65 -56 -86 -65 177 121 278 -56 55
3533 55 108 -59 24 -235 93 -54 70 -2 -65 -65 -297 107 -227 -44 -65 -22 11 165 -122 169 -147 37 29 151
3557 151 -58 -265 136 56 26 -49 -2 189 -270 -43 -9 181 31 -80 -76 76 24 -115 8 -137 62 5 -17
3580 -17 -113 -61 -165 -28 177 -31 61 -68 4 23 20 -87 142 -37 54 32 28 140 -103 169 -23 155 2 123
3604 123 83 -142 32 161 -76 -101 -64 52 15 -136 177 -98 -53 120 109 132 -73 -28 67 -63 -113 -55 3 22
3628 22 22 -14 110 -22 27 95 128 77 -60 -98 105 -82 193 43 35 -132 126 -88 -66 1 149 -12 141 -73
3652 -73 -106 43 -98 -48 262 64 270 -22 29 76 -104 -2 41 241 17 91 -154 26 53 192 151 -109 -146
3675 -146 -31 -217 20 213 -26 157 148 132 -155 95 70 241 -157 -86 43 -45 -222 9 84 -72 -168 -134 -5
3698 -5 139 40 -108 231 28 201 101 95 140 -70 -176 -79 -79 -60 -10 -87 97 19 -219 -57 27 137 122 307 130
3723 130 23 -49 -120 -142 -15 -93 17 -97 41 48 9 -140 -40 -171 -125 -1 -28 22 59 103 -114 22 -22 35 207
3748 207 -132 4 29 -139 -70 -74 -74 67 56 -44 -45 63 -115 82 192 40 54 -120 178 32 -65 -110 -141 -27
3772 -27 101 16 -55 114 -72 -4 -28 -34 -8 75 -43 -57 27 -157 -10 -37 53 42 -16 168 -12 152 28 -73 -16
3797 -16 -79 46 -65 -272 57 -183 68 144 92 -112 -170 145 -202 -66 -44 100 -53 -31 -27 -58 63 -218 -37
3820 -37 4 -15 -120 -92 -94 146 -3 -8 70 -164 19 -66 84 73 3 37 -175 122 172 43 69 77 194 105 -35 -111
3846 -111 -209 69 -94 58 -30 -43 -62 112 50 -66 131 47 63 -70 -62 84 -97 68 -152 -245 112 -9 1 -121
3870 -121 38 190 14 39 -73 30 -71 50 88 144 3 27 16 -121 -150 0 183 26 -134 217 34 49
3892 49 206 142 126 -24 -54 -144 171 94 88 -178 59 69 114 149 168 0 164 89 48 -121 149 76 164 81 109 76
3918 76 -134 -98 24 77 32 -161 -65 12 15 -107 89 126 180 176 26 20 2 54 -62 78 11 -82 -192 -4 141 -55
3944 -55 -100 -81 135 -91 22 -215 -154 -10 -29 -59 -60 6 26 37 -93 90 -54 -75 200 -21 82 -13 -94 -90 -85 -167
3970 -167 81 69 -42 138 -76 122 -77 2 166 121 -111 -86 -41 -21 -43 -27 90 74 143 -58 -54 19 76 44 -52
3995 -52 95 -227 -17 -18 -309 -151 -49 22 131 -51 307 72 66 -36 17 44 -72 -186 235 -123 -69 81 76 73
4019 73 37 15 -160 2 37 23 41 -8 -267 128 -11 -204 -77 53 -56 -2 -144 80 5 -40 87 -198 12
4042 12 -9 65 23 -59 38 2 33 9 88 -100 160 -133 -108 -229 -44 171 75 58 -13 -50 -188 50 73 146 -80 -95
4068 -95 70 32 -38 253 -52 -231 85 -122 -30 63 -86 187 65 140 -95 57 108 87 186 139 -61 -53 -89 21
4092 21 37 -26 -97 47 138 -52 -66 -74 40 -57 33 -346 -23 -2 -15 -59 27 4 3 149 -82 60 -29 93 -82 138
4118 138 -105 12 97 16 38 -52 56 162 -90 -29 -138 -199 27 109 60 66 -42 12 -285 101 -233 -47 181 -183
4142 -183 220 -42 -151 14 -34 -141 -48 157 121 -2 99 180 -22 -82 114 242 -35 199 57 84 -144 -373
4164 -373 -21 -12 170 49 46 -204 105 -95 2 -51 32 -8 -72 30 -92 -156 74 -132 -25 -30 -9 -101 -191 -101 -66 -213
4190 -213 -52 68 -92 -156 55 -154 -80 106 184 77 -19 12 -130 132 133 70 -85 -253 -49 -159 108 -33 -105
4213 -105 136 161 224 -60 -128 104 -103 18 -115 -17 -14 226 -85 -100 -25 103 71 -111 -173 -96 -105 187 -70 -164 -66
4238 -66 -108 194 -73 55 -2 21 -139 -117 -45 80 127 83 -127 54 173 -55 280 109 -26 178 80 -69 14
4261 14 -17 145 -134 17 -6 113 182 -236 -58 31 -61 88 57 -223 115 -122 -88 178 306 107 -151 -94 -64
4284 -64 -44 -64 -55 -53 -182 -165 -45 -4 -7 231 38 115 185 -26 49 78 22 101 28 373 -104 7 -175 -94 -176 68 -67
4311 -67 -79 148 77 -7 -108 -98 81 1 -68 42 -69 16 105 -78 -90 147 303 -49 -111 22 61 57 182 33 296
4336 296 222 110 -30 -25 38 74 -7 68 -117 58 -45 -41 96 -45 77 124 75 -99 127 11 -1 5 -40 89 -6
4361 -6 -157 -143 56 -69 -116 128 11 -6 79 62 -175 -105 32 -286 -17 107 -44 20 -43 181 -118 -15 -82 59
4385 59 84 16 -115 76 96 76 -45 -128 11 -204 239 63 -58 -92 -6 -54 173 237 -21 25 -166 67 -4 -73
4409 -73 -249 -21 -37 49 -26 -10 46 34 -167 -240 98 39 -49 -170 77 -60 -15 -103 161 -179 48 -56 -134 49
4433 49 48 85 -172 29 85 15 88 -127 55 -23 56 15 -69 179 -357 38 -111 -30 -91 -91 109 -200 -89 49 -135
4458 -135 -4 -78 72 347 111 -45 82 42 -90 30 -76 61 147 244 -163 -54 21 62 23 -63 39 35 146
4481 146 -67 -52 57 10 -25 -60 -59 -31 92 5 -122 106 -4 43 -79 16 65 -79 27 -24 145 -265 114 78
4505 78 -28 93 -79 71 165 -115 135 41 -11 91 -8 327 44 -56 52 71 186 -30 -1 -4 213 -40 -31 -33
4529 -33 -18 132 28 58 -12 -149 -97 -8 119 -26 13 96 126 -127 43 174 92 -53 249 168 47 -31 23 18 -22
4554 -22 47 100 -144 -163 139 98 20 44 -46 -74 138 -64 -27 44 94 -143 -60 122 -121 -213 -37 -84 148 62 -22 167
4580 167 11 25 -82 -34 -51 -31 34 -101 -10 -11 190 -130 -43 154 87 -192 184 386 92 -61 -115 -104 192 -135
4604 -135 -218 -26 -15 81 -21 -110 166 69 -108 34 -85 -26 -19 64 113 -2 -72 -99 -38 77 -25 -33 95 26 175
4629 175 211 -52 -7 7 -171 -64 16 -87 -101 153 71 -58 80 108 55 34 -168 -31 229 -127 32 162 92
4652 92 204 -169 -61 -29 -72 -12 0 180 -16 -259 -73 -16 41 -112 115 -12 -37 178 192 -43 -166 -34 -232
4675 -232 -47 -103 272 -23 -4 7 -5 29 89 -38 -40 71 -41 -107 -73 25 79 69 -25 3 -22 49 -48 2 103 -74
4701 -74 97 113 145 -73 -156 25 -47 192 92 77 -115 57 -172 -35 -17 -77 -225 14 -21 -2 -192 -72 -71 227
4725 227 252 10 277 269 -157 -50 -35 143 43 -152 -202 -78 -31 -211 -78 -11 76 6 -68 -162 67 -18 -100 81
4749 81 158 -77 -208 268 152 166 20 -143 65 -129 170 -48 -215 2 -206 -12 67 103 139 -168 -148 -65 46
4772 46 46 -136 -16 53 -84 0 -19 72 34 -75 207 -4 -87 -231 -146 41 205 123 -18 155 118 46 133 215 114
4797 114 -36 144 16 -37 -28 -30 -67 81 32 202 86 207 -439 -155 78 -10 -128 256 7 -108 -92 54 -123
4820 -123 -60 41 -122 -139 -193 -90 -41 -93 -115 80 -126 103 82 -140 125 57 104 -41 -76 113 -69 -48 -25 -59
4844 -59 -158 26 -63 -2 20 57 -79 -165 -170 8 -34 -3 295 -12 70 22 51 102 26 65 9 47 -232 -121 -106 -60 67
4871 67 71 14 -20 -133 -113 -23 -79 -155 88 -117 193 188 -19 -75 -153 72 102 -29 -75 128 -150 -186 -4 80 23 -65
4897 -65 -133 -145 87 -18 -178 -112 -30 -100 15 -81 -127 132 32 275 -43 48 90 36 299 -59 -86 139 94 -20
4921 -20 -30 -37 104 19 -63 72 -116 19 -64 125 -78 -82 -53 -57 16 -206 -70 229 99 -104 139 222 68 -53 36
4946 36 -82 11 118 60 128 -104 -5 66 -252 -29 -123 7 -141 81 195 -110 46 94 27 101 6 -63 144 125
4970 125 -243 -132 -45 -39 -62 -124 -45 -157 -148 -134 -50 111 -125 52 -24 90 296 13 93 2 276 -58 67 46 -64
4995 -64 41 102 -7 29 -83 -98 -90 -40 -139 -46 -64 -215 70 36 -154 73 -73 124 0 177 -45 73 -5 -126
5019 -126 -23 149 66 -39 -49 125 -78 49 24 -38 39 12 49 -66 129 -135 7 99 -12 -122 166 173 -54
5042 -54 -102 -203 129 306 -225 -109 -13 -18 146 202 -66 -206 69 21 -53 27 31 72 90 7 -217 -98 97 21 90
5067 90 56 -115 90 227 69 -45 -22 3 -189 96 77 60 24 -168 -262 65 41 -163 -49 -35 -270 202 80
5090 80 -131 -57 95 -1 10 -95 -9 13 -2 -83 -54 -55 53 -85 56 -128 -99 -297 -35 -65 32 99 79 -71 -186
5115 -186 -46 197 53 -254 -145 -96 254 -10 10 -91 178 -39 142 -66 -117 -20 0 18 -83 -28 -81 78 -77
5138 -77 254 14 43 -5 -2 68 -139 121 -155 -118 33 100 74 171 50 -98 -155 -106 29 10 223 -12 71 -40 11
5163 11 -49 27 118 130 -27 -13 -109 -68 181 -50 226 -45 -115 -151 -239 47 -47 -69 -6 55 148 -168 53 211 95
5188 95 51 114 -52 -132 118 -96 37 58 -164 12 59 0 -80 81 77 -12 -13 139 -81 -78 66 120 101 72 -27 18 32
5215 32 33 192 -154 73 -271 -87 119 165 -152 -95 -68 38 24 -33 -33 -10 5 -27 38 97 -23 68 -26 259 -5 79
5241 79 -38 -3 -142 -68 -78 -242 240 94 26 19 43 60 151 135 -141 38 -1 68 -98 0 188 -50 87 120 113 89
5267 89 -18 162 -100 44 208 -89 2 -80 -93 -97 -93 -12 4 57 -192 -53 37 80 -93 139 45 69 115 -6 0 -34
5293 -34 95 -30 11 -67 158 -140 47 -12 10 115 -89 -7 69 -50 -103 15 130 -47 63 -46 -108 0 106
5316 106 63 -21 -23 -80 -255 61 -48 1 -63 63 -45 115 101 13 -57 94 -134 129 9 27 -93 37 -71 -93
5340 -93 -177 -56 154 22 -90 -62 139 -251 140 -2 110 -34 66 -64 -198 87 -31 46 241 -226 139
5361 139 61 -50 -4 -33 89 42 111 72 -76 -52 -94 62 -103 -26 126 209 -9 -129 -119 147 67 -111 159 74
5385 74 -7 -41 188 177 152 -51 81 -87 -26 -87 -112 -108 -24 30 96 124 -46 82 24 -8 -1 -55 -117 -5 -161 -40 -28
5412 -28 -259 -89 -41 -208 -199 87 -25 28 -96 36 103 -92 -1 118 36 67 28 7 -82 150 -28 127 11 -241
5436 -241 42 -178 91 158 -26 -15 90 58 -119 -152 -8 -17 10 -95 33 124 420 153 -78 233 41 47 120 238
5460 238 57 205 67 4 -1 51 271 -61 -5 -129 -82 -72 59 9 148 -11 -25 132 -188 -82 110 21 75 -106
5484 -106 -112 98 -35 97 20 97 34 150 31 90 -14 -90 -72 51 121 68 102 -16 -119 -102 -67 -72 -246 37 79
5509 79 -168 -122 61 152 37 194 106 -101 109 -26 -228 127 27 158 -13 80 9 -171 -133 38 -117 -311
5531 -311 -181 -94 -8 -98 69 142 -98 -26 37 105 146 -4 -48 92 207 -66 177 -44 -84 29 49 -209 -120 284
5555 284 50 -42 -23 -132 -61 -56 8 -228 109 -98 67 284 98 -10 -128 -193 -103 49 94 28 -19 -235 2 -24
5579 -24 155 28 132 -27 -8 -117 54 -25 77 -199 45 136 -22 -73 -43 155 -129 -26 128 109 50 182 -8
5602 -8 -76 153 9 69 -16 54 -147 49 10 -40 77 -46 -70 39 82 1 77 17 177 -63 -23 53 -55 174 -109
5627 -109 -85 35 160 -89 44 37 -158 179 97 -95 -51 81 6 -83 -4 75 151 -6 -125 174 276 11 -80 -117
5651 -117 -136 -72 110 42 -17 -14 10 -70 -74 -31 214 -305 -16 11 -238 -34 258 76 -21 -191 53 -114 67 59 47
5676 47 31 42 62 -51 -89 8 57 -52 66 36 -67 295 142 3 94 -106 26 -46 59 -82 206 -262 -110
5699 -110 -5 -3 24 -281 -242 7 -207 -63 86 196 175 -61 -10 -1 233 -19 -123 -55 148 -25 -224 54 -12
5722 -12 83 41 61 -62 -38 -222 -264 -56 57 -14 -146 58 -90 161 -4 15 -21 -35 47 78 134 23 23 260 13
5747 13 -181 -126 131 -100 33 -129 122 -136 24 121 58 10 52 -8 38 58 -39 104 -35 -145 -133 37 -118 208
5771 208 -60 -67 -183 100 -63 81 164 83 -12 -28 -32 -190 -75 129 41 97 23 128 91 -65 -134 75 101 19 103
5796 103 -189 -11 -28 290 106 99 -18 -1 22 250 -23 22 -91 104 -50 -94 -165 -235 -26 -54 24 174 140 84
5820 84 95 -90 -2 62 162 18 102 -8 16 1 -164 193 -7 -20 -16 -69 -122 287 56 -260 -34 106 200 -70
5844 -70 -126 74 12 -79 42 58 -115 224 -12 -124 48 153 131 124 -36 -157 -21 70 148 -9 -7 -91 -163 88 152
5869 152 -15 144 -39 -16 62 29 131 174 120 45 -62 94 57 45 -21 26 256 95 281 -84 -170 153 -20 94
5893 94 186 -114 -8 31 -103 -16 179 -79 -43 91 -173 22 -38 -68 109 66 -12 15 86 131 -5 -85 -15 2 265
5918 265 -277 100 114 -46 224 -48 68 201 54 147 99 19 33 51 130 24 23 -147 -83 129 59 119 -182 -133
5942 -133 -180 17 -40 -65 113 11 134 -57 -71 -79 56 132 66 51 -25 5 265 -51 6 -57 34 -100 -69 -2 19 6
5968 6 170 35 163 120 55 -8 -80 -31 -32 -46 177 209 -122 53 78 121 -43 -6 56 56 -19 -65 110 -38 -32 -125 -79 102
5996 102 67 5 -138 183 2 -181 59 84 -16 96 141 -19 -30 117 -54 51 -129 226 36 11 -140 -44
6018 -44 -98 -31 -113 128 -179 -34 7 -105 -122 89 -167 -112 150 -170 -68 21 -73 -140 46 -122 166 -79 11 -35
6042 -35 39 102 -60 -79 -14 -88 42 5 -118 111 36 36 176 149 -28 -2 286 -45 9 142 20 51 58 -26 -113 75
6068 75 -145 -32 25 -41 161 4 12 -147 187 -31 50 117 -24 21 106 -202 9 84 -111 56 -78 -34 181 -141
6092 -141 62 -163 -43 65 4 -34 -70 -333 -54 -144 263 -31 -37 89 168 145 31 -20 201 15 11 29 -103 158
6116 158 -83 -45 -169 -4 54 35 -116 147 -23 -6 -5 87 -205 178 104 130 -58 19 -98 57 105 136 86 -83
6140 -83 -92 6 -13 115 -21 11 -166 -36 -59 212 111 43 -83 -64 16 73 50 23 45 27 29 -29 24 106 -130 153 -77
6167 -77 -49 153 -98 15 42 114 -175 177 40 150 107 -85 -26 116 145 -44 132 -145 -82 -76 -28 139 80 -49
6191 -49 -104 -58 -81 -43 -126 89 135 -210 22 -33 -16 -13 -86 14 -84 -65 122 148 -2 19 -30 312 -52 -15 -18 -38 -156
6218 -156 -78 -161 16 -94 -36 -140 -201 98 261 -85 168 26 99 13 159 -30 -82 32 93 -17 -29 120 -101
6241 -101 -144 14 2 -176 35 -341 283 -136 -52 187 -109 -9 203 101 -9 147 -32 27 148 68 -61 -130
6263 -130 -136 91 -42 -115 61 51 58 -110 -29 -110 -53 80 -22 131 65 -21 -262 -89 100 -40 -74 71 90 -69
6287 -69 -222 117 172 66 -143 267 54 -29 -57 -72 12 133 -106 9 -83 -69 143 92 -135 58 145 36 -61 103
6311 103 230 70 -27 -32 -26 -14 108 -104 72 141 -41 -23 138 73 -62 -65 -87 75 -49 -111 19 -14 -1 -53 64
6336 64 -74 19 -182 -42 -102 -57 152 51 11 185 -46 -68 -31 80 -131 -17 -153 -8 94 -386 98 47 91
6359 91 77 6 -23 -7 -9 43 71 -91 66 -121 64 145 -25 85 187 55 -12 43 -134 7 -88 -106 78 75 176
6384 176 -194 -140 141 -146 265 68 97 19 -14 32 -197 -10 213 -144 -69 -25 39 3 -39 51 36 -119 -24 23 -149
6409 -149 78 114 56 -51 -65 173 60 -106 103 14 -35 74 -21 86 68 -42 -101 62 -21 -141 167 100 -6
6432 -6 183 -137 -5 -27 -99 -35 106 139 138 -82 181 29 234 -74 -159 -14 12 -52 -294 20 -139 51 -39 -146
6456 -146 92 -164 59 66 42 12 63 -28 -61 -79 -4 188 -155 222 -119 -3 -167 -263 -15 -16 -80 -254 107 26 -200
6481 -200 91 -76 -187 -81 -125 -309 -80 194 218 31 37 -18 -14 20 -94 -67 20 159 -63 108 -3 189 121 194
6505 194 -65 137 0 34 -248 -17 -167 55 198 -102 -50 70 156 46 -56 133 -68 -17 -21 42 246 52
6527 52 32 -23 -17 -15 69 -85 -168 -5 -45 57 73 20 51 25 178 160 53 -69 -60 20 -6 -40 157 -74 -63 195 -60
6554 -60 -80 332 -212 -135 212 -116 66 75 17 10 -100 -2 160 22 -92 230 178 54 155 71 -252 188 133 3
6578 3 -237 137 132 52 -101 -23 71 34 -103 143 -82 -223 -37 241 -90 110 -83 143 -55 -61 67 82 -25 -18
6602 -18 -154 -94 -25 102 -42 -104 112 -65 30 -18 -158 25 18 166 -14 195 198 97 167 -1 33 -102 -85 49
6626 49 88 81 -95 -69 -27 51 79 271 -16 0 108 -2 74 2 -211 -46 136 13 260 85 -58 -35 -14 -30 33
6651 33 -274 -86 -35 -12 -181 4 17 -162 -140 -72 -134 -38 -81 -52 -117 -42 -165 -29 -65 79 21 -55 -188 26 153
6676 153 66 68 67 74 -30 45 103 -94 -98 -31 19 -101 -38 -292 57 42 37 -187 -74 98 38 -14 75 172 -95 51 39
6703 39 24 -133 45 -12 -90 -275 2 -83 100 96 136 27 100 49 -100 23 129 159 -103 -108 -163 -143 55 -77 36
6728 36 143 86 -68 79 56 326 156 -8 -192 -4 -155 -92 46 -75 -58 128 -62 -74 122 -145 -17 191
6750 191 -6 -229 14 158 56 -156 -144 101 -77 152 -70 36 95 -192 119 106 21 -240 1 -148 79
6771 79 -33 131 -91 31 -225 20 -36 18 -30 -136 -137 -74 167 -17 7 15 -131 197 77 27 -96 6 41 -44
6795 -44 115 179 -54 -362 -100 -222 -188 38 43 -92 128 153 -83 43 -185 -154 -54 -15 -53 -22 -51 -37 -83 32
6819 32 138 -36 64 177 26 179 43 154 -120 76 136 -16 216 -116 -28 -14 -29 -41 97 150 45 -65
6841 -65 -30 2 45 186 193 -65 95 32 -12 187 86 78 -56 218 138 -63 47 40 -130 -52 36 48 -111 -245 101
6866 101 -1 -5 -61 -80 72 -124 107 357 45 25 14 -150 132 35 -44 116 54 -59 54 86 68 125 -68 33
6890 33 106 56 151 286 -109 -114 80 -323 250 193 113 213 -35 -83 139 19 122 22 -133 75 52 -121 58
6913 58 -156 -93 -20 -41 237 126 91 120 -27 176 47 -87 185 164 143 -5 -101 -248 112 31 -61 -75 71 83
6937 83 45 -21 28 -108 -58 -77 -146 -57 -90 -66 -23 -168 -100 -12 -95 194 -67 -228 -72 -94 147 143 44 75 138 38 162
6964 162 0 -55 69 42 18 -69 159 -98 184 -26 75 163 -50 52 -226 138 34 -113 -75 36 -102 1
6986 1 -105 -238 49 -48 9 -88 41 -89 -28 221 -73 90 -166 -133 205 78 -2 12 -57 -75 156 -60 163 -57
7010 -57 70 130 154 31 81 -121 86 -66 -270 208 9 -26 -87 185 101 -63 -151 -145 -196 391 51 -69 16 -67
7034 -67 -73 -6 -72 -32 127 147 -38 142 -12 -155 9 222 178 9 -266 98 69 -3 -123 -133 190 -160 150 -57
7058 -57 1 -66 -174 -31 122 10 -97 43 195 -74 105 65 136 -78 220 -69 -130 93 159 185 44 137 238
7081 238 6 -183 24 -12 -215 85 60 66 -8 -128 -16 29 -100 -134 -190 -24 -159 -43 39 -59 -190 81 -24
7104 -24 -128 -172 79 7 -70 -121 100 328 18 -14 37 110 -183 5 -91 87 -229 -140 -191 107 -76 73 33 17
7128 17 -20 -160 83 74 -47 -104 -123 252 142 -57 48 105 44 -80 6 272 52 -12 -129 29 -70 -33 77 28
7152 28 63 -57 153 -3 -31 152 24 58 -24 -313 198 11 -69 43 -161 -28 -216 71 81 -19 6 189 48
7175 48 43 2 100 248 216 133 -35 67 300 117 44 154 -118 84 60 7 -15 6 -138 49 200 44 -113 34
7199 34 -40 -55 -146 -99 78 89 130 112 72 52 -184 -28 -4 165 34 -4 -158 -53 -6 -79 46 133 -25 -86 151
7224 151 50 0 -51 123 -77 99 -223 -92 -241 5 6 -68 10 -56 0 -151 126 118 27 64 -95 300 113 186
7248 186 10 -144 -93 -59 92 -24 -198 69 69 188 40 5 -108 63 66 -23 18 292 -95 39 -58 -120 5 -81
7272 -81 49 -124 -74 89 -102 -162 12 61 -74 -98 -58 -81 7 90 -29 80 204 -240 15 -101 -165 -67 154 -115
7296 -115 -29 36 -40 19 -144 31 -201 73 87 -62 -3 96 26 21 9 42 90 -78 -46 33 -14 -87 -5 121 0 8 -72
7323 -72 -81 97 -36 -174 -60 -102 -181 142 -97 21 220 -150 2 -24 112 -83 -137 210 103 -236 28 136
7345 136 -79 -279 -245 -24 -53 -67 192 7 -30 71 150 87 -94 -71 59 7 -143 88 91 72 61 121 -72 108
7369 108 -133 -7 101 28 -121 39 -16 -106 -52 -94 32 -114 165 245 78 75 -241 236 -23 125 171 -11 -14 -64
7393 -64 123 12 176 -94 -7 -8 16 55 76 39 104 126 -110 33 17 -84 48 -169 223 27 14 6 -161 115 8
7418 8 55 151 -161 59 149 20 14 -112 -54 43 -22 -178 -16 46 69 29 97 84 -24 -1 121 71 -203 59 -280 -19
7444 -19 -147 -69 -67 -219 -50 16 83 39 223 -124 -35 148 23 -18 17 40 -157 48 123 99 -69 121 75 17 -27
7469 -27 -125 25 161 -43 -15 103 226 28 -166 2 -65 -147 -95 263 62 -25 -76 30 50 -101 -13 -28 -25 -61 0
7494 0 88 96 -14 52 17 -26 83 -92 -11 1 -2 31 -11 35 4 7 192 -216 109 -56 138 168 15 -112 91 -57
7520 -57 76 65 -29 -205 -95 59 -1 -15 210 117 240 31 -109 103 25 116 116 38 194 -157 3 146 -82 45
7544 45 -68 68 50 -35 317 65 24 30 -164 -60 -49 77 20 19 73 6 151 106 -118 -77 -70 -43 83 123 66 70 100
7571 100 -89 -40 -25 243 -51 -298 106 -51 155 -35 -110 -178 105 120 -158 16 49 195 -31 66 169 164 61
7594 61 132 -180 -92 26 -105 96 -34 24 -69 236 35 -45 -196 46 94 34 66 -70 -67 -62 -67 -54 42 -149 57 -22
7620 -22 -54 -110 44 117 120 62 -88 89 312 106 6 -99 -62 8 139 0 -18 -171 -34 -132 -68 -8 -38 124 87
7645 87 -9 -187 157 -29 -59 -10 -70 5 -119 163 -72 85 172 193 32 54 -31 80 18 50 -8 -127 68 82 -99
7670 -99 -272 -127 -114 -27 -46 120 5 -100 36 31 -114 -63 -247 -48 162 26 -56 117 105 -99 22 82 225
7693 225 154 135 221 -13 8 -28 -122 167 36 -179 73 36 -90 -166 -2 -8 71 -102 15 -16 33 24 -27 23 -138 -102
7719 -102 -43 -28 -43 10 312 138 165 -23 -152 75 -19 54 -73 50 89 -104 -48 76 73 175 -132 53 107 0
7743 0 -38 39 -83 -119 -18 36 103 19 143 363 144 -102 96 -190 -121 52 -36 100 17 -27 160 92 -121 167
7767 167 38 63 315 -65 155 -93 147 195 281 -253 87 80 38 168 89 -175 -171 -26 -8 169 1 1 -321 102
7791 102 76 162 -112 90 17 -149 109 -68 -39 -217 -5 206 -83 138 -48 77 147 262 -36 85 6 -27
7813 -27 -12 -138 -123 57 82 130 2 43 -10 144 -105 -79 -234 -13 114 -47 -149 -111 28 199 88 -183 -136
7836 -136 -61 94 132 91 -38 16 -56 -69 10 37 80 105 147 -165 41 -162 147 6 129 5 43 -42 142 6
7860 6 -49 -63 151 59 -7 -81 23 -75 186 162 -142 86 91 -198 132 -21 54 -48 186 142 -121 -23 240 20 -5
7885 -5 139 -151 -99 64 169 156 12 -1 138 -25 86 -48 213 87 40 -54 -189 -40 46 56 45 39 201 -29
7909 -29 -215 64 127 -102 -42 -169 227 283 -6 -85 19 86 70 4 6 89 29 1 1 -30 16 149 21 -174 159 7
7935 7 -150 30 114 15 15 -159 -109 -106 52 -111 -101 -148 51 92 -54 -145 92 -84 -98 62 99 -59 -81 -17 -41 62
7961 62 33 157 53 -181 -36 130 7 -91 10 -62 -139 -5 -73 10 116 -7 -58 227 -175 -60 -179 -72 -39
7984 -39 -53 146 -5 133 -60 -131 47 -43 88 129 -29 47 115 58 -45 -67 186 7 119 -93 13 153 95
8007 95 100 43 130 -114 -35 -155 35 -149 -86 13 -3 -13 -47 -85 -46 -138 -31 -35 -117 29 -30 110 -35 83 -19 97
8033 97 61 69 170 34 -114 -18 -43 68 222 -14 8 -104 -116 -32 49 101 -206 -61 8 -81 30 8 -223 -74 -11
8058 -11 -15 -14 -96 -49 41 -6 38 -142 107 -146 192 87 -12 -171 -29 34 73 -27 -88 -224 -25 138 -30 48 84
8083 84 131 56 -21 30 -64 51 45 236 50 7 -230 -15 147 -19 53 -70 -105 -3 43 -204 103 -19 -262 -15
8107 -15 123 4 -123 -106 -10 -229 -149 -35 -73 114 133 58 -21 35 54 15 -61 -93 -48 27 268 -21 168 45 -32
8132 -32 -14 -99 -29 258 -151 156 65 -130 -124 15 -41 -15 71 -144 155 52 21 -1 66 1 120 -206 -93 -27 141
8157 141 369 -23 -216 40 -118 -82 -88 -25 -135 -44 -71 -95 268 42 -125 127 1 -45 -29 131 -81 -15 -188
8180 -188 -53 38 -27 -43 -39 -153 39 -178 -106 -21 -250
8191b50
##END NTUPLES=NMR FID
##END=
