##TITLE=1H_DE-80H_X3
 200.13MHz, d2o
 8 sc
 
 19ns.26.2.2025
##JCAMPDX= 6.0         $$ Bruker NMR JCAMP-DX V2.0
##DATA TYPE= NMR FID
##DATA CLASS= NTUPLES
##ORIGIN= UXNMR, Bruker Analytische Messtechnik GmbH
##OWNER= pz
$$ XWIN-NMR		Version 3.5
$$ Thu Mar 20 16:55:17 2025 Russian Standard Time (UT+4h)  Yarkov@DPX200
##.OBSERVE FREQUENCY= 200.1313
##.OBSERVE NUCLEUS= ^1H
##.DELAY= (6, 6)
##.ACQUISITION MODE= SIMULTANEOUS
##.ACQUISITION SCHEME= undefined
##.AVERAGES= 8
##.DIGITISER RES= 18
##SPECTROMETER/DATA SYSTEM= spect
##.PULSE SEQUENCE= zg30
##.SOLVENT NAME= CDCl3
##.SHIFT REFERENCE= (INTERNAL, CDCl3, 0, 14.3821)
##AUDIT TRAIL= $$ (NUMBER, WHEN, WHO, WHERE, WHAT)
$$ ##TITLE= Audit trail, XWIN-NMR		Version 3.5
$$ ##JCAMPDX= 5.01
$$ ##ORIGIN= Bruker BioSpin GmbH
$$ ##OWNER= Yarkov
$$ C:/Bruker/XWIN-NMR/data/yarkov2/nmr/H-C/1/audita.txt
$$ ##AUDIT TRAIL=  $$ (NUMBER, WHEN, WHO, WHERE, WHAT)
(   1,<2025-03-20 16:53:31.67 +0400>,<Yarkov>,<DPX200>,
      <created by zg, POWCHK disabled, PULCHK disabled
       configuration hash MD5:
       00 E9 B6 7A A2 85 ED C7 34 08 36 98 17 FE 4E 26
       data hash MD5: 16K
       6D 6D C2 76 0E BC 4D 7E C0 22 D3 47 DD 8D 5E FB>)
$$ ##END=
$$ 
$$ hash MD5
$$ B4 98 AC 20 B9 71 90 5F 20 95 79 97 53 34 86 BA
##$RELAX= 
##$RELAX= 
##$RELAX= 
##$RELAX= 
##$RELAX= 
##$RELAX= 
$$ Bruker specific parameters
$$ --------------------------
##$DU= <C:/Bruker/XWIN-NMR>
##$EXPNO= 1
##$NAME= <H-C>
##$PROCNO= 1
##$TYPE= <nmr>
##$USER= <yarkov2>
##$AMP= (0..31)
100 100 100 100 100 100 100 100 100 100 100 100 100 100 100 100 100 100 
100 100 100 100 100 100 100 100 100 100 100 100 100 100 
##$AQSEQ= 0
##$AQ_mod= 1
##$AUNM= <au_zg>
##$AUTOPOS= <>
##$BF1= 200.13
##$BF2= 200.13
##$BF3= 200.13
##$BF4= 200.13
##$BF5= 200.13
##$BF6= 200.13
##$BF7= 200.13
##$BF8= 200.13
##$BYTORDA= 1
##$CFDGTYP= 0
##$CFRGTYP= 5
##$CHEMSTR= <none>
##$CNST= (0..31)
1 1 145 1 1 1 1 1 1 1 1 1 1 1 1 1 1 1 1 1 1 1 1 1 1 1 1 1 1 1 1 1 
##$CPDPRG= <>
##$CPDPRG1= <>
##$CPDPRG2= <>
##$CPDPRG3= <>
##$CPDPRG4= <mlev>
##$CPDPRG5= <mlev>
##$CPDPRG6= <mlev>
##$CPDPRG7= <mlev>
##$CPDPRG8= <mlev>
##$CPDPRGB= <>
##$CPDPRGT= <>
##$D= (0..31)
0 0.7 0 0 0 0 0 0 0 0 0 0.03 0 0 0 0 0 0 0 0 0 0 0 0 0 0 0 0 0 0 0 0 
##$DATE= 1742475211
##$DBL= (0..7)
120 120 120 120 120 120 120 120 
##$DBP= (0..7)
150 150 150 150 150 150 150 150 
##$DBP07= 0
##$DBPNAM0= <>
##$DBPNAM1= <>
##$DBPNAM2= <>
##$DBPNAM3= <>
##$DBPNAM4= <>
##$DBPNAM5= <>
##$DBPNAM6= <>
##$DBPNAM7= <>
##$DBPOAL= (0..7)
0.5 0.5 0.5 0.5 0.5 0.5 0.5 0.5 
##$DBPOFFS= (0..7)
0 0 0 0 0 0 0 0 
##$DE= 6
##$DECBNUC= <off>
##$DECIM= 32
##$DECNUC= <off>
##$DECSTAT= 4
##$DIGMOD= 1
##$DIGTYP= 9
##$DL= (0..7)
0 120 120 120 120 120 120 120 
##$DP= (0..7)
150 150 150 150 150 150 150 150 
##$DP07= 0
##$DPNAME0= <>
##$DPNAME1= <>
##$DPNAME2= <>
##$DPNAME3= <>
##$DPNAME4= <>
##$DPNAME5= <>
##$DPNAME6= <>
##$DPNAME7= <>
##$DPOAL= (0..7)
0.5 0.5 0.5 0.5 0.5 0.5 0.5 0.5 
##$DPOFFS= (0..7)
0 0 0 0 0 0 0 0 
##$DQDMODE= 0
##$DR= 18
##$DS= 0
$$ [...]
##$SUBNAM2= <"">
##$SUBNAM3= <"">
##$SUBNAM4= <"">
##$SUBNAM5= <"">
##$SUBNAM6= <"">
##$SUBNAM7= <"">
##$SUBNAM8= <"">
##$SUBNAM9= <"">
##$SW= 18.0517328524113
##$SWIBOX= (0..15)
0 0 2 0 0 0 0 0 0 0 0 0 0 0 0 0 
##$SW_h= 3612.71676300578
##$TD= 16384
##$TD0= 1
##$TE= 0
##$TE2= 300
##$TE3= 300
##$TEG= 300
##$TL= (0..7)
0 120 120 120 120 120 120 120 
##$TP= (0..7)
150 150 150 150 150 150 150 150 
##$TP07= 0
##$TPNAME0= <>
##$TPNAME1= <>
##$TPNAME2= <>
##$TPNAME3= <>
##$TPNAME4= <>
##$TPNAME5= <>
##$TPNAME6= <>
##$TPNAME7= <>
##$TPOAL= (0..7)
0.5 0.5 0.5 0.5 0.5 0.5 0.5 0.5 
##$TPOFFS= (0..7)
0 0 0 0 0 0 0 0 
##$TUNHIN= 0
##$TUNHOUT= 0
##$TUNXOUT= 0
##$USERA1= <user>
##$USERA2= <user>
##$USERA3= <user>
##$USERA4= <user>
##$USERA5= <user>
##$V9= 5
##$VALIST= <valist>
##$VCLIST= <CCCCCCCCCCCCCCC>
##$VD= 0
##$VDLIST= <DDDDDDDDDDDDDDD>
##$VPLIST= <PPPPPPPPPPPPPPP>
##$VTLIST= <TTTTTTTTTTTTTTT>
##$WBST= 1024
##$WBSW= 4
##$XGAIN= (0..3)
0 0 0 0 
##$XL= 0
##$YL= 0
##$YMAX_a= 200408
##$YMIN_a= -180381
##$ZGOPTNS= <>
##$ZL1= 120
##$ZL2= 120
##$ZL3= 120
##$ZL4= 120
##$ABSF1= 10
##$ABSF2= 0
##$ABSG= 5
##$ABSL= 3
##$ALPHA= 0
##$AQORDER= 0
##$ASSFAC= 0
##$ASSFACI= 0
##$ASSFACX= 0
##$ASSWID= 0
##$AUNMP= <proc_1d>
##$AZFE= 0.1
##$AZFW= 0.1
##$BCFW= 1
##$BC_mod= 2
##$BYTORDP= 1
##$COROFFS= 0
##$CY= 83.5205535888672
##$DATMOD= 1
##$DC= 2
##$DFILT= <>
##$DTYPP= 0
##$F1P= 10.8118882576601
##$F2P= -7.23987719738617
##$FCOR= 0.5
##$FTSIZE= 0
##$FT_mod= 4
##$GAMMA= 1
##$GB= 0.15
##$INTBC= 1
##$INTSCL= 1
##$ISEN= 128
##$LB= 0.25
##$LEV0= 0
##$LPBIN= 0
##$MAXI= 10000
##$MC2= 0
##$MEAN= 0
##$ME_mod= 0
##$MI= 1.114404
##$NCOEF= 0
##$NC_proc= 0
##$NLEV= 6
##$NOISF1= 3.799351
##$NOISF2= 2.8
##$NSP= 1
##$NTH_PI= 0
##$NZP= 0
##$OFFSET= 14.38212
##$PC= 1
##$PHC0= -1188.422
##$PHC1= 25.79224
##$PH_mod= 1
##$PKNL= yes
##$PPARMOD= 0
##$PSCAL= 0
##$PSIGN= 0
##$REVERSE= no
##$SF= 200.129724274929
##$SI= 16384
##$SIGF1= 3
##$SIGF2= 2
##$SINO= 400
##$SIOLD= 16384
##$SREGLST= <1H.CDCl3>
##$SSB= 0
##$STSI= 0
##$STSR= 0
##$SW_p= 3205.1282051282
##$SYMM= 0
##$S_DEV= 0
##$TDeff= 0
##$TDoff= 0
##$TI= <>
##$TILT= no
##$TM1= 0
##$TM2= 0
##$TOPLEV= 0
##$USERP1= <user>
##$USERP2= <user>
##$USERP3= <user>
##$USERP4= <user>
##$USERP5= <user>
##$WDW= 1
##$XDIM= 8192
##$YMAX_p= 0
##$YMIN_p= 0
$$ End of Bruker specific parameters
$$ ---------------------------------
##NTUPLES= NMR FID
##VAR_NAME=  TIME,          FID/REAL,        FID/IMAG
##SYMBOL=    X,             R,               I
##VAR_TYPE=  INDEPENDENT,   DEPENDENT,       DEPENDENT
##VAR_FORM=  AFFN,          ASDF,            ASDF
##VAR_DIM=   8192,          8192,            8192
##UNITS=     SECONDS,       ARBITRARY UNITS, ARBITRARY UNITS
##FACTOR=    0.0002768,     1,               1
##FIRST=     0,             0,               0
##LAST=      2.2672688,     0,               0
##MIN=       0,             -180381,         0
##MAX=       2.2672688,     200408,          0
$$ Real data points
##PAGE= N=1
##DATA TABLE= (X++(R..R)), XYDATA
0 0 0 0 0 0 0 0 0 0 0 0 0 0 0 0 0 0 0 -5 8 -8 8 -8 8 -12 15 -16 16 -21 24 -28 32 -36 40 -45 52 -60 67 -74 82
39 82 -91 102 -111 126 -137 151 -168 185 -204 225 -247 272 -300 332 -365 405 -449 499 -557 625
59 625 -707 805 -929 1086 -1296 1590 -2030 2761 -4190 7989 -38770 -86795 27866 23651
73 23651 -2919 74654 69293 -15261 40412 63830 -49672 -29565 81653 -14829 -113863 -2742
85 -2742 14778 -117617 -58525 70527 -7222 -55857 59265 62229 -16295 48118 102493 12129
97 12129 -23935 30246 7126 -49808 -23281 2103 -36728 -51553 -18051 -9361 -23885 -2570
109 -2570 37086 32211 -4112 3459 39469 21506 -7922 24703 35462 -20586 -26647 16559 -3128
122 -3128 -35002 -1428 7068 -39325 -33260 9571 -3037 -18193 18692 26785 -7407 3262 35180
135 35180 20359 5076 21477 13172 -20776 -22028 -3472 -13607 -29822 -15028 -1168 -16578
147 -16578 -19146 8295 19237 9211 16340 24614 8617 70 13236 10960 -6857 -4970 -794
160 -794 -19280 -23833 -2942 -63 -12625 -6576 2950 -4725 -4944 9392 13614 7535 8790 11224 5458
175 5458 2076 6833 7574 -239 -6053 -7842 -12325 -16134 -11015 -3792 -5352 -7553 -689 3526 2909 11323
191 11323 20177 14155 6250 7597 4335 -2796 -1486 -1512 -10011 -13352 -9651 -10949 -10392 -690 3807 -294
207 -294 1869 6303 4513 5793 10484 8627 4432 3594 -133 -4567 -920 2296 -2826 -5951 -5274 -8781
223 -8781 -9795 -3518 -495 -2092 790 3300 579 3493 11130 10528 6059 6529 4732 -2426 -3761 -1045
239 -1045 -4893 -8934 -6976 -7039 -9985 -5310 2296 2915 2885 6306 5976 2616 4606 7690 4948 922 347
256 347 -2443 -6033 -4541 -711 -1573 -4060 -2847 -2689 -3544 -1094 2528 1868 450 1947 2594 902 2700
273 2700 5793 4311 896 527 -441 -3181 -3165 -1604 -2977 -4575 -4050 -3466 -3320 631 4600 3968 2797
290 2797 3774 3733 2077 1994 2789 304 -2415 -3418 -3837 -4371 -2238 -232 -1372 -1076 227 890 775 2085
308 2085 3061 2198 433 53 -197 -40 652 1248 9 -1322 -1586 -1623 -1587 -508 45 -984 -1887 -1461 -148
327 -148 1004 2180 3111 2063 1234 1470 1021 340 383 -484 -2195 -3128 -3117 -2559 -1797 -54 534 347 772
346 772 1710 1971 2233 2818 2413 598 -904 -1275 -1142 -877 -669 -1306 -1924 -2059 -1067 -524 116 1075 1117 -64
366 -64 -324 743 1518 1626 1475 1399 485 -18 -107 -635 -583 -282 -1220 -2776 -2531 -1361 -1058 -93 1082 1050 808
387 808 1260 1836 1952 2113 1723 259 -1337 -1312 -1317 -1260 -1125 -877 -1057 -1483 -971 94 566 803 1250 795 -102
408 -102 108 1153 1114 759 722 -40 -530 -842 -292 -336 -375 -496 -915 -1959 -1268 359 406 443 840 962 240
429 240 641 1419 1160 841 594 -709 -1742 -970 -537 -917 -959 -138 -446 -593 434 902 1028 639 664 -170
449 -170 -363 161 441 -96 30 259 -832 -883 6 574 102 152 -54 -790 -669 165 316 94 358 373 -86
470 -86 -25 757 554 189 -132 -443 -964 -962 -393 -197 -138 -63 196 229 591 771 959 680 595 -138 -1038 -524 -67
493 -67 -327 -642 -422 -781 -925 -180 804 581 536 661 99 -125 753 714 119 111 303 -524 -695 238 33 -262
515 -262 -354 -303 -674 -517 -4 111 67 626 323 -305 395 991 1134 629 433 -30 -583 -678 -438 -413 -451 -616
537 -616 -858 -527 13 307 606 757 519 480 659 294 245 540 48 -573 -572 -380 -551 -273 210 121 -522 -406
559 -406 -100 -208 138 526 232 10 41 222 124 503 571 190 -187 -246 -370 -502 -183 -85 -415 -516 -131 -376
581 -376 -37 866 654 252 14 284 90 -25 269 252 -379 -157 -188 -273 -7 312 58 -232 200 -97 21
602 21 224 489 199 -110 -334 -153 115 145 141 88 -295 -356 37 -4 -95 75 296 -371 -330 321 -23 36 643 161
626 161 -346 -42 94 -216 -388 179 -316 -563 -183 -50 10 580 864 -74 -32 389 289 -90 480 274 -595
647 -595 -578 -144 -457 -329 343 -32 -385 -168 -65 -271 50 443 373 -84 125 170 8 395 86 92 -357 -278
669 -278 -389 -213 -334 -321 -167 -269 -85 -117 278 495 600 460 167 -19 41 245 -147 52 -106 -492 -580 -395
691 -395 -74 -161 175 -128 -165 -263 -125 182 236 422 131 -12 -30 78 177 31 70 -325 -303 -109 -191 -79 -126 -252
715 -252 -453 -124 -223 85 446 553 480 167 252 -146 199 243 74 -112 -108 -706 -504 -37 129 -66 159 -41
737 -41 -70 191 165 193 235 -57 -42 -488 -269 180 -21 -112 -86 -362 -280 139 130 95 172 64 -268 -173 100 207 -156
762 -156 4 95 -44 -228 -148 92 -118 -70 57 -511 1 25 156 149 67 337 123 32 7 132 29 112 -325 -428
786 -428 -137 -110 60 -90 -22 318 -102 167 292 409 274 58 117 -396 -225 17 -74 -369 -153 -93 -298 -363
808 -363 69 -122 -97 116 -96 -13 138 487 251 139 348 124 96 7 -13 -136 -187 -329 -78 -310 -142 -42
830 -42 -55 90 171 180 33 426 195 215 167 -99 -48 -383 -81 176 -288 -262 -50 -68 -233 -5 5 -44 -96 -72 29
855 29 136 333 230 170 69 23 -187 46 159 -18 -158 -220 -167 -146 -58 -157 -29 222 80 14 50 205 314 209
879 209 11 -184 -47 33 -181 -154 -59 -84 -223 -160 20 -56 302 283 -157 97 254 -29 -90 157 -92 97 17
902 17 -208 -379 -275 156 -12 -61 -59 -35 82 224 16 -19 -79 7 192 4 243 -79 122 -88 -85 -149 -181 233
926 233 78 8 -118 -28 56 115 83 323 -151 8 -158 14 88 -242 -160 -174 -168 -221 87 7 -68 45 159 -79 179
951 179 199 52 205 211 84 -314 -145 51 35 -153 38 -150 -54 -41 -90 34 50 133 -7 -51 51 -56 149 35
975 35 84 165 210 -155 70 -161 -13 84 106 -190 -149 64 -111 -99 -57 81 -88 -205 82 2 -153 321 9 -80
999 -80 -99 52 -278 28 62 12 -45 -73 -150 -23 24 112 157 -107 151 8 136 -67 -19 -62 -172 63 -10 -95 79
1024 79 -157 159 -118 -150 -121 -184 91 -28 312 232 -120 173 259 71 -312 -6 139 -33 84 -52 -178 -9
1046 -9 -249 -182 125 111 152 51 -62 -83 -36 289 105 99 58 -75 61 -221 -309 62 -236 -402 137 -94 57 3
1070 3 297 46 167 -93 78 148 -55 -227 -55 60 52 0 -7 15 11 -121 -59 -262 -88 -103 -78 85 -26 5 58
1095 58 -16 -181 154 0 14 65 -11 11 21 -125 -72 49 -62 -29 156 282 48 50 78 -2 51 62 125 38 -2 -133
1121 -133 -175 137 -212 229 137 100 -25 100 65 -92 -83 -189 -60 -222 59 -96 29 87 93 -153 -223 -123 -53 110
1145 110 -55 -49 69 148 188 -8 114 67 63 85 -109 -5 200 -82 126 -26 12 146 -109 -74 133 102 -107 0
1169 0 86 67 0 6 62 233 -237 -192 58 -174 -67 16 -141 -13 146 -24 148 23 -66 -119 139 44 -22 47 51 -172
1195 -172 88 89 -187 -35 -20 -11 104 -101 -16 31 -204 -93 52 92 -137 -42 27 53 -246 -21 27 4 17 143 -165
1220 -165 -123 -87 31 -52 131 255 112 -24 -98 173 82 -32 172 -43 57 241 -45 30 -145 198 -135 -143 115
1243 115 -171 204 -4 -61 212 -114 -54 -114 28 67 -132 45 9 -20 -36 -71 131 218 -71 36 -215 150 -21
1266 -21 71 101 -105 15 42 33 -51 -8 -99 -153 81 -27 93 -76 -2 -5 -2 191 20 -31 139 -78 -76 136 -82 -244
1292 -244 -163 67 -1 79 137 55 19 -1 -135 129 -12 126 222 31 -166 63 -60 -147 160 -55 10 -80 -133 147
1316 147 -37 -11 63 83 38 -10 151 129 -27 22 98 121 146 -54 -41 -82 338 -227 -75 16 -207 244 62 -175
1340 -175 44 125 -33 58 32 41 89 -106 68 -15 100 22 -19 313 -93 24 117 -79 28 -212 9 10 124 -92
1364 -92 78 6 -335 120 -223 -73 -179 -49 -254 -27 5 80 73 85 13 -56 238 44 95 -17 -178 -146 -48 46
1388 46 61 -153 -48 -100 -123 -20 45 5 -46 35 73 112 -48 102 -5 2 -29 147 -185 -220 128 56 -46 11 -100
1413 -100 160 37 46 50 -92 -142 25 -19 50 107 94 98 -172 -77 15 -54 -17 3 43 172 89 -97 -96 83 -18 101 158
1440 158 -130 -206 -55 59 47 -204 -27 -30 -57 90 -63 139 -18 41 -101 69 7 -37 19 168 -99 -67 54
1463 54 -38 100 -103 95 273 118 158 179 241 -83 -184 126 117 -106 -11 116 -61 -112 125 -102 81 -32 -134
1486 -134 27 -136 265 -29 -153 54 -26 46 35 10 33 19 -44 7 96 -55 50 10 -158 -101 -194 -12 -3 70 -179
1511 -179 115 176 51 -153 123 -4 55 -66 -29 56 103 151 -76 -1 5 -161 87 -178 -49 -27 18 -16 69 179
1535 179 -19 -217 108 45 -74 -159 37 -76 -145 209 14 -2 88 218 59 -50 -20 0 -121 -98 -65 -136 -43 -31
1559 -31 -70 -56 18 200 163 -41 -5 -53 199 -5 163 -42 -78 7 278 -15 99 -47 45 -86 -64 35 -173 -184
1583 -184 -149 -17 50 21 90 32 213 168 33 -168 -72 41 -129 -7 155 73 -58 -64 136 -64 -27 93 2 -155
1607 -155 -46 84 -58 -54 51 -131 -18 -54 19 56 -80 -135 33 -114 115 -37 35 54 -160 85 -58 -102 66
1630 66 -14 -74 171 48 256 34 -106 -1 -83 98 106 96 -40 22 -155 -58 95 -57 -15 -15 -105 -151 53 39 -179
1655 -179 188 15 -7 176 137 -43 -18 152 36 50 -66 182 -66 -30 1 -8 -124 15 -49 -6 70 85 -70 -25
1679 -25 -69 132 -146 -164 -166 -166 116 -49 2 200 18 -142 -10 134 43 -78 144 -38 -8 27 65 110 84 -97 66
1704 66 -92 -41 -75 -45 -134 76 197 -99 281 46 82 -35 84 -110 -4 -158 -26 -187 -42 30 -41 143 -136
1727 -136 122 -60 -68 -224 47 -27 204 -21 -119 42 254 -18 -156 -286 228 132 167 -40 -142 -22 -26 0 97
1750 97 -73 -139 49 140 120 -56 -47 121 -166 -35 -39 -53 34 -120 134 2 -30 -6 -49 -21 -98 83 2 175 116 13
1776 13 142 39 152 -73 81 -77 -71 159 34 38 283 38 -102 119 -147 155 122 -8 88 -40 -173 -78 34
1799 34 -74 104 80 62 73 -54 -82 45 45 3 -123 69 123 90 -188 42 -136 -25 130 -125 100 -46 -54 206
1823 206 -88 84 109 -24 128 94 214 -72 -180 -29 -98 84 69 82 156 -12 -59 68 29 -67 12 40 -126 -170
1847 -170 -66 96 -61 -248 -26 -293 79 75 72 -125 -68 -186 -54 -28 -61 -7 33 99 -169 168 88 -24 105 -37
1871 -37 -195 192 -8 136 -18 -15 -37 71 158 -31 79 -145 -23 142 103 140 38 -166 -5 -2 104 -55 19
1894 19 31 -8 0 62 25 108 95 62 -65 1 -165 -56 -97 -93 94 45 85 29 -60 -49 36 15 -113 42 70 38 -95 71
1922 71 75 17 -150 23 25 -2 -174 76 -77 -200 18 -77 -4 -15 147 -52 -5 -119 51 52 -56 -55 -21 97 -42
1947 -42 -107 -88 108 150 157 -86 -152 -26 -74 50 -182 243 -119 41 -49 130 54 129 24 117 -104 -49 -253 -75
1971 -75 70 53 -118 31 152 65 131 180 -130 -103 -172 -53 -79 -109 4 -99 101 48 98 138 -171 57 31 153
1995 153 85 -29 69 -1 -2 196 12 41 152 -170 113 -65 1 -144 173 -22 -183 -51 107 51 47 49 45 -105 -225
2020 -225 65 -50 42 -267 9 -148 -98 -108 -11 172 -118 73 -27 17 -9 59 -1 -50 -94 137 -35 -218 65
2043 65 -129 -29 15 148 -17 100 -16 217 130 105 -46 -7 -39 -18 11 -73 93 -45 148 -66 -85 30 166
2066 166 -10 59 -178 88 156 -109 -28 -241 87 96 -136 99 66 -38 62 -149 115 -83 30 77 39 210 -22
2089 -22 -228 222 183 -95 -128 -110 4 9 73 152 8 18 87 10 11 88 -49 -84 -57 -134 114 -183 -9 6 4 211 4
2116 4 -2 -221 -68 -96 -205 -45 -199 -60 9 -67 77 143 -126 262 -96 191 -77 -28 2 -130 38 111 -59 -30
2140 -30 28 72 151 -101 -80 20 -37 230 34 -121 305 56 227 139 74 -66 -186 -222 52 -104 94 -119 26
2163 26 108 -9 49 -72 -98 52 -94 97 45 56 100 49 49 -90 181 -123 -45 230 8 134 -138 180 -186 25
2187 25 -82 149 -11 -58 -56 35 85 -26 28 -89 -101 -175 -129 -67 205 -18 165 148 -10 -78 23 24 -29 -72 22 111
2213 111 -18 -149 52 -26 49 48 104 -3 76 146 269 -14 -65 45 -79 -33 54 58 43 51 12 117 -52 -95 88 -34
2239 -34 123 73 -56 -217 -40 88 -94 117 -132 -4 -230 18 172 -76 13 -251 247 11 27 93 -36 -81
2261 -81 128 105 102 3 -29 -10 -32 -77 -182 -106 -52 74 -41 -172 92 146 243 78 -91 68 -72 44 -53 -26 111
2286 111 -90 -283 -2 102 143 116 97 -168 -48 39 152 -9 22 90 -70 214 -27 -136 -1 148 210 -17
2308 -17 -306 -184 98 -23 -60 -142 75 90 144 5 -101 -114 -132 -265 -255 -57 -97 -189 74 -205 -127 -246 -68 80
2332 80 7 134 139 -8 104 -52 66 -73 -91 50 -156 -179 3 -67 211 -14 -140 -181 -133 142 -64 104 -59
2355 -59 -206 -113 168 99 -91 12 195 -10 13 -197 183 -48 -91 50 -87 162 291 84 31 -37 -62 225 82
2378 82 -66 -75 132 173 -106 18 0 -147 28 -45 272 -132 28 -30 -160 37 16 -86 55 -64 -80 3 67 -1
2402 -1 3 172 -125 122 58 77 -42 121 258 337 26 14 -85 -19 182 5 -34 -52 190 193 62 -111 23 -237 -198
2427 -198 -48 -192 89 -31 232 159 -122 -157 -110 144 -84 196 -20 -103 36 211 -81 -252 7 24 -54 -31
2449 -31 -120 102 -33 126 -59 94 -48 -275 -62 -80 203 -133 26 74 -133 74 162 19 -45 12 -136 -208 -40
2472 -40 11 -172 107 195 123 -1 29 30 154 119 -41 -55 -264 218 -254 129 -133 89 43 -86 143 165 -56 43
2496 43 57 -32 -14 164 -1 -176 -62 -11 -17 156 42 -89 -38 -233 42 60 2 -25 122 28 66 66 -67 -37 -19 56
2522 56 9 10 -38 -143 -139 -107 -91 -88 -110 11 -178 54 95 77 37 -52 -118 -12 66 -47 -1 -9 -237 -127 -97 -138 -19 6
2550 6 9 58 -144 -17 68 -107 -8 -111 -1 193 67 94 42 -156 -138 -69 82 154 -11 -17 27 50 -36 -61 -165 -143
2576 -143 90 -249 1 -77 66 -51 65 -125 -90 -18 236 86 29 76 -250 -122 -315 -96 54 -149 19 -98
2598 -98 -112 283 104 19 99 153 -40 12 -86 91 -72 -105 182 -241 -2 -7 -44 -87 -20 87 117 114 22 -50 128 -165
2624 -165 -22 -34 -92 130 230 -114 51 54 94 -53 87 37 -51 -32 -28 -214 -104 -201 -52 114 188 33 171 179 72
2649 72 -28 229 104 28 22 16 143 -65 192 -70 2 47 -39 -71 90 32 50 -10 209 38 6 -22 -42 21 -89 9
2675 9 -18 1 58 13 95 155 183 -197 46 -171 36 30 34 -113 149 169 -24 -13 64 214 37 119 -21 37 -99 209
2701 209 94 76 95 3 -334 -67 -20 62 -143 -116 -75 -90 -221 7 43 15 4 -29 111 148 229 1 195 -198 -7
2726 -7 -4 15 69 -89 106 -158 177 12 37 -68 -119 141 -164 50 -146 117 -229 -42 207 -355 -40 73 -3
2749 -3 -10 93 -252 -187 27 -25 -28 -74 -16 220 73 -81 9 178 131 -41 -133 -187 -43 126 18 -63 -39 -29 -12 -31
2775 -31 37 -101 130 30 -32 30 -45 -37 -43 -34 78 253 267 41 -143 -17 125 76 101 99 -31 149 -221 174 1
2800 1 122 141 20 -136 66 42 184 -56 24 -87 155 28 -132 77 62 -41 -88 9 107 39 99 -115 -216 -68
2824 -68 -94 -2 48 -20 92 -152 203 -52 -75 77 -132 6 -110 -14 -153 5 90 -138 84 -20 -56 119 -138
2847 -138 93 -64 -37 -51 114 -85 12 -127 265 -93 -39 -55 37 -140 108 -50 52 -59 48 -207 -22 208
2869 208 -146 -48 123 -63 70 3 42 -30 -39 118 -56 -16 94 -179 -120 -80 -105 -255 -107 -186 89 24 -5 -62 8
2894 8 83 -12 -45 -20 -16 -83 -156 -265 2 83 161 51 -131 -149 162 -50 -161 -24 70 63 -50 -164 0 87 73 109
2920 109 -107 196 -85 -24 26 27 46 -237 18 130 88 56 -32 -13 89 10 94 -68 10 35 168 -184 -1 147
2944 147 189 -119 125 85 8 140 -102 87 57 76 25 11 52 73 -109 -63 40 -81 -49 186 -54 -37 -53 234
2968 234 38 -210 59 -125 -3 83 181 -78 -55 -44 -142 -54 35 -101 -217 -153 -108 290 -134 92 54 49 56 -3 77
2993 77 55 70 207 -126 153 -106 48 92 -107 -97 -121 -156 174 -201 248 -103 -25 172 -17 -88 104 106 101 249
3017 249 -238 82 -240 104 159 151 -26 147 -217 105 -87 98 100 -27 80 -127 73 4 55 -135 -108 8 16
3040 16 33 -44 -14 -40 120 27 -80 83 176 -132 15 67 117 44 -118 -127 -298 122 -114 135 -4 -183 -185 65 82
3065 82 -116 8 93 25 -54 -91 -4 65 111 -6 192 -138 -59 9 67 41 -120 63 -79 -34 13 302 -101 55 121
3090 121 44 71 -115 90 44 -7 -123 14 -71 150 -102 -124 18 -76 -75 257 -108 161 -76 -23 -56 -79 -36 -28 -7
3115 -7 -50 -71 -97 -49 -34 105 -4 -197 -139 128 -73 150 -38 -265 5 18 116 -182 -151 -36 -3 55 -133 176
3139 176 -94 -25 32 48 -48 99 63 22 -92 66 -3 -51 -115 23 -29 69 13 -33 -62 141 -244 89 -39 -15 1
3164 1 96 -69 -46 10 -80 88 -205 -49 110 110 -127 -86 -56 13 -45 49 5 22 -102 -84 -6 11 17 -19 -98 65 103 -185
3192 -185 -186 79 111 102 -72 132 32 132 31 170 -249 -101 -121 79 -197 -91 -123 -230 -98 -106 -45 -113 -22 10
3216 10 -61 62 -23 111 163 -118 40 -84 64 127 8 201 94 -15 29 75 -22 -57 125 -71 152 89 -33
3239 -33 -61 -175 -228 -24 197 -58 -61 58 0 -21 46 102 253 50 95 -307 183 53 -34 23 65 115 -153 0 -134
3264 -134 218 -62 -12 130 -156 -69 109 -122 -102 -34 17 -79 12 7 -67 73 -54 96 13 166 103 109 -35 133 63
3289 63 -63 68 158 24 46 -168 86 -15 -115 102 36 -37 38 -34 156 45 -25 80 -108 -25 -190 227 30
3312 30 -35 116 -46 146 -53 -40 39 106 203 -19 -110 -14 28 -66 230 -6 126 176 -23 -38 110 -11 65 -101
3336 -101 -108 18 -39 70 -102 19 55 -125 -6 23 139 76 129 176 -75 -43 25 -203 -186 -138 -187 135 197 -36 231
3361 231 -7 -85 -75 67 35 -305 118 -47 155 30 -259 -252 -66 132 -58 -186 -122 33 86 18 50 133 225 57
3385 57 -300 74 -89 11 69 -27 84 149 23 38 -29 -86 110 -58 -3 -161 -148 -109 -21 76 -163 -62 9 33 -56
3410 -56 -153 36 -106 -108 -146 -214 -7 117 209 -109 136 -69 140 -60 286 -51 29 -31 -213 -113 140 -80 -59
3433 -59 -89 -251 -166 -180 -94 -61 2 149 -203 171 -50 8 -17 -11 -43 -93 224 27 -71 -276 -106 3 105 -9 283
3458 283 65 -75 62 -179 -59 -129 -126 -72 29 4 -189 26 -68 -85 -177 -25 83 3 148 129 11 -141 -170 149
3482 149 90 2 -62 59 -114 -142 -30 -169 24 -4 -8 42 177 -18 -54 72 -17 119 101 -208 16 123 0 -73
3506 -73 207 -155 -229 86 -39 72 -50 162 -16 -48 -79 -23 49 142 300 -12 39 23 213 38 105 -67 48
3529 48 -3 16 -143 123 -218 23 37 -231 -33 85 -35 -1 -17 -21 -17 263 184 -25 134 203 2 -65 106 71 -35
3554 -35 -8 -155 1 267 129 98 -51 -121 -24 124 71 -105 20 -38 -113 -51 -198 57 -158 -52 232 139 -21
3577 -21 -39 19 -150 51 74 39 69 -23 54 -23 179 93 69 -56 41 235 -101 42 68 20 243 139 17 184 152
3602 152 48 111 -113 27 101 73 -10 47 65 19 233 -165 -244 1 105 -29 -10 -143 -143 72 -81 -76 -113 153 -20
3627 -20 60 169 5 -51 -236 -118 -136 38 -73 -94 83 14 -94 -11 -91 -88 -78 -54 -36 -126 60 -4 -79 41 93 88
3653 88 -83 -36 -43 225 -101 -44 -67 81 -92 60 78 72 83 -289 -43 -48 -56 148 27 73 -93 -108 155 105 -65 -118
3679 -118 21 159 47 -17 156 66 -12 -197 -164 -77 81 105 -35 -37 54 -98 199 -63 222 -255 103 120 -101
3702 -101 75 -63 -48 -98 -38 -201 -122 -46 189 35 -48 231 -153 -16 42 35 123 68 -48 219 141 -122 -140 44
3726 44 -122 -15 269 -93 24 -84 66 12 -24 58 -134 70 -114 -236 -109 19 117 30 183 190 -35 -115 -77
3749 -77 -106 -59 118 -38 -91 34 124 88 -105 136 -21 -19 167 142 -39 -15 134 85 147 -38 -217 -24 -125 -109
3773 -109 -1 -44 -65 -47 42 -151 77 -129 -69 -198 -235 73 11 -105 178 -2 -35 -32 -71 63 -9 57 13 -69 105
3798 105 -58 146 93 -109 122 12 146 65 59 -10 -39 62 -4 -186 73 -69 -15 107 69 -183 -64 262 -137
3821 -137 -30 1 133 -156 91 60 -86 212 31 184 53 -25 -43 54 -44 153 -116 -106 80 75 -15 104 113 -113
3845 -113 -48 -51 -162 -55 34 145 34 -143 -79 -300 -263 238 -11 138 85 107 -168 -170 -115 -131 37 -68 118 89
3869 89 -59 -107 100 -37 -125 -33 -188 101 227 -158 -137 -98 -119 36 -52 -18 -108 122 -12 -143 -92 -127 140 81
3893 81 -97 -74 257 -232 170 -135 37 33 -12 72 -86 20 81 -116 -16 -112 147 58 76 -174 -34 164 65 -100
3917 -100 135 149 -120 -41 -52 4 -136 -13 -83 14 5 35 14 -55 -43 10 94 68 -84 12 95 177 -195 -22 29 14 198
3944 198 -77 -28 85 74 -88 42 180 21 -41 -68 95 -1 29 -95 -106 -37 -80 33 -11 -33 -111 -14 119 57 -90
3969 -90 65 93 5 -80 118 -55 -18 36 70 -55 -13 22 166 110 -26 -122 64 25 -28 -5 -156 -152 -82 0 20 47 -2
3996 -2 106 1 -135 -14 113 -183 -86 -338 195 -76 -63 -308 59 57 116 -218 -38 129 -192 192 212 -35 347
4019 347 222 -98 -142 -85 -2 64 77 251 -124 92 113 -56 146 98 -10 -132 9 106 191 19 -14 64 -57 8
4043 8 -64 65 -147 -114 -11 -68 -45 -8 124 40 74 -290 98 -223 -126 93 75 -136 134 -53 -5 88 23 -209 173
4068 173 135 -9 -128 -211 -42 -52 181 -90 123 15 -46 1 -250 -100 -155 -112 -38 -77 -68 94 55 -76 23 -103
4092 -103 8 19 88 92 -86 150 32 105 -99 140 -12 -61 -92 104 3 -376 -105 -231 24 187 327 -2
4114 -2 -79 90 -104 81 38 183 57 -43 -2 -36 72 78 101 77 -37 70 136 -30 -87 -160 -148 173 27 156 76
4139 76 -196 43 106 227 -237 162 291 -244 24 97 16 -28 108 268 0 9 134 -113 46 -36 114 8 -25
4162 -25 -87 99 147 -30 103 -3 133 -224 -218 183 158 59 88 168 -11 -47 -68 159 -97 119 94 62 -7 19 73
4187 73 -58 16 8 167 45 187 90 -52 78 -2 1 59 57 84 -75 138 69 -131 62 112 -230 79 47 -41 73
4212 73 149 168 245 -74 68 -134 16 -70 19 -167 36 -46 22 142 6 14 144 16 -71 -118 -104 -79 159 88 -42
4237 -42 -176 -21 -51 140 66 41 84 -13 7 -80 224 -110 -1 -249 -43 -86 118 -83 35 -59 17 127 57 -22
4261 -22 -46 98 -83 180 81 9 -154 -48 154 51 94 23 -122 149 -92 138 -294 16 -35 99 63 -225 -9
4284 -9 -34 -158 -57 6 -97 -47 -107 165 -35 -193 -13 147 -65 -170 -139 -116 128 -262 23 133 22 43 -6
4307 -6 -63 -72 -151 7 -27 131 74 151 266 16 -48 62 -178 -220 104 -124 -26 -137 70 -116 3 66 -188 132
4331 132 -100 94 -215 57 -143 101 -87 -31 198 68 -161 -241 186 -48 -158 -100 179 110 -236 62 -82
4352 -82 -92 -61 45 42 134 15 56 161 36 36 -166 -96 -162 173 -113 140 8 -11 100 140 -92 17 -275 40
4376 40 22 82 38 -93 61 215 -97 14 52 190 -233 -117 140 -175 -37 -84 155 118 285 221 -51 107 -58
4399 -58 -117 -99 -174 -43 89 60 -146 -91 73 83 -69 -97 103 247 -81 40 133 -83 -64 44 116 -179 -13 39
4423 39 175 6 -61 -82 -334 59 157 75 -103 -142 -76 211 -78 40 14 -142 -127 22 -10 65 -92 133 0 -271
4447 -271 9 -36 151 61 149 46 141 34 -28 -301 -47 153 -83 -61 184 111 -74 -121 -95 68 -279 -2 40
4470 40 106 -54 -79 -12 83 7 -228 181 -111 -132 33 8 -251 5 168 -289 -52 97 196 -44 16 -168 26
4493 26 -44 -105 -33 -15 -81 174 35 -124 50 -33 -2 -72 24 -81 -51 -58 -283 86 113 1 1 -31 10 -29 99 -124
4519 -124 242 2 11 -3 125 126 49 -5 125 111 -160 -176 -43 5 -32 34 -151 125 204 9 -69 116 99 -54 139
4544 139 -71 79 52 35 4 23 -22 67 316 162 -112 40 -43 -242 19 -1 50 -37 3 -100 137 70 133 83 202
4569 202 3 -166 48 159 -2 34 101 -185 -52 -118 212 -91 -117 -221 125 8 55 94 -115 -20 198 -277
4591 -277 -142 -139 -132 -246 -287 111 104 -126 141 25 -16 204 27 -172 134 -158 -71 13 -317 80 -88 11 99 -8
4615 -8 -58 -185 9 -56 -154 76 19 63 -59 120 41 159 -253 -11 48 10 28 186 -16 -99 -8 -11 9 2 31 207
4641 207 -167 9 -57 -85 182 -69 -44 31 97 52 56 -79 173 -116 -44 32 -128 2 46 198 -287 -182 5 -133
4665 -133 170 -163 -4 -56 70 54 34 57 -95 -15 97 15 -45 87 35 -189 25 83 37 -8 72 -10 -93 -15 62
4690 62 -27 -12 60 -31 -145 77 66 -7 -15 47 54 39 40 -124 105 96 -30 46 62 -150 -87 38 -37 -278 1 68 -328
4717 -328 147 -84 2 -25 54 5 -100 3 -159 132 28 -11 -91 -79 89 21 104 -151 143 -14 151 176 6
4740 6 -51 -74 102 222 61 103 54 75 224 138 -88 -91 -66 266 50 -106 -19 -132 174 70 66 89 -138 119 12
4765 12 -107 -110 154 151 -20 -7 -239 2 -34 -83 130 146 -19 -123 -54 56 -231 -47 -112 262 -123 -77 6 -26 127
4790 127 -246 -162 71 -17 -152 91 300 43 155 109 -77 81 135 -18 233 -38 168 -123 -9 0 -11 -48 -34
4813 -34 -16 110 102 140 -122 -28 -57 151 -103 59 10 62 -104 120 133 186 119 8 172 -58 8 -187 126 94 65
4838 65 33 -108 159 28 -52 49 116 -94 -114 73 39 -115 -41 -162 -19 93 165 253 184 -99 173 25 -48 -30
4862 -30 -102 -53 -284 49 -119 52 -39 -144 21 -142 -53 -17 55 225 -276 41 -189 138 90 154 157 10 -16 -51
4886 -51 18 40 44 64 -55 55 17 -25 168 31 -105 -36 49 107 -47 -76 65 -15 -19 12 -178 31 -55 -190 20 72
4912 72 170 -52 -206 138 144 -47 -179 -232 187 -113 94 70 -108 -4 181 65 -20 -148 98 62 114 38 9 -95
4936 -95 -29 -77 14 228 -56 -153 -63 -11 96 -76 -4 85 35 -15 -30 -247 83 51 126 -164 86 -8 30 -50 -138 42
4962 42 -78 -167 -55 92 160 47 -53 -55 -45 134 142 -59 -111 -128 -30 -199 30 90 13 75 248 -33 -21 32 160
4987 160 48 -57 12 -142 -17 -45 101 73 92 -39 -63 48 -61 -12 -64 121 -17 97 80 76 -21 -25 -47 -259 -68
5012 -68 -294 129 -158 178 42 147 -2 36 -104 206 24 33 199 107 107 115 -265 148 85 128 -10 -108 155 53
5036 53 40 93 239 91 115 87 16 -38 -47 -120 -22 -348 27 58 -25 -108 39 11 -7 88 -206 -7 -193 -12 36 30 -45
5063 -45 -20 48 -81 154 -10 -5 -51 112 92 14 164 376 2 -82 37 -219 73 141 -120 146 -4 -224 -24
5086 -24 57 7 273 109 -56 -39 -84 -66 65 -118 -12 170 -182 -9 87 18 70 -99 60 -22 8 -190 297 -52
5110 -52 119 102 -45 -112 67 -15 -233 -129 104 39 75 -52 -7 45 -40 -6 1 -21 77 172 -148 -97 -132 -98 120 9
5136 9 -51 -40 -83 97 140 139 -74 66 23 54 -74 18 36 29 197 260 -153 121 76 5 34 -52 -111 233 1 -144 -195
5163 -195 -42 -80 -70 101 133 -21 -22 35 29 -29 31 93 -1 105 47 98 26 89 -86 17 109 -212 61 94 -134 -38
5189 -38 -44 -134 129 26 135 78 141 -25 -32 -125 -43 -4 19 125 -40 -59 -55 69 -83 -17 -27 18 -123 58 -119 144
5215 144 -156 74 40 -33 77 11 -61 -108 -222 -3 -79 62 55 -225 -110 -54 68 167 -19 -23 31 6 -26 -105 -78 62
5241 62 -105 123 67 -3 229 -194 -100 186 -130 -78 76 39 216 -57 19 -320 144 -116 6 33 65 -228 158
5264 158 270 49 37 118 46 -71 -117 7 -174 -90 -159 -111 -47 20 48 66 261 -130 -296 -7 110 -194 -182 -143
5288 -143 -132 40 170 49 135 201 103 123 62 -31 -45 20 60 63 74 -10 139 18 -81 80 -112 27 175 81 -119
5313 -119 -106 -103 -92 -39 -81 75 142 -79 -176 63 58 -44 -17 -130 61 -34 -52 -70 -11 132 19 -54 92 192 31
5338 31 -219 -13 -86 17 -146 -182 93 90 115 -30 -136 137 27 -68 144 -42 14 -65 -71 -93 145 64 -148 102
5362 102 169 -77 48 -106 51 -19 -105 -48 103 120 -61 134 54 -124 10 -80 147 -100 111 -32 27 47 -66
5385 -66 -101 -141 271 -70 31 76 -40 -52 -128 -129 109 -52 99 -114 156 -234 100 13 149 -302 -225 -321 -35 -27
5409 -27 -78 24 -59 125 -24 -111 96 -13 64 -59 175 87 345 4 -61 -174 -79 -66 88 160 -57 2 18 12 81
5434 81 -75 -140 -98 -130 -8 -107 54 -136 74 -173 -305 18 19 -103 -231 128 115 -138 -160 -61 0 -96 -203 103
5458 103 -142 -39 58 19 -53 -12 -96 -153 38 -20 -5 -186 -53 -187 133 182 55 -181 -68 -119 225 68 -75
5481 -75 -52 275 157 160 24 -16 -105 -391 -9 -45 180 25 -127 46 86 -58 212 201 93 39 144 -55 -316
5504 -316 -36 -90 -12 -3 65 168 193 189 -119 269 13 -43 -112 45 -215 288 0 -38 -54 209 105 -93 8 -34
5528 -34 5 -155 -2 253 137 -88 -79 128 -90 -68 185 -47 -29 -61 0 -86 227 266 80 -59 -77 96 -127 234
5552 234 -75 -64 69 -83 89 -24 37 44 70 246 -86 -59 35 266 -55 -50 63 55 107 -120 218 103 -65 -21
5576 -21 -41 87 24 -74 -131 74 100 56 104 46 -195 15 43 59 185 -79 -33 -5 -73 177 -25 63 -132 -118 -93 8
5602 8 102 -62 60 -36 -83 23 33 -9 -134 28 19 116 -1 -24 -76 -108 -10 -88 -306 8 57 291 120 174 77 101
5628 101 -103 -104 90 -47 86 -139 -72 117 -146 -4 148 92 -113 -57 -103 169 -71 127 332 -59 -35 29 -70
5651 -70 -195 36 -40 85 182 -139 -7 43 -56 182 44 14 82 17 44 101 41 183 42 -65 37 -39 37 197
5675 197 12 142 57 87 67 -72 -12 -141 -18 -119 -184 98 44 -99 167 103 32 8 110 -261 -59 -3 -142
5698 -142 248 -165 58 -7 23 -46 -58 -165 75 75 -257 26 40 -103 -128 197 -163 -64 -224 -67 52 116 75 -46
5722 -46 46 80 -118 187 256 91 84 87 115 30 -57 -78 148 -16 45 -140 -107 -81 -180 -30 -10 103 134 -40 73 -122
5748 -122 47 188 -82 -155 -56 111 55 -99 126 93 114 -89 96 69 189 -89 -79 138 114 58 -92 -86 72 -239
5772 -239 156 124 17 -22 -78 105 -98 -2 41 -79 -101 105 16 188 -99 93 -69 -97 -71 -13 18 -30 17 100 29
5797 29 78 -162 -154 64 172 91 -158 8 -59 -39 -142 191 -22 38 -35 219 -25 69 36 -29 -8 -26 -12 -9 131 232
5823 232 65 71 -48 -60 93 112 -88 118 68 -133 -31 66 166 6 257 -93 -33 -123 3 266 -122 -41 14
5846 14 -37 -6 -61 -10 237 278 159 38 -12 -280 54 1 10 234 -92 -151 -107 -126 19 144 147 -66 -1 -36 -103 6
5872 6 169 -247 82 -255 55 86 -10 24 -32 94 -86 254 -351 96 162 108 73 150 -98 -199 -23 151 -44
5895 -44 23 64 -51 41 97 51 -70 50 -17 -25 22 -203 -91 29 -63 147 166 -26 211 -7 246 41 -115 -53
5919 -53 -107 11 -21 141 10 -47 -56 -16 178 1 0 -17 -118 21 -46 8 163 -173 49 3 38 49 24 -96 -71 54
5945 54 -94 59 -260 -101 48 65 60 50 -136 39 -51 -98 -120 -136 -83 -255 -25 36 146 192 202 -58 69 -91
5969 -91 71 -113 -311 -108 -255 -84 9 -23 174 -82 -2 26 -35 67 -25 -23 49 53 -120 162 -149 134 -182 -60
5993 -60 248 28 -60 14 -9 -112 -71 -3 81 -74 -96 60 45 -104 119 -42 -50 -36 -58 60 82 162 -107 -53 226
6018 226 110 -70 -54 -120 -67 32 147 -14 13 -159 78 303 -26 262 -206 170 209 18 70 34 -1 -104 -168
6041 -168 -47 54 72 250 60 -3 109 94 -96 -173 21 147 76 -36 22 73 111 -195 8 76 -96 -278 121
6064 121 -53 21 133 -56 121 -55 -164 6 -23 -124 -143 100 -177 -44 -48 71 263 68 76 -118 -87 -16 -66
6087 -66 -11 -75 -6 -72 -74 -122 -110 -85 -247 156 52 -10 -82 160 -22 -164 -60 -14 -72 -100 37 -135 6 106 219
6112 219 14 139 43 -246 165 6 154 -65 97 11 -121 24 74 144 -118 -23 34 -208 234 45 -120 -234
6134 -234 112 41 -7 -20 79 -54 -13 15 -118 70 75 105 -63 32 221 29 -141 -24 88 10 -193 -107 26 -143
6158 -143 -96 69 127 2 101 20 -169 -68 -36 -49 49 187 -61 -117 -199 97 -27 -38 -72 249 147 173 110 48 -51
6183 -51 38 63 33 -19 -54 55 -25 46 -146 253 85 102 6 -149 -89 135 257 32 107 68 119 104 100 -94 64 -107
6209 -107 -166 68 -9 -60 180 59 -77 -68 -85 65 -48 156 -103 130 -2 -142 118 137 -50 -14 178 -30 223
6232 223 1 133 -161 -15 -91 -116 45 -101 102 56 54 -181 -55 39 46 52 -247 -124 84 -32 -31 93 256 -3
6256 -3 -120 -80 176 -63 261 -129 31 -52 130 120 -44 40 131 -36 -154 166 -174 110 -184 49 19 -69 79
6279 79 24 -50 103 -153 38 -168 77 5 -109 134 -146 97 111 67 73 -272 0 89 -84 50 124 -119 -118 -58
6303 -58 -142 21 164 -58 -78 -11 116 162 -16 -235 36 187 -68 -75 -243 -157 87 31 -192 199 41 -148 37
6326 37 -232 142 -16 -12 44 -42 -125 3 -160 -187 -24 143 0 101 115 -199 86 92 -182 37 83 50 15 -139
6350 -139 -36 -78 137 -210 22 -15 42 63 -44 54 128 -35 87 -180 74 -60 37 12 264 185 -9 -43 83
6373 83 -27 21 155 -49 -28 59 -39 12 53 144 147 -18 -98 -67 -155 -213 -90 -58 -66 -134 64 143 -149 -110 125 -236 128
6400 128 103 184 -110 164 -147 -55 224 26 -94 153 171 -116 246 134 74 74 -124 38 76 -34 -43 120 5
6423 5 -33 124 50 -223 136 -38 127 -73 252 288 -30 58 142 18 -23 32 90 34 60 -84 -69 59 -116 85
6447 85 53 -85 -34 60 58 114 -107 -216 79 72 -15 25 -110 -200 -32 82 -45 33 105 -185 28 172 -262 -70 -14
6472 -14 -159 68 103 -26 68 199 -120 -91 1 240 -94 40 -27 -78 -127 -162 -78 -12 21 15 -29 37 78 96 -16 28
6498 28 54 7 75 -56 -44 -61 -109 259 -141 146 157 6 83 -29 -44 -105 -135 108 10 -138 -64 -142 -188 85 -115
6523 -115 253 -230 54 5 -110 142 154 -6 -125 276 -99 -20 68 93 196 129 333 6 -65 62 -63 -255
6545 -255 -296 -3 86 -24 7 -24 -59 -59 90 55 -174 73 227 82 -26 -79 1 -48 80 -153 -82 233 -17 -168
6569 -168 -37 49 -9 -17 100 269 -197 -119 -8 -196 -23 53 -102 34 -63 31 89 98 -213 118 -21 -171 66 86
6593 86 54 -83 212 -110 158 -5 175 0 -34 38 80 -106 108 -65 36 208 -27 -110 -159 -148 -3 -12 44 180
6617 180 -62 103 19 -134 190 -77 -15 194 -118 -28 -98 196 63 -142 -24 -12 131 -131 -88 -156 -10 -90 -33
6640 -33 145 -152 8 51 -81 137 61 -120 -60 31 -77 -93 86 116 24 103 132 -233 -260 -52 41 265 49 144
6664 144 153 98 131 -35 -44 66 -83 7 -4 163 98 -111 130 -14 -210 41 -140 -84 23 -20 -9 -92 -4 -60 227
6689 227 61 81 -64 -146 120 141 76 46 38 -177 38 -19 -8 -9 -22 3 78 69 -14 -32 73 204 175 -156 93 -160
6715 -160 -54 -194 -188 -12 -80 131 150 16 131 -35 1 -104 -96 -137 -14 12 57 90 85 -91 18 -75 -307 111 -96
6740 -96 36 -8 67 -65 52 -175 145 -58 120 205 45 131 -61 -9 2 -4 24 126 -206 -78 -31 4 -112 43
6764 43 123 69 -20 -217 -214 -200 69 -78 -79 222 53 -46 115 -170 54 22 150 213 -26 38 -12 108 -300 78 133
6789 133 -42 -35 5 -62 -99 89 2 -130 -101 -86 50 198 87 71 -20 -35 186 -53 -75 -52 -18 125 -136 147 -49
6814 -49 -38 184 -58 -46 57 67 -41 -78 162 17 -43 26 68 160 -12 77 42 -10 57 61 -70 -168 -4 69 -19 -158
6840 -158 147 212 -6 -85 -171 -99 -19 -64 18 -119 -145 -121 161 110 -109 123 -75 188 289 -110 35 -192 43
6863 43 48 -106 -63 53 87 28 46 -15 141 134 -52 56 -201 -332 -79 -18 20 30 48 85 18 -56 -213 28 -79 -89
6889 -89 121 3 -49 1 24 -134 183 -40 -55 -104 -6 -21 -33 -16 79 -51 200 -55 107 -30 -152 204 -46 54
6913 54 -29 -64 -189 -193 -76 219 119 145 123 9 76 -13 -24 -171 170 -136 6 62 -22 196 324 -6 70 -73
6937 -73 -236 0 -98 217 -109 236 150 40 -91 -88 -70 28 112 65 -8 -121 -207 -102 -114 31 9 -30 -181 -33 81
6962 81 -82 147 -13 173 5 43 14 -61 168 24 -1 90 -5 -29 -13 -57 26 26 -80 229 -13 -240 -97 -70 -90
6987 -90 -49 59 48 -37 -143 -72 60 -51 15 -100 147 -52 -126 -59 228 -41 -265 83 75 -12 -118 -55 27 -177
7011 -177 -42 -197 164 91 126 95 -125 8 3 138 52 -138 70 5 102 44 -393 122 66 26 107 -49 -39 174
7035 174 9 -59 97 -22 -95 -23 -208 -108 39 48 45 -81 -82 -14 241 -16 149 -87 87 94 60 -43 -28 118 -35
7060 -35 5 150 326 121 -86 38 -124 -47 -41 -233 -38 113 -66 118 -43 -192 25 133 -126 150 84 143
7082 143 75 -64 4 -79 29 -6 13 -114 -59 -193 -239 -232 70 123 -258 45 -8 -4 35 -93 -48 62 24 134 -75
7107 -75 80 -9 -143 51 -171 -23 -50 158 74 141 -93 -140 -127 -110 -182 -71 34 -58 -160 131 -4 -5 -98 -67 -185
7132 -185 221 -262 -108 96 116 186 3 176 -62 -142 19 -256 -22 -182 -4 2 90 82 -16 234 35 -53 11 -23
7156 -23 -4 167 -171 -36 63 -271 -11 64 194 40 -87 -29 11 -92 37 -2 -12 -66 -12 70 -101 48 -43 4
7180 4 63 144 -90 112 55 151 129 190 -127 43 -215 22 158 56 -97 175 -79 -40 -111 181 82 -64 -158 157
7204 157 -65 -11 111 19 52 200 -25 182 28 -313 -72 -61 -148 -115 -27 -7 108 15 221 -7 -101 -69 4 -11
7228 -11 -4 202 155 -6 -115 132 180 -165 -117 -83 57 253 -75 106 -1 379 223 -87 95 215 -145 178
7250 178 275 -58 90 -121 44 -61 -82 -25 -86 -172 -34 94 -58 39 -6 -37 -104 -71 -214 -69 -32 200 17 134
7274 134 186 200 -10 89 -122 93 100 -215 200 -20 47 -189 122 46 -191 -7 -259 96 -75 67 45 194 154
7297 154 6 -109 112 107 -275 164 7 32 161 92 -75 -206 -76 23 66 54 44 47 -12 115 148 112 -66 -138 31
7322 31 186 -134 -4 3 51 135 -22 43 -1 -47 288 -52 39 29 34 -94 -15 3 126 107 -140 24 157 -111 -159
7347 -159 174 64 -79 221 -70 202 112 128 1 -124 -66 76 -62 36 -16 30 -55 -38 -213 -80 -120 -8 -131
7370 -131 33 129 -46 -57 -4 -131 -71 -30 -8 -97 104 -27 4 213 -139 -206 2 -177 32 38 -175 -71 -168 172
7394 172 153 40 111 -58 -142 115 -143 118 -20 4 -13 -57 190 109 7 -160 11 -40 -4 125 -9 4 -81 -85
7418 -85 -64 63 56 -29 -53 -49 37 70 -220 -124 -38 -52 -55 -52 120 32 25 120 -32 -157 121 54 69 -5 -5 86 -265 5 -76
7447 -76 -127 164 5 58 -2 143 117 -180 -32 -35 -56 -38 -23 12 -177 -60 -71 -5 31 144 11 -37 -154 -138 54
7472 54 120 -1 -138 -130 24 17 84 10 -79 -13 47 -107 56 -34 140 -86 -61 9 171 -182 -77 49 -143 -244 -31
7497 -31 -215 -205 -35 -101 55 -58 47 1 44 -133 -179 22 140 195 -20 -88 89 19 24 16 -96 -25 -140 -83 44
7522 44 -3 -233 -67 75 132 -19 81 15 -97 43 345 61 -9 85 -139 -11 43 -106 -254 -90 -26 2 216
7545 216 31 24 -91 83 -27 85 -18 187 -73 -187 -108 -177 -131 -314 -5 -28 61 -68 -192 3 33 -72 -96
7568 -96 -50 168 178 -31 -160 -16 -84 59 117 -244 -82 195 -34 64 -44 14 112 -39 135 -85 21 -159 178
7591 178 -51 73 67 155 57 -138 -69 -97 55 -69 -220 247 259 -67 18 -55 -30 20 91 -36 36 47 3 -33 194
7616 194 -7 -22 -140 184 -38 153 59 -143 -70 -52 -4 27 57 -94 -30 -21 -64 47 30 -100 -103 -95 5 -193 -20
7641 -20 -110 -196 -27 -199 -23 -55 -145 69 -60 47 70 151 -11 61 68 112 51 -165 28 35 236 53 -274 -113 -52
7666 -52 -146 -22 48 -27 89 -33 -128 -107 92 -32 -35 34 122 -12 -151 49 -73 67 231 -52 -100 -33 145 119
7690 119 100 -54 198 -148 13 90 -57 -16 150 225 -22 22 -93 112 38 -131 -60 -171 55 -41 -141 282 -54
7713 -54 159 408 2 60 52 21 -32 -180 -99 -106 -3 -27 5 -110 33 27 130 14 -90 -23 -26 68 52 34 -39 -93 -51
7740 -51 -114 53 57 -114 -142 -80 71 142 -63 -22 123 351 51 -36 14 -71 -31 22 287 -167 -81 -70 -72 38 -186 19
7766 19 94 395 185 65 44 -67 -53 92 57 54 -62 36 123 48 -110 99 91 15 -89 81 -32 -125 23 269 -299
7791 -299 148 187 -27 53 -99 29 2 119 -18 228 273 13 41 -209 17 269 41 29 -31 68 61 -52 -160
7814 -160 -158 138 -118 157 -176 182 19 -281 -48 -169 37 -73 173 -204 62 20 -163 76 -72 -57 -237
7835 -237 192 160 31 -115 75 9 -152 -94 -128 12 61 13 124 55 -98 6 83 172 93 -220 -147 27 -50 196
7859 196 182 -143 55 43 -43 -167 102 18 199 -94 92 15 -6 -44 124 -146 -213 47 -109 162 66 143 -171
7882 -171 82 5 -34 143 197 -22 -34 13 45 -227 -225 -1 17 -4 60 -99 31 176 129 19 82 -107 -153 110 -66
7907 -66 -6 -261 0 -59 -2 33 86 -43 -8 73 8 121 53 225 82 -177 13 122 48 75 28 -47 -50 -153 -30
7932 -30 197 89 115 5 -50 -124 -91 -56 22 145 135 198 -113 -117 -263 -283 67 116 -69 46 -35 -76 52 -137 75
7957 75 -75 90 78 52 278 -205 -204 112 194 139 -206 20 205 -195 11 -67 54 71 68 -28 148 22 -30 -101 -60
7982 -60 69 -56 197 -58 237 57 -85 160 -144 -89 163 8 -55 -76 194 -82 -15 -160 100 -22 64 -197
8004 -197 -142 -87 214 192 36 -69 70 -61 -7 -31 -129 -68 -26 -54 -19 87 -129 138 376 6 35 63 78 -66
8028 -66 182 35 -102 -38 25 40 -33 4 -163 -114 84 204 94 -54 -72 -108 68 -46 90 28 143 83 -53 -132
8052 -132 -102 -29 -78 105 -35 -106 -17 -78 64 -112 70 270 1 -53 14 -15 -7 -174 -162 97 -85 270 21 50
8076 50 -26 81 -143 -113 12 -165 68 158 -86 107 -175 -146 276 -90 52 -2 -54 -76 85 43 19 5 -201 -145
8100 -145 -21 -137 110 -76 -59 -45 105 -275 81 -12 130 -84 -222 59 67 29 -114 87 130 25 -65 16 -64
8123 -64 21 -4 -8 28 -96 -152 -121 97 -99 320 220 -58 226 212 42 -110 1 101 -102 -80 -5 -19 5 -25 -258
8148 -258 22 -107 -91 87 -130 -11 -158 -33 284 -17 60 -149 -236 56 27 17 34 1 -206 26 -68 32 -20
8171 -20 57 42 -231 73 -7 102 -93 -10 -107 -299 183 34 57 -88 -80 -207 -35 -79 25 -287
8191b87
$$ Imaginary data points
##PAGE= N=2
##DATA TABLE= (X++(I..I)), XYDATA
0 0 0 0 0 0 0 0 0 0 0 0 8 -8 8 -8 16 -16 24 -24 32 -40 48 -56 64 -72 88 -104 120 -136 159 -182 208 -238
32 -238 270 -304 344 -389 437 -487 543 -607 677 -750 836 -924 1021 -1129 1246 -1373 1514
49 1514 -1667 1835 -2024 2230 -2459 2719 -3009 3341 -3721 4163 -4684 5311 -6076 7043 -8301
64 -8301 10016 -12508 16459 -23712 41391 -180381 -103104 200408 -142757 -132242 149289 75575
76 75575 -135393 65484 162368 -8260 -18588 121965 15798 -90159 486 37675 -66789
87 -66789 -50588 23574 -7137 -68620 -28185 26956 11971 -27973 3684 34379 -8777 -21872
99 -21872 53257 55213 -13753 7588 55450 -7663 -43739 24120 24234 -52169 -36095 1338 -48476
112 -48476 -51431 22981 17131 -24253 20022 51731 9709 9754 52447 34900 -7225 -353 6256
125 6256 -24293 -35286 -11787 -8214 -25913 -24551 -7459 -2538 -2661 14348 30428 16759 -478
138 -478 10683 18716 5682 5697 13680 -2063 -15234 -5959 -5871 -16575 -9601 348 -10762 -19485 -6470
153 -6470 4172 318 4099 16512 16873 7166 6892 14046 13035 4459 452 -3669 -16512 -21308 -11311
168 -11311 -9295 -13946 -6087 85 -5696 -1284 16000 17882 10554 12777 12917 790 -2599 4262 383
183 383 -8302 -7886 -7772 -13299 -12195 -4542 -214 -932 -524 1161 1275 1567 6891 12309 9075 4360 5774
200 5774 4768 -1711 -332 5073 -2499 -13113 -10422 -8206 -12783 -7883 1880 -1442 -4117 5122 8387
215 8387 4365 11800 18109 8117 152 3819 290 -8404 -4930 -1811 -9392 -11609 -5870 -6300 -6400 2756
231 2756 7047 1915 1929 6394 4446 2739 7575 7260 614 -987 7 -2707 -3086 -2 -1359 -6194
247 -6194 -6579 -4718 -5180 -2998 1330 2350 1168 2317 4191 4590 5602 7699 6113 1745 -1123 -2527
263 -2527 -4423 -4927 -3914 -4344 -5847 -5480 -2964 -1070 1748 5337 5157 2713 2613 3302 2345 2089 1908
280 1908 62 -2908 -3196 -2899 -2711 -1003 226 -1359 -2838 -1039 -168 -340 941 2684 1601 915 1173
297 1173 1662 1914 3023 2657 -58 -1767 -1880 -2502 -3141 -2103 -1324 -2286 -2717 -1236 1086 2341 3988
314 3988 4312 2405 1680 1341 1010 -237 -462 -1013 -3192 -3919 -2946 -1843 -1111 309 1316 183 407 1558
332 1558 2043 1474 2227 1841 -256 -1114 -558 -271 248 295 -346 -2168 -2507 -1035 -488 -671 -188 42 -880
351 -880 -272 1128 2178 2556 2582 1859 672 142 85 -424 -1453 -1477 -1665 -3120 -3270 -1385 265 584 1371
370 1371 1728 1258 1232 2054 2314 1360 1152 -64 -1563 -1472 -515 -563 -1101 -782 -1162 -1443 -1113 71 402 655
390 655 703 85 -197 763 1529 1594 1513 1096 467 -527 -655 -478 -577 -1134 -1493 -1876 -1976 -1353 362 1039 1044 1401
412 1401 903 793 1221 1645 1285 384 -232 -733 -1578 -1116 -212 -309 -879 -375 -447 -641 38 704 713 289 332 62
434 62 -312 464 1128 530 -153 213 -244 -931 -289 -3 -193 -721 -690 -1150 -714 394 1254 526 533 902 336
455 336 2 648 890 -205 -684 -858 -1419 -963 -58 358 -146 146 431 -2 477 1383 1139 135 118 -401
475 -401 -848 -449 147 -63 -428 -280 -488 -75 30 792 499 -1 108 -308 -505 243 697 245 -7 166
495 166 -25 -151 -34 290 -97 -776 -659 -975 -1014 24 291 72 148 752 387 378 1220 1421 271 -192 -205
516 -205 -935 -955 -94 -572 -950 -280 -362 -532 335 808 704 298 316 109 14 287 453 268 267 129 -620 -151
538 -151 -182 -161 -174 -468 -716 -586 -401 -79 80 763 574 -76 301 636 703 601 871 342 -544 -703 -287 -469
560 -469 -470 -313 -480 -636 -194 83 230 574 669 120 -206 222 133 127 225 162 -367 -647 -332 -73 -132 177 426
583 426 -356 -264 223 -52 46 103 272 -161 -239 503 429 234 327 -8 -436 -238 -264 -154 -372 166 -220 -292 -101
606 -101 109 285 341 420 345 -154 -516 -104 -70 -146 -79 -173 -479 -552 322 473 260 657 165 -315 12 440 29
629 29 10 67 -221 -640 -201 51 -195 90 369 -323 -515 103 -13 -150 384 520 -191 -47 504 23 213
650 213 393 -21 -460 -403 42 -277 -389 -27 -440 -529 -256 -10 358 523 573 394 101 215 48 33 135 134
672 134 -342 -433 -404 -433 -29 24 36 -399 -374 -10 13 426 314 292 395 11 -10 296 243 169 76 -523 -548 -352 -271
697 -271 -332 -127 -77 -360 -335 274 527 599 784 334 -35 298 -94 83 -159 81 -243 -396 -169 -349 -40 122
719 122 124 51 -161 -35 -75 135 241 86 -106 -53 21 -70 396 397 -150 -161 238 -224 -392 -6 -69 -196 -43 12
743 12 -125 33 403 252 62 99 201 -206 -90 94 20 -251 -333 -66 -348 -37 261 176 34 190 328 127
765 127 57 73 -17 -343 -246 -352 -358 209 -54 -165 -91 66 22 356 377 319 46 -68 22 -192 -38 208 142 -92
789 -92 54 -203 -265 -116 -54 -37 -152 146 -352 -24 142 100 277 85 88 89 58 -42 38 -123 -120 -162 -352 -444 -198
814 -198 -138 -70 171 87 70 189 331 431 121 -43 61 108 -129 -93 33 -78 -173 -192 -420 -478 70 -125 72
837 72 85 -258 194 247 366 388 146 306 -6 88 -90 -90 -196 -283 -330 -358 -362 -180 55 10 199 186 74 242 -76
862 -76 104 182 108 -173 -42 183 -254 -147 -154 -52 -262 39 -90 -22 41 103 -33 148 112 -9 307 126 173 14
886 14 119 98 -14 -1 97 -200 -241 -165 -224 -202 85 189 167 -74 35 -58 -136 281 45 107 -107 64 -41 -6 -67
911 -67 -217 -130 -190 88 2 -200 176 66 -6 -110 -123 38 -44 102 -66 16 -184 30 20 51 62 -10 112 -44
935 -44 -133 -117 78 125 -85 51 13 -85 139 162 -88 -195 26 -169 5 49 177 -163 -13 173 6 234 205
958 205 315 166 -14 275 27 -173 214 13 -140 -274 -236 -244 -159 20 -56 31 15 1 12 214 -13 316 -293
981 -293 31 170 -91 -88 -77 -79 -128 -104 177 -266 -282 142 52 70 276 198 107 141 279 169 -8 160 -217 2 -160
1006 -160 48 -78 -73 66 -245 117 68 13 184 22 -59 84 37 112 104 -35 161 64 -58 31 216 200 -192 150
1030 150 -258 -53 72 198 8 -22 77 28 85 119 89 179 -17 -49 -217 -147 -41 -61 -231 11 9 -202 -2 -64
1054 -64 -11 61 188 10 32 177 -96 46 40 181 121 3 -231 85 -46 29 97 49 -15 53 56 56 114 31 12 133
1080 133 -98 77 46 -62 -147 68 -47 -168 73 -79 238 53 25 -34 205 258 -32 -74 30 -134 -129 9 -129
1103 -129 -156 -204 -279 -32 -26 -56 -36 47 -69 -83 -79 164 -27 -84 56 -258 -6 -152 -263 162 -208 -143 -77 -100 61
1128 61 218 -34 14 -131 68 -132 11 138 64 -4 96 -50 21 -17 -108 14 -210 -40 17 -137 -34 19 -88
1151 -88 -23 78 -65 -19 -165 216 13 30 8 39 2 -67 -169 18 -92 -30 131 -4 120 32 60 -10 37 103 -100
1176 -100 -164 32 90 -32 -43 -179 22 33 -9 1 -71 0 -126 80 65 8 36 1 12 1 82 -137 87 -23 122
1201 122 134 -315 -74 -113 71 -108 -41 -265 82 27 -250 137 -194 162 -22 50 129 -48 69 267 107 -156
1223 -156 102 76 -44 69 -71 8 33 23 45 -146 -239 -105 -213 -140 131 21 -132 31 162 6 25 -26 -96
1246 -96 -26 -138 -211 -122 222 121 221 130 107 -201 -64 40 -58 22 -50 172 -157 72 108 66 -70 255 97 148
1270 148 196 48 66 91 -248 27 -215 -144 -121 152 19 27 0 49 112 -35 128 -123 90 -75 118 56 51 54 102
1295 102 0 -81 324 -45 26 -97 205 -71 -19 -117 -101 -69 -80 17 -171 67 136 -205 106 -114 217 14 -71
1318 -71 -149 -95 -52 -125 120 21 -71 83 62 -90 -145 35 130 -132 -25 5 79 -132 121 77 -106 -267 -82 6 284
1343 284 8 -63 -34 -136 -50 -1 -102 103 0 -113 35 -25 -70 -188 -65 -92 -30 72 0 49 -147 -128 35 -189
1367 -189 -8 99 67 33 -147 -297 1 40 -83 -231 210 0 211 -43 -31 142 36 43 -132 -44 219 171 -182
1390 -182 126 -95 -45 -38 -62 -36 104 259 83 -21 -208 36 -165 21 17 -21 -84 20 42 163 27 36 -21 -38 -197
1415 -197 -32 100 208 71 -103 -31 80 -143 76 169 51 149 -35 20 -140 61 88 158 50 1 -151 85
1437 85 -167 -31 -111 -136 -60 103 -94 -92 162 -134 55 44 166 -5 223 -202 -159 -12 -103 -90 -183 -65 117 46
1461 46 -92 233 -273 -10 -84 44 154 -19 -85 204 -120 -179 101 -48 28 -217 -114 118 -114 107 243 72
1483 72 134 107 72 -27 -96 -166 -129 -11 -59 -85 110 -50 26 -46 51 32 53 13 -197 21 -45 -175 263 -220 59 -103
1509 -103 88 -34 95 39 8 123 -183 -21 -50 -7 -96 156 145 -85 -83 -11 33 -29 33 203 88 211 -2 -109
1533 -109 113 -405 239 69 -21 62 38 -70 -23 -56 -35 -110 118 -65 55 46 32 72 -131 104 -76 268 188 -6
1557 -6 -125 -247 2 31 -127 -106 -31 -4 -113 -14 7 29 -62 -249 46 -63 -86 -14 156 104 59 -93 -9 89 74 -55
1583 -55 19 -130 77 -82 -86 -31 70 118 80 -86 -17 129 -42 10 266 -27 85 100 17 147 -167 -30 17 -27
1607 -27 147 -54 12 114 8 19 -2 90 307 -106 27 -48 8 -68 -14 -5 68 -2 -1 75 -52 151 -168 -76 -92 115
1633 115 172 216 -8 54 -56 -43 77 105 138 -33 163 180 -10 126 -84 -12 -20 -5 -1 -210 63 -92 -48 162 70
1658 70 15 71 87 124 33 -74 -128 90 118 -20 -77 -72 -123 54 184 -127 -33 245 -50 -186 -29 -38 114 -36 83
1683 83 111 -264 -166 -145 69 159 -28 41 10 -143 -395 111 25 18 55 -52 -29 136 114 -203 -55 70 135 52 -129
1708 -129 57 -94 20 199 -119 -191 69 -115 15 126 -45 9 188 -85 147 9 -115 -84 -29 -48 -194 80
1730 80 -66 -225 -8 -225 -40 -324 20 139 -15 -32 30 -7 -49 -85 -34 -65 -48 -67 31 88 110 -176 70 -147
1754 -147 -123 2 57 94 -41 96 48 119 -36 -97 151 144 88 -32 42 -124 -117 153 65 -1 -16 -24 -8 -21 -95 -15 -44
1781 -44 -149 -142 -49 11 -97 -318 122 37 96 238 -169 35 -59 -32 10 -50 60 -87 70 29 3 -14 -126 -145 -58
1806 -58 172 -28 -63 152 -68 -30 157 35 -8 27 191 54 -86 80 -68 -52 151 -105 -144 56 250 181 -122
1829 -122 -129 4 -107 80 53 75 -86 32 110 -162 270 21 -225 -179 -32 -101 89 -123 -128 13 -116 90 134
1852 134 212 -107 -118 -94 20 -109 47 199 -53 172 95 -47 111 -33 -44 72 -13 17 186 -129 74 -16 -88
1875 -88 5 -231 -59 56 107 116 205 39 39 -57 55 -178 -74 -95 -101 33 19 147 -85 64 -82 -97 47 81 90 -281
1901 -281 -42 122 -144 41 -17 81 -138 -215 -139 143 -70 2 -14 27 -64 14 8 92 -46 19 120 160 0 -35 -44 50
1927 50 40 182 211 -198 -100 -81 142 203 20 -249 -37 -61 -6 -61 -74 29 45 -49 -129 78 3 -270 -102 106 60
1952 60 81 84 45 -41 74 -123 -28 -68 85 55 158 140 -56 -31 157 -7 212 -1 -53 -58 -82 -21 85 35 179 -12
1978 -12 -139 -106 121 81 -28 37 -85 -148 -6 -129 -25 137 71 112 15 -6 -60 41 -242 -37 30 -118 3 -173
2002 -173 136 -105 30 190 -7 86 -48 -219 49 -31 60 67 -28 -99 -183 -59 57 -64 110 -28 -18 -175 80
2025 80 -29 -121 43 -70 -224 -13 24 -266 225 -145 -14 -54 -116 218 -76 -103 -279 -51 101 -14 66 -15 -23
2048 -23 5 152 101 -98 119 -46 57 -12 190 188 -29 -177 38 132 -32 59 -67 18 -5 19 -120 -59 142 179
2072 179 -1 -106 29 47 18 -58 53 175 -187 209 78 -5 31 150 63 79 31 -89 2 148 -16 -87 51
2095 51 -78 63 -65 -36 47 142 185 1 -28 -29 29 -94 -88 -1 -73 78 14 -125 13 -51 27 42 -16 -84 90 58 129
2122 129 5 -99 -85 14 126 -19 -88 -158 94 -60 150 -176 -68 -68 42 76 -4 -131 -9 -16 -234 33 52 -59
2146 -59 -54 -75 92 66 227 -52 -2 -92 -14 -2 228 156 29 2 89 134 122 -210 217 107 61 49 85 -37 128 36
2172 36 -15 -12 157 7 -84 -83 80 -20 -114 87 30 -205 -37 -58 -93 134 202 108 -14 -42 -41 -25 77 22 -85 -52
2198 -52 241 44 -25 100 253 -139 -43 80 -72 61 9 23 37 65 -2 -233 -2 -92 92 -228 -205 -8 -95 2
2222 2 -168 -12 161 -72 130 144 326 142 -27 129 -138 4 154 -43 -144 -173 0 -140 37 61 -42 47
2244 47 -13 -32 269 -60 -24 -220 32 29 -105 11 67 -21 -101 -204 3 9 148 -43 -139 52 21 96 101 -98 -57 6
2270 6 -27 -22 4 59 46 20 -51 -136 -57 -123 -89 70 -5 5 -63 43 -15 32 -161 140 -153 158 -73 5 -23 39 114 147
2298 147 -29 -131 -80 -105 82 -20 -253 -140 -94 -77 -59 45 46 -10 -52 110 38 -116 149 172 239 -104 -165 0
2322 0 33 106 -122 -200 -193 -140 -89 -210 -88 137 96 -34 -20 -63 46 -25 -10 -40 57 -69 -235 171 74 138 62 -10 -152
2349 -152 48 12 -95 -45 16 45 -122 -97 -157 -64 -67 130 -99 -112 143 109 150 -14 142 184 -38 48 -50 -77 -190
2374 -190 -9 131 -106 -57 86 -260 -54 -155 -114 -20 209 -81 152 -34 -164 -159 137 111 116 -140 73 -51 146
2397 146 43 -23 -170 -309 -205 29 54 -86 60 -6 -7 -38 99 204 -77 -208 -98 181 4 129 140 -42
2419 -42 3 -7 44 4 111 59 46 -126 -14 0 -24 12 338 -127 177 268 -127 -91 271 35 -65 -57 30 178 77
2444 77 89 134 -113 4 -150 157 104 -60 66 29 150 226 42 179 125 -36 -87 -9 181 -158 -82 -26 -61 -265
2468 -265 109 239 61 8 -66 -22 44 -64 -104 -9 -151 37 -40 13 106 16 63 54 44 -16 -160 2 -240 -117 -224
2493 -224 77 -115 -8 -162 2 -3 -70 110 -146 15 -101 86 -12 -10 -19 67 88 119 -26 -109 -63 -2 -153 -280 72
2518 72 76 -79 -159 -98 77 -80 -85 114 218 18 -16 -59 -177 82 148 -69 64 23 10 32 259 -94 150 52 -1
2543 -1 -46 -110 -3 36 26 -14 19 51 -58 -17 103 -32 147 52 -67 99 -36 -16 11 251 -1 55 -79 -144 59
2568 59 -159 114 -104 167 0 86 -8 -63 -4 -96 60 -91 -120 -85 -82 75 127 -180 -183 138 -3 49 -112 89 214
2593 214 283 188 160 38 -111 -73 -326 19 69 -89 -63 17 -28 233 -90 86 -48 57 0 128 87 73 -63 -289
2617 -289 173 -80 65 -24 -118 -17 -266 25 -30 -121 -89 53 11 -99 -203 -142 124 -96 -6 -123 -59 -38 -34 -84
2641 -84 -55 -23 -175 88 -91 -17 76 167 -169 -81 -79 51 -24 -99 84 -4 20 -88 -79 -73 -113 17 -58 43 -111 89
2667 89 -227 14 -42 -113 82 -65 16 -29 122 -33 116 150 8 -119 198 -3 59 -84 -180 -49 41 60 -274
2690 -274 44 -40 -37 -28 9 8 -106 0 -22 -177 120 46 -128 114 -165 169 203 59 -108 39 40 36 -177 244 90
2715 90 69 68 11 122 190 -121 58 -81 120 -126 -44 25 -52 149 -243 -47 -288 -75 -237 -113 -40 18 19 -69 -35
2740 -35 0 -52 55 -267 78 55 -6 165 56 98 18 52 34 166 104 77 -58 82 16 -141 238 49 133 -189
2764 -189 62 -22 -46 -57 -44 62 -4 -106 -170 37 -10 10 -65 -14 223 -165 -13 234 -101 105 -88 102 -33
2787 -33 6 96 -66 157 -27 5 -82 -137 142 -12 -13 -77 -77 -118 173 4 105 -188 -173 -41 29 8 -41 -4 28 9
2813 9 97 -92 -147 -33 3 28 -6 238 244 310 79 -5 -97 93 -197 -19 -108 12 -148 -151 97 -177 16 -120 74
2838 74 -71 139 -6 132 206 172 -37 -201 160 146 -64 -61 169 -296 -144 -110 100 -17 -7 -51 90 -36 -119
2861 -119 6 76 153 -129 -14 31 64 -146 6 -48 50 -290 -36 16 -265 30 39 76 36 42 197 -13 -164 77
2885 77 -6 -29 -37 -51 -31 154 42 16 146 129 -172 -97 64 -85 123 -146 27 -110 212 -76 -181 99 27 -42
2909 -42 45 8 37 77 120 -54 22 155 244 122 19 212 61 80 -121 -208 -121 11 -88 82 -100 111 -51 -107
2933 -107 -18 55 -40 -129 -66 93 41 -37 64 35 -80 -4 -172 169 66 -127 76 -161 38 -12 -295 59 -192
2956 -192 -21 -56 -21 -9 -197 -92 124 32 91 -69 169 -52 -44 150 -129 -54 212 -94 -133 174 61 -49 46
2979 46 -2 167 157 -40 -27 3 -37 71 3 -220 -40 -115 -133 33 -126 48 -84 -131 71 -163 -111 19 176 -107
3003 -107 -100 76 111 59 89 123 -67 -138 105 -1 84 37 -114 -22 10 22 91 -10 13 96 73 -88 -66 -245 131 -50
3029 -50 -16 -39 -37 4 -284 42 47 72 191 61 -9 74 118 -4 3 -135 -115 74 46 177 61 338 109 -75 -79 -10
3055 -10 -54 -32 -152 82 -2 74 37 90 -101 -3 58 25 -69 -168 -289 380 69 111 14 171 42 -87 95 -79 31
3080 31 -185 -243 111 -3 69 123 -126 -207 -231 -110 65 -53 75 94 -51 -202 -60 27 -24 197 -47 18 193
3103 193 -44 24 78 -101 26 -3 80 -184 18 -224 -46 -185 -124 6 102 79 1 77 -183 -29 -7 -60 61 29
3127 29 -85 6 27 -11 -33 42 -78 -37 -159 -36 368 155 -116 -139 100 -16 -24 -44 -4 228 -16 -2 -127 238
3151 238 60 63 156 -87 -4 55 -58 210 56 68 28 180 -137 21 -153 -74 -24 -67 -5 87 129 3 151 70 46
3176 46 11 83 -8 -167 138 -35 20 -70 49 11 -201 -225 -115 -128 -23 1 15 -62 -141 50 34 -22 245 45 75
3201 75 -7 90 -66 297 27 106 104 129 -1 -112 146 95 114 -115 148 -242 -85 -257 -125 77 -181 -31 -6
3224 -6 -10 118 80 -104 45 210 19 -11 -99 -39 -14 8 252 -278 -71 -189 95 64 -41 182 -98 -83 134 248
3248 248 26 0 -87 -172 164 -1 74 125 190 10 82 133 57 -4 1 -38 235 329 37 -35 124 87 -132 170 158 -218
3274 -218 135 115 73 -130 206 -91 -218 -75 -11 168 -75 59 234 19 -20 -43 57 113 59 38 -93 6 -20
3297 -20 53 76 -95 16 -155 -78 215 -28 -150 -23 -31 57 55 -135 81 -45 -71 -103 86 61 -85 -86 -5 -38 45 48
3323 48 -83 -82 242 71 113 126 74 -39 -72 -213 -93 107 214 77 -237 114 -24 -16 79 -25 134 33 -106
3346 -106 150 -11 85 112 275 -145 157 102 -29 -76 -68 -36 50 97 86 -125 210 38 -42 39 123 -67 -62 -113 42
3371 42 -8 36 -99 132 -45 47 -41 -78 51 -41 36 69 120 -35 -88 -222 194 -56 -57 -66 -67 85 40 11 5 -42 -156
3398 -156 -125 112 16 -16 171 -57 -42 -183 -151 -25 -157 -22 15 -202 -49 -107 -147 -26 116 250 -22 43 -151
3421 -151 -59 -229 -56 119 52 260 -42 -46 88 46 -116 -134 -132 -29 42 53 87 167 -130 -9 88 -155 87 119 -121
3446 -121 63 -306 185 -143 181 -60 72 11 -7 292 -73 -72 -25 -26 36 -67 113 -187 14 -35 -1 83 177 -78
3470 -78 -159 114 114 106 -6 -138 -286 39 -23 71 61 -134 210 2 95 -19 -137 88 -294 -59 124 -114 88
3493 88 -10 -46 0 155 -4 100 40 -117 -130 31 6 -148 -29 -8 52 109 -65 -115 -103 -56 54 -68 -92 124 -125
3518 -125 37 -55 91 -61 -76 46 -155 -260 -154 82 -93 -91 -11 95 67 -79 -37 30 -47 228 -304 32 87
3541 87 -6 26 -6 -106 -219 -57 163 203 -62 45 54 -66 103 25 -24 158 -62 -18 96 -247 -33 156 8
3564 8 -71 12 54 -77 2 -102 119 89 208 95 -110 -98 207 55 -41 -29 -30 -40 -151 23 37 189 -68 23 -190
3589 -190 -57 -79 170 -397 93 105 -21 182 65 -162 114 145 -176 -236 17 -145 -155 -50 15 65 45 22 139
3612 139 -146 201 30 90 -36 -48 -169 -29 123 47 -6 55 31 -122 133 86 222 32 76 7 -145 -5 275
3635 275 67 -47 126 10 -17 -143 34 -72 -47 -74 104 95 44 -120 175 -42 11 -8 -110 17 -14 -22 -119 107
3659 107 -94 -176 8 71 99 -113 112 -52 147 -274 48 10 155 -182 -81 35 -25 94 -158 -47 146 77
3681 77 -35 -104 37 -115 96 -37 189 49 -61 75 -7 59 -188 -193 -131 38 -183 68 204 -44 -189 90
3703 90 -15 -4 -4 -102 -221 22 38 -20 -214 -180 -236 -31 40 267 -64 18 -79 52 221 107 -33 -47 113 31 -181
3728 -181 -167 -40 -110 -105 95 64 103 90 -176 126 -116 53 309 -9 -210 166 -68 -76 -218 -117 160 152 188 -52
3752 -52 0 -27 -69 -57 -7 162 58 158 -161 -129 -15 17 -96 -42 -20 163 25 -69 -58 69 -183 146 -49 -164
3776 -164 42 -127 -132 -132 62 74 167 46 215 -8 -32 42 84 44 28 101 45 152 69 -203 78 38 91 108 -85 144
3802 144 113 -102 -37 -89 -125 -37 157 -34 3 134 127 41 100 -45 63 -89 -32 3 35 -88 -125 93 62 219 133
3827 133 76 113 34 -106 33 151 79 108 8 47 -44 -142 96 -162 -187 79 -19 89 129 8 -96 142 -86 16
3851 16 4 217 -11 -20 136 -42 92 125 11 -108 134 121 45 36 -112 14 28 -6 -115 -15 -42 72 62 -77
3875 -77 -1 -8 -14 -125 133 3 53 79 23 -3 -184 -85 -60 -111 39 83 76 73 -139 -129 -121 132 23 -110 47 -164 27
3902 27 29 -56 47 -27 -146 38 -181 17 111 -67 139 66 143 -93 58 -176 136 139 1 -68 -13 31 -133 7
3926 7 123 34 23 26 103 153 0 7 -65 -110 23 -142 -124 96 -143 153 -29 -13 98 -72 8 -89 -83 42 91 -218
3952 -218 -184 -181 -38 -91 -103 -105 -61 59 108 30 -46 69 -211 225 68 124 323 -274 -78 -98 -57 -22 47 51 -44 -57 82
3979 82 -35 -53 196 -50 -148 -119 3 135 24 -125 7 -87 113 -24 -232 43 104 -23 9 -311 -11 19 43
4002 43 -182 127 -116 6 51 56 58 -11 -58 -104 -57 18 13 -53 -239 -6 -85 -124 -25 72 99 240 -127 -23 13 36 24
4029 24 -195 -173 -20 -145 44 -110 57 69 263 -77 -80 156 -110 82 86 -41 -54 -87 -38 122 21 80 -24 -12
4053 -12 156 -96 6 -100 -101 -44 -131 -64 36 181 242 -104 101 -159 85 195 202 54 57 105 42 -215 -99 146
4077 146 -127 -1 90 -15 -72 -33 -25 -66 -137 -98 -40 -78 183 28 87 -136 88 179 -193 -149 -99 128 59 -115 -64
4102 -64 -45 4 -13 91 -15 61 40 -118 -17 50 95 -7 241 -35 111 5 -172 69 76 51 159 25 10 112
4126 112 6 -114 -69 90 5 -21 -8 -187 62 72 -50 -79 -206 3 -124 13 83 -57 13 15 -69 -61 -55 128 -130
4151 -130 -47 143 33 257 -34 -139 -94 -26 67 -147 -48 9 104 -27 -97 -30 84 -83 -129 -56 -11 72 174 68
4175 68 -118 -188 213 110 76 205 104 -35 -184 -45 -103 -54 -98 -136 -179 -172 75 120 94 -82 -119 -79 134 -28 120
4200 120 -41 18 51 156 -65 20 -306 48 32 -216 -48 69 -216 108 -118 273 95 -303 1 -141 86
4221 86 8 30 -27 73 -136 -16 163 85 -16 135 -108 58 37 -221 113 104 68 181 -151 103 140 148 -33 132
4245 132 201 180 6 237 -127 16 -215 -51 -14 -327 60 1 -20 -21 -48 -100 -176 54 79 35 171 109 114 -149 -70
4270 -70 159 30 -9 -25 51 -108 36 -104 -63 171 70 -88 1 26 -50 -40 35 -211 36 7 40 -31 23 -20 118
4295 118 -110 -76 -7 -47 95 199 -112 37 -36 222 251 13 -224 25 115 -149 5 -53 95 25 -118 -48 55
4318 55 52 257 42 4 -1 6 -143 27 153 28 148 -82 2 216 208 33 -302 182 -55 38 83 12 -261 -59 -81
4343 -81 -57 152 167 -109 54 -66 -81 -48 -220 17 -329 4 -40 162 118 330 11 269 -82 6 -126 117 1
4366 1 34 -160 22 -44 -43 73 -93 -27 236 134 -221 -202 72 61 105 127 -43 -146 -174 115 122 -39 113 -21 102
4391 102 -95 37 71 -50 -37 -52 -114 47 -53 31 144 34 42 170 33 100 194 69 -15 -30 -33 -107 -137 -113 -109 86
4417 86 268 -98 29 116 -41 68 -47 -147 75 29 27 -44 9 42 -44 229 72 104 187 -204 43 47 15 9 39 244
4443 244 84 -48 2 104 116 17 163 -50 -147 170 -134 5 61 12 -40 -16 208 128 -142 200 -53 211 -25
4466 -25 282 3 57 59 51 28 -37 -1 57 1 62 43 -212 5 212 32 265 105 26 -142 69 41 162 -48 -23
4491 -23 -89 20 89 -256 -50 -9 123 9 -60 56 29 -160 74 150 24 -286 66 -59 42 -30 172 -200 -150
4514 -150 25 -94 251 151 -24 179 100 -56 -117 -21 34 92 -190 -15 -70 20 23 75 -94 129 -260 40 54 34
4538 34 198 -126 -109 23 130 -190 -111 -4 57 68 -114 -19 60 -18 56 -127 115 -56 25 -96 4 -122 -88 -65
4562 -65 -1 120 -63 -63 -69 -15 21 -156 -20 -110 13 -74 -255 240 -70 -67 127 -22 47 -101 -49 18 60 119 -136 -38
4588 -38 177 121 -118 -140 -158 82 -48 17 -84 128 8 253 28 -132 -3 64 -105 37 90 -45 -37 -98 -115 31
4612 31 -18 118 9 -64 -16 36 16 288 -14 -323 108 -7 5 113 -222 111 260 70 3 -8 73 24 -114 82
4636 82 -48 -72 -208 -7 -88 -24 72 -6 213 18 169 -18 35 59 -40 -73 -95 94 24 18 -248 -38 -11 -33 11 7
4662 7 -135 -49 15 -104 -117 -1 76 150 69 -116 -132 133 -131 54 -4 51 215 99 -105 60 70 72 -182 33 81
4687 81 63 -95 -208 169 -43 -29 80 7 -2 107 17 39 159 39 146 -174 -20 -289 -150 58 -112 92 138
4710 138 18 48 -62 -58 -13 -138 -189 -95 -45 96 88 -44 52 35 40 -26 -45 -52 54 83 24 204 -132 223 -21 -79 132
4737 132 134 -233 -323 -102 12 11 6 -2 62 -17 202 136 -22 69 -16 -151 -42 82 204 -19 5 -266 -35 10 -9 97
4763 97 4 46 -112 -210 -99 91 26 -62 40 53 -64 -68 -218 24 128 17 -115 264 50 -44 -178 -86 157 -23
4787 -23 53 -119 -70 9 209 68 187 -88 -219 47 -120 97 187 -122 -49 302 -131 -136 0 -37 40 17 217 199
4811 199 -91 -51 75 -193 282 -297 -34 -42 35 80 -136 -119 93 -145 159 -110 3 -66 -108 163 -60 1 -11
4834 -11 -120 -178 -44 72 44 112 38 -172 -186 26 28 -16 224 3 -23 54 -18 195 95 -36 77 -238 -91 -104
4858 -104 -28 74 161 -37 -32 -125 -43 11 18 -101 -60 72 189 -25 6 -106 237 15 -7 178 16 -88 -155 -56 42
4883 42 24 -113 -63 44 37 27 277 72 -47 147 104 -61 21 71 -64 -62 -208 98 -69 -20 139 83 -179 19
4907 19 -27 -163 120 -32 14 -158 152 116 -139 -200 45 148 -56 -55 -134 72 6 70 -79 -4 -103 -129 12 43 36
4932 36 -70 -70 -83 -50 -178 -24 7 68 -198 -197 83 167 -54 103 271 90 -9 -13 90 -111 119 46 -94 -32 -67
4957 -67 -351 38 190 -31 -35 -157 70 32 -83 17 98 122 -140 76 -43 -87 128 -3 -125 -6 -7 44 -71
4980 -71 29 -78 -50 -249 -301 -82 110 -14 37 -98 269 37 -57 -213 -193 150 86 21 118 228 134 -119 88
5003 88 124 175 126 78 32 -29 72 95 -56 -23 -128 -49 -183 -24 77 -34 66 142 59 -130 -2 -175 -98 165
5027 165 10 -93 -144 104 129 -139 -5 -22 -15 8 172 163 80 -118 82 -182 39 43 79 -140 29 12 180 163 -75
5052 -75 -29 -139 -114 2 -28 -16 53 -324 -177 -169 128 214 -206 -18 -39 -94 -81 117 -63 13 70 6 -19 -27 -41 81
5078 81 50 94 -132 -26 -6 107 32 84 -137 -197 213 -294 13 219 48 -77 -144 -75 -136 -89 -46 137 63 1 13
5103 13 64 23 224 71 13 26 37 -72 116 115 155 112 -2 15 36 -107 -218 -356 121 145 -59 272 -12 161
5127 161 372 -71 49 -83 5 -77 -180 74 99 -116 50 -135 -52 31 -112 198 143 173 191 -95 -99 -135 15 113
5151 113 -45 53 3 60 -8 24 90 26 -80 -154 17 27 -32 -10 62 -78 -92 -21 -152 55 -90 -47 40 -123 -68 14
5177 14 -22 94 -91 -27 147 -6 24 59 6 100 27 142 -72 124 -39 0 179 -32 142 -99 80 66 117 32
5201 32 -256 -99 42 -25 -281 121 -40 -102 -128 -45 49 -234 167 275 -30 63 -30 -24 -30 -101 -25 58 42 -104 41
5226 41 151 217 -97 78 -193 -114 115 107 13 60 -25 87 -10 -74 -155 -3 -125 47 -90 -113 50 -133 127 62
5250 62 91 -71 139 -99 7 89 149 141 28 76 -30 197 36 -89 -3 27 4 62 131 66 16 -113 -38 141 -26
5275 -26 -196 -54 -118 227 -17 -134 45 -26 -84 39 24 -104 256 56 -10 239 -46 -116 -22 -129 -135 6 55 13
5299 13 -57 -87 173 120 81 58 -65 7 146 76 160 12 16 -75 -63 -101 -47 125 32 109 60 128 -21 77 169 124 -60
5326 -60 -39 -11 47 -233 18 194 -85 27 -94 -191 -205 90 -68 36 -18 78 77 -79 -92 20 262 -42 51 4
5350 4 -151 133 127 33 148 145 -110 15 -81 165 89 -39 82 155 105 -135 125 81 -109 -212 7 18 -39 -26 -247
5375 -247 -5 49 13 159 -178 165 -42 269 48 35 27 170 104 -106 -84 1 -157 191 58 29 -72 140 6
5398 6 -171 -64 98 234 -219 -124 102 300 -87 94 -220 247 2 10 -89 -36 36 47 -24 96 72 33 100 141 180
5423 180 63 26 60 -244 111 -84 17 -56 -4 8 90 -143 -98 -81 113 -82 2 59 -91 213 -11 44 125 117 -67
5448 -67 113 66 158 94 56 17 40 -95 83 128 75 66 51 -53 87 105 -151 -13 129 105 -162 131 -138 43 99
5473 99 35 224 -277 -33 47 -76 41 -41 17 136 74 112 18 -37 -27 196 93 66 22 137 86 -160 11 -62 57
5498 57 105 78 151 30 71 -40 -75 -26 202 -89 -40 236 95 -46 98 -219 78 -18 170 -33 -63 -38 106 -110
5522 -110 86 112 -41 -19 -132 -109 85 -126 -47 90 -166 -118 115 -90 -154 118 21 247 45 -37 8 161 -101
5545 -101 -79 -228 -41 -72 140 85 112 42 -10 -172 -14 166 11 193 -42 14 15 29 27 94 -5 55 24 -146 -13
5570 -13 -7 18 9 -51 123 33 37 118 155 -11 44 112 -88 -33 -28 102 182 -155 178 95 39 -221 85 233 63 3 65
5597 65 111 -16 -38 -131 69 104 -16 -145 -2 -317 -253 155 213 -165 -158 -41 -186 -101 114 84 44 139 -54 214
5621 214 211 -40 77 62 39 25 -39 187 50 -87 118 -84 -146 -31 15 -47 -14 10 162 -167 -242 -293 -77 2 -270
5646 -270 -134 -80 -67 -137 -75 29 70 -91 -58 -44 -62 -31 103 12 -73 248 -86 -93 -59 63 -22 13 -24 -64 74 41
5672 41 -95 44 66 111 24 -6 38 -35 -86 -188 -132 -110 -7 -65 -61 81 245 157 -12 -80 120 6 -158 -272 -71
5697 -71 314 53 27 62 16 199 -128 -126 78 198 37 -202 73 107 -47 -50 -84 17 -4 86 -111 -49 -30 108 -110
5722 -110 -158 117 21 28 -119 -35 122 -49 183 79 141 -83 16 -56 -45 -29 -37 -60 -88 119 74 15 173 -30 13 205
5748 205 195 97 130 -95 187 -192 64 16 -61 210 -57 48 186 53 -114 -159 -237 17 -10 -147 -60 -150 -48
5771 -48 96 -8 -24 234 124 136 153 205 172 25 34 -164 82 18 28 93 51 107 -122 104 75 163 104 2 124
5796 124 -64 88 -131 39 -43 -136 -67 -78 0 -55 166 57 124 -18 -128 -10 -207 119 -46 -170 161 -58
5818 -58 -99 -90 160 -102 160 28 137 138 221 -60 -56 95 168 91 -131 -68 73 166 208 96 -105 -10 -208 -10 -17 52
5844 52 -126 130 3 -35 -169 -28 -59 -45 -54 107 -153 56 -65 -54 28 -40 -140 -146 80 168 -75 51 -68 -131
5868 -131 187 135 -70 74 -3 -1 -25 32 141 134 40 43 217 88 107 61 -105 -49 189 -106 310 27 -4 -243 -203
5893 -203 -214 -38 -100 -9 -80 -118 17 -2 -77 135 -95 14 268 31 83 -83 75 -78 -65 -154 -43 116 133 376
5917 376 -79 -96 128 91 69 -240 -183 126 101 44 -115 41 -55 -223 -43 -136 -14 -7 117 11 107 23 86 -132
5941 -132 -64 -97 -96 -122 230 -33 -29 142 -73 183 -36 -119 -221 -198 139 144 39 -160 -187 9 -58 -200 81 -59
5965 -59 -66 -49 199 -75 -146 -21 -17 99 23 -222 -196 -70 -165 156 40 -18 -275 -84 30 136 96 149 -117 18
5989 18 -166 33 -154 67 -26 67 215 -19 147 98 173 -226 -18 -2 103 -212 -43 -37 8 5 181 -110 9 -17
6013 -17 45 -75 313 -85 201 184 105 20 -40 -43 7 88 75 67 118 131 -111 -18 -134 -19 47 -53 -79 -26 204 -81
6039 -81 -1 -66 -38 -3 57 100 36 106 -72 204 110 60 92 106 189 -71 43 -168 -164 145 -39 -103 83 -110 -194 -183
6065 -183 63 -121 -101 -127 78 114 -28 -78 -65 -28 56 -45 36 -39 104 -131 -120 92 246 -35 -15 201 53 212
6089 212 -205 -45 -122 -15 136 144 -44 -46 183 121 -58 53 96 -48 -19 77 191 314 207 54 4 42 157 -68
6113 -68 -46 142 -71 58 78 -263 -96 110 -104 61 -141 -4 28 -112 115 -58 -43 132 131 -79 -64 10 15 -34
6137 -34 -68 123 -372 -54 14 34 -54 176 -160 14 59 38 -20 59 -83 -29 45 -15 -108 -97 180 -126 64 228 152
6162 152 8 -10 70 10 -42 57 83 15 -189 -11 -100 80 -182 -78 74 -64 115 118 215 -72 -7 -258 -112 89
6186 89 36 -38 -85 -153 -3 115 35 94 -77 -65 46 147 -11 -147 239 -171 152 23 -59 249 -153 4 251
6209 251 -116 180 64 -3 123 48 -49 -107 -76 67 91 -167 91 37 44 -50 -77 7 67 -99 -102 -111 108 -156 117 39
6235 39 -121 -50 -123 -99 59 79 -116 -134 -77 155 95 -61 26 21 -68 18 84 -119 127 -40 110 58 166 94 -5 225
6261 225 -58 94 -101 -47 -85 -144 58 -145 -100 -217 -42 -71 23 -26 45 7 -157 13 -92 69 -29 -131 105
6284 105 226 9 38 -107 57 -70 -23 -176 31 104 -8 92 -60 68 50 1 52 135 -189 66 -28 17 402
6307 402 -122 -354 167 23 -43 71 17 -155 40 101 80 119 -97 -85 33 -29 46 27 70 -28 -102 113 -26 -90
6331 -90 -164 74 -66 -118 89 -163 -116 -48 -37 113 15 46 -1 77 28 5 -101 -25 -28 11 -37 -56 27 113 -220 79 -81
6358 -81 239 32 89 14 41 86 -89 -73 -29 91 109 -105 -160 -60 -28 115 37 123 36 -42 93 -59 20 -64 31 -78
6384 -78 30 -17 -49 -176 85 127 -114 -21 106 55 -253 -27 -188 66 32 191 41 49 -60 65 -9 220 198 -113
6408 -113 23 42 -43 -119 104 30 70 37 119 143 -161 59 -102 -106 104 100 -132 6 257 -140 83 -193 74 -84
6432 -84 -26 -75 -180 110 227 -193 94 -111 164 157 23 143 -96 145 -18 -28 150 70 -230 80 -75 83
6454 83 -10 -65 43 -223 189 -163 -121 212 -94 56 4 25 -158 18 41 39 -74 -195 -32 -43 41 -97 -32 122
6478 122 -45 -69 -45 119 -56 -59 -90 254 67 -70 -128 -147 27 136 -20 -43 100 0 1 -25 118 -101 73 -58
6502 -58 -206 -152 34 138 -22 -59 -121 128 83 28 -23 1 -126 -29 -22 -28 -8 208 -77 97 -67 78 -113 -118 187
6527 187 21 -3 107 -67 3 41 -289 88 -58 100 -29 57 158 72 -148 13 -4 -51 -174 108 -32 116
6549 116 -87 -148 92 74 -9 -6 284 81 -37 166 63 -64 137 19 -51 -43 -146 -67 104 -113 12 -53 19 -92
6573 -92 221 49 92 56 226 -60 55 -51 6 120 -54 107 -13 -8 123 98 81 94 -171 131 99 16 183 100
6597 100 -179 -194 -37 110 89 74 -103 -57 -188 198 -6 38 -28 25 121 14 52 -31 -96 -40 7 -46 61 14 -228
6622 -228 90 -87 -219 145 136 249 72 -4 76 196 -142 68 89 -28 -254 219 -163 -54 -7 -1 -3 35 22 -126
6646 -126 112 -66 63 -18 196 -166 -49 -4 39 -23 22 128 -113 211 163 62 -14 -71 -63 77 -116 -74 110 22
6670 22 -140 115 115 79 50 141 -162 74 101 -42 -103 67 -210 233 -174 69 -62 -89 -135 16 -102 84 230
6693 230 17 -33 -95 50 1 -214 -4 -60 104 112 216 179 150 76 36 -24 39 -63 152 122 -87 58 66 95 -79
6718 -79 65 41 8 68 156 -111 -24 92 -241 -102 -98 243 -104 -20 -13 31 79 -170 -298 -42 188 2 -104 176
6742 176 94 -116 35 143 -129 -114 -103 -18 -13 -64 -97 214 -3 34 39 154 45 132 -122 -121 95 -33 102 -32 106
6767 106 -46 -85 100 20 163 123 -59 -86 -325 73 -95 -90 -53 -56 -49 -223 -75 42 57 17 -111 10 155 173 -88
6792 -88 121 -71 -208 -22 -96 207 15 -106 -39 -55 -6 -51 -50 82 -107 -13 132 -124 21 72 115 -90 13 -90
6816 -90 134 -43 89 -46 30 -3 -74 -95 -101 96 177 -39 -165 -126 -111 -115 -57 131 -46 121 137 -115 156 -99 -1
6841 -1 50 104 14 110 -41 24 0 -181 76 -149 118 112 51 -37 21 34 40 32 13 121 203 -275 237 73 187 -23 215
6868 215 -42 -175 184 195 38 89 -15 -150 33 -58 -162 -85 -69 45 -138 213 78 -114 209 29 -98 -43
6890 -43 -84 -67 85 30 69 40 -305 -246 130 91 -193 -175 -129 -46 13 202 70 -65 -101 265 -171 14 -53 -122 121
6915 121 49 6 -122 42 188 -15 124 145 -34 36 0 124 -4 -144 -34 199 49 -166 43 81 -97 54
6937 54 -95 -59 -34 15 71 22 18 -16 -114 -40 37 13 45 -79 -41 82 116 77 63 81 27 37 -187 156 2 115 -229
6964 -229 52 -110 -49 109 95 4 -21 -64 -55 86 -16 0 45 45 -9 59 85 153 -87 79 -121 5 -10 110 -5
6989 -5 17 64 -64 86 35 160 -66 -129 65 5 -4 24 199 35 -53 20 13 -74 -44 -26 18 -48 -5 -56 161 7 -29
7016 -29 9 -14 149 -106 -7 -202 99 6 -54 -82 67 65 38 -186 -79 10 50 -158 -38 8 -215 -70 72 3 -33
7041 -33 22 -36 -156 16 19 197 -21 65 80 -218 3 -5 -243 5 35 -172 128 -8 194 -15 110 -120 -85 -79
7065 -79 125 255 89 45 -23 -76 0 12 78 182 -123 -61 31 4 138 -188 -13 192 66 154 120 69 -12 116 72
7090 72 31 30 -65 -83 -50 97 -17 112 3 -51 45 12 77 -19 -118 4 15 5 -75 -183 64 -85 91 -137 73
7115 73 -117 97 -38 -306 -148 -51 -169 55 0 -59 50 -157 -54 -22 102 142 182 125 118 162 -101 37 -8 49
7139 49 -71 -92 69 -150 -98 128 53 -194 52 29 95 -52 -12 115 -54 100 -59 -67 -181 -14 12 -155 -30
7162 -30 -12 40 -168 -212 89 115 -3 262 -156 -82 -86 -118 -35 20 -11 -180 102 357 -231 146 -16 41 131 293 -204
7187 -204 71 -44 1 -197 -157 -39 -56 -243 106 -56 -114 57 -14 84 -149 36 -177 -61 -292 -28 -58 -49 -77
7210 -77 -137 -1 -252 -34 144 -38 -93 33 92 137 -26 190 -79 9 146 112 75 -148 -21 14 -162 -29 71
7233 71 -67 54 -67 138 3 24 -164 23 -56 184 134 124 68 -113 45 64 166 34 42 89 -2 82 -239 240
7257 240 -143 45 207 197 74 -69 -38 -30 75 237 -38 -19 -196 12 -110 11 151 46 95 -120 -80 -81 65
7280 65 -102 -48 15 10 121 -43 164 17 -235 39 35 35 120 -59 -4 -258 36 19 -180 3 170 -8 -21 -21 -101
7305 -101 42 -96 -44 34 -95 -115 239 -76 42 22 -31 -75 63 113 -36 110 74 142 81 -114 246 -1 59 22
7329 22 17 -68 -47 205 -2 -175 -68 -52 4 -99 251 77 100 162 -43 88 -20 -112 -17 33 76 76 -57 -172 -214
7354 -214 110 -36 -3 102 38 -92 236 -65 -5 -83 2 92 153 74 19 -88 136 -47 43 -38 -35 28 -66 -296 -134
7379 -134 -47 17 10 -48 9 -62 56 -154 55 141 161 144 -101 -123 65 135 64 -171 17 -85 10 -140 -52 -92 40
7404 40 -51 -108 -4 -55 -64 -112 -181 46 -207 39 80 97 99 -45 -142 58 114 -161 -188 140 192 -215 14 53 -11 -4 -33
7431 -33 24 114 71 -59 4 -127 85 -23 -8 114 217 -21 2 -93 -54 -19 24 -121 -9 76 23 204 25 -117
7455 -117 -190 -25 172 -163 -139 -76 -77 80 -70 -59 21 -63 -87 0 98 -30 -62 -65 -158 92 -37 -86 -17 77 40 26 -209
7482 -209 33 14 -59 135 -81 -158 -89 -61 91 -51 -37 94 171 6 -72 -12 -159 118 -99 -119 -74 11 170 24
7506 24 85 78 136 75 34 -242 103 103 -78 -104 -139 12 183 162 -5 -87 55 142 106 162 43 -135 -38 -17 -19 73 -44
7533 -44 206 -108 15 97 88 -55 120 266 -221 -52 213 273 70 -174 -52 -114 169 -237 40 247 -63 113
7555 113 93 10 -39 -261 -105 -55 -66 155 -1 -23 -136 -108 -27 69 28 102 14 26 -21 39 37 -52 170 16 50 -92
7581 -92 -52 172 -137 87 -58 32 -43 -75 -118 -133 -6 36 19 7 7 20 -50 -58 14 -143 168 -67 -55 -63 -74 -140 36
7608 36 70 -67 24 -79 -67 -194 -18 -33 70 223 206 141 78 -87 150 -136 -56 -180 137 154 105 70 -153 140
7632 140 -178 65 35 -106 -198 15 -190 -3 -42 -30 -4 -260 37 0 -32 9 123 -59 -59 -118 59 -118 31 -45
7656 -45 -176 15 -48 158 -140 -172 93 -22 208 63 34 -99 113 -56 17 25 -45 66 -104 98 -80 78 58
7679 58 -175 249 85 -54 -53 129 35 90 -9 -30 25 120 -55 -203 162 -132 78 85 23 -123 34 17 -169 106
7703 106 55 -10 236 -50 34 36 -60 -149 -19 -92 -85 -24 94 50 45 123 -79 -45 -64 -28 90 -145 -156 -138 5 -105 -186
7730 -186 -71 -19 -102 -226 111 -232 87 29 48 -67 229 -70 -54 -27 106 39 -95 -11 127 -36 35 63 -117
7753 -117 -67 -7 -17 7 120 -32 -126 -57 60 66 248 112 -152 -167 11 -55 145 -35 107 57 47 91 5 -25 187
7778 187 -55 -210 -15 -19 -39 -134 -157 88 70 137 -113 302 -75 59 -18 111 -49 54 109 89 -292 -3 7 -6
7802 -6 -238 -210 109 -283 -131 -107 -35 29 2 -142 121 97 5 156 -2 16 148 -12 -155 136 123 -152 -47 -29
7826 -29 -162 92 -130 -113 -78 47 -128 138 -207 -114 -26 30 -40 -117 101 -60 104 -148 27 164 16 -39 52
7849 52 -152 -127 147 -24 124 198 -26 -123 97 -157 -144 75 49 -58 -180 -32 -76 44 82 123 84 163 -95 23
7873 23 45 -103 -182 -27 -48 -48 23 -145 -100 81 -113 -11 -39 -67 32 -110 45 0 33 -87 -11 -51 138 -66 14
7898 14 -21 -50 -122 -66 56 24 -217 31 143 -226 12 -45 121 136 175 71 -4 -25 19 136 44 -59 -88 70 121
7923 121 -6 -83 155 90 51 -67 27 79 93 86 -188 75 -93 -42 139 90 35 126 122 138 -143 -33 -81 128 6
7948 6 2 -278 52 3 92 119 105 181 -35 -80 -54 97 -72 49 13 98 32 8 93 55 148 -23 -32 47 -71 -46 91
7975 91 40 -202 -64 159 160 -159 4 -199 -49 -11 -17 155 194 282 21 -8 245 -163 -171 -7 126 -168 88 -136
7999 -136 77 187 -174 101 88 -110 -202 -46 -34 -152 -24 141 -24 -102 100 38 122 -100 -275 -53 192 -194
8021 -194 18 -129 -117 -29 148 -15 131 -9 -178 -206 -76 5 53 -216 -30 -80 252 -44 -95 -29 87 169 -75
8044 -75 -210 -155 58 -64 -137 50 44 35 -22 118 64 97 125 24 27 15 -89 93 -14 -30 -54 106 -4 13 -68 53
8070 53 -101 19 -46 -70 29 -46 76 40 -11 89 179 138 160 23 -101 89 134 -67 -45 54 -35 74 -292 66 62
8095 62 15 -66 181 12 -115 -4 -19 -6 164 -58 -23 -48 14 -103 40 23 -148 126 88 -93 -144 176 -125 6
8119 6 -31 70 115 -13 -29 62 -7 -100 -174 -73 9 126 -54 -39 90 -74 -21 -4 90 -17 144 257 -112 -85 -16
8144 -16 1 -33 -193 -26 159 55 33 0 148 136 104 -66 23 151 158 81 -318 -67 -50 -1 -3 107 -17 86 -132
8169 -132 -95 249 -2 -97 -29 -64 -133 2 97 55 -107 3 -154 -5 20 -132 60 196 -19 81 -111 61
8191F1
##END NTUPLES=NMR FID
##END=
