##TITLE=1H_DE-80H_X3
 200.13MHz, d2o
 8 sc
 
 19ns.26.2.2025
##JCAMPDX= 6.0         $$ Bruker NMR JCAMP-DX V2.0
##DATA TYPE= NMR FID
##DATA CLASS= NTUPLES
##ORIGIN= UXNMR, Bruker Analytische Messtechnik GmbH
##OWNER= pz
$$ XWIN-NMR		Version 3.5
$$ Thu Mar 20 15:10:17 2025 Russian Standard Time (UT+4h)  Yarkov@DPX200
##.OBSERVE FREQUENCY= 200.1313
##.OBSERVE NUCLEUS= ^1H
##.DELAY= (6, 6)
##.ACQUISITION MODE= SIMULTANEOUS
##.ACQUISITION SCHEME= undefined
##.AVERAGES= 8
##.DIGITISER RES= 18
##SPECTROMETER/DATA SYSTEM= spect
##.PULSE SEQUENCE= zg30
##.SOLVENT NAME= CDCl3
##.SHIFT REFERENCE= (INTERNAL, CDCl3, 0, 14.3821)
##AUDIT TRAIL= $$ (NUMBER, WHEN, WHO, WHERE, WHAT)
$$ ##TITLE= Audit trail, XWIN-NMR		Version 3.5
$$ ##JCAMPDX= 5.01
$$ ##ORIGIN= Bruker BioSpin GmbH
$$ ##OWNER= Yarkov
$$ C:/Bruker/XWIN-NMR/data/yarkov2/nmr/H-C/1/audita.txt
$$ ##AUDIT TRAIL=  $$ (NUMBER, WHEN, WHO, WHERE, WHAT)
(   1,<2025-03-20 15:07:42.15 +0400>,<Yarkov>,<DPX200>,
      <created by zg, POWCHK disabled, PULCHK disabled
       configuration hash MD5:
       00 E9 B6 7A A2 85 ED C7 34 08 36 98 17 FE 4E 26
       data hash MD5: 16K
       E1 A3 C5 B7 BD A5 3E E2 72 B4 C6 36 AF 25 00 FE>)
$$ ##END=
$$ 
$$ hash MD5
$$ A7 68 AA E1 08 DF FF EA EA 39 A8 E5 E4 A3 CF B5
##$RELAX= 
##$RELAX= 
##$RELAX= 
##$RELAX= 
##$RELAX= 
##$RELAX= 
$$ Bruker specific parameters
$$ --------------------------
##$DU= <C:/Bruker/XWIN-NMR>
##$EXPNO= 1
##$NAME= <H-C>
##$PROCNO= 1
##$TYPE= <nmr>
##$USER= <yarkov2>
##$AMP= (0..31)
100 100 100 100 100 100 100 100 100 100 100 100 100 100 100 100 100 100 
100 100 100 100 100 100 100 100 100 100 100 100 100 100 
##$AQSEQ= 0
##$AQ_mod= 1
##$AUNM= <au_zg>
##$AUTOPOS= <>
##$BF1= 200.13
##$BF2= 200.13
##$BF3= 200.13
##$BF4= 200.13
##$BF5= 200.13
##$BF6= 200.13
##$BF7= 200.13
##$BF8= 200.13
##$BYTORDA= 1
##$CFDGTYP= 0
##$CFRGTYP= 5
##$CHEMSTR= <none>
##$CNST= (0..31)
1 1 145 1 1 1 1 1 1 1 1 1 1 1 1 1 1 1 1 1 1 1 1 1 1 1 1 1 1 1 1 1 
##$CPDPRG= <>
##$CPDPRG1= <>
##$CPDPRG2= <>
##$CPDPRG3= <>
##$CPDPRG4= <mlev>
##$CPDPRG5= <mlev>
##$CPDPRG6= <mlev>
##$CPDPRG7= <mlev>
##$CPDPRG8= <mlev>
##$CPDPRGB= <>
##$CPDPRGT= <>
##$D= (0..31)
0 0.7 0 0 0 0 0 0 0 0 0 0.03 0 0 0 0 0 0 0 0 0 0 0 0 0 0 0 0 0 0 0 0 
##$DATE= 1742468861
##$DBL= (0..7)
120 120 120 120 120 120 120 120 
##$DBP= (0..7)
150 150 150 150 150 150 150 150 
##$DBP07= 0
##$DBPNAM0= <>
##$DBPNAM1= <>
##$DBPNAM2= <>
##$DBPNAM3= <>
##$DBPNAM4= <>
##$DBPNAM5= <>
##$DBPNAM6= <>
##$DBPNAM7= <>
##$DBPOAL= (0..7)
0.5 0.5 0.5 0.5 0.5 0.5 0.5 0.5 
##$DBPOFFS= (0..7)
0 0 0 0 0 0 0 0 
##$DE= 6
##$DECBNUC= <off>
##$DECIM= 32
##$DECNUC= <off>
##$DECSTAT= 4
##$DIGMOD= 1
##$DIGTYP= 9
##$DL= (0..7)
0 120 120 120 120 120 120 120 
##$DP= (0..7)
150 150 150 150 150 150 150 150 
##$DP07= 0
##$DPNAME0= <>
##$DPNAME1= <>
##$DPNAME2= <>
##$DPNAME3= <>
##$DPNAME4= <>
##$DPNAME5= <>
##$DPNAME6= <>
##$DPNAME7= <>
##$DPOAL= (0..7)
0.5 0.5 0.5 0.5 0.5 0.5 0.5 0.5 
##$DPOFFS= (0..7)
0 0 0 0 0 0 0 0 
##$DQDMODE= 0
##$DR= 18
##$DS= 0
$$ [...]
##$SUBNAM0= <"">
##$SUBNAM1= <"">
##$SUBNAM2= <"">
##$SUBNAM3= <"">
##$SUBNAM4= <"">
##$SUBNAM5= <"">
##$SUBNAM6= <"">
##$SUBNAM7= <"">
##$SUBNAM8= <"">
##$SUBNAM9= <"">
##$SW= 18.0517328524113
##$SWIBOX= (0..15)
0 0 2 0 0 0 0 0 0 0 0 0 0 0 0 0 
##$SW_h= 3612.71676300578
##$TD= 16384
##$TD0= 1
##$TE= 0
##$TE2= 300
##$TE3= 300
##$TEG= 300
##$TL= (0..7)
0 120 120 120 120 120 120 120 
##$TP= (0..7)
150 150 150 150 150 150 150 150 
##$TP07= 0
##$TPNAME0= <>
##$TPNAME1= <>
##$TPNAME2= <>
##$TPNAME3= <>
##$TPNAME4= <>
##$TPNAME5= <>
##$TPNAME6= <>
##$TPNAME7= <>
##$TPOAL= (0..7)
0.5 0.5 0.5 0.5 0.5 0.5 0.5 0.5 
##$TPOFFS= (0..7)
0 0 0 0 0 0 0 0 
##$TUNHIN= 0
##$TUNHOUT= 0
##$TUNXOUT= 0
##$USERA1= <user>
##$USERA2= <user>
##$USERA3= <user>
##$USERA4= <user>
##$USERA5= <user>
##$V9= 5
##$VALIST= <valist>
##$VCLIST= <CCCCCCCCCCCCCCC>
##$VD= 0
##$VDLIST= <DDDDDDDDDDDDDDD>
##$VPLIST= <PPPPPPPPPPPPPPP>
##$VTLIST= <TTTTTTTTTTTTTTT>
##$WBST= 1024
##$WBSW= 4
##$XGAIN= (0..3)
0 0 0 0 
##$XL= 0
##$YL= 0
##$YMAX_a= 168719
##$YMIN_a= -194286
##$ZGOPTNS= <>
##$ZL1= 120
##$ZL2= 120
##$ZL3= 120
##$ZL4= 120
##$ABSF1= 10
##$ABSF2= 0
##$ABSG= 5
##$ABSL= 3
##$ALPHA= 0
##$AQORDER= 0
##$ASSFAC= 0
##$ASSFACI= 0
##$ASSFACX= 0
##$ASSWID= 0
##$AUNMP= <proc_1d>
##$AZFE= 0.1
##$AZFW= 0.1
##$BCFW= 1
##$BC_mod= 2
##$BYTORDP= 1
##$COROFFS= 0
##$CY= -3
##$DATMOD= 1
##$DC= 2
##$DFILT= <>
##$DTYPP= 0
##$F1P= 0
##$F2P= 0
##$FCOR= 0.5
##$FTSIZE= 0
##$FT_mod= 4
##$GAMMA= 1
##$GB= 0.15
##$INTBC= 1
##$INTSCL= 1
##$ISEN= 128
##$LB= 0.25
##$LEV0= 0
##$LPBIN= 0
##$MAXI= 10000
##$MC2= 0
##$MEAN= 0
##$ME_mod= 0
##$MI= 1.114404
##$NCOEF= 0
##$NC_proc= 0
##$NLEV= 6
##$NOISF1= 3.799351
##$NOISF2= 2.8
##$NSP= 1
##$NTH_PI= 0
##$NZP= 0
##$OFFSET= 14.38212
##$PC= 1
##$PHC0= -1184.143
##$PHC1= 10.39224
##$PH_mod= 1
##$PKNL= yes
##$PPARMOD= 0
##$PSCAL= 0
##$PSIGN= 0
##$REVERSE= no
##$SF= 200.129724274929
##$SI= 16384
##$SIGF1= 3
##$SIGF2= 2
##$SINO= 400
##$SIOLD= 16384
##$SREGLST= <1H.CDCl3>
##$SSB= 0
##$STSI= 0
##$STSR= 0
##$SW_p= 3205.1282051282
##$SYMM= 0
##$S_DEV= 0
##$TDeff= 0
##$TDoff= 0
##$TI= <>
##$TILT= no
##$TM1= 0
##$TM2= 0
##$TOPLEV= 0
##$USERP1= <user>
##$USERP2= <user>
##$USERP3= <user>
##$USERP4= <user>
##$USERP5= <user>
##$WDW= 1
##$XDIM= 8192
##$YMAX_p= 0
##$YMIN_p= 0
$$ End of Bruker specific parameters
$$ ---------------------------------
##NTUPLES= NMR FID
##VAR_NAME=  TIME,          FID/REAL,        FID/IMAG
##SYMBOL=    X,             R,               I
##VAR_TYPE=  INDEPENDENT,   DEPENDENT,       DEPENDENT
##VAR_FORM=  AFFN,          ASDF,            ASDF
##VAR_DIM=   8192,          8192,            8192
##UNITS=     SECONDS,       ARBITRARY UNITS, ARBITRARY UNITS
##FACTOR=    0.0002768,     1,               1
##FIRST=     0,             0,               0
##LAST=      2.2672688,     0,               0
##MIN=       0,             -194286,         0
##MAX=       2.2672688,     168719,          0
$$ Real data points
##PAGE= N=1
##DATA TABLE= (X++(R..R)), XYDATA
0@%%%%%%%%%%%%%%%%%%Mj2J6j6J6j6J8k6L2l2L6m4M8n2O0o8P8q6R6j09J19j32
40g0J48j64J80j96K16k40K64k92L21l52L86m25M73n24N78o42P19q05R07j033J187
61F36j380J636j983K478l243M547p140J4018o2083j41772K46482N9638j91587
74g9753R8365J50107j50217o0980J20236m1101p0008Q1991l2696j25822M4717
85f5161M9678q2990K3536J04932k9782l4628O4693J1924j9386L9764J454m4995
97A9039Q26k564l1297M299M225k7640K534J4316j6343Q105K5331j9994o546L3654
111G945j1138j4277N3173J1147n0990J9101M0255l7537j2800L8534k8338m8593
123c3518J5258j738l3130K1878K8864k7246l706L7605J850l461L7699Q656l3395
$$ plain form
0 0 0 0 0 0 0 0 0 0 0 0 0 0 0 0 0 0 0 0 4 -8 8 -8 8 -8 10 -16 16 -16 20 -24 24 -28 32 -36 42 -44 52 -57 62 -70
40 -70 78 -86 94 -102 114 -126 138 -154 167 -185 201 -224 249 -275 303 -339 380 -425 482 -551 636
61 636 -744 892 -1091 1387 -1856 2691 -4449 9569 -52514 -194286 52196 111834 -79753
74 -79753 18612 168719 18502 -42478 77758 36657 -33351 48640 15944 -109878 -65161
85 -65161 -15483 -98473 -74937 29995 213 -34415 30278 42202 22816 62580 64034 19039
97 19039 19865 17301 -13996 -9697 -5472 -33112 -30578 -16262 -32605 -24500 831 -19163 -25709 7945
111 7945 -3193 -17470 35703 46850 -4140 14961 55216 17679 4879 43413 15075 -33518
123 -33518 -18260 -19998 -53128 -31250 -2386 -29632 -33338 4267 6117 2656 40355 49011 15616
136A5616j609J1490j8402p222J1117j2551j9949K492M359m662M589J1455r90r441
150a3708R56J0032N739O092R526k243j0377M693J1269m308p852Q70j1523k0569
164b1403J781Q239q907N01J1543o944l131K2752J1955n966Q436O527j6190o133
178C060J0810m062j1400J916n592j5319M265J2870l128k777O056j937l700O781
192b157P839L408R53l606k350M066K091j651N39l981r848l864J56l377J207N258
208e317m502n249R217Q861K62N672N901n813l917M120o56l214K86n613r521L35
224i148L461j995K070L878n114l258P333M184l27M721L308n285k422M808K071
239H285j042L17m426p275j964R58j296n2J519j615k567J907O108N669K232r93
$$ plain form
136 15616 14007 25497 7095 -127 10990 -1561 -21510 -19018 -14659 -19321 -14732 -3277 -4267 -13708
150 -13708 -12752 -2720 3019 9111 18637 16394 6017 10710 21979 17671 9819 10689 -834 -21403
164 -21403 -19622 -11383 -20290 -19789 -8246 -15190 -18321 4431 16386 10420 18856 25383 9193 3060
178 3060 13870 9808 -1592 324 -5268 -20587 -16322 -3452 -6580 -9357 -3301 -5238 -8938 -2157
192 -2157 5682 9090 10043 6437 4087 8153 10244 8593 9132 5151 -4697 -8561 -8405 -11782 -10575 -5317
208 -5317 -9819 -15068 -5851 3010 3272 8944 14845 9032 5115 9235 8579 5365 5651 38 -9483 -9148
224 -9148 -5687 -7682 -5612 -1734 -6848 -10106 -2773 1411 1084 5805 9113 3828 1406 6214 8285
239 8285 7243 7560 3134 -4141 -6105 -5147 -6443 -6495 -4976 -6591 -9158 -7251 -1143 4526 6758 5765
255E765l05J254j210j186J468k21n248m869m74O55M10P90p31j433N63J260J913
272a599K706K537q39j278Q02J844J552R06j826k934k461j031j065L45j11k248
288d700k340O62K265J399L523L006n96j921J233K461M24q94o67k090l055j599
304b889O61J126j07j075k079k24K079J836K17O67J699p66j304J737L191m37j956
321B376l55j442j125L26K07j484j293j02q84L0K482K211n21p02P69O21O82J330
339C126K84j327j573n55n47M43P81m78j738o75P2J88R46J643n71j269P29Q65J0
358C54J169J725q00k451J10Q14m02k76M01j679j886R78O72k70J204J411j279j166
376a371J534J624l48k6n2r41j081M34L30M7o9o63j163J63J119Q02m04J11n07n8
$$ plain form
255 5765 5460 6714 5504 4318 5786 5565 317 -4552 -5026 -4371 -3961 -3171 -3902 -5335 -4772 -3512 -1599
272 -1599 1107 3644 2805 1527 2329 4173 5725 6631 4805 1871 -590 -1621 -2686 -2341 -2452 -4700
288 -4700 -7040 -6378 -4113 -2714 809 3815 3219 1298 2531 4992 5416 4522 3855 1765 -1290 -2889
304 -2889 -2228 -1102 -1209 -2284 -4363 -4587 -2508 -672 -455 212 1911 1145 -159 1578 4769 4332 2376
321 2376 2021 579 -546 -220 -13 -1497 -2790 -2892 -3776 -3746 -1264 947 426 -276 493 1114 1796 3126
339 3126 3410 2083 510 -45 -592 -149 632 154 -1584 -2259 -2187 -1999 -1053 590 19 -1250 -521 344 354
358 354 1523 3248 2448 -3 107 921 519 243 644 -1035 -2921 -1943 -1271 -1541 -337 1074 -205 -1371
376 -1371 163 1787 1439 1413 1361 420 -661 -227 103 150 81 -582 -1745 -1582 -463 339 -65 46 -461 -519
396e19K36R77N81k65m7r47k84M22L93nn66o72n52J1J67J132R5m21P3o6J7N71J641
419A972n09j073l12M06l49J36M60o29j067k28K42N1R12N18r24q23J240M37j94
438B66Q38M81j058n95K95q0J36N31p40j177j06P64l49J29Q69l74o24J85R31K12
458E34N16J25o27n71K03M03j99L3l33p98l01L01L97j24K82m21J09j99O04O81K03
479H18k49N1k4n41K03P97m58n46n24j42k44K06P67o68n50R8P27k88N61R67j74
500G87n41j45R16k54j71L95o61p45p4o7k90L41L24n59m27P28M75L25J82k25J45
521D59j44j87L39M66l99m97j23j4k28J20K05n77l81L25j44L48L67K97k38J18J3
542A25P6N19L10k91n32K6l99Q1p2q1k22n0m1p3K99N29m2j32J28R6j25K76R2J43
$$ plain form
396 -519 -283 694 1275 1010 963 16 -268 154 547 542 -24 -696 -1248 -1237 -1070 62 157 -264 -191 -257 -240 331 1972
419 1972 1463 390 78 484 135 271 731 102 -965 -1193 -951 -900 12 530 -394 -1217 23 460 266
438 266 1104 1585 527 -68 227 147 283 814 74 -1103 -1209 -445 -794 -665 204 -170 -794 -609 322 534
458 534 1050 1175 548 -23 180 583 384 417 84 -714 -1015 -714 -317 -441 -159 -580 -471 -670 -66 615 818
479 818 569 620 596 55 258 1055 597 51 -473 -615 -859 -653 114 -554 -1104 -1006 -279 -567 -6 961 787
500 787 246 101 1017 763 592 987 326 -419 -493 -560 -850 -509 -185 -744 -1171 -443 32 357 539 314 459
521 459 315 128 467 933 534 37 -86 -100 -328 -208 -3 -580 -961 -636 -780 -432 -65 232 -6 112 125
542 125 201 720 1030 739 207 233 -166 -85 -157 -238 -460 -510 -551 -624 -325 204 162 30 158 254 129 405 497 640
566F40k15m73r4L92m7l71o2k64k59K97J34K23J96k63J00J2K71J78K82K2l00m98
588i9K49J42l88J8j33m36m5M69n3J95L49j52l72K38M70m45J42K65k75j42l4L0
610gJ35k01o0l23L4K07n7L62j66q5M1O2n3L32N70m64l42K43j3j76M0L6l45j26
634c56Q8m8J48L50R7p38M58K57K4K5P7p5k52j86L20l73L65r6l72j91R3L25q7L92
658B45j81k05J86R1Q8j75J04l2j7k53Q2J50p6J5j91r5lJ65J88J8l4J3r1N8K94
683C44R6l29L29k31j21q2p2J79m24P2j50l8J32K70O2j40o9J25J87j15L53k18J17
706B77k70J38l80K75M0j92j90P6j6N1K3L57m18PL01k2K3N2J69J12l19n2L9k72
730a91M14j23m59M0K97rj07J65k71J30k04L18k8J48J66q7k09N0L2J03k10n1N7
$$ plain form
566 640 425 -48 -142 250 203 -168 -230 -494 -753 -456 -322 -99 97 -166 -66 -54 217 395 677 699 399 -99
588 -99 150 292 -96 -78 -211 -647 -692 -223 -276 -81 268 116 -256 -18 452 7 149 414 139 -3 -37 -7
610 -7 128 -73 -133 -456 -422 -215 -272 90 -76 -161 -120 -58 -111 221 791 327 -15 228 215 39 79 115 -230 -356
634 -356 -268 -316 -168 182 279 -459 -1 256 280 305 382 307 55 -131 189 -184 181 85 -287 -478 -385 -60 -147 245
658 245 64 -141 45 136 224 49 153 121 104 -149 -67 83 7 22 -169 -264 -267 -102 86 104 70 83 -8 50 344
683 344 440 111 440 209 88 6 -66 113 -311 -239 -389 -427 -295 -25 37 -103 -172 -47 140 25 378 160 277
706 277 7 145 -235 40 80 -112 -302 -226 -242 -191 -168 189 -229 -222 79 57 80 132 301 413 94 42 81 -191
730 -191 223 100 -359 -319 -22 -31 -138 27 -244 -114 -318 0 -28 120 286 199 -10 40 72 175 -35 -86 -29
753b9k67K75j57L5m8R2J20l88M02J78j87p8J48K8Lq6J80k80j11J28N3k72J75O8
777a8l33J89J05j42OL94j50K52l03J7j08K07q6M7q4k55J61rP2j06K24o9k0n3j98
802b60K42J06j07L7K2oO8J06J73k08J51m89K04j57J47O2m0k19O5J98J8J4r1J2
826D8MJ22l03K66j69m9q5J0j06J62j05J05P6j69L98k48lK13j25j38J19K36k56
849CJ15l4J32j61l7j23K41j66j46j7L00k20M2J27J20l47J46K53k58O3r5J35k62
872a89L5n8J24M5M3J35q5m8K63l55J65j50K11P7j21k95K73j10L3q9o4J17K7j14
896a30Oq0K17L9j13J30nJ36j70l5J03mj14j3N8k46L29j88R8j10m3J66L5k5o4j26
922a49J14J39j27K4o6J0J76j73O8QN0k3J43k76J26R3k03n4K85j93M4M6%j05j81
$$ plain form
753 -29 -296 -21 -178 -143 -191 -99 21 -367 35 213 26 -52 96 124 127 41 221 -59 -170 -42 11 -261 -86 -18
777 -18 -351 -162 -57 -199 -193 201 51 303 0 17 -91 116 30 77 -7 -262 -101 -110 -38 -144 80 11 -9 -62 -260
802 -260 -18 88 -19 18 40 34 102 208 381 173 324 -165 39 -118 29 91 51 -168 -103 95 113 127 36 48
826 48 52 174 -129 137 -32 -81 -166 -156 -262 -100 -205 -100 -24 -193 205 -43 -46 167 42 -96 23 259 3
849 3 118 84 216 55 18 -105 136 -30 -176 -193 107 -113 -71 56 176 -171 -25 228 -30 33 -62 73 -189
872 -189 -154 -212 -88 -43 0 135 50 2 265 -90 75 -75 136 213 92 -203 70 -40 -7 -96 -160 -43 -16 -130
896 -130 -124 -204 13 52 -61 69 64 200 30 -5 98 94 -20 -33 25 -221 108 -80 18 -92 -135 31 66 41 -23 -149
922 -149 -35 104 -23 1 -65 -55 121 -52 16 24 74 51 194 -82 44 137 -66 -120 165 -28 16 62 62 -43 -224
947b24M15k78J55q3j05M1rk5J18L6o6OPJ65j10j46J41R9k22J55ml6J80k20mJ6
973BJ30q3p9Q4j17L5R4N7l6l2k6P3r4k31M45l3j77o6J85k15J07J3J43j34J46j48
999D3J22k04p3R4o2k0l2J42n6JK07k6j64M9n5J1N2j17l3N3q5J52J6o1J49j45K9
1026a3j60J3J81M5J02J12k14j42P8l0j73K57j65K8n5Q5Q4m0J72j63k8J29j45K3
1050a9L0j09m5K1P2l1K3J28j63n7J90j25K65l35K14o4j47N3K85K2k68J40k10J51
1074B1j41J29j22J01K1J81k27J03K8k60P1j2P1r2J21j44K88j73Q1o6o2J80J0q5
1098B2j19J38p9N3mj95PK26K7j52j39L14Pj46n1P6K65j35k4r3o5J86j3j32J95
1123A69l18J83lk07N2J63q9j34J74o6J09j38K47j35Lm6K3P4R9r1l3p6J32j43P4
$$ plain form
947 -224 191 -87 68 -15 -120 -79 -88 -113 5 41 -25 -19 -12 153 43 -103 38 137 -85 70 66 30 210 -10 -14 2
973 2 132 49 -30 54 -63 -28 66 123 87 55 29 102 8 -223 222 189 12 -54 131 -84 23 36 179 45 191 43
999 43 165 -39 -112 -18 -80 -100 -132 10 -46 -45 162 136 -28 21 -34 -23 29 -88 -121 -68 -153 -1 15 -46 103 -42 -13
1026 -13 -173 -160 21 66 168 280 66 -76 2 -28 -201 56 -109 -81 -136 -51 33 -7 165 2 -26 103 -42 -19
1050 -19 11 -98 -143 -122 -50 -81 -58 70 -93 -150 40 -85 180 -155 59 -5 -152 -99 186 208 -60 80 -130 21
1074 21 -120 9 -113 -12 9 190 -37 66 94 -166 -95 -107 -36 -128 -7 -151 137 -36 45 -21 -83 97 107 22
1098 22 -97 41 -38 15 11 -184 -177 49 76 -76 -215 99 106 -40 -91 -15 250 115 91 -2 -67 119 106 -26 169
1123 169 -149 34 31 -176 -124 39 -50 -184 -10 -76 33 -105 142 7 10 -36 -13 61 160 69 36 -40 92 -51 23
1148B3J42j31j44J34m5j62K65j2j7J78l54q7M17j53j73K93l3j89J51q1o1J88j51
1171bP5k19J36J28r0j22J78j28J1lpK47k07M5k30M6J82Kj76K44k26K79j85o3J04
1196A9j50J9J27j82K28j83o9J27m4O4J08k59J37L8N7P9o0J33p2N4j92J08k22N5
1220h0J07j08Q7n6j8J63k19K60j43L5J79l09rK59j46n6J85j81K5R2p3j60J89j15
1244i2J68J10q8l20J18N8N6j90J51J07o0k6j07J61k57J59K03k83N4K05r9k2OJ3
1268B5k08K01o9J29j60l2J29o0j70O7l26L32O5qP7j88J24k0O1R0m7r7J39n6k2
1293b4j00k02K38K07k35N0P0J65k57kQ2o2LJ72J69l18n0M4J32J69k76K05J61j46
1317A95k68P7n6j36L92l05J3O2m6N8j72K84j63l2p7K31n2J4q0k09K95j38M3J82
$$ plain form
1148 23 165 34 -110 24 -21 -183 82 70 53 231 -123 -210 207 54 -119 174 141 -48 103 22 -39 149 -2
1171 -2 73 -146 -10 118 28 -94 84 -44 -33 -36 -43 204 -3 42 -188 -142 40 42 -134 110 -116 163 -22 -85 19
1196 19 -131 -112 15 -167 61 -122 -191 -64 -108 -44 64 -195 -58 -20 37 116 56 189 117 171 -21 87 -135 -80
1220 -80 27 -81 6 -50 -68 95 -124 136 -7 28 207 -102 -111 148 2 -54 131 -50 -25 67 -6 -166 23 -92
1244 -92 76 186 98 -222 -104 -46 10 -180 -29 78 18 -8 -115 46 -211 -52 151 -132 -78 127 28 6 12 25
1268 25 -183 18 -51 78 -82 -114 15 -45 -215 -148 -474 -142 -77 -85 -8 -196 -72 -92 -31 59 12 -85 54 -2 -24
1293 -24 -124 -326 -88 119 -116 -66 4 169 -88 -90 -8 -70 -67 105 274 -44 -94 -50 82 251 -25 180 341 195
1317 195 -73 4 -52 -188 204 -101 -88 -26 -72 -14 -186 98 -65 -97 -174 57 5 19 -61 -270 25 -113 -70 112
1341A12q6p8J46j54J5J26k73J76j82J48m9o9l0l1J00K24j48j36Q3J43J47m80J76
1364a20J98k00K28n0Kp6m7J84j35r6j85L31j0P0m10M05J13p1l14J5J57j11K37
1387A15j83P6l1J37k84K52J36k16K0RO2j45P8L3k16J79J36j88J33j68K61k58Q4
1410B2L5o9j38O5J05j73o8K06j82L7K91l21J82O7q1K76n9j86K4L7o3J11k21o5
1434a68K71Pj52K47l27K51l99K12j8J25K0nl0mj49L9J97j99n1J51J07j61k00K65
1458B9L4k15J47m6R9q3j29J11JK09p3j21J40r7j24Q7K85k96J98j60k3P5qj32M8
1483d4k5K64j09k56L03o2k01J2R6j10J3P7P4J33l01K05k32J85O5j25l5j35J14
1506i4M7J74k18J44n9L8O6m5q6R1M7l7p7K9l6n5%j7J00j14J80j27O9n0J76k69
$$ plain form
1341 112 26 -52 94 -60 -45 81 -192 -16 -198 -50 -99 -168 -198 -229 -129 95 -53 -189 -106 37 184 -296 -120
1364 -120 78 -122 106 56 58 -18 -65 119 -16 -112 -297 34 24 94 -316 89 202 131 -183 -168 -11 -122 115
1387 115 -68 8 -23 114 -170 82 218 2 22 31 93 -52 26 59 -157 22 158 -30 103 -65 196 -62 22
1410 22 57 -12 -150 -85 20 -153 -221 -15 -197 -160 131 -190 -8 59 -22 254 195 9 33 70 7 118 -103 -168
1434 -168 103 110 -42 205 -122 129 -270 -58 -76 49 69 64 34 30 -119 -80 117 -82 -133 18 125 -36 -236 29
1458 29 63 -152 -5 -51 48 -35 -164 -53 -52 157 84 -37 103 6 -118 -31 254 -42 156 -4 -27 48 40 -92 -44
1483 -44 -69 195 86 -170 133 71 -130 -118 -22 -132 -119 -42 32 165 -136 69 -163 22 87 -38 -73 -208 -94
1506 -94 -47 127 -91 53 -6 32 98 53 -33 58 105 68 -9 20 -16 -71 -71 -88 12 -102 78 -49 20 -30 146 -123
1532a23q8J84mJ5L1j04K89o5k62J62J37j56j42LQ5k19J27K87j74R4o9J4J78k45
1556d5jJ55q6k19K02o7J05n3r3o3J03j26M32j80o7j12K23p5k9J99j59l0l64L58
1580HN9j76J17M0P4r3j0r2K11N5j83j07L25l36K99l08k22K86M2j20K55k31M4L
1604f0M0p1%P7J17m1j77L12k90K43k73J0L40k88j7j43J89q7k0R1r6p1O5J48J15
1629A13j67NMPj40J17J04o0j7oL8J91j31j14J32K7k08K40q3K2n2k4p6K16m7k26
1655a35J30r9L3J10r5k8m7N0J74J3r2j38Q8J00p9J25l86P0N8L55k50K8J84o2k41
1680a34J29j23K04o0k47L52n2P4p9l43K74m5n4J13o3m9L8j38O9J57mL4k38n2L23
1705H6P0j1l73K55K45j73k21k2K12j86P5J02j36K27k7j55RJ12p5K8n4O2R3j45
$$ plain form
1532 -123 -211 -27 -31 -16 15 -89 200 135 -127 35 172 16 -126 -123 -38 -257 -130 157 -17 77 8 22 200 -45
1556 -45 -46 109 23 -196 6 -61 44 -9 -102 -165 -62 -188 244 64 -3 -115 108 33 4 203 44 14 -350 8
1580 8 67 -109 8 48 122 29 19 -73 138 193 10 -97 228 -108 191 -117 -339 -53 -11 -131 124 -107 -63 -60
1604 -60 -20 -91 -91 -14 103 62 -115 197 -93 150 -123 -113 227 -61 -78 -221 -32 -119 -139 -48 -144 -215 -150 -2 113
1629 113 -54 -49 -45 -38 -178 -61 43 -17 -34 -40 -2 189 58 -56 76 103 -105 135 52 74 22 -2 -78 138 91 -135
1655 -135 -5 -104 -71 39 -56 -84 -131 -81 93 106 14 -124 -36 64 -15 110 -276 -206 -148 207 -43 -15 169 107 -134
1680 -134 -5 -128 76 16 -231 121 69 143 64 -279 -5 -50 -104 9 -54 -103 -65 -203 -134 23 19 53 -185 -237 86
1705 86 156 145 -228 27 272 99 -122 -144 68 -118 -43 59 -77 150 123 -32 -23 89 14 42 -12 50 143 -2
1729bj44J42M4J10k04J22ko8m9NP2l0pL7q7n9J20R6j54L9J21j32K19q6j39j84
1755b20J77J95p4j69M6J7m6k7O4m6J12k29K22M2q4J19k36J49r8O5n9M9j20L09
1779A58j96L4n3K5R1j51J85j6k46L51k82l9O3r7L15k03mP2m7K4J50j35P2k34P
1804a56K91k2l18N29l11O6L2k54K58l1k53O1mK24Q8l07K19M4j80R7j22L5j31L4
1828a11J13J05k95J81K21j04p2J84k96kJ00K23m68J2K09p5n3J62J11k01K64k73
1850f5J84j67P2k1L05k09p8n7NJ88j11rL1j94K04N5r1j6r3J68j14%q0m3K56r4
1876B6r9R8K9l4j03n1P0K03l05K43j23n3K80l61M01j87j23k8n5L59n8j48j42L84
1900B23l08K49j50k39L28lJ1O6j61O9k75N8R1q5RK51j15L1j04n6j9Q3K18k19m0
$$ plain form
1729 -2 -146 -4 40 150 -54 68 66 -2 -51 -46 26 -4 -11 26 -61 -120 0 96 -58 -19 102 -30 189 103 -36 -220
1755 -220 -43 152 78 -91 -45 -28 -74 -101 -37 -83 29 -200 22 64 -20 99 -137 12 -86 -21 -80 -31 -151 158
1779 158 -38 -4 -57 -32 59 -92 93 77 -169 182 -100 -139 -76 -173 142 -61 -65 7 -40 -16 134 -1 71 -163 -156
1804 -156 135 113 -205 324 13 79 111 -143 115 84 -169 -108 -112 112 200 -107 112 156 -24 73 -49 -14 -145 -111
1828 -111 2 107 -188 -7 214 110 38 222 -74 -76 24 247 -221 -209 0 -75 -128 34 145 -56 208 -65
1850 -65 119 -48 24 3 308 99 21 -36 -31 157 46 37 68 -126 78 133 42 26 -67 101 -13 -13 -93 -136 120 26
1876 26 -73 25 54 20 -83 -134 -64 139 -166 77 -46 -99 181 -180 221 34 -89 -117 -172 187 129 -19 -161 223
1900 223 -85 164 14 -225 103 100 111 177 16 85 -190 -132 -41 -126 -117 134 19 50 -54 -110 -129 -46 172 -47 -87
1925h7K11j89k0J70k91K17j35J92k60J48P0J10J4j00m8J3r4R7N2j32J20q1K28
1948B05j16r8O7J35m67J63J33k7j74J77m5o3J39J34k47J19j47J27j8Q4j34M5K1
1971A3j80J98j15p1K05r8J28K0j97K21j42J47k30j20L40k01J17n4J7L0k01K68
1993I5o3j71M8J64j07J06j90J33M4rp2l6p4R1K61j85l0j49J33l08K80l8J64j04
2017a7J19o7j3K2K1j05p2j98M33m5L8O1l33M02l35J52j62J34J65j71k0l81L91
2040A9k7j35R9q5J24m6j9o8K62j61MK1j51J84j15l8n7M25l25J1o5R4j46L68j19
2065E4j87k3P2L24m0k54l5J51P0j44O1L2j9r9N1Q3R3j84k5J18Ql7j89j07J88n2
2091i0J03q3Q8k7J07R6n2k17J27o4Q8N1q2N1l06L20j24q4J56P1k57K67m4P2j38
$$ plain form
1925 -87 124 -65 -85 85 -206 11 -124 68 -192 -44 26 136 150 50 2 15 -79 18 70 -62 58 -23 205
1948 205 89 -9 58 193 -274 -111 22 -5 -179 -2 -47 -110 29 163 -84 35 -112 15 -3 81 -53 -8 13
1971 13 -167 31 -84 -155 50 -48 80 100 -97 124 -18 129 -101 -221 119 -82 35 -19 -2 28 -173 95
1993 95 32 -139 -91 73 -34 72 -118 15 59 50 -22 -58 -132 -41 220 35 5 -144 -11 -319 -39 -77 87 -17
2017 -17 102 35 22 44 65 -40 -112 -310 123 78 116 177 -156 246 -89 63 -99 35 200 29 9 -372 19
2040 19 -8 -143 -44 -129 -5 -51 -70 -138 124 -37 -33 -12 -163 21 -94 -132 -189 236 -89 -78 -143 -49 -195 173 54
2065 54 -133 -156 -84 240 200 -54 -89 62 132 -12 49 81 62 -37 14 97 190 6 -19 99 107 70 -119 -226 -38 -90
2091 -90 13 -70 18 -9 98 194 142 -75 52 -12 76 127 45 96 -210 110 -14 -98 58 129 -128 139 95 167 29
2116B9l9n7L39r9j64l7q3J62j0j1l48O00k97J10R5n3o5R1j83j07J72M5k1J4k2
2141F1q9Q0l1j15J94j19k9r4K37j8j78P1j19J28K30k43l1R6K2J0j19k48L87L9
2165A22Jj23j02J92j37o9K72k33J67q5K83l90J8J16j29p0L2K55n6J01j52n3p6
2188a16M0O5J68j33k71J87J11j73L16l93L25j70r4J74%m9Ok7m8J49m6kR5j76o2
2213a24J21Mlj60J60o2R9O4k15J61k26J88j06J85k14K7J91%p6j3j32J61r6O2P1
2238F7j82K10p8L3j91K68l3PL7j58j27O1M2N2j4J16K7k74J30o6J66pJ03k23J90
2263A56j55o6n7J58k6K3J3K2m4m5Q9j87J60PJ30j43j59l9L36J8M5m88K45R2j26
2288d1m8j9J75P5J5k78K84j68J59J45j86j77J66n1k43R5K31l8J15j53j72K35p2
$$ plain form
2116 29 -10 -67 272 173 9 -28 -111 51 41 30 -318 282 -15 95 190 137 72 163 -20 -127 45 90 69 83 61
2141 61 -28 52 21 -94 100 -19 -48 -142 95 77 -101 -30 -149 -21 209 -34 -65 31 53 63 -56 -304 83 122
2165 122 123 0 -102 90 -47 -116 156 -77 90 5 288 -102 -84 32 -97 -167 -135 120 64 165 13 -40 -116
2188 -116 -76 -11 157 24 -247 -60 51 -122 194 -199 126 -44 -138 36 36 -13 -7 -34 -82 67 21 19 114 -62 -124
2213 -124 -3 1 -2 -162 -2 -64 35 99 -116 45 -181 7 -99 86 -128 -101 90 90 14 1 -131 30 -66 -4 67
2238 67 -115 95 17 50 -141 127 94 101 138 -20 -147 -86 -44 8 -6 110 137 -137 -7 -73 93 86 189 -34 156
2263 156 1 -65 -122 36 10 33 46 68 24 -21 68 -119 41 48 178 35 -124 -163 173 191 236 -252 -7 85 -41
2288 -41 -89 -108 67 142 157 -121 163 -5 154 299 113 -64 102 51 -192 -97 134 96 211 58 -114 121 49
2311D9j03J47r8M7j04j44K44R1J28pl01R4o5k60K14j32J83l2l4l6O7l8J66J5k70
2336a79L25j76k5K2j5J77j47R4j23O4o6K1j22o7J27K8l3P3j23L3J94l51J16K76
2360A23j20K9OJ35J38j97J19k63M8Q0j11RJ81Ol72K56m7o1K5m4OQ7j11K05j83
2385e6M0l4j24K39r5K7q3K57k09J21l7n4J00k36R9N0J88j29J46k92K0J71m5J3
2409G7n6J0J19k03J18j00K0J43q9M4r1M3k73J83o7Q1J37j87J38r0J47J31j18n3
2433F4j47m5O0rJ13j7J36j82O6n4j1J29j07k5j65J77Q7J33j37j57J96j02j74J39
2457c2j43L69k24q4J48j43P1j75l8K15j06N9K61k93m6K77k77J09N8k59L65O8j12
2480F8k31O1l5O4KJ93j85N4j5J02J19q9M8K3k55J51j85n5J98j74J52j6J53l12
$$ plain form
2311 49 -54 93 -5 42 -62 -206 38 129 257 250 -51 43 -22 -282 -68 -200 -17 -49 -83 -119 -52 -90 76 91 -179
2336 -179 146 -30 -55 -33 -48 129 -18 76 -47 17 -49 -28 -150 -217 -90 -62 -95 -22 -145 -112 82 -269 -153 123
2360 123 3 32 38 173 311 114 233 -30 18 98 -13 -4 177 183 -189 67 20 -41 -16 -60 -54 33 -78 127 -56
2385 -56 -16 -50 -174 65 -30 -3 -86 171 -38 83 46 -8 92 -144 -45 5 193 64 210 -82 -62 109 64 77
2409 77 21 31 150 -53 65 -35 -15 128 39 83 -8 35 -238 -55 -122 -41 96 -91 47 -43 104 235 117 64
2433 64 -83 -128 -68 -77 36 19 155 -27 39 -15 -26 103 -4 -29 -194 -17 70 203 66 -91 105 3 -171 -32
2457 -32 -175 194 -30 -114 34 -109 -38 -213 -251 -36 -142 -83 178 -115 -161 116 -161 -52 6 -253 112 180 68
2480 68 -163 -102 -137 -73 -71 122 -63 -9 -24 78 197 108 156 179 -76 75 -110 -165 33 -141 11 -5 148 -164
2504a64L9J91o3N2j55rP5K9J87k70M5Q7j99K48k22P6K64m53J92K24l06J44J25
2527A37o5P6k30J60j50P8j5o0J00J5l0l9N5k9K56k83j81K95k50L14k29J4O5j28
2551a24R4J61N0o8j6o1r6j89L00k97K18J96rj10k28K91j55j60L77k19j34L07j73
2574d5k20M27l4m0m1j49J47J03k30Q7p4J00R5o8j97K53n1l21J85j0J26O2j07j68
2598a70L1J47q8R3Pk1P7J11k16m9J55K7L2j58m3k9O0J21N8p4R3l47K51j54J60
2623G4m4J95j77j42j07K07oj69Q2l5O5j22K11M0k3p6J37j82J83k19j4J32Q3O5
2647A58j44O3P7j24j30L16k40%r9M4K65l17P3J35j82o1j21J08K24j17J68R0j94
2670hJ21l1O9k96M20l56pM5O3J05k85O8J63k1R3N5k70O9q6J28l4Q8j03m4J07m7
$$ plain form
2504 -164 -125 66 3 55 -100 -109 -34 -5 182 -88 -43 44 -155 93 -129 -53 211 -242 -50 174 -132 12 137
2527 137 72 148 -82 78 -72 6 -9 -69 31 46 16 -23 32 3 259 -24 -205 90 -160 154 -75 -61 4 -124
2551 -124 -30 131 181 113 97 36 -60 -249 51 -246 -28 168 159 49 -179 112 -43 -203 174 -45 -179 128 -45
2574 -45 -265 162 128 88 47 -102 45 148 -82 5 -69 31 126 58 -139 114 63 -258 -73 -83 43 105 -2 -170
2598 -170 -139 8 -80 13 20 -1 76 187 -29 -78 77 104 136 -22 -65 -94 -34 87 145 71 164 -183 68 -86 74
2623 74 30 225 48 -94 -201 6 0 -169 -87 -122 -57 -179 32 72 49 -27 110 -72 111 -108 -122 10 93 158
2647 158 14 77 154 30 -100 216 -24 -24 -123 -79 186 -131 -58 77 -105 -166 -287 -179 45 -72 96 186 -8
2670 -8 113 82 151 -145 275 -81 -88 -43 20 125 -160 -92 71 50 143 198 -72 -3 -89 39 5 93 -10 -54 53 6
2696Fp9K16j48l6J26j19R9m3R5j65J32J07k25pJ07n9K38l2m74L12l28J47K13q6
2720cJ86k20j2Q3j03K1k8K15J4j99J2J10j39Q6K06k44K1j0N1p8J4l7J42q1j8K93
2746B82l77J95j2p9o3j2J62r6p9N5J09J50j56K22m78J40R1j3RK6J88l19O8J00
2770A13J17j47n4j34J60r2J30P5n6j02o7R1J8r5k07K45O3r0K78j69p2j36M54l77
2794e4l1m4J17q7K7j02K48j1j44M1L6Q3l63J96r1K39OOj96J15K51j22mP1q9k17
2820a19j98K74N1j42J19p9R3k9J49l23N00m32N1J2N6J17j11m4j9J05n1P3o4J1
2844@j00PPl9J84J47m09J87jO1l8R3k75K43m0m6qk3k6J0J95n8mk49K30nJ4n2q7
2873h2J0K8R1j18R9j12O6j81K32k95L77J6l39J48Ro5J46kj98K11r8J01J1J2j27
$$ plain form
2696 6 -73 143 -5 -41 85 -34 65 22 117 -48 84 191 -34 -41 66 7 245 213 -261 51 -277 -130 83 -3
2720 -3 183 -37 -49 34 -69 -48 -76 139 153 -46 -34 76 -63 23 229 -15 6 -4 47 -31 -17 -54 88 7 -11 282
2746 282 -95 100 88 9 -54 -66 96 0 -79 -24 85 235 79 301 -177 -37 54 41 50 76 264 -55 13 113
2770 113 230 83 29 -105 55 -37 93 168 112 10 -57 34 52 -43 -250 -5 58 -32 246 77 5 -131 323 -54
2794 -54 -85 -129 -12 -99 -72 -174 74 63 -81 -40 -4 79 -284 -88 -179 60 66 72 -124 -9 242 120 116 187 98 -119
2820 -119 -317 -43 8 -134 -15 -94 -1 -30 119 -204 296 -136 -85 -73 -17 100 -11 -55 -74 31 -20 53 -11 0
2844 0 -100 -93 -86 -125 59 206 -203 -16 -17 44 6 99 -176 67 27 -19 -27 -50 -76 -66 129 71 67 -182 48 43 57 5 -82
2873 -82 -72 -44 47 -71 28 -84 -18 -199 33 -262 115 131 -208 -60 -51 -116 30 28 -170 41 -57 44 55 67 -60
2898f0O1N1k7nj85J18j10j29L26O7L3j84j5M3j00J11j85K40l0r8mqJ83j20J05
2923G8r9o2j71K23K7k52L9K50j5J5r5RJ01J5kN5m1l5J28l04j6L31j63j32J46L0
2949F0q5R4k7k05J81J68j63J25j24j51J80k4j67L0R5Q6j30j07N9r6K01j57K18
2972F1J20l99L10k3j15j03L35k47L5k0k1K10l11J12J24j93K2O0l9J20K6k39K55
2995H0k62J72P2l04J99K3kq0p3O4n8J07mJ02j23J09K1j17O9m1J05j52K25k95J81
3020A8k81K52q0k3K25j5k32J25P8k19L16l97N00k59j25o5K56m9M1L2r5N4Q7k69
3044a25j73L53r9p4p0J77J00p3k83K13PQ8J51l3k96K66j47k42K87q8K29k24R8
3067D2k32N8R8K1j46N9R7O9Nl13K75P2N5k04p6k9J51jQ2m3Q1k19J87j27j22K33
$$ plain form
2898 -60 1 52 25 20 -165 -47 -157 -286 40 107 140 -44 -59 -16 -116 -5 -190 50 20 -78 -82 -90 93 -27 78
2923 78 -21 -83 -254 -31 -4 -256 -217 33 18 33 -62 -53 48 63 61 116 75 40 168 -136 -152 179 16 -116 30 60
2949 60 -25 69 42 -163 18 186 23 148 24 -127 53 29 -138 -108 -13 73 -57 -164 -105 -201 0 -157 61
2972 61 181 -218 92 69 -46 -149 186 -61 -26 -46 -67 143 -168 -56 68 -125 -103 -43 -82 38 64 -175 80
2995 80 -182 -10 62 -242 -43 -20 -22 -102 -175 -111 -169 -62 -66 36 -87 22 43 -74 -5 -46 59 -93 132 -163 18
3020 18 -263 -11 -91 -114 111 96 -136 -11 67 -152 164 -233 267 8 -117 -182 74 25 66 98 3 57 144 -125
3044 -125 -298 55 -44 -118 -188 -11 89 16 -267 -54 -47 41 192 159 -137 129 -18 -260 27 -61 168 -56 42
3067 42 -190 -132 -34 -13 -159 -100 -3 66 71 -242 33 105 160 -44 -120 -149 2 1 83 40 121 -98 89 -38 -160 73
3093G3j34K43j26R7j90J94j88J3K45j75j29J54k5o8J5k3l3K7J37j44K45k92J20
3116C6k11K78j34k3L2j3K45k42o5J23j52O4J5K20l18K5J75l52J62P6K45l07K89
3139A68j99o0rK34j31J83j02j18PL7rj04J3p7j05K11J6j82q3J91Q9L9k08K74o8
3164Gp6j33K40J23k82J90r1L07n25K30RJ64j5M6l2l60L72k36L3k2M0J16j36J71
3188A40Mj80o5L59l71J84K15k44j03J49j98K03k57K67l34P9L37k44J26j82K37
3209A22j68L0O5p6j1n1L2k5K86k04J09j69l6Q4J40j16l0qJ17m6Nj13j45J37K23
3234A52m1j50J87k79K0K20j0J03k93J23N2j91J65jk61P7L15k86j0J70M8p4M4k04
3258a24J65J1l0J64k29k4J18n2o0Q5k74K96J88k00p3j21Q3m7O6J76j15J38j2k87
$$ plain form
3093 73 -61 182 56 153 -37 157 -31 -18 227 52 -77 77 52 -16 -1 -24 -57 -30 107 -37 208 -84 36
3116 36 -175 103 -31 -54 -22 -35 210 -32 -97 26 -126 -62 -47 173 -145 -120 55 -297 -135 -59 186 -121 168
3139 168 -31 -91 -100 134 3 186 84 -34 -27 10 1 -103 -90 -167 -272 -61 -45 -227 -310 -119 -30 9 -199 75 7
3164 7 -69 -202 38 161 -121 69 -22 285 -240 -10 -1 163 148 194 162 -198 174 -62 -29 -51 -11 105 -31 140
3188 140 144 -36 -101 258 -113 71 286 42 -61 88 -110 93 -164 103 -231 -152 185 -59 67 -115 122
3209 122 -46 -16 49 -27 -38 -89 -57 -82 204 0 109 -60 -96 -12 128 12 -18 -26 91 45 50 -63 -208 -71 152
3234 152 111 -39 148 -131 -111 109 99 202 -91 32 84 -107 58 57 -204 -127 188 -98 -108 62 110 36 80 -124
3258 -124 41 52 22 186 -43 -67 51 -1 -61 24 -250 46 234 34 -39 -160 -77 -124 -58 118 3 141 129 -158
3282a58m4R9J12K4O0j81K33j08q8K17k5j38r0J73j57J17j14K7o9K13j47j16O4
3305i6j3pK06k3j60J85oo5r7R5J4j93J86K01j49j93J78l57K30K59k4j41O9l0m4
3330B5J0j06K75k49J65l17L52k3l2j79P7J77k11l3j7J41Ll25M09k31J87o4j84
3353a50L25j36j22O5j33j07K68K5K00k93J65r3q0J79k20P7J09j14K51k31L2o2
3375d5p4J95j70J46K2l10J97j10n9M23k52N3j50K72j55r9ml0J77J80m31J76J98
3398A50k28o2J65M8j00k22J62o1N1M0K58p2j6l5r1j01J0J72o4m1Q0K40k29J39
3422A93k62K4n0K47j77K25j88mj8n2R6j00Q1J80k57L2p9Q7J22N1j72R5R6k69L5
3447f4R0MlJ40k31No8K09j30M4J13m1j7l0J05j42J40k49K21j30J31O6j04k65K15
$$ plain form
3282 -158 -202 -103 9 33 93 -88 145 37 -51 166 141 3 -87 86 -71 46 -68 -41 -110 103 -44 -160 -96
3305 -96 -109 -116 90 67 -93 92 86 21 -76 19 33 -160 26 227 78 -115 63 -294 -64 195 171 30 99 69 25
3330 25 35 -71 204 -45 120 -197 155 132 100 -79 -2 175 -36 -69 -86 55 58 -267 142 -89 98 34 -150
3353 -150 175 39 -83 -18 -151 -258 10 35 235 -58 107 14 -66 113 -107 -30 79 -35 216 -15 17 -45
3375 -45 -119 76 -94 52 74 -236 -39 -149 -208 215 -37 16 -134 138 -17 -116 -120 -150 27 207 -224 -48 150
3398 150 -78 -140 25 73 -27 -249 -87 -148 -97 -57 201 129 113 78 -13 -114 -104 68 4 -37 43 283 54 193
3422 193 -69 -45 -95 152 -25 200 12 8 -10 -62 34 -66 15 195 -62 -30 -109 -22 100 151 -21 74 170 -99 -64
3447 -64 26 30 27 167 -64 -59 -127 82 -48 -4 109 68 51 21 126 -16 124 -125 96 -34 97 163 59 -206 9
3472IJ69k26rm7J41j80L51k23J8jK81n15J66K4q3K06n9J20j14l6K7J4j01Q1L9
3497E2q5l0J42k03J33j05K2j5Q1k46L33jj03J64p7Qq0j68J68J8k9J32k63l2J90
3522FJ79K4j44p6j15K15L5q0mj14J19o9k36R8K20l5J17j07j18j26K10j5J16k15
3546a15KJ76l60K08Q6R7Qj27J0m8L0J29l5J19k27J18r4J9J88J65l65L0P7j01N5
3571D5rR5k14L84l91n5k6J19n7j0O4J94l16J28R9j65K4K15m0P1j37k81K49P8j76
3596a12n2J71M8r9K2M3mK7j4Olqo5J86J41j57k60L65M2j56k58K45o6j28lJ59j50
3623h0P8k2q6%j48K94o1J96m49L88j67q2LJ94n8J1m4R2j90Q0q6k0N5K7J73j48
3649e0R7j54j01J82M1j21M1J41j33Q6R9j33j04J33j13R8R5k82K30j25K42j06j5
$$ plain form
3472 9 178 -48 -57 -104 37 -143 208 -15 3 2 283 -232 -66 -42 -125 81 22 142 28 -8 19 33 -68 13 52
3497 52 -33 -63 79 -124 9 -96 -74 -89 -8 -254 79 78 -25 139 62 70 -10 -178 -10 8 -21 111 -152 -184 6
3522 6 185 209 65 -11 -126 89 124 44 40 -74 45 -24 -260 -162 58 23 140 33 -85 -211 -1 -16 100 -115
3546 -115 -113 63 -297 -89 -3 94 102 -25 -15 -63 -33 96 61 180 -47 71 -23 -4 184 349 -16 14 91 -10 45
3571 45 36 131 -83 301 -90 -145 -171 -52 -109 -119 -55 139 -177 -49 50 -115 -91 124 84 155 18 -263 -14 64 -112
3596 -112 -164 7 55 -44 -22 21 17 44 30 36 33 25 -40 146 287 130 -130 235 277 121 -137 108 42 -86 -89 70 -80
3623 -80 -2 -24 -110 -110 -258 36 -25 171 -278 110 -57 -139 -136 58 0 11 -33 59 -131 -51 -137 -157 -102 -75 98 -50
3649 -50 47 -107 -208 -26 15 -106 -65 76 -57 29 128 -5 -109 24 -89 9 104 -178 52 -73 169 63 48
3672D8j65K41P5j02q3q2J82k65J93J47n37M00J5k5q1M22l08j02q3m1L27k56J1
3695f9O3J17k81J01J74q6j9r6P1J51k16J67j88J15ko9L0K7j59K00j8K5q8P0r3
3720g3J39m5L7j04K1j16J66J95k62J17J4j41r3k1J99j21QK04L7j35j14J24l4j16
3744a14o8L30j49K14j47K2k72J44j12o0q5J36J55J30k30J41N6k60L10k7j52r4
3766a32R2J45N0j85J12j74p4Q3K08j89O0nj9P9j73K59k16J63k89L04k4J0J40l79
3790a54J0l8J31k8Q3J03m6j27O8P5m0j7K61k44k20J41K00kN6k70K7J33k4j67K0
3815f9j49O8J28N4q3Q3j61J19R5j84R8o7JN1j17K22J02l23p8L20k20K29n1R2k74
3840a14M2J29k37J17L3P3l1J37r3O3p6J8r9Q9m2j6r8P4J8K1%j36k0J20l36J77
$$ plain form
3672 48 -117 124 199 97 14 -68 114 -151 42 189 -348 52 67 42 -39 383 75 -27 -110 -151 176 -80 -69
3695 -69 -6 111 -170 -69 105 19 0 -96 -25 126 -90 77 -111 4 2 -67 -37 -10 -169 31 13 38 -50 20 -73
3720 -73 66 21 58 -46 -25 -141 25 220 -42 75 89 -52 -145 -166 33 -88 -80 124 161 26 -88 36 2 -114
3744 -114 -182 148 -1 213 66 88 -184 -40 -152 -212 -297 -161 -6 124 -106 35 91 -169 141 114 -38 -132
3766 -132 -40 105 155 -30 82 -92 -166 -83 125 -64 -4 -9 -28 51 -122 137 -79 84 -205 99 75 85 225 -154
3790 -154 -144 -182 -51 -79 4 107 61 -66 2 77 37 20 281 37 -183 -42 158 156 212 -58 -31 102 78 -89 -69
3815 -69 -218 -150 -22 32 -51 32 -129 -10 85 -99 -1 -68 -67 -16 -133 89 191 -132 -210 110 -110 119 68 160 -114
3840 -114 -72 57 -180 -63 -30 43 12 149 56 119 43 61 -38 51 9 -7 -105 -31 -13 8 8 -128 -148 -28 -364 -187
3866a87J23J64o0k54J95l0j07L68j28q8N2j68K66j64J38m3lr2j26K17M2k3k5n4
3890A3nj10Q7L2J89k36J93k05J62J40n0j65pNJ53l38J54L73l55k64K79p0r9P6
3914d8kl3K31j96K05k43K28q7k98K71p5J56J1j5j37J2Qkq8M17m38K82j14j2n8
3939b5n0j27K35j22L5M1k43L10j15J91j57ln8R6K9j74P0j49L06k6p8Q7o0Lk4%
3965hK1K1Q6p5j0k7J98l28J83m3M4k48K32k54K69j71J60j9L6J1j24j7K8J81p0
3990G6J37j47o0J36k62Q2k63L36j20N5J07j05L3j32P8JOk93L04L8q1j20O7L28
4014B01j90J21j1j4r7K50j32j99J32k90J09K00q6J57l18J78j42K14Ql32L28j36
4036d9J8j21K23q2l2J97l0j27K8P0k09K20K8k78L38k41k0L2O2J1l6j25K31k76
$$ plain form
3866 -187 -64 100 40 -214 -19 -49 -156 212 84 -4 48 -120 146 -18 120 77 74 -18 -144 73 115 92 67 13
3890 13 8 -102 -15 17 206 -30 163 -42 120 260 210 45 38 43 196 -142 12 385 30 -234 45 -25 -124 -48
3914 -48 -50 -83 148 -48 157 -86 142 55 -243 28 -47 109 120 105 -32 -20 -12 -14 -102 315 -123 159 45 33 -25
3939 -25 -75 -202 33 -89 -54 -13 -256 54 -61 130 -27 -30 -88 8 37 -137 -67 -216 90 64 -14 73 13 16 -8 -8
3965 -8 13 34 120 45 35 8 206 -122 61 18 62 -186 46 -208 61 -110 50 31 67 78 -46 -63 -35 146 76
3990 76 213 66 6 142 -120 -38 -301 35 -85 -30 77 -28 5 -127 -49 -48 -42 -335 -31 7 -74 -194 -127 201
4014 201 11 132 121 107 10 260 128 -71 61 -229 -120 80 -6 151 -167 11 -131 83 91 -241 87 -49
4036 -49 -31 -152 71 -11 -43 154 124 -3 25 95 -114 106 134 -144 194 -47 -67 -35 27 38 2 -123 108 -168
4060a68j00K32J53j93J9J5l1O0K25k68K34k12K15k36R4q3R4j29L43l34o6J57J73
4083A94q7l1j3n6N0N7k02j51L47j42m9K20j79J57j50K7R3k18k62N80n0k08q8J41
4107b0N7o6o9k4K2j48K06J13q7N7k07J42K5j77J96L3q2QP8j60R6p8K45j20kk7
4133A1M3j21m5M9j1J82j76m2m3L06l08K53k10p8J71K1L17l43n7J21j1k24K03l8
4157c0J94l29J3j4K57M6j05r2l9N7mj09J71P0n5M6j94J29R4j31K25j04J18l89
4181a75L64o9K4j09q4J31m3J29j05p6oM1l99M73k53J31P4j3K6q3o9O6J95k77q0
4206a87K11j3L8j32K77l36oK5K84m7m1r9J05j03J98k04k16J50L8J55j93Q4K5J06
4230A19k06LR1p1m3J66m6r0M7P3j74J95o2L2Q4j02R1m7r3K61l04P2M3j68J95J12
$$ plain form
4060 -168 -268 -36 117 -76 -57 -42 -73 -13 212 -56 178 -34 181 -55 39 -44 50 -79 264 -70 -136 21 194
4083 194 107 76 63 7 57 114 -88 -239 108 -34 -83 137 -42 115 -35 -8 85 -133 -395 185 135 -73 -161 -20
4107 -20 37 -29 -98 -122 -100 -248 -42 71 -16 41 -166 -24 1 -176 20 53 -29 -21 57 -103 -7 -85 160 40 38 11
4133 11 54 -67 -112 -63 -74 108 -68 -110 -153 153 -155 98 -112 -190 -19 2 319 -24 -81 40 29 -195 8 -30
4157 -30 164 -165 -152 -166 91 137 32 -60 -99 -42 -46 -155 16 86 31 77 -117 12 106 -25 200 96 214 -175
4181 -175 189 120 144 35 -49 82 39 168 63 -13 -19 22 -377 96 -157 -26 48 35 61 -22 -91 -25 170 -107 -187
4206 -187 24 11 49 -83 194 -142 -148 -123 161 114 73 -26 79 -24 174 -30 -246 -96 -58 97 -96 -12 13 119
4230 119 -87 -84 7 -64 -107 59 13 -77 -30 43 -131 64 2 34 118 16 107 60 -33 228 -76 -4 39 -129 66 178
4256A78k39J32j00J24j25k7Q9K35k12j75J25J64k29k96M94j1l09L8k7J90j78L40
4278A81j31n1j98M19k33R6p7M4M6j80J85qj66m1or7K63k43K67k9lj30k3n6k9J66
4304c4j85K55j08J0Q3K9k06O2R8J13j16pJ1k6R5k14J70N3L4j56j00K73o5J6kP
4330I0J16j56n7pj10K13r5J1K16m56K05K0k7j5q2O0l7J05N1J10Ol00p4L07m9J28
4356A73l0p2J55j24k35K39j5q2J56K2k49K62j78Q0k90L32j84r4K17j22o3K51n0
4379I9Rj58L0j91K27k8P1j49N2l0J23%k25L09l17K00m9J92j66n2J29J24k94o9
4403a63L27n0j56K93l54K30j11pm0K17l67L04k09K79j68j3k5L3j26J81N4k81L44
4426A92k52J44n0r5K3Pj06M4J55j17M7j03J46j04J71j07j41K7K42o2j77K37j64
$$ plain form
4256 178 -61 71 -29 95 -30 -57 32 267 55 -120 5 169 -60 -356 138 127 -182 -144 -171 19 -159 181
4278 181 50 -1 -199 220 -13 83 6 50 96 -84 101 93 -73 -114 -120 -217 46 -197 70 41 38 -92 -115 -171 -200 -34
4304 -34 -219 36 -72 -62 21 50 -156 -94 4 117 1 -6 5 -21 74 -140 30 83 117 -39 -139 134 69 85 83 90
4330 90 206 50 -7 -14 -124 89 -6 5 221 -235 -30 -10 -37 -52 -134 -74 -111 -6 45 155 161 -139 -213 94 45 173
4356 173 143 71 226 102 -133 106 91 9 165 187 -62 200 22 102 -188 144 -40 -134 83 -39 -102 149 99
4379 99 108 -50 -20 -211 16 -12 59 -90 -38 -68 55 55 -170 139 -178 22 -27 165 -1 -53 76 200 -94 -163
4403 -163 164 114 -42 251 -103 127 16 9 -31 186 -181 123 -86 193 25 12 -13 20 -106 75 129 -152 192
4426 192 -60 84 34 -61 -38 -31 -137 -93 62 -55 -8 -111 35 -69 102 -5 -146 -119 123 61 -116 121 -43
4449d3Q6j15J46Q6k13J80j50nJ01J8P4k10J2L6j56P6L14k60M7L43l11Nj95L30
4473A96m01L93k74J6J1j07K89n7j32J29o6m7L1j7J56k05K42n7j55jj49L01p9J56
4497A73j37j67m7K64K51k06j9j82j81L59k01O4L3O1j68J26l5j69ojK48J5k2Q1
4521A34k13l6O9m9m0J75p1J8Q1J4m4N7J31r3k30J77lj64J02J3K13j82J24j87M6
4546D2oK54l72K0P4j77L30j71Pj9M7j40L06k03O2Q3j71n2K08k85J42olk5j7jK1
4573e2j9J33j4m0K43k49J38k12K41p8j35J73n4r0J60k21J08j9k10J74n3R3j9J98
4597A96l65K43k76M11o1m10N14k44J13k96J82P7k54K81j61Q3K50j79k7o2j00K5
4619f0J30j51K24j61R3j16J2k7j2J73Q1k51P4j2lJ29j7k71L21J37k26m1Q5j96
$$ plain form
4449 -43 43 -72 74 160 -53 127 -23 -28 73 91 165 -45 -33 3 -153 -77 237 -23 24 367 56 61 -134 196
4473 196 -205 188 -86 -70 -59 -166 123 66 -66 63 -3 -50 -19 -36 120 -85 157 100 -55 -56 -205 96 17 173
4497 173 36 -131 -178 86 337 131 112 -70 -251 108 -93 -29 4 65 -103 23 -12 -181 -187 -188 60 75 53 134
4521 134 -79 -115 -46 -95 -135 40 -31 -13 68 82 38 95 226 133 -97 80 77 -87 15 28 241 59 183 -4 42
4546 42 36 290 -82 -62 12 -165 165 -6 1 -18 29 -111 195 -8 54 137 -34 -86 122 -163 -21 -27 -30 -55 -72 -73 -52
4573 -52 -71 62 48 8 251 2 140 -72 169 91 -44 129 75 -15 145 -76 32 13 -197 -23 -76 17 -2 196
4597 196 -169 74 -202 209 148 -262 252 8 121 -175 7 84 -170 111 -50 33 283 104 77 15 -85 -60
4619 -60 70 -81 143 -18 75 -41 -29 -56 -68 105 186 -65 9 -3 -6 123 106 -165 156 293 67 26 111 -85
4643h5M0l0l7K40k27RQ2j62J86o2K34k19K40Q9k16j84k9K32r9n3J4k2J72o2k10
4668a59M31j51P5j73Jq1j16K10p5rkK9J69j14p8J98k06M3M8k25K91K5k75K9K75
4693A60l63K65q9J36J4j24J04n0k9l1m7k2J89k21L02k03J03j41k1K69l12K90j36
4716D3R7j89P8q9Q4K4o6j02P2J50k5j34J60K8j41pR4j76O3L73l52p3K14J06j43
4741H9q6m7K60j60jj79J06J21j25j75L05j41K10j22j56O4j24L04j00K06l40L00
4763B09k18j01k6P9P2LJ06n0j5n7J3j2J51j85J50k26J64j26O1m6O7m5k3pJ38J0
4789H6k8j09N8J29j30l2n2j44R0J97q2j5K1O4J8j39J2O6j59n9L55k70J84R4j03
4814E2j59J24K9p0J04j01J52j02O7j05orj72L19k34M0mk3K18k20K78j73O0l8N4
$$ plain form
4643 -85 -45 -75 -112 128 -99 -90 -8 -170 16 -46 188 -31 209 298 82 -102 -131 101 2 -51 -37 -59 113 51 -159
4668 -159 272 121 196 23 24 -57 -173 37 -38 -47 -49 -20 149 35 -43 155 -51 -8 40 -185 106 131 -144 -115 160
4693 160 -203 62 -27 109 123 -1 103 53 24 -7 -54 -76 113 -108 194 -9 94 -47 -68 201 -111 179 43
4716 43 140 -49 29 -60 24 48 -18 -120 -48 102 77 -57 103 131 -10 -17 77 -99 -36 337 -15 -88 126 232 89
4741 89 3 -44 216 56 55 -124 -18 103 -22 -197 108 -33 177 55 -101 -37 -161 143 43 249 -91 209
4763 209 -9 -110 -136 -57 15 18 124 74 59 2 15 3 154 -31 119 -107 57 -69 -8 -54 13 -32 -55 -62 76 86
4789 86 58 -51 7 136 6 -26 -78 -222 -132 65 -17 -32 -11 53 71 -68 -56 10 -149 -208 147 -123 61 155 52
4814 52 -107 17 46 -24 80 -21 131 29 96 -9 -15 -24 -196 123 -111 -71 -75 -98 120 -100 178 5 65 27 81
4839H1j28K5J9j30J50k9M2k0J45L4k65K5m6K29k67R9J21j87N9j06M13m46N13n22
4863a91L47m9j31k1K04Jj70pJ00jm9p4j9J48K0k25J00j0K31j54o5j0K89m37OK30
4889F3j30J23J86q8k43K13j65J49k76K88j46N0M3k64K11k21J08K3P8M5J2R7j17
4912C9J47q0p1r1J09O1k89L6L09m5l95K90m9Op1Q1J27j68M4j36O6Q3p3J52j76
4937i4J99j59nJ33m1j50Q7k76K91Rj17L13k21J94k4j53L1j1mJ11L2j59K47n94
4961c61N09o7j27L36l76q8L14P0m6j26k11L42j31m7Q3q9L4o8n7mJ02k9o9L95l08
4986a9J30k00J66Q8l86O8L99l46J59j13r1O8Q9k73K69K20l91R4J99p0K2l7j68
5009a23J36j02K19j43J99l81J17o0J15N4j04q3J43K87k32K0J18j41P5j6r2L2j26
$$ plain form
4839 81 -47 -22 -3 -133 17 -12 30 10 155 189 -76 -51 -97 132 -135 -36 85 -102 -43 -149 264 -182 331 -191
4863 -191 156 107 -24 -45 159 160 -10 -17 83 82 33 -41 -60 88 108 -117 -17 -27 204 50 -15 -25 264 -173 -167 63
4889 63 -67 56 242 154 -89 124 -41 108 -168 120 -26 24 67 -197 14 -207 -99 -76 2 47 59 156 39
4912 39 186 106 35 -56 53 114 -175 -139 170 125 -270 20 -29 -23 -94 -13 114 -54 -10 -146 -80 3 -70 82 -94
4937 -94 105 -54 -59 74 33 -117 -30 -306 -15 -6 -123 190 -31 163 139 -14 17 6 2 113 145 -14 233 -361
4961 -361 148 81 -46 290 -86 -174 140 210 164 38 -173 169 38 -9 74 -15 19 -49 -106 -110 -8 -37 -106 289 -19
4986 -19 111 -89 77 165 -221 -153 246 -100 59 -54 -145 -77 12 -261 8 228 -163 -69 130 60 82 45 -123
5009 -123 13 -89 130 -13 186 -195 -78 -138 -23 31 -73 -156 -13 274 42 62 180 39 114 98 6 38 -88
5032h8M7P4p1p7R2O4q9O1Q2k34R6N2m4J17j10k2QM0K32m06L63j75p3J82jJ86l58
5059e2P6P3K9j62j1R4J58k72j29J74j06J46l66K45J98o7j29P1M5l66K89j6o7K23
5083G8J34j12k00P6P6O6l7k00P5M5j5j5J40J5P4j31kj72J02P6q6m4m5j7J89N4
5109A24j3k08L2Q8J14o5J01j32j09j3q9L36j76J54j19j67K44j18P8l5J9k83K38
5132Ao0l4J94k31K61k28K74j44j56K92j37O9L8k57J86p0J63r8j26Q7j53P7J1Q
5156c3K04n2k54L89k49j41K20r1r3R7k77L18j92K13j54J90J4n8L6j51Q7O7J8j77
5180f9j75M50k41J64k50o5K29j75K58J28m90J68J81q9L0j24L33l18J08Q2o9j17
5202e1J04kM8k21J68L5m2j16j19K17kJ2O9k33J16K2m2Q6N1m9J42j19j93J47j23
$$ plain form
5032 -88 -41 33 -38 -115 -23 41 -48 13 95 -139 -43 9 -35 82 -28 -50 -42 -2 230 -176 187 12 -61 121 120 306 -52
5059 -52 24 97 126 -36 -47 47 205 -67 -196 -22 -128 18 -348 -103 95 28 -101 -30 15 -351 -62 -78 -145 78
5083 78 212 100 -100 -24 52 118 81 -119 -44 1 -14 -29 111 126 200 69 67 -105 -3 73 -13 -57 -102 -119 70 124
5109 124 111 -97 -65 23 137 72 173 41 -68 -81 -170 166 -10 144 25 -142 102 -16 62 27 46 -237 1
5132 1 -59 -93 101 -130 131 -97 177 33 -123 169 32 101 139 -118 68 -2 161 63 -63 24 -129 -52 -41 -33
5156 -33 171 119 -135 254 5 -136 84 -7 -100 -3 -280 38 -154 59 -95 95 109 51 87 -64 23 90 108 -69
5180 -69 -244 206 -35 129 -121 -186 43 -132 126 254 -236 -68 113 24 54 -70 263 -55 53 135 66 -51
5202 -51 53 51 99 -122 46 81 39 -77 -196 21 19 31 100 -133 -17 5 -37 49 100 51 193 74 -119 28 -95
5227i5J41j38nR0K12l86P8J31R8j31pl3k28N02l6j38j1J19j99m7p7L12m6j11J03
5252I8k30K04l8j48M07m29L1J57j57Q3O4N4j5r1R5j18r6N4K0M2R5J21r3L0l39
5277a99O6K11Qj83K14r6J16j88KR6k4k63J63l7M9J02j5K12m04K93K1j43q2K04
5301A23j27N6n6o2k1K64l13R8K79n23L22K57j23j95K3J09rj35J48p9N3k00K13
5324A02j54R4k2j32N0r1J88j43J99j1l1Qmp2k8j22L85k24j5R9O7j2p4K5j04J32
5350A10k32L8J15n5Q3J16j95K77k16p5k6J26Q9k34J31j26j3L0J22j28mO6R3k61
5374a69R1J53J05k1k67J44k56L11j72J61j33o0n2K10O6j38N2j25%J59k0J04k86
5397a43J73l2k7J6j07K67k16K39j94P6k18L42k53P6j01J40j78J28M4mpp3N9n0
$$ plain form
5227 -95 46 -92 -97 -7 205 -181 -103 28 126 -5 -12 -45 -273 229 193 55 44 163 -36 -83 -160 152 106 -5 98
5252 98 -132 72 34 -114 293 -136 -105 52 -105 -22 42 96 81 -10 85 -33 -129 -75 -55 -13 82 203 110 140 -199
5277 -199 -133 78 86 -97 117 21 137 -51 -49 47 23 -240 -77 -114 -65 37 22 234 -170 123 144 1 -81 123
5301 123 -4 52 -4 -66 -87 177 -136 -38 241 -282 40 297 174 -21 2 111 102 -33 115 36 89 -111 102
5324 102 -52 42 20 -112 -62 -153 35 -108 91 80 49 57 53 -19 -47 -169 216 -8 -23 76 143 131 57 82 -22 110
5350 110 -122 -84 31 -24 59 175 -20 257 41 -34 -60 66 155 -79 52 -74 -87 -57 65 -63 -67 -1 92 -169
5374 -169 -78 75 180 159 -108 36 -220 91 -81 80 -53 -113 -165 45 111 -27 25 -100 -100 59 39 143 -143
5397 -143 30 -2 -29 -13 -120 147 -69 170 -24 52 -166 176 -77 -1 -102 38 -140 -12 32 28 21 -52 7 -43
5421d3M9k17L04M1r4J46k25j8J03J47l37N2J08p2K69l87J53J29o1n6j71J90J38
5444A48k61K54l52J28j50J82L1J87j23m6N4j80K01Q7l01J58J27k39O2L56m84J86
5466B5j99J24n2P9q1J74L9l02J57N6mJ04j35j58K67K1j75Q4R5N8k96O9J07j30
5490g3K10j23R8K3j04j10N7p7J04R6L6k11j49J45J16j0j23R7k2Ln4j17J27P6r
5515Fkk7J71k95K50r2J99l7j84J33j68Q5R6p5j30J87J7r3j36R5J8j33R5N8o8M1
5541A1j05J14J23j65K6J46l55K47ml4K23k06p5M6R5Q6k20P7j52O4j65K40m2J02
5565G7m0q9q0R7M9j18K03j04J10o0j8J18j17Q9l91J50K05J30k67m2J07k35K70
5588D4R5j30P0Mp6M4J98o6k07Q5q7N1j72R3L0j2N0m7nr4o7K15k0j05O1J56L9J1
$$ plain form
5421 -43 6 -211 93 134 40 186 -39 -57 46 193 -144 -92 16 -56 213 -174 -21 108 47 -9 -180 10 148
5444 148 -113 141 -211 -83 -233 -51 -20 167 44 -2 52 -128 73 160 -141 17 144 -95 -33 323 -161 25
5466 25 -174 -50 -102 -23 -104 70 109 -193 -36 20 16 120 -15 -173 94 115 -60 24 119 177 -119 -50 57 -73
5490 -73 137 14 112 135 31 -79 -22 -99 5 101 137 -74 -223 -78 38 28 -95 2 -20 -17 -71 -188 -61 15 6
5515 6 4 -23 148 -147 103 11 210 173 -11 122 -46 39 135 60 -70 117 134 41 -95 0 18 -115 -20 38 -30 11
5541 11 -94 20 143 -22 4 150 -205 42 38 4 227 21 -54 -8 87 173 -47 30 -122 -58 -223 17 -25 77
5565 77 37 -52 -132 -35 14 -104 99 -5 105 45 27 145 28 117 -274 -124 81 211 -56 -98 9 -226 44
5588 44 139 9 79 83 7 51 249 183 -24 61 -26 25 -147 -54 -24 -36 14 -33 -38 -132 -199 16 -4 -109 -48 108 147 158
5616A58j67k7J80k7j77Q8j4n8J97j60k0J7j14Q4P5l1O2j59M11k55k6k3p0R3J84
5641B21k64K07n4LJ6j25j38L13j42j15l2Q8K40l45J5rJ31J45k30j1j8P9J45j22
5665bL4j74K30J07p1J24l26J01O5j12M8j18R0N1j48J27k6k5n4K65k18l5M6j72
5689a93N10m72K73j92N4jN4j04J26k15J76M6J35q5k34K78k47N7K03m9j9l02K44
5712D3k15M7J3J62j76Mq5J91j32J66K3JJ45m7j76j78L09J6k9j57J34j17J53Lj64
5737f6k3j37M87l15K07j28j8lK27j96j43J38j67L32l26J54j43L40j98j08J15q0
5759e1PJ56m7k25K45n4n1J97j85j03J40K31j66kp1j07K35j14j49J30j97j7O2J5
5783a21P6J46j59m8K21q9P3j54L9j62J43L05j43Kj66Q3l8M6P0m7j69r9L17j3j95
$$ plain form
5616 158 -9 -36 144 117 -60 28 14 -44 153 -7 -27 -10 -124 -40 35 4 66 -93 318 63 37 14 -56 37 221
5641 221 -43 164 110 113 129 4 -134 179 37 -78 -110 -22 218 -127 -112 -121 10 155 -75 -86 -104 -25 120 -2
5665 -2 32 -142 88 195 124 248 -78 23 88 -24 24 -94 -4 47 -101 26 0 -25 -79 186 -32 -67 -21 -193
5689 -193 317 -155 118 -74 -20 -21 33 -71 55 -160 16 62 197 112 -122 156 -91 -34 169 120 101 -201 43
5712 43 -172 -125 -112 50 -126 -122 -207 -16 -148 18 41 42 187 140 -36 -214 95 111 82 -75 59 -58 95 98 -66
5737 -66 -89 -226 261 -54 153 25 7 4 231 35 -108 30 -137 195 -131 23 -120 220 22 -86 29 -51
5759 -51 -44 112 65 -160 85 31 -20 177 -8 -111 29 260 94 92 21 -86 149 35 -114 16 -181 -198 -136 -121
5783 -121 -45 101 -58 -106 115 26 99 -55 -16 -178 -35 270 127 129 -37 46 8 54 124 77 -92 -191 126 113 -82
5808h2PJ2m8J23K9j28P6k6nj00L66j08j90L3K54l65Q7l1J78p4J5Q8P6j93j29O9
5834f6k5J87J58l26M4K7j54J40O8o5J72l00Q6Q6k82L07o1K1J03j94K0j73l0L50
5858I3l02K54K7j69K02J1l9j65M1J84N0j70J52k65J51r3j89J06J02k8N5m2J66
5881A32j23kN0l50K99J1l5J10J02m8q2j43J4j52K20j34J10K68k53M8Q3O7l20J78
5905E0oj59J09j0J3R5L8P7j93K23j55k59K21K8p5j74L04j47NL6q7k0L2J09J43
5930A98m78J33J64j35J26j15J03j18m7R8l6R2J24j66k2N1k76L70j8r5K3j06J89
5953E9q8J52j95O9K11k80PM4k2n4K81j66J34k33P6o0Q1l3j64L34j04J6j71L35
5977B29k67M2N7k9k08QJ27J66o6J28j74P3Q9j56p0ko2J6k8J52n5K1K5K90k71j34
$$ plain form
5808 -82 -75 -63 -111 12 41 -87 -11 -37 -42 -142 224 116 -74 -41 213 -152 -65 -96 82 8 23 111 187 -6 -135 -66
5834 -66 -91 96 254 -72 -28 -1 -155 -15 53 -12 160 -140 -54 32 -250 57 -4 17 120 -74 -54 -227 -257 93
5858 93 -209 45 72 -97 105 116 77 -88 -47 137 187 17 169 -96 55 -38 -227 -121 -19 -47 8 -34 132
5881 132 9 7 57 -293 6 17 -18 92 194 146 64 -79 -65 -217 3 -131 -21 247 -6 42 125 192 -128 50
5905 50 44 -115 -6 -16 -3 92 130 207 14 237 82 -177 44 72 -3 -177 127 -20 -15 21 -66 -86 -54 55 198
5930 198 -280 -147 17 -118 8 -107 -4 -122 -169 -71 -107 -15 109 -57 -79 -28 -304 66 48 -47 -24 -130 59
5953 59 -29 123 -72 -3 208 -72 -65 -21 -43 -97 184 18 152 -81 -5 -65 16 -17 -181 153 49 65 -106 229
5977 229 -38 4 61 32 -176 -168 -41 125 59 187 13 86 175 19 -51 -53 -115 -99 -127 25 -30 -9 16 306 35 -99
6003i9L37k91K2n4l6K37l80K80j5P5k34pK56k72J79K2r3K11L4k40J29j82n2K42
6027F9k49O8K76j42k16K39j04Q6r7J28k29J40O4j8Qm6N3j71L11p0j5j30P1k20
6051a94K41q2j0m9R2Q6j18j06J11j10K34l4O3j73K76k90J38l15K49R6j93O1P1
6074D4Q2k24PR4K17k59Q2m7P1o5Pk54K13J49j18o3j0M0l9l9l8Q7J01p0J9L30k84
6101C3l3O3j27m8K45j43j60J80K36l59j27J18m5J61j17J69q9J22Oj68k3J84Nk67
6125a84K15J89l33K63k39j08J90K26j06j88R5j59Q4M9J31l15Q0j71K48j18K56
6146A05o6m9p1p8J66Q0N5j99k5J42j01j92K66k52k3K14lM8J4L4%k55R0r0J14J00
6172B4o1k1J34k76K86J4m8l2rK02l22M2K7K78l75J02K3k0K25l17J79P2l4o9mJ15
$$ plain form
6003 -99 238 -53 -31 -85 -121 116 -264 16 1 76 -158 -165 91 -181 -2 20 -73 138 172 -68 61 -121 -173 69
6027 69 -180 -112 164 22 -194 45 -59 27 -70 58 -171 -31 33 15 23 -23 30 -141 170 100 85 -45 26 -194
6051 -194 47 -35 -45 -94 -2 84 -34 -140 -29 -139 95 61 124 -49 227 -63 75 -240 9 105 -88 -27 44
6074 44 126 -98 -91 3 220 -39 43 -4 67 2 9 -245 -32 117 -1 -64 -74 -34 -73 -112 -150 -63 38 -32 -13 317 33
6101 33 0 63 -64 -112 133 -10 -170 10 246 -113 -240 -122 -167 -6 -123 46 -43 79 85 -83 -106 78 83 -184
6125 -184 31 220 -113 150 -89 -197 -7 219 113 -75 20 -139 -55 -6 125 -190 -110 -281 -33 -151 105
6146 105 39 -10 -81 -159 7 87 142 -57 -82 60 -41 -233 33 -219 -242 -28 -31 17 31 65 65 -190 -100 -190 -76 24
6172 24 -37 -58 76 -200 86 100 52 20 11 213 -109 -67 -40 238 -137 -35 -12 -32 193 -124 55 127 93 24 20 135
6198A35k34K7N7J36j39jM8L6j70J99j72K1K53k05K05l73K78p5P5q1o8J78p7p2
6222a9j8L5jj19J82k98K94j76J20j26K04l5J39k17o6J60r0k7K4J78k55K6n8K40
6246I7k58j9L92k70j01J58Q9o2J02j27K2j12P4K19j21P3l73L42J8j19n8J18Kl
6270H3N8J0j24r5O1qO0k3j54J45k19K60O9k40R9J21Nj44J02n0lJ6j63K27j80O0
6296b7J2K89j02M8j72j39J21j05J47k1q3K2Q8J30l32J37j33K26l30K4L9K89o1
6319F7n9j6j10K06p0j42R7k49J39J17K2J0j37L45l19K13j41R6j63n9J89MJ0j16
6343f6J38M5l10L95p7k73j53m0M64k37K42l9j26K1p4K06q1J40N5j55j02K10j62
6366B1K45j25n3j14J21Qo3pP8m9j51L6J2mJ12M3K3k68p4J45Q9j08J82k78J21k4
$$ plain form
6198 135 -99 -72 -15 121 -18 -19 29 65 -105 94 -78 -57 196 -9 196 -177 101 26 101 20 -48 130 53 -19
6222 -19 -37 -2 -3 -122 60 -238 56 -120 0 -126 78 43 182 -35 -101 59 -31 -58 -34 144 -111 -85 -143 97
6246 97 -161 -180 212 -58 -159 -1 88 26 128 1 23 -89 -15 204 83 156 -217 125 143 24 -34 84 86 83
6270 83 141 151 27 -68 -7 -15 45 22 -132 13 -206 54 123 -117 -18 103 108 -36 66 16 13 29 -134 93 -87 -27
6296 -27 -15 274 172 220 48 -91 30 -75 72 51 -32 -10 78 208 -124 13 -120 106 -224 -200 -161 128 67
6319 67 8 -8 -118 88 18 -124 -27 -276 -137 -20 2 12 -125 220 -99 114 -27 69 -94 -153 36 40 50 -66
6343 -66 72 117 -193 202 125 -148 -301 -341 123 -114 128 89 -37 -16 -90 116 35 175 230 75 -27 183 21
6366 21 266 141 88 -26 95 103 40 33 111 62 -89 -53 -41 -45 67 110 133 -135 -209 -64 25 -83 99 -179 -58 -82
6392h2J4o4J32K29j25k66K42m1j35K9L0J76j72K5R3J05l14L46j13J85n15R8K60
6415A37K0j40m5J25k34K10q4J81j22Q5k75K43p7l0j79L11k15J85l66J27N7n0R8
6438c8jJ0q4J48j22l5K25m8j68J29J20j68N3k01Q3J88J9l12K8L3K77j03m3Q0n
6463F5J44j70NOr9R7p0j03K79l21J20J77q2jn2QP8q7oJ16j93Q6M7j50J21j26J15
6490DJ63j59M8K1l02m7K49K2l3J61l46jQ7J29K05j26L2R0m22K51J19j18ql1M5
6515C3o2J6m4R0R8o8j70j04K41k32N1J27m5J11P9O4k69j0p4J56L3OR5k40K92k16
6541d2J92p0j73K32j46N3j95J15Q5J56j27m3K1n9J4j72K33k2l07J72K27k17J39
6564F6j4j33J58j47J16O5j58JO4J0J29L1l42J33J87j90K39j73J48j36j59K6J20
$$ plain form
6392 -82 -68 -132 0 229 104 -162 80 39 -96 -67 -37 139 -33 -8 85 190 -124 222 109 294 -221 -123 137
6415 137 157 17 -28 97 -137 73 -11 170 48 133 -142 101 24 -6 -185 126 -89 96 -270 -143 -86 -136 -38
6438 -38 -39 -29 -113 35 -87 -122 103 55 -113 16 136 -32 21 -180 -97 91 110 -202 -174 -141 136 33 -10 70 65
6463 65 209 39 44 50 -49 48 -22 -125 154 -167 -47 130 48 47 -5 3 81 -6 -12 104 -89 -3 44 -106 15 -111 4
6490 4 167 8 56 77 -225 -272 -23 -1 -34 127 -219 -220 -133 -4 201 75 107 197 -225 26 145 27 19 -12 33
6515 33 -29 -13 -57 33 131 63 -107 -211 30 -202 -151 -24 -69 42 121 185 -84 -94 -168 -12 21 27 122 -118 174 -42
6541 -42 150 80 -93 139 -7 46 -149 -34 51 207 80 37 58 -1 13 -159 74 52 -255 -83 144 -73 66
6564 66 52 -81 77 -70 46 111 -47 -46 18 28 157 188 -154 -21 166 -24 215 42 190 54 -105 -79 41
6587D1j73J53J6m9k05O4K44j28n2J40n4J3j40R4L8n2j04L15p3j76J80l24J61M1
6611c0J18j08J83k13K08k86nJ20j05K48R3l42J81k54O4R3J17j3o6K22l20L82j14
6634A73j8j45K34k76r0R2j9K66j47j11l7J6k99N85k96nJ26j38J33j9Q8J02l72
6657a57J80O9j55j59J52L4K17j66r5QM8J71j07J07j36L1j30r0K85k6m3J44p6n3
6681E3j13M6J91p9m2j12O3l02L69q0m6J51M9k4j32j74J04J24L6j18P6q7N9p2o9
6706a29m0N5R8k9R2N8k18J41r6J7O0pJ26j06J11k20j3J43Mj43K45k07K10k12N9
6731am8K36l37K46R5n8nk04r6J09J16K3j1j19M0N1j41L7R1J05n5mr6J40k23n6
6757a65L43r3j49N3O3PMJ34j61M8J19l63R5P6l9K57j34k57R3J1L2k43K67Q4MR8
$$ plain form
6587 41 -132 21 37 -12 -217 -153 91 -37 -89 51 -3 10 -130 -36 2 -50 -154 161 88 -88 92 -232 -71 -30
6611 -30 88 -20 163 -50 158 -128 -133 -13 -118 130 223 -119 62 -192 -128 -35 82 69 3 225 -95 287 173
6634 173 155 10 244 -32 -122 -30 -49 217 70 -41 -78 -62 -361 224 -72 -77 49 -89 44 25 113 215 -157
6657 -157 23 92 -63 -222 -70 -36 181 15 -80 -72 -24 147 40 147 11 42 -88 -178 107 81 38 182 106 53
6681 53 -60 -14 177 98 56 -56 7 -295 74 -6 -52 99 148 124 -8 -182 -78 46 82 -36 40 -47 12 -60 -129
6706 -129 -169 -114 -16 -45 47 105 -113 28 -68 -51 9 2 128 22 133 -87 -100 43 47 -96 149 -58 152 -60 -1
6731 -1 -49 187 -150 96 191 133 128 -76 -172 -63 53 76 65 -54 -14 37 -104 -67 24 129 74 70 -26 114 -109 -165
6757 -165 178 85 -64 -11 52 59 63 197 36 84 203 -160 -65 11 -28 229 95 -162 -69 -58 -26 -269 -2 82 86 184
6783A84k47J88k16K53j91k1K3j44J88j72O1k6J89K5j81O0o1J65j62j0RQr3pL34
6808A56k06J09J47k01j12N5M0J14j4L1j30P0j25J02j88MK66m3m5r0M9j3J27J01
6832B04j49j3m9L4j1k30L02m9K5q9N2o4J38j70p6J73j37J73n0J12j46l0J44j96
6856a02J0J01R3k79L41l6k04jJ65j08j28K47k56N0rQ0o8J4J14j1j67L63k84n6
6880a31J68l8l9j51K75k75J02K90k59Q5j23J8L00l65J54J62j82j66Q9J62j56N7
6902b3o2K26j54P4l30L35j43J51l55M24j11M1j34J18J11m50L48J08p8j32J01j50
6924h5P5J00k70L39j76q8n6Q9m7Q7J61p4R3m18K00J41n8r5J50M4n1k34Q6J12q9
6949f4J69Q1l26K10k16J3m6L02m84N38m00L87N4l04J52r6j0k74N87j50k4j02K6
$$ plain form
6783 184 -63 125 -91 162 -29 -50 -27 -171 17 -155 -94 -120 69 94 -87 -27 -88 77 -85 -95 -86 -78 -171 -178 156
6808 156 -50 59 206 5 -107 -52 -12 102 88 119 -11 59 -66 36 -152 -148 118 75 30 -60 -11 -24 103 204
6832 204 55 42 -7 27 16 -214 88 39 64 -25 27 -37 101 -69 -145 28 -109 64 14 126 -20 -50 94 -102
6856 -102 -92 9 102 -177 164 128 -76 -77 88 -20 -148 99 -157 -107 -116 -36 -104 -90 24 13 -154 209 -75 -131
6880 -131 37 -1 -40 -191 84 -191 -89 201 -58 27 -96 -78 222 -143 11 173 -9 -175 -86 76 -80 -23
6902 -23 -85 141 -13 61 -269 66 -77 74 -281 143 32 73 -61 57 168 -282 66 174 96 -36 65 -85
6924 -85 -10 90 -180 159 -17 -105 -161 -72 -119 -32 129 55 148 -270 -70 71 13 -82 68 112 61 -173 -87 25 -64
6949 -64 105 186 -140 70 -146 -133 -179 123 -361 177 -223 164 218 -86 66 -30 -40 -314 273 123 99 -3 23
6972B3l7%J19j98K23l46K77Pj19K21l13K66j18J73o0m6N5q7k64L82l02M1R3j9
6996b9J51N9k04j49L59j05q2O2K4k35M05k14Q7r4j16J35j75K55p9J0l97L19J38
7019A25j0j93K0J8k29L54j53lK51j83K57j85N3Kkk14K59ok95Q1M3P6j03o3k4J43
7045A9Q1k8r0J99k33j7%Q1j01r4NQ2J97j06j18J62lj57K88j77K19j51r6K18l63
7070a83K21Q2l4Q2n5ro6j55J36j1j47lr1K36J47J5r9j27R3j88j4L03l1j40J34
7095I6k7j17o9k5J10Op0o9J01J31k52Q4L61m72L10M4j92J59j52m1K01kJ36j59
7119I2q2M3k3q5N0j98L17k3J20k52l4k9R1kN8J40l69J99J07k98J46j47J45RJ59
7144A34j2J25l02kP5j28n1J53J62J63m72O9J6oK45l49J13m5j50K89j03j08L21
$$ plain form
6972 23 -14 -14 105 -93 130 -216 61 68 -51 170 -143 123 5 178 118 72 127 40 -224 158 -144 -103 -10 -29
6996 -29 122 181 -23 -172 187 82 0 62 86 -149 256 42 129 35 -81 54 -121 134 55 65 -332 -13 125
7019 125 115 -78 -58 -40 -269 85 -68 -71 180 -3 254 69 122 124 122 -92 167 161 -134 -53 -10 66 -37 -100 -124 19
7045 19 100 72 -18 181 -52 -69 -69 12 -89 -183 -178 -96 101 -5 -123 39 36 -121 167 -10 209 58 -38 180 -183
7070 -183 38 120 86 168 113 104 38 -117 19 8 -139 -142 -233 3 150 165 66 -61 32 -156 -170 133 102 -38 96
7095 96 69 -48 -117 -142 -32 -26 -96 -165 -64 67 -185 -101 260 -212 98 142 -50 109 -43 -84 117 115 251 92
7119 92 10 53 30 -55 -5 -203 114 91 211 -41 -75 -104 -13 -15 43 183 -186 13 120 -178 -32 -179 -34 -25 134
7144 134 122 247 -55 -57 18 -110 -161 -8 154 317 -155 -86 -70 -76 169 -180 -67 -112 -262 27 -76 -184 137
7167A37k21o0m6K51k8Q4l70K53J29k15M5J62k92K17mj73K08j62QK75j65j32J43
7190D4j49n9K00P2k9j34J09Q8j64J50r3J25k14j1O4o7O6jjJ94j67j9K1j29L1K07
7216A34O0l93K74J11p5j43J10O2k16J70k56J97l5Pk27M03p7l43K62q2Q3j40m1
7239a55K16n3r9R3Q1J38k30M1l3n9M5K2K83l94J86q7Jj21K24j85mJ32K0J08j10
7264F0NM2o9J08j58J92k63J15j50K64l70J88J20j68J87J03k22qp6o4K10j72K11
7287H5m6P3k52K04k76K27J60k65J24J79j63j09N3q3J09j48r4K09O8J09k19J04
7309D9KO3j14J79j58j23k6J47k0K49l10n6O6l8J7K01O3l32J73N4j33J6J51j52
7333c2J51r0J1J74j51j33K40l34J90j4N2l5p3J9L41m57J07L41m17J19J16m2j75
$$ plain form
7167 137 -84 -144 -190 61 33 117 -253 0 129 -86 -41 121 -171 46 42 -131 77 -85 -77 198 33 -99 44
7190 44 -105 -164 36 108 79 -55 54 142 -22 128 35 160 -54 -65 -1 -68 -2 -3 -4 190 23 4 25 -104 -73 134
7216 134 194 -199 75 186 111 -32 78 140 -76 94 -162 35 0 7 -220 183 106 -237 25 -57 26 -114 -155
7239 -155 61 8 -91 2 83 221 -9 32 -1 -60 -15 7 290 -104 82 -5 -4 -125 99 -86 -90 42 62 170 60
7264 60 65 107 38 146 -12 180 -83 32 -118 146 -224 -36 84 -84 103 206 -16 -24 -100 -164 46 -126 85
7287 85 39 112 -140 64 -212 15 175 -90 34 213 50 -59 -6 -89 20 -128 -222 -13 55 164 -55 49
7309 49 51 114 0 179 21 -102 -128 19 -1 248 -62 -118 -52 -90 -73 128 191 -141 32 86 -47 -31 120 -32
7333 -32 119 29 40 214 63 -70 170 -164 26 12 64 29 -44 -25 316 -141 -34 307 -110 9 125 83 -92
7356i2J34q6Q0K15p6k09o3o3M6M3K22l51K47j77K21j66L4q0M3J12k02K48j49J43
7380G4j09O7r8m2J00j42J23M8L8J53j89J06M0j63m1J32r1J4K31m17P8J42k79J82
7404d3K3j10N9Q7L9p3j08J43Q0j00p4K08rj07q5M5J2K5p6K72k53q7J79q9J65j66
7430d3J9l0N6l2LK23j51l7n5J8j07J38j75K21p8q7J25k68K80q2j40J46m8N8R9
7455E3k70K18q4lJ39j55k8J48J78q6r9j74J19j83J76J47p9j02P8r6O7k98L15m1
7479f0J03q6L0j47K53k23K81Q2k79P2R3j81j96L64j17Q4k47J02K03j64J5k59L88
7502A11j72j42M7J05r1J93J07R2j70k50Q2K59k44J36k1j69Q5oJ84j91L33n31K75
7525B2M4k02L16k10J68j6k93J37R0j77J21j39J01m6K63l1j30j34p4Q8K16Q9k00
$$ plain form
7356 -92 42 -44 36 251 175 -34 -97 -160 -114 -71 151 -200 47 -130 91 -75 -41 -121 -78 34 -168 80 -69 74
7380 74 -35 32 -66 -108 -8 -150 -27 21 59 212 23 129 169 6 -35 97 6 20 251 -166 -88 54 -225 -43
7404 -43 -20 -130 -71 16 55 -18 -126 17 97 -3 -77 131 122 15 -70 -25 -13 12 -64 208 -45 -132 47 -42 123 -43
7430 -43 -24 -54 2 -30 -27 196 45 8 -47 -29 -136 2 -173 48 -30 -117 8 -260 20 -62 -202 -56 -104 -46 53
7455 53 -217 1 -83 -86 53 -102 -130 18 196 110 11 -163 -44 -227 -51 96 17 -85 -7 -103 -36 -334 -19 -60
7479 -60 43 -43 -13 -160 93 -130 151 233 -46 26 119 -62 -258 106 -11 73 -174 -72 131 -33 -18 -277 111
7502 111 -61 -203 -156 -51 -142 51 158 250 80 -170 -88 171 -73 63 42 -127 -42 -48 136 -55 278 -253 22
7525 22 66 -136 180 -30 138 122 -171 -34 56 -121 0 -139 -38 -84 179 148 18 -116 -190 -102 114 203 3
7548CO2j22J64l0Pj0m2J36l00J76q1l4K54j69J95n6m2j60K71k38O9k1N0K4m6j12
7574e2N0Q4l14K59n3q4P7p0K57l38K12J32r5j01M9NK7Q3j62k7J45l7j73J56K79
7599C09k51k67L53l13K19P4j04P4J12k56J8M9n3J34oN0m35K40Q3j00J07j42J10
7622Eo6L1m9l3J75k7K66l67k07M96l38J35J99j74l6m5j0J02j91L29k87K02qn9
7646D3j6R3j90j33J43J10p9J39r6j88J13k31L89j74K7K9l0J73j61M7n9J02Jl1
7670B1K24j84j56J88k73M02k19m5r6K51j60J05pp4K29k20j00jJ0J64L5q5K8j00
7694f3J06j3j10K07J53k74%n0R8r0p1m5q2J57K51j04rK5p1r3k48K40pK45K7l3
7720A46k1k11J83p7L4j40oK20l57K22p7J96q2J62k88N8oK7J63o8j26Q7l1m7Q0
$$ plain form
7548 3 65 -57 107 77 84 74 32 168 -132 44 -37 -71 183 14 209 153 111 -49 222 -16 53 32 82 106 60 -52
7574 -52 -2 82 -232 27 -26 -110 -33 -103 154 -184 28 160 65 -36 13 18 45 128 -34 -61 84 47 -126 30 309
7599 309 58 -209 144 -169 50 124 20 94 206 -50 -32 17 -36 98 92 142 -293 -53 30 -70 37 -105 5
7622 5 -61 -30 -79 -112 63 36 302 -65 -272 224 -114 21 220 46 10 -35 -45 57 -134 195 -92 110 102 43
7646 43 27 120 -70 -203 -60 50 -29 110 14 -174 -61 -292 97 -77 -50 -21 -51 122 -39 8 -51 51 52 21
7670 21 245 61 -95 93 -180 222 3 -42 -138 113 -47 58 51 -23 206 -14 -114 -115 -105 59 94 9 37 -63
7694 -63 43 30 -80 127 280 6 6 -44 54 -36 -107 -152 -234 -77 174 70 61 86 15 -78 -326 -86 -93 152 179 146
7720 146 125 -86 97 20 54 -86 -92 128 -229 -7 -84 112 30 192 -96 -38 -44 -17 146 78 -48 39 8 -39 41
7745D1O0l53L60l9J1J04k56K5K65l17K65j65L8k1j47J32L9K2j09M4j87K84k50
7768a54K99J94n35J75J15qMj28Q6j42K0j15J82r2k2K92k6k67N4J10j23J40m2o4
7792d7J8N0Q1o5M7o9j91J22k7J81J6j63K02j51L8P9j20%K2O6k09KM5J7M5L1q9
7819f9J52k8j05R0o9n8K9J51l58K32J36l23K19J56l83K58r8L9j36Q7RK9N5L5L4
7844H4o6n8j06J06k1j5L58k24mK6l5j9o3o1K5K05l73J39j19L01o0K56l87J36m7
7869b2p9J89l9M6J85l80r9J4J23J78j08K26k01j04J22J03l10L30j67j09M9K53
7891B00j40L7p0kK4N4j47O6J42l97L61j65k5O4m3j14J05J22j67O5PR8q0j28J12
7916b1J07k63J45qK8O4%k2j32J9R7q4j31L8Q0L39q8l70L31l38L60o7k37K45n4
$$ plain form
7745 41 101 -252 108 69 80 184 -72 -47 218 -99 166 1 39 18 -129 3 42 64 -45 -1 -188 96 -154
7768 -154 145 339 -196 -21 94 86 90 -38 48 -94 -74 -189 -7 -99 -121 171 145 -122 -68 42 -81 59 17 -47
7792 -47 -29 21 102 37 84 15 -176 -54 -81 100 116 -47 155 4 42 121 1 1 23 89 -120 -118 -73 -56 -11 20 -69
7819 -69 83 55 -50 40 -29 -87 -58 93 -265 -33 103 -220 -1 155 -228 30 -68 -29 -165 -78 -69 -40 15 50 84
7844 84 18 -40 -146 -40 -61 -76 282 58 54 80 45 26 -37 -98 -73 132 -241 -102 -221 80 20 276 -111 25 -22
7869 -22 -101 88 49 95 280 -100 -199 -185 -62 116 8 234 33 -71 51 154 -156 174 7 -102 -53 200
7891 200 60 97 27 25 49 103 -44 22 164 -233 128 -37 -62 2 -41 -155 -50 72 -95 -30 -23 75 -5 -133 -21
7916 -21 86 -177 -32 -40 -12 52 52 30 -102 -83 14 -70 -201 -163 -83 256 168 -202 129 -209 151 84 -153 92 38
7941C8J33k66J38j96K44k7J1M8p3P7j09R7k94K97o5o0n8N6m4j4K5k4J48j42j59
7966b19K27k5m6K0J02o5o7J20N1nK1N0k2k65J36k45M83l83J22J3q7K32koMk76
7992a32jJ18N3J43M7o3k71J47J5j50K35j42j21L7M4M9K9OJ11k23J17k4K2j92J91
8017D5r2r1J31O2j3r8j00K18j68J1J99Q1j73J6m4r1K12n6J5Mj5N0k08n9K00j08
8043g2J42j35J9r1L3QJ05K12n8j68M3o9L4J51j86J07j7Pl7Q6k4q2j00L5J04J77
8069B24j68j%p1R6K6l56K77k6n6n7J6q6K03O9o7j42J14Q0RK2k43K35j62N9O5j8
8096D2Pq2PJ88k53J73J71o0k43j27K93K8j27J14m27L64n2M8o2qnJ10j49J46k51
8121a55J73p4J92J37k15K4k13O5pK3QJ39j51J36l3k17j7K68j7J07j82O6r9lJ77
$$ plain form
7941 38 171 -95 43 -153 91 64 75 123 50 127 18 115 -179 118 53 -7 -65 -9 -53 -67 -42 -66 82 -60 -219
7966 -219 8 -17 -63 -43 59 -6 -73 47 98 93 114 164 142 -123 13 -232 251 -132 -10 3 -84 148 146 140 144 -132
7992 -132 -133 -15 38 181 228 165 -106 41 56 -94 141 -1 -122 -85 -41 8 37 43 154 -69 48 24 46 -146 45
8017 45 -47 -138 -7 55 42 -56 -156 62 -106 -95 104 185 12 28 -16 -107 105 49 64 68 53 103 -105 -164 36 -72
8043 -72 70 -65 -46 -137 -104 -96 9 221 163 -5 38 -31 3 154 -32 75 58 65 28 114 90 8 -92 -57 47 224
8069 224 56 55 55 -16 80 106 -250 27 1 -55 -112 -96 -182 21 90 23 -119 -5 75 84 106 -137 98 -64 -5 60 42
8096 42 49 -33 -26 162 -91 82 253 193 -50 -177 116 144 17 131 -296 68 16 64 2 -6 -11 99 -50 96 -155
8121 -155 18 -56 136 273 58 82 -131 -66 -73 -50 -42 97 -54 82 49 -168 -185 83 66 173 -9 57 -42 -45 132
8146A32j41J53k18K05k15J39j69K08K33j62l58J00N7M7Kk30J81L20j41M4k39k02
8168b54J86J5N5K7K38j81j81M9L5J74k52J69jJ53ok86L4M3N8j86Q5N9M0
$$ plain form
8146 132 -9 144 -74 131 -84 55 -114 94 327 165 -193 -93 -36 11 13 -217 -36 284 143 187 -52 -254
8168 -254 -68 -53 2 29 267 86 -95 -46 -11 163 -89 80 79 232 226 -60 -26 17 75 -111 -26 33 73
8191G3
$$ Imaginary data points
##PAGE= N=2
##DATA TABLE= (X++(I..I)), XYDATA
0@%%%%%%%%%%%qJ6j6J6k4L2m0M8n6P0p9R1j14J36j53J77k08K40k77L17l60M13
33B21m70N30n98O74p55Q44r43J050j169J298j438J593j761J944k145K362k601
50a364K865l156L478l838M241m689N197n778O450p239Q176r311J0727j2544J4971
65H186j8401K3653l2790N3178j83274M8096K22030k34765M6339J63722q1673p6065
77f1764J71594j1384j00448O6580K9864j33965J3393O5653o5315j7129Q7076n5193
89a1038p9867N4472L5538m2748K0272J8986k3101K0576L5066j2491J6580K9980
101F2225j5081j1082Q261k5417j6656O247l4007l5191K1839O10k0597L8743K4564
114D458m0380K1388O3260j8693j9973M4037q423n0347J4978J6106l3269M816K1979
$$ plain form
0 0 0 0 0 0 0 0 0 0 0 0 0 -8 8 -8 8 -16 16 -24 24 -32 38 -41 50 -64 72 -81 96 -112 128 -149 168 -192 221
33 221 -249 281 -317 357 -398 446 -497 553 -616 682 -756 837 -924 1020 -1125 1237 -1364
50 -1364 1501 -1655 1823 -2015 2226 -2463 2734 -3044 3406 -3833 4343 -4968 5759 -6785 8186
65 8186 -10215 13438 -19352 33826 -149448 -101352 120678 -114087 -67748 95974 14301 -61764
77 -61764 109830 98446 -2002 64578 94442 -39523 -26130 39523 -25792 -42921 44155 -11038
89 -11038 -90905 -36433 -895 -43643 -23371 -4385 -27486 -6910 28156 15665 32245 62225
101 62225 47144 36062 44323 18906 2250 8497 -25510 -60701 -38862 -38252 -58849 -20106 4458
114 4458 -35922 -14534 48726 30033 10060 54097 45674 -4673 10305 26411 -6858 -2042 19937
127A9937l6297k4739L0950J607k0566K0797R230l1656L085L2292R8l89K3548J371
141B9268j5878N522Q381r688q159k343j4095k0124m614Q267K983J514P623K553
155h790j767J2284J9369J625o879K950l870j4454L223J0719j1150j0377M585p845
169a0377j0372J4565Q032j4173j0R302q644j483K0095O201p094N568L377r362
183E625L537J1496q453j4246j525n449r151K857N958n39n75j37L058J0068P882
198A0406J015J756l70o114j911L547k791l856J84p092q330N096O440m714q19M338
214c215m134j906Q786N447l57L151o9m392K809O034l221m004q11p976p401L779
230g480K855m271N82L420l610N47R390N863O8P10q51l941P20L498j361l385j673
$$ plain form
127 19937 -16360 -41099 -10149 -8542 -29108 -8311 919 -30737 -27652 4640 4738 4349 27897 29268
141 29268 13390 18912 27293 17605 9446 7103 -6992 -27116 -31730 -23463 -20480 -18966 -11343 -8790
155 -8790 -10557 1727 21096 22721 15842 18792 14922 468 3691 14410 3260 -7117 -2532 -10377
169 -10377 -20749 -6184 1848 -12325 -12335 -3033 -11677 -13160 6935 13136 6042 11610 14987 5625
183 5625 9162 20658 12205 -2041 -3566 -9015 -18166 -15309 -9351 -9890 -10465 -10602 -7544 2524 10406
198 10406 11421 13177 12807 6693 4782 8329 5538 1682 1866 -5226 -13556 -8460 -2020 -6734 -7553 -3215
214 -3215 -7349 -9255 -469 4978 4621 7772 7703 3311 6120 12154 8933 4929 4118 -3858 -11259 -7480
230 -7480 -4625 -8896 -8314 -4894 -8504 -7957 1433 7296 7364 8074 7223 3282 4002 7500 6139 2754 1081
247A081l677m387K87L505J224j609k822m77K730K143J854L835K246k009j430K775
263E269K618n07j847l075m172k042n36n76j73j25j343p43L232L616K778J872j84
280D062r95L08J135N23l60j119l281l030j42J127k26j60K49k386j803K017L836
297b45J074k86R05K06k93J187K362P85j184k496k838j099R30K90k027j403L19
314c813l58n35K756L619J46j420P09J036L11J017N54j540k041j59q09p02J290
331F1M90k691j622P89Q04N48J263P10r04J40J012J055J279Q99r55k063q00J07
349A22l20n9J18j658j782P28J396M65Q65J203o34j429Q91J990J51n23J48r92j640
368i60Q51Q30p18k75L39j297j452J318J749o70p63P15n7l44J542J077l25j16n55
$$ plain form
247 1081 -2596 -6983 -6696 -3191 -1967 -3576 -6398 -6875 -4145 -2002 -148 3687 5933 3924 2494 5269
263 5269 7887 7380 5533 2458 -1714 -3756 -4292 -4868 -5041 -5166 -6509 -7252 -4020 -404 2374 4246 4062
280 4062 3067 3375 4510 5033 4673 3554 273 -2757 -2899 -1772 -1998 -2158 -1909 -4295 -6098 -4081 -245
297 -245 829 543 1448 1654 1361 2548 4910 5695 4511 2015 -823 -1922 -992 -702 -2729 -4132 -3813
314 -3813 -4171 -4706 -1950 1669 1815 395 1104 2140 2451 3468 4022 2482 441 282 -527 -1229 61
331 61 551 -2140 -3762 -2973 -2169 -1621 -358 352 -552 -412 600 1655 2934 3833 2878 815 15 122
349 122 -198 -257 -139 -1797 -3579 -2851 -1455 -990 -125 1078 444 -985 -94 1896 2047 1524 1672 680 -960
368 -960 -109 721 3 -272 67 -1230 -2682 -1364 385 -285 -1048 -333 -390 -734 808 1885 1560 1444 889
387H89r66N0Q66K7j239o90l48k96N90P33N38j07m78NK23J280O66l36q03o91j18
408b05J50M92J66n12r56l35J91L78K08J004k76j303M65J057J51R9N11k24j204
427a43J02L52k2j83N05j405q17Q60P17n99J19R04p17p65J178P20k5K06k30r94
447b37Q3R86r8q43K49l82j048J45J136k87QJ50k77k88P26O93j03K2K35k87m98
468H5L54N29l42n58n36n13j26O18M82m31n32J34O04M2K49J112j41q03l26P51J15
489G67k44N5m83r40L65N5l46J67N18k91p36L16J045K98j05Rj50j74M84J80j40
510F50p3K7o50m30L61j97O5l08l34J4K9K68L97P58k55j90K01K62J22J21j2o69
532A57n42M8J30K16l19n7k99j78L56J19N35K55k17l70L39J71RL13K7m54p8j82
$$ plain form
387 889 -77 -27 839 866 -373 -1063 -1411 -1707 -1117 -384 154 47 -431 -426 -203 1077 1743 1407 604 -87 -205
408 -205 -55 437 603 91 -865 -1200 -1009 -631 -423 581 305 -998 -533 524 675 774 1285 1061 -143
427 -143 -41 311 289 106 611 -794 -1611 -751 -34 -633 -514 390 -327 -1092 86 806 781 987 757 -237
447 -237 -154 832 734 -109 140 -242 -1290 -1145 -9 -296 -288 -138 -415 -703 23 716 613 635 870 583 85
468 85 439 968 626 68 -468 -981 -1107 -489 -7 -438 -970 -836 -232 -190 59 1171 1030 227 -99 652 767
489 767 523 578 95 -845 -480 -425 -771 -604 -86 -377 -1113 -797 248 546 441 450 300 126 610 790 650
510 650 577 604 -46 -476 -115 -312 -247 -555 -889 -875 -846 -578 -181 577 322 132 333 595 717 838 826 157
532 157 -385 -337 -207 9 -310 -367 -666 -844 -488 -369 166 421 204 -166 173 344 353 666 693 239 161 -21
554b1o5J95K4k79o39p2K98K63j08M63J76j49j56J16P70l9l72k01l35R2J25k43
576a57N4q1m36J24m8L39L5K09j08j1N6K52J9J68J97k04m25O7K40r8l52J24j84
599b20l04l3N72j43k40M75j2m0KM36j59o9k49k2M1N3J78j99l00k36Q1K90j45K50
623GJ98Om57K48M04j76p4L30l08m53M59j42k00J91l3l93J05M19q8l63M28j46j83
646b21L28L0J72K4l8m84j4M30k2l65J64k34m00K05K15k3K36o6K07j06j39L94P5
669C68nl36J98j10q3j31P6k7k57K8j17N7M52j35R3j24J29R9mK10J89l40n6k55
693h1n7Q3K7L5l57M1pL4N7K53j1K6oJ22j08L22n5p5j68J51K0l42J88l05j49j3
719c75L65j39j6K64j26j93R5L10JJ0j98J59j78j60J91M0O2r5m7m79L37M10k48
$$ plain form
554 -21 -86 109 133 -146 -785 -857 -559 -296 -404 59 235 86 -70 46 816 777 405 204 -131 -39 86 -157
576 -157 -103 -184 -620 -496 -544 -205 -170 39 -69 -80 -24 228 247 415 612 408 -17 50 290 192 -160 -36 -220
599 -220 -524 -557 15 -128 -368 107 95 55 57 493 334 265 16 -6 35 88 266 67 -233 -469 -388 -98 -243 7
623 7 205 211 -246 2 406 230 156 486 178 -275 184 42 -158 33 0 -393 -288 131 43 -320 108 -38 -221
646 -221 107 137 309 333 295 -189 -203 227 205 -160 4 -230 -630 -425 -210 -233 3 -63 144 38 -101 293 368
669 368 363 27 225 115 32 -99 -23 -50 -307 -279 -396 -339 113 -22 71 -53 76 175 171 381 570 230 174 -81
693 -81 -138 -55 -28 7 -350 -309 -316 -282 -225 28 17 43 37 159 51 373 318 243 75 226 246 -96 92 -213 -362 -375
719 -375 -10 -149 -165 99 -27 -220 -125 185 186 196 -2 157 -21 -181 10 50 112 17 -30 -509 -172 238 -10
742a0m7O9j52Q5N7K28o5k05J65j52J82r7Klj62K43n78L28N0J74n6l51J44K43J13
767B05J6j08M3j58J06P3j01j6J64k27k22K11m2j93K46O0k46K8R2j19J45M9L4J72
791B12j60K03n8k20K48p4Ll69J07n9N3K66p3k63K35nJ47j4j77L2O9J12j56j82
815a23O6Q2j86J32lN4L6M6O4J04l46J40J46k40m2L06k04l4J16j97m3N7mpk4J30
841B6R6j12L7n6k2N6q9L01l95J18J20J11l07o1J29J30k25O0l1J16J2P6j49j0Q9
866B0j9n2J28j07O0P7J12n0j42j27P7p9J48J39j97o2J2J3p5J84N0l2j26J1j01
891a38K0K45k20k9K53j66k07J41r3M67k73M1J20j14k23L41l75Q5Q7L15k19k16
913a58J18J02kp8o2j00lL33j25j60M8K07kJ84j56k12K37j65J19P7k16J50j85J91
$$ plain form
742 -10 -57 12 -140 -55 2 230 165 -40 125 -27 155 58 60 57 -105 138 -440 -112 -62 112 56 -295 -151 92 205
767 205 221 113 156 -2 104 177 76 60 224 -3 -225 -14 -56 -249 -3 57 -189 -161 -69 -188 -43 6 40 212
791 212 52 255 197 -23 225 151 154 -215 -108 -167 -114 152 79 -184 51 46 193 179 2 34 103 215 59 -123
815 -123 -57 25 -161 -29 -32 22 58 104 168 272 -74 66 212 -28 -70 236 32 -2 114 -83 -126 -69 -73 -80 -104 26
841 26 122 10 47 -9 -31 25 -64 237 -158 -40 80 191 -116 -177 -48 82 -143 -83 -114 2 14 90 -59 -69 20
866 20 1 -51 77 -30 30 107 219 169 27 -100 -23 -102 46 185 -12 -74 -62 -49 -124 60 110 78 -48 -37 -138
891 -138 -118 127 -93 -122 131 -35 -242 -101 -194 273 0 41 161 47 -176 165 -210 -125 -38 277 58 -158
913 -158 -40 62 60 -18 -80 -180 -183 150 25 -135 -87 120 118 302 146 -66 171 6 125 202 -14 136 -49 142
937A42j37k80L84j22o1J06m4L9N6k12J78l5r3q7J95j15p8N3K21l8k2p7l2J15K
962E8j31o2J59N6k71L25ok43K12k82R2J65k11L34l88J51J25k42J28N1Q5l0k14
985a39J47J00k54J22l2J28rjp1Q2n4j62M9J76K08k65P2k57L60k35j94L32j33P
1009b3j2J4p7J61k39K36q5L3kR6j37J29j49K2q5j50J10K62j65k3K28m49K48P0
1033A3M7j47m9j18JL12j1j48J19P7k15j1K13j70R2L3j3N0n7j00K04q1k04K46p5
1058HJ03k0j23k50K72J06l2j25K5j40J99j30K1J74q4R0j04N5N4j37k7J48j53m4
1082a14K76k81K51o6K5k35J60j47K9N1J29L6j09OJ19n3j83L2K8J56j28J8n7K5
1106c2R1J26j87Q0J7j47o0R2J02j70J34j48M51l56K8P6J19j02k04j9j0J09J76
$$ plain form
937 142 5 -275 109 -13 -74 32 -12 27 83 -129 49 14 -79 -166 29 -86 -164 -111 110 72 50 -27 -59 56 58
962 58 -73 -135 24 80 -191 134 128 -115 97 -185 -93 72 -139 195 -193 -42 83 -159 -31 20 105 75 -139
985 -139 8 108 -146 -24 -56 72 63 62 -9 73 19 -143 -94 82 290 25 97 -160 200 -35 -229 103 -30 -23
1009 -23 -35 -21 -98 63 -176 60 -25 8 6 102 -35 94 -55 -33 -118 -268 -158 104 -61 -84 144 -305 -57 13
1033 13 60 -87 -136 -254 -253 59 48 -100 19 96 -119 -130 83 -87 5 38 25 75 18 -82 122 41 -163 83 8
1058 8 111 91 -32 -282 -10 96 64 -61 -36 -176 23 -107 -86 88 4 94 -10 45 99 -38 -65 83 -70 -114
1082 -114 162 -119 132 66 91 -144 16 -131 -102 -51 78 114 5 11 130 77 -106 -74 -46 110 -18 0 -57 -32
1106 -32 59 185 -2 78 95 -52 -112 -20 82 -88 46 -102 349 -7 21 97 216 114 -90 -109 -119 -10 166
1129A66k73%j10Q2L1r7K60k22L41j31kL6j26j82R8J44J28l17K68j72J40k7o4k75
1153c04J97J8L24k84J82l90K87r2k9K24j58K21j22m0K59l40L5J94l39J92J56k85
1175i4J01q4K30k56L4J43k63L21l01K18j36L26j64k35q3K02J45m1p9Q4Q1l30J43
1198c8M9J6l3j37J06M1j12J16k61K52j39J51p9K0r0K94N0J46m06K14q6r4L7j48
1222a31K38k01J01J9n1Jm5Q9J05j77ol5K06R6k77j16K19k0m4p2j55K13N2j55j3
1247a59J17P4M5p8J17J3j17NL1O8j13J41j57j8RR2o9J60j91k02M1J31m8K76j67
1272Aj20J63m4J31n3j15J2l8j66J14O2k1M6J53r3o9j14K75j91j3o8L62q1k22n9
1297a48L11n9j27kk09J54p1P9J78k71K15m4j03L35l52O2J49n8j14J17q4k2J03
$$ plain form
1129 166 -107 -107 -217 -135 -104 -201 59 -163 178 47 45 81 -45 -227 -129 15 143 -174 94 -78 62 35 -29 -304
1153 -304 -107 -89 235 -49 133 -257 30 -62 -91 133 -25 196 74 34 293 -47 -12 182 -157 35 191 -94
1175 -94 7 -77 153 -103 -69 74 -189 132 -169 49 -87 239 75 -160 -243 -41 104 63 -16 68 149 -181 -38
1198 -38 11 27 -6 -143 -37 4 -108 8 -253 -1 -140 11 -68 -48 -138 156 206 352 -54 160 74 -20 17 -131
1222 -131 107 -94 7 26 -25 -24 -69 20 125 -52 -58 -93 113 209 -68 -184 35 15 -29 -101 -256 -43 9 -146 -159
1247 -159 -42 32 77 -1 116 129 12 17 48 116 3 144 -13 -31 -22 70 1 161 -30 -232 -191 -60 -108 168 1
1272 1 -119 44 0 131 78 -37 -25 -63 -229 -115 -53 -74 -28 125 32 -37 -151 124 -67 -80 -148 214 133 -89 -148
1297 -148 163 104 -23 -25 -234 -80 -151 -72 106 -165 50 6 -97 238 -114 -52 97 39 -75 42 -42 -64 39
1320C9k82K55j03O9M2J3j09K7NL7j13k7K26j20jn3r1J74P8j08O8R5j76J60j03
1345Blj38K82p0Q1o5k25K18R0k58K91k82J42j43j71K60q1M4j84K92n8l94L94q5
1369f1L5K00j07j13J32k8R1m08J88J97j99J37k09J99R0j88rl6J40p6M8k13K8K24
1393F2M3lj93K5K7j99J43l9o4K07n6Qoj7rJ04J31j03j0J08l74K73o1j25Q1m5R1
1420aL8j18R1k42K42k1jj12J26k01M16k91N2M4J91k59K67k22n8o0J07r4R1O8j66
1445a13J26j07j29M94j60j84o6K49L6R1k22j4j21K32q2o0j4K35k86O4J12q5O2
1468E8j80J56Q5r9Pr0qn1L19j45jj7M6K16m06j38J55j00J42O6Q2L4j32Q2J03j44
1494D0k5o1J24k46J14J78j74L6j26J70k08K80k45J67j16L61k56K5p4j9l9n6K62
$$ plain form
1320 39 -243 12 -91 -22 20 33 -76 -49 -44 -7 -120 -147 79 -41 -42 -95 -186 -12 66 -42 26 121 -55 105 2
1345 2 -1 -139 143 73 154 89 -136 82 172 -86 205 -77 65 -78 -249 11 -70 -26 -210 82 24 -370 24 -61
1369 -61 -26 174 67 -46 86 58 149 -259 -71 126 -73 64 -145 54 144 -44 -53 -89 51 -25 23 -190 -162 62
1393 62 105 102 -91 -66 -39 -238 -95 -134 -198 9 -47 -39 -45 -62 -71 33 164 61 51 159 -215 58 -3 -128 -47 -92 -1
1420 -1 37 -81 10 -232 10 -11 -12 -124 2 -199 217 -74 -22 22 213 -46 221 -1 -59 -119 -12 -106 -15 53 -113
1445 -113 13 -94 -223 271 111 -73 -139 110 146 237 15 1 -120 112 30 -30 -44 191 -95 -31 81 -4 58
1468 58 -122 34 119 20 27 -63 -71 -122 197 52 51 34 80 296 -110 -248 -93 -193 -51 15 97 131 -1 81 184 40
1494 40 15 -46 78 -168 -54 124 -50 -14 -140 30 -178 102 -143 24 -92 269 13 38 -36 -55 -94 -150 112
1517A12j35pJ69j09l7Q5j50j0J01R3k70P1o4J83J9l21J30J74o2J20j76qJ08j48
1541a32J05r0J59j5J45j24k5j53J4K44oq5j25Q2Q8j69K01j09k3MK9l2J12j44K06
1566A57r4j69R7M0j24J94N5k12q7KJ54J57j58n1J0j7N6N9j51J78n7J37k42n7J36
1591A3R0m4k50K8K43j71J04K23j45n1k53K41j0j90M7J58j5o0J03j43j34L24M8
1614A56k08KR8J36k85M3j40K00MJ2Q8J61l44M7J60k03N4QN0J05k09J41o8m9L39
1639B98l26K37k85K2P6q7J99k03r6J00M6R3j98L24j21k85K04q6J81k20L9j0J69
1662G1j23J22j0J21j36j58K60k52n2L6Q1j9K40m3l03J71j71J28pKL9r0J0MP8Q4
1688H3k48J46L8j53J73mj2j98J5N7J03j86K59p6n5M61k82p7j97J79j71n6K77P
$$ plain form
1517 112 -23 -30 139 30 -7 78 -72 -82 19 112 -158 -87 -151 32 51 -270 -140 34 -28 92 -84 -92 16 -132
1541 -132 -27 -117 42 27 172 48 23 -130 -116 128 122 37 -88 -6 82 -87 114 5 -18 -14 15 -17 95 -49 157
1566 157 63 -106 -9 31 -93 101 156 -56 -143 -141 13 170 12 -39 -29 -46 10 69 -82 96 39 176 -66 -123 13
1591 13 103 59 -191 -163 80 -91 13 236 91 40 -213 28 18 -172 -125 33 18 -42 61 -82 -216 108 156
1614 156 -52 -50 48 184 -101 -58 -198 2 6 18 106 267 -77 -30 130 -73 -19 -11 39 144 -65 76 8 -41 298
1639 298 -28 209 -76 -54 22 -65 134 -69 -165 -65 -19 74 -124 200 79 -206 -2 -88 93 -127 -88 -98 71
1662 71 -52 70 60 181 45 -113 147 -105 -157 -121 -40 -59 181 138 -165 6 -165 -37 -44 -42 -3 -93 -83 -79 -1 83
1688 83 -165 -19 19 -134 39 35 23 -175 -160 -103 0 -186 73 -3 -58 403 121 44 -153 26 -145 -201 76 83
1712H3r5M0Nj13O4Q7j71M54l12O7J1l3Q3j80K28k32p3J07K06k80J16J16k86j59
1736b67Q3J70J2lj03L07j70p2ql6O4J27j6q9J16k09mJ05O7k33Q4J53m1j40J12
1761Ij65J03j8j6M69m02J60k91J44r3JO7J48k22JJ79R2j07k5j86O5J1q3L42o3
1786A20k17j22J86q4Q0J06m1j51N6N4P3p2J02j70J44J02k36J06k88L68j35K3J29
1809A33k21J28P9KKk28O4k2J0j0p3k5L0nK6P7n0L22j63j31K30n2j45J77j02m8
1835EL5q2J14n2k10K48j3j35L8m2Q4NL30k56kn1q0Q2j9K02k01J60j49L4l9l7K09
1862A78q8j09J25j43n7M0K06k39N7K5m1l7j21J83j60J24oJ03n3j64J75O6Oj81
1886a11J73j83J85k53K11r5K3L89m71R7r9J52O2r6m0J64k16O6J32r7o1Q3o3O4
$$ plain form
1712 83 -12 28 33 -80 -16 71 -100 354 42 109 120 87 170 -10 218 -14 -87 20 226 -54 62 178 -108 -267
1736 -267 -184 -14 -2 -5 -108 199 29 -43 -51 -87 -23 104 88 -1 115 -94 -98 7 74 -159 -75 78 37 -103 9
1761 9 -156 -53 -71 -87 382 -20 140 -151 -7 -100 -99 -32 116 -106 -105 74 166 59 34 -152 -87 -76 -159 183 120
1786 120 -97 -219 -33 -117 -37 69 28 -123 -67 -13 60 -12 90 -80 64 166 -70 36 -252 116 -19 4 133
1809 133 -88 40 119 121 123 -105 -41 -63 -53 -63 -136 -161 -131 -136 -110 -33 -83 239 76 -55 175 123 -22 155 53 5
1835 5 40 -42 72 20 -190 58 45 -90 -52 -94 -10 -5 325 69 67 16 -64 18 -1 201 0 160 11 45 6 -31 178
1862 178 90 -19 106 -37 -94 -54 152 -87 -30 -5 -46 -83 -204 -21 -181 -57 -63 40 -13 -177 -2 64 70 -111
1886 -111 62 -121 64 -189 22 -73 -50 339 -132 -35 -134 18 80 -16 -56 108 -108 -42 90 -7 -68 15 -48 16
1910A6m6J44r1J3J05k21K55k34K6r9N7r6J7K29o7Q1M7j55K7l4m9K73l03J80p9
1935dJ5J39j11j82J64J5l0k1L3Pk13J73n9O5J25k4k33l7J51J29n3q1P1q6n4P8
1961b3p5j00K19o9J04k57J35p2J54N4k5j21K53lM3k42J55j59j45K68o2o3j44J49
1985b6R9j94m8K10Oj21K35k69j0J74j2j21J43N6r1J5j70L24j56j32K39m1m3m3
2009B4j14L2J04M4j28J86M0j27j73K8j10J32P1j12M9O4r0n8M0K0J34j01%k4K03
2034A34k1k35q1J11J6J07P5l97K55J83l45J53J50k62K91j73J25p4q6J05Om9o3
2057g5J44j40p7J76J04j97j25K33j84O9J16j14O5J30Lj12O0RK7r6k61K86j33j27
2081b19N27k57q7j1J20O1k43J76O8l18J77K9j13K81n60L36J87k26j00N1K59P3
$$ plain form
1910 16 -30 114 23 36 141 -80 175 -59 -33 -132 -75 -171 -154 75 8 89 136 -19 8 -26 -75 198 -105 75 -4
1935 -4 11 150 39 -143 21 36 6 -15 18 25 -188 -15 -74 -9 116 92 -141 -178 -27 102 49 -32 39 -47 -101 -23
1961 -23 -98 -198 21 -48 56 -201 -66 -138 16 70 45 -76 177 174 217 -25 130 -29 -174 94 32 -31 -175 -26
1985 -26 73 -121 -169 41 47 -74 161 -108 -118 56 44 -77 66 122 31 46 -124 200 44 -88 151 110 67 24
2009 24 -90 -58 46 90 -38 148 188 61 -112 -84 -194 -62 9 -103 -54 10 -80 -138 -98 -78 56 -45 -45 -69 134
2034 134 113 -122 -203 -92 -76 31 106 -291 -36 147 -198 -45 105 -157 134 -39 86 12 -74 31 37 -12 -75
2057 -75 69 -71 -148 28 132 -65 -190 43 -141 -72 44 -70 -5 125 128 16 76 85 112 16 -245 41 -92 -219
2081 -219 308 51 -36 -47 73 134 -109 67 135 -183 -6 23 -90 191 -369 -33 154 -72 -172 -121 138 211
2103B11j3k50j3J01R5k58J43n3J06l1j18j21K2K55K3q0L2p5j15J25Mm7J13k8M
2128C2L0j21K27l85J64K19Q2k33n1R2k4L5j82Q9J89j91K34q2j61J49j10K0M8n8
2152A2k2K2m8j04K79M7j78nK0j35M3L0J00L8q3q8j9R1k4P9k70J4Q7K32p0J51j05
2179I4j22k67K52J78k22K02Lj22k1K77j85q4J2j25M9p1j0J00O8Q0k18J59J83j25
2203H5mM9j89N0j08N9j5M3J01M3r3J36j11R1M4k48Q8P5r6j2j0j19jJ2L10j58K8
2230E0r2P7o9J48r7p4K52l82K9J56N1N3j03J64J46m06R7r9K37j30J16j17Q7j0
2254H4P1K9j14Ro4j82L84j49O1Q4l91Ln8J74K20j90q1K72k82J85p9j9j61J26J11
2279D3j28O4j01K26l3j05m9J95k95J98o2R2r0Q1m6N0J32l52J49J17j68J64k5q0
$$ plain form
2103 211 198 -52 -65 36 131 -127 16 -37 69 38 -80 -201 -179 76 99 19 51 -24 -139 -14 -10 -57 56 28 32
2128 32 62 -59 168 -217 -53 166 248 15 -36 56 32 67 -115 -26 163 -28 206 124 -37 112 2 22 70 12
2152 12 -10 12 -36 -140 139 186 8 3 23 -112 -69 -39 61 99 16 -72 -91 0 -24 55 -215 -201 -114 118 48 199 94
2179 94 -28 -295 -43 135 -87 115 118 -4 -25 252 67 -17 -5 -130 -81 -152 -162 -62 6 86 -132 27 210 85
2203 85 81 130 -59 -9 -117 -58 -73 -30 71 114 21 157 46 137 181 -67 21 96 0 -12 -22 -141 -142 -130 180 22 50
2230 50 -42 35 -34 114 17 -57 195 -187 -158 -2 49 102 -1 163 309 -97 0 -99 138 8 124 7 94 84
2254 84 155 184 70 79 15 -167 217 68 129 213 -178 -175 -233 -59 161 -29 -110 162 -120 65 -14 -33 -194 -68 43
2279 43 -85 -21 -122 104 71 -34 -83 112 -183 15 -47 45 -45 36 -10 40 172 -180 -31 86 -82 82 57 -23
2303b3K00jj98oJ22n8N8j55J53J69l50K91j44L1k23N8J81j96K1J55j13M9r0n1
2327a20j41J17J07o3L32k48J20j93J65l20J43l1o2J07N4J10n7j83L91p9j39nj18
2350a13J55l4j14J13L3J38j66r4L7J44j40nR7%p0j19k03K92N6l4n8J66j04L7J49
2375A63j92KNp2r2m3JK82J3r4N5n9J69j48q4j3J98j87Q1L77l86R4j2j21L8q8J34
2402B1n0mN0J84k90K18j74l6K27n6k05J79J1k66J95P2j03j41R1P0k15L54p9oJ02
2427A49j30M3j24J72p6J91l31K53k11O5K35k89P3jm3qL66j91rk04N4p8o7K55J2
2452A06j49k40L66n2Jo7J14Kj25N0NM7n0J20j7q6Q5j13m9mL29j19j59j9J19p1
2478B4lJ83j63l6J50j30J83l22K29l14J85o0J37L5j26N0j91J72M1r5K2m8L0j7
$$ plain form
2303 -23 177 176 -22 -28 94 36 94 -61 92 261 -89 202 58 89 -134 -76 105 -91 -70 85 -28 21 -69 -120
2327 -120 -261 -144 -37 -100 232 -16 104 -89 76 -244 -101 -132 -194 -87 -33 77 20 -163 228 149 10 5 -113
2350 -113 42 8 -106 7 40 178 12 -82 -45 99 -41 -46 51 51 -19 -138 -341 -49 7 -27 -85 81 -23 14 163
2375 163 -29 -27 -22 -94 -186 -229 -228 54 67 -27 28 -31 138 -10 -94 -107 91 -96 -15 362 -24 70 58 -63 -25 -113 21
2402 21 -29 -33 17 201 -89 129 -45 -81 146 90 -115 64 75 -191 4 76 -27 -168 -77 -7 -222 132 53 47 149
2427 149 19 62 -62 110 34 225 -106 147 -64 1 236 -53 20 19 -24 -32 334 143 134 -70 -16 -94 -161 94 106
2452 106 -43 -283 83 31 32 -35 79 81 -44 6 11 58 8 128 111 25 110 -3 -52 -56 273 154 -5 -24 95 24
2478 24 21 204 41 5 155 25 208 -114 115 -199 -14 -74 63 98 -28 22 -169 3 44 -51 -29 -77 -47 -64
2502f4R1l7l1J08k09L18r5L0k56L27j47j25L07l82Q7J89j32j28J40j43J23k8J97
2525A40j2j92q0j5l6L14Q7j34k75P4j17J69L0r0J09m3J8Q5j87k6K55p4J55j60
2549eK84l86L9Q4M9M0Jj79J21J77j62q9J92J05j81n5j5J32j40k23O1K86k65Kp7
2574b04K90m46M01j53M5K69j79L9M3k82j7K17p8j1J37j36m5m6k4L21r4P6k7q7
2598Ij20N4P2l3J15l5j77j45J07l9J89J98j53k57K21K2j12%R5L3O8k36J05k20
2622b39J77L8K27m36J58J31O4l20K56j52n0K45N6j97R9N3j78K56k59j86L28K29
2644C00l77J48k36K38J6M2kj59j13J52q2J40l19P2K46M4K0k74J02o1J93k47M8
2667a09M2J94k55J0J86q2L3Q0j64o8K63k10N6J49P6r9r2Q5j13J58k06O7j16K1
$$ plain form
2502 -64 27 -10 -41 67 -142 176 81 111 -145 182 35 -90 217 -165 -78 111 -21 -149 -9 -152 -29 -57 140
2525 140 128 -64 -144 -159 -195 119 206 72 -203 -129 -246 -77 -47 -137 -28 -71 -53 32 -155 -181 74 0 155 -5
2549 -5 279 -107 -68 16 65 105 106 -73 48 225 63 -26 166 271 90 35 20 152 12 -211 -150 136 -129 -127 -204
2574 -204 86 -360 41 -112 -67 202 23 62 105 -177 -194 23 -55 -66 71 -65 -110 -156 -180 141 47 123 96 9
2598 9 -111 -57 15 -18 97 62 -115 -260 -153 -192 -3 195 42 -215 6 28 -84 -84 11 44 112 -124 -19 -239
2622 -239 -62 -24 203 -233 -75 56 120 -200 56 -96 -146 99 155 -42 57 110 -68 188 -71 -257 71 300
2644 300 -77 71 -165 73 89 131 129 -30 -143 9 -73 67 -252 -180 66 110 130 -144 -42 -103 90 -157 -109
2667 -109 -67 127 -128 -118 68 -14 19 99 -65 -133 130 -80 -24 125 201 102 10 95 -18 140 -66 1 -115 -94
2691i4J24m6J28j75p3L53k14l3K18j96N3Ml9J68j59P4k15J79R3k2k78%R4q5J56
2716A5J05k06KJ97k73J53K3n2J21k99K42N7j70M8j6L04j86Pj39J92l53M68p4n0
2740A16k58j54M83j91K12k79K7R8j39J8K5J43j72k29L18j07K19k54Q4O4J8J2j70
2763a16K03r6K39l43R8J04j89P6L7p7R8J65o6j65J18J15o3o7P4j84J02l2p6J03
2787E8j5p1NP4q7N2j75J30K38m47M20M1j56r0J34r0j12M3O0m5k4J04j20R8K2p5
2813b8R0m6J17J2l34K58k50O3R9k20K93q9k1M4J7J28k33R3n9j78M00j63J55k1
2837A27k37J3L08k18lk2OJ5J3p8J71j49o0j24L47j86k09M19p5l7M2K3j36J14l6
2862B8K8j61J29q3q9J14J22j42l4K47j90RqQ7j07J50p9k5KO6%k81K80K42j52j88
$$ plain form
2691 -94 30 -16 112 -63 -136 217 3 -30 188 -8 45 49 10 178 19 93 -122 57 150 128 -150 -150 -56 -141 15
2716 15 120 -86 -84 113 -160 -7 16 -36 85 -214 28 85 -85 -37 -53 251 65 72 -67 125 -228 240 166 116
2740 116 -142 -296 187 -4 208 -71 -44 54 -85 -67 -42 101 -71 -300 18 -89 130 -124 -40 24 42 54 -116
2763 -116 87 -9 230 -113 -15 89 -100 -24 13 -64 34 199 133 -32 86 201 138 71 145 -39 63 31 -45 58
2787 58 43 -28 -23 51 -36 16 -159 -29 209 -238 182 223 67 -23 111 21 -91 -48 12 -33 -57 47 -73 25 47 -28
2813 -28 62 16 133 145 -189 69 -181 -118 -19 -239 54 -35 -56 -12 5 133 -100 -7 -66 -244 156 -7 148 127
2837 127 -110 -97 211 -7 -10 -32 -26 -11 2 -76 95 -54 -114 -238 109 -77 -286 133 58 21 63 86 -50 64 28
2862 28 56 -105 24 -59 -148 -34 88 -54 -88 159 -31 -22 -30 57 -50 100 21 -4 -2 64 64 -217 63 305 153 -35
2888c5j12L03j16j2r6J38N1o2R5j02l4J18l00R8j6K61l19J52L2k39J22K0L7M7
2912C1L9q6j8J39j83J2K3J2k16J55O0p7N9J06k01J32n7l3K34k06j2J71L0j79N1
2937a4r6K07L2l06J11K11j23P6jj46L3n5J25K54k77j9j0J1p0Q8p9J12k52J15J43
2962G0j80j50J08K46k24P5j2J06j70O0RJ12j84o7L76j85N4k14K44r2J71k13K41
2985A81j33r3q2J99k93L51n8r2L1j77K22j27p0J08Q7j66J29J41k31K03j14o4L34
3008B86l02p1m0o4J63J14m9p9m1l3K97j63j62L16R1r8n8K6o2j05l1L0K7j81K41
3033E2m5j15K17K6k46J98j70P5j3K52p3j59J68j07j34o9J18J54L5j13j41M3K21
3056A74k26L9j04K63r6j6K33k85j1L0j6J61j20Q1k27k1L44j99k24M17k39L7l2
$$ plain form
2888 -35 -147 156 40 28 -68 70 121 59 154 52 18 136 -164 -66 -82 179 -140 12 44 -195 -73 -53 -16 31
2912 31 70 -16 -34 105 -78 -66 -43 -31 -247 -92 -32 -109 -50 56 -145 -13 -70 -103 131 -75 -87 84 114 -65 -14
2937 -14 -110 97 129 -177 -66 145 22 98 97 -49 -16 -71 54 308 31 12 2 13 -57 31 -48 64 -188 -73 70
2962 70 -110 -260 -152 94 -130 -55 -67 39 -131 -71 -62 50 -134 -201 175 -10 44 -170 74 -18 153 -60 181
2985 181 48 -45 -127 72 -221 130 72 -20 11 -166 56 -71 -141 -33 54 -112 17 158 -73 130 16 -48 286
3008 286 -16 -87 -127 -191 -28 86 37 -42 -83 -116 181 18 -144 172 263 165 107 133 71 -34 -65 -35 -8 -189 52
3033 52 7 -108 109 135 -111 87 -83 -8 -21 231 158 -1 167 60 -74 -143 -25 129 164 51 -90 -47 174
3056 174 -52 -13 -117 146 50 34 267 -18 -29 1 -15 146 26 107 -120 -141 203 4 -220 197 -42 -5 -37
3079c7J75k08J83j6k0P2k7l65J08L17j36q7qM4o1K19j67j26L09j15K1l4N4j49
3103e4M2j07r5K58j55rJ07O5J62k77J67k01QK66l7k1j53P8l6j35J89P8m8J2j01
3128Cm0K1J84r7k20J83j97K4J22%p9l3K88j15q0j8L37m08K2m2K55j36j02M4J13
3153B9K1O0o9k20R6J39n2PR8R6l2j73m5j60J62R2K5J01l06K25q9NJ28p1Q8n3j03
3180aK15k80L08j31n3j93m8K33lJ93j72p1j19K06L7J08j90m6Q8O5j09k00M36m25
3204a52K32j00k09K86j26J65Q1p1j20LL0j04L38j80l23J15O8l1J02J63j42p4j02
3227a51J95%k5O2j36J55o2J75l74O3J0K47r0j47K46l13K56l14L09J25l00KJ03
3250C6R8k26N9M7m0M1r9Q4m6J42p1j43j6J57j5M3o7K6J57r4j70J55Pj14J17r6
$$ plain form
3079 -37 138 -70 113 97 77 149 122 -243 -135 182 46 -41 -49 -5 -66 153 -14 -140 169 54 75 41 95 -54
3103 -54 -12 -119 -214 44 -111 -120 -13 52 214 -63 104 -97 -89 177 140 119 -34 44 8 -127 62 140 92 104 3
3128 3 -37 -16 168 71 -149 34 -163 -139 -17 -17 -96 -129 159 44 -36 -54 283 -125 -103 -145 110 -26 -128 -84 29
3153 29 50 110 41 -179 -83 56 4 11 109 205 173 0 -45 -205 -43 49 74 175 -131 94 5 10 138 67 155 102 -1
3180 -1 214 -66 242 111 58 -135 -183 50 47 240 68 -3 -122 84 121 229 39 -7 81 146 37 -163 273 -152
3204 -152 80 -20 -229 57 -69 96 177 106 -14 -11 19 -85 253 73 -250 -135 -67 -98 4 167 25 -49 -151
3227 -151 44 44 19 81 -55 100 38 213 -161 -98 -88 159 69 -78 168 -145 111 -203 106 231 -69 -67 36
3250 36 134 -92 -33 14 -26 15 -84 0 -46 96 25 -118 -134 23 8 51 -16 10 167 73 -97 58 65 -49 68 -28
3276b8R3j24QJP4L6J45l20Q8j3k21K64m8M0J05m4j70Q6o4J63j40K2l6k8J20Q1
3302I0l24J35K22O6j70k13K76j08J39k32O9J40j30n6J14K7k44Q6J82m6j98J34
3324d1M1J00r0j32L55k00l1P1j30n8L33m06n4K34o8j00L60k00o2O9jq5M3O4l4
3349b2M7l0P6N7N5k02O1k5P5j52Q7m0N5j71J6K55j57p5R2J92l62J70J96j55j17
3374g4p1K15N0j28J76k33J86k15M6p8n4J71P2k03J30L9L7j48L27k8l83J29j82
3397b19J99k6P6L09m43J41j85M4P3J07j62L9J71l2j50J71k98M5K31k01M0O3N7
3420E0k23J00J52L5pr0rK74k49n3r6P0J85l60M91j11r1J86k58nn0Mq6P2J59p7
3446A3n8J52j23pK1Mo9P9K7jj68J66k05J50J46m2p5r6q2K58j02J32R3l53O7N1
$$ plain form
3276 -28 65 -59 -51 -50 24 60 205 -115 -27 -40 -261 3 -45 -5 100 56 -114 -28 -92 71 -69 -47 -83 -111 9 90
3302 90 -234 -99 123 189 19 -194 82 -26 113 -119 -50 90 -40 -96 18 45 -199 -113 69 23 -175 -41
3324 -41 0 100 10 -122 233 33 2 73 -57 -115 218 -188 -242 -8 -76 -176 184 -16 -78 -9 -10 -95 -52 12 -22
3349 -22 25 -5 71 128 183 -19 42 17 92 -60 27 -13 42 -129 -113 142 -15 -90 2 194 -168 2 198 43 -74
3374 -74 -145 70 120 -8 168 -65 121 -94 -48 -126 -180 -9 63 -140 -10 29 66 -82 245 217 -166 -37 -219
3397 -219 -20 -46 30 339 -104 37 -148 -104 -31 76 -86 -47 124 92 -58 113 -185 -140 91 -110 -70 -7 50
3420 50 -173 -73 79 114 107 17 8 282 33 -20 -116 -46 139 -221 270 159 68 254 -4 -9 -59 -55 -141 -69 90 13
3446 13 -45 107 -16 -23 -2 2 -67 12 39 38 -130 36 -169 -19 127 85 10 -86 -168 90 -12 120 213 -140 -73 -22
3472b2l8M0N8j34j48J35K36Q1j57r6K46k33N8j85K31Q6k43Q9J98ml36J52r6L01
3496B19Kl04R2o5Q2q2j0k4O2P2o9M4k6M0j84qK10Ml42L23K80k86k5k1k07K29l3
3523b7o8Q4K41k76J43r7L9J14o6K4j97r3J40K37j33n8j7j19K13j94N3N4O2j10
3547e1J0k01K79O5r8rq6J30O2o7J13j55J45j36J35j40n2L5m0O2o2K5J06P8m4j06
3573bo3p5J99o3M7J4j52J05J20k04J54K9j57q9J67J50k17J09j96P9l5o6k3j3L85
3598B03j76j2k24L32K6j98P0K5J4j05r6J05K46j17J44k49J45j42K8%P5M7j2l66
3622b37J04M3K55k20p1M85l94j56L15n0m5k31L39k14oQ5J02JP7j22M3o7k4J7n6
3647b7J57j90J10j18Q9N1k48K89k33L11k47P5L9m4M4j34J58o1L9j06p2J99k18
$$ plain form
3472 -22 -60 -20 38 -96 -244 -109 127 208 51 -45 201 -32 26 -159 72 158 -85 4 202 198 -138 14 -82 219
3496 219 221 -83 9 -56 26 -56 -66 -90 -28 44 -25 19 -7 33 -151 -159 51 55 -287 36 316 30 5 -16 -223 6 -27
3523 -27 -95 -11 230 -46 97 0 39 153 87 111 -86 -179 -39 198 65 7 -10 -129 84 -110 -57 -3 59 -51
3547 -51 -41 -242 37 102 4 -5 -91 39 101 34 147 -8 137 1 136 -4 -56 -21 -61 1 -61 -36 70 148 104 -2
3573 -2 -65 -140 59 -4 43 57 -95 10 130 -74 80 109 -48 -137 30 180 -37 72 -124 -45 -80 -146 -169 -182 203
3598 203 27 15 -209 123 149 -49 21 46 60 -45 -141 -36 210 93 237 -12 133 -9 19 19 94 141 129 -237
3622 -237 -133 -90 165 -55 -126 359 -35 -191 124 74 29 -202 137 -77 -83 2 104 105 182 60 103 36 12 29 -27
3647 -27 130 -60 50 -68 21 72 -176 113 -120 191 -56 19 58 14 58 -76 82 21 60 -46 -118 81 -137
3670a37K81k82M4J18l5P4kj94L33k64J56op7q0N1J0j90J78j0j20L0J95m3j01l9
3695a10J93j16J67n5j27J15J19k99j08M00k7r6J75j69nj39K31P1j81lj9j6O5k30
3719a64L23k26j8J44j47J59r3L8n6P2qQM9q4k2K29j61K04l01N8j43J87O2j62N0
3744bO0P0j83k3j26J59j08K80l7o9k07M89m61K23m4j52J7M5N8m1j0O1J92k90Q6
3769a3k04K34o5p9J65j5j6r2J65j29N3n0j12J11j4J93l39J75m7K23j61k00N4M0
3793a23J59m4K22k36P4j45K27j48J34k02M0J51k44l0J25J19r1q8J55j06P4j15
3815i2K10j0k22J37K28j34p9j78N1JLJ55q3Q7qN2j16J4K8J06k16J62j74P1M5k74
3841b36j6P2K8J76j13n5J33R2j33M8J06l12O8K18j36nK26l0M5r6n4%j30K10r9
$$ plain form
3670 -137 144 -138 -94 24 -11 63 61 -133 200 -64 92 86 9 -71 -20 -10 -200 -22 -32 -152 -122 73 30 -71 -110
3695 -110 83 -33 134 79 -48 67 186 -113 -221 179 152 56 231 62 57 -82 149 220 39 36 17 1 66 -164
3719 -164 159 -67 -85 59 -88 71 -22 16 -40 32 24 32 81 -3 -25 204 43 247 -54 4 -139 48 110 -52 -2
3744 -2 58 128 -55 -78 -204 -45 -153 127 90 21 -186 303 -158 65 21 -131 -114 -69 -11 -52 -62 -1 191 -99 -13
3769 -13 -217 17 -48 -127 38 23 7 -85 80 -49 4 -46 -158 -47 -61 132 -207 -32 -79 144 -17 -217 -163 -123
3793 -123 36 -8 214 -22 52 -93 134 -14 120 -82 -42 109 -135 -165 -40 79 -12 -100 55 -51 23 -92
3815 -92 118 108 -114 23 251 117 38 -140 -89 -88 -85 70 -13 74 66 118 2 16 44 150 -66 96 -78 -7 38 -236
3841 -236 -252 -180 -152 24 -89 -144 -11 81 -52 -4 102 -210 -142 76 -60 -65 161 131 176 80 26 26 -104 106 7
3866Gj14Q5J19q7Q2r1N1k11L10l39J21J88k38L4J09Qj59K40k25J27o6J68P2j79
3890A2j33J41K24m10J65M8N1m8R5k03J36j26j1J10m4Q1q4J35j37N6J88q1m3K5
3914A47k73P3J06q3o1m0J11Q3P2j80N4K8j05j8J19p6K14l08K68j42k5J26j46j4
3938g0k6J36k63L07k58K19M7o3j57K47K5k40J23J06j50l3N2O0j76J49p1J05J81
3961B50k56q3J92L3j62J0j71k6J39j4J39j8p4q8L48k80nJ91l4k72K90k1j62Q9
3985A5j58L70k45j07r5K19r5K15j75O6j10J59J7l4l2n6R4j42Q7l8JO3k1j34Q3
4010e3J73l2j98JP1Q9j22K1j5J36J30p1k19N3P1K2L7j28Q2j56L13k36J4j13o6
4035a96R6J21J96n28K85r0K09j48P9lo3K78j77j26J94j05j62K02J7l5K3j24K35
$$ plain form
3866 7 -107 -22 97 10 92 1 52 -159 151 -188 -67 121 -117 -83 26 34 -125 115 -110 17 -49 119 191 12
3890 12 -121 20 244 -166 -1 47 98 50 145 -58 78 -48 -59 51 7 88 4 139 2 58 246 165 122 147
3914 147 -126 -53 53 -30 -91 -131 -20 63 135 -45 9 37 -68 -86 33 -43 171 -137 131 -11 -36 90 -56 -70
3938 -70 -96 40 -223 84 -174 45 92 29 -128 119 144 -96 27 133 -17 -50 2 62 -114 35 -36 69 250
3961 250 -6 -89 103 136 -26 -16 -187 -213 -74 -88 51 33 -41 -129 219 -61 -66 125 91 -181 109 88 -74 15
3985 15 -143 227 -18 -125 -220 -1 -96 119 -56 10 -100 59 76 42 10 -46 48 -94 -7 -45 -44 19 -2 -136 -53
4010 -53 120 88 -110 -109 -38 51 -71 -50 -65 71 201 130 -89 -36 35 57 94 -34 48 -108 205 -31 -17 -130 -196
4035 -196 -100 21 217 -311 -26 -116 93 -55 24 21 -42 236 59 -67 127 22 -140 62 79 44 67 -57 178
4058A78j54Q9j26L6o9J7m0J33j80M3J46J03j15j01K9K0Rp7J46k67J95k27L68r7
4082E9N4L0j8J1l50J31J48l6n5n7N1o4k4J49p0N1m2j34J14L5L3lO0q3n8K38J09
4109B79m57K54o4O8l8J12j3j58k4k5J71k26K66j29m1q9J33J39j49rl9J50j11j51
4133a51K46K6q5M0j37J24m0j23l6K39k02M9j15P5K44n4j66q2K9l6l3J82MN7N2
4158A07j71Kk7K02k44K42k10P5J64j31J36k37K6K00j42O6k26J94O7j8M5o2j14
4181e6l5N3M4k9oj50P1j92N9L50k08K30k06J05m9K66k48O2R1j23pL3L8j74o2J0
4207a33J13p3j49L57l12Q0P0K10j51j6j59J51L3j25Q3r3p8P6o6J97p6p3J30J7
4231A3J91j31j5k4P6j84M4J00M5j78k16M89l13R2k76K05K49m30L83o1j29N1q8
$$ plain form
4058 178 24 113 -13 23 -46 -29 -69 64 -116 -73 73 176 61 -40 -11 9 18 -59 87 -180 15 -212 156 59
4082 59 113 143 125 136 -214 -83 65 29 -26 -83 -32 -96 -120 29 -41 10 -32 -166 -52 -17 16 13 73 -10 -68 170 279
4109 279 -178 76 12 80 42 154 141 -17 -41 -66 105 -121 145 16 -25 -114 19 158 9 0 -39 111 0 -151
4133 -151 95 121 36 76 -61 63 23 -100 -136 103 -99 -50 -165 -90 154 100 -66 -148 -119 -155 -188 -6 -2 55 107
4158 107 -64 -62 -89 113 -131 111 -99 -24 140 9 145 -92 -66 134 -8 58 -168 26 93 75 120 58 -56
4181 -56 -91 -38 6 -23 -29 -179 -108 -300 -241 109 -99 131 -75 30 -19 247 -1 61 152 29 22 55 93 -81 -143 -133
4207 -133 -20 -93 -242 115 -197 -117 -47 163 12 -4 -163 -12 21 -104 -21 -114 -192 -116 -182 15 -61 -134 -4 13
4231 13 204 73 58 34 110 -74 -30 70 115 -63 -279 210 -103 -11 -287 -82 167 -263 120 59 -70 -19 -107
4254a07J53j52k8L31l35NJ93J48r8k52K47r3O2J09k49J7q5O2K14M6k63q8J50j33
4278a46J22J13p1J47j64L0J17j48nJ26j1K05l45J77k6k13K46k77J4rQK59l23K58
4302H4k50K62j85J6N0J91k07j03m3L53j25j11J44M2j43L2M4k0K5k0l30L13P5j39
4326d5j66J81j25J93J05j82o6J53j03J52r0QJ7j61J48j8p0Q8J64j63l7q2J30r6
4350f5RMr7J68MJ10qk10P1K9J20j45j42L75k78K3k4N3j77J64M4Ql2J21j78J66
4376A13j38o2K03j93j27J24QJ14k21K11j68J12P6k62j4L10J82l51M3L8J73j58
4398A3J04o7r8K3J62j03J64j59k6O4k18K12q3n6J69j51j38K24q1k5j59J87M0O
4422DR2J42k11K27k13L6M1j93N1j08Q3Q0l9J03%k48N2M7j9n9J94j05J04J3j15
$$ plain form
4254 -107 46 -106 -134 197 -138 -133 60 208 110 -142 105 12 74 183 -66 -49 -134 -72 142 188 -75 -163 -13 -146
4278 -146 -24 89 18 165 1 31 148 0 -5 121 110 315 -30 147 121 -92 154 -123 -109 -118 -110 149 -174 84
4302 84 -166 96 -89 -73 -23 168 -39 -142 -185 168 43 -68 76 118 -25 7 51 31 56 36 -294 19 94 -45
4326 -45 -211 -30 -155 38 143 -39 -105 48 -55 97 7 15 32 -129 19 1 -69 19 183 20 -17 -99 31 -65
4350 -65 -56 -52 -149 19 23 133 125 -85 -14 15 135 -10 -152 223 -55 -32 -56 -3 -180 -16 28 36 4 125 -53 113
4376 113 -25 -87 116 -77 -204 -80 -72 42 -179 32 -136 -24 52 -210 -224 86 268 -83 -40 -2 171 13
4398 13 117 50 -48 -25 137 34 198 39 13 77 -141 71 -12 -68 101 -50 -188 36 -45 -70 -229 -42 -2 4
4422 4 96 238 27 254 41 77 118 -75 -24 -132 -49 31 -8 95 95 -153 -101 -54 -73 -132 62 -43 61 74 -41
4447d1L1q5J58p5J1l4j38J69l8j8J4J81j90J76j52j45K67j64J51k21J87j39J81
4470H6r0J38l30q4K71R2j81M4J72j5j05r8J5k4Q1l0L8P3N5P2k26MQ6Ql16K66J84
4497A86l0O3q0J7j57J38j2j3j60j39L26j41n4l0LK88l69J95o4O2q2j4J60k64M7
4522a24L6P7J66l13J37J65j97J75j87J02j51J42J23n6o9j23m8k9J66Q5Jr5J44
4545A27j79O1K01l18K75k21k1j30L54k07m3K03k65K50R7j56lk09R3K87k23l5P8
4568A6K8k16J86j00J86o4p3L6K8j62o3L29M5q7Q3j91K2Q1r9P9R5l05K32k36J73
4593B3j50L03n6q2k0k11J68l8k1j6N3k1M2J48p0J16l90K78m6j02J16J27j1j53
4617a3k52K62k10J85m1O7M27l13or6m4j72J44J74P0k28K34on5j2j63r9J12O2J12
$$ plain form
4447 -41 -10 -95 63 -12 -1 -35 -173 -4 -42 -60 -46 135 -55 121 -31 -176 91 -73 78 -143 44 -95 86
4470 86 -4 134 -196 -280 -9 83 -98 -54 118 103 -2 -100 -85 -109 -28 -58 -20 53 108 180 -46 -42 44 52 -264 2 186
4497 186 156 219 139 156 -1 137 125 112 -48 -187 139 -2 -56 -86 -83 205 -164 31 -33 29 -53 -67 93 -171 -124
4522 -124 -88 -11 155 -158 -21 144 -53 122 -65 37 -114 28 151 95 26 -97 -145 -174 -8 77 78 -17 127
4545 127 -52 9 210 -108 167 -54 -75 -205 149 -58 -101 102 -163 87 184 28 25 -184 -91 196 -27 -62 16
4568 16 44 -172 14 -86 100 36 -37 -1 27 -135 -198 131 176 89 172 -19 3 84 -15 64 159 -146 86 -150 23
4593 23 -127 176 120 38 18 -193 -25 -63 -84 -100 -47 -68 -26 122 52 168 -222 56 10 -92 24 151 140 -13
4617 -13 -265 -3 -213 -28 -69 -2 425 112 106 10 -34 -206 -62 112 182 -46 188 182 127 115 -48 -147 -35 27 139
4642A39k04N8R8Mnq7j05n1K01K0J45k07PP2j08j47K14K11o9m38K20L1K43j55J5
4667A02nQ8p9P2k64l8O8j88K73R6k57n4R1R2J7N3o5r3L3J39l1nO7l7M2k00J85
4694A02J3K0k21j37K66n5M6o2J8K7NJ21j0p6n5k6%n1m0J85L6j19j13J54j1j65
4720a48O3j37J99J82k47J80l5J94k53j00j29K56o2O2j20J83Q9k51p7P7q5J03K39
4743A83j11p6OK15m7k57J2P5RJ9l5o1J13J14j00j23N3k3J8j45J21q7K51Oj76L3
4769a3J77j25k55O3p3K47J18q7j94N6l4J21J40j30J23j26L6J03m5j55k8l5J15
4792ak07J18L7J15p5JK02n6k74J39J34l17J72K4K12q2j82J44p6p3J52r3r7J29
4816D6j70K28k63J52k47K82p2JK7P4R4l05j8L14r0L3o8K0r4K32k22k9LJ09Jk03
$$ plain form
4642 139 -65 -7 91 95 90 3 -102 -153 48 68 213 6 13 85 -23 -170 44 255 186 -252 -32 -1 242 87 102
4667 102 97 185 106 178 -86 -124 -56 -244 29 125 -132 -186 -95 -3 14 67 2 -91 -58 81 50 45 112 75 117 -83 102
4694 102 115 135 -86 -223 43 -12 34 -28 -10 17 22 143 133 57 2 -24 -24 -75 -115 70 106 -13 -126 28 17 -148
4720 -148 -85 -222 -23 159 -88 92 57 251 -2 -102 -231 25 -37 25 -95 88 177 -74 -151 -74 -159 -56 183
4743 183 72 -4 2 217 170 -87 -75 0 9 28 -7 -68 45 159 59 -64 -11 -34 -16 -161 -40 -127 124 130 -46 -13
4769 -13 164 39 -216 -153 -226 21 139 52 -142 -86 -120 1 141 11 134 8 44 147 102 -53 -81 -116 -1
4792 -1 -208 -90 -53 62 -13 -12 190 134 -140 -1 133 -184 -12 12 224 142 -40 104 28 -45 107 14 -83 46
4816 46 -124 104 -159 -7 -254 28 -44 -43 -16 58 152 -153 -171 143 53 86 18 38 -56 176 -46 -75 -72 37 38 -165
4842a65J09L9P0O8r2j68O2N8N%K21j07j25k10L58l6r6J58j94J5n3K87k77mK7J57
$$ plain form
4842 -165 -56 -17 53 121 29 -139 -77 -19 -14 -14 207 100 -25 -235 123 87 -9 149 -45 -30 -83 204 -73 -77 -50 107
$$ [...]
8191I0
##END NTUPLES=NMR FID
##END=
