##TITLE=1H_DE-80H_X3
 200.13MHz, d2o
 8 sc
 
 19ns.26.2.2025
##JCAMPDX= 6.0         $$ Bruker NMR JCAMP-DX V2.0
##DATA TYPE= NMR FID
##DATA CLASS= NTUPLES
##ORIGIN= UXNMR, Bruker Analytische Messtechnik GmbH
##OWNER= pz
$$ XWIN-NMR		Version 3.5
$$ Thu May 15 16:54:59 2025 Russian Standard Time (UT+4h)  Yarkov@DPX200
##.OBSERVE FREQUENCY= 200.1313
##.OBSERVE NUCLEUS= ^1H
##.DELAY= (6, 6)
##.ACQUISITION MODE= SIMULTANEOUS
##.ACQUISITION SCHEME= undefined
##.AVERAGES= 8
##.DIGITISER RES= 18
##SPECTROMETER/DATA SYSTEM= spect
##.PULSE SEQUENCE= zg30
##.SOLVENT NAME= CDCl3
##.SHIFT REFERENCE= (INTERNAL, CDCl3, 0, 14.3821)
##AUDIT TRAIL= $$ (NUMBER, WHEN, WHO, WHERE, WHAT)
$$ ##TITLE= Audit trail, XWIN-NMR		Version 3.5
$$ ##JCAMPDX= 5.01
$$ ##ORIGIN= Bruker BioSpin GmbH
$$ ##OWNER= Yarkov
$$ C:/Bruker/XWIN-NMR/data/yarkov2/nmr/H-C/1/audita.txt
$$ ##AUDIT TRAIL=  $$ (NUMBER, WHEN, WHO, WHERE, WHAT)
(   1,<2025-05-15 16:53:54.68 +0400>,<Yarkov>,<DPX200>,
      <created by zg, POWCHK disabled, PULCHK disabled
       configuration hash MD5:
       00 E9 B6 7A A2 85 ED C7 34 08 36 98 17 FE 4E 26
       data hash MD5: 16K
       0E D9 2F 0F B2 68 90 4A 14 CC 00 03 5A BE 79 DE>)
$$ ##END=
$$ 
$$ hash MD5
$$ 6C AF 53 42 D7 4C 0C 3E A0 09 B1 11 1B 12 1B 7E
##$RELAX= 
##$RELAX= 
##$RELAX= 
##$RELAX= 
##$RELAX= 
##$RELAX= 
$$ Bruker specific parameters
$$ --------------------------
##$DU= <C:/Bruker/XWIN-NMR>
##$EXPNO= 1
##$NAME= <H-C>
##$PROCNO= 1
##$TYPE= <nmr>
##$USER= <yarkov2>
##$AMP= (0..31)
100 100 100 100 100 100 100 100 100 100 100 100 100 100 100 100 100 100 
100 100 100 100 100 100 100 100 100 100 100 100 100 100 
##$AQSEQ= 0
##$AQ_mod= 1
##$AUNM= <au_zg>
##$AUTOPOS= <>
##$BF1= 200.13
##$BF2= 200.13
##$BF3= 200.13
##$BF4= 200.13
##$BF5= 200.13
##$BF6= 200.13
##$BF7= 200.13
##$BF8= 200.13
##$BYTORDA= 1
##$CFDGTYP= 0
##$CFRGTYP= 5
##$CHEMSTR= <none>
##$CNST= (0..31)
1 1 145 1 1 1 1 1 1 1 1 1 1 1 1 1 1 1 1 1 1 1 1 1 1 1 1 1 1 1 1 1 
##$CPDPRG= <>
##$CPDPRG1= <>
##$CPDPRG2= <>
##$CPDPRG3= <>
##$CPDPRG4= <mlev>
##$CPDPRG5= <mlev>
##$CPDPRG6= <mlev>
##$CPDPRG7= <mlev>
##$CPDPRG8= <mlev>
##$CPDPRGB= <>
##$CPDPRGT= <>
##$D= (0..31)
0 0.7 0 0 0 0 0 0 0 0 0 0.03 0 0 0 0 0 0 0 0 0 0 0 0 0 0 0 0 0 0 0 0 
##$DATE= 1747313634
##$DBL= (0..7)
120 120 120 120 120 120 120 120 
##$DBP= (0..7)
150 150 150 150 150 150 150 150 
##$DBP07= 0
##$DBPNAM0= <>
##$DBPNAM1= <>
##$DBPNAM2= <>
##$DBPNAM3= <>
##$DBPNAM4= <>
##$DBPNAM5= <>
##$DBPNAM6= <>
##$DBPNAM7= <>
##$DBPOAL= (0..7)
0.5 0.5 0.5 0.5 0.5 0.5 0.5 0.5 
##$DBPOFFS= (0..7)
0 0 0 0 0 0 0 0 
##$DE= 6
##$DECBNUC= <off>
##$DECIM= 32
##$DECNUC= <off>
##$DECSTAT= 4
##$DIGMOD= 1
##$DIGTYP= 9
##$DL= (0..7)
0 120 120 120 120 120 120 120 
##$DP= (0..7)
150 150 150 150 150 150 150 150 
##$DP07= 0
##$DPNAME0= <>
##$DPNAME1= <>
##$DPNAME2= <>
##$DPNAME3= <>
##$DPNAME4= <>
##$DPNAME5= <>
##$DPNAME6= <>
##$DPNAME7= <>
##$DPOAL= (0..7)
0.5 0.5 0.5 0.5 0.5 0.5 0.5 0.5 
##$DPOFFS= (0..7)
0 0 0 0 0 0 0 0 
##$DQDMODE= 0
##$DR= 18
##$DS= 0
$$ [...]
##$SUBNAM2= <"">
##$SUBNAM3= <"">
##$SUBNAM4= <"">
##$SUBNAM5= <"">
##$SUBNAM6= <"">
##$SUBNAM7= <"">
##$SUBNAM8= <"">
##$SUBNAM9= <"">
##$SW= 18.0517328524113
##$SWIBOX= (0..15)
0 0 2 0 0 0 0 0 0 0 0 0 0 0 0 0 
##$SW_h= 3612.71676300578
##$TD= 16384
##$TD0= 1
##$TE= 0
##$TE2= 300
##$TE3= 300
##$TEG= 300
##$TL= (0..7)
0 120 120 120 120 120 120 120 
##$TP= (0..7)
150 150 150 150 150 150 150 150 
##$TP07= 0
##$TPNAME0= <>
##$TPNAME1= <>
##$TPNAME2= <>
##$TPNAME3= <>
##$TPNAME4= <>
##$TPNAME5= <>
##$TPNAME6= <>
##$TPNAME7= <>
##$TPOAL= (0..7)
0.5 0.5 0.5 0.5 0.5 0.5 0.5 0.5 
##$TPOFFS= (0..7)
0 0 0 0 0 0 0 0 
##$TUNHIN= 0
##$TUNHOUT= 0
##$TUNXOUT= 0
##$USERA1= <user>
##$USERA2= <user>
##$USERA3= <user>
##$USERA4= <user>
##$USERA5= <user>
##$V9= 5
##$VALIST= <valist>
##$VCLIST= <CCCCCCCCCCCCCCC>
##$VD= 0
##$VDLIST= <DDDDDDDDDDDDDDD>
##$VPLIST= <PPPPPPPPPPPPPPP>
##$VTLIST= <TTTTTTTTTTTTTTT>
##$WBST= 1024
##$WBSW= 4
##$XGAIN= (0..3)
0 0 0 0 
##$XL= 0
##$YL= 0
##$YMAX_a= 35417
##$YMIN_a= -29631
##$ZGOPTNS= <>
##$ZL1= 120
##$ZL2= 120
##$ZL3= 120
##$ZL4= 120
##$ABSF1= 10
##$ABSF2= 0
##$ABSG= 5
##$ABSL= 3
##$ALPHA= 0
##$AQORDER= 0
##$ASSFAC= 0
##$ASSFACI= 0
##$ASSFACX= 0
##$ASSWID= 0
##$AUNMP= <proc_1d>
##$AZFE= 0.1
##$AZFW= 0.1
##$BCFW= 1
##$BC_mod= 2
##$BYTORDP= 1
##$COROFFS= 0
##$CY= 83.5205535888672
##$DATMOD= 1
##$DC= 2
##$DFILT= <>
##$DTYPP= 0
##$F1P= 10.8118882576601
##$F2P= -7.23987719738617
##$FCOR= 0.5
##$FTSIZE= 0
##$FT_mod= 4
##$GAMMA= 1
##$GB= 0.15
##$INTBC= 1
##$INTSCL= 1
##$ISEN= 128
##$LB= 0.25
##$LEV0= 0
##$LPBIN= 0
##$MAXI= 10000
##$MC2= 0
##$MEAN= 0
##$ME_mod= 0
##$MI= 1.114404
##$NCOEF= 0
##$NC_proc= 0
##$NLEV= 6
##$NOISF1= 3.799351
##$NOISF2= 2.8
##$NSP= 1
##$NTH_PI= 0
##$NZP= 0
##$OFFSET= 14.38212
##$PC= 1
##$PHC0= -1331.412
##$PHC1= -7.466247
##$PH_mod= 1
##$PKNL= yes
##$PPARMOD= 0
##$PSCAL= 0
##$PSIGN= 0
##$REVERSE= no
##$SF= 200.129724274929
##$SI= 16384
##$SIGF1= 3
##$SIGF2= 2
##$SINO= 400
##$SIOLD= 16384
##$SREGLST= <1H.CDCl3>
##$SSB= 0
##$STSI= 0
##$STSR= 0
##$SW_p= 3205.1282051282
##$SYMM= 0
##$S_DEV= 0
##$TDeff= 0
##$TDoff= 0
##$TI= <>
##$TILT= no
##$TM1= 0
##$TM2= 0
##$TOPLEV= 0
##$USERP1= <user>
##$USERP2= <user>
##$USERP3= <user>
##$USERP4= <user>
##$USERP5= <user>
##$WDW= 1
##$XDIM= 8192
##$YMAX_p= 0
##$YMIN_p= 0
$$ End of Bruker specific parameters
$$ ---------------------------------
##NTUPLES= NMR FID
##VAR_NAME=  TIME,          FID/REAL,        FID/IMAG
##SYMBOL=    X,             R,               I
##VAR_TYPE=  INDEPENDENT,   DEPENDENT,       DEPENDENT
##VAR_FORM=  AFFN,          ASDF,            ASDF
##VAR_DIM=   8192,          8192,            8192
##UNITS=     SECONDS,       ARBITRARY UNITS, ARBITRARY UNITS
##FACTOR=    0.0002768,     1,               1
##FIRST=     0,             0,               0
##LAST=      2.2672688,     0,               0
##MIN=       0,             -29631,          0
##MAX=       2.2672688,     35417,           0
$$ Real data points
##PAGE= N=1
##DATA TABLE= (X++(R..R)), XYDATA
$$ [...]
735A13J29j82K01q5q2m6l1j87R6M3j04N8q9J4K61k43J43J26j50R8M3o2J42j31
759G5L7M4j71MJ22j40m0Q2l01J81o0J07J21j82J13J24ko8J06n2M9j1n3j12J10
784H3pj1k34K9J90k57M4L8L3OM2o1J26O8l4L4j25K25K1j42p6K8r1J13K1j40J6
811f1j7q7O6qJ8J80j60K9J48j36R0M5j7J0m3N9on1o2N3j08Q7m7j14J46q7J4Q9
839C0j42Q2J38r2J0l3O4L1m6L1q9J00n9q1l8JO4q1k7N0o8qJ35L9m7N4oJ36j66
868a8J59K7j30L4N6k0n5Q1k49K11j60nj0qj15J62N8p0P3r5J16M6j14J29o2k2O3
895H2o5J25j15J8l7j44k1J75p9r9J77J4q4J45p2j9K6L5J26j38J05J6j12L1j39
920d9p2P4J07r5K2Ok5OlnJ12q4L5M4j60J84p0P4l0M1j11N3o8N6p9k9N2q1qL3J79
$$ plain form
735 113 242 60 261 176 94 48 17 -170 -74 -31 -135 -77 -166 -152 109 -134 9 135 -15 83 126 64 206 75
759 75 112 156 -15 -11 111 -29 -69 13 -288 -107 -167 -60 61 -121 -8 116 114 46 152 100 149 138 85 -27 83
784 83 76 65 -169 -140 50 -207 -163 -125 -92 -86 -44 -105 21 89 55 89 -36 189 210 68 -8 20 -71 42 63 -77 -61
811 -61 -78 -165 -99 -107 -89 91 -69 -40 108 -28 62 107 90 100 57 116 110 59 -3 50 -58 29 -18 -132 14 -73 -59 30
839 30 -112 -30 108 16 26 -7 57 88 42 73 -16 84 25 -56 -94 -93 -29 -110 -137 -87 -155 -163 -28 11 -36 18 12 148 -18
868 -18 141 168 38 72 128 108 53 134 -115 96 -64 -69 -79 -87 -202 -40 18 -52 21 -74 42 88 -26 103 41 19 82
895 82 17 142 27 45 8 -136 -157 18 -61 -160 17 31 -53 92 20 1 27 62 188 50 155 171 59 90 -49
920 -49 -121 -47 60 -35 -13 -7 -32 -26 -29 -34 78 -6 29 73 -87 97 27 101 71 112 1 54 -14 42 -37 -66 -14 -95 -103 -70 109
951A09j49r8J41JL7NJ5Q7j53J4M2jm8P7j04O4j24j65J58J4j5M2m0R8m6M6O1Q9
979A57j34O2k9J9m7L1k4m9pJ0k0r2J17j19Q3J01l2q5N6J1n0J61j22K4J68j71P2
1006I1k6j3LL0j29K6j3j12J23n6QJ3n6N7O1l7K7J04n7k9M1L0L6o3l8rl4j30J74
1035B2j22J36p6Q1j05J8j40J35N0M3O8j35L7J27j14m0J49j68J1Q6j15J3m5q8O6
1060a06JO9J8q9M6j2lJ42n2j7M5l8rJ03q3J24j38r0O8N5j03o3R9q1O2P5p8Q6j46
1089a15J18J%J41l7k17Q7K1J5k5k7r7K11j61j1Q2Rl6O8p6K11m6j03P9j78J40J5
1116F9J26k59J12j3p9K3P2j1j06NK0k5m0J70j10M6rl1K8Q6j08J3Q7r8J21j06L5
1143A8J18j74L9J7j05J37j18O9N2m8k8K26r8p2Oj02P7l0L2J05k8m9R1k00J31j11
$$ plain form
951 109 -40 -138 3 4 41 46 61 148 -5 9 51 50 2 79 -25 39 -85 -250 -92 -78 -93 -51 -91 7 -39 7 68 157
979 157 23 85 56 75 28 59 35 -14 -21 -11 -31 -123 -6 -125 -42 59 27 -58 -2 9 -41 120 -2 22 190 19 91
1006 91 65 52 55 85 -44 -18 -31 -143 -20 -76 -68 -55 -111 -54 7 -30 -3 101 44 15 56 86 122 59 21 12 -22 -152 22
1035 22 -100 36 -40 41 -64 -46 -186 -51 -1 42 110 -25 12 139 25 -15 134 -34 -23 63 -52 -39 -84 -172 -106
1060 -106 -105 -36 -18 -107 -61 -73 -76 66 14 -3 42 4 -5 98 15 139 1 -89 -21 34 -69 -132 -33 -114 -52 23 -55 31 -115
1089 -115 3 4 4 145 108 -109 -22 -1 14 -11 -38 -135 76 -85 -96 -14 -5 -41 27 -49 162 116 13 92 -86 54 69
1116 69 195 -64 48 35 -44 -21 51 40 -66 -61 -41 -66 -106 64 -46 0 -9 -40 -12 74 -34 -21 66 -32 89 -17 18
1143 18 136 -38 1 18 -87 50 -68 1 53 5 -23 203 105 33 39 -63 14 -16 16 121 93 44 135 -65 66 -45
1169d5K6j7J42j69J04j24o0J37p7J11j0NJ41o1r5O4l5k7J5j18J12j3o5j8N8j5
1195c4L0MJ8m8J32q6On2P8Q8k26J42l2J48k25J31L4j39l3M3M0l2j3N4j2j06J8
1222g2K4K3Q9r9J6J02j21L5q6K7K08r3q1P5k1n2L1q4Q9p7M8N8p2J9J8pJ57j16
1250C8j42K16j17L8l6J10j49J45q9k1K6k1p8J31m2L2j08J01NJ63k66N6o8O5R4
1275H3j41K22j07k5pk4l8k1Nq4M1J30j01J73r9o3k1J18n8J32j47M8mQ1o7M5n9
1302A2j1l1n8J27j49O8L4M0j3k4k3M1j1JlNlO3j00R8P7j99M3Q2j58J67o6K3j4
1331A8p2L9kO8L1n1j83K57q1L2q2M1J1N2j45L3M5p1n8J93k21K03n1j20J21K4o8
1358c7P7M7r8L6j6j24R9J0k1O7p9J22Kq7K1Pn1L2k03K21q7r0K89m2o3Kk1jQr8
$$ plain form
1169 -45 -19 -36 106 -63 41 -83 -143 -6 -83 28 18 23 164 103 8 72 37 10 25 -93 19 6 -59 -77 -19 -34
1195 -34 -4 0 18 -30 102 16 22 -30 48 136 -90 52 20 168 -57 74 108 -31 -64 -21 19 -13 -26 28 16 -90 -72
1222 -72 -48 -25 64 -35 -19 83 -38 -3 -89 -62 146 53 -28 47 26 -26 5 -79 10 -67 -19 39 -33 -14 4 -3 154 38
1250 38 -104 112 -5 33 -3 107 -42 103 14 -7 19 -2 -80 51 9 41 -67 34 39 202 -64 -8 -76 -11 83
1275 83 -58 164 57 32 25 1 -37 -58 -53 -137 -96 34 -67 106 7 -56 -77 41 -17 115 -32 16 12 93 26 71 12
1302 12 1 -30 -88 39 -110 -42 -8 32 19 -5 -28 13 2 3 0 5 2 65 -35 63 140 -59 -16 66 -92 75 9 32 18
1331 18 -54 -15 -17 51 82 31 -152 105 24 56 -26 15 26 78 -67 -34 11 -60 -118 75 -146 57 6 -114 7 31 -37
1358 -37 40 87 -11 25 9 -115 -16 -6 -27 40 -39 83 85 -2 19 26 -25 7 -196 25 -62 -152 137 95 32 34 13 12 20 -78
1388g8P0K9q3J50o6q0O2Q8j43k0K4J28j41M1Q0l8J1j47J24L6N7q6l5J24q0o1P
1415b7lo9J67j12k8Q3j7K7l4Q7j8j3j07P0l8q1R9Q0k80K15K5M2j82K22j84K8Q2
1442C4j0p2pOj0Q2L5lM1k6J3m6Lj6N6k8o2R2j85P8K1q2J30j7j44J77j99K09qp3
1472a1L7k6k3P3R9q1o9M4n0J4r4N4P7m8n9JJ11J1j08j13K02K1j86K40r7O7q7k8
1500b9J55kj14Lj1o8M9l9N4m4Q2or4P9j09J23j9o3Q4p3J90j68o0J24Pj09k6n5
1528a39J29j2Lm1L0K3N7l7J7M0j8l3j22J19M1n0J31k25J2R8m2k7Q8j14%l7R3J7
1556Ar4l1LJ13J0M4j7k5N8p1J2J5P3j32n3N6J1J67j86N9j6l2L6n8N6L2L4r8j7
1585e0L2J79j44O3o2k9L8K6j07p8J02O8p8J0O5j15Q9m0J3N8p6O6l9r6N9K6Q3o6
$$ plain form
1388 -78 -8 21 -62 88 22 -58 4 92 -51 -71 -47 81 -60 -19 61 23 34 -113 11 47 104 18 -17 107 27 -34 -27
1415 -27 -30 -99 68 -44 -72 11 -6 21 -13 74 56 43 -64 6 -32 -113 -14 66 -214 1 26 68 -114 108 -76 -48 34
1442 34 24 -48 -55 -49 -59 23 58 55 96 70 83 37 40 24 80 52 -10 82 -103 -25 -4 -86 44 27 -117 60 -139 70 62 -11
1472 -11 26 0 -23 50 149 68 -1 43 -7 7 -87 -33 44 -4 -63 -62 49 60 -48 -161 41 62 -124 116 19 86 -1 -29
1500 -29 126 124 10 13 2 -66 -17 -56 -2 -46 36 30 -64 15 -94 29 10 -53 31 -42 148 -20 -80 44 51 -58 -84 -139
1528 -139 -10 -22 -19 -60 -30 -7 50 13 30 70 52 19 -103 16 57 7 138 -87 -75 23 -19 -46 42 -72 -72 -109 -16 1
1556 1 -93 -124 -121 -8 2 46 29 4 62 -9 3 18 91 -41 -94 -38 -27 140 -46 13 -3 -35 1 -57 -1 31 65 -33 -50
1585 -50 -18 161 17 80 18 -11 27 53 -54 -132 -30 38 -40 -30 35 -80 9 -31 -18 40 -36 30 -9 -105 -46 -20 63 -3
1613cN2j43K21k40O3K7n3j1P7l5m2P2p0K37j29M1N8j25m8J49j73J17k0J8q1R9
1639E8j04N9J3k3p9R2j03N2K4k0K8l2J15rj34R1nO9j5j54J17mq7J32n3l5M1m5
1667a1JK4j16M8J33q6j6L3J5J16j57j1R0m5j7Qm5O8q4N3J7j19O7k1P7N9q2j8k4
1696d3J5O9k2J7K8j1Mp8J04p2Q7n0k1MN0j09r6O8l7J96k7lm7o9J08k05J09O4q7
1725e4P1mJ09k18j4J91o1o0M4l6J03j88J01Q4k3j3n9M6j6K1O6l2j29J2K8J52j37
1752a6J12l0m3Nl8O6r2j6N4J6m8KQQ3q3Q1j89J04Rk2M1o6O9l8Plk7k3J15j01J66
1783A03r3m6J22l9L3J5q4N2n0J14k11J76n4k0O6j10j29J64M0o0L3m0P7N0j54N8
1809A3j4rJ33k9m6l6L7mj0J02j50O1L5l3O8kq5L8l6J5n8O4n1L0l5j4J2K7j33J20
$$ plain form
1613 -3 49 -94 127 -113 -50 -23 -76 -87 -10 -45 -87 -15 -85 152 23 64 122 -3 -51 98 -75 42 22 40 -41 58
1639 58 -46 13 26 3 -76 16 -87 -35 -11 -31 -3 -35 80 71 -63 28 23 92 77 -77 40 36 -51 81 28 -7 34 -11
1667 -11 -10 14 -102 -54 79 -7 -23 10 25 141 -16 -27 63 18 1 9 -36 32 -52 1 18 -101 -34 -55 22 81 -1 -19 -43
1696 -43 -28 41 19 36 64 53 57 -21 83 11 98 48 27 31 81 -28 -124 -56 -93 103 76 73 26 -43 65 -140 -31 33 -54
1725 -54 17 13 122 -96 -110 81 20 -40 4 -32 71 -117 -16 68 45 32 -27 19 3 24 90 58 -71 -59 -31 121 -16
1752 -16 96 66 23 28 -10 56 -36 -52 2 18 -30 -28 -20 63 -20 61 -128 -24 -15 -37 4 -62 7 -31 -24 -27 -54 -77 38 -63 103
1783 103 10 -36 86 47 80 95 11 63 13 127 -84 92 38 18 84 -26 -155 9 49 -11 22 -18 59 109 -45 13
1809 13 -1 -10 123 94 48 12 49 45 35 137 -13 48 83 50 118 116 31 69 33 48 -10 54 3 33 -2 -16 -4 23 -110 10
1839A0j05O3LK3N3k4Rk0k9O4O9q7l7m4pJ76o2j21P3n6J8L2m8O8l9P0l8q2J32o5
1869aQ7j04J9R0j2j65Q3R7p2k6n1J33j17J37q4k2j0R3j05r3J87Mj04L5l4J16r3
1896a2m3M5l8P2nK9qO0n6l8j41K0J99J9j08o2J14O1n7j5J08j60j71Q4N7J5M0M8
1924E7o9K0J15j38P9p8L0O1k6o4J26j05o9q1J48J7M1l8J9p2J19q0J4M2j2M2q3
1951A5j9M8J07j81K1J3r6J56p6K0k9M8k3m7R8J1q2m3J32M7k15n8M7J0M1N1QL0
1979C4K1j1p1l7M2L5R5k04J20l0n2R0r7J1j9J13l2o2J75l5j29o5P4Lo7J06q8P7
2007cmK9r4M1p1L6M4KM6j10P4R5r9l2L9o7J18j29J80o0l7r0l5J53lm4NJ2Q3J3
2037I2j0j20J12m4J9j9O2p8o2J5O8L0j36P4pP3m8jJ9j02J20j27Jm2J87r7K4K9
$$ plain form
1839 10 -95 -32 -29 -6 47 23 32 12 -17 47 116 29 -8 -52 -59 117 55 -66 7 -49 -31 1 -47 21 -18 52 14 -68 64 -1
1869 -1 86 -18 1 91 79 -86 -3 94 22 -4 -55 78 -39 98 14 -8 -18 75 -30 -123 64 68 -36 -1 -35 81 -12
1896 -12 -55 -10 -48 24 19 48 40 100 44 6 -135 -115 84 103 -5 -67 47 108 51 36 144 -16 -187 -103 -46 -31 9 57
1924 57 -12 8 123 -15 64 -14 16 77 51 -13 113 8 -61 -142 6 23 64 26 45 -27 92 12 26 68 56 98 15
1951 15 -4 44 151 -30 -9 4 -92 64 -12 8 -21 27 4 -43 55 66 -16 -59 73 120 -95 -153 -106 -96 -55 -4 4 34
1979 34 55 44 -27 -64 -22 13 108 -96 24 -6 -58 32 -65 -54 -73 40 8 -54 121 86 -43 -108 -34 -31 -98 8 -80 -3
2007 -3 -7 22 -72 -31 -102 -66 -22 -20 26 -84 -10 85 -14 -46 -7 -74 44 -85 95 35 -2 -92 -127 26 23 -21 -16 -4 79 92
2037 92 82 -38 74 30 49 30 92 14 -48 -33 35 65 -71 3 -4 69 21 20 39 -63 57 -70 -69 -111 76 -21 3 32
2065C2k1Q4j23K6Jpj0J11j64K25j52k1jL6K0k2J11r1L1N1k9l3Lr4N0L1p0J1m6
2094f1l2lO7M8J9k7n3m0M8M0l2O0K6o7P5j05N4J9j8k3O0k6K7OM5k3Jq4n2P4J5
2125C8pn7KR4j9n7K9J9l3r2P8K0o4J35j52k9J28K0m6M6j39J48%r5j5J6J51j78
2153e9P9kq4PQ1m9M2N3m2j47N9J16lk3j26J06M3l4q2L3K9L1m0k5M0qr7K1J00l0
2183a1P3j00P9j32J05p8L0Q8j15K0P1K7j98J87l3P9j25L0Q5l1l0j01N3n5P1J8
2209GR6r1l3L8L6j35rK24j54m%k7%l3n4N8J38p9J4Q5j76R3m0Q5n9J5K2jL5j06
2239e5j0N5P2j87J01K2N7l0r4Q6k1J3n5J25M2j16k3l6k0P8o2M2J89j02n8M3j40
2266h4K14j65P2o0J2QOm9J01r8pK5J04m6pJ8j25P8N8p0J16j24rp6M7O2n4qR1j12
$$ plain form
2065 32 11 95 -28 -2 -1 -8 -18 93 -71 154 2 -19 -20 16 36 14 125 34 65 116 87 54 57 -37 13 44 -26 -15 -61
2094 -61 -93 -96 -29 19 38 11 -42 -82 -34 6 -26 34 60 -7 68 -37 17 36 18 -5 55 29 56 62 107 84 85 1 -51 23 38
2125 38 31 -26 -24 70 51 -6 23 42 9 -83 -5 15 -49 86 -66 -95 33 53 7 53 -86 62 62 -33 -48 -32 119 -59
2153 -59 20 18 -66 -59 22 -27 15 68 26 -121 -62 54 51 28 -98 8 51 17 -65 -32 -3 28 -12 -37 3 -5 -102 -81 19 -11
2183 -11 62 -38 41 -91 14 -64 -34 54 -61 -41 30 57 -141 46 13 92 -33 -3 82 51 21 -80 -27 -82 -11 7
2209 7 103 12 -21 17 53 -82 -91 133 -21 -25 -25 -52 -52 -85 -139 -81 57 -22 -8 77 -99 -6 -46 39 -20 -5 17 16 51 -55
2239 -55 -65 -10 62 -125 -24 -2 55 25 -69 17 -4 9 -46 79 121 5 -18 -54 -74 4 -58 -16 173 71 13 56 -84
2266 -84 130 -35 37 -23 -11 -3 3 -46 55 -43 -50 -25 79 33 26 44 -81 -3 55 -15 101 -23 -32 -108 -61 1 -53 -61 30 -82
2296h2N6P3J9j51R4p3O5N0Jl8l9M6o8k0M3o4O8K6J12o2l1p4O0L9r3N8k3Q0j02
2325c0J01j25O6k3r7LJ04l1Q4M4j03K5PNo9M3L5o2J4l5L3R7j40J07m1l6m8MN3
2354a5J31k90K22m9p4M9Q3n6K7O0k22J11N4j73J12m0J56j31K2O2Kk0j1K8n8ML4
2381A8O7j26N3r6R3j8j6j6M5n6J34j50Q4k7L8n7O2k5l0l2J19ll8o7J41j15Q1j3
2409E0m9l3M6mO0r0K7O0m0no4K9J4K9K3o4J7n0J23j02l6j1L2pl0J15r0J40j50
2438f0P3q4J38j17P4Km1L6J7p9Q4o1J38k05J33n1p2J29n2q0P5J3k2m9oO9o2J30
2466G0j72K07k26J27km6k4K1J15j5m9p7O9l2KK6Q7m9nk4J6qn0KQ1m2O8K7j74Q9
2496A2l0J1J18j04Jnm7R4n2j6L4l6N1N6j1K5p1l4K0k4j3O1j8Nr7M2l9J37p6j2
$$ plain form
2296 -82 -26 47 66 -85 9 -64 1 51 52 14 -25 21 -47 -67 -24 -88 -20 6 118 56 25 -49 11 50 -43 15 -8 72 -30
2325 -30 71 -54 12 -11 -108 -105 -1 -32 52 96 -7 18 25 30 -39 4 39 -23 -9 -44 -11 86 -54 53 12 -24 -72 -68 -15
2354 -15 116 -174 48 -1 -75 -26 57 1 28 88 -134 -23 31 -142 -30 -70 86 -45 -23 39 41 21 10 38 -20 -16 18
2381 18 85 -41 12 -84 9 -9 -25 -41 4 -52 82 -68 16 -11 27 -30 32 7 -23 -55 64 61 23 -44 97 -18 63 50
2409 50 1 -32 14 10 70 -20 7 67 27 22 -42 -13 1 30 53 -11 6 -44 79 -23 -59 -70 -38 -45 -75 40 -50 90 -60
2438 -60 13 -71 67 -50 24 26 -15 21 38 -41 43 -18 120 -85 48 -3 -75 54 2 -78 -3 10 -12 -61 -67 2 -60 70
2466 70 -102 105 -121 6 4 -42 -66 -45 70 55 6 -71 -2 -34 -32 -6 81 32 27 3 19 11 -39 -37 44 2 70 97 -77 12
2496 12 -18 -7 111 7 8 3 -44 50 -2 -18 16 -20 31 87 76 101 30 -4 16 -8 -21 40 22 27 -70 -28 -67 70 -6 -18
2526a8M6k7j04K6J30P7r5q0M8k5J41j15%L9r5P1l9M8j9n5P5O6p8M1q0Lm3J27l6
2555B9Q7j53N2M2j26J03p2K4j0k1M1P9j32N4%K2kp8M1k2K9Q4j4j0p2J3N2k1K1
2584D0j26J09O7p1r2K02o6j18Q4pKJ36k06K5O7m6n4l6N0P4q0j33K28l9n9Q2%n5
2612b2q0N8m8N4N5J1K3o8J05j62J13p9O9n1Ol5L5K4ln5K8O0j9l2L9R1o4pp5m1
2642g0R0K6o3K0j7m7J35r5K4q5P6o9Q0j0l2O4ok1MJ41j41Qk9N0nJ13j75j7J24
2671G3k19K30p4N3l9j06N5%l0j2M1K0p5l8J45r1QO8Q8k45J41%K1k4k6K4O1p6N3
2700B6J1Q8q5j15L6r8J23J4R3j46P3k9j4K15p3j27J1J7J8Kn0Q8o2oM2j27j0L4
2728e1J38j50Q0p2O0J4K8o4J0P7j07%nK6O2j23o0R6P1j06L5J7L7P4l9j26R8J9
$$ plain form
2526 -18 28 1 -103 -77 53 130 35 -45 3 -22 119 4 4 43 -52 19 -20 28 9 -46 29 95 17 58 -22 -19 -62 65 29
2555 29 116 -37 15 57 -69 34 -38 -14 -24 -45 -4 75 -57 -3 -3 19 17 -61 -20 -42 -13 71 57 47 -25 -12 40 19 40
2584 40 -86 23 90 19 -73 129 63 -55 29 22 24 160 -46 -21 46 0 -54 -90 -40 34 -46 -179 49 10 -49 33 33 -22
2612 -22 -102 -44 -92 -38 17 28 51 -17 88 -74 39 -40 29 -22 -16 -51 -16 8 5 -50 -22 38 19 -13 26 117 53 46 -29 -70
2642 -70 20 46 -17 3 -14 -61 74 -21 3 -82 -6 -75 5 -5 -37 27 21 0 4 145 4 12 -17 33 28 141 -34 -51 73
2671 73 -146 84 10 63 24 -82 -27 -27 -57 -69 -28 -8 -83 -121 24 -67 -59 9 97 -148 -7 -7 14 -10 -36 -12 49 -27 26
2700 26 37 125 40 -75 -39 -137 -14 0 93 -53 20 -9 -23 192 119 -8 3 20 38 40 -10 78 16 10 52 -75 -85 -51
2728 -51 87 -63 17 -55 5 19 47 -17 -7 70 -37 -37 -42 -16 46 -77 -137 -41 30 -76 -41 -24 13 87 48 -78 20 39
2756C9k0q5%J89j20kj7l4j1J01l0K5j7Q8j52n3N4N1N0j08R7q9Q4j47J50ML8P3
2784A58k14J87j48j9L1R1j18J22j23J07j16P2k3Q3j23L7K17j81Lm0p8J09k9r6
2808i1J76j45L3N6M1J8o1QKq8m2J42pqj8k2R4n9j03J71q3J9J0q0L1Q4P0j58R2
2837H2n8nrk1J19j55k1J51q6J1j03J14k7m1j5O1j31Q5M8mK8m4O5j44J60q4q6Q4
2865b6M2j5lk3k7L7j1k4%P2%j47J44p9J23q1M0op6M7M6%n6K5k8PO0m3k2l9N1l0
2897d2k1J94m8l3N7k05J01J16j15Mm9o0R2J06p5K2j50K4J23K0%M4O9k52J11R5
2923A28r8kj6Lk8Q3j36J73r8K3Ko2K9P7o8r2J33o7j5qqJ3M0j9j9k3m6Q0o7L4M3
2954a1J8P2m6l3m8P0j7n8j0J09n9j42J91n5n2J03n9M0J0R1j94M1m9N9J2K2m4o4
$$ plain form
2756 39 19 -66 -66 123 3 1 -16 -50 -61 40 10 35 18 106 -46 -99 -45 6 56 -52 45 -44 40 -107 43 47 85 158
2784 158 -56 131 -17 -36 -5 86 -32 90 -33 74 -42 30 7 90 -33 4 221 40 43 3 -75 34 5 -91
2808 -91 85 -60 -27 29 70 88 27 35 37 -51 -93 49 42 34 16 -6 88 29 -74 97 14 33 43 -37 -6 78 148 -10 82
2837 82 24 19 10 -11 108 -47 -68 83 -3 8 -95 19 -8 -49 -64 -3 -134 -49 -1 -5 23 -21 44 -100 60 -24 -110 -26
2865 -26 16 1 -2 -25 -52 -15 -26 -50 -50 22 22 -125 19 -60 63 -18 22 16 -60 -13 33 33 -23 2 -26 -19 41 -2 -24 -63 -12 -42
2897 -42 -63 131 83 50 107 -98 3 119 4 8 -41 -101 -9 97 22 44 -106 -82 41 61 61 105 174 -78 33 128
2923 128 30 28 12 15 -13 70 -66 107 9 32 34 -28 1 78 10 -82 51 -16 -31 -39 -47 -34 6 -13 -32 -55 -101 -21 -88 -54 -11
2954 -11 7 79 33 0 -48 22 5 -53 -63 46 -13 -155 36 -19 -71 32 -27 13 23 114 -80 -39 -88 -29 -17 5 -39 -103
2982a03J64o7J3j16J65j19O1pMO1o0L5ON7k10J27L2k2j5J9r7J65o7p0J32j60L4
3009c8O5j3Q9j16L0n0p2P8L8J11j31o8M8O6j4k2P3p1p2Q5K3J8l9m0J77j44LK3
3037C7Nm8J7p7R2J0j3L1r5L3o9jJ12l2j2p0r8P1O9J56j68J1L5R1k5k13K16j4m1
3066A0p1L7N3P9j46J0Oj3J04p3K2m0n8j0O0R1o5On0nR5jj9RN0k8j60K14j71M7
3096a7R8n1r0j3R3r0J7J1R7p6q1Q2L0J0oj1m5Q7r5P3J1q9J63J4n9NJ4j19j34J36
3126c5L5j12RJ25p8Q5J7m5K3oN1l7j4j53J12l0q0J98j05Q4N9k6m8l2Q1J0r3N3
3154D8p4R9j09R5n2m1J23j11J7o0m3J07K9On0O1k4jq9P6J0q0J5k0Q9q6j6N1L5
3183Ej2L5k2%q9M7Ll9P5N9l9q8j07R5k0J66k0k9q2M8J9L4j1L0o9j2m5Q6p8P1k7
$$ plain form
2982 -103 61 -6 7 -109 56 -63 -2 -9 -5 56 -4 31 37 94 -116 11 43 21 6 25 -72 93 26 -44 88 -72 -38
3009 -38 27 14 103 -13 17 -33 -105 -27 11 122 -9 -77 -29 37 23 1 74 3 -69 16 39 57 18 -22 155 11 14 37
3037 37 42 -6 11 -66 26 36 23 54 -41 -8 -77 -78 34 2 -10 -80 -178 -107 -38 118 -50 -39 -4 87 62 -151 65 51 10
3066 10 -61 -24 29 108 -38 -28 -22 -35 69 -4 18 -22 -80 -90 -30 61 -4 2 -48 -53 42 41 22 31 81 53 -107 107 -64 -17
3096 -17 81 30 -60 -73 20 -70 -53 -42 55 -21 -102 -20 10 20 14 3 -42 45 -50 23 34 -55 108 122 63 68 82 -37 -171 -35
3126 -35 0 -112 -103 22 -56 29 46 1 24 18 69 32 18 -135 -23 -53 -133 65 -40 44 103 77 29 -3 78 88 -5 48
3154 48 -26 73 -36 59 7 -34 89 -22 -5 -65 -108 -1 28 34 -16 45 21 20 -69 7 17 -63 -48 -68 21 -65 -81 -30 5
3183 5 -7 28 6 6 -83 -36 -33 -72 3 62 23 -65 -172 -77 -97 69 49 20 -62 -14 5 39 28 58 -11 -23 -68 18 -60 11 -16
3214a6q8J08J7J8m4M1m2N5j11Q7q5P3p5K8k9k5R6J29j74R2r0LJ2o0J43o1o3j5
3242g6J01m3n2L8j1J73o3k01J19O7r6K8O1P0n2j41K10j00M4j74J0K20j10J00k35
3267a13J65j72J25oK5M4l3j12J18n3k9R0q0N1p7M8O5l4j34J40j08LR4p8P9N0o4
3294DrR9p3r8J74j86P2J46r5qo9K8P6r7o7L5K8P4OK7J2m3p7%Q0L3j86J13j2L1
3324A8k8lL9n9Rm2J67j19K2l5o6J49j85K25r0lJ26j2p9K7p4R0m5Q8j08Kn7m7M6
3353d4p3K11j10nqj3Q7n2Lj8k7J18n2jp2O7%P6O0j15n0j12J85m2R5j66k2O8M1
3382B9J21j42N5k8j19k0J55j30M5L5J7j3K9j73J31O8r4M0O5m4p5J37j39l6K20
3407A34l0j2j43K5l3R8L5j25K3o5J32o2m3LJ36l1j00P1n4j57J89R1j41n5L9J46
$$ plain form
3214 -16 -104 4 21 39 -5 36 -6 49 -62 25 -60 13 -62 -34 -63 -88 8 137 -37 55 -35 -32 -20 -80 63 2 -61 -76
3242 -76 25 -18 -70 -32 -43 130 67 -134 -15 52 -44 -16 45 115 63 -78 132 32 76 -98 -88 132 22 122 -113
3267 -113 52 -120 5 -1 24 68 35 -77 41 -12 -41 49 -31 20 -57 -9 56 22 -112 28 -80 -77 17 -61 18 68 4
3294 4 -5 94 21 -77 97 -89 -17 129 34 26 -43 -15 61 -36 -103 -68 -40 34 40 67 79 36 -41 -41 39 72 -114 -1 -13 18
3324 18 -10 -13 26 -33 -24 -66 101 -18 4 -31 -97 52 -133 92 2 -1 125 113 34 61 -13 77 32 120 12 14 -43 -90 -44
3353 -44 -117 94 -16 -21 -29 -42 45 -7 -4 -22 -49 69 17 16 -56 11 11 87 147 32 -18 -130 55 13 108 -58 -80 -12 29
3382 29 150 8 63 35 -84 -104 51 -79 -34 1 18 5 34 -139 -8 60 -34 6 71 27 -48 89 -50 -86 134
3407 134 104 92 -51 -26 -59 39 74 -51 -28 -93 39 -23 -66 -63 73 42 -58 13 -41 -198 -9 82 -59 -114 -75 71
3433G1p9r6J46m2p5J50j02m9J56n8r4J8M9r0J67j09j4J25k8k0j9r6J49q5N2m1
3459a4J38j98Q0O3nm6J9j49J51mJ42k75n1J51P8p2K9J50p0j32ml1O1k3N7J9n3
3486A1l7J52j87J19L0p6J0K6m4O0nl6k4j04K5J53l2k2o6O7O4j56M7J29l5q4J3
3513bj2j2l7K0k6N9K5o7Q7j07J34l9j7q9J80j10l2lM1M2Kj03L7K5J7J30j72KL9
3542A2p5j0J60j7m3M6m6m4Q6o2qo4P0J36j32k2p8K03n0r7R8p3K0k7M0p4M3N7l0
3571A9k1l3l5P5o8K2K0p1K9j0K33k53R0J29r5M6o8k6K5R2rj0m3Mj65J94Rq1j8
3600a9p5J24j59M5J12m1P5Qp9j9N8j39M0Q6L4r0Q6J16j78J1n0J02q6m9K9J08o3
3627a3K6J3L0l8jq6J06o0nL5n4P9q0QN3j31K37j46j6J40j03j2M7k3R4n4J4m5l3
$$ plain form
3433 71 -8 -104 42 0 -75 75 -27 -76 80 22 -72 -54 -5 -95 72 -37 -51 74 46 26 7 -89 60 -25 27 -14
3459 -14 124 -74 6 69 64 18 37 -112 39 35 177 -98 -149 2 80 8 37 187 117 -15 -19 -50 11 -12 45 64 11
3486 11 -26 126 -61 58 88 12 22 48 4 64 59 23 -1 -105 -80 73 41 19 -47 20 84 -72 -25 104 69 -15 -2
3513 -2 -14 -26 -63 -43 -69 -10 15 -52 35 -72 62 23 6 -83 97 -13 -45 -48 -7 35 37 -66 -29 -4 13 143 -29 -27 12
3542 12 -63 -73 87 70 27 73 27 -17 69 7 -1 -65 5 141 9 -13 -91 112 62 -35 63 -10 10 -17 23 -51 -8 49 19
3571 19 -2 -35 -70 5 -63 -41 -21 -92 -63 -73 160 -93 -3 126 31 77 9 -17 8 100 91 81 38 42 -123 71 80 -1 -19
3600 -19 -94 30 -129 -84 28 -13 62 70 -9 -28 30 -109 -69 17 51 -39 47 163 -15 -4 -54 48 -38 -87 -58 50 -13
3627 -13 13 26 56 18 17 -69 37 -23 -28 7 -47 32 -48 -40 13 -118 119 -27 -43 97 -6 -18 29 6 100 46 60 15 -18
3656a8n8jJ07q5nO2R6j38p4N3K07k94J03R2r2J14o9L7QJ18j64O4p2n4J01n3L6
3683B1RO8p2j07o2J99j10N0p2J06Mj12K04j20k2k2rJ75j81N4N6k7r6J64m5n3O
3710FO0jl4j3NJ0P1p8j25J73q1n2J03l6J6q3O8j25J15o5M8L1m3J4J10k9j7k8l2
3739a2J27j74q0J22qp7J9J51j08kJ15K6q4l8JJ6J27m7m2j32J5QQ5%K2j20J47q5
3767b8R9n6J5j20nN8K2k7j7Q5J7n1k4P1n6J7M4m3QjN2p2l5%K1jP7q8M7p8R3kJ4
3800C6l2J9P7r6M0r5J01K7j22O0o0j17J94q8q3J40M5N0m0m5rk2o2QK2Q7r8P0l9
3829c2m1N8N5kP5r1l9N9L0p4k8P0k4o6J16MM0o1j6P2J5r7m5pNJ19m6OJ1r3J32
3860A05p7j18m2J47o4O9o4K2m2J41j68J24j7j2M5M6l3k7o2l9O7ql3l0Q2J4j9j6
$$ plain form
3656 -18 -76 -77 30 -55 -60 2 98 -40 -114 -61 146 -148 -45 47 -45 69 0 37 45 163 -1 63 -9 -63 38 -15 21
3683 21 30 98 26 -81 -143 56 -54 -4 -76 30 34 -78 126 6 -16 -38 -47 128 -53 1 57 30 -66 98 53 0 6
3710 6 66 65 31 18 23 33 104 26 -99 74 -7 -59 44 8 24 -59 9 -116 -1 -66 -18 13 -30 -16 94 65 48 20 -12
3739 -12 115 -59 -139 -17 -25 -102 -83 68 -40 -42 73 99 15 -23 -22 -6 121 74 32 -100 -85 -77 8 8 30 -90 57 -28
3767 -28 71 15 30 -90 -95 -37 -15 -42 -59 26 43 -8 -32 39 -17 0 44 1 9 8 60 -12 -47 -47 -26 -27 50 -38 9 -69 24 22 36
3800 36 4 23 100 4 44 -51 50 77 -45 15 -45 -162 32 -56 -139 1 46 96 56 11 2 -20 -82 -74 -52 35 -63 7 -32
3829 -32 -73 -15 40 38 113 22 -17 42 72 -2 -30 40 16 -50 66 70 110 49 33 105 120 23 -22 -29 -24 95 49 55 66 -27 105
3860 105 28 -90 -132 15 -49 20 -44 -22 -64 77 -91 33 16 4 49 95 62 35 -27 -66 1 -7 -40 -70 12 26 7 -9
3888ij8q3O2N9M5k3j1J2N5p9l0N9lr3N8P0j39M3M1k2oN6N7n2m0J1L7j16O4K4P2
3919A01q6J28j88M1J9m8M3j5j0M9PN6r4J31j42j6J2N5Oo8O7n7N5k4K9K8j03l5
3947e9k5J9M1m4M8j1K5k6M6j16P3K9O4o7J37j38LN5m8k6M9n3m5Q3k3m6J70n6P0
3976A29k72Q0K52j44n0O0j23J01o1Q1p9Nj05J97o3RN4j16M2r8O4N8O2o5m5Q8j4
4003D7k1p0L6L2oj38R6O4j12O4R5J6q6rM3k6k0k2J55j42Jl7K7J0n5J6p3J42l3
4032fM0k5m2l1M7P8M9j81J34j9o8Kl1P2Kj00R0L8L0r1n6J46j60J09q4J58m2q3
4060b4j3%J5qj3R6j13M9O0p6J91j09P6j95J13j25J35Nj20J55j18k0J17M1l7k1
4086F1Ll1J3j10RM3k5K8M1j08j2J48jj38K6J45j05j0K9o4Q5o3P5n8j5K5j41K06
$$ plain form
3888 -9 -27 -110 -48 11 56 33 22 34 89 10 -20 39 36 -57 1 71 -68 -25 16 -6 -12 44 101 49 9 20 57 -59 5 29 101
3919 101 15 143 -45 -4 15 -33 10 -5 -15 34 41 97 3 134 -8 -24 -12 43 49 -19 48 -9 46 22 51 79 -24 -59
3947 -59 -84 -65 -24 -68 -20 -31 -6 -32 14 -102 -29 0 64 -3 134 -4 -1 54 6 -20 29 -24 -69 14 -9 -55 115 59 129
3976 129 -143 -63 189 45 -5 55 -68 33 -28 53 -26 -21 -126 71 8 17 71 -45 -3 -101 -37 21 83 18 -27 61 47
4003 47 26 -44 -8 24 18 -120 -24 40 -72 -8 87 103 17 8 51 25 5 -17 138 -4 -3 -40 -13 -3 -58 -42 -115 27 -6
4032 -6 34 9 -33 -64 -17 61 110 -71 63 44 -24 -22 -53 19 21 -79 11 49 79 -12 -68 78 -82 27 -57 101 59 -24
4060 -24 -37 -37 -22 -30 -43 53 -60 -11 49 -27 164 55 131 -64 49 -76 59 64 -56 99 -19 -39 78 119 82 61
4086 61 64 33 46 -64 -55 -12 -37 -9 32 -76 -88 60 59 -79 -53 92 -13 -23 6 -58 27 -36 39 -19 -34 -9 -150 56
4114E6j19K9M1J16r9j8rn0%R7K7mj78J00N8O3j00N4J8j78J44J2Q3o9j09P5K4o6
4142bJ3q5J71m6n0M8j0j04L6K8P7j13N2k5k3L6R6j13l1J09pl0j9p5Q6O2j31O3
4170A3M0m8L8m7L1lJ4p2N3k2Pl3O3M5j46n0K01j05j49J47N1n6j10J26Q8m6ro9
4198d8J32j51J38J6n8%j28K3N5J1M8oN5r3j30J18J21k02J89j30R4q1o7P4Mp6P9
4225a3J5q7J3M5K8M2j20R5o1L9J8pL4l0j17P1Q0j71J67l4N2j44J68m7o8l0ll6
4253a01J44k3p4L0M1m2N4j9j00J60m0J0N9j08J4j05J48p3K1J16j07j01k8P4O5
4278A5jOr3J50o0j9m5J1R2n4O7j24L9j7M3pj4J8k5N7Oj04Q9p8o1K54m5l1l3%j20
4309h4J61p2j22J04R7r5J9j2K2q4R3j25J53Pp6M6j0QM1j40O9K2oQ6m9k0M4omj52
$$ plain form
4114 56 -63 -34 7 123 24 6 -3 -53 -53 44 71 67 -111 -11 47 110 10 64 82 -96 48 60 143 74 -35 40 64 -2
4142 -2 11 -74 97 51 1 49 39 -65 -29 -1 76 -37 15 -10 -33 3 99 -14 -45 64 57 27 8 -67 19 81 -50 13
4170 13 53 5 43 -4 27 24 38 -34 19 -3 4 -29 34 79 -67 -117 84 -21 -170 -23 28 -28 -138 -12 76 30 21 -48
4198 -48 84 -67 71 87 29 29 -99 -76 -21 -10 38 32 87 -6 -136 -18 103 -99 90 -40 54 -27 -94 -20 -16 -92 -13
4225 -13 2 -85 -72 -27 1 43 -77 18 -43 -4 14 7 41 11 -106 -35 45 -126 41 7 59 -85 83 36 -32 -62 -65 -101
4253 -101 43 20 -54 -24 17 -25 29 10 -90 70 30 40 99 -9 5 -100 48 -25 -4 112 5 -96 -124 -50 15
4278 15 14 20 -73 77 17 -2 -47 -36 56 2 69 -55 -16 -33 10 3 -11 7 -18 39 45 -59 30 -48 -109 145 100 69 36 36 -84
4309 -84 77 5 -117 -13 84 -11 8 -4 18 -66 27 -98 55 62 -14 32 22 30 71 -69 0 22 16 102 53 33 77 71 67 -85
4339h5J64o3j44J41p8L3M1O6j23m5L2pM8J80j83l7J90j19m2Q6Mj17N0jj31J00
4365d0o1oJ40j96K48k9n6K8j6l0R3n7j3q0O3J29m2p8l9K3j39K20k04k4K08J7r7
4392c8o4K3K1J82n6m4k7qoJ0L8K6k2n6J07n3rJ4r7M3M1l1nm5R2m7L2K5j01R9m7
4423cN5M4j21l5l1k8P3RqL3J12j12J1K5QJ3j9N0j17M5k9K9J1l0m6p6K05j26OJ56
4453A04j31MK1L7q6J37j46mN7k1J12%q8o7l7R0J7m9J82j42Q8j2m5N1n0lO4k6n5
4482BQ8m6j5P0j48N9n4O7K1m1r9P4mJ52j01njo6P9l8N6j10M9Q0M0k19J25P4mj6
4512F9j37J00RQj4j14K2O8Kj26J48l7l0mkP7j0JJ3pJ6o7K9r1J72o6j57J23l2P1
4542C4J4p6R3k8p4J5L6qo7lJ95j09k5N3J26j44j2N4L5l3q3J8j08N3K5p4N0J16
$$ plain form
4339 -85 79 16 -128 13 -65 -32 9 75 -48 -93 -61 -68 -20 160 -23 -60 130 11 -31 55 59 -58 -8 -9 -140 -40
4365 -40 -101 -107 33 -163 85 56 0 28 12 -18 75 18 5 -75 -12 117 75 -3 -42 -19 -158 62 -142 -166 42 59 -38
4392 -38 -102 -79 -58 124 68 24 -3 -11 -17 -7 31 57 35 -21 86 33 24 38 -59 -16 25 -6 -11 -56 36 -11 21 46 -55 44 -3
4423 -3 52 96 -25 -60 -91 -119 -46 -37 -45 -12 100 -12 -1 24 32 45 26 76 -41 4 -25 4 15 -15 -61 -137 68 -58 -52 104
4453 104 -27 -23 -2 35 -51 86 -60 -64 -7 -28 84 84 -4 -71 -108 -18 -1 -50 132 -10 78 66 21 72 22 19 83 57 2
4482 2 90 44 29 99 -49 10 -44 23 44 3 -96 -22 -26 126 25 20 19 -47 32 -6 50 -60 -11 69 109 -110 15 89 85 69
4512 69 -68 32 41 49 35 -79 -57 11 13 -113 35 -2 -32 -36 -38 39 29 30 43 36 52 -15 14 -77 95 29 -128 -5 -37 34
4542 34 48 -28 65 37 -37 -22 14 6 -61 -64 131 22 -3 50 176 32 20 74 109 76 -7 11 -97 -44 -19 -93 -43 73
4570G3k7j76P6J02l7O1j90K24l5m2n9o9M6lm3J60k1n6L5q1O4J38j00M6j03Ol4
4597d5K7K5pO3QN9j43J1j68K24j17J0R9n4O4j17K9J7L2KM6q9J0m9J47j75Q8nJ0
4626Bp1O6J0j20K24j79ON7L4P9q5N9j05N5r6QN4O3q8JL9l9M8R0k2l9m8l0RO0p5
4657c3O9om9N8j35J78o7R6j26P4m7qNk8J53j62J82k11m3N8J36M7j85J25o3P0K3
4684A11p0K9m1K7m5o2M2J34m5n3M8j2kl1n9N7M1m4o5K0M3q1J91q3Ln7O0L0k10
4713a24J96k4j35N8J11q6r0J22L4n3k6Q4o0N0P4j07N1p0J17j67N2K1L9j01N2p
4739A1ML2j44J37NN9l8q4L5K6j20J5J08j3j21J29j00R4l3K10k55k0M8n0L8J30
4765A03n4j35R3O6j43j2J06p8O8J06j51Pk1P4j9l6Q4o7K3J6qj8P1j15MO5j14J10
$$ plain form
4570 73 46 -130 -54 48 11 72 -118 106 71 29 -30 -99 -53 -56 -99 61 40 -16 19 -62 2 140 40 86 -17 -11 -45
4597 -45 -18 7 0 63 71 130 -13 -2 -170 54 -63 -53 46 -8 56 -61 -32 -15 17 19 65 -24 -14 -63 84 -91 -3 -8 2
4626 2 -69 -3 7 -113 111 -68 -62 -5 29 108 23 82 -23 32 -64 -56 -2 61 -27 -26 13 -26 22 112 90 51 3 -27 -18 42 -33
4657 -33 36 30 -19 39 -96 82 15 111 -15 59 12 4 9 -19 134 -28 154 -57 -100 -42 94 141 -44 81 18 88 111
4684 111 41 70 29 56 11 -51 -9 125 80 27 75 63 61 30 -29 28 69 25 -40 -20 23 -58 133 50 53 -4 56 86 -124
4713 -124 72 48 -87 -29 82 -4 -94 28 62 9 -17 67 7 57 131 24 75 5 122 -45 7 28 67 -34 18 11
4739 11 15 47 -97 40 45 104 66 -18 17 43 -77 -62 46 33 -88 41 -59 35 2 212 -43 -63 -15 -65 -27 103
4765 103 49 -86 7 73 -70 -82 24 -54 14 120 -31 -24 -45 29 10 -26 58 -9 14 30 22 4 75 -40 -36 29 -85 25
4793B5p1L6l7J60r4J63k36N5M6k2j9P1j19L9m7J47j38J21No9l1N9j57R5J25o8
4819C9n3m3Q1oO4l4k8N7q7J25j70k0p4K32J4q3m0n7J19L7N8j65M2J7Qr2N7n6m
4848f2J08p2Mj9J16j34l8Q3j1kQ1J0m3P4j31Q4K7p6j08K29j86j7K39j88K4m8J20
4875F4m9R4p5M1j04P5r0N7q2R5O3q3L2n3p3J57Jk27J10Ql3M9MmJ22j92Q2jq2J96
4905A02j09j34J52O8j05P5k0l2O3m5p3J4P1JlL7Nn3k2K9oK4n4j5Q4qq1N7ql5J0
4936a1m2L7K9M8k7n3L5jj28J29p9p2J97r8KK8O2n7lQ9j13K7n4J49n6r5j7J50l9
4965C7o7j1m1O3rM0L4o0N9m7J17j56l0P0r0J5oJ41j13M7j00R0p8J06j15O8J68
4992A32r5M6j28m4J40L8j25K3M2m3J94j29K2j67P7J05j55Q9Rk07K19M6l7q9Q5
$$ plain form
4793 25 -46 -10 -47 113 19 182 -54 1 47 25 6 77 -42 -3 -50 97 -41 80 85 16 -15 44 -113 -18 107 39
4819 39 -14 -57 24 18 82 48 20 77 -10 115 -55 -75 -149 83 97 14 -26 -83 36 73 131 -34 8 25 33 -59 -2 -58 -62
4848 -62 46 -26 -22 -41 75 -59 -97 -14 -25 -27 54 64 21 95 -36 48 75 -1 -109 120 -66 -83 156 -32 -8 -56 64
4875 64 15 109 34 75 -29 46 -44 13 -69 26 89 6 38 -15 -88 69 70 -157 -47 -39 -72 -23 -19 -23 99 -93 -11 -12 -94 102
4905 102 -7 -141 11 79 -26 49 29 -3 60 15 -58 -44 27 28 25 62 67 14 -8 21 15 39 -15 -30 54 46 -35 22 14 -21 -11
4936 -11 -53 -16 13 61 34 -19 16 15 -113 16 -63 -135 62 -36 -34 -6 56 -1 -4 85 -28 -1 -55 94 38 -57 -74 76 37
4965 37 -30 -41 -82 -19 -28 12 46 -14 45 -2 115 -41 -71 -1 -91 -76 -82 59 -54 -7 -107 -17 -95 11 -104 -36 132
4992 132 37 83 -45 -89 51 89 -36 -13 29 -14 180 51 73 -94 -17 88 -67 22 31 -176 43 89 52 -37 48
5017D8p4j5L4J53k03K4J12j22P0j06O7K9L1j41J67j31j1K4J14j50Q1M9l2m4j9
5042d5Q4kK9j44J13N5p9r4qN6J7P7k2l7o0P5K3L1o9n4J10K9q9R7n7n9R8j01q4
5071a10J94j72J74j23J7K4N0j75J19J5K1l7n7k9J4J00p7L6r7J09j04N3O9P0j81
5096i7P6N8r2N7L2J3m1J06n5J5o0j09r4K00M1k9M7p9jJ1O7j16L0j9Q7L3r1P9p4
5125eL6r0N2J19m0j45m3J08j24J38K5J6n4mkK4N4n3j1O2r8J3R0j06MKo3M6M2L9
5155C2qj6j3J51j30k1J5l0J05j43P5O6j15L3Q4j00N3q2L0k7nJ19q0o2O0N7p0j8
5183d0RJ7l9P3k3L1j14R3r1O8k0Rj6K4K7j4k5R9j04J3N0o8R0j6m1p3M3J5P9j14
5213e8P0r4K2R8K4j22J39o4j4J11j14l4Qk9n0J21m6J39n4o7n8J40q9k7j5R3MN0
$$ plain form
5017 48 -26 -41 -7 146 -57 -33 79 -43 27 -79 -12 17 48 -93 74 -57 -68 -44 70 -80 1 50 18 -26 -45
5042 -45 39 37 66 -78 35 90 11 -83 -91 -35 -18 59 37 0 -60 15 38 69 0 -54 56 85 -4 93 36 -23 75 -26 -110
5071 -110 84 -88 86 -37 -20 4 54 -121 -2 13 34 -3 -60 -89 -75 25 -52 -16 -113 -4 -108 -55 14 84 -97
5096 -97 -21 37 -55 2 34 47 6 112 57 72 12 -97 -191 9 50 21 68 -11 -12 -1 66 -50 -20 -39 48 81 -10 69 -5
5125 -5 31 -59 -7 112 72 -73 -116 -8 -132 6 31 47 -7 -11 -13 11 65 12 1 63 -35 -22 68 -38 -34 -32 -95 -49 -7 32
5155 32 24 8 -5 146 16 -5 10 -20 85 -58 17 83 -32 1 85 -15 38 -44 -14 -41 -46 73 -7 -69 -9 48 -22 -40
5183 -40 -31 -14 -53 20 -3 28 -86 7 -84 -16 -36 -27 -43 -19 8 -6 -31 68 -36 -23 27 -41 49 33 -8 -81 -38 -23 56 -58
5213 -58 12 -82 -60 38 62 -60 79 15 1 112 -2 -36 -28 -57 -107 14 -32 107 53 -14 -72 68 -21 -48 -63 30 34 84
5241H4l2r6J33j04P2P7j52m7k9O8l4J4L3L0k7pK5j7N4llrk0M6j33J29J9M2j16
5270cN6l9n8Q2m0m2K2%l5P8k01J17l2J03k2J9j04J38m7j02n4J95j21P6N5k0Nj5
5298A1j12o0K35j06j10P4M4No4MkQ7O4Q3k70J91k6l2j1M8j3j08P8j52J21k7N9
5325A1qP8o9Lj25J23jN7m0p4M2M6P4n5j07J37M4r8q7M1l4J17j3j29P2p5Q2j35
5353a23Q1J39k18J14m0l4J46n6l5k6P2o5P0P7j11l4R9j29Q5J4m0o0J60n4p8n9
5379a05M4K9l3J09j62RP7q2LO8L0m7j1J6m6L3O2j9Q9j76J24R6j59K2N0l7k6O0
5407A8o8N3k9nM9k8mj5NQ0o5J2q3J03j3l0P8j25Q5N5j08P6QK1Oj44J58p9%J2r5
5438g2l6Q1L5%m8m7P6Q4n4R7j68O8m3O6k5n5R1Rp8j11J47k2j19J80n0n5J9Q7K5
$$ plain form
5241 84 52 -44 89 -15 57 134 -18 -65 -94 -26 -60 -46 -13 17 -10 -17 8 -9 45 42 39 30 10 56 -77 52 71 113 -3
5270 -3 53 14 -44 38 -2 -44 -22 -22 -57 21 -180 -63 -95 8 -14 5 -99 39 -8 -110 -164 31 -90 -14 41 21 26 11
5298 11 -101 -161 74 -32 -142 -68 -24 -19 -83 -79 -81 6 70 153 -117 74 48 16 5 53 40 -68 10 -142 -21 -48 11
5325 11 3 81 12 15 -110 13 12 69 29 -45 -3 43 117 62 -45 92 136 38 -49 -8 -42 75 62 -67 5 -70 12 -123
5353 -123 -42 97 -121 -7 -47 -81 65 9 -26 -52 20 -45 25 102 -9 -43 56 -73 12 26 -14 -74 86 32 -46 -105
5379 -105 -61 -32 -65 44 -118 -109 -32 -114 -111 -43 -13 -60 -71 -55 -101 -68 -6 -25 64 -112 12 108 -51 -29 21 -16 -42 18
5407 18 -50 3 -26 -31 18 -10 -14 -29 -24 56 -9 3 -80 23 10 -20 58 -67 18 73 -35 41 49 70 76 -68 90 11 11 23 -72
5438 -72 -108 -27 8 8 -40 -87 -11 73 19 116 -52 16 -27 39 14 -41 50 59 -19 -130 17 -5 -124 56 6 -49 -30 57 82
5467H2j68J16j69J97j76J18P6l4J3m6R3j40M3p4J17j49J07r1J72j21o9qN7N4M0
5492D0j76J03O1Mp1M8P6n0j11J25q0l0oO4K8k7J23m2j7r3O2p4N0r4J32j18J06
5519C3j66J30O4j19J48j33K5N3%m7QrK8P4p2n0M9J1O4m0j6j10J52j28R3r2k8J29
5547E1M7m8o4JL0N6o6N8j21N5M1j9j89J21O6J04r6l6j2N0n5J9M8o0K6%L0p4J08
5576G1k03K70r4jj42J20L1l0o8MJ46j82n1J59j47J31J19j83R4r0J5J03o8J5O2
5601H1j6k1n1N1r1J3K8L8l9l1R5r0K9j0O9Rq6L1O0q9O9l8o1O0l2nL7M4l8rj8k1
5633c2O2O0j10L0j06J81Q3o6j60J6LK0J24k0n2j02R8q2J13L8p4l4K9op1pJ11m9
5661cN1r0M5J3k1Q3m0k3j0o1M1rk2O7m3k0M5M7q3R3N2o1m0p9R7p0O0m1m2M7rJ
$$ plain form
5467 82 -86 30 -139 58 -118 0 76 42 55 9 102 -38 5 -69 48 -101 6 -85 87 -34 -103 -111 -54 0 40
5492 40 -136 -33 28 32 -39 9 85 35 -76 49 -31 -61 -67 -3 25 -2 121 79 62 -31 31 -43 7 -87 45 -73 33
5519 33 -133 -3 61 -58 90 -43 -18 35 35 -12 -4 -13 15 89 17 -33 16 27 91 51 35 -75 77 -51 42 -50 -78 51
5547 51 98 50 -14 -13 17 73 7 65 -56 -1 40 21 -168 -47 19 123 27 -9 -21 29 -26 -7 41 -19 7 7 37 -37 71
5576 71 -132 138 44 43 -99 21 52 22 -46 -42 104 -78 -129 30 -117 14 133 -50 44 -46 -31 72 4 19 81
5601 81 65 44 -7 44 -47 -34 -6 32 -7 -38 57 -33 -4 -14 55 64 -22 9 69 -20 49 11 -50 10 -22 -27 10 54 16 7 -11 -32
5633 -32 30 90 -20 10 -96 85 168 102 -58 -42 -39 -19 105 85 33 -69 29 -53 60 98 24 -10 19 13 -58 -65 46 -3
5661 -3 48 -42 3 16 -5 78 38 15 5 -56 -15 -24 -46 21 -22 -42 3 50 -33 60 112 51 11 -68 29 -41 19 -22 -64 -17 -26 -25
5693b5J30o3r5O9j28J43om6J04Qj16J09j46J36j34J45j10j0J8L9Jj5N8p3Q1j7
5719E7k7q9N1Jj2K7loK1k3n8Q9j12J57Ko9l2lQ5m4r6J34p4r2J02L8Rn3o3O9k9
5750d3k7J03k8J08j27K2j36R4JJ6N1j53J14L9mL5j32J27k5m8k3O7M8j01P9O1q5
5777C3n1K3l8j34K93r9Kj15N3j4OJ07p6L5l7O6r7M2K3K1m1r3O2PQ8j0qj45J48
5806E1j20P3K1kM6l2l9oJ7Rj4Q9j33K7N8j3j30M1J71r4r2M2J06o7N4ql2k1N0j40
5836h8J08r7J35o3K1L8j00k1J02j0Q1p4j1K8Q2k03P0P6j60%k5R0j40R5Q5q1J64
5863A02k07J87j17L8J2L2j03j6J36k5p8R3Q6k33J40n8p0J68n1lm0L6q6K2J35q2
5889A8M1m6j13N3q7J88p2j03M7J73j00o3J56m0q1J4rK0k1K1j2q2J53j23J35l2
$$ plain form
5693 -25 105 42 -53 16 -112 31 25 -21 83 91 -25 84 -62 74 -60 85 -25 -35 -17 22 23 8 66 -7 74 57
5719 57 30 -59 -8 -7 -19 8 5 -1 20 -3 -61 28 -84 73 75 6 -26 -29 56 12 -84 50 -24 -116 -14 24 33 -20 -83 -14 -43
5750 -43 -70 33 5 113 -14 8 -128 -34 -33 -17 34 -119 -5 34 30 65 -67 60 35 -13 -36 31 79 -22 57 118 33
5777 33 -18 5 -33 -167 126 27 29 -86 -33 -47 -41 66 -10 25 -12 54 -43 -1 22 43 2 -91 -29 -22 66 56 48 -97 51
5806 51 -69 4 25 23 69 37 -2 -8 9 18 4 93 -40 -13 45 32 -98 -57 114 20 -72 -30 76 9 63 55 23 2 52 -88
5836 -88 20 -77 58 -5 16 54 -46 -67 35 25 106 32 21 49 131 -72 -2 74 -86 -86 -111 -21 -161 -66 19 -62 102
5863 102 -105 82 -35 3 15 47 -56 -72 64 39 -39 54 140 -93 47 -11 -81 87 36 33 -7 29 -57 -35 100 18
5889 18 59 13 -100 -47 -134 54 -18 -121 -74 99 -1 -64 92 52 -29 -15 -24 -4 -25 -4 -16 -98 55 -68 67 35
5915C5M6l9j95J73L9r2l8P7k2L3m8K10j30q4Q2K4p1RP0j38OJ35kj43J29q6r1J90
5943G9k5m1L5m2P5n4J1j34N5O6K9O3l0j09J03m4n1J7o2J26m8K5l5M4J4l6l4j3
5971a6L3m9R1j52Q6R6j41N1q0J94j13j50K30q1N2j18J1N4M0%j01L0N8JN3j35N1
5998eO8m6j4k7j20J96k7o9Q8l5m0L0M5o2J3J5R2j66P6L1l5O4r7J7R7j50O8nM1
6027D3%o0J6O0q2J53j51m7J41q1O4q3N3q2OM4l2J4p4J36Nk7p5J30j66J08Ln1J92
6056A57j35K2m8R3m0o7k5Q2r7J08j38P4R9k12J52M7j16o4Q9J4M5n8mJ13p0j9j7
6083a5P2r8J44r8j03Q2r1K11k7rq6ko8J42o8N8K1j31M6M0J04k06J27j08k7J14
6109B4j6m0N0R9m5m9o9k7Q2J38j02k4M3o1o0R6j10M0P9RL5j63L6Ko8J10m7L4L2
$$ plain form
5915 35 81 42 -153 20 59 -33 -71 6 -16 17 -31 179 49 -35 47 71 0 9 79 -59 -53 82 80 -63 66 -20 -111 79
5943 79 54 13 48 6 81 27 38 -96 -41 25 54 117 87 -22 81 37 -14 3 -59 67 19 44 9 53 67 31 -3 -16
5971 -16 17 -32 59 -93 -7 89 -52 -1 -81 113 0 -150 80 -1 51 -67 -56 -2 38 38 -63 -33 25 26 79 -56 -5
5998 -5 63 17 3 -24 -144 52 25 -44 44 9 -31 -1 44 -18 -5 10 102 -64 12 43 8 72 -25 -8 89 -61 7 2 43
6027 43 43 -17 -1 59 -23 130 -21 -68 73 -8 56 -27 26 -56 -50 -6 -38 -24 -98 38 43 16 -59 71 -95 13 16 -35 157
6056 157 22 44 -4 89 49 -18 -43 39 -58 50 -88 -14 85 -127 25 72 -44 -108 -19 -5 40 -18 -22 91 21 2 -15
6083 -15 57 -41 103 5 -98 -16 -107 104 77 68 -18 -20 -88 54 -14 44 65 -66 -20 20 124 -82 45 -63 -90 24
6109 24 8 -32 18 117 72 23 -46 -73 9 147 45 21 64 3 -57 39 -71 -31 48 57 92 -71 -35 -33 -101 9 -38 -4 28
6138B8J5J3n1m5M6Q4j48j9J6j10K68p9l4O8p3R3r5Q6M5r7L2J4j77J80k7m5K9Q5
6166A02pj24P2J24j09o5M0j7L9j24K5L1K4O3j1n0O1o2J35k15M8j32O0O7M5P4l6
6193E8K9q5K4r6N7P8n6R9j37P2LJ73j72o1j3j3Q0k1j0p7J04qj02P7p6P7N7q6R5
6222G0n8j5o5R4Q7k2r6j23O9N3O4M9j01J6m7M3k8j0rL7m4J5J6l7j03J65mP6r3
6251aK2jm0j2M1k2k5N0P8j73P9l8J10j68J00q6P5K1q9Q3Ol0OJ41j06L3o6L9q7
6280f0J71k75K27qj16J29j29M8k7P7n7J71q8m8j6N0p7n1J08o0J09j43J36j49J25
6305D7J3j57O2N7J8Q1o3q2K8o1Oj4P3o2p8P6NlQ7k9Q3r2Q9j63j1Q6p0J83r6K8
6335D1k6n8j8q5J84o1P6L3k6m0r2L4J1N2k4o0Q0l2k7r5K09Kq3o5R6m0P2r7jJ0
$$ plain form
6138 28 43 56 5 -40 6 90 -58 -77 -61 -171 97 18 -16 52 -21 72 -23 63 108 11 43 57 -120 60 33 -12 17 102
6166 102 95 -29 43 167 58 -7 33 16 55 -69 -44 -13 11 74 63 13 74 12 147 -68 -20 -152 -92 -25 20 94 58
6193 58 87 2 26 -70 -13 65 9 108 -29 43 46 219 47 -14 -27 -40 40 19 9 -68 36 28 -74 3 -73 4 61 -25 70
6222 70 12 -3 -68 26 113 91 -5 -128 -59 -6 58 107 6 22 -25 18 -10 -20 -29 8 -36 -21 -5 -42 -145 20 16 92 -1
6251 -1 21 20 -20 -32 9 -13 -38 12 90 -83 -4 -42 68 -100 0 -86 -11 10 -79 4 10 -20 -14 127 21 54 -12 27 -60
6280 -60 111 -164 63 55 -61 68 -61 -13 -40 37 -20 151 63 15 -1 49 -28 -79 29 -31 78 -65 71 -78 47
6305 47 60 -97 -35 22 40 121 58 -24 4 -57 -51 -65 8 -54 -132 -56 -51 -54 33 4 87 -5 84 -79 -90 -4 -74 109 13 41
6335 41 15 -43 -61 -146 38 -23 53 86 60 20 -72 -38 -27 25 1 -59 21 -11 -38 -133 76 78 -5 -70 26 -14 58 -39 -40 -30
6365c0N3p6J20n5N0j3r7N1J9o9lN3k4P3nJ0q0J21j23M6kO8nr3M6o6J01j39R1r4
6395g2P1R5j52R1qMO2m5O8j31O3L1m6n8P0k3p0O9o2K8Q8j3j24J30j50Q0K0%m9
6424c3L1R1j23K5M9N9l9O6j50N8l7N5oM7j21o3R9P7r4m7J20o1R7j50K7O2p6P0
6452C3O0j82Q6k9OJ7Q8j07O2Ql3M9J2j37J9M6l5k9j9P6K7l7Q5o3K4K5j1k0r9K3
6482e5J23n9J3J9j18M0r9K19L2j01J13q3o2O6Mm9J4j1N8K4o9O9r5j0J1J23r5p
6510A5q0M4Q5l3koo8M0M4n0R9j31P8q3J19Lj47J16o4m9N5N1k11J52O3N4j95J26
6538B5n5J29r6m3N1l6K4k7J10P7j6j08Pn8R6M2j13oM0j23R3o9oM0M6Q4j9p0J19
6567A38j01l5K3j26M9J58j63Lp3N5J06j37M1J12j8l1j26J59M9o8K2k4m0O4j14
$$ plain form
6365 -30 23 -53 67 12 62 49 -48 3 22 -47 -50 3 -21 52 47 57 -23 98 -25 21 19 87 82 -11 35 -31 70 -69 22 -72
6395 -72 -1 94 -58 33 25 29 91 46 114 -17 46 77 31 -27 43 20 -50 19 -43 -15 73 60 -64 66 -84 -4 16 16 -33
6424 -33 -2 89 -34 -9 40 99 60 126 -24 34 -3 52 46 93 -28 -91 8 85 -9 -56 64 3 100 -50 -23 39 -37 33
6452 33 93 -89 -3 -32 -26 -9 79 -28 34 42 9 58 70 -67 -48 -2 -37 -66 -85 -9 18 -19 66 3 27 52 41 21 -78 -55
6482 -55 68 9 22 41 -77 -37 -136 83 115 14 127 44 -18 48 52 3 17 6 64 88 19 88 -7 -17 -6 117 22 15
6510 15 -65 -21 64 31 29 23 -45 -5 39 -11 88 -43 35 -48 71 74 -73 43 -21 -70 -15 36 -175 -23 40 94 -101 25
6538 25 -30 99 3 -40 11 -25 -1 -28 82 159 143 35 42 -16 80 122 9 3 43 -80 13 -56 -62 -22 24 108 89 19 138
6567 138 37 2 25 -101 -52 106 -57 -54 -127 -72 34 -103 -62 50 32 1 -125 34 83 15 37 13 -27 37 -77
6592g7N7J0o1J02P7j39K0L9P7r9m7j1P0m6kJ60j27q8J44p0j1q%J4Q6Ko5K7J4m5
6622Cj3O7j8J9j02M2n0K07j64n7J42q9J03j1j04L0R2l3j62O9N4j4J26k9j09Q3
6648H2kp3N5m5o2n9O8P2K9j52J2N3n0O6r1KQ7M9m8r7J24l2n6QoJ02N9o0j3M2L8
6679A02j57N6p%j22J07K3R2j47j4P7n6N8L9m0r0R6K3mK8J9j48J1n9N7J20j38n9
6707a33K58j50nL2p9R9r9J19n8l0J01qn5K7L5L9k02J3P1K4qM9M4j12QJ3k0J40
6735A13j51L0J02k09R5k9J16j17NQ8%q7R0ppj08J38l5j18M5N7j64K40o3r7L5J34
6762I6o0p5J44j22r0N6N3m5K6K7p8J7J16k7l3Rj06Q1LJ69k28N9J6K8n3L1j3k2
6790b1O8J9o8Qp6K7K5m7R8l3O1K3q8M4m0k7O9q8O3Qm8k4Q9pK2n4NJ07j20J9j6
$$ plain form
6592 -77 -20 -10 -71 31 108 -31 -11 28 105 6 -41 -52 18 -28 -30 130 3 -85 59 -11 -22 -30 -30 -16 70 72 7 34 48 3
6622 3 -10 57 39 58 -44 -2 -52 155 -9 -66 76 -13 90 79 -25 5 97 64 -98 -29 25 11 137 108 -1 82
6648 82 80 7 62 17 -45 -104 -36 36 65 -87 -75 -22 -72 -6 -97 -95 -8 41 -7 -104 20 -12 -68 -60 -66 36 95 35 22 64 102
6679 102 -55 1 -6 -6 -128 -21 2 94 -53 -67 10 -46 12 51 11 -79 17 40 36 64 83 -65 -54 -113 -56 64 -74 -133
6707 -133 125 -25 -30 2 -77 22 -77 42 -16 -46 55 47 -8 19 54 93 -109 -96 -25 -1 -9 40 84 -28 -20 -7 -27 113
6735 113 -38 -8 94 -115 -20 -49 67 -50 -45 43 43 -44 46 39 32 -76 62 27 -91 -46 11 -153 87 24 -73 -38 96
6762 96 36 -39 105 -17 -107 -51 2 -43 -17 10 -68 -51 65 38 5 14 -92 -11 -8 161 -67 -8 8 36 -17 14 1 -21
6790 -21 47 66 -2 6 -70 -43 -18 -65 33 0 61 84 -4 40 0 -27 42 -46 17 25 -23 -47 42 35 57 3 8 115 -5 14 -2
6821bJ15j76N2L1m9K9j1k6O6o5k9N8L6Q4k55J41J67j80O1q9P0R2p1r5J22j05J6
6848a3J1K5J5n3P7q8L5j27J46Nk8M6m3pK8k9mj6J30j34j06J50N1k0l1J9k0M9m8
6877B0M8q9PP5l6k0R5m5j22J49k8j00K3n0R4J48o5j22j11M8K3N4mk9m3J2N3J0
6905eo4O0Rln7k0J44j17O2l7LK3P9o9m2LLmL7p3J11k8o0M5M6Kno5n1M9Q2q0J04
6938H2j3p9L4l6K8j09J14nl1m5N1j5n2K7j2L4K9q8L6lJ09r0j0L3k9P2O2p2Jk5
6968bl0M6l8q2J37m0Qj8P1r1O0l8o5J86j38J08p0o9J2J28l6r1J41k02P3N5J15
6995A30k07Q7p0J28r1n3N6JJ1L7N1o9J1o5R5k0o0o7J29j8n6MN5M9j24J0N7r1J3
7024f7M5k1j1k4J22k4n3q5N0M8N6o1kM5l0M4k6n%l5j7K3k3J59p1%L5o7o2J19M9
$$ plain form
6821 -2 113 -63 -11 20 -29 0 -11 -37 29 -36 -65 -7 29 113 -142 -1 166 -14 47 -42 28 120 49 -46 76 -29 -13
6848 -13 -2 23 38 -15 62 -26 9 -118 28 33 5 51 8 1 29 0 -4 -20 110 -24 -130 20 71 51 20 39 19 68 20
6877 20 68 -21 -14 61 25 5 100 55 -67 82 54 -46 -23 -73 21 169 104 -18 -129 -81 -58 -4 -8 -37 -80 -68 -15 -5
6905 -5 -69 -9 0 -3 -60 -80 64 -53 9 -28 -25 -2 77 8 -34 -31 -28 -32 5 -68 43 15 -45 0 46 48 43 -22 -73 -24 58 -22 82
6938 82 69 -10 24 -12 16 -93 21 16 -15 -60 -9 -24 -76 -49 -61 -27 2 -86 -50 -53 56 -34 -44 -11 -40 32 94 22 23 -2
6968 -2 -32 14 -24 -106 31 -9 -1 -19 52 -39 21 -17 -82 104 -34 74 4 -65 -53 75 39 -52 89 -113 -40 15 130
6995 130 -77 10 -60 68 -23 -76 -20 -19 -8 29 80 11 22 -43 52 32 -28 -95 34 16 -40 -36 19 68 -56 -46 11 -80 -67
7024 -67 -22 -43 -54 -78 44 20 -33 -118 -68 -20 36 -25 -27 18 -12 32 6 1 1 -34 -51 -28 -51 108 37 37 72 5 -57 62 111
7055A11j20M4rr2J33K0p0o2J26j46J08P4q8j38J54o9R6r8QOL6PM6l4q2J18O2j74
7083c3L5j7j2K9mN0l0K5K8j16J59n3j21Q2l2j5N4r5J90r9n6Qm4R2J4k0m1j3n5
7112i0R8O5k0j35Q5M4Oj4k3N7mj8n0MQ4K4j68Q3j81K87j58J02r2R6MJ3o9q0M5
7141eo9R8Po6N1n0N1M1j16K5K4j8J6P0p3j0k9ML9J15j12rll4Q6oJ4j77J05o8J70
7172G1j0J5j17M5m2P2n5M5k8p4J13n5R1k0k5l6N7m9q3J07K2k6o3N8J4kl5mN0n9
7202b3M5O2m2n8j06J04P4p9p2P8N8r8J07p1qN2M4o5j2k8k0L3K9l5m0J60j24N2
7230A7O7j18K3O9rj08Q2Mj61J67j7j6l1J28j66l3J24n2J31j18M8J18q4j37P3o8
7256f7N2O5j21O8o1kM2j3m1N3P0j4M5q9R7j10j8J16k5o6J1R3j28N4j5R5n4p5K6
$$ plain form
7055 111 -9 35 26 -66 67 87 17 -45 81 -65 43 117 29 -109 45 -24 72 -26 -18 -12 24 31 77 43 -39 79 141 -33
7083 -33 2 -15 -27 2 -2 48 18 43 71 -45 114 61 -60 22 -10 -25 29 -66 124 25 -31 -23 -67 25 39 19 -22 -35 -90
7112 -90 8 73 53 -82 3 47 53 39 16 73 69 51 1 5 89 113 -55 28 -153 134 -24 78 -14 82 86 99 30 -50 -5
7141 -5 -74 24 31 -35 16 -34 17 58 -58 -33 -9 -27 -11 59 -14 -24 -53 -49 -10 105 -7 -16 -19 -53 33 27 41 -136 -31 -99 71
7172 71 61 76 -41 4 -38 34 -21 24 -4 -78 35 -20 71 51 26 -10 47 -2 -85 22 44 18 -45 13 27 25 -10 -14 36 -23
7202 -23 22 84 42 -16 -122 -18 56 -23 -95 -17 41 -57 50 -21 -29 23 67 2 -10 -38 -58 -25 4 -31 -71 89 -35 17
7230 17 84 -34 -11 58 49 -59 23 27 -134 33 16 0 -31 97 -69 -102 22 -30 101 -17 31 149 65 -72 1 -67
7256 -67 -15 50 -71 -3 -64 -66 -24 -37 -78 -25 45 31 76 -13 84 -26 -44 72 47 -19 -8 85 -43 11 -4 91 37 -38 -12
7285a2j9L3j8%J08q0R7o6q8P0N5j33M3Nor9K03k0j6k7K7l9Kj1n4K7P0q3k9N9K8
7316B7j5n9R9K4k0l4P5p0j2J7k6j21K0J56j55P4O6q7M7o6P6q5M0m8P0j4J13O0
7344A52k10K2J22N1n3pr8O7n7L3j75J56p4J67q4K5j05J63k13J18l0RJ8J85k58
7369g6O5M0P8j17M4m3m2J78r6j06J6J70r6K3L6j0N9o1j24O0N3pQ0j66kJ58o3j03
7397e2J3O1n9N3k5Kj7N5Q5n0M1m9K6j40R9j18J89j39L2pN8o1k0J03jj34OR2q4
7426d1J7mK3j1nO2j26J23o6J01p2O6Lm3M9n0K1p6p7o5Q7J3P0l8J3RO0n3l1k9J9
7457e1M6k8N4O6M5j73R%m4J37m5m7NM0m1M6n7J15j58R0l4Lj4M4k7j08Q9k8J04
7486C8J00p7m2k0J8k2P1j25k3J10mK0k9j2l0j7%J8NK7O5L4j57R1m3lk9P5q2p6
$$ plain form
7285 -12 -31 2 -16 -16 92 12 109 43 -45 25 80 -53 -10 -5 -11 -110 93 73 57 30 57 18 20 9 -45 -18 52 -31 -60 -1 27
7316 27 12 -47 52 76 56 22 97 27 15 32 6 -115 -95 61 -94 -20 46 -41 6 -60 16 -69 -29 -77 -7 -21 92 152
7344 152 -58 -36 86 137 84 77 -21 46 -11 22 -153 3 -71 96 12 37 -68 95 -118 0 -30 -21 -3 182 -76
7369 -76 -11 29 107 -10 34 -9 -51 127 31 -75 -59 111 15 38 74 64 123 62 -62 -2 51 44 124 -42 -44 114 51 -52
7397 -52 -39 22 -37 16 -9 -7 -24 31 116 66 107 58 84 -56 43 -75 114 -25 7 0 58 -3 -23 80 79 -55 -49 43 -41
7426 -41 -24 -28 -5 -16 -21 41 -85 38 -28 73 1 67 70 27 76 26 47 -29 -106 -171 -84 -71 -1 -39 -26 -17 43 -10 -41 -70 -51
7457 -51 -5 -33 21 87 132 -41 -32 -32 -76 61 16 -31 -26 14 -27 19 -38 77 -81 9 -25 -22 -36 8 -19 -127 -38 -66 38
7486 38 138 61 19 -1 17 -5 66 -59 -82 28 24 44 15 3 -27 -44 -44 -26 -21 6 71 105 -52 39 -4 -7 -36 39 -43 -119
7516a19P5J20R0p5j17j3R8j8J15k46J62m3q0J3K2JM5j05J57m2n0R9l0L8k5j9L5
7543H8n5k7p7N8N3j9n1n6L0j06J00P3M3p8ORK1l5L8O7n5m6M5ll2RK2Ok6P3j02
7574b7J5l5j5J41r7M5J22j50k1J27j77P2p4N5J11j29Q4L5O8k48J6N5K9o0K5k0
7600e3M8j6L2n0O8k0l5L7K0n5J3K2Rl3J17j88N1L1q0Q5M2j24J06J23j50lr3N6
7628d0P2Nm2n3Q8n3j30K81k21J41r1j2On9J58k0O4k02R8j9J1M4p3j5O6j3j17Q6
7656d0O7j8r2N2J3Kk5R2or9J56j88j9K47j03Mn5j5qN3J1j7j0rRj4O8r6R3n8N9
7687E4l9qo2J16q0n2m1J83j90n0J35p4P1L4N8j28nlR0k4j7Q9j13J29p1M0j97J86
7715C1Ql1j7L9p6m7Q2q4J16n9p6J40Om8K7M0nK3J24k26L4p8J42mP1p4%n3l9K4
$$ plain form
7516 -119 -44 76 166 91 -26 -39 59 41 156 -90 72 29 -51 -38 -16 -15 30 -75 82 40 -10 89 59 97 72 53 88
7543 88 33 6 -71 -13 40 21 -30 -86 -56 -162 -62 11 54 -24 -18 -9 12 -23 15 82 27 -19 26 23 -9 0 22 28 2 75 -27
7574 -27 -12 -47 -62 79 -18 27 149 -1 -22 105 -72 0 -74 -19 92 -37 47 82 150 -98 -82 -27 2 -58 -33 -53
7600 -53 -5 -21 11 -39 29 9 -26 11 31 -24 -11 11 20 -13 104 -84 -33 -2 -82 3 45 -79 27 150 0 -3 -96 -40
7628 -40 32 37 -5 -58 30 -23 -153 128 -93 48 -43 -55 -49 -108 50 30 94 -108 -10 -29 -18 26 -47 -62 4 -9 -126 -40
7656 -40 27 9 -83 -31 -18 -16 -41 51 45 -54 102 -86 -105 142 39 43 -12 -27 -35 18 29 12 2 -7 2 -12 56 -40 53 -5 54
7687 54 15 7 -55 61 -19 -71 -112 71 -119 -169 -34 -108 -37 -3 55 -73 -78 -81 9 -15 -32 57 -56 73 2 42 -155 31
7715 31 39 8 -9 30 -46 -93 -11 -95 21 -38 -114 26 32 -16 11 51 46 69 193 -33 1 -77 65 61 132 58 58 5 -34 -10
7745a0K7rj05K8P5L9lj67J74j4j0l5J17j14lk8M8kl2P2l0l7J0Nj1jN6q4R7r7O3
7776A9q2J19M4k13k8J95J1l7J13j87J17o3QK7k8n4MP5l8k3k6M3M6l4K6M8r5J22
7804A09n5o6J13j31J0p4J16P5j28l1J14K0r4K6j10P9O9J10j22Q0n7k3j10R7rN4
7830F2j88J41m6QL6L0rK0r7J1kL7k4M9P5k07K37j16q5j8J49qjq8l1J45l5J02j20
7859B7L9Oo1P9k0j02P0l2q7J02rl6J5M6q1M5kL6j41O8Q1p1j2M9j3N2p1j16N7N5
7889b7J2J8j6j4K2k4%L9j05OJ4J23N1j69M9R1j04J5p6m8K12l7j1l4R7r7M0p1J76
7918A32q6m3M2p8Q3l9P9j01P4J2J0o1Kj0M2o5l2J16m8m5K0M6M2q0K7NO6q5P8n1
7948E2%o3prKJ7OO8n0J9Rq7mk3J03j6lJ4n1J27j20o6Q4Q8j3j54Q7%L8R5k43J75
$$ plain form
7745 -10 17 8 -97 -69 6 45 42 -125 49 35 25 -10 107 -7 -10 -38 10 8 -24 48 18 -19 -9 -4 -15 -16 40 -44 53 -44 19
7776 19 -63 56 100 -113 -141 54 65 28 141 -46 71 8 16 43 15 -39 -35 40 2 -21 -47 -4 42 8 34 82 -13 109
7804 109 54 -12 101 -30 -20 -94 22 97 -31 -62 52 72 -22 4 -106 -27 42 152 30 110 53 30 -80 17 8 62
7830 62 -126 15 -31 -23 13 43 34 54 -43 -32 -34 3 -21 28 103 -104 133 17 -68 -86 63 55 54 -34 -65 80 45 147 27
7859 27 66 72 11 90 70 -32 38 6 -81 21 12 -24 -9 37 -44 1 -1 35 -106 -38 43 -28 -40 9 -4 48 -23 -139 -82 -27
7889 -27 -15 3 -13 -27 -5 -29 -29 10 -95 -89 -75 48 99 -70 -21 70 -34 -19 -95 -143 69 32 21 -13 84 -13 27 -44 132
7918 132 46 3 45 -33 50 11 90 -11 63 75 85 24 26 16 58 -7 -39 77 29 -16 4 50 92 12 39 44 110 25 103 52
7948 52 52 -11 -18 -27 -25 -8 -2 66 16 35 44 -43 -47 -70 33 17 14 28 -23 104 -16 -82 2 90 77 -77 10 10 48 143 -100 75
7980G5l2R2j10l8j01J99m0k8J3m2K8p0L3m1J10K0p1j00K03l8q9Q6K2q0RL0o2L1
8008Ir8J72j29j3R6p9MJ06K2j11Q3n0P7j36L9K4J4j84J47r3J11M3K3j20L3M5m8
8035a3Q1k4p8J02m1M8j99J31kK4N6q3R5r8p7J34r1Q7lk3p3J05J3o8p3P1O8o6j33
8064a30O9PL5k2L0O2j23J24r0Q4j51J11K0J10p9j63L5M4J1j0NJ85k33Q6o4J0O1
8091B4m1L3k5L2l6Q8o6Jj4L7j2j23J32JJ7J4L7r5K7o1J6k8JK1j9J15qj13JN3n
8122Dp3R6n9N8j5kO3j33J33q6J22p7j66J70k4M0r8J34r2N5j21q6J24J44m8j5q
8149D0n8J74j11l5J13j20%J59j30o6QR4j9m4j7ln1J17o7L8m1J5o5j3J17j10Q4
8176IP6j0q5l5J17n5Q6o9Np5l0N0R3k8n9
$$ plain form
7980 75 43 135 25 -13 -114 85 45 17 30 -12 16 -54 -21 -62 48 68 -3 -103 100 62 -27 59 81 1 10 40 -22 9
8008 9 -89 83 -46 -59 37 -42 -38 68 90 -21 62 12 89 -47 -8 16 30 -154 -7 -100 11 54 77 -43 -10 35 -13
8035 -13 68 44 -34 68 27 75 -124 7 5 29 85 2 97 -1 -78 56 -35 52 49 26 -47 58 71 3 -70 1 69 3 -130
8064 -130 -61 -54 -19 -41 -11 51 -72 52 -38 46 -105 6 26 136 57 -106 -71 -27 -16 -26 -21 164 -69 17 -47 -37 24
8091 24 -17 16 -9 23 -13 75 9 10 -4 33 21 -102 30 31 48 62 99 4 31 -30 -14 -42 -41 -20 -39 76 68 -45 -44 9 4
8122 4 -69 27 -32 26 11 9 72 -61 72 -14 108 31 -135 35 11 51 -47 87 -5 50 -71 -157 -33 111 63 48 40
8149 40 -18 156 45 10 123 3 3 162 32 -34 -26 68 49 5 -12 -15 -66 51 -16 22 -19 -4 -69 -82 35 -75 9
8176 9 85 75 -10 -45 72 17 103 34 39 -36 -66 -16 77 49 -10
8191a0
$$ Imaginary data points
##PAGE= N=2
##DATA TABLE= (X++(I..I)), XYDATA
0@%%%%%%%%%%%%%%%%%Qj6J6j6J6j6K4l2L2m0M8m8N6o4P2q8J00j08J20j36J53j77
39i6K00k17K41k72L04l36L68m04M45m90N41n97O58p25P98q83R78j082J202j344
59g11J511j707J946k245K630l145L877n002O983j1491M2771l788n5307L7678l145
74A0855l2681J1901K4449k7687o320J8146q160j1173K6034M696j6119J0142R698
87A3781j8912M005J6451p937q485O944k842n409L604J44o047k52J212k495o88
102f926K690j91K263K470k261L988P532m302j069N637o481n774O884j070q295
117d905R79K050n292k86P035m6l814M790J875n353L709N291l923k72K447l628
133F57j120L111J3j811j210o80j653j542J836R46j258M99N03L18K020J163J584
$$ plain form
0 0 0 0 0 0 0 0 0 0 0 0 0 0 0 0 0 0 0 8 -8 8 -8 8 -8 16 -16 16 -24 24 -24 32 -32 40 -48 52 -56 64 -72 81 -96
39 -96 104 -113 128 -144 160 -176 192 -212 233 -257 284 -313 345 -380 418 -465 513 -569 633 -711
59 -711 800 -907 1039 -1206 1424 -1721 2156 -2846 4137 -7354 35417 31629 -23678 14000 10855
74 10855 -21826 -9925 14524 -13163 -19483 -1337 -9497 -20670 5364 10060 -6059 4083 13781
87 13781 -5131 -1126 15325 7388 -1097 5847 3005 -2404 1200 1344 -4703 -4955 -3743 -6238 -6926
102 -6926 -4236 -4427 -2164 306 -1955 2033 9565 5263 4194 9831 3350 -2424 4460 3390 -4905
117 -4905 -3926 -1876 -7168 -7454 -419 -465 -4279 511 2386 -2967 742 6033 2110 1838 4285 657
133 657 -463 2648 2661 850 -360 -1040 -2693 -4235 -2399 -1453 -2711 -2212 -1709 -1391 629 1792 3376
150C376J083k375m54J264k482m71J572k887k010J215j22l19J531J322n57j064
166a378K126Q55j535J851M85k849P05J281j594P41L93j585n82k20N1M91k85O10
184d39k89q47J392P08M13J437o89p15M66j347J72J034j739r92L98j136J27J168
202h78P25K53j58N00L15o39J503O90k022L59M56j933N25J122j219m72N3k94k49
221a363J49J042P4r93J184L30n45J776M47j150L95k40n91q1l67j96p92j105M23
240a603J75l37J334J58m45R32L44J95Q91k81J48m85q08O26j57r41M34n66j112
259a498L58o3j75O15k32K15K65j19J364L11k48R81l31o44N34j69n96k14p96m88
279i30m12l91P80j07l75R81j81j02J302J61N0L57k02Q6o7k56L93m88r12M18p77
$$ plain form
150 3376 4459 2084 1630 2894 412 -59 1513 -1374 -3384 -2169 -2291 -2610 -1079 243 -314 -1378
166 -1378 748 1603 68 1919 2404 -445 260 1541 -53 688 1081 -504 -1086 -1306 -1255 -764 -1049 -439
184 -439 -728 -1575 -183 525 938 2375 1686 971 1437 90 262 1296 -443 -1435 -1037 -2173 -2046 -878
202 -878 -153 100 -58 442 757 118 1621 2311 289 648 1104 -829 -304 818 -401 -873 -820 -1114 -1363
221 -1363 -1214 -172 -98 -1091 93 423 -122 1654 2101 951 1346 1106 515 434 67 -129 -921 -2026 -1603
240 -1603 -1428 -1765 -431 -273 -718 214 558 753 1644 1363 1511 1026 218 844 687 -254 180 -386 -1498
259 -1498 -1140 -1203 -1378 -763 -995 -780 -515 -634 730 1041 793 1774 1443 799 1333 1164 568 354 -442 -930
279 -930 -1342 -1733 -953 -1060 -1435 -454 -635 -737 565 726 776 1133 931 1017 950 694 1087 599 -313 105 -672
300f72n42P38l94l95L31k38L66N95K29O17k4p3P64l68j23Q24p85o36J04p08k57
321f47K2j72J14k15o9O53j52J18Q89m64M3O29j41NK83k78L6l75j94K63n67j96
343d15L59q26M2L67j58J84J59J51L60n0J36O33m61n8M23o17k31L94n47J54J00
364I9o29K42k31R3K78k61O9M43m56J66O58k26J19rk57L02k01mK36m36o9J61m85
387c98J69K29l00J53K26l28K48k0K84Q4l79L9K01m16K84J84m27K71J24l08K29
408A49j30r1K88m26K17O6k79K00J44m09J59K23l15K55n6p5Q0j56L10J11k68K29
430B26J42l88J70ok65K01o1l17J82k81J69J15l40L35J47m04M08L17k66K61Nk23
452A27K03j28N2L1n55K81j3n46M69l8l19J63K0o6J78l4L43J86m98M54J1j80M42
$$ plain form
300 -672 -1214 -476 -870 -1265 -934 -1172 -806 -211 18 635 611 538 1302 934 811 1635 850 214 318 -390 -647
321 -647 -625 -797 -683 -898 -967 -314 -466 -348 541 77 120 749 608 613 896 618 654 279 85 348 -219 -415
343 -415 -56 -882 -840 -473 -631 -447 -288 -137 223 173 309 942 481 423 846 229 -2 392 -155 -1 99
364 99 -530 -288 -519 -426 -148 -409 -340 103 -353 -187 471 245 364 355 98 400 199 195 431 -5 -74 87 -398
387 -398 -229 0 -300 -147 79 -249 -1 -21 263 347 -32 7 208 -208 76 260 -167 104 228 -80 149
408 149 19 -72 216 -210 7 73 -206 -6 138 -271 -112 111 -204 51 -5 -80 0 -156 154 265 -3 226
430 226 368 -20 150 144 -121 80 19 -298 -116 -397 -228 -113 -453 -118 29 -375 33 350 84 345 350 127
452 127 330 202 254 285 -270 11 -2 -548 -79 -117 -436 -273 -253 -319 -141 -175 168 354 -144 310 321 141 583
475E83j42l55J37k12k21R7l32K51q8l13K97J15j90M12k7j29M60q1L8J94k23K42
497E13j25k55Q4j37m29K87n3l56K23j59MJ82j9O5K29MK29mk18N13j62k65K59l48
521F2j18N6k39J35j94q3J80p7j73M14q9j8K75l7J24J76j14K7n7p3J23j25j75K11
545B11l48j48J43k45l9K90j97K06Q8J7K28q7m2L80m00J31K30k39pq4j11l2Kp7
569a30K7j01j42K44j70L5L38j95J83J02k19K82m6q1K00j62q3N5j74K3M3k29j4
592b14J38j19Q8R4j95J48j24J68R3m1p5K75k94K27J13l53K30l1j99J72j70j39
614b08K55k66J35Po8K3J17o5J20J8n5J22k9m3J32k05P1O0j57j0N0q8M1n5j19Q4
640a33m2rK08j62j5K19j27J03J11k0QJ1j87K38j77M7J14k78M3K06m26K19P6k60
$$ plain form
475 583 441 86 223 11 -210 -113 -445 -194 -282 -595 -298 -183 -373 39 12 -117 343 262 300 494 271 513
497 513 388 133 217 80 -349 -62 -115 -471 -248 -407 -403 -221 -240 -175 54 58 287 283 65 578 416 151 410 62
521 62 -56 0 -239 -104 -298 -381 -201 -278 -451 -37 -126 -144 131 94 218 394 280 307 250 177 300 175 0 211
545 211 -137 -285 -142 -387 -426 -136 -333 -127 -39 -22 206 119 77 457 57 188 418 179 172 88 -23 -55 -53 -130
569 -130 -103 -204 -346 -102 -272 -237 101 -94 89 191 -28 254 208 127 327 165 82 137 -37 -14 29 -200 -214
592 -214 -76 -195 -107 -13 -208 -60 -184 -16 77 36 -39 236 -58 169 282 -71 159 128 -71 101 -69 -208
614 -208 47 -219 -84 -77 -145 -122 -5 -70 50 68 13 135 106 63 195 -10 61 121 -36 -46 4 -84 -43 -98 -217 -133
640 -133 -175 -184 24 -138 -153 66 -61 42 153 133 141 152 -35 203 26 73 187 -91 -48 158 -268 -49 27 -233
664b33Q5J25m2J03r3o8K01m1K16r6m7J84j06j56P9N7k42J20k72jJ58j54L9J53
688c1r7K07J5j58J48O4j30J58J3J1n7r3P3L8k51J00j8j76J61j55j08K91j34J91
712F2j1j56K63n6q5K32l3j69J71j05n6o7nr4M7j20J82m3j99J67n0o2K68o9OJ77
738A95L3k7r9m4J05n7k44K25o8j75J36j36k5l2M7P1K2j52K15O0p4J31J8j22J76
763A79p8M8j9m1j02N9j67Jok9J38j56j7J75p4J7R7N2j4m2O1R4j04JJ67j84mJ13
791A65l34J15Mr8J28p6o3P5L9p6J85j12j42K97p2L2J82p3j18L5p4J9j05J9J05
816E7k12R8j4l9o4J55p7J28p4J13R3j37J34P6k64lJ57p4L1K1n3j43L2k27L26j79
842a39K4J73j11j17L16k66N9R9M8j33K10k06J97q3j4o6p9J33L5j97R9k7J2N8j15
$$ plain form
664 -233 -148 -23 -65 38 -55 -123 78 37 253 157 110 294 188 32 111 168 -74 46 -226 -227 -69 -223 -184 -31
688 -31 -128 79 94 -64 84 148 18 176 189 200 143 50 123 161 -90 10 -8 -184 -23 -178 -286 5 -129 62
712 62 51 -105 158 102 17 249 216 47 218 113 57 -10 -15 -109 -62 -182 0 -43 -242 -75 -125 -187 81 12 18 195
738 195 228 201 102 58 163 106 -138 87 19 -156 -20 -156 -181 -213 -166 -95 -73 -225 -10 50 -24 107 125 3 179
763 179 101 149 130 89 -13 46 -121 -120 -126 -155 -17 -173 -190 -15 -89 -72 25 77 63 21 82 176 72 73 240 56 52 165
791 165 -169 -54 -50 -148 -20 -96 -159 -84 -45 -121 64 -48 -190 107 35 67 249 176 58 93 19 38 -67 -48 57
816 57 -155 -57 -71 -110 -174 -19 -96 32 -42 71 164 27 161 237 -27 -30 127 53 84 105 52 -91 -59 -286 40 -139
842 -139 -115 58 -53 -170 146 -120 -61 38 86 -47 163 -43 154 71 57 -9 -88 45 80 -117 -18 -45 -33 25 -90
867i0Q7J0K3K9k5J3J11r8k4qP6j36K6n8nJ27q9j3R4j65P5Q3j97J23J07j12J87
894A51n9k6J0K1q2J20p3On8j11J66r6l0k4mn7R7j3k8K48j41l4R7p3J09n2r6K15
922A83j52N0l6o4j04L0l0n6J48o1O9j42K4K10p6O6m4N7n2O8N7m1l5K2j7m8r6J11
950D1r8m5K2j0l3J46j67J64J02k14J29K1K1M6k8j11J02n0p4K02j09Oj01q3J52
975C1j64J4J74j76QJ30j04mJ43j33K23j4o5j7M7k12J59n0L0P6k07J46j05j9L8
1000e1O7J9j23J52K8p4o5N8J43n8j73J30r8M5N2j29O5l2L1j2j23R2J72j59N1j06
1026i8O7J37j9n7O3lk8Q0q5k9J9j07j2J07l4pN7j70L5kj8J62j13P4on4J36l3n7
1055EO9J5q9J48k25J08q9k3L1J77j92K2P4j8Q3j36Q8P0j53M3n7j1J19J33j52P
$$ plain form
867 -90 -3 7 30 59 34 47 158 60 36 28 104 -32 -6 -64 -69 58 -31 -44 50 -115 -40 43 -154 -31 76 -36 151
894 151 92 66 76 97 15 135 62 68 10 -101 65 -31 -61 -85 -89 -146 -49 -62 -90 158 17 -17 80 7 116 64 -32 183
922 183 31 81 45 -19 -123 -93 -123 -179 -31 -92 -23 -165 -141 69 -7 59 15 72 20 88 145 104 69 91 74 26 -70 41
950 41 -57 -102 -80 -90 -123 23 -144 20 122 -92 37 58 79 125 97 -14 88 38 -36 166 57 63 -38 -121 31
975 31 -133 -119 55 -121 -113 17 -87 -91 52 -81 142 128 63 46 93 -119 40 -10 20 96 -111 35 -70 -89 -51
1000 -51 16 35 -88 64 92 18 -47 11 154 96 -77 53 -45 0 52 -77 -12 -44 -13 -25 -148 -56 116 -43 8 -98
1026 -98 -31 106 87 30 93 90 62 142 57 28 47 -60 -72 35 1 -6 51 -119 -84 -86 -104 58 -55 19 13 -41 95 62 5
1055 5 74 89 0 148 -77 31 -58 -81 -50 127 -65 -43 31 13 96 -40 48 118 -35 8 -49 -60 59 192 40 47
1081D7k0p3rJ20q3LO4j56J6J0n0R3L6l7J37n6Q0l4j33J06K5M9j16m9kJ00n3j69
1109a54J47P4j65J0k3J11o3L3J12n9Q3l6Jj3J15k92K18o9p9J54j14J1j82oJ27
1134e9J11j85J19J02j08l7J6R1m0k8N6J21q7q7J3n8l4O1JM7q0j6R9j26J95j46
1160e9OJ29r0k4J64nj64Q7M7j14L0O5j37J28k9j08J76j81Q0j33k1J02K8M6K0n4
1186a1N6R9K6j21j5Jn3N3m2N2j86J45m3l3R3n0R1o4M4J4p5K1O6L6j33jR3K7r0
1215@RJM8L2j28O2j0k14K13J3n1k9N0j9j3J10K1o1j12J27K9r4rJ15k5N6p9k4Q4
1244A02j60R9M7o2o2N4M3j41N9K6QN5m1j9Q9p7r8O0P3m4l9N4%j22R2j19N4J52
1272H3j55J44K1j08P0M2J8j22Q3k5k2M3o0j5o1K7L2j5k3m4NR0J1k6Lm9P9O3m9
$$ plain form
1081 47 27 -46 -55 65 -18 -15 49 -107 -91 -81 -131 -38 -2 -39 98 42 122 88 -45 61 86 135 19 -30 -32 68 15 -154
1109 -154 -7 67 -98 -88 -111 0 -63 -30 82 23 106 70 71 58 173 -119 99 30 -49 105 -9 2 -180 -186 -59
1134 -59 52 -133 -14 88 -20 -57 -41 50 10 -18 38 159 72 -15 -2 -60 -94 -33 -32 15 -65 -81 18 -108 87 -59
1160 -59 -53 76 -14 -38 126 121 -43 44 91 -23 7 72 -65 63 34 -74 102 -79 1 -132 -153 -51 -23 23 43 -11
1186 -11 45 144 170 49 34 35 -18 35 -7 45 -141 4 -39 -72 21 -29 62 -2 42 56 -19 2 68 104 -29 -30 63 90 0
1215 0 9 10 58 90 -38 24 14 -200 13 26 -25 -54 -4 -23 -36 74 95 34 -78 49 78 -16 -25 90 65 121 42 18 102
1244 102 -58 41 88 26 -36 18 61 -80 -21 5 13 68 27 8 97 20 -78 -18 55 11 -28 26 26 -96 -4 -123 -69 83
1272 83 -72 72 93 -15 55 97 115 -7 76 51 29 72 12 -3 -64 -37 -5 -20 -43 -87 -82 8 19 -7 -4 -53 26 89 40
1301D0j1l3J34l7p5m9L6J1j03Q1mO0K9r9k4j5j7R9Pl7K4O9n7J16j67L7lj09J84
1330H7m7n1l8o5J47n7j55J11pk5J6K9P9O9j55K3J25k2j7M8j54K4P2j7n8N7n6J0
1358b7n8J00m8l3J08M6p4N4q8M1M5q6k3L8r6M5J4Q3p3K0O0k0pr6J02p7K1R5k7
1387C9n2kR7j04%L1r5J70j22Q5oj75J62r9K9M3r7M0P2K%N3j38K37j81N2j00N8
1415aM7L2J7j01m6j31J28l6J14p1N0o1N6N0KJ1p9J27j65lP4m3P5N1k3k4k5r7P5
1444CJ5p8J15Kp8L3J1r1P7J16j15J5L6n0J6L3l0K4m3%mq5J4M2k0k0J17q9j2N9
1474A3n1j8N5q9J67Kn9Q9r6q3j4J77P9k16NJ06o1l5j0J0Nk4LJ64n7rr4Q4l4m8
1504c9K9O3Pq0J43j90M5LL3j76J35q8L2J81j32N1j09J39n3j4l1j0J10j3p2M3K9
$$ plain form
1301 40 29 -4 130 93 18 -31 5 16 -87 -6 -10 50 79 -20 -44 -59 -76 23 30 -7 17 86 29 145 -22 15 12 -97 87
1330 87 40 -11 -49 -114 33 -24 -179 -68 -75 -100 -84 -55 24 93 -62 -39 86 64 47 95 -59 -35 37 20 -38 19 -37 -27
1358 -27 -85 15 -33 -66 42 88 14 68 -20 21 66 -20 -43 -5 -101 -56 -42 41 -32 -12 48 28 21 -75 27 -50 -29 66 39
1387 39 -13 -15 82 -22 -22 9 -86 84 -38 47 41 -134 28 -71 -42 1 -96 -56 16 18 18 71 -67 170 -11 41 -59 -1
1415 -1 46 78 95 -6 -52 -183 -55 -91 23 -48 2 -59 -3 47 49 60 -19 108 -57 -60 14 -29 46 97 74 50 25 -72 3
1444 3 18 -60 55 57 -21 12 23 -68 9 125 10 25 61 11 27 60 30 54 11 11 7 -78 -64 -22 -42 -62 55 -34 -46 13
1474 13 -38 -56 -1 -90 77 79 20 109 13 -70 -84 93 172 -44 -39 67 6 -29 -39 -29 -24 -48 -45 119 62 53 -41 43 9 -39
1504 -39 -10 53 60 -20 123 -67 -22 -19 14 -162 -27 -115 -83 98 -34 17 -92 47 -6 -20 -51 -61 49 36 -36 7 36
1531C6q3R3L2j51N9R6j27m4J33l0n1M2J5p8J06k1J14j88J8n6L7n1J33KP8j77J3
1558e0Q9K2n4o0o3J03M1m8j5O9JqoM2O3k03J10RL8q4o1n6J87k30N5J27J3r4PQ6
1588C0Np9R8p2P6l0j37O8O2j03R9L1n4j1Q4p3l7l2L0k7K8K1m9Q3K8k4Q6o1j5m3
1618a8M6o6L1L9k4k6j12N4J52lM0q2k01K49q1q4J79p1p2J47M2j55J01j36J31K
1644H2o7P2j05K3O8j07J57j17q7J07n9l7N7L2n6J21o2L4o6ok4j8O6L5m3QJK6k6
1673Iqj9k0J3R3q6P2j16M7O7o9k5j4J11o9o0P2n8r1J79j42P9n0j4J40po1m1L6
1702c2J20J8K2k47R8L9Nj51O6J00o5k9p0N5K8J8p0Q8p9N2J91k52O6J6L9No6P9
1730D4o8R7o6J8k7J02j43rO3l0L4p7M2Mk6m6n4K57p7k2L3k0k2k6J2M7K0J9o7q1
$$ plain form
1531 36 -47 46 78 -73 -14 82 -45 -89 44 14 -37 5 20 -58 48 27 141 -47 -29 -85 -48 -99 34 36 114 -63 -50
1558 -50 39 61 7 -53 -116 -13 28 -20 -35 34 35 27 21 63 126 -77 33 42 80 -4 -65 -121 66 -164 -109 18 31 -63 -56 30
1588 30 35 -44 54 -18 58 28 -109 -41 21 -82 17 48 -6 -17 67 -6 -43 -75 -45 -72 -44 -23 -72 11 39 15 101 40 25 -18
1618 -18 28 -38 -7 32 8 -18 -130 -76 76 73 113 31 -170 79 -2 -86 93 22 -50 97 139 -16 85 -51 80 82
1644 82 15 87 -18 5 73 -34 123 6 -81 26 -33 -70 -13 19 -37 84 22 56 -10 -16 -40 -58 8 43 0 8 9 35 9
1673 9 1 -18 -38 -25 68 -18 54 -62 -15 52 -17 -42 -56 55 -14 -74 -2 -60 -151 28 -114 -35 -85 -99 41 34 -27 -68 -32
1702 -32 88 106 128 -119 -21 18 23 -128 -62 38 -27 -56 -126 -71 -43 -25 -95 -7 -86 -34 157 -95 -29 -13 26 31 -35 44
1730 44 -24 73 7 25 -2 100 -43 -52 11 -19 15 -62 -20 -16 -42 -88 -142 115 38 16 49 29 7 -19 -7 40 60 79 12 -69
1760f9P0r0J66j03j8Rk7J18j63N7L5Q9k9j23R0jJ1j9O7p2Mq6Q8jK8j44K31j55
1788c7J2M2N4k20J99n2N1L2K8L1j45L2m5J9p2J09j08N5q5K35j60mJ91j48l6J9
1814cJ0K4k4L1l3j4R7j4p6k2j5R4r7LO5k0MPM0l8L6o0n0Q6l1K2p0Mn7J51n4j2
1846a6N0j09m1J16L9j82R4J88j00p0K6lpR9r1O5q8M0Lk7P6jl5qj0p0j22J01J27
1875D4J5k8j14Q7n3J98j31m7N6k6MJ2j02J15n4n4J09p9n7J32j06R8k4m5n3M8N3
1902bnnK4m5O4n0LN7o8R4o2Olp3QjJ14o8m3J29j9j57P8l7o1J7L7J7K9L1q5J18
1934D2k7M4m4n8k7Q4k1N9Nr1R4j26M6J97j22p5O0L5k2j80K14k8q0K7M9jo9Q5p3
1963cK3k3J10p4j44O6M7m8mJ05r4J2j5J38k3p9p3MpJ31lp9K3J30j78J01rk0J9
$$ plain form
1760 -69 1 -89 77 -26 -44 -35 -62 56 -107 -50 -15 74 45 -78 12 11 22 3 70 -2 2 -84 4 3 31 -113 118 -37
1788 -37 -25 17 71 -149 50 -2 49 81 109 140 -5 27 -18 1 -71 38 -70 -15 -100 135 -25 -29 162 14 -22 -3
1814 -3 7 31 7 38 5 -9 88 74 -2 -24 -39 55 -42 -39 26 6 10 17 57 19 55 -5 -55 31 0 22 -48 -44 -101 50 -4 -16
1846 -16 34 -75 -116 0 39 -143 -49 139 39 -31 -5 -8 -15 84 -7 58 -30 10 13 -14 62 61 26 18 8 -62 -184 -83 44
1875 44 59 31 -83 4 -49 149 18 -29 27 1 5 17 -85 30 -24 -78 31 -48 -105 27 -79 19 -5 -50 -103 -55 -2
1902 -2 -7 -12 12 -33 31 -19 -16 41 -27 67 5 11 8 -65 -57 -58 56 -12 -55 74 55 -102 -24 -61 -122 -105 -68 -51 -22 9 -76 42
1934 42 15 59 15 -43 -70 14 -7 52 57 -34 60 -66 -20 177 55 -20 40 75 53 -127 87 59 -21 6 55 54 -15 70 -3
1963 -3 20 -3 107 33 -111 -45 2 -46 -50 55 -39 -27 -42 96 73 -6 -79 -75 -82 49 46 -33 -10 120 -58 43 34 14 33
1992C3J0N7j85O1j10K11j38J05n6L9q8L7pj5O0n9R2m5N3o8K1R0k12J16j2kJ00
2019H8l4L5j54R7r5K13n9n0k6J5l2j24J94oK5l1j68J45r4L1R9k10N7J34Nj64J77
2046F8j03k0R4M3m2L7j31k8o7J81l0P2o3o9R3j42J18j4M1L8p6LL6K8j36N4j5J62
2074A32j82R3pr2L9O0J9j08K2M3l1L3jm0L2M2j34N1m0J6M7mN3j37R0pK5p5K0L3
2104hj1P3m3j9o7J17J2o3l5P6p8N9q9J67Oj07m6J11J2l4j21J56L9n0m9k0Q3q9
2132a8k4N0N7M9j83l9K28n9m9n1J07k2l6R0j50o8J30j23M8P3nR2j24J10M1j99
2158g5J31j63J02L7Ko0O9r7L0L3l5Q8r5J3Q5p5o4l1J32j11J28K5l2l2N4j64J59
2185E4j42O6Q2k2j74J05K7J8j8OQ2q8q7J22j4R2j42M0J0k9M0m5j9KR3l6m4O5J9
$$ plain form
1992 33 43 100 -85 -24 -134 77 -61 44 -12 27 -61 -24 -31 -46 14 -45 47 2 55 -13 8 98 -114 2 -10 -12 88
2019 88 54 89 -65 32 -63 150 91 41 15 30 -2 -126 68 62 87 56 -112 33 -61 -30 69 -141 -84 50 55 -109 68
2046 68 -35 -55 39 82 40 77 -54 -82 -149 32 2 74 11 -58 35 -107 11 -3 38 76 0 3 39 67 -69 -15 -30 132
2074 132 -50 43 36 -56 -17 43 62 -46 -24 19 -12 21 20 -20 12 54 -80 -29 -69 -53 -6 -10 43 -94 -4 -11 14 -61 -41 -8
2104 -8 -19 54 11 -8 -75 42 54 -9 -44 32 -46 13 -76 91 97 -10 -56 55 67 33 -88 68 107 57 8 -12 71 -18
2132 -18 -42 8 65 114 -69 -108 120 61 12 -39 68 46 10 100 -50 -118 12 -111 -63 10 5 97 -27 83 124 -75
2158 -75 56 -107 -5 32 34 -26 43 -54 -24 9 -26 62 -33 -20 65 -10 -74 -105 27 -84 44 69 37 5 59 -105 54
2185 54 -88 -22 60 38 -136 -31 -4 14 -4 2 84 -4 -91 31 17 109 -33 7 17 -12 28 -17 -36 -34 59 23 -21 44 63
2214F3k7R1j01j6m3N7o9Q0o0N2k4K7qL3L6j50O6k8L1j01J02q9L0J04o3Q2M6j02
2242A9j4L9l2n8M8N8o3nn0O6M0j11L9J25q2k5Qm7J64j25Q1r0k4l5O4J14k4Kj49
2271f7R3oN6j05N4K3j07O8N9j34J02J8J2o8l3L6J26j81o0J23j79J46Q8n8K8m3
2297iL3K2R4k22M8k6Q3m7j1J71j32o0P5j01L5l%L9QM9j6m6oM6q7K05j22N0J6j61
2327g5J05kq0M8J32o9j04P9p6M3jQ1l1L3j39J10o3j42O9R0j33P1M7l8K6P7r8O4
2355B4O0m1km2PO2j0n5l1N0n4L4Lj6l3O8Nn2J4m7N7l2qJ06j11j8R9o8k9R6q0P
2387c7kM9R2q1K4j76P7J08o2j2k1J9M9O1r0k9L7ql2p3Q9rJ30m7L8j39J14n0j8
2416Aq2R8o4O0p1Q4j6L9j0l4L7m5l6J8j8N0j1kM2l2k5oP7j27J30k03K25o0k9J55
$$ plain form
2214 63 36 127 26 10 -33 24 -45 35 -25 27 3 30 22 55 91 -59 7 -21 10 -91 11 -78 -48 56 -7 75 121 19
2242 19 5 44 12 -46 2 60 -3 -8 -58 8 48 -63 -24 101 19 -6 2 -45 119 -6 75 -15 -39 -74 -10 104 80 82 -67
2271 -67 26 20 76 -29 25 48 -59 9 68 -66 36 54 66 -2 -35 1 127 -54 -114 9 -170 -24 64 6 34 -9
2297 -9 24 46 140 -82 -34 -60 23 -24 -35 136 4 -56 19 -82 -47 -50 -50 -11 -3 46 30 -16 -22 24 -63 142 20 70 86 -75
2327 -75 30 28 -52 -4 128 59 -45 34 -42 1 0 81 50 83 -56 54 -9 -151 -82 8 -125 -54 -7 -45 -19 58 -40 24
2355 24 84 43 41 -1 6 68 58 3 -28 22 -32 2 5 -11 -44 24 29 -23 -9 -56 1 -31 -39 67 -44 -62 37 -31 -60 36 -44 -37
2387 -37 -39 10 102 21 45 -131 -54 54 -8 -20 -41 -22 27 88 -2 -31 6 -2 -34 -107 -18 -27 103 56 94 -45 69 19 1
2416 1 -81 17 -47 13 -58 26 10 49 39 5 42 -3 -39 -21 -39 11 0 -2 40 8 -17 -23 54 -73 57 -146 79 19 -10 145
2446A45j9k08J43j2lo3P5n0o4O6mqM7jj14O0%J9j00L8R8Oj4nj27j58K75Jj10J20
2476C3n8Q1k9Rj01J02o2M7n4R0N5k1j3j28L0J93j70Q2rm4o2R2o9J28j27MM0n4
2504a5L8n3k3O7j8J9K8n6M2O6j28n5P0J5L6o3k6O9M8K5j02M9J8j41l4J67j7l1
2532e%o3NM1J56j11o1O0j0Q0n6N6M0p3q5m1P7N4j05N3j9q1J07nmJ8p3J26r3J86
2562A74j82K1J01j03l7R0m0n1K2k4j1kO4J01lk05J55j8J6l6l7l0Q6o9o9J22r6
2589f1J10j89L0N9M8l5J63j24k9N2k5J77k28J5R6m6k9J26j05N2m6Rk9J36j62q
2615d3L9p1J73r2p0J95m3j52l9L4K4o7O5L8j03J76r1L4m8O9k6L7j20J29o3n9K
2642g2J08j38R3N5m0K7m5N1p6M8J01m2j04Ok2R4K2r4P8j20L0J3P9j0Ro6R1j16
$$ plain form
2446 145 126 -82 61 49 46 -17 58 8 -56 10 6 -2 45 44 -70 -10 -10 9 -91 -53 45 51 37 32 -95 -253 22 23 -87 33
2476 33 -25 56 27 36 -65 37 -25 22 -32 58 113 92 79 -49 -19 174 4 86 77 33 -29 63 -6 122 -5 -1 39 -15
2504 -15 23 -30 -53 14 -4 15 43 -13 29 95 -33 -88 -18 -3 33 -30 -56 13 61 86 -16 33 51 -90 -124 43 26 -5
2532 -5 -5 -68 -63 -22 134 23 -38 22 12 92 36 92 132 59 -26 -67 10 64 -41 12 -7 -88 19 14 10 28 -45 81 -12 174
2562 174 -8 13 114 11 -26 64 24 -27 -5 -29 -40 -42 22 123 120 -85 70 52 68 32 -5 -35 51 -18 -87 35 -61
2589 -61 49 -140 -110 -51 -3 -38 125 1 -28 24 -1 176 -52 -37 59 13 -16 110 5 57 11 20 -9 127 -35 -43
2615 -43 -4 -75 98 6 -64 131 88 -64 -103 -69 -45 -112 -47 -9 -112 64 -27 7 -41 28 2 39 -81 48 -15 -74 -72
2642 -72 36 -102 -9 46 6 33 -12 39 -37 11 112 70 -34 -28 -50 44 66 -28 50 -70 -40 -27 52 42 51 -15 76 -40
2670d0Q1j13QJ37Qj23J27K1j50M1R3j46N0K0L9P5j84J1j4J4p3K30m7j9o8L1k0
2697a1M5j17J66p0M0M5j14P6o3J8j4j2J6M4l7j15M2Q9o3R4q6M1qJ8l5LNQ0n0L
2727C0N5k0j06J5L7M8q0O1K1o7J33l2j9j32j2O9L0j05Q6R7j24NN8j40J06p9kM
2755f3mN4J19j33q4Q5P6p3m3J6P4K6Pj43M9j1J16j02L9Q6j03J14j04O1n2k3Q9
2782G3m8NJ5N4q4M7m4OK8L6j60J48q0l3J18j15J16q6n4l1N8O1k7j0J64p1m3m7
2810do4l5O5O3M5n3L2J8k8k4o9O0O4o1n5J90o1q1q7O5pP5n2M9j16J2l0M7m8P9
2840a1K7J2J8m9Rq3J21l7p1J01m0O4J4o6j13J38M3m9J0m8M1L2o4Rm3r7J55Po3
2869c3R2j17M4K2M7k6K0j5oq5K3nJ01r6q4QN4J22j39J83j44k1R3p6J04o4M1q6
$$ plain form
2670 -40 41 -72 -64 73 81 -42 85 106 -44 -3 90 -56 -6 14 53 128 -56 -45 -59 -45 -118 112 65 46 -22 9 -11
2697 -11 34 -83 83 13 53 98 -16 60 -3 15 1 -11 5 49 12 -103 -61 28 -35 59 -27 14 6 24 -11 -8 -3 77 27 30
2727 30 85 65 -41 -26 11 59 -21 40 61 -6 127 95 76 -56 -68 1 31 -74 12 109 -15 -10 48 -92 14 -65 -67 -63
2755 -63 -67 -13 106 -27 -111 -26 50 -23 -66 -50 24 50 57 -86 -37 -48 68 -34 5 91 -12 102 -2 59 7 -16 73
2782 73 25 30 45 99 15 62 18 24 52 88 -72 76 -4 -37 81 -34 82 -4 -58 -89 -31 30 3 -7 157 86 43 -4
2810 -4 -68 -103 -38 25 70 17 49 67 39 15 -54 6 70 9 -46 144 83 2 -85 -20 -27 48 -4 45 -71 -59 -89 -42 -90 -11
2840 -11 16 28 46 -3 6 -77 44 7 -64 37 -3 61 75 9 -104 34 77 28 38 -10 31 63 -1 8 -35 -132 23 30 -33
2869 -33 59 -58 -14 8 55 29 49 34 28 -57 -34 -39 62 -34 -118 -110 -56 66 -73 110 -34 -55 38 -38 66 2 43 -43
2897d3Q6j5j04QJ58j24P3n9J8P8n0N0j39M0m2J20j57O1J16o8j40K7R3K2j8O1q8
2924c6L4o0o0R3K8l8N3Q4j79J21o9q2J13Qk0O2R1j64q8J47j6l8Pm7J34o8q9J68
2952H9q9k7N8M6k%j22j48K87q7J62j54l9P3j9m2J27j54O4p9J04O9r6p7M6n9J74
2979A05j14J9q8K9J20j25Q4R7j22K2L6r6J06j13J60j16N4p0P2J9q6M4o8j09L5
3004a05Q6M7lK7o2j1O8r9J19j21j2R1q7Q4k7j13J90k7j6n8j5O8q4J22j46J17j02
3031f9J86q0J0l1J5j5Kj7j42O5J56q5m9rQ8Q3q6j34R8l0l8O8j32J34L1j4o7PJ3
3060d2J07n0Mq4O4lj7J3L9J20j32J20j29M2n6mj1Q3R6j37O7r1k2Q0j32J30o7M3
3088C1j15M7rk8K0J79j28N0Pj36J11j46J03O8l0N5p0N2q4l6K31k67J07n5J51K6
$$ plain form
2897 -43 43 28 -76 -68 90 -34 39 -20 -2 76 26 76 -63 -23 -65 55 -102 -41 75 7 -133 -106 -13 9 -9 52 -36
2924 -36 -2 -62 -122 -29 -1 -39 14 98 -81 40 -29 -111 2 10 -10 52 143 -21 -109 38 22 -16 -9 -56 78 10 -79 89
2952 89 0 -27 31 77 75 75 -47 -195 92 5 167 13 -26 47 28 -14 113 -41 23 -56 48 117 21 -56 -10 -69 105
2979 105 -9 10 -78 -49 71 -54 30 127 5 27 63 -33 73 -40 120 4 58 -12 60 79 -7 37 -31 -140 -105
3004 -105 -19 28 25 52 -10 -21 47 -52 67 -54 -66 25 -62 22 -5 -118 72 45 29 -29 -44 24 -60 62 -84 33 -69
3031 -69 117 37 47 16 31 16 18 1 -141 -76 80 -5 -54 -63 25 108 22 -112 -14 -44 -82 -14 -146 -12 19 5 -62 -55 -42
3060 -42 65 15 19 -65 -1 -4 -21 -8 31 151 19 139 10 52 -4 -8 -19 64 160 23 90 -1 -23 57 -75 55 -12 31
3088 31 -84 -37 -46 -74 -54 125 -3 47 54 -82 29 -117 -14 54 24 79 9 61 -23 -59 172 -95 12 -43 108 134
3114A34j30jn3Q5j25P9M8o8J19j00nO9o9m7P4K7q4J23o8o2MQ7k7p0P1l6pP0m5
3143gq5J02m1O5n8j6R3Rj40Q4O4q2m3j3J73jj82R1r2L4P0j16P2p7J36nL1rl8j05
3173h6J47o4p3QJ8K6Q8m0j12J8J8J21L9p9m2j2J44q6K1Qj63K06q6L7mn4m1l0O7
3202fk8P5j8JRp4J00j08n9J89j5K2j18j24K28j08P0L7j11Q0o3LK2K7l5K1j0q8
3230h1N2K4n8J47j5j08k4Q2p6l7J42J0rN2q4o2R1j31O7k0M7J4j45N9q3J40j07
3257a13J30j26M8Kk4P8N4n5o6J19j36L0kK2j2J01Nj20O7k9n2Oj4J89j58J07k3
3284B8q6P0j4J05j48L3m6J68j7j38M2L3M6m5l2j39J53N9q6QR1q4M4j14l0K2N3
3311b4k7qJ43j07o9P1J05p9k9N9K3pm3j27J51j29J16k8o3k1MR6j6L5n8l4M9q8
$$ plain form
3114 134 4 3 -50 35 -90 -11 37 -31 88 -12 -17 52 -17 -64 10 37 -47 76 8 -54 -50 37 10 -60 11 -25 -32 38 -7
3143 -7 -92 10 -31 34 -24 -40 53 62 -78 6 70 -12 -55 -68 105 104 -78 13 -79 -45 25 -91 -19 -96 40 35 66 57 19 -86
3173 -86 61 -3 -76 -68 -50 -24 64 24 -88 -70 -52 69 108 29 -13 -25 119 33 54 62 -101 105 19 56 52 -2 -43 -73 -6
3202 -6 -34 41 23 24 33 -41 59 -49 -108 81 66 88 -30 -154 74 -34 36 73 -38 42 -21 -18 4 31 -4 17 7 -81
3230 -81 -29 -5 -63 84 69 -39 -63 19 -57 -94 48 58 49 101 17 -45 46 -85 -18 -38 9 23 -122 -63 -146 -6 -113
3257 -113 17 -109 -61 -59 -83 -5 49 -6 -72 47 -89 -59 -61 -39 -51 50 55 -65 2 -27 -79 -73 -87 102 -56 51 28
3284 28 -58 12 -2 103 -45 -12 -58 110 93 -45 -3 30 76 31 -1 -140 13 72 -14 -6 85 1 45 -69 -99 -77 -24
3311 -24 -51 -59 84 -23 -92 -21 84 5 -24 35 58 51 8 -119 32 -97 19 -9 -72 -93 -89 7 -9 26 -32 -66 -17 -105
3339a05J73p6L5N8j51m6J09j6N1k7qJ1j06O0l1J12j08Q0m8L1k3J40n7r9M2m8R6
3366D9j3r9J23k4o2K1nk5M0L2Mj9J1M5j38r1J86k12J99L9o1J16q2j48J70r7M4
3393Co1J04k3m4M3m1N4n5J0L9k8j7kr1J22Q8o0o0Q1N2m3o6o2R0J0L3j23K1j62
3422a88J34J15p7L0j52N5J05K3p3K8R4q4k1m4OL7o5P3j2K0m9P4K8m9k7j6J7R1
3450G3q9M3%L1jq9O6M7o3L6p4o0L7M8j4K0p4R1M6m1J20j34m2p3J61n7j50J06M2
3479Fj2k1P6j9q5J19l0p3N4J9k1j7n9K11k06j0J79p1n0K0J3q4J5Q0O3p8M4j55
3507i2P4l6L5P1Lm9M4o2J02j11%K1j5m0%Q7o2j0m2M2M9Q0p5Nk1q1J11m8L9ro2
3538e2L7j0K7Mj4L0Pq5N3P5p3l6N7o9K9J05j41MJ22m0q1J1K5K3j18N2J04j19J34
$$ plain form
3339 -105 68 -8 27 85 -66 -112 -3 -19 32 5 -3 8 -98 -38 -69 43 -65 15 -33 -2 -25 115 58 -41 1 -47 49
3366 49 36 -63 60 36 -26 -5 -10 -35 5 37 41 22 33 78 -60 -151 35 -177 22 61 0 116 34 -114 56 -41 3
3393 3 -58 46 23 -21 22 -19 35 -20 -10 29 1 -16 -18 -109 13 101 41 -19 62 114 71 5 -57 33 43 76 -47 -26 -188
3422 -188 -54 61 -16 14 -138 -83 22 45 -28 0 94 10 -11 -55 -49 -12 -77 -4 -16 4 -45 29 57 8 -19 -35 -18 73
3450 73 -16 27 27 58 57 -32 34 81 18 54 -20 -80 -43 5 -9 11 -63 28 74 33 153 19 -23 -96 65 8 -142 -36 6
3479 6 -6 -27 49 30 -55 64 34 -39 15 34 13 -4 -63 148 -58 -68 111 40 -10 10 23 -61 -46 34 97 19 63 -92
3507 -92 -18 -54 -19 52 55 6 50 -12 90 -21 -21 0 -15 -55 -55 32 -30 -40 -82 -40 9 89 14 19 -2 -83 28 -20 19 10 -52
3538 -52 -15 -25 2 6 -8 22 29 -56 -3 72 -1 -37 20 -49 -20 85 -56 -52 70 30 -51 -40 -15 8 -110 -58 46 -73 61
3567F1l1J2J2j05Q0n7R0j00O8j38J61J2j01J0qpN1k1M7k0Nl6O6j0J7m6nJ9m0k8
3597d2Q6j4l0k5p2J45j14O6NO0n7k5Q3j81J83n7Ml4J21j16K9o8P7o4J8J16k3r8
3625b7Q3j33J34J17j73k8n8Q6r0M7K8r1J30L5q1R5o4j7m5L4J22k3n0o6L6J4ro7
3653f1J36j17m4K06j07r6J55M9o3k2q%r1r8K21n7m0N0L2m8l3o9J3J03nl3nq9J18
3682cJ1m1q0J72j26r0K29j3r4K5K3O8j67N4J2K1o6K9J81j14L1j84J15%O5q9L5
3709Dml1Rl4L1k1j3R4o7OK4nL3M3j23Qj7K6M7M7l3j34J06l0N6q8M4N2J59p3p3
3740D3M4r0K0L2m3lj0pP5l9J4p5Q7o5Q4j25j6J63m0j44N5j10J40l5MR9j34M3j6
3769d9O2k2m3J22k3m1lj35J37M6qon0j38P3L6L4n4L1J06j17J2J09q8P0j31J71
$$ plain form
3567 61 30 42 54 -51 29 -28 62 -38 30 -108 53 65 -36 -26 -34 -41 10 -11 36 16 21 -15 51 41 58 12 7 26 -14 -42
3597 -42 44 30 0 -25 -97 48 -66 0 5 65 8 -17 66 -115 68 11 15 -19 102 -14 15 -53 24 -40 -22 94 71 -27
3625 -27 56 -77 57 174 1 -27 -85 1 -89 -42 -14 -105 25 60 -21 74 10 -7 -52 -18 104 81 31 -35 1 15 6 -61
3653 -61 75 -42 -86 120 13 -83 72 121 58 36 28 28 -63 -161 60 3 -37 13 45 -3 -36 -105 -92 11 6 -27 -32 -121 -3
3682 -3 8 -33 -113 59 -67 -157 72 59 -35 -10 13 81 -86 -32 -20 1 -65 -36 145 31 62 -122 -7 -7 58 -31 4
3709 4 0 -31 -22 -56 -25 -46 -59 35 -32 -26 -2 -7 26 69 -54 -46 -63 -37 10 57 24 -110 -4 -34 22 -66 -22 30 189 116 43
3740 43 87 -3 17 49 6 3 -7 -14 61 22 36 -39 48 -17 67 -58 -74 89 49 -95 -40 -150 -10 -45 -41 58 -76 -33 -49
3769 -49 13 -9 -52 70 47 6 3 -132 5 51 43 37 -13 -151 -78 -42 -8 -62 -31 75 -42 -30 79 -9 61 -70 101
3796A01j10J7J8j1J9l6r5O7J05j78N8O7K3O0j10o1J6M2n9J20k7Q8q5k8N4r9O9
3823B5J08q2J7l1l7Q2K8m9p9K0l2J15j14m5J57j50N9o8P6o9j5P0n3Q4q7L7L1j27
3851a29J71l8J7K7l3M9P0n7j55J05q1N5L3J63j61%j10O6K3L2L2j33J67p9P8j02
3877A0J1j27J05O6n3J5o6K3P8j34Q2n1l7j5K04o5l5m7J1N6N3j45P9M2l7J6NOj03
3906e3J27l4JL2j35J50n6m0M2m0Lj88K09Q7o5m8N1qm1R0j41J13l4m1p7O6Q5j88
3934a33R5k6M5P6k3k5L2n2kj09J50o7P1K1n4M5k5J1J7L9M5k27J1O5o0O5Q9p2l9
3963c7j06J51P3j19k3M0O4m7l2lK8m6J4pR4p2Kj07J74k2r8R0m4J19j3K6k5kN7
3992A29p7kN2q3r1nNP4K5p7J11p4K1j17J06j8nK7j42J54l3%J66k91J32P0j02m2
$$ plain form
3796 101 -9 8 26 15 34 -2 -97 -30 75 -103 -45 22 45 105 -5 -66 -50 -8 -67 53 26 114 29 1 55 -44 25
3823 25 133 51 68 37 0 82 110 61 -18 2 -30 85 -29 -74 83 -67 -8 -76 0 -69 -84 -14 -67 17 -70 -33 -2 -129
3851 -129 42 4 21 48 15 64 134 77 -78 27 -54 1 34 197 36 36 -74 -8 15 47 79 -54 113 34 112 10
3877 10 21 -106 -1 65 12 27 -39 -16 62 -72 10 -41 -78 -93 111 46 11 -36 -25 31 84 -61 18 60 23 39 44 50 -53
3906 -53 74 40 41 73 -62 88 32 -8 34 -6 -3 -191 18 105 40 -8 43 35 -6 84 -57 56 22 -19 -96 -30 55 -133
3934 -133 -38 -64 -19 57 34 9 41 -11 -13 -122 28 -39 32 53 -1 44 19 30 47 86 131 -96 -85 -20 -80 -15 74 2 -37
3963 -37 -143 8 81 -38 -61 -21 43 -4 -36 -39 -11 -57 -43 -50 44 -28 -26 -133 41 19 -79 11 -33 86 73 99 74 72 129
3992 129 52 50 102 19 -72 -77 -72 2 27 -50 61 -13 8 -109 -3 -21 -26 1 -141 13 -20 -20 146 -145 -13 57 -45 -87
4020h7N8l1K3m1R2k0n1P4o0J8k4K6K1j3l1R7l4%o4j3O2N2m8j9K8n6K4j05j3J74
4050C9j53J28N0J4j26Q5O1j49J53k34J57qP1o3m4l1L6m7R4o3j7J17j05K2J0j5
4076a8j4O7J05j32NL4m6n9L5R9q1K0Rm3l9J08l9O%j23J01lL6R6j00mp6Q6j01N5
4106a6J5R3r8o4J8N8pLM3k0J44l55K73mn8l7n7K9P9N5j4q1jm2K4J08r7K3j26K2
4136i0J16N0r7m0N7o2K6J02j57R3J3P8m5k4O4l7J5l5l4m0K7r0J01J7M4N7j78O1
4164hp6K41j80L2ko1J03n4N0j45J02p0L1P2mp5J13m3j00L3K2J8l3J6l8R7l1L3
4192D3m2m3J07N7j90P4q4J75j09j6j4N0Q1j16P1p4K5l6l8J36j76R5O6j51Q5l5
4218e9o7Q4O5L9m4j05RP9Mo3j0JJ57j53J04o4J5L4r8P0M9p5N0p7J88k10J61mj9
$$ plain form
4020 -87 -29 -60 -37 -78 14 -6 -57 17 -43 -25 -49 -23 -2 -15 -46 51 17 17 -47 -60 2 54 6 -13 15 -41 -17 -122 -135 39
4050 39 -114 14 64 78 -48 37 98 -51 102 -132 25 17 88 25 -19 -50 -14 -61 33 -30 -47 70 -35 -13 -3 -18
4076 -18 -32 35 140 8 13 47 1 -58 -23 76 -5 15 24 -19 -58 50 11 17 17 -106 -5 -8 28 124 24 20 -56 30 -71 -16
4106 -16 -1 92 -6 -70 -52 6 -1 2 45 25 169 -186 87 83 25 -12 -69 -40 39 94 80 -1 -2 -44 -20 88 -9 14 -112 -90
4136 -90 26 76 -21 -61 -4 -66 -40 62 -95 -2 11 89 44 20 84 47 62 27 -7 -47 -20 -110 -9 8 52 109 -69 -8
4164 -8 -84 157 -23 9 7 -54 49 -5 45 -100 2 -68 -37 35 31 -44 69 26 -74 -41 -19 -1 -34 -18 -56 41 10 43
4192 43 1 -42 65 122 -68 6 -78 97 -12 -28 -42 8 89 -27 44 -30 -5 -41 -79 57 -119 -24 42 -109 -24 -59
4218 -59 -126 -42 23 62 18 -87 -78 1 5 -58 -68 -67 90 -63 41 -23 -8 26 -72 -2 47 -28 22 -55 133 -77 84 80 61
4247F1n5j4l7J03j3j35J00K9l3J15j04k8N5q4P1n8oj6j23L9K8J07j07J06n9o3
4273a21N8K1J62j98K0L2O9L1m0QK7k17J65j49J24P6o8%M3o3L0K6q2NR3K6j2J0
4301G6j45O5o9N6J36n1l1j44R6L4j13Q2L2o6M0n9O9O1j33J36l1q1O1k3o9Q1k6
4328a6R1P7j31J6l4l2M8N9j29J12J1o4K2J4p1Q4o2m4J3M5l7n5P7j5p3N0N8O4l4
4357D4j42Q9M3J0m6n8M7rO8k5R6m6rp2O5m3%L0m1oL3K9m5L3j42J13j32R2n7Q9
4387Hl6m9J19j72R6K6NP9l0K8j17R3q2l3J22mm2N1r0K7l2J08q5m0N6K8q4M1k7
4416c6M4j03O3K2Oj6M0o6LJ17j33J37l8J2J3n2K4L2j05l0M7p6Q6N8p3L2%o9M3
4445a8J30m4j63J12o3NJ5R2n2P5j34J08k54K20O5o7j3p2L6o3J24m0j24R7J27n3
$$ plain form
4247 61 6 -8 -45 58 45 -90 10 39 6 121 17 -11 44 -40 31 -27 -33 -49 -172 -133 -105 2 -105 1 -58 -121
4273 -121 -63 -42 120 -78 -58 -26 43 74 34 42 69 -148 17 -132 -8 68 0 0 43 -20 10 36 -46 -41 52 78 66 76
4301 76 -69 -4 -73 -17 119 68 37 -107 -11 23 -90 -8 24 -42 -2 -61 8 69 -64 72 41 -40 21 -2 -71 10 -16
4328 -16 75 152 21 37 3 -29 19 78 -51 61 72 8 30 44 -27 57 -5 -49 -36 9 -28 -83 -6 -21 -94 -44 14 78 44
4357 44 -98 -9 34 44 -2 -60 -13 -22 46 21 117 71 62 -10 55 12 12 42 1 -5 28 57 12 45 -97 16 -116 -24 -81 8
4387 8 -28 -77 42 -130 -34 -8 -3 76 46 74 -43 50 -32 -65 57 53 11 62 -28 -1 -33 75 -10 -50 6 34 -50 -9 -36
4416 -36 8 -95 -32 -10 -4 -20 20 -46 -43 74 -59 78 40 52 65 13 37 69 -36 -66 -19 -95 -9 49 -24 8 8 -61 -18
4445 -18 112 68 -95 17 -46 -41 -26 66 14 89 -45 63 -191 29 94 27 14 -58 -22 -85 39 -1 -125 -28 99 46
4471D6k2Op9O0K6o0n8J12P9j47k3J63l3n5jj0Q9m5K1p0o8J05N8j25M8q7j4N4J25
4500I5r1q4K16j61m9o2J76r6J20L6j17o8K28j11n0J4N6l1L7J9n9l4M4J2n3ln6
4527g2P5p3K3Q7J0n9K1J4l8k1M4rL7j14J97j77k3J70p8nl4kk6R9j16Lj0Q1K3P7
4557A04j57J2QP5K8j54M6P3K9q4P4k0p2J8k4l9Q0n0N2J1k8L4M7j70K06m0j8k5
4585A6J4o6J7l7M0p6N7l5o1M8P6k5K8J62j28n7M1j5kj9l1j8n1J20p2J20N7j19
4613a6J3P5q5P6q4j5O2jj87J57j3p3J54m5l1M3k4p5J59m4p2k9L4j23L1P7M3J8
4641B5j30Q5o8J11Q5n7j13P6p9K3M8n8J27m2j7N8ol9l2l6N9r5R2qn7R0j4J5p9
4670c6p7M3nP6qO9r1J74j59n1J70r5q3J5O8m6J60p1o0K7n8R6o8K9Q1k1j35Q0k0
$$ plain form
4471 46 24 30 -49 11 37 -23 -81 31 110 -37 -60 103 70 15 14 4 93 48 69 -1 -69 36 94 -31 17 -70 -84 -30 95
4500 95 4 -80 136 -25 -74 -136 40 -56 64 100 -17 -85 143 32 -18 -4 52 21 58 77 18 -16 28 40 -13 -16 -72
4527 -72 3 -70 -47 40 50 -9 12 26 -12 -33 11 2 39 -75 122 -55 -78 92 14 9 -25 -27 -53 46 -70 -67 -77 4 27 104
4557 104 -53 -41 -33 42 70 -84 -38 35 64 -20 54 34 -38 -20 -44 -83 -3 -53 -1 10 -18 16 63 -107 99 59 41 16
4585 16 30 -36 -19 -56 -16 -92 -35 -70 -131 -83 -7 -32 -4 158 30 -27 14 -1 -3 -22 -53 -71 -122 -2 -74 46 103 -16
4613 -16 -3 72 -13 63 -21 -36 26 25 -162 -5 -18 -91 63 18 -13 30 6 -69 90 46 -26 -55 -21 -144 -113 -36 7 25
4641 25 -105 -20 -88 23 108 51 -62 14 -65 -42 6 -52 75 33 16 74 68 29 -3 -39 20 -75 17 9 -48 42 28 43 -36
4670 -36 -113 -70 -75 1 -7 62 -29 145 -14 -65 105 10 -73 -58 10 -36 124 53 -7 20 -38 58 -10 19 100 79 -56 24 4
4699Dl5R0n0kKN7K1l0r4N6K7N5l2o1l5Q9m0mL3l5j2m5N1m8o4J06j22K00K1p4q1
4730e2K9k9P1J32j30N6j29q1K08j01l1J1J9L8P8k40Q6j2K9Q2j22J34o4O2J1j33
4756g8Q3RL2o4j6J54j02K4o1k9J29j70K6J41j92l9J70p1J19p8J56j38lQ4j01J04
4782H9m7o2N4p3J58k20K32j9q9R5j41j3N2p6N1Q2r5R8j13J1Q7j06R8L2j67R0k9
4809b1L1j9j17K1Q3k8k9P3L0j1l4lL9p3k6KJ80Mj32j8J3J05l1j06P6j8j9Q2p5
4838b1l0l6R2p5Q1RN7j02L6q2J0M2mj7j2l3Q0M3j0K0r0O0m9j1J30q2lN8k01J13
4868b7o7J36L2k3Nj6K7j62O6K4rJ1nJ5q7J53m1q7J09q4M7K9n3M6q9oP3rK7o3j4
4899d2L6n2J03l0o8J48j05n5J78j14Lq1O7J23j84k5J47N9j29n5P6J03m9q2M7j21
$$ plain form
4699 4 -31 59 9 7 9 66 87 57 -37 19 46 101 69 8 -27 62 22 18 51 16 4 -41 10 -38 -102 4 -118 82 103 29 -52
4730 -52 -23 -52 19 151 21 77 -52 -133 75 -26 -57 -46 -27 11 89 -151 -65 -77 -48 34 -88 46 -18 44 55 -78
4756 -78 5 14 46 -18 -34 120 18 42 -19 -48 81 -89 -63 78 -114 -153 17 -54 65 -13 143 5 2 86 -15 89
4782 89 42 -20 34 -39 119 -101 131 112 23 118 -23 -36 16 -60 -9 73 -22 76 -37 -26 61 -45 53 85 -82 8 -21
4809 -21 10 -9 -126 -105 -22 -50 -79 -6 24 13 -21 -24 15 -58 -84 -82 98 102 -30 -48 -35 70 39 -67 9 -9 -28 54 -21
4838 -21 -51 -87 5 -70 11 20 77 -25 11 -71 -61 -19 -23 -40 -52 -85 -5 38 28 48 -42 18 -31 -42 88 6 3 61 -140 -27
4868 -27 -94 42 74 51 56 40 67 -95 -29 -5 -14 -3 -8 7 -80 73 32 -55 54 -30 17 46 -7 39 -50 -56 17 8 35 -28 -42
4899 -42 -6 -58 45 15 -53 95 -10 -65 113 -1 2 -79 -12 111 -73 -98 49 108 -21 -76 0 103 54 -28 19 -102
4925a02k5P4J91j56L7jj9J4%N5P9r9J4j39M9Q6l1k5j1q9J53l1K9L0n4q0J3J20
4953H2j43j1qP3J05p9L0k9j13J37pJ30k18L4M2M0Rn2J8M3j37P6l8P8n8MR5r3l
4982GJ15j12M1j44QP7M7K9q3OJ8m4J02L0m2j8j24P7K1L6pr3J00j27o4Q8k9J27
5010D2l1q2J56nk8j25J31J1k3j30mJ03p3P5kn8J7j8J08j24rJ5%k6K7M9J08L0j96
5039f2J06j5pq8K2K4m1l4J13P8q0m4P8l0O2j41Lo4R8l7M4m7k1J11l4m7K3R1m9
5068A2O3k10J00p5J25q1q3J86jJ1m0nqr0P0J03r0O4j29J40j4L1k0m0N8l4J5k18
5096a60J54rl2jr8L1J36j0j22K28j90O0mO8j1l6L3n0J89j26p7OO3p0J34j45M6
5123Gm6R0j02K3J32p0M0n1M3q5NOk4l2J1J56j18J40k14R6k5j44K16o8j12L8Q5
$$ plain form
4925 -102 -127 -53 138 -18 19 18 -1 13 13 68 147 48 62 -77 -28 58 27 2 -9 -98 55 24 53 83 29 -51 -38 82
4953 82 -61 -72 -80 -7 98 19 49 20 -93 44 37 167 -51 -17 25 65 74 22 40 83 -54 22 -16 62 4 8 103 10 7
4982 7 122 10 51 -93 -85 -8 39 68 -15 -9 9 -35 67 97 55 37 -87 -10 11 47 40 -53 47 -80 -144 -56 -85 42
5010 42 11 -71 85 80 52 -73 58 69 46 -84 -88 15 -58 17 15 -43 -26 -44 64 -60 -69 -54 -54 -80 -53 -4 104 134 -62
5039 -62 44 29 22 -66 -44 -20 -61 -95 18 96 16 -28 50 20 82 -59 -56 -120 -22 -59 -15 -62 -83 28 -6 -53 -30 61 12
5068 12 75 -135 -35 -110 15 -66 -149 37 36 47 7 2 -6 -96 -26 77 -13 51 -78 62 48 79 59 19 77 43 58 -160
5096 -160 -6 -15 -47 -48 -146 -115 21 11 -111 117 -73 -13 -17 51 40 4 37 -13 176 50 -27 -21 42 -28 106 -39 7
5123 7 -39 51 -51 -28 104 34 74 23 66 -19 -14 -8 -32 -64 -53 103 -15 125 -89 7 -18 -162 54 -14 -126 -88 -3
5150ck5L3Kml6M3P5r9O9j70J65Lp4kJ3mJ9N5j74R6j9k4RP7q7J6J8q6N8O8m4J2
5182b0P3o9J9L3j2o6R6J7j8M7n9o2NM2oo2Q2JO0rp3n8m3J34q8J9P1j24M5J57p6
5213E6rl7j5Q3L3r5m3K1P0j5Rj51K2K9k0O0r9O0M4N5k6P6j57K1KK7JL8n0K7j4
5244Cq1R2lJ34j87L5j22K1R9j17J76k2nk6j3P4j5k1k3J5n6n5P2J6j15J84m7n6
5272d3L1N8Ql4o3J33j71L0J13q3LL0Rl0J18j01lkP5n7j4Mjp1O0P0j03MP0L4p9
5303eq0J03j4j35O8R0J5q2J11j11J75n7p8q7O5N8l3M1Pk4j02J94lq5J6K8q6k1
5331c2J05q9r0J30n6L4m4J11n5M3q2M3p9Q3m6k5nk4K11p5J0j1Kp2L1o4j4J28j06
5360c8j7J8J26j7o8J3L4Mj1J0p3N2l0L9j52L10n1j64RM4n0k6P9J1K5j32lJ50j08
$$ plain form
5150 -3 -28 5 7 3 -33 10 85 -14 55 -115 50 53 -21 -23 -10 -14 5 60 -114 -18 -37 -61 -52 25 -62 -46 -28 -114 -56 12 -32 -20
5182 -20 53 -16 3 36 24 -42 54 71 53 100 41 -21 -16 26 20 -42 40 41 101 92 19 -39 -82 52 -36 -17 54 -70 -25 132 56
5213 56 47 10 -5 78 111 16 -27 -6 64 49 58 -93 -71 -42 -62 -2 -101 -41 3 58 32 108 -49 -28 -26 1 2 40 -10 17 3
5244 3 -78 14 11 145 -42 -7 -129 -108 -9 -126 50 28 23 -3 -16 58 43 22 -1 14 -42 -97 -25 -9 -124 60 13 -43
5272 -43 -12 46 54 20 -43 90 -81 -51 62 -21 -18 12 21 -9 109 8 5 3 78 21 7 11 10 -61 -1 69 -34 -30 40 74 -5
5303 -5 -85 18 4 -131 -63 27 42 -40 71 -40 135 78 0 -87 -22 36 3 44 51 27 -75 119 116 31 47 75 -11 -32
5331 -32 73 -16 -106 24 -32 2 -42 69 14 57 -25 18 -61 22 -24 -49 -54 -78 133 58 68 57 59 -13 18 -46 -60 68 -38
5360 -38 -55 -37 89 72 4 17 51 55 44 54 -19 33 3 42 -110 200 149 -15 -6 38 -12 -38 41 52 77 -55 -58 92 -16
5389a6j21J54j4ln6L0j07J50o7pQ1m2r0K17p0j9J7mJ00j00L7m9kO0j61J08Lj0
5417A9j9L2J34j25m6J19j59J07j30k0J68K6q2L2j13o9J28k1j9L1K1M2n1j8Kl8
5443d9N9L3p3Q3n0L2o4l3J46r5k8L8J48k14P4m9j4J14j0m9L7L0j34J6L0J63j38
5470Co0J54j76N1q6Q6J01r8M9q3J00j24L6R1qj2j3j1m1J43j09l4nP4k8J0J3J0
5498C3l6KJ00j04p3J28Lp4m7O3J03o7j68J48L9j37J44j01j9J12j03%o8J68k8q7
5524f9M3n0J34m4QK6j10J20j7M1l3K8q5J30j06m5P6q8L7l1J8J06o8r3J75j61J69
5551A11j12j42J94k0j7L6m7J0j45J78j1p2Q4O4r6L2j09pN1l9K3P4M3j5n8JO6k6
5579E1q3R9K7k78R2J15Q1j69J03j04N6J2j5O4M9n8J00j48j64Q8N7k3L2j8n5P2
$$ plain form
5389 -16 -137 17 3 0 -56 -26 -133 17 -50 -57 24 -18 -108 109 39 20 37 33 133 33 70 21 19 79 -82 26 29 19
5417 19 0 32 166 41 -5 114 -45 62 -68 -88 80 106 24 56 -57 -126 2 -19 -38 -7 14 56 5 -13 -11 -49
5443 -49 10 43 -30 53 3 35 -29 -62 84 -11 -39 -1 147 -67 7 -42 -56 58 48 -1 36 66 -68 -52 -22 141 3
5470 3 -57 97 -79 -28 -114 -28 73 -25 24 -59 41 -83 -47 44 36 24 11 0 -41 102 -7 -41 -46 28 0 10 23 33
5498 33 -3 -1 99 -5 -78 50 53 -21 -68 -5 98 31 -137 11 50 -87 57 -44 -63 49 -54 -54 -122 46 18 -69
5524 -69 -26 -76 58 14 22 48 -62 58 41 82 49 77 -8 122 16 -29 47 -41 -4 -35 -17 89 21 -72 103 -58 111
5551 111 -1 -143 51 31 14 50 3 13 -132 46 35 -37 47 111 15 47 -62 -69 -18 -57 -34 40 83 68 10 11 77 51
5579 51 -32 67 94 -184 -92 23 104 -65 38 -66 -10 2 -13 51 100 42 142 -6 -170 -82 -25 -48 -16 -34 -89 -17
5605a7j2k2L8K3mK8l8R4j11k5n9J62j25J1P6j31J15R4j59mO5l5J4J84j87l3P6
5632A8K4mO8j05j9M4j3Qj5n3m2N0N4l9M8q6k0K6J18o3k5K6r3N1Q6l0J9p6M5m0
5662c8j0R9r3J02j41J14m6O2O3j23j4Q0p6O9l9l4J07o1k7j05K00m1M0j6q8Jl2
5689d7M9L5j08J11q9%J65o9n7L0nRL2o0PK4N5j03N1M2%j38Q9ML4j33O5L8j11j2
5719i2J5J5J32q4J41k37J32k2J54j78Q1j8j32Q9P6p7J2q2J67n2P0Pj9j64J45J6
5745I5Jk5j03J3K6p3M5L1m9k4lL0R5L3n3o7J4M7O0j41j0j7O9PN6m8p1J15m9O6
5775G0M3K5m9pnQq4J7p8R6J7k2m7K2J1q0P1nm5K4J0j2k5NK7O7m0l4l8J9J46k17
5807a10O8N0m2l5L2K2l1J05n0j1k0M0rL2jjo2J26l7j56P2m2J8J33m9j10M3j0J35
$$ plain form
5605 -17 -29 -51 -13 10 6 34 -4 90 -21 -46 -105 57 -68 -57 19 -112 3 97 -62 -66 -1 -36 -22 162 -25 -58 18
5632 18 42 38 106 1 -18 26 13 21 6 -47 -89 -39 15 -24 24 -62 -82 -56 62 -1 -26 0 -93 -42 44 14 33 -43 2 -38
5662 -38 -48 51 -42 60 -81 33 -13 49 112 -11 -25 55 -21 48 9 -25 82 21 -6 -111 89 48 88 72 -16 -15 -47
5689 -47 2 37 -71 40 -49 -49 116 47 -10 20 15 24 56 -4 3 27 82 -21 30 72 72 -66 23 27 61 -72 -7 31 -80 -92
5719 -92 -77 -62 70 -14 127 -110 22 0 154 -24 57 39 -93 -4 72 -5 7 -75 92 40 110 117 98 -66 79 95
5745 95 96 71 -32 -19 7 -66 -21 10 -39 -63 -66 -36 59 92 39 -28 -14 33 93 -48 -58 -75 -6 1 57 9 -62 53 4 70
5775 70 113 138 89 82 77 85 1 18 -60 36 53 31 -16 6 17 -63 8 3 -42 -18 -8 -20 -45 -40 -13 54 14 -20 -58 -39 107 -110
5807 -110 -42 8 -34 -69 -37 -15 -46 59 9 -2 -22 18 9 41 40 39 -23 103 66 -90 -18 -60 -42 91 42 -68 -25 -35 100
5836A00j00j2M7j11L5L6l1L0%j48K03j12J15j05k2J70j35N3j00J13Oj58J27J3
5860A4P6k03J08K2%K1j7Jj4j71J51j3j6J01r9L0N8m7L3j06Q7o4J07k8o7j1nO6
5888A4o2l4Q9KN3k8m5L7k4o7P7O6r4NJ8J2K2kj4n3K6LL7m1k0k1l8J1J65p9Mr6
5920g7L2j0J00p0j28Q1J36j5j43J29j2J0o5R6K7j1n8N3r3K6l9L7M0K2q1k9R1k2
5948B7MO6j05j3P0l1m7n6J39j46Q0R7j86LP7N5q9l6J57q4l5k8Q7o4O4%k6n6J11
5977C5o3j9L0Mm8m2m9K44j03q1R7O5j7K3r8N6o0j8n9J06oJ00Kj40N7p5J4P5M2
6006G2j30k5pM7n6J44j6j18R8O5l7q9J14r9j3N8p2p8K23j15j2Q5J8L2m3K7o3K4
6034C4j38J44K6L2r4k0j7R3mL8O1j28J11j04o2O1n8j06K04l5p8J70j49j10J67
$$ plain form
5836 100 0 -12 35 -76 -41 -5 -36 -6 -6 -154 49 -63 52 -53 -75 95 -40 13 -87 26 32 -126 1 14
5860 14 90 -113 -5 17 17 38 21 22 8 -163 -12 -25 -41 60 -39 -9 49 2 35 -71 16 -48 59 31 -36 -47 -52 14
5888 14 -48 -82 7 9 62 34 -11 26 2 -65 12 78 -16 -11 7 19 41 39 25 -28 -2 1 38 -3 -23 -44 -82 -71 94 15 19 -77
5920 -77 -45 -55 45 -25 -153 -72 64 49 -94 35 23 33 -32 64 91 80 22 75 -18 8 -31 6 46 68 -13 -42 49 27
5948 27 31 97 -8 -21 49 18 -29 -85 54 -92 -12 85 -101 -98 -21 34 -55 -91 66 -18 -53 -81 6 -58 6 6 -20 -76 35
5977 35 -28 -47 -17 -13 -61 -103 -152 92 -11 -92 5 70 53 76 -22 34 -26 -44 -103 3 -3 97 99 -41 16 -59 -45 30 72
6006 72 -58 -83 -90 -43 -99 45 29 -89 9 74 37 -52 62 -37 -50 8 -64 -142 81 -34 -46 39 57 89 46 73 10 34
6034 34 -104 40 66 98 4 -16 -33 60 56 94 155 27 138 34 -28 33 -25 -131 73 38 -40 130 -19 -129 38
6059C8n4N3j49R1M4l9q3J29k4K1ro8Q6l9N5j12J0J3Q6j5j06J24j47L4P9R6j54
6086d0L9oljj18L3P8j7Pn5M4N0m8o9J10j48J50N7l7k6Po8L6k6O9Ol9M1O3j12P3
6117E0n4l4K4LJ9l6m1P7M7m9J00k1k0j40L0M4mM8rl4n9K01q7r8P9n3L6J46j74
6146iJ4On9J32q1M5Lo8Q5r1O6j1N4j1j5jK6qj98R5K8pJ1K4n9J4k1K0R8q4j0j0
6178b2Q4q8k5J9l2O6p3J63j44J42l8o2l4MJ6M6n7k4r9J27m7J08L2q1l1J0p2J63
6206E1j8J4j03OJ42m1J4k06L20k4r8j50J87j43M0J7PLl8P0n1o6O4N0q9m5KM9L4
6235bpk2N1q6Q8j58J40o6K4R4r1K9O7ok8J3r5O8j29J03N9j48K52j49l7k8J30j56
6263i0r1J35l1J29n3N7j9l1N0q5j00J48j8j9M1k6n5N9oj2O4l2o3Q0j52J43o4q8
$$ plain form
6059 38 -16 37 -112 -21 23 -16 -99 30 6 27 18 -50 36 -3 52 -60 -50 -37 49 34 -72 52 -95 -61 18 114 -40
6086 -40 -1 -7 -10 -11 -129 -96 -18 -35 -28 -83 -39 11 -37 -106 4 -144 6 63 26 0 7 -61 -25 -51 18 24 -15 26 89 -23 50
6117 50 -4 -38 -14 -11 8 -28 -69 8 55 6 106 85 65 -75 -45 -1 -5 43 34 0 -59 142 55 -43 36 -17 19 165 -9
6146 -9 5 11 -48 84 3 48 51 -17 68 -23 43 32 86 75 60 59 85 77 -121 -26 2 -5 6 30 -29 -15 -36 -16 82 -2 -12 -22
6178 -22 62 -26 -51 -32 -64 2 -71 92 -52 90 52 -10 -44 -40 -24 22 -35 -59 -158 -31 -78 30 62 -19 -50 -40 -112 51
6206 51 33 47 -56 -50 92 51 65 -141 179 155 57 -93 94 -49 -9 8 15 18 -20 50 -1 -67 -3 47 -42 -87 -85 -36 -2
6235 -2 -9 -31 20 -66 22 -136 4 -62 -38 56 -35 -6 61 55 27 40 -55 13 -116 -13 46 -102 150 1 -36 -64 66 -90
6263 -90 -181 -46 -77 52 -1 56 37 6 56 -29 -129 19 1 -18 23 -3 -58 1 -5 -17 47 15 -48 32 -120 23 -41 -129
6291a29J49j2k04J54K8N5q5j2j5M6j00O5R8M9p5p8M3P5L5j05Q3j39O3p6O6q4P8
6318b7MmJ16j8nr5J05K7p8L7j07J60q3rj45O4O5P8j33k7J5k0J9J39o3j04K2Q8
6346B1J9j3q1J8J62j23k0j3N3o5l6J06J9l1J2m4O4l2L5k3J5L3o6lL3q6J19l2n0
6375iNQ8p1J0k9j12Q9M1j13O2K6k5N8r8Q2M8n6Mm3l2Q7L5L3j68Q7k5L4r3K8L0
6405b7J56m8j01j6O9o6J60o4R0j65K8m0N0m7o3l6K27q3m9J98k16L3m1L1L5j64
6431a49J03Q7j30J27K6j50N3K5j04J15Nl2M3K1o5Q5r1o9m6J94j29N9m7N5P5j7
6457D4j20R4O7o2P4j5j12qRJ8jO1L8j11Q7j3k8o7j7R3r1J02k01K45n5j1l0p0J14
6486C4J6m3o5J18n2J5m8M2p0J06m6Pk7N4OL6k4j12J35k2k7j8J01j12J1p6O3j03
$$ plain form
6291 -129 20 8 -196 -42 -14 41 -44 -56 -71 -25 -125 -60 38 87 12 -66 -23 52 87 -18 65 -74 -11 -87 -21 -105 -27
6318 -27 -23 -27 89 71 66 -29 76 103 25 62 -45 115 32 23 -122 -58 7 85 -48 -75 -60 -80 -61 78 15 -89 -67 21
6346 21 40 27 -54 -36 126 3 -17 -30 23 -42 -78 28 47 16 28 -16 48 16 51 28 43 76 10 7 40 -46 73 41 -9
6375 -9 -4 84 13 23 -6 -118 -29 12 -101 -39 -13 -38 20 -78 4 52 -4 0 -43 -75 12 47 80 -88 -1 -26 8 -85 -57 -27
6405 -27 129 81 -20 -36 33 -33 127 63 153 -12 16 -24 26 -21 -84 -120 107 24 -25 173 -43 -10 -51 -20 15 -149
6431 -149 -46 41 -89 38 64 -86 -33 -8 -112 3 8 -24 19 40 -25 60 -31 -100 -146 48 -81 -22 -69 -14 61 44
6457 44 -76 18 85 23 97 82 -30 -38 -29 -11 -12 49 87 -24 63 50 22 -45 -62 31 -60 42 -159 86 31 20 -10 -80 34
6486 34 50 7 -58 60 8 23 -25 17 -53 53 7 14 -13 41 47 83 59 -53 82 60 33 15 116 4 15 -61 2 -101
6514a01J00N9O0j21M8L4j16O6m8R6j09J25j12R4j82K07j59J23m6q7m4K11K7k9
6538I6j5r2k2N9J8r4K9M9j42J02P9m1N4j20j1j4N0L0j3N8k17K02%l5J0nkpL9j7
6568B8J6k2R2r5k7N7Po3oL2J3n7K4J40j00k7j4P8j4j22q8K15q1L7m3k3K6M7o5
6597c5K7j51J37On0K9o7O4J38j28N3p4P7M2L6k01J86j06n7J32%q9J46j05j45J38
6623Cj01J04Jjj6n4J65j24J0mO9j14L1K6PN1j25P2lk1N6j2n1J7nM9j28M3K00k02
6653e7K2k8JL6J2Jq3O9NO5r7O9L9r7L8j5n5J28k1p4m7J19q0j6Qo2J33o7J7R8l1
6684C0Q9j02kO0j17K9o9R7J3j0l1j2q1J20n1Kj6M9O2k3L0Ml1jo7m8L8J7l1N9l1
6715b4M5p3k1Q5o2%R8p6k6o4L6R6p3K5J6M5o8k2J38n5J5K2Km3n1J78j39pO5n0
$$ plain form
6514 -101 -1 58 118 -3 45 79 -37 29 -19 77 -32 93 -19 75 -107 100 -59 64 18 -69 -113 98 125 96
6538 96 81 -11 -33 26 44 -50 -21 28 -114 -12 67 26 80 -40 -51 -65 -15 15 2 60 -157 45 45 10 20 15 13 6 45 28
6568 28 44 22 114 19 -8 49 56 -7 -13 19 32 -25 -1 139 39 12 -2 76 62 -60 -148 67 -14 23 -20 -43 -17 30 -35
6597 -35 -8 -159 -22 -16 -66 -37 -104 -40 98 -30 23 -51 26 68 104 -97 89 -17 -74 58 58 -31 115 10 -135 3
6623 3 -98 6 7 6 -10 -64 101 -23 -13 -17 52 -62 -31 -5 2 53 -72 0 -3 -24 32 20 -31 -14 -19 30 -98 -55 145 -57
6653 -57 -35 -63 -62 -26 -14 -13 -96 -27 -22 43 -54 15 54 -43 -5 -20 -75 53 32 -42 -89 30 -50 -66 -58 -120 13 -54 -37 61 30
6684 30 119 17 15 75 -42 -13 -82 15 28 18 -13 -25 -106 14 -37 -35 -51 -2 60 37 67 71 40 39 -28 -76 -38 -21 -52 7 -24
6715 -24 21 -52 -73 12 -50 -50 48 -28 -54 -118 -82 14 -59 -34 -18 27 -41 -63 75 20 35 57 59 16 -35 143 4 -3 62 12
6745A2Ql5L7p9J06R5j09O9r3r8J09J5M9J6r0R2l9k6J3o4l1j6k7J06p0O8K3J2K7
6774H0j36R5j11M4rN3N3N3j26K9o8J09o3o1P2nR6j32J43j35j8l3R5PM9m6p1k7
6802f3R0m6p8K29j77M8O5j45J30Nj27K06j03k0jNM2q0K4j87K84n8J9j7K0l6N0
6829G9M6j17K4JR8j87L6P8J6r3jP6j28M1OkM1m4J04oj29K6J4lk8KM5m0M7L5j11
6860g4J77r5m3n6j3Q0J2P0j8Po0j6N5K8j34L0J18m6n8jq5J66j2J4m9l7%k0J62
6889A02j58n1k1J66j39N0R1q6J37r8n4J09o3R4n8K4n2j5Q7m9l4J75j81M0m2mO4
6916C4qL0n2j3Q0k11K13l7j03M3o4J38o3k3N9J3p9N7n4j0K7nO6n6N3J5N9j90J07
6945B6O8k31K04j39K4J19l5j44Q9J5n6J6J0p8LJ20L0k0L9j23n7N5P6l0K8n1j02
$$ plain form
6745 12 20 -15 22 -57 49 144 35 104 11 -87 22 37 86 102 12 104 65 39 52 -12 -43 -59 -86 20 -50 18 41 53 80
6774 80 -56 39 -72 -28 -37 16 69 122 -4 25 -43 66 3 -58 14 9 105 -27 116 -19 -37 -70 25 32 81 35 -36 -63
6802 -63 27 -19 -97 132 -45 3 68 -77 53 58 -69 137 34 14 13 18 60 -20 4 -183 101 43 62 45 65 29 79
6829 79 125 8 32 33 131 -56 -20 58 74 -19 -20 56 -72 -31 -25 -27 14 -30 74 68 -61 -35 -21 -24 -52 -50 -5 -45 2 37 -74
6860 -74 103 8 -35 -91 -104 -24 -12 58 40 47 -13 -29 26 54 -80 -50 68 22 -36 -37 -122 44 32 46 -3 -40 -40 -60 102
6889 102 -56 -107 -128 38 -101 -51 40 -46 91 -7 -61 48 -15 79 21 45 -7 -22 65 16 -18 157 -24 16 -26 -30 34
6916 34 26 56 4 -9 71 -140 73 36 -67 -24 -88 50 -13 -36 23 36 -43 14 -40 -50 -23 -28 38 -18 35 50 109 -81 26
6945 26 94 -137 67 -72 -48 71 36 -108 -19 -4 -60 -44 -34 -112 -109 11 41 21 60 -63 -120 -65 11 -19 9 -42 -144
6972a44N7J3M7J12o0m7N9J15j37j4n7NJ02olJ14j42k3N0o5m6l6K30k15m1Q0J04
6999E2p7J8o9J38k5Lj43J41M1r8L1n0P6R5l7k8k1o4J5k4J09n9q8k5J82j09R2n8
7027A8p0J54n0j40J15Pj11Q7l0n5O8J2RP7j24L2L8O4j39j3J15j88N8M8q4J01M1
7054D0o6J13r0j00K23n7k8o1k6N4K8m0Q4j43O0j4j3J02q2n7O9J44j10K8n8P4p
7081F7j40PJ45j37K5R0l7pK7j8l6o9J32K0m2q1L6J30j27Q6j32R9p4J46q2q9k4
7108h5Q0J0M5r7J82j74J48j15K8k6M0J3j06R3N8n6k2L4n6L0p9J54m9n1j8M6K6
7135E3j23m3Q1l7J6R7Nk9K7j41N7P0M8j32MMN9l2oRL4l5k2J23j17J07p6N4r5M2
7165Bk9R8j15J30J7n4nK0j63RJ82j11rJ05m3K4j16L1P4j61K09k9j19L4O7l7P4
$$ plain form
6972 -144 -87 -74 -27 85 25 -22 37 152 15 1 -56 -51 51 45 42 156 14 -9 41 -24 -70 -106 124 -91 -132 -52 52
6999 52 -25 -7 -76 62 37 40 -103 38 79 -19 12 -38 38 133 96 68 47 -17 -2 -26 83 24 -64 -89 93 -16 76 18
7027 18 -52 102 52 -88 27 34 -77 10 -20 -75 -7 5 14 91 -33 -1 37 101 -38 -51 64 -124 -66 -18 -102 -1 40
7054 40 -26 87 -3 -103 120 63 35 -26 -52 2 30 -10 74 -69 -9 -23 -36 66 -16 -73 -4 140 30 58 0 74 67
7081 67 -73 -66 79 -58 -33 57 20 13 40 22 -14 -83 49 69 27 -54 -18 112 -15 71 -61 38 -36 110 28 -61 -85
7108 -85 -5 5 50 -47 135 -39 109 -6 22 -4 36 49 -57 36 94 38 16 50 -6 24 -55 99 50 -1 -19 27 53
7135 53 -70 -113 -32 -69 -53 44 49 20 47 -94 -37 33 81 -51 -47 -43 16 -16 -22 -13 21 -14 -36 87 -30 77 1 55 -40 2
7165 2 -27 71 -44 86 103 49 44 64 -99 -90 92 -19 -28 77 34 58 -58 -27 47 -114 95 66 -53 -19 48 11 85
7192H5l5n3Qj7k6J37q4j12P4P2J06j24K7j02L3P1m3l5M0P7j26M2k7O1m5l2L4p6
7220g0N7OM3L1j08P6n7N0m3l0P0m7K5N4j10Q3L4q0j0J87j10k5P1q5j06J27k0n2
7248c9M9J6K2j63J66M7j11K8J4j79J45J0j2L3n1K0J02q3MN0j32R2m9J38r8p6J40
7275H3j5m2p9M3M3m9q7R7p3J76j19M4j6n6N3pM7K3j32P0n2M5J31j51j9lJ28o4
7303A9M5p3J5o5L1J0k5n1J60j18L5o5o3J59o6O4j41J19K4Jm4L6l0J01j46J07L4
7330G3r0j9R6L3m2j30J57j42J32j48J38j6l7j01M8J1O7Rj06P9J5n1q6OK10j29
7356b3J16j63J23l2J3J04j65J62r9j04P1m9o0J42k0K5j6LO9Ko9k8O2L2q3J9o7
7383c5p3R8q2L9QM4K1j15J14j20J01k3O2j97N9M5lO2l2Q1m9L6l3n9N2k6LQ3m9
$$ plain form
7192 85 50 -3 5 -12 -38 99 15 -97 -23 49 155 31 58 -44 -11 60 17 -18 22 99 -27 15 -12 49 4 -28 6 -70
7220 -70 -13 -7 36 67 -41 35 -22 28 -15 -45 25 -22 3 57 -53 30 64 -16 -26 161 51 26 97 12 -94 33 13 -39
7248 -39 10 26 48 -115 51 98 -13 15 29 -150 -5 5 -7 26 -25 -5 97 14 18 68 -64 28 -21 117 19 -57 83
7275 83 68 26 -53 -10 33 -16 -103 -6 -79 97 -22 22 6 -50 3 -4 43 66 -66 4 -48 -3 128 -23 -42 -45 83 19
7303 19 64 -9 6 -59 -28 -18 -43 -94 66 -52 -17 -82 -145 14 -52 12 -129 -10 14 15 -29 7 -23 78 -68 39 73
7330 73 -17 -36 60 93 51 -79 78 -64 68 -80 58 42 5 -96 -48 -37 30 39 -67 12 27 -24 -110 -104 106 -23
7356 -23 93 -70 53 21 34 138 -27 135 36 -68 3 -46 -106 36 16 41 25 28 97 99 30 2 64 96 13 32 -35
7383 -35 -108 -10 -92 -53 -45 -1 20 -95 19 -101 0 -23 39 -158 -99 -54 -57 5 -27 54 5 41 8 -51 1 -25 -22 61 12
7412A2l6N2j8M5r1J86n4j08j3Rk6M6J2J6q9M5J22j60N5l3L2J4j12N9j01M3J7J84
7440A08j53R3qJj34R3j1j1rJ42j10R8m4k4l9K0Q2j25J4O3p8N2Ll5NP8q0n3Q0j50
7470a32J30j1moQ3L3j60J9p8M9P6Lo6LM5k5j8O4m7m0J5R2m8l6P7q3Q9o1J17j7
7500F3m6m3R5jj56l2J79m7p8L8L3l9O5oK4n0m4L2N5r0Q7l1n7R5L3l7p5K4K2j1
7530BO1R3j21j1QP3m5o7K3k6o1K25q7o5L7o8RJ16j98K16q2q2J66n7J5j18Q7j45
7558a02K8M4p5O9j5O5r7R2J0m3K3j44J66Q5k13J58j04Q9n2j6m1K08j54M3j22P1
$$ plain form
7412 12 -24 28 10 55 -36 150 96 -12 -25 -16 -42 4 16 32 -57 -12 110 -50 5 -28 4 18 -94 -35 -136 -93 -76 108
7440 108 -45 48 40 41 -93 0 -11 -22 -31 111 1 99 55 31 -8 12 94 -31 -17 46 -32 20 23 -12 -7 71 -9 -62 18 -132
7470 -132 -2 -13 -17 -23 60 93 -67 -48 -126 -77 -1 2 -64 -61 -16 -41 -59 5 -42 -82 -67 25 -23 -59 18 -65 24 -37 80 63
7500 63 17 -26 69 68 -88 -120 59 12 -66 -28 5 -34 31 25 49 -1 -45 -13 42 -48 39 8 -49 46 79 42 -33 -9 13 2
7530 2 63 156 35 24 32 105 60 -7 16 -10 -71 154 67 2 39 -29 -20 96 -102 114 32 -50 116 59 74 -44 43 -102
7558 -102 -74 -30 -105 -36 -51 14 -83 9 19 -24 -1 -145 21 106 -107 51 -53 36 -16 -32 -73 135 -19 24 -98 -27
$$ [...]
8191a53
##END NTUPLES=NMR FID
##END=
