##TITLE=1H_DE-80H_X3
 200.13MHz, d2o
 8 sc
 
 19ns.26.2.2025
##JCAMPDX= 6.0         $$ Bruker NMR JCAMP-DX V2.0
##DATA TYPE= NMR FID
##DATA CLASS= NTUPLES
##ORIGIN= UXNMR, Bruker Analytische Messtechnik GmbH
##OWNER= pz
$$ XWIN-NMR		Version 3.5
$$ Thu May 15 14:59:06 2025 Russian Standard Time (UT+4h)  Yarkov@DPX200
##.OBSERVE FREQUENCY= 200.1313
##.OBSERVE NUCLEUS= ^1H
##.DELAY= (6, 6)
##.ACQUISITION MODE= SIMULTANEOUS
##.ACQUISITION SCHEME= undefined
##.AVERAGES= 8
##.DIGITISER RES= 18
##SPECTROMETER/DATA SYSTEM= spect
##.PULSE SEQUENCE= zg30
##.SOLVENT NAME= CDCl3
##.SHIFT REFERENCE= (INTERNAL, CDCl3, 0, 14.3821)
##AUDIT TRAIL= $$ (NUMBER, WHEN, WHO, WHERE, WHAT)
$$ ##TITLE= Audit trail, XWIN-NMR		Version 3.5
$$ ##JCAMPDX= 5.01
$$ ##ORIGIN= Bruker BioSpin GmbH
$$ ##OWNER= Yarkov
$$ C:/Bruker/XWIN-NMR/data/yarkov2/nmr/H-C/1/audita.txt
$$ ##AUDIT TRAIL=  $$ (NUMBER, WHEN, WHO, WHERE, WHAT)
(   1,<2025-05-15 14:58:14.03 +0400>,<Yarkov>,<DPX200>,
      <created by zg, POWCHK disabled, PULCHK disabled
       configuration hash MD5:
       00 E9 B6 7A A2 85 ED C7 34 08 36 98 17 FE 4E 26
       data hash MD5: 16K
       41 1E AE FD CD 96 B5 9B 18 ED 4F 90 6D 2F A4 86>)
$$ ##END=
$$ 
$$ hash MD5
$$ 65 72 5A 58 70 FE 65 65 0A 45 C4 38 52 2C 86 A0
##$RELAX= 
##$RELAX= 
##$RELAX= 
##$RELAX= 
##$RELAX= 
##$RELAX= 
$$ Bruker specific parameters
$$ --------------------------
##$DU= <C:/Bruker/XWIN-NMR>
##$EXPNO= 1
##$NAME= <H-C>
##$PROCNO= 1
##$TYPE= <nmr>
##$USER= <yarkov2>
##$AMP= (0..31)
100 100 100 100 100 100 100 100 100 100 100 100 100 100 100 100 100 100 
100 100 100 100 100 100 100 100 100 100 100 100 100 100 
##$AQSEQ= 0
##$AQ_mod= 1
##$AUNM= <au_zg>
##$AUTOPOS= <>
##$BF1= 200.13
##$BF2= 200.13
##$BF3= 200.13
##$BF4= 200.13
##$BF5= 200.13
##$BF6= 200.13
##$BF7= 200.13
##$BF8= 200.13
##$BYTORDA= 1
##$CFDGTYP= 0
##$CFRGTYP= 5
##$CHEMSTR= <none>
##$CNST= (0..31)
1 1 145 1 1 1 1 1 1 1 1 1 1 1 1 1 1 1 1 1 1 1 1 1 1 1 1 1 1 1 1 1 
##$CPDPRG= <>
##$CPDPRG1= <>
##$CPDPRG2= <>
##$CPDPRG3= <>
##$CPDPRG4= <mlev>
##$CPDPRG5= <mlev>
##$CPDPRG6= <mlev>
##$CPDPRG7= <mlev>
##$CPDPRG8= <mlev>
##$CPDPRGB= <>
##$CPDPRGT= <>
##$D= (0..31)
0 0.7 0 0 0 0 0 0 0 0 0 0.03 0 0 0 0 0 0 0 0 0 0 0 0 0 0 0 0 0 0 0 0 
##$DATE= 1747306693
##$DBL= (0..7)
120 120 120 120 120 120 120 120 
##$DBP= (0..7)
150 150 150 150 150 150 150 150 
##$DBP07= 0
##$DBPNAM0= <>
##$DBPNAM1= <>
##$DBPNAM2= <>
##$DBPNAM3= <>
##$DBPNAM4= <>
##$DBPNAM5= <>
##$DBPNAM6= <>
##$DBPNAM7= <>
##$DBPOAL= (0..7)
0.5 0.5 0.5 0.5 0.5 0.5 0.5 0.5 
##$DBPOFFS= (0..7)
0 0 0 0 0 0 0 0 
##$DE= 6
##$DECBNUC= <off>
##$DECIM= 32
##$DECNUC= <off>
##$DECSTAT= 4
##$DIGMOD= 1
##$DIGTYP= 9
##$DL= (0..7)
0 120 120 120 120 120 120 120 
##$DP= (0..7)
150 150 150 150 150 150 150 150 
##$DP07= 0
##$DPNAME0= <>
##$DPNAME1= <>
##$DPNAME2= <>
##$DPNAME3= <>
##$DPNAME4= <>
##$DPNAME5= <>
##$DPNAME6= <>
##$DPNAME7= <>
##$DPOAL= (0..7)
0.5 0.5 0.5 0.5 0.5 0.5 0.5 0.5 
##$DPOFFS= (0..7)
0 0 0 0 0 0 0 0 
##$DQDMODE= 0
##$DR= 18
##$DS= 0
$$ [...]
##$SUBNAM2= <"">
##$SUBNAM3= <"">
##$SUBNAM4= <"">
##$SUBNAM5= <"">
##$SUBNAM6= <"">
##$SUBNAM7= <"">
##$SUBNAM8= <"">
##$SUBNAM9= <"">
##$SW= 18.0517328524113
##$SWIBOX= (0..15)
0 0 2 0 0 0 0 0 0 0 0 0 0 0 0 0 
##$SW_h= 3612.71676300578
##$TD= 16384
##$TD0= 1
##$TE= 0
##$TE2= 300
##$TE3= 300
##$TEG= 300
##$TL= (0..7)
0 120 120 120 120 120 120 120 
##$TP= (0..7)
150 150 150 150 150 150 150 150 
##$TP07= 0
##$TPNAME0= <>
##$TPNAME1= <>
##$TPNAME2= <>
##$TPNAME3= <>
##$TPNAME4= <>
##$TPNAME5= <>
##$TPNAME6= <>
##$TPNAME7= <>
##$TPOAL= (0..7)
0.5 0.5 0.5 0.5 0.5 0.5 0.5 0.5 
##$TPOFFS= (0..7)
0 0 0 0 0 0 0 0 
##$TUNHIN= 0
##$TUNHOUT= 0
##$TUNXOUT= 0
##$USERA1= <user>
##$USERA2= <user>
##$USERA3= <user>
##$USERA4= <user>
##$USERA5= <user>
##$V9= 5
##$VALIST= <valist>
##$VCLIST= <CCCCCCCCCCCCCCC>
##$VD= 0
##$VDLIST= <DDDDDDDDDDDDDDD>
##$VPLIST= <PPPPPPPPPPPPPPP>
##$VTLIST= <TTTTTTTTTTTTTTT>
##$WBST= 1024
##$WBSW= 4
##$XGAIN= (0..3)
0 0 0 0 
##$XL= 0
##$YL= 0
##$YMAX_a= 53974
##$YMIN_a= -45492
##$ZGOPTNS= <>
##$ZL1= 120
##$ZL2= 120
##$ZL3= 120
##$ZL4= 120
##$ABSF1= 10
##$ABSF2= 0
##$ABSG= 5
##$ABSL= 3
##$ALPHA= 0
##$AQORDER= 0
##$ASSFAC= 0
##$ASSFACI= 0
##$ASSFACX= 0
##$ASSWID= 0
##$AUNMP= <proc_1d>
##$AZFE= 0.1
##$AZFW= 0.1
##$BCFW= 1
##$BC_mod= 2
##$BYTORDP= 1
##$COROFFS= 0
##$CY= 83.5205535888672
##$DATMOD= 1
##$DC= 2
##$DFILT= <>
##$DTYPP= 0
##$F1P= 10.8118882576601
##$F2P= -7.23987719738617
##$FCOR= 0.5
##$FTSIZE= 0
##$FT_mod= 4
##$GAMMA= 1
##$GB= 0.15
##$INTBC= 1
##$INTSCL= 1
##$ISEN= 128
##$LB= 0.25
##$LEV0= 0
##$LPBIN= 0
##$MAXI= 10000
##$MC2= 0
##$MEAN= 0
##$ME_mod= 0
##$MI= 1.114404
##$NCOEF= 0
##$NC_proc= 0
##$NLEV= 6
##$NOISF1= 3.799351
##$NOISF2= 2.8
##$NSP= 1
##$NTH_PI= 0
##$NZP= 0
##$OFFSET= 14.38212
##$PC= 1
##$PHC0= -1345.591
##$PHC1= 7.133752
##$PH_mod= 1
##$PKNL= yes
##$PPARMOD= 0
##$PSCAL= 0
##$PSIGN= 0
##$REVERSE= no
##$SF= 200.129724274929
##$SI= 16384
##$SIGF1= 3
##$SIGF2= 2
##$SINO= 400
##$SIOLD= 16384
##$SREGLST= <1H.CDCl3>
##$SSB= 0
##$STSI= 0
##$STSR= 0
##$SW_p= 3205.1282051282
##$SYMM= 0
##$S_DEV= 0
##$TDeff= 0
##$TDoff= 0
##$TI= <>
##$TILT= no
##$TM1= 0
##$TM2= 0
##$TOPLEV= 0
##$USERP1= <user>
##$USERP2= <user>
##$USERP3= <user>
##$USERP4= <user>
##$USERP5= <user>
##$WDW= 1
##$XDIM= 8192
##$YMAX_p= 0
##$YMIN_p= 0
$$ End of Bruker specific parameters
$$ ---------------------------------
##NTUPLES= NMR FID
##VAR_NAME=  TIME,          FID/REAL,        FID/IMAG
##SYMBOL=    X,             R,               I
##VAR_TYPE=  INDEPENDENT,   DEPENDENT,       DEPENDENT
##VAR_FORM=  AFFN,          ASDF,            ASDF
##VAR_DIM=   8192,          8192,            8192
##UNITS=     SECONDS,       ARBITRARY UNITS, ARBITRARY UNITS
##FACTOR=    0.0002768,     1,               1
##FIRST=     0,             0,               0
##LAST=      2.2672688,     0,               0
##MIN=       0,             -45492,          0
##MAX=       2.2672688,     53974,           0
$$ Real data points
##PAGE= N=1
##DATA TABLE= (X++(R..R)), XYDATA
$$ [...]
698eL5o5rN0l2p3Q5O1q3pP2r8J20j08O9j2o0O3K3j22J8J50j44J48m9r1J27j30
$$ -5 30 -35 -44 6 -26 -99 -14 47 -36 -43 29 -69 51 -57 12 0 -60 3 26 -96 -78 72 -72 76 27 -64 63 -67
726f7N9q7J67n2l4n3L3ONJ10q8n2J27q4O2j1K5J2o8j08Q9J9O2RN5o0k2op8k2R3
$$ -67 -8 -95 72 20 -14 -67 -34 -28 -23 87 -1 -53 74 -10 52 41 66 78 10 -98 -9 10 72 81 136 76 54 48 -30 -52 41
757D1r9J23j12LJ03m8j7L3K9o7M6p3K6q6J76m8l0lQ1j15K0NJ0k4R0j03K4jj8P4
$$ 41 -58 65 -47 -44 59 11 -6 27 56 -11 35 -38 -12 -98 78 30 0 -3 78 -37 -17 -12 -2 -26 64 -39 -15 -16 -34 40
787D0RMk7k6K2M1k9J7R3j74J15Oj41O3Q4m8k8j20J20n8M4J1m7N8mP9j08L5J4j36
$$ 40 49 53 26 0 22 63 34 51 144 -30 85 91 -50 13 97 49 21 -99 21 -37 7 18 -29 29 25 104 -4 31 45 -91
817i1J72j21M8O6o0Oj8m7J09rj28J31j36P4pp0Q0M9m2l0P3MJ1j2l8Kl7j3K2k0
$$ -91 81 -40 8 74 14 20 2 -45 64 55 -73 58 -78 -4 -11 -81 -1 48 6 -24 49 53 64 52 14 16 -21 -34 -12 -32
847c2N2O5j24N0J8O7k07J14q4P5O7j76R3l7j3J92o7j35M7k6P6K3l0L4o4N6j2K2
$$ -32 20 85 -39 11 29 96 -111 3 -81 -6 61 -115 -22 -59 -72 120 53 -82 -35 -61 15 38 8 42 -22 34 22 44
875D4o0P3j12O4n2k0R5k1J15p9o9j6K3K0R1q1j26R9j4r2K06n3j21R4L8n6%J3K0
$$ 44 -16 57 -55 9 -43 -63 32 11 126 47 -22 -38 -15 5 96 15 -111 -12 -26 -118 88 35 -86 8 46 -10 -10 3 23
904B3K8%p0nR5p8J4R8p3j03Q8o3K2l5J08o1q3O4M7p3P1N3j22j15J51r7J25J5R7
$$ 23 51 51 -19 -24 71 -7 7 105 32 -71 17 -46 -24 -59 49 -12 -95 -31 16 -57 14 67 -55 -170 -19 -116 9 24 121
933A21j04k4k6jR4j09m0N1J20q1n6N4n0K3JR1nn4oJ16p7l4N0j32P9j2k0l6R0j32
$$ 121 17 -7 -33 -34 60 -49 -89 -38 82 1 -55 -1 -51 -28 -27 64 59 5 -1 115 38 4 54 -78 1 -11 -31 -67 23 -109
963a09J16K2j17J25o8M5QJ8M7k00k1N7Q4j07J29p5P1n2K8l1K8p1O6J7J3m5l0J14
$$ -109 7 29 -88 37 -31 14 22 40 87 -113 -134 -77 7 -100 29 -46 25 -27 1 -30 -2 -73 -7 10 23 -22 -52 62
991F2k3k0L8k6m2N5K8j40P8R6j48P8o4K1n3M4P7o4M6K9M0q6l5L8l6n3P5l4J3p0
$$ 62 39 19 57 31 -11 44 72 -68 10 106 -42 36 -28 -7 -60 -16 61 -3 43 72 112 26 -9 29 -7 -60 15 -19 -6 -76
1021g6K09j94J9J41j72Q8L6j72J00rpP9j61O8k2Q2l5J35j70l7Q5o3J45o1P4k09
$$ -76 133 -61 -42 99 -73 15 51 -121 -21 -30 -37 42 -119 -51 -73 9 -26 109 -61 -98 -13 -76 69 8 82 -127
1047a27J16j6J35k10PJ24j57R5K4o8J12j02K0Q1K1p4m4J05J2j16J41j06M3p5L
$$ -127 -11 -27 108 -102 -95 29 -128 -33 -9 -77 35 -67 -47 34 55 -19 -63 42 54 -62 79 -27 16 -59 -56
1072e6LJ51j00Q6no2kj8j1L8r3M4J2j2K6R2j57J53M2j54j3J02q2M3j04qM3Q6j69
$$ -56 -53 98 -2 84 79 17 15 -3 -14 24 -69 -25 -13 -25 1 93 -64 89 131 -23 -36 66 -16 27 -77 -85 -42 44 -125
1101a25J96N3j10n6nJ00r0Q0j03R6lj3r5J22j5m5J3q9P3j08J72l1p0O3p9J32l
$$ -125 71 124 14 -42 -47 53 -37 43 -60 36 33 20 -75 47 32 -13 0 -89 -16 -124 48 17 -53 10 -69 63 60
1128F0J0o9pP8p5n8J66J2j31k1pJ14j75J08j04K9R8j3q8J04J7p9p0J72l4N6j25
$$ 60 70 1 -6 72 -3 -61 105 117 -14 -35 -42 72 -103 5 -99 -70 28 15 -73 31 48 -31 -101 71 37 93 -32
1155c2nJ58r0r9j0L2J26m0L4l3l8kK9o2j01J30J2L4K1j6n7J1rL8o0O1Q7J9q9k0
$$ -32 -37 121 31 -68 -78 -46 80 40 74 41 3 1 30 -32 -133 -3 9 43 64 48 -9 2 -7 31 -29 32 119 138 49 29
1185B9k9m5K9n4M6k0J8n0O2M9n1j37O1K8J15k8K3m8p3J65j08QR2j11Q0m5J3m8
$$ 29 0 -45 -16 -70 -24 -44 -26 -76 -14 35 -16 -153 -92 -64 51 23 46 -2 -75 90 -18 -10 82 -29 51 6 19 -29
1213b9O4k8p3O9Lm2N0Oj9J43j95Q0M2k07J08O2J2p9M9n5J01j18O3n3N5J13oj57
$$ -29 35 7 -66 3 6 -36 14 20 1 144 -51 29 71 -136 -28 34 46 -33 16 -39 62 -56 7 -46 9 122 116 -41
1241d1N8j10R5N5q5Q4M0o0m8J4lq0J26l0qo4J92r4j6r1oP2J33j17K9J9j51J22
$$ -41 17 -93 2 57 -28 56 96 36 -12 2 -1 -81 45 15 7 -57 135 41 25 -66 -72 0 133 16 45 64 -87 35
1269C5n0j4J4m0P1J3o7J48j30j8O2n4N3J7K0j14M1j1oJ07k8M2q8l2pJ49j26M0
$$ 35 -15 -29 -15 -55 16 29 -38 110 -20 -38 24 -30 23 40 60 -54 -13 -24 -30 77 49 91 3 -29 -36 113 -13 27
1297B7o5J20j02J26j44N2N5q7l7L8L1l5l0J07j29J9m3m6J03J12o0j2m6j9J14j6
$$ 27 -38 82 -20 106 -38 14 69 -18 -55 -17 14 -21 -51 56 -73 -54 -97 -143 -40 72 12 0 -46 -65 49 33
1323C3k9L0l3L3p8L8J40o7j14J8lKN9j32M3J50j04O9J8o2%L4Pj39O4j0K21k08
$$ 33 4 34 1 34 -44 -6 134 67 -47 -29 -32 -30 29 -103 -60 90 -14 55 73 11 11 45 52 -87 -23 -33 188 -20
1351b0n0k2K5J17n5q8K7J85j93O8j24O9O5j34J02p8J34n1J4j02J03q0K24j82O6
$$ -20 -70 -92 -67 50 -5 -93 -66 119 -74 -6 -130 -61 4 -130 -28 -106 28 -23 -9 -111 -8 -88 136 -46 20
1376B0K6ML3j1r9j30J13QN8o2O6oqK1j9j47K02j96J15j38N6J28j33J35j66J52
$$ 20 46 50 83 72 -27 -157 -44 -36 22 -40 26 20 12 33 14 -133 69 -127 -12 -150 -94 34 -99 36 -130 22
1402B2m9j6L3l2J99j38o2qJ8q6J47L5Oq5J06m0j4k0KL6r0K1o6J37j56J41j28J63
$$ 22 -27 -43 -10 -42 157 19 -43 -51 -33 -119 28 63 69 -16 90 50 36 16 18 54 -36 -15 -81 56 -100 41 -87 76
1430G6M1r0J1m1J25j31LL8o2O1q7J45p1J57j98k6K09k6j09p2O1n0P2r8O4lR0n3
$$ 76 117 27 38 -3 122 -9 -6 32 -30 31 -56 89 18 175 -23 -49 160 134 25 -47 14 -36 36 -62 2 -1 89 36
1458C6J15k21J46j09Q9k8L9k2j0r0JjP8m7J2j3lrm4L7L3n3M5k9R9mq7k2jOMJ0
$$ 36 151 -70 76 -33 56 28 67 45 35 -55 -54 -55 23 -24 -12 -25 -28 -37 -81 -44 -11 -64 -19 -48 51 47 -40 -62 -63 -57 -53 -43
1490d3j5k7P7J44j66M3p3NJ5NlR1l7p5N5M3M9Kj31M6L5K4j66J33m4J8lQ7Mn3m0
$$ -43 -58 -85 -8 136 -30 13 -60 -55 -40 -35 -38 53 16 -59 -4 39 88 90 -41 5 40 64 -102 31 -13 5 2 89 93 40 0
1521@n5R8n0l1O1k4q8Q9J6O2j58nJ34j31R2j77J63m3M0m8l2M0R1m9p3J80m0j00
$$ 0 -55 43 -7 -38 23 -1 -89 0 16 78 -80 -85 49 -82 10 -167 -4 -47 -7 -55 -87 -47 44 -5 -78 102 62 -38
1549c8O7M4p2M2Kr8N0o5nL1p8J41O8j26l6N0K3J8o5j2L0R5j37K8j8K8l7R0n5Q3
$$ -38 29 73 1 43 45 -53 -3 -68 -73 -42 -120 21 89 -37 -73 -23 0 18 -47 -59 -29 66 -71 -43 -61 -33 -70 20 -35 48
1579D8k3p2O5N9k6j44Q9J2N8o9p9N0J16Mk9j78M3l8J97j50P8J5l7J9o2j6m0M7
$$ 48 25 -47 18 77 51 -93 -4 8 66 -3 -82 -32 84 88 59 -119 -76 -114 83 -67 11 26 -11 8 -54 -70 -110 -63
1607f3J95k75J37o5J5M2k8n7J72j79J39j30k1J09ml4O4Kr6J49j51P5k1N1j01P2
$$ -63 132 -143 -6 -71 -56 -14 -42 -99 73 -106 33 -97 -118 -9 -13 -47 17 19 -77 72 -79 -4 -25 26 -75 -3
1633cL2M5j47K6R3o0jk9p2P4m9O3n3L2j8M6P3j09o1K06j42J21j66P8L0JL5lr4
$$ -3 29 74 -73 -47 46 -14 -15 -44 -116 -42 -91 -28 -81 -49 -67 -21 52 -57 -118 88 -54 67 -99 -21 9 10 45 42 -52
1662e2R7j32M0J23Rj40lJ17j76K16k8M1m0KJ1p6n5J1qK1m4K05k01m4J54j86P3
$$ -52 45 -87 -47 76 85 -55 -58 59 -117 99 71 112 72 74 85 9 -46 -35 -43 -22 -66 139 -62 -106 48 -138 -65
1689f5L0O5M2n9m6L6O5r1l7O2L5n0J5R1o0NN7j82J32p3%J32r5%O5p5P9l5n7J5
$$ -65 -35 30 72 13 -33 3 68 -23 -60 2 37 -13 2 93 33 38 95 -87 45 -28 -28 104 9 9 74 -1 78 43 -14 1
1719AL6j45J23n2J08K6j12J42q4k17J95l4KK5r9J51j57K7P0l0M0k7mN6k5O8j50
$$ 1 37 -108 15 -37 71 97 -15 127 43 -174 21 -13 -11 14 -85 66 -91 -64 6 -24 16 -11 -15 41 16 84 -66
1746f6m0J29m7P8o9N4o1P5j40J7J04j38J28j44K01j02J3l0J43Kj35N4m3mk8J4
$$ -66 -106 23 -24 54 -15 39 -22 53 -87 -70 34 -104 24 -120 81 -21 -8 -38 105 107 -28 26 -17 -21 -49 -35
1772c5m3Q0lm0L3N5m0N8pj56P1J16k6k7k1pj4J0q3R6Q9m2r2N2OQop8J17j64N1
$$ -35 -78 2 -1 -41 -8 47 7 65 58 -98 -27 89 63 36 15 8 -6 4 -79 17 106 64 -28 24 30 38 32 -46 71 -93 -42
1803d2J29k6j24Q8l8rN5n5Q4K5j9M2l1p7pj1KJ77k14N5P3j01K6pl0M4o8L4qQ9
$$ -42 87 61 -63 25 -13 -22 33 -22 62 87 68 110 79 2 -5 -16 -14 163 -51 4 77 -24 2 -5 -35 9 -59 -25 -33 56
1833E6k5m3j7m9J09j16J37k2J03j23M2n9R6l5m9o7M9M5r6J42q6J2mp3J28p1L7
$$ 56 31 -12 -29 -78 31 -85 52 30 133 10 52 -7 89 54 5 -62 -13 32 -64 78 -8 4 0 -73 55 -16 21
1860B1o9Ro8N8P3pqq7K5Q6KL3l6O8j43J4P0J05j50k2J04o9o7M4m4O6J26k03R4
$$ 21 -48 -39 -107 -49 24 17 9 -78 -53 33 35 68 32 100 -43 -29 41 146 -4 -26 78 9 -58 -14 -58 8 134 -69 25
1889B5o9nl3N3n7L4k7l3J29j11K04kj19K7m6O5j9k6kq4O5M4q3K8K6n1p5R3J3R6
$$ 25 -44 -49 -82 -29 -86 -52 -79 -112 17 -94 110 108 -11 16 -30 35 16 -10 -12 -96 -31 13 -70 -42 -16 -67 -142 -49 -36 60
1919F0k2o6j04J60mj57N8J54o1J2k9j18R9R4m0n3j8L2nr0m4J69j20k4M2M5K1M4
$$ 60 38 -28 -132 28 24 -133 -75 79 18 30 1 -117 -18 76 36 -17 -35 -3 -8 -98 -142 27 -93 -117 -75 -30 -9 35
1947C5j27j6J14N1o5mJ5P1j66J30j63Q3L4M5L6k57K54j13M7P5j68R0l5R8o2J1
$$ 35 -92 -108 6 57 -8 -12 3 74 -92 38 -125 -42 -8 37 73 -184 70 -43 4 79 -89 1 -34 64 2 13
1973A3o9J08Qm8r8Q1%R3q9j0Q6o8j3j07J38l0P8j08J6J2P2j5Q4j78K1M8m3j12
$$ 13 -56 52 60 12 -86 -5 -5 88 -1 -11 75 7 -6 -113 25 -5 73 -35 -19 -7 65 50 134 -44 -23 25 -18 -130
2001a30K12L3k33K64j42j3J9L3o8%J45j89J82j00q4K4L7J8K9o4L2j00M7L4k6J6
$$ -130 82 115 -118 146 4 -9 10 43 -25 -25 120 -69 113 13 -71 -47 -10 8 37 -27 5 -95 -48 -14 -40 -24
2027b4p8M4p0j4O4J90j66L5J6J9L7Nk3l7l3P4q0K6m2L2J09or8J5Q2Q9o1j71Q4
$$ -24 -102 -58 -128 -142 -78 112 -54 -19 -3 16 53 58 35 -2 -35 39 -41 -15 -57 -25 84 78 -20 -5 77 166 105 -66 18
2056A8k6R5j05O3P2p1Jq3N3J3k7J9k8N4m8k0r6J60j37P6M7M4m8l3j12J71n3l0
$$ 18 -8 87 -18 45 117 46 47 -36 17 30 3 22 -6 48 0 -20 -116 44 -93 -17 30 74 26 -7 -119 52 -1 -31
2084c1K6K7q0J01m0N8j04O5k8PJ2M2J9j69J21j54nJ91j35J28p7P6q1j4J02L8j95
$$ -31 -5 22 -58 43 3 61 -43 22 -6 1 13 55 74 -95 26 -128 -133 58 -77 51 -26 50 -31 -45 57 95 -100
2111a00J10N8j03K5qQ4j04J01j66J56r4O4j30J51L4j57N9K3p2J0p1R4n2J29p3
$$ -100 10 68 -35 -10 -18 66 -38 63 -103 53 -41 23 -107 44 78 -79 -20 3 -69 -59 -130 -36 -88 41 -32
2136c2RM9n9P8j03N4o1N7N6o5k6P%N1m3l8Nk0J17L1l6k3rL3K1J7q3m1On0J80j46
$$ -32 -23 26 -33 45 -58 -4 -65 -8 48 -17 -43 -36 -36 15 -28 -66 -61 -81 36 67 31 8 -1 32 53 70 -13 -54 -48 -98 82 -64
2168f4J31n5j08J24m5J43j51P2r1R7j41K5J4O0k3Mq1r7K12j63J74Kj03J5L9M9
$$ -64 67 12 -96 28 -17 126 -25 47 -44 53 -88 -63 -49 11 -12 -8 -89 -186 26 -137 37 39 -64 -49 -10 39
2194C9o6o3J12Pj4jk9rn7Q3m9J5J3N3j3L2j33Q7K9P4j20q6J48r7J4L9n5l5P1r0
$$ 39 -27 -90 22 29 15 14 -15 -24 -81 2 -47 -32 -19 34 21 53 -80 7 36 110 -10 -96 52 -45 -31 8 -47 -82 -11 -101
2224a01k8J12l4J02r9J6%k0M3p3k0J43q7L3J31o8j18J04l6j5oM1m9p4J97j46Q1
$$ -101 -129 -17 -51 51 -48 -32 -32 -52 -9 -82 -102 41 -46 -13 118 50 -68 36 0 -15 -21 20 -29 -103 94 -52 29
2251B9N2j21m0L6J03n8Q5k2j32J17P2j83L8N5q4J03p9q1J46j7m6O1p1m4M7M9N0
$$ 29 81 -40 -80 -44 59 1 86 64 -68 49 121 -62 -24 31 -53 50 -29 -110 36 19 -27 34 -37 -81 -34 15 65
2278F5j67J16q2J21j93J1J99j77K9J41j1j34J69Lj75N5Q8j32J70j13kj9N1lk9
$$ 65 -102 14 -68 53 -140 -129 70 -107 -78 63 52 -82 87 90 -85 -30 58 -74 96 -17 -19 -38 13 10 -19
2303a9m0O3k8M2n7L9M9q8J59p3j15R1OJ4k6j04J63l8l4R5m8o4%N9J5j57J25n3
$$ -19 -59 4 -24 18 -39 0 49 -39 120 47 -68 23 29 43 17 -87 76 38 4 99 51 -13 -13 46 61 -96 29 -24
2331b4L1q3J52p2o5J28l0o4Q4n4nJ5q9P6n7L4K4J04n0L3k3K1q1n4J07q0n9K4O0
$$ -24 7 -76 76 4 -61 67 37 -27 57 3 -2 13 -76 0 -57 -23 1 105 55 88 65 86 5 -49 58 -22 -81 -57 3
2360CO6p3P0n0j4k1J2j3K7mj00P6J26j79Q7J1m9N2l8j5N7q2P4P9p0p4N6K1K6o
$$ 3 69 -4 66 16 2 -19 -7 -20 7 3 -97 -21 105 -74 13 24 -25 27 -11 -26 31 -51 23 102 32 -42 14 35 61 55
2390E5o3P4N7j04L9q1M9l9N0p4J46n2j1p0N9l7q4R4k6J00j05j33J42L6q2L5k4
$$ 55 -8 66 123 19 58 -23 26 -13 37 -37 109 57 46 -24 35 -2 -86 8 -18 82 -23 -156 -14 22 -60 -25 -49
2417d9O7j55J6J86p0K6o3R8OJ2j21M8m5J27j17L5Q1m8r3J79k04O3N2q8J18j55
$$ -49 18 -137 -121 65 -5 21 -42 56 62 74 -47 1 -44 83 -34 1 82 34 -59 120 -84 -21 31 -57 61 -94
2443i4J43J5o7q4K1J14m9m8M5j9P9j15J0O5k3Q2j19m1N0P4l1M2l5N0l7l3q4J90
$$ -94 49 64 -3 -87 -66 48 -1 -49 -4 -23 56 -59 -49 16 -7 75 -44 -85 -35 39 8 50 15 65 28 -5 -89 101
2471A01j35Q6lq2J54J8r8N6j45O2O9n6K1j34J36l4M7j08%M0P9j04JM7N7r4k5P4
$$ 101 -34 52 49 -33 121 139 41 97 -48 14 83 27 48 -86 50 16 63 -45 -45 -5 74 -30 -29 18 75 -19 -44 30
2499C0o3k3K2M8P2q7r2N5Q2k4L0j34J65j42J8J51l0N9j01m1R3k08J05j03K73j39
$$ 30 -33 -56 -34 14 86 -1 -93 -38 44 20 50 -84 81 -61 -43 108 78 137 36 -5 88 -120 -15 -118 155 16
2525A6O6n8J1o0n0N1R4j30j0Q5l3j28J53p5J18p1l7k1J5L8R9q3J00j03M7k4J1
$$ 16 82 24 35 -25 -75 -24 70 -60 -70 15 -18 -146 7 -68 50 -21 -58 -79 -64 -26 73 -10 90 -13 34 10 21
2552B1P0k0pl9N8o7jj5M7p8J26j61O5O3k6k9M0j0m4k3J2K5k9ROM8j1j45K14j27
$$ 21 91 71 64 25 83 16 15 0 47 -31 95 -66 -1 62 36 7 47 37 -7 -30 -18 7 -22 -13 -7 41 30 -115 99 -28
2582b8K1K6j7pMo1o1J34n9j17J21K3l6P0R5o8j12P0j6K3o8J1Q8M6j45J15n4l1
$$ -28 -7 19 2 -5 -1 -62 -123 11 -48 -165 -44 -21 -57 13 108 40 -72 -2 -18 5 -63 -52 36 82 -63 52 -2 -33
2610c3p7J26L9p3m1O1k6nj3L9n3K4nQ4M2r7L8j40M5Q0L4j64J79L2j67p0M7O2J20
$$ -33 -110 16 55 -18 -59 2 -24 -29 -42 -3 -56 -32 -37 47 89 -8 30 -110 -65 15 49 -115 64 96 -71 -141 -94 -32 88
2639H8K5j30M6N1j5j57J92j06J8j1J2p7J02l2J0o6k6R1J2nq9Q1o4Q6jl0n1L2j1
$$ 88 113 -17 29 80 65 -92 100 -6 12 1 13 -64 38 6 16 -50 -76 15 27 22 -67 14 -50 36 35 5 -46 -14 -25
2668b5k2K5M2Mj02J23N1j25O9N7j11k6J51rr5j3J0j1j13J9K23j36N6n1n3O7O8
$$ -25 -47 -22 20 24 -78 45 96 -29 40 97 -14 -40 111 102 7 -6 4 -7 -120 -101 122 -14 42 -9 -62 5 73
2695G3q6J7o1R7j7pq0R2n8k4L0r4J61j50J10K4Mj02J15j26R9k2k1l0P8p5j5L3
$$ 73 -13 4 -57 40 23 16 -64 28 -30 -54 -24 -118 43 -107 3 27 31 -71 44 -82 17 -5 -26 -56 22 -53 -68 -35
2723c5l2J32r4n7J39l2RK9Nn6k9M1k7K7J5O2j18J0K7m6O4o0O5N9r0o8n6J43j54
$$ -35 -67 65 -29 -86 53 21 30 59 64 8 -21 20 -7 20 35 97 -21 -11 16 -30 34 -26 39 98 8 -60 -116 27 -127
2752a27J83j01pO1p8k0J08j88J68o7K7O2p0J10n7J1j7om9K2j4L9nN0l4L8r0R1
$$ -127 56 -45 -52 9 -69 -89 19 -169 -1 -68 -41 21 -49 61 4 15 -2 -8 -57 -35 -49 -10 -15 35 1 39 -51 40
2780D0l9lk1jjn7lM0M7m6K1n9QM4p4J30M3n7l5Oq0K08j02q5KN3m5J42q0L8Ko2
$$ 40 1 -2 -23 -24 -25 -82 -85 -45 2 -44 -23 -82 -74 -30 -104 26 69 12 -23 -17 -97 111 9 -76 -74 -21 -66 76 -4 34 36 -26
2812b6O2m5N2j04NJ24q9j0J25l1n3O5r5J2Q6j24pqj7J57j80P8J3m1J14k3j52J18
$$ -26 36 -9 43 -61 -56 68 -21 -31 94 63 10 75 -20 -8 78 -46 -53 -61 -78 79 -101 -23 -10 -51 63 40 -112 6
2840FO1j27L1q4O7O4o0m3O8mJ01o3J3J1k5o6L5kQ2q1p3J15j24J86j89R3L8kP5
$$ 6 67 -60 -29 -113 -46 18 -42 -85 -17 -21 80 17 30 41 16 -50 -15 -17 65 -16 -89 26 -98 88 -101 -8 30 28 103
2869A03j35j1O7j1n0p1R7m3K9J58j97J20n0k3k8K1O5K7j20nO5j3K7n4J6k9J05
$$ 103 -32 -43 24 13 -37 -108 -11 -54 -25 133 -64 56 6 -17 -45 -24 41 68 -52 -57 8 -5 22 -32 -16 -45 60
2896F0j51M9P7J3J7j31O7nj0P9k2pq7pR1p6L8j1N6m2l1j6l5N2k7L7J3M8j8M3j35
$$ 60 -91 -42 35 48 65 -66 1 -4 -14 65 43 36 -51 -58 33 -43 -5 -16 40 -2 -33 -49 -84 -32 -59 -22 -9 39 21 64 -71
2927g1J2N0m0R2k8Q4j14J4J0J0k4Ln3P6J34j72M7rO2j5r6L4m7kj4J33q4q9J86
$$ -71 -59 -9 -49 43 15 99 -15 -1 9 19 -5 -2 -55 21 155 -17 30 21 83 68 -28 6 -41 -43 -57 76 -8 -97 89
2956H9j21J20%P0q1j2k00J50k8%M5o1m2O9N2Km0j30O2J12k0o9N1k3l3Q2Rj56M3
$$ 89 -32 88 88 158 77 65 -135 15 -13 -13 32 -29 -71 -2 50 52 12 -118 -56 56 36 -33 18 -5 -38 44 53 -103 -60
2985f0Q4j06Q7K1n0N1r6J08l4RkO3ro9Jr7O4L3J4Oj2KKj2O9r1n6J4J19L0q3m0
$$ -60 24 -82 5 26 -24 27 -69 39 5 14 12 75 66 -3 -2 -99 -35 -2 12 18 6 8 10 -2 67 -24 -80 -66 53 83 0 -40
3017d0Q4K1n9J06q4l1M6n8Q1K5j18oN7MJ8Nr9J02J0j53J36q9J06j8j39P4R2L4
$$ -40 44 65 6 112 28 -3 43 -15 66 91 -27 -33 24 28 46 51 -48 54 64 -89 47 -42 64 46 -93 -19 73 107
3045A07r9nk4J7p1N0P1m2m9Rm2L0J10J4o5K9m5L2N1j54J94l8r9J17m7j51J63J5
$$ 107 8 3 -21 -4 -75 -25 46 4 -45 -36 -78 -48 62 76 11 40 -5 27 78 -76 118 80 -19 98 51 -100 63 78
3073G8n4k5M1q1L2n7P1n9K11k17N2N1j22O6p0K2J54k4j43M1K3K9L2j42K2O4O8
$$ 78 24 -1 40 -41 -9 -66 5 -54 157 -60 -8 43 -79 -13 -83 -61 93 69 -74 -33 -10 19 51 -91 -69 -5 63
3100F3k18J12OM1J3J5J08k11K45j83o2QJ94j9n6r8N2O6p4Km1nj4P3O5l0n9j6J19
$$ 63 -155 -43 -37 4 17 32 140 -71 174 -9 -71 -63 131 112 56 -42 10 76 2 4 -37 -42 -56 17 82 52 -7 -23 96
3129I6j16l2R9m5j4J8p1N2l7J01o1J0J3J31k34J25K7j9k3m5O1p3P1l0r6L9J04
$$ 96 -20 -52 47 2 -12 6 -65 -13 -50 51 -10 0 13 144 -90 35 62 43 20 -25 36 -37 34 4 -92 -53 51
3156E1Rj34M3J01n6P0p3j4j6q7O1K6L1L7j67N5K1q3J61r8O8j7J0P3q0k2R9K6n3
$$ 51 60 -74 -31 70 14 84 11 -3 -19 -106 -45 -19 12 49 -118 -63 -42 -125 36 -62 6 -11 -1 72 -8 -30 69 95 42
3185D2l1k5o5J01P0k09O5P0rN0j06j0O4R3j02Lk9J29r7o1M7L9O2l6o9l7rR1k0
$$ 42 11 -14 -79 22 92 -117 -52 18 9 59 -47 -57 7 100 -2 1 -28 101 4 -57 -10 29 91 55 -14 -51 -60 31 11
3214A1l7l8J41j00N4q6P0k1j8k3P2mJ5j5K5qm4m9P3j0p2R2j7K7l3L1L8o9p5J21
$$ 11 -26 -64 77 -23 31 -55 15 -6 -24 -47 25 21 36 21 46 38 -6 -55 18 8 -64 28 11 38 5 36 74 5 -70 51
3244E1O5q7q9J06j28Ok2M0r1J87M5l7j00R4n4j9L5l6n4P5k0O1o2Q0k3q5Q3nl4
$$ 51 116 29 -60 46 -82 -76 -98 -58 -149 38 83 46 -54 40 -14 -33 2 -34 -88 -13 -33 28 -34 46 23 -62 21 16 -18
3273a8m6J01m4Q4p3j1L4r4J50j9lj48J9R2q4K1L0N3r3J10k6r1Q5j10J12k7L4k5
$$ -18 -64 37 -7 77 4 -7 27 -67 83 64 61 -87 -68 24 -60 -39 -9 44 -49 61 35 -56 29 -81 31 4 38 13
3301A3L7o1qQ1l4M7j16j1R3j5j21J03r6J69r5M4l0k5N5j8j2M1J3n7k8P0m8K9j00
$$ 13 50 -11 -19 62 28 75 -41 -52 41 26 -95 8 -88 81 -14 30 0 -25 30 12 0 41 54 -3 -31 39 -9 20 -80
3330h0J34p3J4K8J11j67lJ0K0l3J04k6j47N6M0j4M0l6rR%Ok6K7k3J20j1j16j8
$$ -80 54 -19 -5 23 134 -33 -36 -26 -6 -39 65 39 -108 -52 -12 -26 14 -22 -31 -22 -22 -16 -42 -15 -38 82 71 -45 -63
3359f3J84j20o9J59j83J00J1l5l3J12k1n1N8q2J25j26N1O5q2j5J16p7K2j15j1
$$ -63 121 1 -68 91 -92 8 19 -16 -49 63 42 -9 49 -33 92 -34 17 82 0 -15 101 24 46 -69 -80
3384h0J61q9J9k02K11Ln8J06o0m3J1R7n8p9J09k5j16J10j9J53j39or8R3O2J3q5
$$ -80 81 -8 11 -191 20 23 -35 71 11 -32 -21 76 18 -61 48 23 -93 17 -2 151 12 6 -92 1 63 76 -9
3411imr4J24PM4o6J9K5j15J78j97J73p3n7QM9P6K3j52J0K7J2L5q3k0O3o5Q0j50
$$ -9 -13 -107 17 24 68 2 21 46 -69 109 -88 85 12 -45 -37 12 88 111 -41 -31 -4 8 43 -40 -60 3 -62 18 -132
3440a32J23J34j25n6J67r2k9J07j44J7J86j30o5pR6r0J00j3k3O0o7k9n8P9K5k8
$$ -132 -9 125 0 -56 111 19 -10 97 -47 -30 156 26 -39 -46 50 -40 60 47 24 84 17 -12 -70 9 34 6
3466Fo5R5j1m9mm9J07L%Ml5K8l1K5j41J10P7j18J06n7p8J58o5K0q9J31q8R6j33
$$ 6 -59 36 25 -24 -28 -77 30 33 33 37 2 30 -1 24 -117 -7 70 -48 58 1 -77 81 16 36 -53 78 -10 86 -47
3495d7m6j6M2kK2L8K2m5K7k3K4Q7k5K4m9J05J0j06j32jj1J37j50O8o3Q7r5J09
$$ -47 -93 -109 -67 -69 -47 -9 13 -32 -5 -28 -4 83 58 82 33 138 148 42 -90 -91 -102 35 -115 -47 -110 -23 -118 -9
3523iq6J22ml2o9J17M4j45R5l1P8L7j00K5o2K0p4J59p2j83K85j05N8n1j6O6o1
$$ -9 -95 27 23 -9 -78 39 83 -62 33 2 80 117 17 42 -20 0 -74 85 13 -170 115 10 68 17 1 67 6
3550Fk3J0k9J22p3K2k8o5P6Om1J5k2Nk0P2N8j8r3MJ13m0o4lN2o9J42k7q8n6j6
$$ 6 -17 -7 -36 86 13 35 7 -58 18 24 -17 -2 -24 -19 -39 33 91 73 -20 -16 97 57 -7 -10 42 -27 115 88 0 -56 -72
3581g2J55r0P9j83J38j2l4rNm1J5J07r1K6J02p6k1J2k6oK1r5N3Q3l0j7K6k8%K2
$$ -72 83 -7 72 -111 27 15 -19 -28 -23 -64 -49 58 -33 -7 95 19 -2 10 -16 -22 -1 -96 -43 40 10 -7 19 -9 -9 13
3611A3p0JR6q3J11j7l2J8J8O0p2L9j05L7l2J7L4j2P7j03P2j9l7o3Q2L7r2M2j17
$$ 13 -57 -56 40 -43 68 51 19 37 55 115 43 82 -23 14 -18 -1 33 21 98 -5 67 48 11 -52 30 67 -25 17 -100
3640a00K04j74J16p2J65k24n7J53kl8L0r8J44m1o0k5R5P6p7N8k15J41pN5p8P8
$$ -100 104 -70 46 -26 139 -85 -142 11 9 -29 1 -97 47 6 -54 -79 16 92 15 73 -142 -1 -8 47 -31 47
3666D7j01J19l7n5J00j40P3J8m2J14j57J36q7L6l0L0j4m6K5%r1J8J0J95m9j24
$$ 47 -54 65 28 -27 73 -67 6 24 -18 96 -61 75 -12 24 -6 24 10 -36 -11 -11 -102 -84 -74 121 72 -52
3692e2O5l2p3J38q8M8K8j19J25L0j83J00k1J13m8M2qj08K4R1m7n7J17j58L9J8
$$ -52 13 -19 -92 46 -42 6 34 -85 40 70 -113 -13 -34 79 31 73 65 -43 -19 72 25 -32 85 -73 -34 -16
3718a6P5J0j46J34K1j02K8M1l4m4KJ19j19m5J27q0M7qr8J10K6K3Rj18l0l8J88
$$ -16 59 69 -77 57 78 -24 4 45 11 -33 -31 88 -31 -76 51 -29 18 10 -88 22 48 71 80 -38 -68 -106 82
3745H2l8q4J74j12p1P7p3QJ35q2Rj48J12k8P5m0J1L0o5j6l2M2lO8j93Q0L8k9m2
$$ 82 44 -40 134 22 -49 28 -45 -37 98 16 25 -123 -11 -39 36 -4 7 37 -28 -44 -76 -34 -37 31 -162 -82 -44 -73 -115
3774a15J39k0O5j08k3J10l0J7j23J40o0o0J13o9Q7j36O1mP8j3j53K34q0j23R5
$$ -115 24 4 69 -39 -62 48 18 35 -88 52 -8 -68 45 -24 63 -73 -12 -16 62 49 -104 130 50 -73 22
3799B2p6KM2J9o4N1kR2q7Q1j08L7Kn3n6Q5n1P3o3L7m6K6Qm8L5J60r5J5k8L6r9
$$ 22 -54 -52 -10 9 -55 -4 -6 86 -1 80 -28 9 11 -42 -98 -13 -64 9 -54 -17 -63 -37 -29 -77 -42 118 23 38 10 46 -53
3830e3J23j06O6O0o0m1nj9R2o4m1j3J00P7j03q7N9qN7o6K8o2J09r5J09r7QMj0
$$ -53 70 -36 30 90 30 -11 -16 -35 57 -7 -48 -61 39 116 13 -74 -15 -23 34 -32 -4 -66 43 -52 57 -40 -32 -28 -38
3859c8m5R1q4k0N8Q6J2j49M2J13k6JN0j10om7K5O9nM3m2q8J12o1q7J91rm5P4o5
$$ -38 -83 8 -76 -96 -38 48 60 -89 -47 66 40 41 91 -19 -25 -72 -47 22 17 60 18 -70 42 -19 -106 85 76 31 105 40
3889D0o8r9Q1jj7j18J84L0n5K9L0J4j9QM8M5j73r1R6r8K03n8qj14J51L4q0j0M6
$$ 40 -28 -127 -46 -47 -64 -182 2 32 -23 6 36 50 31 39 87 132 -41 -132 -36 -134 69 11 3 -111 40 74 -6 -16 30
3918C0L0j11J62j67O5J44j31l7M6m2k7N4k9K8k0M2m6M8Mp5n9Q8J34j63N7J7p9
$$ 30 60 -51 111 -56 9 153 22 -15 31 -11 -38 16 -13 15 -5 37 -9 39 43 -32 -91 -3 131 -32 25 42 -37
3945c7J35n3k2n2QK7O5k05J42P5o4m7k7O1Q3l1j09J18j16J14o0k9M4l7l9l8J71
$$ -37 98 45 23 -29 -21 6 71 -134 8 83 19 -28 -55 6 89 58 -51 67 -49 65 5 -24 20 -17 -56 -94 77
3972G7J2j08mql8J6M1J1M7j11N0Q0nj15J12o3N1np2m2J05j00K8J55q8N4j15O8
$$ 77 89 -19 -23 -31 -69 -53 -12 -1 46 -65 -15 65 60 -55 57 -6 45 40 -32 -74 31 -69 -41 114 26 80 -35 33
4000C3J2J0k5k6j3Q0j35M8q8J61k3j25J16j11N4M2N3o1M9J6p7L2N3j9j43M1k8
$$ 33 45 55 30 4 -9 71 -64 -16 -104 57 34 -91 25 -86 -32 10 63 2 51 67 -10 22 75 56 -87 -46 -74
4027g4J30m2K9o7J00j60p5N1J73pj2o3m3R7O9j67J66m8o9j3j8R3m6k3o6J31p3
$$ -74 56 14 43 -24 76 -84 -159 -108 65 58 46 -17 -60 37 106 -61 105 57 -12 -25 -43 50 4 -19 -85 46 -27
4054b7R9j69J05m2NJ7k7Q7j12L7K7K9j3R6j09n8J53j45L8n0N0N4O0o6Ln9K1L9
$$ -27 72 -97 8 -34 -29 -12 -39 48 -64 -27 0 29 16 112 3 -55 98 -47 -9 -59 -9 45 105 39 42 -17 4 43
4082D3q3jLM2Q3l3l5r9J31n0j3o9P1N0kj01J15Kp1L6o1l4N1MJ09j54K6M6j40J35
$$ 43 -40 -41 -38 4 87 54 19 -80 51 1 -12 -81 -10 40 38 -63 52 54 -17 19 -42 -76 -25 -21 88 -66 -40 6 -134 1
4112AN4j8r8l9J60j27j8J9%N2k3P9r6K8L0j01R2k7q3J58K0n2MK9p9M9r1N0Q4j02
$$ 1 55 37 -61 -100 60 -67 -85 -66 -66 -14 -37 42 -54 -26 4 -97 -5 -32 -115 43 63 11 15 44 -35 14 -77 -27 57 -45
4142d5l3J07k8n7K6k8R7n8K6l7j0K2m2J36r6j16J25PL5j1J6rk1K3k0R5j43P7N0
$$ -45 -78 29 1 -56 -30 -58 39 -19 7 -30 -40 -18 -60 76 -20 -136 -11 -4 31 20 36 27 6 29 9 104 -39 38 88
4171H8J4l4Q5j86kJ3L1Pj01J47l4j5q1LQ0K1Q6n2k7r9J1R0o7j8P5q3pM3l7J9N5
$$ 88 102 68 153 -33 -35 -22 9 16 -85 62 28 13 -68 -65 15 36 122 70 43 -56 -45 45 -22 -40 35 -48 -55 -12 -49 -30 25
4202B5j0n8k8P9m4O0Kl1l2K6j06L8J31K5p0L4n4M2N0r7J14j28K7j10N0J40Rp5
$$ 25 15 -43 -71 8 -36 24 26 -5 -37 -11 -117 -79 52 77 7 41 -13 29 79 -18 96 -32 -5 -115 -65 75 84 9
4230IR4m5q3M2J1j04J46m7j5kO1j09L5j0J76j02p2Q5p2PMp9K2J4J1l0Q9J03oj18
$$ 9 103 58 -25 17 28 -76 70 23 8 6 67 -42 -7 -17 159 57 -15 70 -2 5 9 -70 -48 -34 -23 -53 36 139 133 15
4260A5P1p3o5N7j22j0M8J11N3j17N3Ll5J9N0r5l2L7M6q3j3r2J42N1rJ2n1L9J2
$$ 15 86 13 -52 5 -117 -127 -79 32 85 -32 21 24 -11 8 58 -37 -69 -32 14 -69 -82 -174 -32 19 10 22 -29 10 22
4289B2J6m2J26j39R6j13J25r0O3J8m8m8R4p2qNp3P0J04j32p2L3Q7P2k21J99j04
$$ 22 38 -4 122 -17 79 -34 91 1 64 82 34 -14 80 8 0 5 -68 2 106 -26 -98 -65 22 94 -127 72 -32
4316c2P8q0K6n2J4K3N3p7K3O9nj6J2k0m7K4J2kk2J31p9R2k22Q0Q9q5n3K76k05
$$ -32 46 -34 -8 -60 -46 -23 30 -47 -24 45 40 24 36 16 -31 -7 5 3 -19 112 33 125 -97 -17 72 -13 -66 210 5
4345Eo8K0J04j57J06J08j36L6p2KoJ05j26J02L0k4K4o4R9j71J31r7nR4k1L3k1
$$ 5 -63 -43 61 -96 10 118 -18 18 -54 -52 -58 47 -79 23 53 29 53 -11 88 -83 48 -49 -54 40 19 52 31
4372C1q0L8J18O0j01p2R8n5q7M3Jp8K5J19o9P7l0lj01P9j01Q8kj10J17j7O2m6
$$ 31 -49 -11 107 167 66 -6 92 37 -50 -7 -6 -84 -59 60 -9 68 38 35 -66 13 -88 0 -2 -112 5 -12 50 4
4400DJ50j66l6L5M2r6M8J59k82J86n2P2o4L7l8m2M0m4J46K2j71N6K0J1o7R9j68
$$ 4 154 -12 -48 -13 29 -67 -19 140 -142 44 -8 64 0 37 -1 -43 -3 -47 99 121 -50 6 26 37 -30 69 -99
4427i9M7Q7r0P7Q5k42J83j30l3J47j08P7ml5l9K1J3j6J12oj02M1P7Oj70K40j48
$$ -99 -52 35 -55 22 107 -135 48 -82 -115 32 -76 1 -3 -38 -77 -56 -43 -59 53 47 -55 -14 63 69 -101 139 -9
4454ij0M9j63J65mR3p1j02K4k4k9N7R6qj7l3n8O8M6j04RK2J9r9p8K65k28J13K2
$$ -9 -19 30 -133 32 28 121 50 -52 -28 -52 -81 -24 72 64 47 14 -44 24 70 -34 -25 -3 16 -83 -161 104 -124 -11 11
4483A1o6O2O0k3j66J52k8K9j8J1j14O6Q4m6P0j04K7J1J5M0k5l8L1j19O7M2j4j3
$$ 11 -55 7 67 44 -122 30 2 31 13 24 -90 -24 60 14 84 -20 7 18 33 73 48 10 41 -78 -11 31 17 4
4511DK7k4Q2m7lLj70J54mm5J39j97K0lJ09q9N8j44J85k9m7j1m8R4lj47P2j1m4
$$ 4 31 7 89 42 39 42 -128 26 22 -23 116 -81 -61 -64 45 -44 14 -130 55 26 -21 -32 -80 14 11 -136 -64 -75 -119
4540a19J73q5J8l4K8n0J94j02kn5J09o2K3p2R8pM6j82O9P4n1N8j85J18m0l3J44
$$ -119 54 -31 -13 -47 -19 -69 125 23 21 -34 75 13 36 -36 62 55 101 -81 -12 62 11 69 -116 2 -38 -71 73
4567G3p1K6m4n4Q2n1J45j28j8J23l9k7NQ1m7j19J3L9r5J67n5PRN9M1r8j33J08
$$ 73 2 28 -16 -70 12 -39 106 -22 -40 83 44 17 22 103 56 -63 -50 -11 -106 61 6 13 22 81 122 24 -109 -1
4595ar2J75m5Nl8O6k0l0j5K4K9o7KN4n1O1Lk1j02P6Q5k3j13K2J4Q8j67P3nR6p7
$$ -1 -93 82 37 42 4 70 50 20 5 29 58 -9 -7 47 -4 57 60 39 -63 13 98 75 -38 -16 -2 86 -81 -8 -13 83 6
4626Fp0P6j45Q0j7J98n2j49N9r9L09l09J95J02r6n4N2j29J5K0m1kL4O5q4JM5J8
$$ 6 -64 12 -133 -53 -70 128 76 -73 -14 -113 196 -113 82 184 88 34 86 -43 -28 -8 -49 -51 -17 48 -36 -35 10 28
4654B8qo9M0l3o2J85q4Lq4Q7o6pN8N5q1nQ0N4o5m4k8k0J64j31O8r9L9O2n7J0m6
$$ 28 20 -49 -9 -42 -104 81 -3 0 -84 3 -63 -70 -12 43 -38 -43 37 91 26 -18 -46 -66 98 -33 35 -64 -25 37 -20 -10 -56
4685e6K7o4L9k7L9lk6L2MJ2N6P0j29L2j4j5r6J32j2k0J7N0n1j5N4n5j03J07J24
$$ -56 -29 -93 -54 -81 -42 -45 -71 -39 -35 -23 33 103 -26 6 -8 -23 -119 13 1 -19 -2 48 -3 -18 36 -19 -122 -15 109
4714A09k8m3q8L8P7p1m8L4Q0q5L3R0j72J10J6N6j80P7M4k2q6P0q8K2r5R1L4j2
$$ 109 81 38 -50 -12 65 -6 -54 -20 60 -25 8 98 -74 36 52 108 -72 5 49 27 -59 11 -77 -55 -150 -59 -25 -37
4742c7K3N6l7r0K01k00J07o6J10o8K4j2J2Qo3J28r5r3J60l4L6J13j16j00%L0J6
$$ -37 -14 42 5 -85 116 -84 23 -43 67 -1 23 11 23 31 -32 96 1 -92 68 34 70 183 67 -33 -33 -3 13
4769A3O5j53J09M3r3Q1r2L8M0qp1j8N8n2m5R0l7rQ2p4K7m2M7n2Q6j0J3j7n7p6
$$ 13 78 -75 34 77 -16 65 -27 11 51 43 -28 -46 12 -40 -85 5 -32 -41 41 -33 -6 -48 -1 -53 33 23 36 19 -38 -114
4799a14J59m1m6P3J20j59J25r5M7q5m7O9j05J62j26M8O4K1p5K5n3N1J0K0r2P5
$$ -114 45 4 -42 31 151 -8 117 22 69 -16 -63 6 -99 63 -63 -15 49 70 -5 20 -33 18 28 48 -44 31
4825C1q6Kk2Jr1J49Q8j50J23K3q4J8l4O4jr9J46m6o5j5Q3N2m6L7jq8n3j48K23
$$ 31 -55 -53 -75 -74 -165 -16 72 -78 45 68 -16 2 -32 32 31 -68 78 32 -33 -48 35 87 41 78 77 -11 -64 -212 11
4854A1J27j76N4k8Q1l0r8P5P4r2m2q8J23J7j07J27m4m5J02j70J34oj34O1O3k4
$$ 11 138 -38 16 -12 69 39 -59 16 90 -2 -44 -132 -9 8 -99 28 -16 -61 41 -129 5 -1 -135 -74 -11 -35
4880c5o5J01PK8o6o4J64j6k5m7M7L7l9l1j09K2J25P3p4J39k65LJ0J30j16K2J6
$$ -35 -100 1 8 36 -30 -94 70 54 29 -18 29 66 27 -4 -113 -91 34 107 33 172 -93 -90 -80 50 -66 -44 -28
4907b8J13j03L1q5KJ66j17q9K14m8q9%N9o2kL3R0l1p3K3Q2j09Q6q7J13n2q6Q0
$$ -28 85 -18 13 -72 -70 96 -21 -110 104 56 -33 -33 26 -36 -38 -5 85 54 -19 4 86 -23 63 -24 89 37 -49 31
4935C1Kq1Q3m0J00j11O4j7J5k3n1P3r2K3L1q7J26j20J14LJ9j24J23q3j6l0N9M7
$$ 31 33 -48 35 -5 95 -16 48 31 46 23 -28 45 -47 -24 7 -80 46 -74 40 43 62 -62 61 -22 -38 -68 -9 38
4963C8Jj32J80j02j38K45p4p9J30q1m7O3LRL2M8j58K1m9J28j9n8J72l6j53Ro8
$$ 38 39 -93 87 -15 -153 92 18 -61 69 -12 -59 4 7 16 48 96 -62 -41 -90 38 19 -39 133 97 -56 -47 -115
4990a15J16P1Oq0L9n0L5n5k1K2K3o1M6L7Pn5nr1J09O6pm3Q5q6q7J09o0J50j15
$$ -115 1 72 78 -2 37 -13 22 -33 -54 -32 -9 -70 -24 13 20 -35 -40 -131 -22 44 37 -6 79 -7 -94 15 -45 105 -10
5019a0R3j00J9O2j31K09j26j7M2M5j79P6ON0n3R2m8K6q3j8K2n1P2k7M0M5r2L0
$$ -10 83 -17 2 64 -67 142 16 -1 41 86 -93 -17 -11 39 -14 78 30 56 -27 -45 -23 -74 -2 -29 11 56 -36 -6
5047fO5l8Q1j80O7PK9n6oJ7N8M5j10N0N0k0n8plk1J60r6L3M4j25Np0J43j10l9
$$ -6 59 21 102 -78 -11 -4 25 -31 -37 -20 38 83 -27 23 73 53 -5 -12 -15 -36 124 28 61 105 -20 -15 -85 58 -52 -91
5077i1J76o4o1Q4r0P6kJ7l4j0mL0j2Lp1R6pk3Nn5K8J62n2m5m8J2p8n4J32k5J40
$$ -91 85 21 -40 44 -46 30 28 45 11 1 -3 27 15 18 -53 43 36 13 18 -37 -9 153 101 56 8 20 -58 -112 20 -5 135
5108A35n0l0r6KJ23k3k12J97n4K9M6j38P9j67J26J8r4J06O7j77J43p0Q8p5nk2
$$ 135 85 55 -41 -39 84 61 -151 46 -8 21 67 -71 8 -159 -33 -15 -109 -3 64 -113 30 -40 48 -27 -32 -54
5134e4n7J27rp2lN1o9L0J17j37N1QQ3j30J8q0J79j6m6qL4Qj9%M1k6k2L5q7R0l4
$$ -54 -111 16 7 -65 -68 -17 -86 -56 61 -76 -25 -17 66 -64 -46 -126 53 37 -9 -17 17 25 6 6 47 21 -1 34 -53 37 3
5165CNP5j83Q0JM0m0o3J26r2N0oP9j4p0j5pl6Q7j00J78j14L5J7l9L8r1Q3m7R3
$$ 3 8 83 -100 -20 -19 21 -19 -82 44 -48 2 -4 75 61 -9 -24 -31 -67 20 -80 98 -16 19 36 -3 35 -56 27 -20 73
5195G3k5p1J23j12J9m0o9JJ10r6R6k3j18J6J24L4m2K5l8k0N5n1J6MR3o2o6N3q7
$$ 73 48 -23 100 -12 7 -33 -102 -101 9 -87 9 -14 -132 -116 8 42 0 25 -13 -33 22 -29 -13 -9 84 22 -44 9 -78
5224g8O8L2o4O4n4M6j00j6j9J48N5j37O8K8p3J23q5R7m4o3l1k0P5L4p1P2j3q7
$$ -78 -10 22 -42 22 -32 14 -86 -102 -121 27 82 -55 13 41 -32 91 6 103 59 -4 -35 -55 20 54 -17 55 42 -45
5252d5P0j1l2PN8n9J8k6R6q3K6R9Oj19k0J09k2n7P3j42J20k4rj9PQ8o8o2R5Q6
$$ -45 25 14 -18 -11 47 -12 6 -20 76 -7 19 118 124 5 -15 94 72 15 88 -54 66 42 33 14 21 109 41 -21 74 160
5282A60j43n3K6l7Nn9J76j25P6Rj22KJ59j58M4L8k5km2Q1Ll2P0ml6j12O1O1M1
$$ 160 17 -36 -10 -47 -42 -101 75 -50 26 35 -87 -85 74 -84 -40 -2 -27 -29 -71 10 13 -19 51 47 11 -101 -40 21 62
5311F2j55J26RK0JJ2j17J11j9q4J06j37P5O2j0j04P6N3j8j09p2J92n2pj6J6K4
$$ 62 -93 33 42 62 63 75 -42 69 50 -34 72 -65 10 72 62 -42 34 87 69 -40 -112 80 28 21 5 21 45
5338D5K6j11M7Mm3R8q4JO5m3j4M9lM9j30J06r0J1m5M1J28j71L9O9j23RL8R2j2
$$ 45 71 -40 7 11 -32 66 -18 -17 48 5 -9 40 37 86 -44 62 -28 -17 -62 -21 107 -64 -25 44 -79 -70 -32 60 48
5367D8o5mj21J18L3J8q8j5K9n4K27j99M0JN4r1Q0pL2j0oM7m7K6k2j35J31N0k9
$$ 48 -17 -21 -142 -24 9 27 -61 -76 -47 -101 126 -73 -33 -32 22 -69 11 4 36 26 20 67 20 46 24 -111 20 70 41
5396D1j6l5p7J36p7Ol8J5J5k3R9o2J1K6m3N3j09O2m0J27q3%j5K9l0j8M7q0O6M
$$ 41 25 -10 -87 49 -28 -22 -60 -45 -30 -53 46 -16 -5 21 -22 31 -78 -16 -56 71 -12 -12 -27 2 -28 -46 1 -79 -13 -9
5426ij6MP7p5N8m3L3q8j9O0Q9L7Ll3r2R8M8j98K7l4R6j7n7K0j9J8R4m0O8q9ro
$$ -9 -25 -21 56 -19 39 -4 29 -59 -78 -18 71 108 111 78 -14 84 132 -66 -39 -73 23 6 -51 -31 -50 -32 62 22 90 1 -8 -14
5458a4M6K4o1J51k85J23n1J02n0Q1k0o7n3O3m0J41Lp4l4q5M5m7J10q9O8p4J04
$$ -14 32 56 -5 146 -139 -16 -67 35 -15 66 46 -21 -74 -11 -51 90 93 19 -15 -100 -55 -102 8 -81 -13 -87 17
5485A7n0k3R6pp6J73j42k9kl8J23q6J46j25J8m2P4q1P7o4J7J14n7m7N8p0J93j43
$$ 17 -33 -56 40 33 -43 130 -12 -41 -43 -81 42 -44 102 -23 -5 -47 27 -54 23 -41 -24 90 33 -14 44 -26 167 24
5513B4M8p9L8l6k1m2J66m1n1k9M7m5J3L0n6LN1o4J08j30j6J56j1j15n1P6j00J45
$$ 24 72 -7 31 -5 -26 -68 98 57 6 -23 24 -21 -8 22 -34 -31 20 -44 64 -66 -82 74 63 -52 -103 -27 -127 18
5541A8K9p1m7K9K6j6J23j32KJ4o2N8K3J2n3K3P9j12K1J48l8r7k5k6P2Pj4N2k06
$$ 18 47 -24 -71 -42 -16 -32 91 -41 -39 -25 -87 -29 -6 6 -47 -24 55 -57 -36 112 74 -23 -48 -74 -2 5 -9 43 -163
5570a63J78m9J8J17k1p1Np1J17n2Ml3q8J98n3o5P3j29J28NM8r1k7KQL4k1Q7j10
$$ -163 15 -34 -16 101 80 9 14 -57 60 8 12 -21 -109 89 36 -29 44 -85 43 48 96 5 -22 -20 -12 22 1 88 -22
5599b2J0M6r6K8R5j63J67p5L7N1j20L7j0L5J29r2p6L8J4l8j40R1P4o0J78j79o
$$ -22 -12 34 -62 -34 61 -102 65 -10 27 78 -42 -5 -15 20 149 57 -19 19 33 -5 -145 -54 20 -40 138 -41 -47
5626d7R2n8L1n7km5J64j49PN9l4N7L2j56J09j7J18pr1Q1r3J6PO6o8N5q1k5L4j9
$$ -47 45 -13 18 -39 -41 -86 78 -71 -64 -5 -39 18 50 -106 3 -14 104 97 6 87 -6 10 17 83 15 70 -11 -36 -2 -21
5656b1Q4l7l1L7nJ9r5J7l8N7J4L1j12L4K3j6m2J75p3O1n4n5R7m4j5L4l2R9j06
$$ -21 63 26 -5 32 27 46 -49 -32 -70 -13 1 32 -80 -46 -23 -39 -81 94 21 82 28 -27 70 26 11 45 13 112 6
5685Fm3JM4J8lJ6O3j63Q0O8j43L8l9O1J01j05Q0Km9j66J69%j9mK2j10N8L5Q9j25
$$ 6 -37 -36 8 26 23 39 102 -61 19 87 -56 -18 -57 4 105 0 80 82 33 -133 36 36 17 13 35 -75 -17 18 107 -18
5715a8j8q7J50P1j39K3m3P4rn4k1N6Rj05J47l4O1j24o0O6O1rp2J22j00L7p4M4
$$ -18 -36 -123 27 98 -41 -18 -61 13 4 -50 -71 -15 -6 -111 36 2 63 -61 -121 -55 6 -3 -75 47 -53 -16 -90 -46
5743d6J72j31P6q1mL7M6L1m8j28J67N4p0j96J93j59M6k2O8P3n3J6q0J18k8q1o6
$$ -46 126 -5 71 -10 -14 23 69 100 52 -76 91 145 75 -121 72 -87 -41 -63 5 78 25 41 -39 79 51 -30 -96
5770i6Q5n3O9k4o2J9J33m9q5J43p1Q4j10R9n6J6r2L0L7O4p0r7M5L3NL3m5J31m1
$$ -96 -11 -64 5 -19 -81 -62 71 22 -63 80 9 93 -17 82 26 42 -50 -20 17 81 11 -86 -41 -8 -3 30 -15 116 75
5799G5k6j4k1L2r4O3r9Q5M2p0qK1r2J53K1j02K5k0n0P3rl9M1P1j8j16Q7M7p5J45
$$ 75 49 35 14 46 -48 15 -84 1 43 -27 -35 -14 -106 47 68 -34 -9 -29 -79 -6 -15 -54 -13 58 40 -76 11 58 -17 128
5829A28l18J26J37k8l1o2N8o2J11o0mj01J36J4m9j9J13n6Mj3j21O2o1J90j12M7
$$ 128 -190 -64 73 45 14 -48 10 -52 59 -1 -5 -106 30 44 -5 -24 89 33 37 24 -97 -35 -96 94 -18 29
5855B9l2Jn9M6k8O9o1K9L7r0o4P2JP9o7O1j0l3N5j66K11j41O9O5k8j34J34n2J36
$$ 29 -3 -2 -61 -15 -43 26 -35 -6 31 -59 -123 -51 -50 29 -38 23 13 -20 35 -131 80 -61 8 73 45 -89 45 -7 129
5884A29j71Qo3J73j77Q9q7J12k8k2Q4j07pLJ07l1mjKR7q7Qm9O6pl7lM3k7n4LN
$$ 129 -42 -34 -97 76 -101 -12 -99 13 -15 -37 47 -60 -67 -64 43 12 8 7 9 106 19 27 -22 44 37 0 -3 40 13 -41 -38 -33
5916c3n1R6k5P5j23J43k30J22J07r6m3K9Q5Po5rJ92k11R0m5Lj67J26m3n4K09j27
$$ -33 -84 12 -13 62 -61 82 -148 -26 81 -15 -58 -29 56 63 -2 -11 181 -30 60 15 18 -149 -23 -66 -120 89 -38
5943c8m9M4l7J79j26M0n0J67j03N0q7K3k0J2j7l5o2J86k5l8j33K02k05J18n5j7
$$ -38 -87 -43 -80 99 -27 13 -37 130 27 77 -10 13 -7 5 -12 -47 -109 77 52 14 -119 83 -122 -4 -59 -76
5969g6K0O3K8K1j13l8J51j39N4q8J25K9j21J19P0j91J43j18L2J10r7O3j8l3K0
$$ -76 -56 7 35 56 -57 -95 56 -83 -29 -117 8 37 -84 35 105 -86 57 -61 -29 81 -16 47 29 -4 16
5994A6KJ8j0k6M4o2J9K2j4Q6j33J10j2p1o7n3N9L1P1p5Q5q8Q0j23J40Ln6r2k1
$$ 16 18 36 26 0 44 -18 1 23 9 95 -38 72 60 -11 -78 -131 -72 -41 30 -45 40 -48 32 -91 49 52 -4 -96 -117
6023a17P8L5On9P3Qjl2O4j11J50j15p3Q8n3J33j6r1N1J1R9p1j74J51J47k14j09
$$ -117 -39 -4 2 -57 16 24 23 -9 55 -56 94 -21 -94 -6 -59 74 58 -33 18 29 128 57 -117 34 181 -33 -142
6050a42R3J08m6L9k1q5P8k9L0n8L9k8NO9j42M7NM5m4l0J26r9J38j16L4N2M3j28
$$ -142 -49 59 13 52 31 -54 24 -5 25 -33 6 -22 -17 52 -90 -43 -38 7 -37 -67 59 -40 98 -18 16 68 111 -17
6078a7N6nj5o4Q0j13PR3L0l9L2r5K1j11J22k6P0n6M2P5j34K1r1J21R5j26j8M9
$$ -17 39 34 19 -45 35 -78 -71 22 52 13 45 -50 -29 -140 -18 -44 26 -30 12 87 -47 -26 -117 4 99 -27 -45 4
6106DP2j68N7J09o7k7P4n6p4J51j29M3P2pj8L6n3N4k7q0O9r1NJ06n5p4K2P5n3
$$ 4 76 -92 -35 74 7 -20 54 -2 -76 75 -54 -11 61 54 36 72 19 73 46 -34 35 -56 -51 55 0 -74 -52 23 -30
6135c0kj1L2L0oj82J25M6KK0l6j1O1r7O2l2O6p7M5p4k4K9L9N7r8M8K2J14j00p8
$$ -30 -32 -43 -11 19 13 -169 -44 2 4 24 -12 -23 38 -59 3 -29 37 -40 5 -69 -93 -64 -25 32 -66 -18 4 118 18 -60
6165f0J03J2J4M4k37J18j3jJ22r5j96K52J7%p8M9j26P7m8Q3ko3M0l4J0J4n9pN8
$$ -60 43 55 69 113 -124 -6 -19 -20 102 7 -189 63 80 80 2 51 -75 2 -46 37 35 -28 12 -22 -12 2 -57 -64 -6
6194fj6M2op0J49n9%j02O5j9n6J3J44r4O0n5k2O7J01j52R8j72J53q0J35j07l0
$$ -6 -22 20 14 -56 93 34 34 -68 -3 -22 -78 -65 79 -15 45 -10 -32 35 136 -16 82 -90 63 -17 118 11 -19
6221a9n2M7lJ3jm3J00j4j16P5M6J4jq5q4P1J35j17O5m5k9Q8j08Q1J04p5j03o4
$$ -19 -71 -24 -27 -14 -15 -58 42 28 -88 -13 33 47 46 -39 -123 -52 83 -34 31 -14 -43 45 -63 18 122 47 -56 -120
6249a20J36mq1J34r4P9l5J7k3kj84Q2J26j28K9M6m9J11r6J31np1K2o0J3o0lJ2
$$ -120 16 12 -69 65 -29 50 15 32 9 7 -177 -95 31 -97 -68 -22 -71 40 -56 75 70 -1 21 -39 -26 -86 -89 -77
6277g7Q9l7j2j5J20j21oP7q4J13k6N7p1k7Q7l4K1j49J34Pq5P0j4m5k3N6Q6Jj22
$$ -77 12 -25 -37 -52 68 -53 -59 18 -66 47 21 78 7 -20 67 33 54 -95 39 46 -39 31 17 -28 -51 5 91 92 -30
6306c0P4J4j8L9q5m8O4M4k26J13Q4m7l1M6j25M2L1J13r4Q2p8J17r2l2qM7K1L9
$$ -30 44 58 40 79 -6 -54 10 54 -172 -59 25 -22 -53 -7 -132 -90 -59 54 -40 42 -36 81 -11 -43 -51 -4 17 56
6334E6j1n7j38R6R8m9Q4o3Q9j05Q1q9J5l4l1K1o4MJ17K0k3J7p2J14o9l5M3n3j
$$ 56 45 -12 -150 -54 44 -5 79 16 105 0 81 -8 7 -27 -58 -37 -101 -97 20 40 17 34 -38 76 7 -28 15 -38 -39
6363c9O1j17J92l4j02K0M0N1m8K6n7O7l9k5J14n7qp3j9P6l5k9m0J35p6J06r6m2
$$ -39 22 -95 97 63 -39 -19 21 72 24 50 -7 60 21 -4 110 53 45 -28 -47 29 -6 -35 -75 60 -16 90 -6 -48
6391d8l9J1P1noO4k1p5O3M3j16Q2m8o9Q0m9J05Pj24m3J63O1n3NN7l8k2l2o8K9
$$ -48 -87 -76 -5 -10 -16 48 27 -48 15 58 -58 24 -24 -93 -13 -62 43 50 -74 -117 46 107 54 59 116 78 56 24 -44 -15
6421a5J17l3r8J30j08jK0R1o5M4j06p2J02j5M8m6p4K3J28r0L3l5n5J41j35j7J09
$$ -15 102 69 -29 101 -7 -8 12 103 38 82 -24 -96 6 -9 39 -7 -81 -58 70 -20 13 -22 -77 64 -71 -88 21
6448B1k7N8K7j38N0o4J06J5nq0M0J2j02K5J66q3J16q5N4q7n3J31q3l5OL6l6j3
$$ 21 -6 52 79 -59 -9 -73 33 48 43 -37 3 15 -87 -62 104 21 137 52 106 19 -34 97 14 -21 -15 21 -15 -28
6476b8M2K7j41J00J4N1j7J7j81J58l6j3rR8j48R6n9K1Q2j9r3J19o0o8J56m7J7
$$ -28 14 41 -100 0 14 65 48 65 -116 42 6 -7 -16 82 -66 30 -29 -8 74 55 -38 81 21 -47 109 62 79
6503G9j27J49p3l8P8j00J6l2J2K7jlr0J53J1k9o0p0P5J0K2N1p4R2j18m2O6K0J0
$$ 79 -48 101 28 -10 68 -32 -16 -48 -36 -9 -10 -13 -103 50 61 32 -28 -98 -23 -13 9 60 -14 78 -40 -82 -16 4 14
6532A4K4q4oRq7J05M3j6q5Q9q2rQ7N5j9j34J94l4o8L3n4m0Q0j8Ok5N3j1k9l1J36
$$ 14 38 -46 -52 -43 -130 -25 18 2 -83 6 -76 -85 2 57 38 -96 98 64 -4 29 -25 -65 15 -3 3 -22 31 20 -9 -40 96
6563I6Lj46M8M7j11l6J12j00L1J06J0PJ2k5m7m5p4J45k9L7k6P3q3j03J81k09J26
$$ 96 99 -47 1 48 -63 -99 13 -87 -56 50 60 67 79 54 7 -38 -112 33 4 41 15 88 5 -98 83 -126 0
6590@j0j7P2j3K4n7M6l6J4M7m9p5J46j1j5p6j21R7o7Q2K3j8lo0O9L6o4O4L5j17
$$ 0 -10 -27 45 32 56 -1 45 9 23 70 21 -54 92 81 66 -10 -131 -34 -101 -19 4 -14 -17 -77 -8 28 -36 28 63 -54
6620e4J1qJ05j2m0j2kQ2j54J47oq9J16J03j44p7kJ03k7r3K8j7nJ40p6r7N1J7M0
$$ -54 -43 -51 54 42 2 -10 -12 70 -84 63 57 -32 84 187 43 -34 -36 67 40 -53 -25 -42 -47 93 17 -80 -29 -12 28
6649B8j14N6M1K1k8k9J04j32O6n1jJ34j09l3k1P1J07m6J8j23J19l5L5l3O0r6J5
$$ 28 -86 -30 11 32 4 -25 79 -53 13 -38 -39 95 -14 -47 -68 3 110 64 82 -41 78 43 78 45 105 9 24
6676B4j50J43n7Q4m1J8O8p5K0j0J33p1j4q8K6M0m6j5K8m3Kl0k0J53o1Jj37J34
$$ 24 -126 17 -40 44 3 21 89 14 34 24 157 86 72 -16 10 50 4 -11 17 -26 -24 -54 -74 79 18 19 -118 16
6704A6j2q3J12M4M9j25l0J69j87J16q9J27m7q3R9n4m5%Q4r6Q2n4O5r8K3O7j9j7
$$ 16 4 -79 33 77 126 1 -29 140 -47 69 -20 107 60 -23 76 22 -23 -23 61 -35 47 -7 58 -40 -17 50 31 14
6732A4Q6j15J03p8m4Q4j06O3m1N9r7N2k8L1rl9K7j0J23r5K9j5n6J34j22K04j32
$$ 14 100 -15 88 10 -34 50 -56 7 -34 25 -72 -20 -48 -17 -26 -65 -38 -48 75 -20 9 -6 -62 72 -50 154 22
6759B2J9j00RN6O8p2J03n9m0P6j07JM2q2M8K6q1J54j56j00J55P9p0q5O2q3J59
$$ 22 41 -59 -50 6 74 2 105 46 6 82 -25 -24 18 -64 -16 10 -71 83 -73 -173 -18 61 -9 -94 -32 -115 44
6786D4m4J5q5m2L8N1L7k6oJ0k2N6kK5k8k9RK0K1k6N2q6J16j39n7J45j71K42q5
$$ 44 0 15 -70 -112 -74 -23 14 -12 -18 -8 -30 26 24 49 21 -8 1 21 42 16 68 -18 98 -41 -98 47 -124 118 33
6815C3j35Q2p4J07j00J45p9K1rk2j5J0M1j0O3n9j20J13M4q9O7m2J9j6l1L7M0p0
$$ 33 -102 -20 -94 13 -87 58 -21 0 -9 -31 -46 -36 5 -5 58 -1 -121 -8 36 -53 14 -28 -9 -25 -56 -19 21 -49
6843d9P4J7l8m3k9O9q9R4P6r2Q7j05M2o4j5R8j56J36M2r7j0N2o3O1k2O0j3j15
$$ -49 25 42 4 -39 -68 1 -88 6 82 -10 77 -28 14 -50 -65 33 -123 13 55 -42 -52 0 -63 -2 -24 36 23 -92
6871i2K9R1j6lj18K05r1k4Qm6pJ35q1M3l9N5j48J27j3J6J9m7o6J00j15k9O7P0
$$ -92 -63 28 12 9 -109 96 5 -19 -11 -57 -64 71 -10 33 -6 49 -99 28 15 31 50 3 -63 37 -78 -107 -40 30
6899C0p7P7j2K0k7o7N8K2l2N9k3j03J06k01K95q9m1J01j70J16O9j00J1j6o2J56
$$ 30 -47 30 18 38 11 -56 2 24 -8 51 28 -75 31 -170 125 36 -5 96 -74 42 111 11 22 6 -56 100
6925A00q9M8m4qM8r5O8r5J27j6n4R6j06%j2P9n4j0m1P7p3R6j14L5M7o8N2K0j33
$$ 100 11 59 15 7 55 -40 28 -67 60 44 -10 86 -20 -20 -32 47 -7 -17 -58 19 -54 42 -72 -37 10 -58 -6 14 -119
6954a19J11jj4Qk1N1l6l6m0J76j96M7J13Mpj5Q1j31k4N3p7M6m0Q5q8P9j29J67
$$ -119 -8 -9 -23 -15 -36 15 -21 -57 -97 79 -117 -70 43 47 40 25 106 -25 -49 4 -73 -27 -67 18 -70 9 -120 47
6982D7n9R6j71J1J19j34J60R9j33j01J81n6mKj39O4o0P5l7O3q8M7J01n0j4j8j0
$$ 47 -12 84 -87 -76 43 -91 69 168 35 -66 115 59 55 57 -82 -18 -78 -3 -40 23 -65 -18 83 33 19 1 -9
7009iJ13q4J4k0M2j00N6m5J9J0j4O4P6j14k9oL3M9q1j27J48m8m2J57j24O1J05
$$ -9 104 20 34 14 56 -44 12 -33 -14 -4 -18 46 122 8 -21 -27 6 55 -26 -153 -5 -53 -95 62 -62 -1 104
7036A04m4j04L0J10m5r8L6J7m1K2Q0r2n7J97j63J36o3qlM8j28J52M4k29J98r0
$$ 104 60 -44 -14 96 51 -47 -11 6 -35 -13 67 -25 -82 115 -48 88 25 17 14 62 -66 86 130 -99 99 9
7062IL3n4N5m8J18j04o0K5nO4np0J12m5j5k5JM2L1l4l3J16j82m4J05MM2j23R6
$$ 9 42 -12 43 -5 113 9 -51 -26 -31 33 28 -42 70 25 10 -15 -14 28 59 25 -8 108 -74 -118 -13 -9 33 -90 6
7091FJ6JNpj1j01J35o6J4J8rn7lJ26l2O6m8r0J46r2j7j12J60p0L1n5N1l6J22p3
$$ 6 22 23 28 21 10 -91 44 -22 -8 10 1 -56 -59 67 35 101 53 -37 109 17 0 -112 48 -22 9 -46 5 -31 91 18
7121A8q0K5k3O1n0K0J2k6J19j58J17r0j5J45j02m3M3O7L2o4L4L5j46R1p6K5M1
$$ 18 -62 -37 -60 1 -49 -29 -17 -43 76 -82 35 -55 -70 75 -27 -70 -27 40 72 8 42 77 -69 22 -54 -29 12
7148A2p9J12j22R7o6R2l0K8j48J67j07O7l7j02R5K8j7J5n2J7m3J90j32M5p1J3
$$ 12 -67 45 -77 20 -46 46 16 44 -104 63 -44 23 -14 -116 -21 7 -10 5 -47 -30 -73 117 -15 30 -41 -28
7174b8L0m6J49j95M1K1R3k2L9r9J07q8P5m8K3q1OJ3Rrl0R9j25L8J2n1K3j3M0K9
$$ -28 2 -44 105 -90 -49 -28 65 43 82 -17 90 2 77 29 52 -29 -23 -10 -1 -10 -40 59 -66 -28 -16 -67 -44 -57 -17 12
7204A2M6q3n6l9N0J35r0JN1LK0j8m8L4Oon0L5J11k1j55P3J4kp0O3j17R6Lo7J21
$$ 12 58 -25 -81 -120 -70 65 -25 -24 27 30 50 32 -16 18 24 18 -32 3 114 93 -62 11 25 23 -47 16 -101 -5 -2 -69 52
7235E2p9M7N%kJ3j10J37j02N8r6j9L9M5Q5j06%Km9J24K1J0r2L1j5J5pJ11q4q6
$$ 52 -27 20 25 25 23 36 -74 63 -39 19 -77 -96 -57 -12 73 -33 -33 -31 -80 44 65 75 -17 14 -1 14 7 118 34 -52
7265e2K4O5o1J4j9M3O1k7n2J25j89L7Q0n8K1j8Jo3J35j17O3Qm9K2%M6n9J8OPQ
$$ -52 -28 37 -24 -10 -29 14 75 48 -4 121 -68 -31 49 -9 12 -6 -5 -68 67 -50 13 21 -28 -6 -6 40 -19 -1 5 12 20
7296B0jm1P6j16K3P1J9L3j06Q8M5n8k5m2%j7P4o6n8J01kj01J17k4O5j10N7q5O1
$$ 20 19 -22 54 -62 -39 32 51 84 -22 66 111 53 28 -14 -14 -31 43 -23 -81 20 18 -83 34 10 75 -35 22 -63 -2
7325bP5j10K3N2l8O5L0j02R6j04L7J22j33K8n4m9Q9r2J17j65R6M3J6qK8L5q1p7
$$ -2 73 -37 -14 38 0 65 95 -7 89 -15 22 144 11 39 -15 -64 25 -67 50 -115 -19 24 40 32 60 95 14 -63
7353f3O3kk1J4MN2j03J00o5P9Oj61J10J5j09O3m8J4J02j0PP2j43qn6J09Or9J1
$$ -63 0 -2 -23 -9 -5 47 -56 44 -21 58 64 -97 13 28 -81 -18 -66 -52 50 40 47 119 -24 -32 -88 21 27 -72 -61
7382f1M3K4r3J00j2J06p4j13R0J9o4J67r9q9K0%Q8j05OM9l1O9m1q2K8j20L4J37
$$ -61 -18 6 -87 13 1 107 33 -80 10 29 -35 132 33 -56 -36 -36 52 -53 -47 2 -29 40 -1 -83 -55 -175 -141 -4
7410dj22J5N2m8N0kL8j7Q6l3R8j78J4L5Q4r7R9L2j49N8m9l7J61j56M6M2Qj5K1
$$ -4 -126 -111 -59 -107 -57 -59 -21 -38 48 15 113 -65 -51 -16 68 -29 70 102 -47 11 -38 -75 86 -70 -24 18 26 11 32
7439C2q0R2N7j67J13q6J54j1j14pK2j25J3oP0L4n2J7N0p7M2j4N9J8j34R7l9O3
$$ 32 -48 44 101 -66 47 -39 115 104 -10 -17 5 -120 -107 -113 -43 -9 -61 -44 6 -71 -29 -43 16 34 -100 -3 -42 21
7467B1J05q5J1j0n7m1R1j6M7pj04q4R5M7J09k46J50o1O7k5K2k9K9J1q5l7oJ9j5
$$ 21 126 41 52 42 -15 -56 35 19 66 59 -45 -129 -34 13 122 -124 26 -35 32 7 29 0 29 40 -45 -82 -88 -69 -84
7496h4O8N2J9j23J21j09P9r6MJ5P6l5o5k0J64j67J47j3j0n8M9l0N6oj11J57q7
$$ -84 -16 36 55 -68 53 -56 23 -73 -69 -54 22 -13 -78 -98 66 -101 46 33 23 -35 14 -16 40 34 -77 80 -7
7523gK3k1O5r6N8m2lM2j4r8J06Qr4nN2n9O2R5j64P9L5L1o4m7Nj3j43K34J01r7
$$ -7 16 -5 60 -36 22 -20 -23 19 5 -93 13 21 -73 -78 -26 -85 -23 72 -92 -13 22 53 -11 -58 -53 -66 -209 25 126 29
7553B9mM9j77J64j38J17O8j17J05p6J7M9m2n8Q3p5O5k17J36J8J27p8Mo7N1j19
$$ 29 25 74 -103 61 -77 40 108 -9 96 20 37 86 44 -14 69 -6 59 -158 -22 -4 123 45 49 -18 33 -86
7579h6O0L1j8R1p2RN5j19Oo0J19q0M3j6Q8M4j76J73r3q8J21l6n9M4p5M9n9J08
$$ -86 -26 5 -13 78 6 15 70 -49 -43 -103 16 -64 -21 -37 51 95 -81 92 -1 -89 32 -4 -63 -19 -94 -45 -104 4
7607DJ5J1Ro0L1k5m2j01J93o8J05M6o4n6k2l7q2P4J01K0Kq9m1J03l6N7j24JM2
$$ 4 19 30 39 -21 10 -15 -57 -158 35 -33 72 118 54 -2 -24 -61 -143 -69 32 52 54 -35 -76 27 -9 48 -76 -75 -33
7636c3M9j3J48j51J6j5pk0L9M1l1J0k8p2O7m1M3Jj8R2j29NlJ7k0J6K7R0o4L0l4
$$ -33 16 3 151 0 16 1 -6 -26 13 54 23 33 5 -67 0 -41 2 3 -15 77 -52 -47 -50 -33 -53 -37 -10 80 16 46 12
7667A2R5k17R0J8k6L2j9L9o1P5m4J6mJ7m6L4m7m6M8N1n9P9K0L0o5R0j09n2P1j5
$$ 12 107 -110 -20 -2 -28 4 -15 24 -37 38 -6 10 6 23 -23 11 -36 -82 -34 17 -42 37 57 87 22 112 3 -49 22 7
7697GkMr5M2j4J14o2Nm0Kk0Q4J6n7j11J79M0k46J52k3n0p4R3J81j48LP4q3q4J50
$$ 7 5 9 -86 -44 -58 56 -6 -1 -41 -39 -59 25 41 -16 -127 52 92 -154 -2 -25 -75 -149 -56 125 -23 -20 54 -29 -113 37
7727C7Qk1nM1j36J42pr8N2N9j22qr0J56r7O3n2N7J23j79R3J2pl4L4O9j51L0jJ1
$$ 37 45 24 19 60 -76 66 59 -39 13 72 -50 -58 -148 8 -89 -26 -78 -21 102 -77 16 28 21 -13 21 90 -61 -31 -32 -21
7757b1k3O8o9J02L6q3l5No9J5J22n8k4J0k5M4l4P3K4j08J88j23N4j1m2j0J22j18
$$ -21 -44 24 -45 57 93 10 -25 -20 -89 -74 48 -10 -34 -24 -49 -5 -39 34 58 -50 138 15 69 58 16 6 128 10
7785A0M1l2m6P0r2kJ35m7o3L1k0K6p9N4J00k7k4l4m3RqK6j7L8q1P7J8K6m5%k8
$$ 10 51 19 -27 43 -49 -51 84 37 -26 5 -15 11 -68 -14 86 59 35 1 -42 -33 -41 -15 -32 6 -75 2 20 46 1 1 -27
7816b7KO3j7N1O6j10j09J09%O5p7J1J5j45Q6J47j86K8L5o8J20o5m4O4J8n0rR7
$$ -27 -25 38 21 72 138 28 -81 28 28 93 16 27 42 -103 -17 130 -56 -28 7 -61 59 -6 -50 14 32 -18 -27 70
7844G0m8m8Ol4K5j5K4P2l2M6m6l5m2o6J93j31N8J65j48P1j20K3J29j13M0K2j55
$$ 70 22 -26 -20 -54 -29 -44 -20 52 20 66 20 -15 -57 -123 70 -61 -3 162 14 85 -35 -12 117 4 44 66 -89
7871h9Q5M1o3J2O2q9J09M8k34O5P7l9k3R3rj00OmN2r7J42m2K6Lk9K4p1O8K1J6
$$ -89 -4 37 -26 -14 48 -41 68 116 -118 -53 24 -15 -38 55 46 -54 -48 -52 0 -97 45 3 29 32 3 27 -44 24 45 61
7901F1j08O9J6r6Q7j29oJ5L0J72j65k6J09J0j55O3QpJ43q6M0N7j47j33J43L2o1
$$ 61 -47 22 38 -58 29 -100 -106 -91 -61 111 -54 -80 29 39 -116 -53 -45 -52 91 5 45 102 -45 -178 -35 -3 -64
7928f4l1Q2qk4k1K5Q2K3j3qo2Nj6K4n0N9q3J58k9q7J04j90M4R1j13lqJ27L7J24
$$ -64 -95 -13 -21 -45 -66 -41 41 64 51 43 -19 -14 -30 -6 -56 3 -80 78 49 -38 66 -124 -80 11 -102 -105 -113 14 51 175
7958A75j09j12j4M8j5qK3N7j9l4r5J13q6J25J3j06P4n5O4Pj60R7N6M9m5J23j39
$$ 175 66 -46 -60 -12 -27 -35 -12 45 26 -8 -103 10 -76 49 62 -44 30 -25 39 46 -114 -17 39 88 43 166 27
7985B7K1j05N3P3nPR6k87J44r6K9O7jn2J2ll3J49j56R8r8R8k2j22J96k6j09k0
$$ 27 48 -57 -4 69 64 71 167 -120 24 -72 -43 24 23 -29 -17 -20 -53 96 -60 38 -60 38 16 -106 90 64 -45 -65
8013f5J51j62K7J31k19J62L5l3j4Kjj6m9L5k8O6l8N5O7n4j46N5P5j10j2J89k21
$$ -65 86 -76 -49 82 -137 25 60 27 13 15 14 -2 -51 -16 -44 22 -16 39 106 52 -94 -39 36 -74 -86 103 -118
8040a18O4O5o0R9L9j88M0P2m7N6q8K2J4L5R0j17k4P3j54K18k04O5l1J5J19P1q4
$$ -118 -54 11 -49 50 89 -99 -59 13 -34 22 -66 -44 -30 5 95 -22 -46 27 -127 91 -113 -48 -79 -64 55 126 42
8067D2o9K1n0O8J9n0k3j1O4p7N6L7Kq8J60q2K1k9j16J08l0k1O1m5o9N9K1N5n7
$$ 42 -27 -6 -56 12 31 -19 -42 -53 11 -66 -10 27 29 -59 101 19 40 11 -105 3 -27 -48 13 -32 -101 -42 -21 34 -23
8096b3n0L8j8l9K9J12J1j20K7L3J4j1l6N8j04J11jM8j02R9j33K8N4Nj5n9M1q3
$$ -23 -73 -35 -53 -92 -63 49 60 -60 -33 0 14 3 -33 25 -79 32 31 79 -23 76 -57 -29 25 30 15 -44 -3 -86
8124h6m0J80p5L0J7Mn9o6J22j10N7P5o7l2Q5J11j42n3M4M0Kq2J01j40J29K4j2
$$ -86 -126 54 -21 9 26 30 -29 -95 27 -83 -26 49 -18 -50 35 146 4 -49 -5 35 37 -45 56 -84 45 69 57
8151E7o0K1k9J31j82O5J5j7M8M2o4Mr2M2k6k8J08m9pj1R4j0rK7r2M7r8M4N6P0
$$ 57 -3 18 -11 120 -62 3 18 1 49 91 27 31 -61 -19 -45 -73 35 -14 -21 -32 62 52 43 70 -22 25 -73 -29 27 97
8181I7o2q9O3q5R4N7M7j40M0l4
$$ 97 35 -54 9 -76 18 75 122 -18 22 -12
8191a2
$$ Imaginary data points
##PAGE= N=2
##DATA TABLE= (X++(I..I)), XYDATA
0@%%%%%%%%%%%%%%%Qj6J6j6J6j6K4l2L2m0M8n6O4p2Q8r6J04j20J36j58J82k02
$$ 0 0 0 0 0 0 0 0 0 0 0 0 0 0 0 0 8 -8 8 -8 8 -8 16 -16 16 -24 24 -32 32 -40 48 -48 56 -64 72 -86 96 -106
37a06K26k56K87l19L52l90M32m76N28n84O44p10P82q61R48j046J155j275J410
$$ -106 120 -136 151 -168 184 -206 226 -250 278 -306 338 -372 410 -451 497 -549 606 -669 741
56G41j563J738j941K179k463K808l237L791m535N589p218J0079j6560N9999o851
$$ 741 -822 916 -1025 1154 -1309 1499 -1738 2053 -2482 3107 -4111 5968 -10592 49407 42556
71D2556q8048N7526L117m7357J9014M3441l9727j4979K5881j1147j8821L7547
$$ 42556 -45492 12034 15151 -32206 -13192 30249 -9478 -24457 1424 -9723 -28544 9003
83I003Q862k7210J0169J6947k6388n22K5960m541j6017O725K37n860L741K650
$$ 9003 17865 -9345 824 17771 -8617 -9139 16821 12280 -3737 2988 3225 -2635 1106 3756
97C756o963j042J674l113n81M404m3J073J64m486N540J0082o327k783Q129p426
$$ 3756 -3207 -4249 -2575 -5688 -6269 -1865 -1908 -835 -671 -5157 383 10465 4138 1355 9484 2058
113B058j0134J1076O034j1444l143N156n007l430R894K867o952K839K406p523
$$ 2058 -8076 3000 9034 -2410 -5553 -397 -5404 -8834 1060 3927 -3025 -186 2220 -5303
127e303K720R741k515l943K108k615m259L190N062n69l836j430q20j826J972L925
$$ -5303 -2583 7158 4643 700 2808 193 -4066 -876 4186 3617 -219 -1649 -2469 -4295 -2323 1602
143A602j37k123j077K48K34O88M427J388n447r67L085l071o16N208j514n411J142
$$ 1602 1465 -658 -1735 -1487 -1253 -565 3862 5250 -197 -1164 1921 -1150 -1766 3442 1928 -3483 -2341
160b341K006j830J060L984j864l532L126R98l137K635K859m918j279L058q05q94
$$ -2341 -335 -2165 -1105 2879 1015 -2517 609 1607 -1530 1105 3964 -954 -2233 825 20 -874
176h74K064j14k532j07J363j07M95J630j651k003J440P50l37J795j33j790l80
$$ -874 1190 1076 -1456 -1563 -200 -307 188 1818 167 -1836 -396 354 17 1812 1679 -111 -491
193d91m35l9J914L1j414n40q7l41L27K035P33j475k52L46j003J156J657j516q98
$$ -491 -926 -965 949 980 -434 -974 -1061 -1402 -1075 960 1693 218 -34 312 -691 465 2122 606 -292
212b92M18j172n42J477Q87j025n98M93k40l26J477P35j333L27J30q47R12R18p61
$$ -292 126 -1046 -1588 -111 776 -249 -847 -354 -594 -920 557 1292 -41 286 416 -431 481 1399 638
231F38o68O7k97k76J19N74k72r13m0L43Q3P90L93n04K29Q1j42M91K11R8n66q66
$$ 638 -30 37 -260 -536 -417 157 -115 -1028 -1068 -725 -642 148 541 37 266 347 205 696 907 1005 439 -427
253d27J1J91j31L74j17n98j69o0M80P45j84K1pk62L12K71J93L00l50p49J32K1
$$ -427 -416 -225 -356 18 -99 -697 -866 -926 -446 299 115 136 129 -133 179 450 643 943 593 -156 -24 -3
275cM8rj34l16k69j82L65L61J24J74k34q1L92J02K15K62l39l80m4j76K00J09l01
$$ -3 45 36 -98 -414 -683 -865 -500 -139 -15 159 -75 -156 236 338 553 815 476 96 52 -124 76 185 -116
298a16j48o4k40K31Q9Q5J79k44rK42J73K25J02j73j8j64j35L27j49j47p1l10K
$$ -116 -264 -328 -568 -337 -248 -163 16 -228 -237 5 178 403 505 332 314 150 15 342 193 46 -25 -335 -333
321c33O0P3J34K1j88J19j02O9M28o9j51J06k72J01P2MJ42j88k14KJ7J86k3k09
$$ -333 -273 -200 -66 -45 -233 -114 -216 -147 281 212 61 167 -105 -4 68 72 214 26 -188 -186 -169 17 -6 -215
345b15N3l4M4M8K50K4m4n8j23K19j15M3J64k21J2j95J22j8K10k08n1l1p7J74k0
$$ -215 -162 -196 -152 -104 146 170 126 68 -55 164 49 92 256 35 47 -148 -26 -44 166 -42 -93 -124 -201 -27 -47
370d7jJ75j84r2J42J32j08J40p7j35K6J01R3j07P0q1j52k6J68L5p4k8p1l9J26
$$ -47 -48 127 -57 -149 -7 125 17 157 80 -55 -29 72 165 58 128 47 -105 -131 37 72 -2 -30 -101 -140 -14
395a4nJ73j21l8O9j05O2J04l3j8R3j63M5k5l3l6j2K9q3J32kJ5j03MJ47j14l8N7
$$ -14 -19 154 33 -5 64 -41 21 125 92 74 167 4 49 24 -9 -45 -57 -28 -111 21 19 34 -69 -65 82 -32 -70 -13
423a3M1J17q7n8K9r3Q2M9q5k6L1n2L4P3k2J40k93Q0J0M4L3K3p9P3N3m0k9r8M7
$$ -13 28 145 58 0 29 -64 18 67 -18 -44 -13 -65 -31 42 20 160 -133 -53 -43 1 34 57 -22 51 104 64 35 -63 -16
452a6l3p2O7Pp3R3Q2k24N8J08q0K06o5r2J12p7L0J35j52Q3J42k55J19j30O7nj67
$$ -16 -49 -121 -54 -47 -120 -27 55 -169 -111 -3 -83 123 58 -34 78 1 31 166 14 97 239 -16 103 -27 40 35 -132
479a32J81p1j17J6K76r8JK6Qr1M7L1Ql0L6o1ql1o5k0J6qm0K1P2pl7R6N3Q9j50
$$ -132 49 -22 -139 -123 153 55 56 82 90 -1 46 77 85 55 91 30 22 -9 -74 -94 -78 -86 -126 -105 -33 -40 -77 19 72 161 11
510A1N8Ol2P0r4J8o4L6m2J5j2r2J27j42P8M3l2R2K5k3k3P9p4k1P3o2j07K1J00
$$ 11 69 75 43 113 19 37 -27 9 -33 -18 -30 -122 5 -137 -59 -16 -48 44 69 46 23 102 28 7 80 18 -89 -68 32
539C2j4j05N7M5o0p2J03M1r1R6l9L0l1Q3j1j04N2J03j41M2m8J47j53P7j14rQ7
$$ 32 18 -87 -30 15 -45 -117 -14 27 -64 32 -7 23 -8 75 64 -40 12 115 -26 16 -32 115 -38 39 -75 -84 3
566CM1%n5m4J23p8k9J16j38J27j8P7n9j8p3R0n2j4l7J2L0L5N8m5j09nn1P5p8J26
$$ 3 44 44 -11 -55 68 -10 -39 77 -61 66 48 125 66 48 -25 65 13 -1 -38 -26 4 39 97 52 -57 -62 -113 -38 -116 10
596A0n1J07ln2L9p7J06r0o8L0j1PP4nr0L1Q7r6N2ok6M9K7n0L6l7o3O1m6L9J12
$$ 10 -41 66 63 11 50 -27 79 -11 -79 -49 -60 -53 21 16 -74 -43 44 -52 0 -6 -32 17 44 -6 30 -7 -70 -9 -55 -16 96
627I6j87P6J0m9J01l5qm6O7K0j31K5qR6l8J5j1n1L3J17q3PQ3j15O7n3J08j8j32
$$ 96 -91 -15 -5 -54 47 12 4 -42 25 45 -86 -61 -69 27 -11 4 -7 -58 -25 92 9 16 99 -16 51 -2 106 88 -44
656d4J15j00k0J70k69J78n9n2J57l3o5p6O8m8L2M9J00l8p3k4pJ30j00q1J29%K7
$$ -44 71 -29 -49 121 -148 30 -29 -81 76 43 -22 -98 -30 -78 -46 3 103 65 -8 -32 -39 91 -9 -90 39 39 66
683F6l6k6k9N7j80K34k5L8r2J0j4P2p0j2J8O2r7MO2j5k7L3pk8OK4Q3r1nq0J01
$$ 66 30 4 -25 32 -148 86 61 99 7 17 3 75 5 -7 11 73 -24 -20 42 27 0 33 26 -2 4 28 111 20 15 -65 36
714C6m1k5j1M6q6j1N1o7Q0O6j11L6L6K4L4o2P8Jj41J04j21J02Lj22lJ16M4J08
$$ 36 -5 -30 -41 5 -81 -92 -41 -108 -28 38 -73 -37 -1 23 57 -5 73 74 -67 37 -84 18 21 -101 -104 12 56 164
742A64j70m9J03n0kM8o4O4r0J24j35o4P6j4M1J1k1J28j41K8J0j11J41q8J03k8
$$ 164 -6 -55 48 -2 -4 44 -20 44 -46 78 -57 -121 -45 -59 -18 -7 -28 100 -41 -13 -3 -114 27 -61 42 14
768A4O4q9l6L8oo4P2PJ6l7j9J07Kl6m2k7K7j5M1m0J4J4j3m5P6J7j07P6p2P8j7
$$ 14 78 -11 -47 -9 -15 -79 -7 0 16 -21 -40 67 69 33 -9 -36 -9 -24 17 -23 -9 5 -8 -53 23 40 -67 9 -63 15 -2
799bKm5J2J1N6j00O4jj8j1R3o0l9J3K0R6r3lq6QLL3M3K7m7L7j11R9O2j27M9M5
$$ -2 0 -45 -33 -22 34 -66 -2 -3 -21 -32 61 1 -38 -25 -5 91 -2 -5 -91 -83 -80 -47 -4 23 -24 13 -98 1 63 -64 -15 30
831C0l5k1N9O4p1Rm8Rr6J06Mk7o1J30o4J25l8p6R2j00k7J05L6j79P6q8J04%l8
$$ 30 -5 -26 33 97 26 35 -13 -4 -100 6 10 -17 -78 52 -12 113 75 -1 91 -9 -36 69 105 -74 2 -86 18 18 -20
860b0L6P9p1o4J8L3q5QpL8R8j31J4%J11N1r1j1m7M1j08K03j46J12j24l0J1N0R6
$$ -20 16 95 24 -40 -22 11 -74 -66 -73 -35 63 -68 -54 -54 57 108 17 6 -41 0 -108 95 -51 61 -63 -93 -82 -32 64
889F4m6m6R5K9j35M9n3J14o7p6J81o7l0R3j02M1RJ6L7r6J02l5k2N9j79K0P4m2
$$ 64 18 -28 67 96 -39 10 -43 71 4 -72 109 42 12 105 3 44 53 69 106 10 112 77 55 114 -65 -45 29 -13
917a3L1p3L8q5J77j67O9j1J05r3j1J8m6K1M6n7O5j13J14j17M0L6O7j79J98j0J5
$$ -13 18 -55 -17 -102 75 -92 -23 -34 71 -22 -33 -15 -61 -40 6 -51 14 -99 15 -102 -62 -26 41 -138 60 50 65
944F5J2j00rN8q3K1J21n3O0k13J26Q8j45m6J11r5K2J8Q6r1KJ59k11K25j10J7j29
$$ 65 77 -23 -32 26 -57 -36 85 32 92 -121 5 93 -52 -98 13 -82 -60 -42 44 -47 -45 114 -97 128 18 35 -94
971i4lJ45k0qN9Lr4j8L9q3j0J48j37MQ4NJ07j45o2M9K3j5J1JP2k7N1j40M2k8J3
$$ -94 -97 48 28 20 79 82 -12 -30 9 -74 -84 64 -73 -69 15 20 127 -18 -80 -31 -8 -23 -12 -11 61 34 85 -55 -13 -41 -28
1002b8L5j5j2j7R2n8q8Q9j9K2r0J04j12p9K10j6p4j8p4K09J9m3j8Q3j71n2J04
$$ -28 7 -8 -20 -37 55 -3 -91 -2 -21 1 -89 15 -97 -176 34 18 -56 -74 -148 61 80 37 19 102 -69 -121 -17
1029a7K5O3j02J08J7p0q6Q8p1K3j59K04j35R3K3M2m5L6n2R3j26L4QK7M3p9N1n6
$$ -17 8 71 -31 77 94 24 -62 26 -45 -22 -181 23 -112 -19 4 46 1 37 -15 78 -48 -14 -6 21 64 -15 36 -20
1057b0o6P3J7k6L0j0N1m3L0k5ko8J4O2K1O1j81R2k8l3L0J48k33p2J73j4n7Q9K5
$$ -20 -86 -13 4 -22 8 -2 49 6 36 11 9 -59 -45 17 38 99 -82 10 -18 -51 -21 127 -106 -178 -5 -19 -76 13 38
1086C8L3j66N6K4n3P3o5mJ20l7j62K4M9Q5MO7r5J22j82R7j28O5mP6l3N1l1n4Q9
$$ 38 71 -95 -39 -15 -68 5 -60 -64 56 19 -143 -119 -70 15 19 86 -9 113 -69 28 -100 -35 -39 37 4 55 24 -30 59
1115E9K7j36R7k0j21Q5j1J0P1j30J11m4l1L2nN7j0m7m3J4Q1j6N0k3n5k6o9J89
$$ 59 86 -50 47 27 -94 -9 -20 -10 61 -69 42 -2 -33 -1 -6 51 41 -6 -49 -35 46 30 80 57 2 -24 -93 96
1143I6j01m4j09K72q5pKj14J00l2l6R0Kp6R5j43P5K6m7P8j04J44q5O1q8M3J4q5
$$ 96 -5 -49 -158 114 29 22 24 -90 10 -22 -58 32 34 -42 53 -90 -15 11 -36 42 -62 82 -3 58 -30 13 27 -58
1171e8N1j02J82j00L8P1m4J4l8k1J44j33J6Ql2n2M5N7j29J32m6J19k29N7R7k9
$$ -58 -7 -109 73 -27 11 82 38 52 14 -7 137 4 20 28 -4 -56 -11 46 -83 49 3 122 -107 -50 47 18
1197A8rJ12m8m7Q8j01o8M5J6q8m5j8J61m5ojoN7o1R6k08J43O8J0J1j60J27m9J64
$$ 18 9 121 73 26 114 13 -55 -10 6 -82 -127 -145 16 -29 -35 -36 -42 15 -46 50 -158 -15 53 63 74 -86 41 -8 156
1226A56k63M2M0jl6Q9pj03J47Op9n9J67r0nl7P7rO9n6Rrl5J36r4j44J21J6q9N6
$$ 156 -107 -65 -25 -26 -62 27 20 -83 64 70 -9 -68 99 9 4 -33 44 35 104 48 57 48 13 149 55 -89 32 48 -41 15
1256A5j04J82l7j2j5k1o8M2j8j3R2r0L8p3N2N4J43j93k5M5L9j62J72p8n4P4J15
$$ 15 -89 93 56 44 29 8 -60 -18 -36 -49 43 -47 -9 -82 -30 24 167 -26 -51 -6 33 -129 43 -35 -89 -15 100
1283A00j03r8R2q8J40j19J24o8J23k08J92j51Q2m4l4O0j3m9J23r9q8K15k33J38
$$ 100 -3 -101 -9 -97 43 -76 48 -20 103 -105 87 -64 18 -26 -60 0 -13 -62 61 -38 -126 89 -144 -6
1307fJ5o0r5J62l2l4L6J05q5p7J57Lj92K03j11k2Pl9J98j18K4km0J1L6j6n1Q3
$$ -6 9 -51 -146 16 -16 -50 -14 91 6 -71 86 89 -103 100 -11 -33 -26 -65 133 15 39 37 -3 8 44 28 -23 60
1335F0n3%J5K1Qj44Q9n2ok3Q8k9L7l5o9J53m1j50R6Ll3J1J33k5N3j4j6j26m5N6
$$ 60 7 7 22 43 51 -93 -4 -56 -62 -85 3 -26 11 -24 -93 60 19 -131 -35 -32 -65 -54 79 54 107 93 77 -49 -94 -38
1365c8k1J01k9k3pn3K6P2m2oL0k0K6q2oR7Mn8M4N8j21k4M4N9m4J6J0K3Ok9j77
$$ -38 -59 42 13 -10 -17 -70 -44 28 -14 -20 10 -10 16 -66 -72 25 29 -29 15 73 -48 -72 -28 31 -13 3 13 36 42 13 -164
1396a64J06L4K8RN8r6J1n2Q8l1O1k1j0l2N4j7pl0j6O9k1m8l0J22j40O7p8P1K6
$$ -164 -58 -24 4 13 71 -25 -14 -66 22 -9 52 31 21 -11 43 26 19 -11 -27 42 21 -27 -57 65 -75 -8 -86 -15 11
1425A1p9J29m2N6j61J30N6r4N4k8r3m9M0R6J9l6n3QJ24k5l1l5Q3j2l7n2Q1l4o6
$$ 11 -68 61 19 75 -86 44 100 6 60 32 -61 -110 -70 26 45 9 -44 -36 88 63 32 -3 80 68 31 -21 60 26 -40
1454d0j3Q6M0j19J23j63J41N7o0j60J8J31Oq6P6r8m4N0L1j7J06o1l9o7P8N0r1
$$ -40 -53 33 73 -46 77 -86 55 112 52 -108 -90 41 47 -39 37 -61 -105 -55 -24 -41 65 4 -35 -102 -24 26 -65
1481f5N8RJ6J9nl8K7r3J26j01J13n0J9P5j73N3j9l3l6O7O0o6pL6K2j8k8l8J85
$$ -65 -7 2 18 37 32 -6 21 -72 54 -47 66 16 35 110 -63 -10 -29 -62 -98 -31 29 -37 -44 -8 14 -4 -32 -70 115
1510A15j09o0Nn4P5Q3p7M2J9J9r8Q5m7o8N7n8O3p4J32j54J06o8J4N0l6O5m0r8
$$ 115 6 -54 -49 -103 -28 55 -22 20 39 58 -40 45 -2 -70 -13 -71 -8 -82 50 -104 2 -66 -52 -2 -38 27 -13 -111
1538a11L0K5R7J2j10J36j04J8l5LKO8n1RN4j09P1k0j5MN0q1O1j29J02pP3j3r5
$$ -111 -81 -56 41 53 -57 79 -25 -7 -42 -39 -37 31 -20 -11 43 -66 5 -15 -30 -26 24 -57 4 -125 -23 -30 43 30 -65
1567f5m9Q3R8l0m9J3p2n0J77m5l6K6M4j5J17k19J23j0pN5j18MJ19j41N0kl6L0
$$ -65 -114 -31 67 37 -12 1 -71 -121 56 11 -25 1 45 30 147 -72 51 41 34 89 -29 -25 94 -47 3 1 -35 -5
1595el2r0J52n6o0P6R9j72J74lj37M5o0M3J24j07%m4J4L0P2p1m6J76j44L7j23
$$ -5 -37 -127 25 -31 -91 -15 84 -88 86 83 -54 -9 -69 -26 98 -9 -9 -53 -39 -9 63 -8 -54 122 -22 15 -108
1622a08J25k2L2J8P8j03j3P5j20Q3r3L2J51j70R0j81J30Npo0J37L9k86K29n1O
$$ -108 17 -5 27 45 123 20 7 82 -38 45 -48 -16 135 -35 55 -126 4 9 2 -58 79 118 -168 61 10 16
1648A6m6o0J16m5p6M1%Mk4J32jj06N6Q2j70K13o8o7o4L5N1j37Q6j13J71mq8K3
$$ 16 -30 -90 26 -19 -95 -54 -54 -50 -74 58 57 -49 7 89 -81 132 64 -3 -67 -32 19 -118 -32 -145 26 22 -66 -43
1676d3N0k1O7o8l5J57j68M8p4P5L2n2KP1j00L3k6J19n0m7j3L4Ql2L1J8L0k8J6
$$ -43 7 -14 53 -15 -50 107 -61 -13 -87 -12 20 -32 -30 41 -59 -26 -52 67 17 -30 -43 -9 -1 -33 -2 16 46 18 34
1705C4m7L8j06J99j11L6L5j06K2N1o2rP1j3O6j40m9J00O4o5M3j0m6p4Q1P4r6J9
$$ 34 -13 25 -81 118 7 43 78 -28 -6 45 -17 -26 45 32 98 -42 -91 9 73 8 51 41 -5 -79 2 76 -20 -1
1733aq1Q9J7mm4O1Q4j06j5P3j4n8R2r4J2J1n2L7oKj8kP5N3k25O0R6k9Q8j02K5
$$ -1 -82 7 24 20 -24 37 121 15 0 73 59 1 93 -1 11 22 -30 7 1 3 -15 -17 58 111 -114 -54 42 13 101 -1 24
1764B4lJ31j76J8m9M0l1P9o5o4J06o5r4K10j62J32j13P8K3p6J58K0j50J41k6r6
$$ 24 21 152 -24 -6 -55 -15 -46 33 -32 -96 10 -55 -149 61 -101 31 -82 -4 19 -57 101 121 -29 112 86 -10
1790a0RK2n1J70l1p2Kr7J07m3O1j31K5P6m2o6J20j24L6pjjK1j3P2q8Pm2O4kJ2
$$ -10 -1 21 -30 140 109 37 39 -58 49 6 67 -64 -39 37 -5 -71 49 -75 -39 -46 -47 -48 -27 -40 32 -56 -49 -91 -27 -29 -17
1821a7L3m1rJM2L8j02Q3L2m7K1o6O1lm4l2n3kK30j04O4o3L6j5o8ON9j02L1L2o0
$$ -17 16 -25 -34 -33 9 47 -55 28 60 13 34 -32 29 26 -18 -50 -103 -105 125 21 85 22 58 43 -25 -19 40 -62 -31 1 -59
1852e9P4J7j13P0J08j18N1l7K2j56Q1O0j0N7J1J08j60k5o4R2P6j70J15k0L4j9
$$ -59 15 32 -81 -11 97 -21 30 -7 15 -141 -60 0 -10 47 58 166 6 -19 -83 9 85 -85 30 10 44 25
1878B5o7QJ05j20P4q4mJ57k03J15J32q9J6l3r2NO3j7q8Q1K9l8n1J0M7L3K3m5l8
$$ 25 -42 -34 71 -49 25 -59 -63 94 -109 6 138 49 65 32 -60 -55 8 -9 -97 -16 13 -25 -76 -66 -19 14 37 -8 -46
1907d6K7R3o3Jpl3Q5j82J35po7J61K6mr4l9q2J42l1j0k9%k9R4o9L9M3q0n2j1N6
$$ -46 -19 74 11 12 5 -28 57 -125 10 3 -64 97 123 119 25 -14 -96 46 15 5 -24 -24 -53 41 -28 11 54 -26 -78 -89 -33
1938c3pO7L9q8M7j41P0pJ21o5l5O1k5M3o6L7J7l2k7j8KJ02r0O9k7M0j12P1l0r
$$ -33 -40 27 66 -22 25 -116 -46 -53 68 3 -32 29 4 47 -19 18 35 3 -24 -42 -40 62 -28 41 14 54 -58 13 -17 -26
1968b6J6J4o8J19k4rl2M9j07K4K8Q1j36P3M3lM1l1o3J56j89N2J6P2j08k6O2J7
$$ -26 -10 4 -64 55 31 22 -10 39 -68 -44 -16 65 -71 2 45 42 83 52 -11 145 -44 8 24 96 -12 -38 24 41
1996D1j4l9M5j8lm0r1J17m0O7o1J19p6j3J6k5M8j3j7%M2j39N0K2J08j13l2J07
$$ 41 27 -12 33 15 12 -28 -119 -2 -42 25 -36 83 7 -6 10 -15 33 20 3 3 45 -94 -44 -22 86 -27 -59 48
2024D8p1j71J32N8J34j51RM6o8Q1r1M8R4q7n8m0J19N5o8J7J7q3O6M8j09J9m9p7
$$ 48 -23 -194 -62 -4 130 -21 -12 34 -34 47 -44 4 98 11 -47 -87 32 87 19 36 53 -30 36 84 -25 -6 -55 -132
2052a32J72j25j1J20j15M7J63o2p9m4J06K7j01j8J81j37N8o4J0J2j9pj1l6K6l9
$$ -132 40 -85 -96 24 -91 -44 119 57 -22 -66 40 67 -34 -52 129 -8 50 -14 -4 8 -11 -18 -29 -65 -39 -78
2078g8Q9Mj27J81l9Rm5j00Q5jk9J47r4r7n6K24k6n2L6r5O3K0p1KP9m0M3M9o9m1
$$ -78 11 15 -112 69 30 39 -6 -106 -21 -22 -51 96 2 -95 -151 73 47 -5 31 -64 -1 19 -52 -50 29 -11 32 81 12 -29
2108b9K2k8J7J4m4P0k6qJ14j18j1P4j60O7O5j09J06p4jM0L7n4R2j74N7J33l1n7
$$ -29 -7 -35 -18 -4 -48 22 -4 -12 102 -16 -27 47 -113 -46 19 -90 16 -58 -59 -19 18 -36 56 -118 -61 72 41 -16
2136a6Q2K6j58J38j81J09R3j52j7jJ27n3qJ3J4j1P0n7M4nK2j9M1Lj83Q6Q9j03
$$ -16 66 92 -66 72 -109 0 93 -59 -76 -77 50 -3 -11 2 16 5 75 18 62 57 79 60 101 104 -79 7 96 -7
2164gPj1o0m4J01J09j80N5J05n6K8J1p3M4j4K1o4Mmm3N5kL8jq5N6Qk6P3j36O4
$$ -7 0 -11 -71 -115 -14 95 -85 -30 75 19 47 58 -15 29 15 36 -28 -24 -28 -71 -16 -18 20 19 -66 -10 -2 -28 45 -91 -27
2195b7j6o1O7Po6J31j72J26L2j02J37p4J01m5J17j62l0J5k2K6m5J34j51J77j13
$$ -27 -43 -104 -37 -30 -96 35 -137 -11 21 -81 56 -18 83 38 155 -7 -37 -22 -44 -18 -63 71 -80 97 -16
2220a6M9k3n7N4m4L8k0P7o8l3M9M7j27O7L8pl4M5q9Q4j51J05l0K4p6J53j26Q1
$$ -16 33 10 -47 7 -37 1 -19 58 -10 -43 6 53 -74 -7 31 24 -10 35 -54 30 -121 -16 -46 -22 -98 55 -71 10
2248A0l1L0M6k07K06n7oP8n1J5qP9l4m7K1n7Q6p9L0qJ2Pj1J1Lj14K6K6o1J15j4
$$ 10 -21 9 55 -152 54 -3 -9 69 18 33 25 104 70 23 44 -13 73 -6 24 16 28 35 24 35 38 -76 -50 -24 -85 30 16
2279A6n1q4J63j26KJ12O4j52m2J00MM6OK1p2Q9p7M7K7m9j0N4j21M4m2O8k9j22
$$ 16 -35 -119 44 -82 -80 32 96 -56 -98 2 6 52 58 79 7 96 19 66 93 44 34 88 -33 11 -31 37 8 -114
2307a14O6m6J17Kj13O8N9m9mJ43j51j03J03P2J8l3J7j23O0N4k0q9J43o5n0k5J06
$$ -114 -48 -94 23 25 -88 -20 39 -10 -14 129 -22 -125 -22 50 68 35 52 -71 -11 43 23 -66 77 12 -38 -63 43
2334D3q7l8M4L9J4l6L3J0o2Q9l5O6p7l6Qn8M3J70k06J45n4j27N5n3J00K0k4M3
$$ 43 -44 -82 -38 1 15 -21 12 22 -40 49 14 80 3 -33 -25 -83 -40 130 -76 69 15 -112 -57 -110 -10 10 -14 29
2362B9r5J0O5j59Q2P1m6J16r9J08j67J35m0ojJ0k0N4K3r4q0Q6M3K5Oj43R2J2q1
$$ 29 -66 -56 9 -150 -68 3 -43 73 -26 82 -85 50 10 4 3 13 -7 47 70 -24 -104 -18 25 50 56 -87 5 17 -64
2391f4j8J26m2J9n0m0J23p5K3O6j46L9J00q9Q9n6m3qP5mj02O8j36Q2LL6J9P7q4
$$ -64 -82 44 2 21 -29 -69 54 -21 2 68 -78 -39 61 -28 61 5 -38 -46 29 25 -77 -9 -145 -63 -60 -24 -5 72 -12
2420a2P3p8q1J15n1K3P9l2jL3k3M2j76R1L1pMp1K1Q0p7J4l5J37j45K9Q3k2j4O0
$$ -12 61 -17 -98 17 -34 -11 68 36 35 68 45 87 -89 2 33 26 30 -41 -20 60 -17 -3 -38 99 -46 -17 66 44 30 90
2450I0j22m1N0M5l3o3Pj2O3O2L3j03jj14J51m5P1rl3Mm0p3m0J60K2j0O9K6m7o1
$$ 90 -32 -73 -23 22 -11 -74 -67 -79 -16 46 79 -24 -25 -139 12 -33 38 29 -4 0 -40 -113 -153 7 29 19 88 114 67 6
2480Fqk2L4l2K5n4Q4l9n1J03j0p4n4J36lJ0o7N1j23O2l0P6p3O0q1Q8j10Q0J3q0
$$ 6 -2 -24 10 -22 3 -51 33 -6 -57 46 36 -38 -92 44 41 51 -16 35 -88 -26 -56 20 -53 7 -74 14 -96 -16 -3 -83
2510h3Q6j5r8J14m4J32j45nQ4N0jj06Q4k3k6j25J31J0K8q2k0rk8M3J72j68O7M
$$ -83 3 -12 -110 4 -40 92 -53 -58 26 76 75 -31 53 30 4 -121 10 20 48 -34 -54 -63 -91 -48 124 -44 23 27
2538B7j27O1j4J46j46R1r2J18m9k8j2qN4j1m5k3K5QL3k1P3j1j70J77j18J00j6
$$ 27 -100 -39 -53 93 -53 38 -54 64 15 -13 -25 -33 21 10 -35 -58 -33 -25 8 -13 60 49 -121 56 -62 38 22
2565B2l2K2J41j90J6J09q3n6K8J1%L5J0l2Pl7J1MR0r9Q9j05l5R9JL5j40K21m9
$$ 22 -10 12 153 -37 -21 88 5 -51 -23 -12 -12 23 33 1 8 -29 -18 -14 76 -23 66 -39 -74 25 26 61 -79 142 93
2594I3j45K1o0J70j58J08J1J8k5K5j42J37j02l0K9O0p0P1K2Q5k02J58r7L4KK9
$$ 93 -52 -31 -91 79 -79 29 40 58 33 58 -84 53 -49 -79 -50 10 -60 11 33 118 -84 74 -23 11 13 42
2620D2j17P4J0l4L4M7J2m9n6Q4mo8N3Q4l8q6J5K1p0J8L9m6n9L1M1R4m1J3m8q7
$$ 42 -75 -1 9 -25 9 56 68 19 -37 47 43 -25 28 112 74 -12 3 24 -46 -28 11 -35 -94 -63 -22 72 31 44 -4 -91
2650i1K9P0O6q6nm7j6m4O6N0Q3nj02n0Q9Qo6K6M9M1j27n4P6k4O0m4oR0r3j2J68
$$ -91 -62 8 74 -12 -17 -64 -80 -124 -58 -8 75 70 -32 -82 7 15 -51 -25 24 65 -62 -116 -40 -64 -4 -48 -54 36 -57 -69 99
2681I9m0r9p9N5r9K06p9J62j38OL3q4o7J47n1O3ol5j1L4qL9q7pJ05n7j21M3J68
$$ 99 59 -40 -119 -64 -163 43 -36 126 -12 -6 27 -57 -124 23 -28 35 29 -6 -17 17 9 48 -39 -46 59 2 -119 -76 92
2710I2j23O2lJ6j7o8l7J68r2jM6n6l6j4K43k54Q3K3J9qOn2k6L4k8P1l9K4k5k6
$$ 92 -31 31 28 44 27 -41 -78 90 -2 -3 43 -13 -49 -63 180 -74 9 32 51 43 49 -3 -29 5 -23 48 9 33 8 -18
2740a8L9n1Nk4NN4K1r0O1P4r7J00q7O8j2Qr6Q7p1%m4N7PoM0R3j30j6J29j33O0
$$ -18 21 -30 -25 -49 -44 10 31 -59 2 76 -21 79 -8 60 48 56 -40 47 -24 -24 -68 -11 -4 -10 30 123 -7 -23 106 -27 33
2771C3j35Q5l6M9R6j29L4J7M3l8m1M7j98J41oj7M1m5J07m1J4N1j10N7J1j6On6
$$ 33 -102 -17 -53 -4 92 -37 -3 14 57 19 -22 25 -173 -32 -38 -55 -14 -59 48 7 21 72 -38 19 30 14 20 -36
2799c6J14p0J7R9p6l8P8m3R6r8Oj2k10N9J18j4L1j8K3Ol9J9m5j9R0L7mj3l8o8
$$ -36 78 8 25 124 48 10 88 45 141 43 49 37 -173 -114 4 -10 21 3 26 32 -7 12 -33 -52 38 75 71 58 20 -48
2829d8p5K7l2O3kP1n0K26j41m8L7p4K07j00o7QL6N7j55J0J93q5k4N2k4j59O1L2
$$ -48 -123 -96 -128 -65 -67 4 -46 180 39 -9 28 -46 161 61 -6 2 38 95 -60 -50 143 58 34 86 62 -97 -36 -4
2857dl1J21qJ2n2L1j48N2L9M0L1j23N4p2O1M7P8j59P7J4j8j02rJ46n6j35J37M5
$$ -4 -35 86 78 90 38 69 -79 -27 12 52 83 -40 14 -58 3 50 128 -31 46 60 42 -60 -69 77 21 -114 23 68
2885F8r8J59j07L7K6j49P3j05N8J24Ok7oJ2j27K21j47j4K4n2j64J94M3r5L8K4
$$ 68 -30 129 22 59 85 -64 9 -96 -38 86 92 65 59 71 -56 165 18 4 28 -24 -188 6 49 -46 -8 16
2911A6p4K4JRK4n9n5P1o3Q8m8P4m9K2J51j22n6k8L7K6Rl1J40m1N5k08J4PN8r1
$$ 16 -58 -34 -33 -24 0 -59 -114 -43 -106 -18 -66 8 -41 -19 132 10 -46 -74 -37 -11 -2 -33 107 66 121 -87 -73 -66 -8 -99
2941i9J98p4K1M1j61L3r5J16M9j21Q3J48j29Rj58J69p2O7p1J09l8n6N1Kjm5q7
$$ -99 99 25 46 87 -74 -41 -136 -20 29 -92 -9 139 10 19 -139 30 -42 25 -46 63 25 -31 20 22 21 -24 -111
2968a11R4K2j24J27M4p1%J38n9k3m3l4O8n0M8K1k6lk2L1l6k3Q1m0O0j06J5j01
$$ -111 -17 5 -119 8 52 -19 -19 119 60 37 -6 -40 28 -22 26 47 21 18 -4 27 -9 -32 49 9 69 -37 -22 -123
2996a23J40QM7p7p3J19j09lN0K5P4j13O3Lj4o8lO0j3n8M4NN3r7P3p8J10Lr0L9
$$ -123 17 25 72 -5 -78 41 -68 -71 -21 4 78 -35 28 31 17 -51 -54 6 -7 -65 -21 -16 37 -60 13 -65 45 48 -42 -3
3026ck6k8J57j04n0J23j42Q2K7m6PL6n1j0N8mj5J4J02k97K32K3q0m2P7k9R5p7
$$ -3 -29 -57 100 -4 -54 69 -73 9 36 -10 -3 33 -18 -28 30 26 11 25 127 -170 62 85 5 -37 40 11 106 29
3054B9p0K31j36j13R1R6k30J58q0R8j04K8rK5N3j24K1k8N6L3K8j33R3j02J06j20
$$ 29 -41 190 54 -59 32 128 -102 56 -24 74 -30 -2 -11 14 67 -57 -36 -64 -8 25 53 -80 13 -89 17 -103
3080a03P6q7J47J3q3O4l7J02k2j36R4r1Q5k0N5m7m2K6J46j78J61Lj45ll0J56l4
$$ -103 -27 -114 33 46 -37 27 -10 92 70 -66 28 -63 22 2 57 10 -32 -6 140 -38 123 126 -19 -22 -52 104 70
3107G0p2m3O6o1N3j16N8Q8j8q8Q1J2n1K21k21P5j89N3Q9R2j29J20j47M9Q6n4l8
$$ 70 -2 -45 21 -40 13 -103 -45 43 25 -63 18 30 -21 200 -21 54 -135 -82 7 99 -30 90 -57 -8 78 24 -14
3134a4k2m8J97j98O1M2q5J0K03k16Q9jj2j25J5L8J4K9O6P8j50N0kM8j00J35p5
$$ -14 -36 -84 113 -85 -24 18 -67 -57 146 -70 19 18 6 -119 -104 -66 -52 -23 43 121 -29 21 19 67 -33 102 27
3161B7O2o4Ll0K9j5K9m7l0KK6k5Q9j1l7qj34J70j9L4p1J23j14J09m8J1q5j7P9
$$ 27 89 25 28 -2 27 12 41 -6 -36 -34 -8 -33 56 45 8 0 -134 36 17 51 -20 103 -11 98 50 61 -24 -41 38
3190C8j36J54O7j47N6j21O6k3P0q9J29p8n4J02j39M2K6k9p7J73k4J6J4lL2K6p7
$$ 38 -98 56 123 -24 32 -89 -23 -46 24 -65 64 -14 -68 34 -105 -63 -37 -66 -143 30 6 22 36 33 65 91 14
3217A4K9k8k08J02K9P8M6r9J10n0j5J1r9J71j23j3N5J04j45J16o4l9n4K0J36j48
$$ 14 43 15 -193 -91 -62 16 62 -37 73 23 8 19 -80 91 -32 -45 10 114 -31 85 21 -18 -72 -52 84 -64
3243f4J38o7Ol8J5q0J75j34J76k31J09Nr2j4O5M3k7qM2l2J6k5O0j11J08q2k3J31
$$ -64 74 7 13 -25 -10 -90 85 -49 127 -104 5 10 -82 -96 -31 12 -15 -23 19 -13 3 -22 38 -73 35 -47 -70 61
3271F1%m6m3J0k2J17j29N3M7j66J27j21J30r2N7P2r3l3l6N1N5j7n4L2j6L4m5J72
$$ 61 61 15 -28 -18 -40 77 -52 1 48 -118 9 -112 18 -74 -17 55 -38 -71 -107 -56 -1 -18 -72 -40 -56 -22 -67 105
3299A05p1R8p2j65R9l9Ql2J00Jj01P6m3M0K3j55J30P1m4J28m7q5o8N7J3q8J46
$$ 105 34 132 60 -105 -6 -45 -37 -69 31 32 -69 7 -36 4 27 -128 2 73 29 157 110 25 -43 14 27 -61 85
3326H5m8j62J17N3p5OrJ60j53Q9j74K03o5p3J37p0r3o1J17l3k4rM1r5J38j7Q1
$$ 85 37 -125 -8 45 -30 -24 -33 127 -26 63 -111 92 27 -46 91 21 -72 -133 -16 -49 -73 -82 -41 -136 2 -15 66
3353F6j10p0J27m4j01MJ1O7O9j4L2p0O6j2k5M0m3L7P7j32O1p4O6kk5J4j0r5K8
$$ 66 -44 -114 13 -31 -132 -128 -117 -50 19 5 37 -33 33 21 -4 36 -7 30 107 -25 36 -38 28 26 1 15 5 -90 -62
3382f2r1J15K0m8P9l5J%j9J04j04J06n5j03L9R5p3O6k2K2p9O2l8l4NR1J8Nr4J30
$$ -62 -153 -38 -18 -66 13 -22 -21 -21 -40 64 -40 66 11 -92 -53 42 -31 35 13 35 -44 18 -20 -54 -49 42 60 65 -29 101
3412A01k3o9KNm2R3k3j34O4J5J1n9J45j41K8N0j78J36J21l8j12K9N3o3n4R9kp8
$$ 101 78 9 11 16 -26 67 44 -90 -26 -11 0 -59 86 -55 -27 23 -155 -19 102 64 -48 -19 34 -29 -83 16 14 -64
3440f4q6Q1M7K6j0J9rj9J7r9O9K5L4j1qRj6q8k4J30r8L5O5j25J59l7M6j49J26
$$ -64 -150 -69 -22 4 -6 13 4 -15 2 -97 -28 -3 31 20 12 21 5 -83 -107 23 -75 -40 25 -100 59 22 68 -81 45
3469D5r2J55r0mo3J01No9J04j35L4l2L7k7J7k2KL1LOm1Q8K0j18J11l9p5J2J16
$$ 45 -47 108 18 14 -49 52 57 -12 92 -43 -9 -41 -4 -31 -14 -36 -34 -3 0 6 -35 53 73 -45 66 27 -48 -36 80
3498H0j31J40p1l7K1K6R3j12j09J89j31oR0p5P1r6k7J51Jp8N7o4R1r4P9o2M7Q4
$$ 80 -51 89 18 -19 2 28 121 9 -100 89 -42 -48 42 -33 38 -58 -85 66 67 -11 46 -18 73 -21 58 -4 43 127
3526A27j03O7p8n0L0P5j7r7j7K4p1nJ04r1J34m5m6M9L0l9k9Q9q2Q6J0n2J5N3J2
$$ 127 24 91 13 -37 -7 68 51 -46 -63 -39 -110 -115 -11 -102 32 -13 -59 -10 20 -19 -48 41 -41 45 55 3 18 71 83
3555H3k47L6R2J55j34P4p2J9n1J12K6j07N6j7n4K5Q6p2K6j00pK20j92O9j6m9O4
$$ 83 -164 -128 -36 119 -15 59 -13 6 -45 67 93 -14 42 25 -29 -4 82 10 36 -64 -71 149 -43 26 10 -39 25
3582B5J5j13l6J26l5n4N7M0l1PRj7n3J1qL1L1r8P7L7R9o4j90P2J56j24J2J02k0
$$ 25 40 -73 -109 17 -18 -72 -15 25 -6 1 10 -7 -60 -49 -57 -26 5 -93 -16 21 120 56 -134 -62 94 -30 -18 84 64
3611F4%L6k1j01M4J9o9M5q8Q1k2Q1m4O3j44k3J65j84J00P9jr9J09n1pn8P8J2j83
$$ 64 64 100 79 -22 22 41 -28 17 -71 10 -12 69 25 88 -56 -79 86 -98 2 81 80 -19 90 39 32 -26 52 64 -119
3640a19M5J24n4K7j05Q1K8n9J58l15K43O1q8nM9r3P9r1O8n5n9Q5mJ0j7l6QJ30
$$ -119 -74 50 -4 23 -82 -1 27 -32 126 -189 54 115 27 22 71 -22 57 -34 34 -21 -80 5 1 11 -6 -42 -34 96
3668I6j17l9P6p6Q0o9K0Nl6Q7r3J28j1j28j0J99j77L1N8o2J29m1MQK3r2P2o8j1
$$ 96 -21 -60 16 -60 20 -49 -29 -24 -60 27 -66 62 51 -77 -87 112 -65 -34 24 -38 91 50 54 62 85 -7 65 -3 -14
3697a4J12j69j9J51J5l6m5k4J24j41nN3j27J46k8N3r8O2j07N5M3J13Rq3M3q5L8
$$ -14 98 -71 -90 61 76 40 -5 -29 95 -46 -51 2 -125 21 -7 46 -52 10 -97 -42 1 114 123 40 83 -2 36
3724C6l9o9N4l5K6J01k9L2r8n8R9pj4lL9k4j9P0j79J85l3j76K14p1Kq9L8J55q4
$$ 36 -3 -72 -18 -53 -27 74 45 77 -21 -79 20 13 -1 -4 35 11 -8 62 -117 68 35 -141 73 2 4 -85 -47 108 24
3753B4q4Q9k3L9j42J42m0N1o8M7n3N6j52J14J44p9j59RR2m2M4r7K08m9o6m7m9
$$ 24 -60 29 6 45 -97 45 5 56 -12 35 -18 38 -114 0 144 65 -94 -85 7 -35 9 -88 120 71 5 -42 -91
3780i1P6J9J8JL0p5%K5NOj70K56j00q0P3l1N3nJ07o3K0j38N3J5J6P6m7j60l4m
$$ -91 -15 4 22 23 53 -22 -22 3 8 14 -156 100 0 -80 -7 -38 15 10 117 54 74 -64 -11 4 20 96 49 -111 -145 -149
3810a49J92m5j48K30j61M3K4Ko6N8Ml3O1P0o3p2J47q4l8L1k7O5Rq7J1o9J34Q5
$$ -149 43 -2 -150 80 -81 -38 -14 -12 -78 -20 -16 -49 12 82 19 -53 94 10 -28 3 -24 41 50 -37 -26 -95 39 124
3838A24j76P9P3j04q9J11n0k4O1k4L5L5r0l5K17k16J36j23P4J2m5J02j54P2j0
$$ 124 -52 27 100 -4 -93 18 -32 -56 5 -19 16 51 -39 -74 143 -73 63 -60 14 26 -19 83 -71 1 -9
3863iLL0p9J73j88J92j2r1j29J63k8j07J40r7P3j55J2J62q9N9M5j32J17r4P9n9
$$ -9 -6 24 -55 118 -70 122 110 19 -110 53 25 -82 58 -39 34 -121 -109 53 -36 23 68 -64 53 -41 38 -21
3889b1J89k15O0k4k3KK4R4k4j41N8J40j65QQ0j3L7j08K5O5q6J58j58R3qM5q5l1
$$ -21 168 -47 13 -11 -34 -32 -8 86 62 -79 -21 119 -46 -38 42 29 66 -42 -17 48 -38 120 -38 55 47 92 7 -24
3917b4Mk8R3J6j50k0K5M6q2J31P0j61K5O6p3k2M1J16J5r9Q1j93J35j7L3p5N6p2
$$ -24 -20 -48 45 61 -89 -109 -84 -38 -120 11 81 -80 -55 11 -62 -84 -43 73 88 -11 70 -123 12 -5 28 -47 9 -63
3945f3R0j2O6q9J4j02R9L6kk0L7j6r7l7P8M4Qj49K60k26N3K8n6N3l7J21m2j15
$$ -63 27 15 81 -8 6 -96 3 39 37 17 54 38 -59 -96 -18 26 34 -115 145 -81 -28 0 -56 -3 -40 81 39 -76
3973g6J07N7j35K3m1J7n0J04j6M0j01J88j45n9J49p7O4j77J03J42q9N0q0L4Po4
$$ -76 31 88 -47 -24 -65 -48 -98 6 -10 30 -71 117 -28 -87 62 -15 49 -128 -25 117 28 78 -2 32 39 -25
3999b5O9qn6j01J86l3l1n0nm7M7J17K0j5l9o4L4n6oQM6L6J4Q2q9r4k6Q7O0K8j32
$$ -25 44 36 -20 -121 65 32 1 -49 -54 -101 -54 63 83 68 29 -35 -1 -57 -63 -55 -9 27 41 123 34 -60 -86 1 61 89 -43
4030d3J18j5n6j9O9l8l3Q9r9l2J70m6j10O8l8R0l7m5j01K15qq2J4o6m2P5Nj3k
$$ -43 75 60 4 -15 54 16 -17 72 -27 -59 111 65 -45 23 -15 75 38 -7 -108 107 99 17 31 -35 -77 -2 3 -10 -12
4059a2N6q1N6o7J57n2p5k5j4K2l5J25l4J8k8n4M8jK1n1k6K8N5k7l3J93k13Mj5
$$ -12 44 -37 19 -48 109 57 -18 -43 -57 -35 -70 55 21 39 11 -43 5 4 25 -26 -52 -24 31 4 -29 164 -49 -45 -60
4088f0j6O7K2l4Jpj4J07j44L4J11p7n9M7Mj34J32o8N6Q2p6k3l4Q1o8J05Jq4o0
$$ -60 -76 -9 13 -21 -20 -27 -41 66 -78 -44 67 -10 -69 -22 -18 -152 -20 -88 -32 50 -26 -49 -83 -2 -70 35 36 -48 -108
4117a08K09q7L0lo8K5J8n6n8JJ1L1R8l4N1j28J2M1L5p4P4J3r2j6J7PMj7J67q0
$$ -108 101 14 44 41 -27 -2 16 -40 -98 -97 -86 -55 43 9 60 -68 -56 -15 20 -54 20 33 -59 -75 -58 -51 -47 -64 103 23
4147B3nj38K36p7m8M7j37R4m3j9R0n6J4M5P0m9m9K2p0mJ74j34o0J00k2PK3J8q3
$$ 23 18 -120 116 39 -9 38 -99 -5 -48 -67 23 -33 -19 26 96 47 -2 20 -50 -54 120 -14 -74 26 4 11 34 52 -31
4176c1J63j36j0OJ8j30J3J6R7j93J73O1O8j30mr5Q7k3P1n6p3Q0L3o2M3o8L1rL0
$$ -31 132 -4 -14 -8 10 -120 -107 -91 6 -187 -14 47 115 -15 -19 -114 -27 -50 21 -35 -108 -28 5 -57 -14 -82 -51 -60 -30
4205c0L6j3l4R0j52J72j53K36j20r6J3N8J4j8r6J68%j1p4lm3J6J3O1r4j5R7l2
$$ -30 6 -7 -41 49 -103 69 -84 152 32 -64 -51 7 21 3 -93 75 75 64 -10 -13 -56 -40 -27 34 -60 -75 22 -10
4233a0l9J51j04m0L4K9llk4M3K4p1M5r2J28p2J7K4%m3M7m2Nm9Q4o4k1Q1NM3j5
$$ -10 -49 102 -2 -42 -8 21 18 15 -9 34 58 -13 32 -60 68 -4 13 37 37 -6 41 -1 4 -45 39 -25 -46 35 40 83 68
4264F8j68J44l1j1r2N9j6m3j4Q2j2n7O7o0L0j42J11J08kl6L7n2P4o4O2M1n2j4
$$ 68 -100 44 13 2 -90 -31 -47 -90 -104 -22 -34 -91 -24 -84 -54 -196 -85 23 21 -15 22 -30 44 -20 42 83 31 17
4292A7n5Q0lpm5M0o7j8r4J25k7M4n9P9p1N4O4o1j26P3j27K04J1Mk8j01j1J83j28
$$ 17 -38 42 39 32 -13 27 -40 -58 -152 -27 -54 -10 -69 10 -61 -7 57 -4 -130 -57 -184 20 31 35 7 -94 -105 78 -50
4321e0J09o6q6R2m2O3ll4j72J13J34rm9M6nj36R0jK8R2j33J4J8j8K2o8L7j1r7
$$ -50 59 -7 -93 -1 -43 20 17 -17 -189 -76 58 49 0 46 41 -95 -5 -6 22 114 -19 -5 13 -5 17 -51 -14 -25 -122
4350a22J01k1J47r8q2P3J50j26k7O3m6kj06J40j24N2P1r9M8l4N9J02L1j58J5k
$$ -122 -21 -42 105 7 -75 -2 148 22 -5 58 12 10 -96 44 -80 -28 43 -56 -8 -42 17 119 150 -8 7 5
4376Ej3J10j56J13Rq3r1N7N2O0l0j39M9r5J28Om5J13j01K1On4J46k00Q7%K8P6
$$ 5 -8 102 -54 59 68 -15 -106 -49 3 63 33 -106 -57 -152 -24 -18 -63 50 -51 -30 -24 -78 68 -132 -45 -45 -17 59
4404E9m8p1N1J13j63L9K0m5P6LL2M3O8j25Ljj08K5QRK6j7j6m8J40j20KO8j16O1
$$ 59 11 -60 -9 104 -59 -20 0 -45 31 34 66 109 177 52 55 54 -54 -29 -21 -12 14 -3 -19 -67 73 -47 -45 23 -93 -32
4434c2L1Q3Nj66l6J00O5j23O8r1J33l3R5r4M7L7r0J3p7J02q1M8nN0o5j4O8m8j6
$$ -32 -1 82 87 -79 -115 -15 50 -73 -5 -96 37 4 99 5 52 89 -1 12 -65 37 -44 4 -1 49 -16 -30 38 -10 -26
4463b6L5r5O2L0qJ09Mnn5Q0j57n1J95j53O0k9Q5n5o5m3K7O7O0j34M4n5J61o8n5
$$ -26 9 -86 -24 6 -2 107 111 106 51 131 -26 -77 118 -35 25 -4 81 26 -39 -82 -55 12 72 -62 -18 -73 88 20 -35
4492c5J10J8j16J18q6J7m0kj9j3J39Ro7L7P0k31J73o2n0N4L9L3k2J9p1r5J11k4
$$ -35 75 93 -23 95 9 26 -14 -16 -35 -48 91 100 33 70 140 -91 82 20 -30 24 63 96 74 93 22 -73 38 14
4520A4k9M7M6l1j07J52L1k15J38n5M3j0r5J08p0P9n8j1r6J36J17r1m4J3R9r2k
$$ 14 -15 32 78 47 -60 92 123 -92 46 -9 34 24 -71 37 -33 46 -12 -23 -119 17 134 43 -1 12 111 19 17
4547A7m3M7l3Ml6KQ1n2L2Mk6O5r7JN8r3N5j9jJ44l6j03P9o2mm1kP4l6J02r9l0
$$ 17 -26 21 -12 -8 -44 -42 39 -13 19 23 -3 62 -35 -34 24 -69 -14 -33 -34 110 74 -29 50 -12 -16 -57 -59 15 -21 81 -18 -48
4579d8K2J9K5l2m7J19m4n2N3m1l5QJ3R3m9L3j06O7o1O7Ml1N7j06RJ23o7n5Q7m7
$$ -48 -26 -7 18 -14 -61 58 14 -38 15 -26 -61 -53 -40 53 4 37 -69 -2 -63 4 8 -23 34 -72 -63 60 -7 -62 25 -22
4609b2l3J3n8P1M0Mj7o8J24l8J01o1R9j63K6P5p4p7L5J13o6P1m5j06J36k8m4j5
$$ -22 -55 -42 -100 -29 11 15 -2 -70 54 16 117 56 155 -8 18 93 19 -58 -23 90 24 95 50 -56 80 52 8 -7
4637gkj9P9k7N3j01k7J29j41M6Q9mj51R6m7J14j09LJ47j59J30j32M6J05m5j8L8
$$ -7 -9 -28 51 24 77 -24 -51 78 -63 -17 72 68 -83 13 -34 80 -29 -26 121 -38 92 -40 6 111 66 48 86
4664H6p2Q7j73k0N9k9K00J03k03o0j06J57j0m5L8j02J05n9Q0n1K9J5K8J2k7j24
$$ 86 14 101 -72 -92 -33 -62 138 241 38 -22 -128 29 19 -26 12 -90 15 -44 36 -15 14 29 57 69 42 -82
4690h2kJ32j06J5L6N1l1j6O5n4J12j4j55P1Kll8n4K34j56m5N8q2J15m1M7qn9N5
$$ -82 -84 48 -58 -43 -7 44 13 -3 62 8 120 106 -49 22 24 21 -17 -71 163 7 -38 20 -62 53 12 59 51 -8 47
4719D7j00J6Q2l6rj11P0J39j08Jo5J57m6M3n0K2Nn4J9r5J45j34O1J5j10L4P8j
$$ 47 -53 -37 45 9 0 -111 -41 98 -10 -9 -74 83 37 80 30 52 57 3 22 -73 72 -62 -1 14 -96 -62 16 15
4747A5p2P1j4o4L9r8M6J45l5L0p6J18L0r5r5P8J3q8Q1L1k5j01J41o7j49J46J5
$$ 15 -57 14 0 -64 -25 -123 -77 68 33 63 -13 105 135 40 -55 23 36 -52 29 60 35 -66 75 8 -141 5 20
4774B0j18J21RK6q9R0j24J10j00R8j68P0N1RL0n4o1Q6k7N9j7o1pL6P6l8n5K4K3
$$ 20 -98 23 32 58 -31 59 -65 45 -55 43 -125 -55 -4 5 35 -19 -80 6 -21 38 21 -40 -47 -11 65 27 -28 -4 19
4803A9K2l9o1J07r2J5J28k19R8o5J47l7n3O4q3RR3k01J40M9j12r4Q3J19p6J28
$$ 19 41 2 -59 48 -44 -29 99 -120 -22 -87 60 23 -30 34 -49 -40 53 -148 -8 41 -71 -165 -82 37 -39 89
4829H9j07Q4j09J56l5o5j13N8L2K8r7J43pL4j14j5N1R1p6kN3j09Q7n6O3k3r2j10
$$ 89 -18 66 -43 113 78 13 -100 -42 -10 18 -79 64 57 91 -23 -38 13 104 28 26 79 -30 57 1 64 41 -51 -161
4857a61K00o3M5Om4m7j1J4N6Rm7J8J20j33n0J47o3m6J2J03j52L7M6Q1j18J23r0
$$ -161 39 -24 21 27 -17 -64 -75 -61 -5 4 -43 -25 95 -38 -88 59 -4 -50 -38 65 -87 -50 -4 77 -41 82 -8
4884hP8j59Q4Q0j43R1J50k62J10K9m0r6J08j6p2M6K8o2Q7Kj73J28N7m9rM8r1P3
$$ -8 70 -89 -5 75 -68 23 173 -89 21 50 10 -86 22 6 -66 -20 8 -54 33 35 -138 -10 47 -2 -11 37 -54 19
4912A9o2q2J93L4r9Nm7J2J0r9L9j02K54KJ4r3n2N8p9N9J9qP3m6p0j2J0Q1p3K6
$$ 19 -43 -125 68 102 3 8 -39 -27 -17 -116 -77 -179 75 77 91 -2 -54 4 -75 -16 3 -5 68 22 -48 -60 -50 31 -42 -16
4942a6k8Q1m8L7mJ2j33J35m0J7q7OR4j7j7m6L2J25o2p0R9p8K0R0K8j95L7N1Mo1
$$ -16 -44 37 -11 26 22 34 -99 36 -4 13 -74 -68 26 9 -8 -54 -22 103 41 -29 70 -8 12 102 130 -65 -28 23 27 -34
4972c4Pl9mJ26j78K21o7NM3n2p2j1K2N0l9n8Q6M4o0L6qL5k6J34j14l3l2oM4P2
$$ -34 -27 -66 -70 56 -122 99 32 37 80 28 -44 -55 -33 17 -22 -80 6 50 -10 26 18 53 27 161 47 14 -18 -24 20 92
5002I2j12N6J5n0N0j18K6o6R3j8j1J10Jp9m3j8O1nO8j12J16r8N1j06J58p0j12
$$ 92 -20 36 51 1 51 -67 -41 -107 -14 -32 -43 67 68 -11 -54 -72 -11 -16 52 -60 56 -42 9 -97 61 -9 -121
5029a21J01j1J5n0O7q0J44p8o8OJ17Pl1j20J08Jm6M4P0j31L3Pl0N6l3LR7j56K7
$$ -121 -20 -31 -16 -66 1 -79 65 -13 -81 -75 42 49 18 -102 6 7 -39 5 75 -56 -23 -16 -46 10 -23 -20 77 -79 -52
5058e2J15k6Qj45J29o3k4M1K6r0R5l9m4l5R1L8l0n1R3J7q0P0j9K7j27J15k2l4
$$ -52 63 37 45 -100 29 -34 -58 -17 9 -81 14 -25 -69 -104 -13 25 -5 -56 37 54 -26 44 25 52 -75 40 18 -16
5086a6R0j14K6k8K0Q1j37Q7r5M1Q6p5nJ73j64J69j93O8n1J7R0L1m2j39J1J02J6
$$ -16 74 -40 -14 -42 -22 59 -78 9 -86 -45 41 -34 -39 134 -30 139 -54 14 -37 -20 70 101 59 -80 -69 33 49
5113D9no0j06J26n6O0R6p4L9p3r3R1Mq4O0r9J79q4R3M5j18qR3j5J7n3k2l0M0P9
$$ 49 44 -16 -122 4 -52 8 104 30 69 -4 -97 -6 -2 -86 -26 -125 54 -30 63 108 -10 -18 75 60 77 24 2 -28 12 91
5143I1q2%n9N7o1M1NN4j75Q8P4k9O3l7km0J4k0N8m9L5n0Q9j39J84j36k3M7q9R0
$$ 91 9 9 -50 7 -54 -13 -8 46 -129 -41 33 4 67 30 28 -12 2 -18 40 -9 26 -24 65 -74 110 -26 -49 -2 -91 -1
5173aM0l5j28J80M3j17L6mj23N2J83r9m7J50m3j28O0K3nJ14j86M1j0J6J3J1j03
$$ -1 39 4 -124 56 99 -18 18 14 -109 -57 126 27 -20 130 87 -41 19 42 37 151 -35 6 -4 12 25 36 -67
5200f7NJ40o0J9o9p7J06M2j0k4K2j76K28j6j10K7%J06j37M4lk4P0n7K2l6Q3j6
$$ -67 -62 78 18 37 -32 -109 -3 39 29 5 27 -149 79 63 -47 -20 -20 86 -51 -7 -10 -34 36 -21 1 -35 48 32
5228C2j80J62j1J14j65L2pm6Q2j18J63j31J15p0m6k0J18p4L6JKk2J2K2k2N0o9
$$ 32 -148 14 3 117 -48 -16 -23 -69 13 -105 58 -73 42 -28 -74 -94 24 -50 -14 -13 -11 -33 -21 1 -21 29 -40
5255d0k6R7m3RpM8m5Qj25J65o8L3o9J36p4n0o5J48l0M8qj70J29l8K2m8J58j20
$$ -40 -66 31 -12 -3 -10 38 -7 1 -124 41 -27 6 -63 73 -1 -51 -116 32 2 50 42 -128 1 -37 -15 -63 95 -25
5283b5J88k05J20j39k8Q1J4l5j2N3m9L0o0LO0q9J6L2j05J09j9R2j37M0J17k0o5
$$ -25 163 -42 78 -61 -89 -8 6 -29 -41 12 -37 -7 -67 -64 -4 -93 -77 -45 -150 -41 -60 32 -105 -65 52 32 -33
5310c3K3qnN4l9lnN3K1o7o8J40k0j46Q2n8J89m0o1j79J48K6K4Kk2n1L1J7K9RQ1
$$ -33 -10 -18 -23 31 -8 -11 -16 37 58 -9 -77 63 43 -103 -21 -79 110 70 9 -170 -22 4 28 30 8 -43 -12 5 34 43 124
5341A24j18M8j12k8J36j22J74n1Ok3M0o5l8L2J01m4l4q3R9o0J15op7n0L0J4o3
$$ 124 6 54 -58 -86 50 -72 102 51 57 34 74 9 -29 3 104 60 26 -57 42 -18 97 91 14 -36 -6 8 -55
5368e5n2J92j37Q5j02O1K4qj09J05%l7q4Q1O5Jml5o7J05M9k2k7M9j62P0Mo8R0
$$ -55 -107 85 -52 33 -69 -8 16 8 -101 4 4 -33 -117 -36 29 30 26 -9 -76 29 78 56 29 78 -84 -14 -10 -78 12
5397A2QM0l5RK7o4oK0M1q3K8R8J4j20p1Q4J39j35l8%P4m0N2p5pj9N2k1L9N2j09
$$ 12 20 60 25 34 61 -3 -9 11 52 -31 -3 95 109 -11 -82 2 141 6 -32 -32 42 2 54 -21 -28 -47 5 -16 23 75 -34
5428c4o9J30l9NRO8r1q2J17O6rj45L4P2q1k6P6q0J32Po7M6n4k7M0r6N3J54j66
$$ -34 -103 27 -12 -7 2 70 -21 -103 14 80 71 -74 -40 32 -49 -75 1 -79 53 60 -7 39 -15 -42 -2 -98 -45 109 -57
5457e7L5M8p2%O4n5q8J61m5q2Q5J2L3r1o3R4jj77K09p5M3R6p7J21j34j6m6Q6J1
$$ -57 -22 26 -46 -46 18 -37 -125 36 -9 -91 -6 6 39 -52 -115 -21 -22 -199 10 -65 -22 74 -3 118 -16 -32 -78 8 19
5486A9J8p3K3m2j1N7l3O4j2k1R7r5k0o4J04j05M5Mm4R8o0J30n4P7j91O0j0J1K6
$$ 19 37 -36 -13 -55 -66 -9 -42 22 10 -11 86 -9 -29 -93 11 -94 -49 -45 -89 9 -51 79 25 102 -89 -29 -39 -28 -2
5515bN1n1J6n9J8JN2k2N4l6q5P6k1Q5l1o1l0p6J58l6KmJ4J4J3k0J0j48J57q4J07
$$ -2 49 -2 14 -45 -27 -26 26 4 58 22 -63 13 -8 77 46 -15 -45 -121 37 1 3 -1 13 27 40 20 30 -118 39 -45 62
5546F2Jn8j0oo7m6J39J2J19l9Jn3n0MN1k2j36P1J9QL7p0o2M7M3J5M5j45K9Q2m0
$$ 62 63 5 -5 -11 -78 -124 15 27 146 107 108 55 5 9 60 38 -98 -27 -8 0 37 -33 -95 -48 -5 10 55 -90 -61 21 -19
5577a9n9k4J17q9J44n9K5m0L6q9O8p4M0k1Q9p7O9j2N6N0j13k4m9O3p9j0J56lp1
$$ -19 -78 -102 15 -74 70 11 36 -4 32 -57 11 -63 -23 -44 45 -32 37 25 81 131 18 -6 -55 8 -71 -81 75 72 1
5606Ak2O6j33K5J18j20M3k3pJ24j16O0K2j7o1N2L0n7m4K5l3mR1n2M8nl4K4mM2
$$ 1 -21 45 -88 -63 55 -65 -22 -45 -52 72 -44 16 38 21 -40 12 42 -15 -59 -34 -67 -71 20 -32 16 11 -23 1 -3 39
5636C9m7P0p0J6j5J5m3j5J63j27J02l3j31J74j11N6R4j72j3m4N9J06K7j19k1j8
$$ 39 -8 62 -8 8 -7 8 -35 -50 113 -14 88 55 -76 98 -13 43 137 -35 -48 -92 -33 73 100 -19 -40 -58
5662e8O1j41O8j9J47j13j7j7Q2J4n8J49j44J70j67M6j03J78k6j00N2o5K1J07r0
$$ -58 3 -138 -70 -89 58 -55 -72 -89 -7 7 -51 98 -46 124 -43 3 -100 78 52 -48 4 -61 -40 67 -23
5687b3M1j1Q9o4m0P6r3K7lp0J92q7r3Q0M1mp5P2q9M9r3J15m7J7l0m3N2q4J14Q5
$$ -23 18 7 96 32 -8 68 -25 2 -1 -71 121 34 -59 21 62 58 -17 55 -34 15 -78 37 -10 7 -23 -66 -14 -98 16 101
5717A01o8N8j29K1j8n0K2J36l7L4L1l6Mj66J59j28P3j7J19r7q0O9O8j30j2J12
$$ 101 33 91 -38 -17 -35 -85 -63 73 36 70 101 65 69 -97 62 -66 7 -10 109 12 -68 1 69 -61 -73 39
5743C9m7L2j36J38K2r3J39j29Q0o5M8o0l4P1j24R9O2L0j34P6k0J22j41KQ6m4r
$$ 39 -8 24 -112 26 48 -45 94 -35 45 -20 28 -32 -66 5 -119 -20 42 72 -62 14 -6 116 -25 -23 63 19 10
5770A0R9j36p1J17j17l5J78Kl0l1K6N8p8j63K60q6RJ07j38O1k2Q2q9L0j37J05
$$ 10 109 -27 -98 19 -98 -133 45 47 17 -14 12 70 -8 -171 89 3 12 119 -19 42 20 102 13 43 -94 11
5796A1mJ5O2q1L2rr7N5n0Q5L4l2J25n1n9n1O5j45K4O5n7M8P0q1N1M9l0l1n1l2
$$ 11 7 22 84 3 35 26 -71 -16 -66 19 53 21 146 95 36 -15 50 -95 -71 -6 -63 -15 55 -26 25 74 44 13 -38 -70
5826g0M3R0n5o0N4n1M0J10j67Q5K5l5N1j05NM3L2L0QPn4%j31P5jq6J22L9j7%K
$$ -70 -27 63 8 -52 2 -49 -9 101 -66 19 44 9 60 -45 -40 3 35 65 73 80 26 26 -105 -30 -31 -117 5 44 27 27 29
5857B9j00O1JL1O7l0ko8LO6n3Q8q8N3j40J01P1mk20J11l1J80k60J25j3k0J8J8
$$ 29 -71 -10 -9 22 89 59 57 -11 -8 58 5 93 5 58 -82 19 90 86 -134 -23 -54 126 -134 -9 -22 -42 -24 -6
5885fq1m7K9N4J75j57J3K5P0j17l3P1J16r3P5q8oK5nJ2R1q4j04J01j5L4k1MQq3
$$ -6 -87 -134 -105 -51 124 -33 -20 5 75 -42 -75 -4 112 19 94 6 0 25 20 32 123 39 -65 36 21 55 34 38 46 -37
5915c7J0Q5j52J06j14J55q6J2P1q2K1Rl0oJ00p0o8P0Q2p4L8n0Lj00Q0k1LM7m3
$$ -37 -27 58 -94 12 -102 53 -33 -21 50 -32 -11 -2 -32 -38 62 -8 -76 -6 76 2 40 -10 -7 -107 -27 -48 -45 2 -41
5944d1M1Qm2N7l9L8JMK9j4R8j32J32l1k06J38j48k3O4L7QLm6QL2p4J70j20O1J8
$$ -41 0 8 -34 23 -16 22 23 27 56 42 140 8 140 109 -97 41 -107 -130 -66 -29 -21 -18 -64 -56 -24 -98 72 -48 13 31
5974C1k9J18k02J31l0m1o4Q5J7M5l9Q7k22%P0Q6l3k6m0oQ5j30J74j49J31k1j9
$$ 31 2 120 -82 49 19 -22 -86 -1 16 61 22 109 -113 -113 -43 43 10 -16 -56 -62 23 -107 67 -82 49 28 9
6001Ij4O6r3J37j37J0Q5m0K0j09k2O5J14l3o9rK5P7j01%J11m5k0J6o5n5J00O9
$$ 9 -5 61 -32 105 -32 -22 63 23 43 -66 -88 -23 91 58 -11 -20 5 82 -19 -19 92 47 27 43 -22 -77 23 92
6029I2m6m9K9Kj37N0J30o9p1M9Q0j28J29n3J9k4pj9p6R7lm1P6J15j71J6mO0r2
$$ 92 46 -3 26 28 -109 -59 71 2 -69 -20 60 -68 61 8 27 3 -4 -23 -99 -2 -5 -46 30 145 -26 -10 -14 46 -46
6058d6j3k0J9o3R4J8r2P6R9k8n0J84j27j03J04k5r7J31K6j14J22r2J9j23L5M4
$$ -46 -59 -79 -60 -123 -29 -11 -103 -27 72 44 -6 178 51 -52 52 27 -70 61 87 -27 95 3 22 -101 -66 -22
6084b2p9J53r6K8mQL1Qk7J13j24L8j28mJ66qj31L8P3m6J72q2p6Q7j32l0M0R9j1
$$ -22 -101 52 -44 -16 -20 -12 19 27 0 113 -11 27 -101 -105 61 53 -78 -40 33 -13 159 77 1 88 -44 -74 -34 65 54
6113E4%j15R8p7Q6%j75K5O6M4n4J20j72J43m7k9O1o1O8j2j13J14k4r4J44m1K2
$$ 54 54 -61 37 -40 46 46 -129 -104 -38 6 -48 72 -100 43 -4 -33 28 -33 35 23 -90 24 0 -94 50 9 31
6140C1n1M8k5p6J04pn0k3K6M4r2N5J11L9j94J73j22L4J5q1l9j4J03L1q9O2o7J01
$$ 31 -20 28 3 -73 31 24 -26 -49 -23 21 -71 -16 95 134 -60 113 -9 25 40 -41 -80 -94 9 40 -49 13 -54 47
6168D7K5j52L3O4J35j02M9j82J30p1nKn4J3J22n3MQ9m7l4j58J33J9m3k1L2L7n5
$$ 47 72 -80 -47 17 152 50 99 -83 47 -24 -29 -27 -81 -68 54 1 5 94 47 13 -145 -12 7 -36 -57 -25 12 -43
6196d3nJ95j06k2%m5M7N0j4j47J05J4j9J46j33j11J0M9p8P7rj6k8L2J6k3M0j6
$$ -43 -48 147 41 19 19 -26 21 71 57 -90 15 29 10 156 23 -88 -78 -29 -107 -30 -39 -55 -83 -51 -35 -58 -18 -34
6224c4l2N6R3o9j3M7l4o6J43m5n9P2oj15N2L7K1Op4l0L8O6QK9r5l2K1P5k9K8M4
$$ -34 -66 -10 83 14 1 48 14 -52 91 46 -13 59 53 -62 -10 27 48 54 -20 -50 -12 54 62 91 -4 -36 -15 60 31 59 103
6255A03j20P0M7j35K0J8J4L4k6L3r6K4L6P1j65nQ7O0j45Q4j2K7o8J9M5J9R5p0
$$ 103 -17 53 100 -35 -15 3 17 51 25 58 -38 -14 22 93 -72 -77 10 70 -75 9 -3 24 -44 -25 20 39 134 64
6283F4j71J07M1o7o3N5J22q8n3M4J58p3n8k6j37O5J33J2or7J14k12J40p8J2K8
$$ 64 -107 0 41 -26 -89 -34 88 0 -53 -9 149 76 18 -8 -145 -80 53 65 59 -38 76 -136 4 -74 -62 -34
6309c4J1L3Qj04Q5Q3n2j24L8M5mp3P6kL2P2k1p3k3J06j20P2L6n5n0PJ4Q1p7q9
$$ -34 -23 10 18 -86 -1 82 30 -94 -56 -11 -15 -88 -12 -14 18 90 69 -4 -27 79 -41 31 67 12 -38 -31 -17 64 -13 -102
6339a02Q0J16j07J9l6K8l0l1J22k5j8j8J0n5L9L9r7R4nl9J0O5j36J22J0J0j15
$$ -102 -22 94 -13 6 -30 -2 -32 -63 59 34 16 -2 8 -47 -8 31 -66 28 23 -16 -6 59 -77 45 55 65 -50
6366e0L6ON5p7j3j5O2o3O0n5N9P6n3J4n9P8j6j8m4j6l2J01n2J17j84J00J4L2O
$$ -50 -14 -8 47 -30 -43 -58 4 -59 1 -54 5 81 28 42 -17 61 45 27 -17 -33 -65 36 -16 101 -83 17 31 63 69
6395F9q4K6Om2j5PK2qOJ6L4j80K63p8jl7Q9j9r1J13l4m4Oj8l1k8J14K9j23p5P7
$$ 69 -15 11 17 -25 -40 -33 -11 -19 -13 3 37 -143 120 42 41 4 93 74 -17 96 62 18 24 6 -25 -53 61 90 -33 -108 -31
6426c1J1L7j30N9L1J7J05j82J38r8J18J0o7jQp7P0p3M5n4M7l5m7P0J35p2p0j44
$$ -31 -20 17 -113 -54 -23 -6 99 -83 55 -43 75 85 18 17 25 -52 18 -55 -10 -64 -17 -52 -99 -29 106 34 -36 -180
6454a80K08%q6J05p6p1Q6jR0q9MR6Q4j89m2J01L5o1j5J4mql4J9j4L6j6k5l0Q6
$$ -180 28 28 -58 47 -29 -100 -14 -15 75 -14 -10 86 170 -19 -61 40 75 14 -1 13 9 1 -33 -14 -28 8 -8 -33 -63 23
6484B3rj9J9M7j8l7MM3j28J22j6k8n0J49j06r1J80j65Q4l4jJ05jp7o2N6p0M3L5
$$ 23 14 -5 14 61 43 6 10 53 -75 47 31 3 -47 102 -4 -95 85 -80 4 -30 -31 74 73 -4 -66 -10 -80 -37 -2
6513bkj4LM0q9J04jj06K1J54l4j08O3N2n9k9P7n9Oj24Q2P4r4PM5j08J16k1m1M8
$$ -2 -4 -18 -15 25 -64 40 39 -67 -46 108 74 -34 29 81 22 -7 70 11 17 -107 -25 49 -45 -38 7 -101 15 -6 -47 1
6543AlP8j06L9J2M9l4p7NJ86j62m9J27k03J44N1j84R4K5M6o5Q1j56J27l9P4j32
$$ 1 -2 76 -30 9 21 70 36 -41 -36 150 -12 -61 66 -137 7 58 -126 -32 -7 39 -26 55 -101 26 -13 61 -71
6570g1l0Q1m3kJ32k0K3j59J19r3J09nm2q2J32q1q6J27m7R3o0Jq5lK06j73P6L2
$$ -71 -101 -20 -63 -65 67 47 70 -89 30 -63 46 41 -1 -83 49 -32 -118 9 -38 55 -5 -4 -89 -92 114 -59 17 49
6598D9L7o6j51J84Rl0j72J88N2o0j22O9L4M4n0L7J8j78J09l6K2P5r6J62j17j21
$$ 49 86 20 -131 53 62 32 -140 48 100 40 -82 -13 21 65 15 52 70 -108 1 -35 -13 62 -34 128 11 -110
6624a10Q0J41l7r0P0j92K13j85J29r2P2O6j19R0o2J62j70m4P9%M4j94J91o4n3
$$ -110 -30 111 74 -16 54 -138 75 -110 19 -73 -1 65 -54 36 -26 136 -34 -78 1 1 45 -149 42 -22 -75
6649g5Q5m4P4K5J2j92j1R3R3j42J23q2M7k6N7m6K0J31j34L7m4j07K01r5r3J41
$$ -75 10 -34 40 65 77 -115 -126 -33 60 -82 41 -41 6 -20 37 -9 11 142 8 45 1 -106 95 0 -93 48
6675D8M5m5j55OJ53j05J19L8n5k9J8l9j6J4j6K8n2lM3j13J50j3mJ6O0k5j30M1
$$ 48 93 48 -107 -101 52 -53 66 104 49 20 38 -1 -17 -3 -19 9 -43 -46 -3 -116 34 21 17 33 93 68 -62 -21
6703b1p2J52P4k6j36j4L6N3L8m4jJN5j82R3l8p5Q3j3mJ34k21J94p2P4j41Q1m9
$$ -21 -93 59 133 107 -29 -43 -7 46 84 40 39 40 95 -87 6 -32 -107 -24 -37 -41 93 -128 66 -6 68 -73 8 -41
6731d1jN6M7j01pJ34l2j16P5K0J8m6oN9l5n8mj6J21n5o7P2L8n2L5p0p9J86j08
$$ -41 -42 14 61 -40 -47 87 55 -61 14 34 52 6 0 59 24 -34 -38 -54 67 12 -55 17 55 3 38 -32 -111 75 -33
6760c3J7n1Q8o6L6R5m5j16K2J37J6j39J3M5L4l5n0j71K90j11J25j55J03m5M3m
$$ -33 -16 -67 21 -45 -9 86 41 -75 -53 84 100 -39 -26 19 53 18 -32 -203 87 -24 101 -54 49 4 47 43
6786D3r8P0j32J78q8R8j26n5R8J2J1j8j16Q6O4Mj2j2k4n1M3J1j5L4J4j8j21P0
$$ 43 -55 15 -117 61 -27 71 -55 -110 -12 0 11 -7 -123 -37 27 31 19 7 -17 -68 -25 -14 -29 5 19 1 -120 -50
6814e0K33j04j66J51p9O3L5m0l6N6K7k4j09J5N9q0O4q2J1K9M1n2P6q6N5P3p1o7
$$ -50 183 79 -87 64 -15 48 83 43 7 63 90 66 -43 -28 31 -49 15 -67 -56 -27 14 -38 38 -48 7 80 9 -58
6842e8M8j1r2K06j48L9k4M1L0j02o5Q8K1p9P0R6j69Q8J5o2K54j10j52R8R8j27
$$ -58 -10 -21 -113 93 -55 -16 -40 1 31 -71 -136 -48 -27 -106 -36 60 -109 -21 -6 -68 186 76 -76 22 120 -7
6868gm3J9K1m9J67n3oK7j12l3J40k6r2P8K1qj82L0J12J5n6j5MP1Op4O3q5J02L5
$$ -7 -50 -31 -10 -59 108 55 49 76 -36 -69 71 45 -47 31 52 44 -138 -108 4 19 -37 -52 -48 23 29 -45 18 -67 35 70
6898G0o5q2R2k5LR2n7j36R7k0N1j07J11j6L2N8j01L7n4P5r8R5p2J35l0l2M4j93
$$ 70 5 -77 15 -10 -7 85 28 -108 -11 -31 20 -87 24 8 40 98 -3 34 -20 55 -43 52 -20 115 85 53 97 -96
6926i6J54n5j6RM3k5J0J34j22p7J21o0K2j13K0J16n6NK1Mp8J04r5P4o9oN0j7o7
$$ -96 58 3 -13 -4 39 14 24 158 36 -41 80 20 42 -71 -51 65 9 14 35 39 -39 65 -30 44 -25 -31 19 2 -65
6955f5N1kJ10r0j8O7j4n6O4Mp2L0p0J14j5L3Jq0O0mj42Q3p7J34q0%K9m4l8K0L9
$$ -65 -14 -16 94 4 -14 53 39 -17 47 51 -21 9 -61 53 38 71 72 -8 52 48 -94 -11 -88 46 -34 -34 -5 -49 -87 -67 -28
6986b8k7o2J56o3m0J7LJ00J2oN7m0L2j46M8K3j4l7L3oo8O7n2P6N7j16J5p3j0Q9
$$ -28 -55 -117 39 -24 -64 -47 -44 56 68 62 119 79 111 -35 13 36 22 -15 18 12 -56 11 -41 35 92 -24 -9 -82 -92 -3
7016cL4n3J36j31L6q6J52j55L0J8Q2j95J77p0R6p3oj5J39k09J71m6j10J56o2J3
$$ -3 31 -22 114 -17 19 -67 85 -70 -40 -22 60 -135 42 -28 68 -5 -11 -26 113 -96 75 29 -81 75 13 26
7042B6p8M4m7J43p8o4O5M8k8J4Qj39J04o8k0P6K9L4J5L5q7K9k1J9r1M0J31p9j48
$$ 26 -52 -8 -55 88 10 -54 11 59 31 45 53 -86 18 -50 -70 6 35 69 84 119 32 61 40 59 -32 8 139 60 -88
7071h8P5J2j0kj28K12p7l8J9Q7r5k4JP5Rk1L8L4nl2j73O1N6M2j38J53k7J2l5Q4
$$ -88 -13 -1 -11 -13 -141 71 -6 -44 -25 62 -33 -57 -56 19 28 7 45 79 74 42 -131 -70 -14 28 -110 43 16 28 -7 77
7101G7j53J90k36R9q4J23j24J36j09P0o7jJ75k7NMj27qM8r9J38q3O2M8q9N2Ro5
$$ 77 -76 114 -122 -23 -107 16 -108 28 -81 -11 -78 -79 96 69 74 78 -49 -57 -9 -108 30 -53 9 57 -32 20 29 -36
7129c6J26k8P8Ok04k6J65j13N7j04J29j63P9n3J02o1R0l7N5k5j08L4m3Q2k6P8
$$ -36 90 62 140 146 -58 -84 81 -32 25 -79 50 -113 -34 -87 15 -46 44 7 62 37 -71 -37 -80 2 -24 54
7155E4q7n8J38n3q5O1N4k0q1P6l9P1Q0m9j19m9J27M0m3q8J2K8l5n9R5K4K4l2M7
$$ 54 -33 -91 47 -6 -91 -30 24 4 -77 -1 -40 31 111 62 -57 -106 21 61 18 -70 -58 -30 -65 -124 -29 -5 19 -13 34
7184C4j18P2L0j01J11k0k4N1r1J14j04k5J31j20J3J06o3l1J11p9L4Kp8kl3J05
$$ 34 -84 -12 18 -83 28 8 -16 35 -56 58 -46 -71 60 -60 -47 59 -4 -35 76 -3 31 33 -45 -47 -80 25
7210B5J41j50j0k5L2j1Q9j26k00K85p7K9n6m7Q5k8LJ00P2j77J5j6R9j28kL0R6
$$ 25 166 16 6 -19 13 2 91 -35 -235 50 -27 2 -54 -101 -16 -44 -41 59 131 -46 -31 -47 52 -76 -78 -48 48
7237D8l6J0jn8J15r6JL7K4j70P0J15j08J38k4j50O8N1J05j30p7J0J21j08J05n8
$$ 48 12 22 21 -37 78 -18 -17 20 44 -126 -56 59 -49 89 65 -85 -17 34 139 9 -68 -58 63 -45 60 2
7263Bj18J37k6m3J8K0l3M1K8p2p1J28j53M0J67n9Q0p0M3j71J34m7M6k2j5P7r7
$$ 2 -116 21 -5 -48 -30 -10 -43 -2 26 -46 -117 11 -142 -102 65 6 86 16 59 -112 22 -25 21 -1 -16 61 -36
7290c6j3N7j7J05ok25J46Q1p1PJ5k7n2M3Lm1M9p8N7L1k2O1j17J46j22L4qN1m2
$$ -36 -49 8 -9 96 90 -135 11 92 21 28 43 16 -36 7 10 -31 18 -60 -3 28 6 67 -50 96 -26 8 0 51 9
7319Ij45K22j06J7n2J39q1N4q9R2Q2j28M0n1L3o8P2p5K5O5j02J4Q5P3j14J2k3
$$ 9 -136 86 -20 -3 -55 84 3 57 -32 60 142 14 54 3 36 -32 40 -35 -10 55 -47 -33 52 125 11 23 0
7346@N3j05K1M1n9O3L4n7Q4o6J23j81Q0j09J42p2L4J01o7q9J04j21Lj2pJ07O0
$$ 0 53 -52 -31 10 -49 14 48 -9 75 9 132 -49 31 -78 64 -8 26 127 60 -29 75 -46 -43 -55 -62 45 105
7373A05j55n4P7%O0m8P2r2J21m6J0mO5rp1j12J57r6L9k4J9q0R4ol5l5O0j15O2
$$ 105 -50 -104 -27 -27 33 -15 57 -35 86 40 50 46 111 102 31 -81 76 -20 19 -5 14 -66 28 22 -13 -48 12 -103 -41
7402d1l3pR9J9n3L7J2j12J18p1j0J3R3n5L2n9M2J7k8n6K1lpQ7j16L0N1o1j3N7
$$ -41 -74 -81 18 37 -16 21 33 -79 39 -32 -42 -29 64 9 41 -18 24 41 13 -43 -22 -25 -32 55 -61 -31 20 -41 -54 3
7432Ck8k0J77j34J27o6n8j7P2j66o6J24R1o6L9o3Q2p6O8j28J34pk1L4q5L6J03
$$ 3 -25 -45 132 -2 125 59 1 -16 56 -110 -176 -52 39 -27 12 -51 31 -45 23 -105 29 22 1 35 -50 -14 89
7459H9l0p6O7q8J47j08j39J01Q3q9O8o5j9J39n6n2RJ16n0o3J4k6N9l5m1J4J24
$$ 89 59 -17 50 -38 109 1 -138 -37 46 -43 25 -40 -59 80 24 -28 -19 97 47 -16 -2 -28 31 -4 -45 -31 93
7486I3j73M0M6p2O6M1n0L4j4J4l9j6k0K26j92k9N0N6J23k38%j0R3m3Q9M7k51O9
$$ 93 -80 -40 6 -66 0 41 -9 25 11 25 -14 -30 -50 176 -16 -45 5 61 184 -54 -54 -64 29 -14 75 122 -129 -60
7514f0N6J2Q8q6l5O9n0q9J18p1O3o0J57j04l4K8n8o6R5Q6o0q7J61m9O1j36P9n9
$$ -60 -4 8 96 10 -25 44 -6 -95 23 -48 15 -45 112 8 -26 2 -56 -122 -27 59 -1 -88 73 24 85 -51 28 -31
7542c1PM5j28O6N5Q9p6l2K2P6M1j55lJ0j0L2k0m4q1J78r5N8n1J04k0k6j00J41
$$ -31 -24 21 -107 -41 14 103 27 -5 17 93 134 -21 -24 -14 -24 8 -12 -56 -137 41 -54 4 -47 57 37 11 -89 52
7570E2j71J64k8o5N8MJ8l2P3j55J80j49J0l6K77k82l4J98j3j52J08O7j15L6O5
$$ 52 -119 45 17 -48 10 14 32 0 73 -82 98 -51 -41 -77 200 -82 -116 82 69 -83 25 92 -23 13 78
7595G8n6j4nk8K7l7R0K5m6j09M0K2Q5j25J65j57P0k7K1j8N5q2K7J9p1P7k4O5j02
$$ 78 22 8 3 -25 2 -35 55 80 34 -75 -35 -13 72 -53 112 -45 25 -2 19 1 56 -26 1 20 -51 26 2 67 -35
7624c5P0Qpj50J17j11J01l6R3j38J45j09R3k5P5o7n6L7J28o1j16J32j30J28o3
$$ -35 35 43 36 -114 3 -108 -7 -43 50 -88 57 -52 41 16 91 24 -32 5 133 72 -44 88 -42 86 23
$$ [...]
8191B9
##END NTUPLES=NMR FID
##END=
