##TITLE=1H_DE-80H_X3
 200.13MHz, d2o
 8 sc
 
 19ns.26.2.2025
##JCAMPDX= 6.0         $$ Bruker NMR JCAMP-DX V2.0
##DATA TYPE= NMR FID
##DATA CLASS= NTUPLES
##ORIGIN= UXNMR, Bruker Analytische Messtechnik GmbH
##OWNER= pz
$$ XWIN-NMR		Version 3.5
$$ Thu May 15 14:51:07 2025 Russian Standard Time (UT+4h)  Yarkov@DPX200
##.OBSERVE FREQUENCY= 200.1313
##.OBSERVE NUCLEUS= ^1H
##.DELAY= (6, 6)
##.ACQUISITION MODE= SIMULTANEOUS
##.ACQUISITION SCHEME= undefined
##.AVERAGES= 8
##.DIGITISER RES= 18
##SPECTROMETER/DATA SYSTEM= spect
##.PULSE SEQUENCE= zg30
##.SOLVENT NAME= CDCl3
##.SHIFT REFERENCE= (INTERNAL, CDCl3, 0, 14.3821)
##AUDIT TRAIL= $$ (NUMBER, WHEN, WHO, WHERE, WHAT)
$$ ##TITLE= Audit trail, XWIN-NMR		Version 3.5
$$ ##JCAMPDX= 5.01
$$ ##ORIGIN= Bruker BioSpin GmbH
$$ ##OWNER= Yarkov
$$ C:/Bruker/XWIN-NMR/data/yarkov2/nmr/H-C/1/audita.txt
$$ ##AUDIT TRAIL=  $$ (NUMBER, WHEN, WHO, WHERE, WHAT)
(   1,<2025-05-15 14:50:24.92 +0400>,<Yarkov>,<DPX200>,
      <created by zg, POWCHK disabled, PULCHK disabled
       configuration hash MD5:
       00 E9 B6 7A A2 85 ED C7 34 08 36 98 17 FE 4E 26
       data hash MD5: 16K
       F6 7F D5 06 26 80 58 91 83 19 60 B0 99 F9 F7 89>)
$$ ##END=
$$ 
$$ hash MD5
$$ 20 39 44 63 C6 D7 FC F6 BD E5 FB E5 00 95 44 E8
##$RELAX= 
##$RELAX= 
##$RELAX= 
##$RELAX= 
##$RELAX= 
##$RELAX= 
$$ Bruker specific parameters
$$ --------------------------
##$DU= <C:/Bruker/XWIN-NMR>
##$EXPNO= 1
##$NAME= <H-C>
##$PROCNO= 1
##$TYPE= <nmr>
##$USER= <yarkov2>
##$AMP= (0..31)
100 100 100 100 100 100 100 100 100 100 100 100 100 100 100 100 100 100 
100 100 100 100 100 100 100 100 100 100 100 100 100 100 
##$AQSEQ= 0
##$AQ_mod= 1
##$AUNM= <au_zg>
##$AUTOPOS= <>
##$BF1= 200.13
##$BF2= 200.13
##$BF3= 200.13
##$BF4= 200.13
##$BF5= 200.13
##$BF6= 200.13
##$BF7= 200.13
##$BF8= 200.13
##$BYTORDA= 1
##$CFDGTYP= 0
##$CFRGTYP= 5
##$CHEMSTR= <none>
##$CNST= (0..31)
1 1 145 1 1 1 1 1 1 1 1 1 1 1 1 1 1 1 1 1 1 1 1 1 1 1 1 1 1 1 1 1 
##$CPDPRG= <>
##$CPDPRG1= <>
##$CPDPRG2= <>
##$CPDPRG3= <>
##$CPDPRG4= <mlev>
##$CPDPRG5= <mlev>
##$CPDPRG6= <mlev>
##$CPDPRG7= <mlev>
##$CPDPRG8= <mlev>
##$CPDPRGB= <>
##$CPDPRGT= <>
##$D= (0..31)
0 0.7 0 0 0 0 0 0 0 0 0 0.03 0 0 0 0 0 0 0 0 0 0 0 0 0 0 0 0 0 0 0 0 
##$DATE= 1747306224
##$DBL= (0..7)
120 120 120 120 120 120 120 120 
##$DBP= (0..7)
150 150 150 150 150 150 150 150 
##$DBP07= 0
##$DBPNAM0= <>
##$DBPNAM1= <>
##$DBPNAM2= <>
##$DBPNAM3= <>
##$DBPNAM4= <>
##$DBPNAM5= <>
##$DBPNAM6= <>
##$DBPNAM7= <>
##$DBPOAL= (0..7)
0.5 0.5 0.5 0.5 0.5 0.5 0.5 0.5 
##$DBPOFFS= (0..7)
0 0 0 0 0 0 0 0 
##$DE= 6
##$DECBNUC= <off>
##$DECIM= 32
##$DECNUC= <off>
##$DECSTAT= 4
##$DIGMOD= 1
##$DIGTYP= 9
##$DL= (0..7)
0 120 120 120 120 120 120 120 
##$DP= (0..7)
150 150 150 150 150 150 150 150 
##$DP07= 0
##$DPNAME0= <>
##$DPNAME1= <>
##$DPNAME2= <>
##$DPNAME3= <>
##$DPNAME4= <>
##$DPNAME5= <>
##$DPNAME6= <>
##$DPNAME7= <>
##$DPOAL= (0..7)
0.5 0.5 0.5 0.5 0.5 0.5 0.5 0.5 
##$DPOFFS= (0..7)
0 0 0 0 0 0 0 0 
##$DQDMODE= 0
##$DR= 18
##$DS= 0
$$ [...]
##$SUBNAM2= <"">
##$SUBNAM3= <"">
##$SUBNAM4= <"">
##$SUBNAM5= <"">
##$SUBNAM6= <"">
##$SUBNAM7= <"">
##$SUBNAM8= <"">
##$SUBNAM9= <"">
##$SW= 18.0517328524113
##$SWIBOX= (0..15)
0 0 2 0 0 0 0 0 0 0 0 0 0 0 0 0 
##$SW_h= 3612.71676300578
##$TD= 16384
##$TD0= 1
##$TE= 0
##$TE2= 300
##$TE3= 300
##$TEG= 300
##$TL= (0..7)
0 120 120 120 120 120 120 120 
##$TP= (0..7)
150 150 150 150 150 150 150 150 
##$TP07= 0
##$TPNAME0= <>
##$TPNAME1= <>
##$TPNAME2= <>
##$TPNAME3= <>
##$TPNAME4= <>
##$TPNAME5= <>
##$TPNAME6= <>
##$TPNAME7= <>
##$TPOAL= (0..7)
0.5 0.5 0.5 0.5 0.5 0.5 0.5 0.5 
##$TPOFFS= (0..7)
0 0 0 0 0 0 0 0 
##$TUNHIN= 0
##$TUNHOUT= 0
##$TUNXOUT= 0
##$USERA1= <user>
##$USERA2= <user>
##$USERA3= <user>
##$USERA4= <user>
##$USERA5= <user>
##$V9= 5
##$VALIST= <valist>
##$VCLIST= <CCCCCCCCCCCCCCC>
##$VD= 0
##$VDLIST= <DDDDDDDDDDDDDDD>
##$VPLIST= <PPPPPPPPPPPPPPP>
##$VTLIST= <TTTTTTTTTTTTTTT>
##$WBST= 1024
##$WBSW= 4
##$XGAIN= (0..3)
0 0 0 0 
##$XL= 0
##$YL= 0
##$YMAX_a= 36500
##$YMIN_a= -30467
##$ZGOPTNS= <>
##$ZL1= 120
##$ZL2= 120
##$ZL3= 120
##$ZL4= 120
##$ABSF1= 10
##$ABSF2= 0
##$ABSG= 5
##$ABSL= 3
##$ALPHA= 0
##$AQORDER= 0
##$ASSFAC= 0
##$ASSFACI= 0
##$ASSFACX= 0
##$ASSWID= 0
##$AUNMP= <proc_1d>
##$AZFE= 0.1
##$AZFW= 0.1
##$BCFW= 1
##$BC_mod= 2
##$BYTORDP= 1
##$COROFFS= 0
##$CY= 83.5205535888672
##$DATMOD= 1
##$DC= 2
##$DFILT= <>
##$DTYPP= 0
##$F1P= 10.8118882576601
##$F2P= -7.23987719738617
##$FCOR= 0.5
##$FTSIZE= 0
##$FT_mod= 4
##$GAMMA= 1
##$GB= 0.15
##$INTBC= 1
##$INTSCL= 1
##$ISEN= 128
##$LB= 0.25
##$LEV0= 0
##$LPBIN= 0
##$MAXI= 10000
##$MC2= 0
##$MEAN= 0
##$ME_mod= 0
##$MI= 1.114404
##$NCOEF= 0
##$NC_proc= 0
##$NLEV= 6
##$NOISF1= 3.799351
##$NOISF2= 2.8
##$NSP= 1
##$NTH_PI= 0
##$NZP= 0
##$OFFSET= 14.38212
##$PC= 1
##$PHC0= -1345.591
##$PHC1= 7.133752
##$PH_mod= 1
##$PKNL= yes
##$PPARMOD= 0
##$PSCAL= 0
##$PSIGN= 0
##$REVERSE= no
##$SF= 200.129724274929
##$SI= 16384
##$SIGF1= 3
##$SIGF2= 2
##$SINO= 400
##$SIOLD= 16384
##$SREGLST= <1H.CDCl3>
##$SSB= 0
##$STSI= 0
##$STSR= 0
##$SW_p= 3205.1282051282
##$SYMM= 0
##$S_DEV= 0
##$TDeff= 0
##$TDoff= 0
##$TI= <>
##$TILT= no
##$TM1= 0
##$TM2= 0
##$TOPLEV= 0
##$USERP1= <user>
##$USERP2= <user>
##$USERP3= <user>
##$USERP4= <user>
##$USERP5= <user>
##$WDW= 1
##$XDIM= 8192
##$YMAX_p= 0
##$YMIN_p= 0
$$ End of Bruker specific parameters
$$ ---------------------------------
##NTUPLES= NMR FID
##VAR_NAME=  TIME,          FID/REAL,        FID/IMAG
##SYMBOL=    X,             R,               I
##VAR_TYPE=  INDEPENDENT,   DEPENDENT,       DEPENDENT
##VAR_FORM=  AFFN,          ASDF,            ASDF
##VAR_DIM=   8192,          8192,            8192
##UNITS=     SECONDS,       ARBITRARY UNITS, ARBITRARY UNITS
##FACTOR=    0.0002768,     1,               1
##FIRST=     0,             0,               0
##LAST=      2.2672688,     0,               0
##MIN=       0,             -30467,          0
##MAX=       2.2672688,     36500,           0
$$ Real data points
##PAGE= N=1
##DATA TABLE= (X++(R..R)), XYDATA
$$ [...]
$$ plain form
736 47 55 -6 -109 -1 -30 -114 -106 27 -76 42 101 -37 -91 6 57 30 20 -75 29 88 -53 30 113 6 48 -111 -204
763 -204 -75 6 -64 -12 -113 110 -13 -28 38 -30 -31 74 68 134 11 -40 117 -12 36 -58 -19 43 -95 -23 -17 49 -72
790 -72 -75 -18 37 28 -139 -108 37 25 -132 77 -96 -112 108 33 64 -28 1 -95 -61 -33 -90 -3 -94 44 -84 -52 17 -17
818 -17 86 -36 26 -27 32 -45 20 -14 -36 -79 53 -97 -10 148 -9 8 -14 -43 -28 -107 80 -79 67 -105 -54 13
844 13 31 -14 -43 -48 48 141 3 4 -20 -59 -1 41 -83 -92 -50 -69 36 14 30 -34 -18 76 46 93 -132 77 11 -52 1 -28
874 -28 43 -16 35 -53 -39 -92 10 60 9 -28 83 -30 -47 85 12 32 64 186 -53 61 33 -4 75 52 22 57 46
901 46 41 -48 58 17 -30 67 -61 -61 73 37 -40 54 41 31 55 -87 -62 21 -40 16 -17 1 -45 73 -52 -62 -78 100
929 100 -30 -30 -9 13 97 52 0 46 -76 72 16 -65 -70 -102 22 -123 -64 7 56 -45 19 -64 55 37 -102 1 -7
$$ packed form
736D7Qo1j03J08k9q4QJ33j03J18N9j38n4R7N1k7j0r5J04N9j41Q3Q3j07M2j59r3
763b04J29Q1p0N2j01K23j23j5O6o8jJ05oO6j23n1J57j29M8r4L9O2j38P2OO6j21
790g2lN7N5rj67L1J45j2j57K09j73j6K20p5L1r2K9r6L4K8n7Q7r1J38j28L2O9l4
818a7J03j22O2n3N9p7O5l4k2m3J32j50Q7J58j57J7k2k9J5p9J87j59J46j72N1O7
844A3J8m5k9nR6R3j38Jk4l9N8M2j24rM2j9J05k2J6o4J6R4l0M7k25K09o6o3N3k9
874b8P1n9N1q8J4n3J02N0n1l7J11j13j7J32p3K0L2J22k39J14k8l7P9k3l0L5j1
901D6nq9J06m1m7R7j28%J34l6p7R4j3j0K4j42K5Q3o1N6l3J8m6J18j25j0j6J78
929A00j30%K1K2Q4m5n2M6j22J48n6q1nl2J24j45N9P1M9j01O4q3J19j8j39J03q
$$ plain form
956 -7 24 -9 -34 -10 -97 -40 13 9 80 -29 101 -102 98 66 -8 -1 -16 81 -60 49 -59 -53 -5 -49 -65 139 -31 73
984 73 86 -3 36 -28 -34 -152 -18 -113 -106 -3 2 -90 58 54 -81 -75 -86 -92 -126 15 -82 -35 85 -92 -4 -42 61 84 -27
1013 -27 -28 7 -11 -138 23 -3 159 46 1 -49 -98 -29 -10 -9 64 -45 68 -2 -30 39 84 -25 -120 -1 -108 -39 -20
1040 -20 111 -5 32 6 -69 31 -77 69 -10 20 33 3 3 -37 13 -65 -96 -12 66 -52 -35 97 -27 -29 -44 33 37 20
1068 20 -46 -64 0 31 29 -51 -47 60 -69 48 -92 7 55 -26 38 52 -15 52 -79 -1 -45 2 -15 -45 -3 -27 -156 -152 -113
1097 -113 -57 -15 -14 -11 13 51 0 43 32 -20 -37 68 49 -13 -143 -99 54 -50 9 -84 43 90 -37 -124 -63 9 30 20
1125 20 26 5 -69 -187 -72 32 7 30 -13 83 7 -43 -66 33 -61 32 20 40 -81 -7 -92 -15 36 -13 80 -40 -56 8
1153 8 13 -23 6 -18 102 -49 124 24 10 78 19 72 73 2 -48 24 56 -33 -20 70 4 46 84 -26 -41 -86 4 35 -3
$$ packed form
956gL1l3k5K4q7N7N3mP1j09J30k03K00l2p4Pj5R7j41J09j08OM8m4j6K04j70J04
984G3J3q9L9o4oj18J34r5PJ03Nr2J48mj35Oj1ol4J41r7M7J20j77Q8l8J03K3j11
1013b7jL5j8j27J61k6J62j13m5n0m9O9J9JP3j09J13p0k8O9M5j09r5J19j07O9J9
1040b0J31j16L7k6p5J00j08J46p9L0J3l0%m0N0p8l1Q4P8j18J7J32j24kj5P7Mj7
1068B0o6j8O4L1kq0MJ07j29J17j40R9M8q1O4J4o7O7j31P8m4M7j7l0M2k4j29ML9
1097a13N6M2JLK4L8n1M3j1n2j7J05j9o2j30M4J53j04N9r3J27M7j27q7O1P2K1j0
1125B0Ok1p4j18J15J04k5K3m3R6p6n0k3R9r4R3j2K0j21P4q5P7N1m9R3j20j6O4
1153HNl6K9k4J20j51J73j00j4O8n9N3Jp1n0P2L2q9J3R0o6M2L8j10j5m5R0L1l8
$$ plain form
1182 -3 28 22 -9 -46 -56 -4 46 -93 -68 -7 -12 -28 36 35 10 5 3 15 -120 -41 98 -81 -52 -29 -14 -39 -66 55 24 -13 77
1213 77 23 -88 -33 15 -18 -17 34 -114 41 -69 120 -21 93 -63 14 -85 -81 -47 3 -35 11 -33 -75 31 56 45 -171
1240 -171 14 77 31 -84 -63 -33 -15 110 -101 -36 13 -17 14 46 25 73 -44 125 26 -44 -27 47 24 85 142 31
1266 31 81 67 23 11 37 -90 -57 77 -24 -26 27 -94 -49 38 106 130 -61 2 95 2 -4 -6 -37 27 -93 -33 -22 105
1294 105 -67 50 -68 12 75 -98 -40 95 4 -84 98 40 89 27 -5 -6 -34 19 -73 -38 -37 -61 -40 -2 -28 11 16 67
1322 67 61 -70 11 27 4 -29 53 82 93 -109 -47 53 50 27 105 12 76 -86 51 -18 84 -41 -16 -81 -53 -49 -85 28
1350 28 53 -70 -102 -5 -102 -80 -30 13 -101 52 -68 3 -72 82 11 -41 -26 -32 -61 -25 -54 92 102 -71 7 -28 -40
1377 -40 -70 -1 -3 19 -26 119 33 54 3 -156 4 2 -4 28 -77 -41 18 29 -56 2 0 58 54 -103 46 -27 74 3 21
$$ packed form
1182cL1ol1l7j0N2N0j39K5O1nj6O4jk5nkJ2j35P9J39j79K9K3J5k5k7J21l1l7R0
1213G7n4j11N5M8l3JN1j48J55j10J89j41J14j56P7r9ML4N0l8M6m4m2J06K5j1k16
1240a71J85O3m6j15K1L0J8J25k11O5M9l0L1L2k1M8j17J69r9p0J7P4k3O1N7j11
1266C1N0j4m4j2K6j27L3J34j01kN3j21M5Q7O8K4j91O3R3r3okl1O4j20O0J1J27
1294A05j72J17j18Q0O3j73N8J35r1q8J82n8M9o2l2jk8N3r2L5Jk4K1L8k6L9NN1
1322F7oj31Q1J6k3l3Q2K9J1k02O2J00lk3P8r3O4j62J37o9J02j25K5o5K8Ml6J13
1350B8K5j23l2R7r7K2N0M3j14J53j20P1p5J54p1n2J5ok9L6k9J46J0j73P8l5j2
1377d0l0O9kK2m5J45q6K1n1j59J60koL2j05L6N9J1q5N8kN8mj57J49p3J01p1J8
$$ plain form
1406 21 -32 -59 45 53 28 32 -29 -94 25 5 28 -49 18 80 111 31 -10 22 5 -10 -70 -22 2 -34 5 -34 14 82 -101 -26
1436 -26 7 9 -42 -33 -21 -89 -5 37 0 111 55 -41 42 58 -34 -36 -46 11 -101 -10 19 23 82 -21 101 34 -66 35 10
1465 10 -5 -25 63 49 -93 46 17 1 -2 -51 -83 5 -58 -12 -67 -63 -48 34 -8 -112 -18 -75 4 50 60 29 136 44 -48
1494 -48 102 -49 -131 -47 41 65 -68 -16 -68 2 69 43 -6 39 -17 40 -8 -82 -17 43 10 -17 19 18 -48 -37 -128 -18 49
1523 49 -6 -27 -142 2 8 22 -19 15 -4 6 17 44 79 -31 -53 42 25 -45 14 17 -37 86 44 87 20 -5 -40 -75 48
1552 48 -63 29 64 -31 -137 -85 -140 46 56 -5 43 37 83 14 25 -114 -1 -100 37 51 49 12 -116 -6 -47 -16 88
1579 88 -14 31 14 -35 -18 -46 28 69 -1 -114 -75 48 -44 -6 -14 146 -54 -100 41 -8 27 -26 -1 34 106 16 43 -61
1607 -61 82 -14 20 51 6 -66 86 -55 -88 -6 -54 -17 84 -14 -66 -2 33 -3 142 91 -107 84 -56 -82 -122 -77
$$ packed form
1406B1n3k7J04Qk5Mo1o5J19k0K3p7O7O2L1q0m1L2j7j5o0M8K4l6L9l9M8O8j83P5
1436b6L3Kn1RJ2o8Q4M2l7J11n6r6Q3J6r2kj0N7j12R1K9MN9j03J22o7j00J01k5
1465A0j5k0Q8j4j42J39k9j6lm9l2Q8o3M6n5MJ5Q2m2j04R4n7P9M6J0l1J07r2r2
1494d8J50j51q2Q4Q8K4j33N2n2P0O7k6m9M5n6N7m8p4O5O0l3k7L6jo6J1r1J10O7
1523D9n5k1j15J44OJ4m1L4j9J0J1K7L5j10k2R5j7p0N9Ln4J23m2M3o7k5l5l5J23
1552D8j11R2L5r5j06N2n5J86J0o1M8oM6o9J1j39J13r9J37J4kl7j28J10m1L1J04
1579H8j02M5j7m9J7k8P4M1p0j13L9J23r2L8qJ60k00m6J41m9L5n3K5L5P2r0K7j04
1607f1J43r6L4L1m5p2J52j41l3Q2m8L7J01r8n2O4L5l6J45n1j98J91j40k6m0M5
$$ plain form
1633 -77 63 -46 96 98 -27 34 28 -8 -11 -15 -38 15 62 -75 -73 -10 -49 98 62 -46 146 69 7 -56 -24 52 18 116 -10
1662 -10 -38 10 -35 -106 -15 -41 61 -46 -126 -19 -63 -44 129 15 67 -30 -15 -37 28 34 0 -32 10 50 129 -45 -56 49
1690 49 -135 -41 -48 -4 81 -8 -16 -54 65 -89 38 -76 17 18 24 -55 38 25 -44 -19 35 15 20 62 -60 38 -31 -42 80
1719 80 47 -36 -47 -37 26 4 49 125 -16 52 -5 -7 -3 45 -44 63 5 7 80 -7 -9 35 103 -96 82 6 -62 -26 97 -71
1749 -71 51 19 -12 10 -59 -1 70 164 -115 -52 -56 25 57 -82 48 0 34 -82 39 -16 -106 4 -42 34 144 94 -26
1776 -26 93 100 -49 -110 55 50 -105 -44 -38 -7 8 -55 46 -43 18 92 -39 21 -11 -48 -94 5 -8 -36 77 -42 37 46
1804 46 -13 13 -32 46 -54 22 -25 -78 58 41 -4 -16 -84 -28 -42 0 -26 3 -47 -58 -20 -59 -71 -56 36 -46 -83 -73 134
1833 134 36 12 41 29 6 94 -39 -104 -80 -16 -55 -105 -13 -19 -15 -24 2 -31 -28 27 8 -81 -116 -55 -42 -57 -75 -25 -68 47 -84
$$ packed form
1633g7J40j09J42Kj25O1ol6lmk3N3M7j37KO3l9J47l6j08J92p7o2o3L2P6l4R8j26
1662a0k8M8m5p1R1k6J02j07q0J07m4J9J73j14N2r7J5k2O5Ol4l2M2M0P9j74j1J05
1690D9j84R4pM4Q5q9ql8J19j54J27j14R3JOp9R3j3o9K5N4k0NM2j22R8o9j1J22
1719H0l3q3j1J0O3k2M5P6j41O8n7kMM8q9J07n8KP3q7kM4O8j99J78p6o8L6J23j68
1749g1J22l2l1K2o9N8P1R4k79O3mQ1L2j39J30m8L4j16J21n5r0J10m6P6J10n0j20
1776b6J19Pj49o1J65nj55O1OL1J5o3J01q9O1P4j31O0l2l7m6R9j3k8J13j19P9R
1804D6n9K6m5P8j00P6m7n3J36j7m5j2o8N6j4M2k6K9n0j1L8l9j2J5R2q2l7J0K07
1833A34r8k4K9j2k3Q8j33o5K4O4l9n0R2oMrK6l3LN5j9q9l5O1J3j5j8N0m3J15j31
$$ plain form
1864 -84 -19 -58 54 14 21 -18 52 8 34 -96 -80 12 63 47 -41 69 -22 42 2 -52 1 79 54 8 32 -44 69 -33
1892 -33 -130 21 -22 -26 -43 -36 70 -34 -34 -46 5 13 -13 -19 -5 105 37 88 -75 20 31 -23 1 23 -86 28 -30 -14 -20 42
1922 42 145 -8 10 56 -124 -84 -28 43 -42 -75 -33 -111 -63 -12 54 -4 112 89 102 107 -25 -50 -6 46 45 25 5 34 -77
1951 -77 -76 -40 -60 10 14 -79 41 -29 34 -32 -49 -62 80 5 1 -6 77 3 -39 43 -60 35 26 -81 24 -110 54 -34 7
1980 7 -57 -216 133 -46 30 47 -17 -44 -55 -7 7 -1 -52 131 -97 -112 -32 57 -53 -142 60 -121 43 -37 96 16
2006 16 4 -12 -125 -91 -127 74 75 84 56 26 -22 11 -72 177 30 22 -28 -81 -10 -61 -59 -16 -93 -88 169 -1 -39 5 4 -75
2036 -75 -79 -9 -3 -61 59 -20 1 41 21 111 55 -86 -54 -81 51 47 52 -11 32 11 -12 151 47 -74 -56 61 -38 22 45
2065 45 -14 88 -42 -17 -94 50 13 31 35 38 31 -36 -37 -9 101 -71 -28 -46 -94 -41 -69 30 8 -101 6 58 -18 36 90
$$ packed form
1864h4O5l9J12m0Pl9P0m4K6j30J6R2N1j6q8J10r1O4m0n4N3P8k5m6K4p6J13j02
1892c3r7J51m3mj7PJ06j04%j2N1Qk6oJ4J10o8N1j63R5J1n4K4K2j09J14n8J6oO2
1922D2J03j53J8M6j80M0N6P1q5l3M2p8M8N1O6n8J16k3J3Nj32k5M4N2jk0k0K9j11
1951g7JL6k0P0Mr3J20p0O3o6j7j3J42p5mpQ3p4m2Q2j03R5rj07J05j34J64q8M1
1980Go4j59L49j79P6J7o4k7j1M8J4qn1J83k28j5Q0Q9j10q9K02j81J64q0J33q0
2006A6j2j6j13L4l6K01JRk8l0m8L3q3K49j47qn0n3P1n1KM3p7NK57j70l8M4jp9
2036g5mP0On8J20p9K1M0k0R0n6j41L2k7J32mNo3M3k1k3J63j04j21J8J17r9O0K3
2065D5n9J02j30K5p7J44l7J8MLpo7jK8J10j72M3j8m8N3k8R9k2j09J07N2p6N4N4
$$ plain form
2094 90 -36 33 75 -28 -11 77 8 57 15 49 -49 21 48 -45 19 -32 12 -11 -41 -64 29 8 -12 50 61 -109 -7 61
2122 61 -44 -22 -50 -155 -29 -72 -33 60 32 -2 -56 60 13 -53 -93 19 158 -29 56 -3 -161 66 -37 58 39
2147 39 4 -14 40 -27 31 47 -46 -23 44 -90 6 23 44 37 -14 66 15 -102 164 120 -4 58 -33 95 44 -83 43
2174 43 -87 29 -67 -51 19 -18 81 -80 13 -84 -61 -48 -38 38 -15 25 10 69 -30 -85 18 99 -32 6 72 103 -83
2201 -83 -68 46 5 -39 -45 62 -4 -186 -28 -60 32 -115 12 94 -52 -59 63 -24 102 -58 -43 -64 -74 117 -44
2226 -44 -74 -70 -68 -25 -19 -35 -11 -61 34 -94 61 -4 -109 4 -146 -27 -154 -90 -74 -42 -17 -63 29 23 69 40 -73 -18
2254 -18 -10 -163 -21 -58 -19 52 5 -59 -10 86 -25 110 -114 -57 117 -7 90 28 44 -26 -32 -111 -37 -88 -34 -28 44 161
2282 161 -29 2 -154 13 -25 37 -33 -50 -116 -15 -25 -9 -32 88 -73 22 -103 21 -36 -53 37 -29 12 81 62 -32
$$ packed form
2094I0j26O9M2j03J7Q8o9M9m2L4r8P0K7r3O4n1M4k3l0k3R3k1k0O2J1j70J02O8
2122F1j05K2k8j05J26m3L9R3k8l4n4J16m7o6m0J12J39j87Q5n9j58K27j03R5j9
2147C9l5j8N4o7N8J6r3K3O7j34R6J7K1pn1Q0n1j17K66m4j24O2r1J28n1j27J26
2174D3j30J16r6J6P0l7R9j61R3r7K3J3J0P6n3M0j5N9r9n5J03Q1j31L8O6L1j86
2201h3J5J14m1m4oJ07o6j82J58l2R2j47J27Q2j46pJ22q7J26j60J5k1j0J91j61
2226d4l0MKM3Oj6K4n0R5j28J55o5j05J13j50J19j27O4J6L2K5m6R2oM6k9j13N5
2254a8Qj53J42l7L9P1m7o4M9R6j11J35k24N7J74j24R7o2J6p0op9P4n1N4OP2J17
2282A61j90L1j56J67l8O2p0j7o6J01j0J6k3J20j61R5j25J24n7j7R0o6M1O9j9r4
$$ plain form
2308 -32 -36 -10 100 -4 -73 37 57 38 -52 32 72 43 90 31 30 -32 24 -3 0 -3 -89 70 -119 -97 -106 38 97 -15 65
2337 65 67 -40 -21 -27 -58 76 -73 -44 3 -120 12 -29 15 4 26 1 39 108 8 81 69 67 29 -59 -17 -23 -98 -7 -57
2366 -57 53 -42 -98 35 19 -30 -36 -18 -43 -37 -103 73 5 -109 37 79 6 -53 -72 -24 65 -14 -76 -43 -21 -14 64 44 48 -28
2396 -28 -42 -11 -36 -21 18 -11 -26 -27 -38 -29 -66 6 -120 -45 -3 -11 3 -15 -21 -40 -25 -121 -50 40 -43 -5 15 -75 -5 0 71 63 -56
2429 -56 21 -105 78 25 -91 -9 30 35 44 31 -72 70 -20 82 -34 -14 63 54 115 49 28 -136 68 -95 103 -8
2455 -8 25 20 -57 86 -60 -72 -67 -75 82 11 109 21 -112 -61 3 80 16 -30 -43 -56 93 11 -118 43 -32 31 36 -24 104
2484 104 -72 -48 8 118 99 15 -42 84 25 -41 -89 -28 -74 19 -1 -126 -81 -91 -18 23 57 -11 -48 51 -15 31 -29 -56
2512 -56 1 -39 35 28 -5 -52 0 30 -30 -109 26 70 81 27 112 -121 18 -16 31 -28 -26 1 -12 23 -21 -18 97 -12 -162
$$ packed form
2308c2mK6J10j04o9J10K0j9r0Q4M0k9M7n9jo2N6k7Llq6J59j89K2rJ44N9j12Q0
2337F5Kj07J9ol1J34j49K9M7j23J32m1M4j1K2k5L8O9j00P3j2kl8q8M2op5R1n0
2366e7J10r5n6J33j6m9oJ8k5Oo6J76o8j14J46M2p3n9j9M8Q9p9o2L3K2PP8k0Mp6
2396b8j4L1k5J5L9k9j5jj1Rl7P2j26P5M2qJ4j8oj9J5r6P1R0q3L8K0r0P0NP1qj19
2429e6P7j26J83n3j16Q2L9NRj3j03J42r0J02j16K0P7rO1o6k1j64K04j63J98j11
2455hL3np7J43j46j2NqJ57p1R8q8j33N1O4P7o4m6j3j3J49q2j29J61p5O3No0J28
2484A04j76K4N6J10j9q4n7J26n9o6m8O1m6R3k0j25M5j0P3M1L4o8l7R9o6M6o0k7
2512e6N7m0P4pl3m7N2L0o0p9J35M4J1n4Q5k33J39l4M7n9KK7j3L5m4LJ15j09j50
$$ plain form
2541 -162 9 32 36 72 -74 38 125 -22 -127 -87 60 -21 54 -44 -5 64 27 -61 13 -22 -58 31 89 -28 -26 96 -32
2568 -32 -19 -10 42 29 34 -35 48 48 -14 52 -116 -31 -3 -41 124 69 18 7 -159 -45 12 -32 -58 -50 16 2 -70 47 23 -6
2598 -6 58 43 -95 -36 -105 -82 61 41 3 -37 -35 -11 60 67 19 -17 -54 92 193 -4 -10 -3 41 -6 25 57 -103 20 -18
2627 -18 61 -24 -34 8 81 -44 -96 2 36 -61 -58 -18 66 -47 -15 -20 -4 -65 -35 -53 6 -35 19 -80 -34 99 64 45 -12 -19
2657 -19 -46 -35 21 -28 48 -20 -23 67 -25 -30 -12 -125 18 11 25 23 16 -38 -26 74 -53 6 -183 -12 152 -13 -14 18 9 -75
2687 -75 -96 -36 -8 0 5 27 -7 -16 -101 2 30 5 109 -31 -74 12 20 56 64 58 16 13 89 -64 50 -20 23 13 -70 -48 5
2718 5 19 -30 -21 -1 -105 100 -9 62 -37 -39 102 -27 12 23 57 33 -19 57 -9 60 73 75 -34 -2 -45 106 54 -21 73
2747 73 85 16 -142 -6 7 43 -50 135 -4 22 1 2 -39 -41 -136 49 -64 -11 -76 85 26 -48 -59 13 -113 -101 -44
$$ packed form
2541a62J71K3ML6j46J12Q7j47j05M0J47q1P5r8L9O9l7q8P4l5l6Q9N8j17KJ22j28
2568c2J3RN2j3No9Q3%o2O6j68Q5K8l8J65n5n1j1j66J14N7m4k6QO6j4p2J17k4k9
2598fO4j5j38N9o9K3J43k0l8m0KK4P1Pm8l6l7J46J01j97oPM4m7L1L2j60J23l8
2627a8P9q5j0M2P3j25n2R8L4r7LM0Q4j13L2nJ6o1L0j8N9m1N4r9M6J33l5j9n7p
2657a9k7J1N6m9P6o8lR0r2nJ8j13J43pJ4kpn4J2J00j27N9j89J71J64j65jL2rq4
2687g5k1O0K8QNK2l4rq5J03K8k5J04j40m3Q6QL6Qom2lP6j53J14p0M3j0q3K2N3
2718EJ4m9RK0j04K05j09P1r9kJ41j29L9J1L4k4n2P6o6O9J3Kj09L2m3J51n2p5R4
2747G3J2o9j58J36J3L6r3J85j39K6k1Jm1kr5J85j13N3o5J61n9p4j1P2j26J2N7
$$ plain form
2774 -44 -3 -4 6 38 3 109 58 -30 127 97 -96 -27 -18 4 34 62 -78 60 26 9 -41 -4 -9 52 44 -127 -62 -66 -42 -50
2804 -50 20 107 -1 79 111 26 55 -68 -13 0 -50 78 98 12 -42 30 -124 34 -61 -35 61 53 -70 26 36 26 62 -5
2832 -5 1 -3 8 -29 -43 0 -58 51 -15 -22 -27 -17 20 129 0 74 107 -37 -62 20 -106 -137 -44 -19 9 24 56 65 -37 38
2862 38 45 -47 26 -5 -59 -61 -89 34 83 -9 -15 42 19 50 1 -39 -34 28 -53 42 -98 32 42 68 59 16 -9 54 -84 42
2892 42 -74 46 43 -37 -74 -59 -14 -43 -83 -4 37 -103 90 60 3 -80 19 10 129 6 35 26 33 85 135 6 43 24 1
2921 1 -110 18 -57 -61 -71 56 -21 -40 -14 38 -44 20 68 -71 -34 11 -44 -44 -31 -5 68 11 14 51 -65 -59 -2 -46 51 46 -31
2952 -31 6 -78 116 51 7 49 11 0 -107 -33 41 57 -49 4 58 -25 -98 -74 -35 12 -35 -61 -6 -4 73 89 -112 62
2980 62 -62 120 -93 20 58 103 79 -60 55 7 -28 58 92 140 104 28 3 34 -66 -4 26 60 -63 -6 -45 -131
$$ packed form
2774d4M1jJ0L2l5J06n1q8J57l0j93O9RK2L0K8j40J38l4j7n0L7nO1qj71O5mK4q
2804e0P0Q7j08Q0L2q5K9j23N5J3n0J28K0q6n4P2j54J58r5K6R6qj23R6J0j0L6o7
2832eOmJ1l7j4M3n8J09o6pnJ0L7J09j29P4L3j44k5Q2j26l1R3K5K8J5L2Rj02P5
2862C8Pr2P3l1n4kk8J23M9r2oN7k3L1m9m0NO2q1R5j40J30J0K6rm3k5O3j38J26
2892D2j16J20lq0l7J5M5k9m0P9M1j40J93l0n7q3R9rJ19j23K9rPN2N0j29L7j9k3
2921Aj11J28p5mj0J27p7j9K6N2q2O4M8j39L7M5n5%J3K6P3n7LL7j16ON7m4R7np7
2952c1L7q4J94o5m4M2l8j1j07P4P4J6j06N3N4q3p3K4L9M7m7k6N5KP7J6k01J74
2980F2j24J82k13J13L8M5k4j39J15m8l5Q6L4M8l6p6k5L1j00O2L0L4j23N7l9q6
$$ plain form
3006 -131 -62 7 -210 -51 24 -62 0 -10 -22 -43 -101 -53 55 124 11 127 -54 61 43 90 39 10 55 50 57 106 5
3033 5 37 13 1 -57 10 41 19 28 9 62 68 -8 10 -8 -32 -4 72 14 23 110 17 25 24 -55 -111 1 -54 68 18 -93 -90 80
3065 80 -50 19 -86 10 80 -32 -3 55 -39 51 -31 41 -32 -25 -44 71 4 1 25 115 58 71 -14 7 -31 -45 6 14 -22 30
3095 30 -90 -16 -48 2 -59 -76 3 -73 1 -74 105 102 -15 -28 -74 118 36 77 -80 -73 -57 41 17 46 -51 96 -37 -116
3123 -116 -105 -41 -92 -65 -59 -123 -17 0 130 -56 -18 16 -47 -58 9 -123 69 24 74 3 14 -102 26 36 86 23 10
3150 10 -13 32 -76 21 103 36 -74 148 48 -33 149 100 -50 -11 -3 -121 -41 100 17 4 73 -32 77 92 -10
3175 -10 23 -60 -132 -88 15 -76 -54 13 11 -8 -32 -60 105 62 25 37 51 -1 -54 -88 -72 -6 68 84 44 -67 -41 -5 168
3204 168 50 49 -28 34 -14 -15 15 5 -42 -32 37 -46 -56 18 -85 -100 -61 55 60 -82 -37 81 -87 -14 2 71 1 -36
$$ packed form
3006a31O9O9k17J59P5q6O2j0j2k1n8M8J08O9j13J16j81J15j8M7n1k9M5nPM9j01
3033EL2k4j2n8O7L1k2Rj9N3Op6J8j8k4K8P6n8RQ7r3Qjp9n6J12n5J22n0j11LJ70
3065H0j30O9j05R6P0j12K9N8r4R0q2P2p3Pj9J15o7lK4R0n7J3q5K1l8j4N1Ql6N2
3095C0j20P4l2N0o1j7P9p6P4p5J79lj17j3m6J92q2M1j57PJ6R8k4K9r7J47j33p9
3123a16J1O4n1K7Oo4J06J7J30j86L8L4o3j1O7j32J92m5N0p1J1j16J28J0N0o3j3
3150A0k3M5j08R7Q2o7j10K22j00q1J82m9j50L9Qj18Q0J41q3j3O9j05J09J5j02
3175a0L3q3p2M4J03r1K2O7kj9k4k8J65m3l7J2J4n2n3l4J6O6P4J6m0j11K6L6J73
3204A68j18jp7O2m8jL0j0m7J0O9q3j0P4j03j5L9J16Nj42M5J18j68P3J6O9p0l7
$$ plain form
3232 -36 68 63 33 58 91 60 -41 22 -42 138 17 -113 0 36 -23 -30 69 -64 0 130 66 36 44 -13 54 -125 -153
3259 -153 -39 -25 47 -1 -5 -62 12 -92 115 -38 -2 -15 15 -94 177 143 -52 34 -9 -8 22 6 107 -11 -32 53
3285 53 13 -5 73 -99 76 45 -60 -50 11 -39 43 -19 4 -10 -98 131 49 -59 -118 26 45 49 3 -97 13 -26 -25
3312 -25 133 -42 -47 -40 -43 41 -66 64 -4 7 -90 8 -64 -100 93 28 14 -7 86 94 28 20 -16 -35 3 -66 17 37 0 25
3342 25 -22 41 -72 62 -7 -2 -10 -18 25 -4 -21 23 28 22 83 -175 18 84 -57 -83 -102 70 -71 1 116 19 71 25 -17
3371 -17 55 2 98 34 15 59 40 60 20 -21 -59 81 87 -165 82 -3 -88 -14 26 25 38 -97 15 -28 -17 -27 -91 24
3399 24 -38 -55 55 57 -38 -47 -20 -4 -103 22 58 -6 -51 -10 18 -35 -14 30 124 114 -34 60 -31 0 -126 -73 8 14 -77 15
3429 15 33 186 -15 74 -68 -38 13 -59 -3 0 -6 24 -78 -23 -20 21 47 -66 44 -67 107 44 26 -19 123 -38 -36
$$ packed form
3232c6J04nl0K5L3l1j01O3o4J80j21j30J13L6n9pR9j33O4J30o4l0Qn7O7j79k8
3259a53J14J4P2m8mn7P4j04K07j53L6j3L0j09K71l4j95Q6m3JL0j6J01j18k1Q5
3285E3m0j8P8j72J75l1j05J0O1n0Q2o2K3j4q8K29q2j08n9J44J9Mm6j00J10l9J
3312b5J58j75nPlQ4j07J30o8J1r7R8p2l6J93o5j4k1R3Qo6ql6j9L8o9Q3K0l7K5
3342B5m7O3j13J34o9NqqM3k9j7M4NoO1k58J93O6j41k6j9J72j41P2J15r7N2m6m2
3371a7P2n3R6o4j9M4j9K0m0m1l8J40Ok52K47q5q5P4M0jJ3j35J12m3J1j0o4J15
3399B4o2j7J10Kr5rK7J6r9J25L6o4m5M1K8n3K1M4R4j0j48R4r1L1j26N3Q1Or1R2
3429A5J8J53k01Q9j42L0N1p2N6LoL0j02N5LM1K6j13J10j11J74o3j8m5J42j61K
$$ plain form
3456 -36 0 -58 67 -66 13 21 27 -39 66 -107 -9 68 -33 -22 20 91 -2 -4 -8 16 2 -11 -17 74 -5 107 46 -44 -60 55
3486 55 -109 5 10 -49 48 31 -4 -48 18 45 32 -7 38 -63 -8 31 53 -24 53 -27 -122 -62 -34 72 40 -4 11 -23 84
3515 84 -44 3 7 -9 13 42 -16 -70 96 63 60 -3 -94 -123 -79 7 -55 -5 6 -49 1 67 20 -45 -66 72 123 57 166
3544 166 -112 66 -67 134 -74 -37 113 -61 85 -11 -35 -37 -16 97 -32 -63 -18 -70 -20 -95 -24 -39 -124 8 -25
3569 -25 8 55 -100 47 -12 59 5 -58 52 -77 -58 -39 59 56 15 40 -41 18 26 -107 -148 53 21 4 40 11 -60 52
3597 52 60 25 -72 51 -48 -1 47 -110 -33 -8 44 17 -118 18 -20 -16 -38 105 38 -5 59 -34 -42 -27 49 18 -49 -46 8 42
3627 42 -36 16 -53 117 -15 -35 36 84 5 -90 27 -66 44 9 6 13 -75 -7 60 -25 -21 36 5 27 24 -15 -3 -66 52 -108
3657 -108 124 -47 -29 -11 94 -11 40 -30 -50 -49 64 -92 16 7 87 -47 10 31 20 31 56 21 3 -17 67 -107
$$ packed form
3456c6L6n8J25j33P9QOo6J05j73R8P7j01J1M2P1r3kmK4j4j3oR1p9J12o1r0j6J15
3486E5j64J14Nn9R7j7l5m4O6K7j3l9M5j01N5L9K2p7P7q0r5O0K8J06l2m4J5l4J07
3515H4j28M7Mj6K2K9n8n4J66l3lo3r1k9M4Q6o2N0J1n5N0O6m7o5k1J38N1o6J09
3544A66k78J78j33K01k08L7J50j74J46r6k4kK1J13j29l1M5n2N0p5P1j5q5J32l3
3569b5L3M7j55J47n9P1n4o3J10j29J9J9R8lm1K5q1N9Qj33m1K01l2j7L6k9p1J12
3597E2Ql5r7J23r9M7M8j57P7K5N2k7j35J36l8Mk2J43o7m3O4r3qJ5P6l1o7LN4L4
3627D2p8N2o9J70j32k0P1M8p9r5J17r3J10l5lPq8O8O7q5MN7l1K2ll9J2o3J18j60
3657a08K32j71J8J8J05j05N1p0k0JJ13j56J08rQ0j34N7K1j1J1K5l5j8k0Q4j74
$$ plain form
3683 -107 -29 -69 -25 -9 36 -45 -165 -56 -43 50 -77 -63 -41 -52 -63 -13 24 31 -10 22 -45 -10 31 -57 -19 -66 -2 -43 48
3712 48 65 90 70 -30 41 -56 -2 23 -35 75 -78 -9 40 61 -50 15 -74 -52 -4 -71 162 -14 -44 154 59 -7 38
3739 38 -1 19 -2 -24 -30 -26 -115 -7 -15 35 41 -21 13 106 139 -38 -57 -97 55 11 -18 -17 58 -16 -64 -34 -70 55 3 10 13 -110
3771 -110 -56 58 -9 -37 -38 17 -45 -13 0 -3 82 -25 15 18 -22 34 -26 -58 -2 100 -21 107 0 8 -6 -25 -94 25
3799 25 -18 -41 29 9 -85 10 47 -120 38 -11 -21 -9 80 -41 -114 1 -15 -14 83 85 -38 -56 140 -78 105 -45 -1
3826 -1 -21 -101 -7 96 42 17 -37 -20 -1 149 -147 64 0 25 56 -11 80 25 16 -35 -6 20 -3 5 -2 1 -9 1 68 -32
3856 -32 83 71 18 -29 -45 17 74 63 39 -34 -39 89 -123 -31 31 -5 -50 -67 -9 -14 -13 53 71 55 29 18 -6 14 83 -93
3886 -93 6 26 -61 58 -68 61 20 100 -78 -21 44 16 -34 -127 123 33 32 -20 -25 -54 14 56 -33 34 -1 44 -42 -9 102
$$ packed form
3683a07P8m0M4J6M5q1j20J09J3R3j27J4K2j1j1N0L7Pm1L2o7L5M1q8L8m7O4m1R1
3712D8J7K5k0j00P1r7N4K5n8J10j53O9M9K1j11O5q9K2M8o7K33j76l0J98r5o6M5
3739C8l9K0k1k2oMq9J08qN0Oo2L4R3L3j77j9m0J52m4k9JP5p4m8L0l6J25n2PLj23
3771a10N4J14o7k8jN5o2L2J3lQ5j07M0Lm0N6o0l2N6J02j21J28j07Qj4j9o9J19
3799B5m3k3P0k0r4R5L7j67J58m9j0J2Q9j21p3J15j6JR7Kj23j8J96k18J83j50M4
3826ak0q0R4J03n4k5n4J7J9J50k96K11o4K5L1o7R1n5rn1K9K6k3QpLj0J0O7j00
3856c2J15j2n3m7j6O2N7j1k4p3nJ28k12R2O2l6m5j7N8nJO6J8j6k6j1k4K0O9j76
3886i3R9K0q7J19j26J29m1Q0j78N7O5k8n0r3K50r0jn2nk9O8M2q9O7l5M5q6L3J11
$$ plain form
3915 102 15 40 26 94 -104 31 -94 -88 108 -13 38 -17 -109 91 45 44 -23 45 -32 4 -72 -46 9 86 -87 -53 -132
3942 -132 -79 18 -80 60 -116 -107 -43 31 35 46 -80 -45 -56 16 5 122 -52 14 -41 -12 -52 53 13 -10 -56 -98 -32 17
3970 17 76 55 15 42 92 -58 -63 13 -48 -61 -9 -35 -15 -14 -74 -38 -16 -47 -101 -115 27 -53 -85 -31 36 -90 5 -34 106
3999 106 -43 37 5 -68 44 -60 -67 -76 45 58 71 33 46 0 -15 -47 3 99 22 -31 -2 -16 110 5 67 11 -46 -67
4027 -67 33 -33 -25 -27 12 -26 28 -121 3 -28 45 20 -36 -25 22 88 11 -55 34 -41 52 112 -8 12 145 59 1 -4 22
4056 22 -18 -104 79 -8 -78 -1 -45 69 -11 1 -8 -6 -77 -6 81 -64 51 93 36 -73 47 32 -31 -12 -39 -25 -20 96
4084 96 -70 -20 -2 0 71 55 -33 -34 -32 43 -128 8 19 -1 39 -43 -38 24 39 -2 84 -76 -101 14 -130 -76 29 -94
4112 -94 -90 2 -108 -28 69 -11 28 46 -54 -16 36 -110 -87 0 29 -25 7 60 26 -32 -36 44 -7 -29 -9 36 -11 -54 -31 -30
$$ packed form
3915A02q7K5j4O8j98J35j25OJ96j21N1n5r2K00m6jo7O8p7L6p6K6N5P7j73L4p9
3942a32N3R7r8J40j76RO4P4MJ1j26L5j1P2j1J17j74O6n5K9m0J05m0k3m6m2O6M9
3970A7N9k1m0K7N0j50nP6o1j3N2k6K0Jo0L6K2l1n4j4J42q0l2N4O7j26R5l9J40
3999A06j49Q0l2p3J12j04prJ21J3J3l8J3m6j5l2N0R6p7n3K9j4J26j05O2n6n7k1
4027f7J00o6QkL9l8N4j49J24l1P3k5n6J1M7O6p7o6Q9p5R3O0j20K0J33q6n8nK6
4056B2m0q6J83q7p0P7m4J14q0J2rKp1P1Q7j45J15M2n7j09J20j5o3J9k7J4NJ16
4084I6j66N0J8KP1j6q8jKP5j71J36J1k0M0q2NO2J5m1Q6j60k5J15j44N4J05j23
4112i4MR2j10Q0R7q0L9J8j00L8N2j46K3Q7K9n4L2N3l4n8mQ0n1k2K0M5m7m3K3J
$$ plain form
4142 -30 -33 -42 99 66 5 -33 -13 -63 -60 -72 56 -25 -25 -9 2 -17 -62 -65 14 -50 -61 -153 40 15 77 75 -108 -14 99 -68
4172 -68 53 22 -33 -28 -17 18 -25 30 -14 60 -26 -62 47 16 70 30 -16 -76 17 5 -26 -125 -49 47 -58 -78 -81 -97 -62 -98
4202 -98 -22 -50 56 55 -12 -122 -131 -51 -6 -73 -107 34 1 52 -38 50 31 -39 15 -119 -50 71 60 -18 -7 57 -13 -50 134
4231 134 127 3 -125 -53 -74 -23 28 9 25 53 -78 -68 62 -34 30 -52 -41 52 42 -41 -28 -89 141 -37 -40 0 -27 18
4259 18 -3 16 -22 -13 -34 12 101 -89 36 65 67 52 46 45 -49 15 82 -85 44 -70 18 5 -94 -19 65 30 -81 20 -150
4288 -150 85 -16 -4 -19 -40 -91 13 4 -18 5 -6 78 136 -50 -71 12 8 -28 64 33 -8 -38 98 -82 -30 92 -2
4315 -2 100 -64 -13 5 -23 31 -10 55 10 -122 -3 -20 -44 21 68 32 -59 98 -3 43 100 83 139 -12 17 18 -46 -5
4343 -5 113 -55 87 3 -82 14 105 112 88 -87 -31 -32 10 121 2 -106 127 11 3 76 -52 -86 72 10 2 -80 99
$$ packed form
4142c0lrJ41l3o1l8K0n0Lj2J28q1%J6J1j9m5lP9o4j1r2J93k5O2kj83R4J13j67
4172f8J21l1n5NJ1L5m3N5m4P4q6l6J09l1N4m0m6o0R3j2l1r9P6R6j05k0lj6L5l6
4202i8P6k8J06jo7j10rQ0M5o7l4J41l3N1r0Q8j9p0N4j34O9J21j1p8J1O4p0l7J84
4231A34pj24j28P2k1N1N1j9J6K8j31J0J30r6O4q2J1R3j0q3J3o1K30j78lM0k7M5
4259A8k1J9l8Rk1M6Q9j90J25K9Kj5ojr4O4O7j67J29j14Q8j3r9P5Q4l5j11J01j70
4288a50K35j01J2j5k1n1J04rk2K3j1Q4N8j86k1Q3ml6R2l1m1l0J36j80N2J22r4
4315bJ02j64N1J8k8N4m1O5m5j32J19j7k4O5M7l6r1J57j01M6N7j7N6j51K9Jo4M1
4343eJ18j68J42q4q5R6R1Pk4j75N6jM2J11j19j08K33j16qP3j28l4J58o2qq2J79
$$ plain form
4370 99 -27 136 -118 -55 -65 -26 94 92 6 -4 29 92 -4 3 -29 -19 -9 -4 -54 20 57 54 24 42 -58 87 47 -131 -43
4399 -43 13 -10 -2 -40 24 58 -115 -64 11 100 -142 60 60 -53 18 5 -77 -14 -37 24 78 4 -66 23 61 50 30 -90 -45
4428 -45 32 35 -31 6 -50 26 52 -7 9 115 -16 -8 -26 79 -39 55 83 93 -60 -3 -50 -13 11 -82 -65 -94 27 10
4456 10 12 -117 -21 -46 -135 -34 -44 -33 -36 -59 -108 22 -37 -107 -61 52 36 48 52 24 90 5 -22 -5 38 -49 53 -42 41
4485 41 -27 57 -26 8 8 -57 -36 -55 21 -130 111 71 67 -49 -18 63 -15 -97 -36 150 -21 61 -91 -83 -135 -60 -23 -33 100
4514 100 -64 61 -57 36 57 45 92 23 5 -47 20 -34 58 -87 100 -65 -92 14 -2 1 37 -15 -14 -89 35 70 -35
4541 -35 -144 79 -23 -54 39 69 -25 -24 82 80 -57 -50 -37 -22 73 -27 -131 47 -44 -90 -27 28 -36 -50 38 80 32 24
4569 24 9 -2 -22 18 2 30 42 -31 -16 34 24 -100 10 -63 -34 -3 -137 -44 -35 30 45 -39 -77 -8 -43 59 34 -37 -37
$$ packed form
4370I9j26J63k54O3j0L9J20kq6j0L3O3r6Pl2J0J0Nn0P4L7ll0J8j00J45m0j78Q8
4399d3N6k3Ql8O4L4j73N1P5Q9k42K02%j13P1j3q2O3k3O1N4p4p0Q9L8j1k0j20M5
4428d5P7Lo6L7n6P6K6n9J6J06j31Qj8J05j18R4K8J0j53N7m7L7K4r3J7k9J21j7
4456A0Kj29R6k5q9J01j0J1lk3m9J30n9p0M6J13j6J2Mk8O6q5k7J7M3q7J02r5Q3
4485D1o8Q4q3L4%o5K1j9P6j51K41m0mj16L1Q1p8q2O1J86j71Q2j52Qn2P5L7j0J33
4514A00j64J25j18R3K1j2M7o9j8n2O7n4R2j45J87j65k7J06j6LL6n2Jp5J24L5j05
4541c5j09K23j02l1R3L0r4JJ06kj37PJ3J5R5j00j04J78r1m6O3N5o4j4Q8M2m8q
4569B4j5j1k0M0j6K8J2p3J5N0j0j24J10p3K9L1j34R3RO5J5q4l8O9l5J02k5p1%
$$ plain form
4598 -37 -21 44 -110 84 141 -6 16 69 -58 -57 -21 -56 75 -16 83 41 28 -47 -8 103 -47 34 -13 22 -80 20
4624 20 -59 24 20 72 133 35 42 -53 41 -7 -28 -20 99 -109 -94 27 -10 -12 197 39 -9 -5 -69 -33 9 25 38 120 27 0
4654 0 5 15 -101 87 -6 -55 -30 -16 -37 -78 27 -182 -59 1 29 -40 49 0 -43 -161 -144 91 69 37 85 -23 -35
4681 -35 92 36 -19 67 3 -68 82 -4 41 -37 11 29 -50 136 0 6 10 -146 34 -69 -57 -69 -65 -44 -84 -55 22 -10
4709 -10 -48 -59 -35 -78 -46 -25 -23 -22 33 -134 -41 76 35 52 90 -105 116 5 18 13 88 43 -2 -12 91 3 -69 72
4737 72 63 15 57 61 31 -57 87 -68 72 18 -37 -43 -4 90 -70 106 -60 -63 39 74 -150 43 117 4 -77 13 -66
4764 -66 -24 -68 64 -77 -44 5 -84 229 -15 76 85 108 72 -15 -49 -34 61 -89 -21 6 -46 103 -63 76 34 -127
4790 -127 1 -62 -81 77 29 19 95 55 23 -40 5 1 -40 41 -20 -34 -25 -14 -28 29 -39 23 -53 12 50 46 31 -26 -26 -30 -42
$$ packed form
4598c7J6O5j54J94N7j47K2N3j27JL6l5J31r1R9m2j3p5L9J11j50Q1m7L5j02J00
4624B0p9Q3mN2O1r8Pr5R4m8k1QJ19k08J5J21l7kK09j58m8Mo4L6M2J6J3Q2r3k7
4654@NJ0j16J88r3m9K5J4k1m1J05k09J23O0K8o9Q9m9m3j18J7K35k2l2M8j08j2
4681c5J27n6n5Q6o4p1J50q6M5p8M8J8p9J86j36OMj56J80j03J2j2MK1m0K9P7l2
4709a0l8j1K4m3L2K1KJN5j67R3J17m1J7L8j95K21j11J3nP5m5m5j0J03q8p2J41
4737G2rm8M2Ml0q8J44j55J40n4n5oL9R4j60J76j66lJ02L5k24J93P4j13q1R0p9
4764f6M2m4J32j41L3M9q9L13k44R1RK3l6q7l4J5R5j50O8K7n2J49j66J39m2j61
4790a27J28o3j9J58m8j0P6m0l2o3M5mm1Q1o1j4RJ1j4N7o8O2p6O5L8mj5n7%mj2
$$ plain form
4821 -42 16 140 54 -2 -58 66 20 -97 43 39 -48 21 17 36 -81 -49 -30 13 -52 -55 -5 29 45 123 -53 -63 92 111
4849 111 -91 59 -65 -64 -39 2 53 55 -19 -45 28 50 61 -37 9 0 25 88 -117 -15 -46 22 31 26 -27 -90 94 -113 45
4878 45 7 -2 -33 -62 110 -12 3 -112 -101 137 -74 -2 2 107 38 18 53 -99 42 -51 61 34 93 -53 -55 -1 -25
4905 -25 -64 47 -95 62 -50 57 -49 -28 114 -89 96 -50 -104 -40 59 0 47 -33 11 -23 18 -27 -67 -112 -32
4930 -32 17 -167 74 42 43 -47 54 -25 108 39 13 26 35 39 -22 29 -13 50 129 -50 -10 -15 24 7 47 -61 -24 -38 -24
4959 -24 -47 48 -61 -62 25 -34 -40 70 -63 -22 -1 23 -54 56 -71 -2 63 -10 -58 21 21 6 -28 -13 -1 30 128 85 -59
4988 -59 -28 -61 45 18 -22 -90 -30 54 27 -118 -9 14 48 48 -66 10 -88 9 -78 -60 -55 76 1 74 59 27 7 -5 -7
5017 -7 -1 -128 78 -8 9 -1 175 -6 67 34 -28 43 -12 26 -5 -65 -8 -95 -8 23 -38 -74 35 75 24 51 -40 24 -62
$$ packed form
4821d2N8J24q6n6n6J24m6j17J40mq7O9mJ9j17L2J9M3o5lN0L4J6P8j76j0J55J9
4849A11k02J50j24JK5M1N1Kp4k6P3K2J1r8M6rK5O3k05J02l1O8Rnn3o3J84k07J58
4878D5l8rl1k9J72j22J5j15J1K38k11P2MJ05o9k0L5j52J41r3J12k7N9j46kN4k4
4905b5l9J11j42J57j12J07j06K1J42k03J85j46n4O4R9n9M7q0M4l4M1m5m0m5Q0
4930c2M9j84K41l2Jr0J01p9J33o9k6J3RMo1N1m2O3P9j79M0nL9j7M0j08L7j4J4
4959b4k3R5j09jQ7n9oJ10j33M1K1K4p7J10j27O9O5p3m8P9%j5l4J5J2L1R8m3j44
4988e9L1l3J06k7m0o8O0Q4k7j45J09K3L4%j14P6r8R7q7J8NJ31p5P3j5l2k0j2k
5017gOj27K06q6J7j0J76j81P3l3o2P1n5L8l1o0N7q7Q7L1o1l6J09M0n1K7r1O4q6
$$ plain form
5046 -62 -14 19 -40 -37 36 -26 -28 -42 90 71 -34 -50 -29 -15 -12 -55 -8 -50 -40 -32 -7 86 -51 -28 22 49 54 -1 72 -17 53
5077 53 50 73 31 32 -5 -2 42 15 -101 31 -60 103 -44 -104 -74 -73 18 65 -47 -39 -139 -59 16 39 71 -92 21 -95
5105 -95 70 -74 -22 8 -56 -77 48 116 -37 65 39 -41 55 3 -69 -12 65 9 31 14 -42 -59 49 -20 -86 37 -66
5132 -66 17 -27 -127 70 -66 22 -32 -129 -50 -140 -23 6 32 -62 3 31 16 -69 88 -6 -67 -19 -166 30 16 -58 -23
5159 -23 51 -46 80 -50 3 -25 45 -33 -107 31 66 -60 14 108 -85 64 -103 -27 59 -52 -76 -19 -49 5 53 -42
5185 -42 41 34 150 -51 -49 -46 -8 -4 -53 12 -12 -27 74 59 22 -9 135 -125 44 27 -24 22 35 33 78 57 -15 16 48 -10
5215 -10 3 -19 9 -29 11 53 -9 -43 -5 -12 -35 -114 -72 23 -34 8 -15 37 45 -13 54 14 73 26 105 81 -48 5 36 -63 43
5246 43 -38 -35 -10 62 48 -47 22 -47 -39 -39 -38 32 -84 -32 -28 -83 86 73 -30 23 58 -143 -5 -73 -26 -119 1 39 139
$$ packed form
5046f2M8L3n9LP3o2kj4J32j9j05j6K1J4Lm3M7m2J0QK5R3j37K3N0K7Nn5P3q9P0
5077E3lK3m2Jl7LM4k7j16J32r1J63j47o0L0JR1M7j12Qj00Q0P5K3L2j63J13j16
5105i5J65j44N2L0o4k1J25O8j53J02k6q0R6n2p2N7P7n6K2j7n6j7J08o9o6J23j03
5132f6Q3m4j00J97j36Q8n4r7P9r0J17K9K6r4O5K8j5q5J57r4o1M8j47J96j4p4L5
5159b3P4r7J26j30N3k8P0p8p4J38L5j26P4R4j93J49j67P6Q6j11k4N7l0N4M8r5
5185d2Q3pJ16k01KLL8Mm9O5k4j5J01j5l7l1J44k60J69j7n1M6J3kM5k1p2L1L2n8
5215a0J3k2K8l8M0M2o2l4L8pk3p9M2R5n7M2k3N2Qn8O7m0N9m7P9k4j29N3L1r9J06
5246D3q1LK5P2j4r5O9o9Q%JP0j16N2Mn5J69j3j03N3L5k01J38o8M7r3J20L8J00
$$ plain form
5275 139 29 62 30 -79 -172 -38 13 9 16 8 47 75 -79 81 60 27 35 -69 20 -8 -33 15 -11 -14 -87 -36 -141 30
5303 30 -63 -97 50 -14 114 20 -35 -10 8 44 11 17 18 -57 -99 -27 -56 94 -122 -102 95 79 84 -31 70 -12 43 19
5331 19 -33 -149 77 -26 -59 8 -80 -55 -34 -10 -21 10 50 18 -50 -113 87 25 -86 -95 33 83 34 -59 9 -28 66 -23
5359 -23 62 -21 -72 -1 34 57 -43 -101 40 55 3 -3 -89 -40 4 116 -50 -53 30 8 -40 39 57 58 -15 36 -63 -1 -131
5388 -131 -15 6 -25 32 62 -44 -43 -90 -38 62 26 -101 37 -34 -24 37 33 37 24 73 16 -19 97 35 23 -47 -22 1
5416 1 30 -48 -36 73 26 21 -3 57 -1 52 -40 58 -60 34 -4 74 2 2 0 -54 -125 -34 -3 -80 50 60 -154 -53 -103 32
5446 32 16 -54 -58 77 -23 15 35 26 95 16 -67 7 -34 41 -74 0 7 -34 -6 78 69 89 47 -36 147 -110 80 -76 46
5475 46 72 -40 -39 -51 -26 14 -106 156 16 -39 -68 -12 44 -10 59 44 46 13 5 -29 -37 -24 -86 40 75 -62 -4 -69 -129
$$ packed form
5275A39j10L3l2j09r3J34N1mPqL9K8j54J60k1l3Qj04Q9k8k5M8k6lp3N1j05J71
5303C0r3l4J47o4J28r4n5K5J8L6l3OJp5m2P2k9J50k16K0J97j6Nj15J01q2N5k4
5331A9n2j16K26j03l3O7q8K5K1K4j1L1M0l2o8o3K00o2j11rJ28N0m9r3O8l7R4q9
5359b3Q5q3n1P1L5K3j00n8J41J5n2oq6M9M4J12j66lQ3k2m8P9J8Jp3N1r9O2j30
5388a31J16K1l1N7L0j06Jm7N2J00l6j27J38p1J0O1mMj3M9n7l5J16o2j2p0K5K3
5416AK9p8J2J09m7nk4O0n8N3r2R8j18R4l8P8p2%kn4p1R1L1p7J30J0k14J01n0J35
5446C2j6p0mJ35j00L8K0rO9p9q3P4m1P5j15P4Pm1K8Q4rK0m2q3J83k57J90j56J22
5475D6K6j12Jj2K5M0j20K62j40n5k9N6N6n4O9j5Kl3ql4qJ3o2J26L5j37N8o5o0
$$ plain form
5504 -129 79 -96 -37 23 57 50 -32 -63 -13 2 39 -71 -55 -96 -110 -29 42 -64 -73 -80 -47 -11 37 47 83 -17 53 30 -12
5533 -12 -79 39 3 26 -82 -36 23 -1 13 -104 53 -114 104 -26 -82 24 36 65 16 -12 13 -34 -23 -68 63 -89
5559 -89 -154 -48 65 -107 -55 10 -26 42 -12 3 24 -44 -71 -49 -42 -21 -67 -124 43 23 62 110 112 -40 -17 89 24 -24
5587 -24 -54 -44 45 26 -70 2 -36 -10 34 -74 -30 65 20 -28 -4 -17 1 32 -51 -92 55 42 -80 10 43 -14 -61 25 -87
5616 -87 -132 52 -13 14 -63 -39 -15 14 92 17 -48 -27 39 -63 -2 12 51 87 -30 -9 86 -42 63 -30 4 24 -59 10
5644 10 -92 -59 -22 -39 -35 98 85 -2 30 -37 -9 9 -63 -19 -37 -25 -14 39 21 5 -5 104 10 -63 80 40 27 55 -59
5673 -59 -8 -83 -67 107 -32 27 -24 2 -6 -36 97 13 -85 58 -19 -127 -5 -82 -48 -35 -18 -42 26 30 113 -14 -52 -59
5701 -59 31 -6 9 3 -30 -18 28 -77 -23 52 83 46 102 49 40 2 -17 -124 132 74 -19 5 12 -32 20 55 32 20 10 -87
$$ packed form
5504a29K08j75N9O0L4pq2l1N0J5L7j10J6m1j4Q1P1j06rpL3L6M8J0L6j00P0k3m2
5533a2o7J18l6K3j08M6N9k4J4j17J57j67K18j30n6J06J2K9m9k8K5m7J1m5J31j52
5559h9o5J06J13j72N2O5l6O8n4J5K1o8k7K2PK1m6n7J67k0L9M8Kj52K3J06o5m8
5587b4l0J0Q9j9r6P2l8K6M4j08M4R5m5m8K4j3J8L1q3m1J47j3j22R0L3n7m7Q6j12
5616h7m5J84o5K7p7K4K4K9P8p5o5K1O6j02O1J4L9L6j17K1R5j28J05r3L4K0q3O9
5644A0j02L3L7j7MJ33j3q7L2o7K8J8p2M4j8J2J1N3j8j6j0J09r4p3J43m0j3K8j14
5673e9N1p5J6J74j39N9n1K6ql0J33q4r8J43p7j08J22p7L4J3J7k4O8MQ3j27l8p
5701e9R0l7J5ol3J2M6j05N4P5L1l7N6n3rl8j9j07K56n8r3K4Pm4N2L5k3j2j0r7
$$ plain form
5731 -87 -144 8 -10 -83 75 17 124 -44 -66 84 55 -126 -7 13 18 34 -4 30 19 -11 12 40 51 2 -7 33 39 -31
5759 -31 -77 30 -153 -30 43 -35 8 27 -83 34 103 -63 -3 -6 46 51 -113 16 163 24 71 22 107 -101 -21 -40
5785 -40 -63 140 -38 -63 -41 27 -20 102 -29 85 15 -46 4 -59 -25 -43 64 42 -1 78 42 35 39 -39 43 -92 -46 -86
5813 -86 18 -123 39 18 -64 18 -111 33 -12 65 -14 30 -52 15 25 -3 37 -47 -10 -54 -140 -60 -23 35 1 98 66 -16
5841 -16 13 -56 10 -19 -95 12 -13 -31 -47 -138 59 39 79 -53 -7 -15 -50 -17 75 -11 -28 46 -81 -45 -9 -33 62 49 -11
5870 -11 -11 22 35 -1 76 -28 89 -11 79 24 -55 -21 15 -20 73 49 24 -22 -70 -83 47 51 -25 5 -31 -54 -81 20 -88
5899 -88 -49 -105 -1 2 -79 -13 53 142 -9 1 94 16 26 -37 5 -8 -90 -85 -55 -45 56 -65 35 59 -33 25 -12 -46 -1
5928 -1 101 -119 44 -52 14 -85 -21 200 22 115 -102 -55 -35 -53 -15 -30 -16 -23 -85 78 48 31 16 25 40 -31 -139 55
$$ packed form
5731h7n7J52j8p3J58n8J07j68k2J50k9j81J19K0NJ6l8L4j1l0K3K8J1m9rM0Op0
5759c1m6J07j83J23P3p8M3J9j10J17O9j66O0lN2Nj64J29J47j39M7m9Q5k08Q0j9
5785d0k3K03j78k5K2O8m7J22j31J14p0o1N0o3L4j8J07k2m3P9l6pMp8Q2j35M6m0
5813h6J04j41J62k1q2Q2j29J44m5P7p9M4q2O7J0k8M0q4L7m4q6Q0L7N8l4R7l2q2
5841a6K9o9O6k9p6J07k5j8j6r1J97k0M0j32M6ql5L3R2q6j7P4j27L6L6k4R5j3o0
5870a1%L3J3l6P7j04J17j00R0n5p9L4L6l5R3k4k5m6m8j3J30Mp6L0l6k3k7J01j08
5899h8L9n6J04Lq1O6O6Q9j51J0R3p8J0o3M2j3q2NL0J0J01j21J00K4r2N8l7l4M5
5928aJ02k20J63r6O6r9O4K21j78R3k17M7K0j8L8j5J4po2J63l0j7j5RJ5p1j08J94
$$ plain form
5956 55 88 -145 3 39 13 180 10 -125 -10 15 31 68 -84 -14 -49 -1 -59 -94 -28 155 43 -79 -4 45 55
5981 55 32 12 38 -4 14 -59 36 -95 129 46 -26 -63 1 23 18 35 -95 -54 27 0 2 -21 -57 -82 -36 18 126 28 24 35
6011 35 -61 22 -133 -71 98 57 61 72 -48 -51 15 8 -11 41 -23 60 -36 44 21 -54 -44 3 101 24 -25 12 11 12 -72 50 -42
6042 -42 -19 27 -79 -2 11 23 20 -52 -51 22 61 63 -85 -81 31 -44 -35 10 -26 -161 10 -12 54 -41 -5 25 -13 -77 50 -71
6072 -71 -48 -51 -96 74 10 30 0 -22 -42 19 -3 63 78 33 75 -110 96 56 25 18 -62 6 57 -14 65 109 82 -61 -53 -64
6102 -64 82 60 -7 -18 -3 -74 -31 -78 43 52 -81 -78 -105 14 -85 -75 -63 -34 22 -130 -21 57 -55 -58 88 114 -55
6129 -55 15 -20 -54 25 -82 -11 71 -61 65 24 31 24 50 -173 -5 -48 -34 43 -21 75 74 -31 -20 65 117 -58 25 19 50
6158 50 -51 13 -6 -4 -11 11 -45 -104 -110 25 48 13 120 24 78 -78 76 18 54 100 -41 30 72 1 -30 -50 -100 -6 -61
$$ packed form
5956E5L3k33J48L6k6J67j70j35J15K5J6L7j52P0l5M8n8l5O6J83j12j22P5M9J0
5981E5k3k0K6m2J8p3R5j31K24q3p2l7O4K2nJ7j30M1Q1k7Kk3l6k5M6N4J08r8mJ1
6011C5r6Q3j55O2J69m1MJ1j20lO6pj9N2o4Q3r6Q0k3p5J0M7R8p7m9L7jJq4J22r2
6042d2K3M6j06P7J3J2lp2JP3L9Kj48MJ12p5RM5l6j35J71k2O6r5L6L0l8o4J27j21
6072g1K3lm5J70o4K0l0k2k0O1k2O6J5m5M2j85K06m0l1pq0O8N1p1P9M4k7j43Qj1
6102f4J46k2o7j1J5p1M3m7J21Rj33Lk7J19r9J0J2K9N6j52J09P8j12lJ46K6j69
6129e5P0l5l4P9j07P1Q2j32J26m1PpK6k23J68m3J4P7o4R6jj05J1Q5N2j75Q3oL1
6158E0j01O4j9KpK2n6n9oJ35K3l5J07r6N4j56J54n8L6M6j41P1M2p1l1k0n0R4n5
$$ plain form
6187 -61 -32 -4 -29 -85 -94 -44 37 43 -40 -40 -27 38 0 -87 -36 -66 -49 -40 -87 -83 79 102 38 -33 76 -41 -40 58 13 25 -130
6218 -130 33 -53 49 -10 42 49 76 60 101 -52 -16 80 83 -40 32 52 -93 142 34 -106 20 -72 79 4 -72 -64
6244 -64 -4 -20 -8 -83 47 22 56 17 13 22 96 94 3 65 -72 161 31 48 -27 42 -165 35 -62 67 -95 -145 1
6271 1 -83 -145 -39 -54 -137 -1 49 1 -15 55 13 43 -89 -65 91 113 -92 -14 77 1 14 -1 47 23 -112 38 -70
6298 -70 79 18 -40 52 -83 3 10 -72 -84 -1 -10 -98 -104 -58 116 -94 22 -60 -3 63 83 -125 -51 29 -67 -19 12 37 19
6327 19 34 -9 26 -68 39 -3 4 -51 16 36 40 -71 107 -61 -53 -34 15 -19 18 -22 19 -103 -92 -107 -16 -110 -98 -38 40
6356 40 -31 -40 -50 30 -100 -27 -45 -4 31 10 -94 -25 -79 42 5 41 -9 -128 40 -95 -30 -60 123 -34 53 -23 -91
6383 -91 -39 12 -30 8 -47 -70 -41 18 -17 -65 68 -57 82 -30 64 -58 46 13 111 60 -12 -77 -69 -24 27 -47 25 -64
$$ packed form
6187f1K9K8k5n6rN0Q1Oq3%J3O5l8q7N1l0J7Rm7MJ62K3o4p1J09j17JR8m5J2j55
6218a30J63q6J02n9N2PK7j6M1j53L6R6Lj23P2K0j45K35j08j40J26r2J51p5p6Q
6244f4O0j6J2p5J30k5L4l9mRP4kr1O2j37K33j30J7p5O9k07K00r7J29j62n0J46
6271Aq4o2J06j5q3J36N0m8j6P0m2L0j32K4J56K2k05P8R1p6J3j5M8k4j35J50j08
6298g0J49o1n8R2j35Q6Pq2j2Q3rq8oM6J74k10J16q2N7O6K0k08P4Q0r6M8L1K5j8
6327A9J5m3L5r4J07m2Pn5O7K0Mj11J78j68QJ9M9l4L7m0M1j22J1j5R1r4J2O0P8
6356D0p1rj0Q0j30P3j8M1L5k1j04O9n4J21l7L6n0j19J68j35O5l0J83j57Q7p6o8
6383i1N2N1m2L8n5k3K9N9l5m8J33j25J39j12R4j22J04l3R8n1p2o5QM5N1p4P2q9
$$ plain form
6411 -64 46 -41 -72 -104 67 -5 10 -38 40 45 -69 -15 83 90 10 92 -40 74 14 65 -23 -20 92 136 -35 13 -33 22
6439 22 -10 58 -1 22 -24 68 -25 -53 -126 10 -19 23 -60 -86 -35 78 -1 -73 65 -66 59 -24 17 58 56 109 -90 167
6467 167 -28 59 -69 46 -94 -20 -118 -44 7 5 64 84 99 100 -144 -62 -11 -51 -58 -30 -30 53 12 -32 36 -40 -29 23 37
6496 37 51 -18 39 -88 -19 -50 13 14 -55 44 18 52 56 -43 -27 30 -3 -21 8 -30 -45 -64 54 30 30 29 -91 53 7 23
6526 23 8 72 -28 35 -26 19 -127 -52 -1 54 -2 39 -123 88 -45 62 -101 57 -34 -40 -154 -10 -86 -117 -57 78
6552 78 -11 27 22 24 34 -71 82 32 75 -66 6 -55 -31 -156 57 14 -11 -11 22 -17 19 -34 -50 35 53 -111 46 -41
6580 -41 -101 -14 -87 114 47 2 -5 -109 -50 37 71 -63 -107 39 15 90 -80 127 76 -8 -25 -9 -18 -41 94 -25 188
6607 188 -37 68 52 24 -25 22 -36 -31 -38 -20 -2 21 -16 102 -104 -9 -111 -30 -82 -116 -86 14 29 3 -31 -65 42
$$ packed form
6411f4J10q7l1l2J71p2J5m8P8Nj14N4R8Pq0Q2j32J14o0N1q8LJ12M4j71M8m6N5
6439B2l2O8n9K3m6R2r3k8p3J36k9M2q3k6N1J13p9p2J38j31J25q3M1M1kN3j99K57
6467A67j95Q7j28J15j40P4r8P4N1kN9K0J5Jk44Q2N1m0pK8%Q3m1m4O8p6J1N2J4
6496C7J4o9N7j27O9l1O3Jo9R9k6L4Mr9J6N7l3j8K9l8j5j9J18k4%jj20J44m6J6
6526B3j5O4j00O3o1M5j46P5N1N5n6M1j62K11j33J07j63J58r1oj14J44p6l1O0J35
6552G8q9L8nKJ0j05J53n0M3j41P2o1K4j25K13m3k5%L3l9L6n3j6Q5J8j64J57q7
6580d1o0Q7p3K01o7m5pj04N9Q7L4j34m4J46k4P5j70K07n1q4j7J6rk3J35j19K13
6607A88k25J05j6k8m9M7n8NpJ8J8K3l7J18k06R5j02Q1n2l4L0J00J5k6l4l4J07
$$ plain form
6634 42 40 -10 -88 128 39 93 -70 -59 139 24 63 71 62 -62 -101 11 88 13 36 -11 -42 17 -15 -12 -16 35 -33 -74 56
6663 56 35 35 -67 86 -54 34 -42 18 -25 -20 72 39 13 16 51 135 -28 11 23 -19 50 54 50 5 81 -26 188 -20 37
6692 37 91 62 26 5 -127 -89 8 -27 42 37 9 -14 -57 56 33 -73 -46 -80 40 -25 15 -60 23 -38 50 -49 24 -8 -1
6721 -1 -4 27 52 -25 101 -40 -19 144 11 35 -49 50 77 -46 -63 -9 -61 -54 -54 31 95 21 69 69 -11 -64 -35 -57 -26 -70
6751 -70 4 -48 42 -7 4 -77 70 44 8 165 63 -37 -17 -80 -11 53 -38 3 -76 114 71 7 -81 1 -54 67 40
6778 40 67 -5 56 78 -2 10 14 -22 60 -32 -58 -11 -17 -3 6 109 2 23 -44 44 38 -10 44 106 -52 31 -20 69 56 18 8
6809 8 -27 75 -51 -16 -52 8 53 17 -55 -11 47 -86 -55 53 -60 62 -183 7 -133 3 -142 -83 -39 5 -4 9
6835 9 83 -48 -77 -50 -72 29 19 60 -29 -34 80 -25 -1 -63 61 -5 -26 72 53 -73 43 103 -43 70 -32 4
$$ packed form
6634D2kn0p8K16q9N4j63J1J98j15L9Qrj24l9J12P7p5K3m7l1N9l2LmN1o8m1J30
6663E6k1%j02J53j40Q8p6O0m3NR2l3k6LL5Q4j63L9J2m2O9Mmm5P6j07K14k08N7
6692C7N4k9l6k1j32L8R7l5O9nk8k3m3J13k3j06K7l4J20o5M0p5Q3o1Q8r9P3l2P
6721alL1K5p7J26j41K1J63j33K4q4R9K7j23j7N4n2P%Q5O4p4M8%q0n3K9k2L1m4
6751g0P4n2R0m9J1q1J47k6l6J57j02j00K0o3O9O4r1M1p9J90m3o4q8Q2n5J21k7
6778D0K7p2O1K2q0J2Ml6Q2r2k6M7oJ4RJ03j07K1o7Q8om8N4O2j58Q3n1Q9j3l8j0
6809Hl5J02j26L5l6O0M5l6p2M4N8j33L1J08j13J22k45J90j40J36j45N9M4M4rJ3
6835IP4j31k9K7k2J01j0M1q9nJ14j05K4o2J24o6k1R8j9j26J16O0j46J13j02L6
$$ plain form
6861 4 -43 -68 2 70 96 45 27 -3 -79 -96 76 -3 34 9 -68 -2 -44 -66 21 -50 96 0 -52 5 -87 25 -77 11 -16
6890 -16 -55 37 162 -28 30 10 -99 28 -45 -36 39 -33 49 -40 1 85 99 41 23 -26 -67 -32 -63 -68 6 -34 27 -55 3
6919 3 34 25 -141 -138 -9 15 -94 -80 -121 -83 -12 64 14 -81 15 66 10 93 18 31 20 92 -55 103 -68 -2 -63 -38 9
6948 9 -15 -80 -46 0 -16 37 -133 -100 -12 84 25 -16 -57 -79 -52 -29 37 -65 -28 47 -25 25 -47 -53 -17 29 8 -31 -34 -81 16
6979 16 3 62 -30 14 -42 -5 47 -42 -97 67 151 -27 -60 53 -79 8 -18 57 -26 -33 63 -66 18 -34 -51 -45 12 -147
7007 -147 25 54 10 33 31 122 -102 77 -3 66 -67 -30 53 -17 65 80 6 65 -10 16 58 141 65 -64 65 -32 113
7034 113 48 -68 -27 -17 -64 48 24 0 -34 2 -54 -7 19 -4 16 157 27 -78 -7 -7 -62 -35 -40 -13 80 60 -43 89
7062 89 0 -42 99 10 72 -79 77 47 54 -11 -117 4 107 -57 48 -45 23 -77 50 -85 146 10 19 -56 -71
$$ packed form
6861Dm7k5P0O8K6n1j8l0p6j7J72p9L7k5p7O6m2k2Q7p1J46r6n2N7r2J12j02Q8k7
6890a6l9R2J25j90N8k0j09J27p3RP5p2Q2q9M1Q4J4n8j8m9m1L5l1nP4m0O1q2N8
6919CL1rj66LJ29K4j09J4m1L8P1P6n0r5R6N1n6Q3p5J3j1P2j47J58j71O6o1K5M7
6948Ik4o5L4M6j6N3j70L3Q8R6n9m1m1k2K7K3O6j02L7P5p2N0p2oL6M6k1l9lm7R7
6979A6j3N9r2M4n6L7N2q9n5J64Q4j78l3J13j32Q7k6P5q3pR6j29Q4n2j7ON7j59
7007a47J72K9m4K3kR1k24J79q0O9j33L7Q3p0Q2J5p4N9p5K6M2Q3p6j29J29r7J45
7034A13o5j16M1J0m7J12k4k4l4L6n6M7K6k3K0J41j30j05P1%n5K7nK7R3k0j03J32
7062H9q9m2J41q9O2j51J56l0Po5j06J21J03j64J05r3O8j00J27j35K31j36Rp5j5
$$ plain form
7087 -71 -23 -95 -7 25 -12 -29 2 17 53 -89 13 9 -8 68 27 11 -31 81 -49 -17 44 -12 27 46 112 9 -35 6
7115 6 -26 28 -2 11 -88 -87 82 112 -64 -85 27 -70 -124 -13 -64 26 28 -13 0 56 -16 -17 -19 13 -87 -1 -75 16 64 -81
7145 -81 -67 -24 121 72 41 -80 90 -7 64 101 109 1 13 -50 -30 -115 -30 24 -60 16 9 -8 -67 -34 -72 -28 -61 -76 -44
7174 -44 -45 -75 59 4 48 -10 -35 13 -11 84 -24 108 68 6 89 -64 20 35 -11 43 196 20 1 -28 54 109 -24
7201 -24 -73 -52 11 23 65 -40 -23 -29 -25 -33 -42 51 60 -69 -35 -22 -44 4 -58 108 -26 30 80 27 35 67 -42 -24 -76 140
7231 140 94 -69 -56 -62 80 99 38 26 -21 84 13 -19 -29 15 22 67 2 25 36 55 1 -59 26 -77 18 -30 -16 -17 -99
7260 -99 -68 43 12 8 -57 135 15 18 49 -18 76 39 106 -3 38 14 -28 47 5 169 66 -35 6 78 1 -21 120
7287 120 85 -8 100 -28 -22 -44 -40 -32 -7 81 -18 -46 -47 46 23 2 -62 5 -78 -105 -5 20 16 -96 -61 32 54 -28 -86 47
$$ packed form
7087g1M8p2Q8L2l7j7L1J5L6j42J02mj7P6m1j6m2J12j30L2O1n6L9J9O6j03m4M1
7115Fl2N4l0J3r9JJ69L0j76k1J12r7n4J11n1R0Km1J3N6p2jkL2j00Q6p4R1M8j45
7145h1J4M3J45m9l1j21J70r7P1L7Qj08J2o3K0q5Q5N4q4P6pj7n9L3l8M4l3j5L2
7174d4jl0J34n5M4n8k5M8k4R5j08J32m0o2Q3j53Q4J5m6N4J53j76j9k9Q2N5j33
7201b4m9K1O3J2M2j05J7oMqrR3Rj29L4J3k2M8o2J66j34N6N0n3QL2j09J8n2K16
7231A40m6j63J3oJ42J9o1j2m7J05p1l2j0M4PM5o5K3J1J9n4o0Q5j03R5m8J4jq2
7260i9L1J11l1mo5J92j20LL1o7R4l7O7j09M1k4m2P5m2J64j03j01M1P2p7k2J41
7287A20l5r3J08j28Ok2MQK5Q8r9k8jR3k3k1o4O7q3k7J00K5mj12L5R3K2q2n8J33
$$ plain form
7317 47 7 60 128 -9 -6 53 -8 -16 91 -11 122 -49 69 16 -15 -35 -58 64 -18 39 -11 -35 -57 -10 119 11 -55
7344 -55 94 -110 -41 0 3 -49 -5 -27 -63 10 84 -53 14 6 64 26 -40 38 77 17 61 25 58 -89 56 26 -8 118
7372 118 44 -53 -42 0 41 -5 -47 -83 -36 68 37 -110 -10 -28 -49 -52 49 -25 3 55 79 -44 18 -22 32 5 89 128
7400 128 27 -38 18 -86 -59 47 -14 -79 -40 131 35 35 -35 88 56 33 -17 -18 -88 87 8 7 -19 48 61 52 -100 -27
7428 -27 -37 19 15 36 72 -55 19 11 2 71 6 -103 24 26 1 -24 111 15 -15 14 14 176 -22 32 -74 40 -47 56
7456 56 6 29 -19 -42 -32 3 10 -150 -21 -125 -90 -78 -114 -5 -48 -103 33 -136 -46 -8 -24 41 103 -112 -20 -14 40 55
7484 55 56 97 57 10 87 -20 -28 -28 -36 -114 4 66 19 27 -29 -4 -6 -64 -59 -89 79 -104 63 12 -33 -122 -23 -34 -39 -60 24 88
7516 88 -88 -51 -21 42 -31 0 61 89 16 26 -20 18 48 -59 -7 81 -15 54 -57 118 37 156 13 75 -42 90
$$ packed form
7317D7m0N3O8j37LN9o1qJ07j02J33j71J18n3l1k0k3J22q2N7n0k4k2M7J29j08o6
7344e5J49k04O9M1Ln2M4k2l6P3P4j37O7qN8l8o6P8L9o0M4l6L3j47J45l0l4J26
7372A18p4r7J1M2M1m6m2l6M7J04l1j47J00j8k1lJ01p4K8N2K4j23O2m0N4k7Q4L9
7400A28j01o5N6j04K7J06o1o5L9J71r6%p0J23l2k3n0jp0J75p9jk6O7J3rj52P3
7428b7j0N6mK1L6j27P4qrO9o5j09J27Kk5k5J35r6l0K9%J62j98N4j06J14q7J03
7456E6n0K3m8k3J0L5Pj60J29j04L5J2l6J09m3n5J36j69R0L8j6O5O2k15R2ON4J5
7484E5JM1m0m7P7j07q%qp8J18O2m7Qn6K5kn8Nl0J68j83J67n1m5q9R9j1nk1Q4O4
7516H8j76L7L0O3p3L1O1K8p3J0m6L8L0j07N2Q8r6O9j11J75q1J19j43O2j17J32
$$ plain form
7542 90 -41 20 101 9 43 -33 -39 -31 14 62 82 -45 47 -27 -28 116 -25 -104 -23 108 49 12 18 4 20 -36 -33 84 9 -113
7572 -113 10 -150 -12 35 39 3 32 -73 -7 -15 -50 87 -116 -99 -89 54 100 22 58 -185 -24 -33 -44 -18 17 68 -26
7599 -26 -89 -21 -47 7 25 -80 81 17 79 64 -35 64 44 -82 87 -77 100 69 45 -73 -81 79 75 50 25 33 -98
7626 -98 -70 -41 -121 -27 75 -28 -25 32 -28 86 -43 -149 9 -79 -57 -67 -38 -31 11 -40 0 -133 -27 11 -6 79 141
7653 141 -118 83 -4 -25 -29 55 34 -26 133 43 -4 -4 -113 -14 120 30 79 -50 42 32 -29 -7 -22 -47 83 -24 -59
7680 -59 -65 47 -44 24 20 27 63 19 -12 25 -46 35 11 -46 0 -44 -17 -46 34 -14 -94 -44 -3 36 -35 -55 -36 65 71 -7 -25
7711 -25 -6 69 -55 101 -36 35 -73 -27 -36 33 -17 -31 -33 -4 -79 -83 -15 -34 -38 79 -78 -35 -1 90 1 -23 12 10 -64 38
7741 38 0 23 15 -90 -6 59 123 -45 -91 12 -30 -19 109 129 -75 -80 47 -23 49 -10 -30 44 47 -7 -31 71 25 -152
$$ packed form
7542I0j31O1Q1r2L4p6oQM5M8K0j27R2p4jJ44j41p9Q1J31n9l7Oj4J6n6LJ17p5j22
7572a13J23j60J38M7Ml6K9j05O6ql5J37k03J7J0J43M6p8L6k43J61rj1K6L5N1r4
7599b6o3O8k6N4J8j05J61o4O2j5r9R9k0j26J69j64J77l1k4j18qJ60mk5k5Qj31
7626i8K8K9q0R4J02j03LN7o0J14j29j06J58q8K2j0K9PM2n1M0j33J06L8j7Q5O2
7653A41k59K01q7k1mQ4k1o0J59r0m7%j09R9J34r0M9j29R2j0o1K2j5k5J30j07l5
7680e9oJ12r1O8mPL6m4l1L7p1Q1k4n7M6m4K7k9Q0m8q0N0M1L9p1k0J9J01Op8j8
7711b5J9P5j24J56j37P1j08M6rO9n0j4kK9p5mO8j9mJ17j57M3L4R1q9k4L5kp4J02
7741C8l8K3qj05Q4O5O4j68m6J03m2J1J28K0k04nJ27p0P2n9k0P4Ln4k4J02m6j77
$$ plain form
7769 -152 -2 67 19 -48 35 -14 -40 19 -101 -14 69 32 9 126 -106 3 17 -15 -4 -29 -103 59 7 52 -33 -60 -10
7796 -10 -106 -76 10 -14 -21 -25 -18 -37 92 35 -9 -105 -41 -85 -66 -61 57 2 -26 -62 -31 -16 -51 11 -70 -40 53 39 2 14 103
7827 103 84 -30 85 -9 84 -86 6 67 113 -11 52 -68 52 39 14 41 -122 23 -71 -39 -11 82 -45 -8 72
7852 72 17 -15 -28 -7 8 38 23 -82 -54 6 -56 65 160 -25 198 151 107 80 -3 -8 27 4 88 37 71 -3 100 -33
7880 -33 -33 76 26 4 50 -124 -12 50 65 45 -47 82 -60 48 -63 42 -97 -25 7 -96 13 5 48 -23 44 78
7906 78 -25 42 89 -48 -87 -30 -25 126 115 70 61 -5 52 92 -52 -8 -62 42 39 -34 -108 -61 50 -18 88 -23 -77 -114
7934 -114 27 63 -22 -7 -27 -3 -26 37 58 12 11 -36 -30 32 -68 31 -63 -93 -92 -4 -2 -106 54 31 -89 37 -4 -16 -38
7963 -38 -65 116 41 -47 -23 11 -65 61 17 -10 61 58 49 -56 -23 -34 -41 -35 21 -14 -84 -102 -71 50 -70 -55 -13 -1 -51 12
$$ packed form
7769a52J50O9m8o7Q3m9k6N9j20Q7Q3l7k3J17k32J09J4l2J1k5p4J62n2M5q5k7N0
7796a0r6L0Q6k4pmPj9J29n7m4r6O4m4J9NJ18n5k8l6L1J5l5O2q1L0R3j4l7J2Q9
7827A03j9j14J15r4R3j70R2O1M6j24O3j20J20j3k5K7j63J45r4L2K8R3j27L7Q0
7852G2n5l2j3K1J5L0j5j05K8O0o2J21R5j85K23m7m4k7q3nL5k3Q4n1L4p4J03j33
7880c3%J09n0k2M6j74J12O2J5k0r2J29j42J08j11J05j39P2L2j03J09qM3p1O7L4
7906G8j03O7M7j37l9N7NJ51j1m5ro6N7M0j44M4n4J04lp3p4M7J11o8J06j11n4l7
7934a14J41L6q5J5k0K4k3O3K1m6jm7OO2j00R9r4l0JQ8Kj04J60k3j20J26m1j2k2
7963c8k7J81p5q8K4L4p6J26m4k7P1lrj05L3j1pON6l5p0j8L1J21j20J5M2J2n0O3
$$ plain form
7993 12 78 -88 12 -28 -1 84 35 19 47 -6 6 8 32 3 -81 142 40 -39 15 15 -45 -38 47 83 -31 -21 16 -63 37
8022 37 86 27 -132 -6 42 -79 22 -94 54 19 46 -4 -3 1 65 -123 -132 30 46 20 31 4 37 50 19 -56 -59 -10
8050 -10 65 -83 81 -5 -20 -82 27 -74 1 67 -5 26 -2 -59 -109 -21 -15 -15 75 13 19 -28 9 -66 119 36 -3 85 43
8079 43 -38 32 34 65 57 -140 198 105 7 -9 178 30 -7 -8 60 -70 -114 -109 31 -54 -11 -31 -71 4 18 38 -53 -43 9
8108 9 -2 11 30 26 6 8 46 89 -11 -18 -99 29 -144 141 32 77 -25 -1 1 28 60 10 -40 8 70 17 47 -77 19
8137 19 -40 27 -95 43 -2 -17 77 -44 -4 -45 27 12 -46 -106 -58 -63 -69 -87 -8 13 114 10 2 -53 -6 -26 29 -20 -49
8166 -49 -49 -36 66 72 114 -24 -60 13 -24 -52 -32 -25 92 -24 -92 -5 -63 14 42 6 -59 71 74 -151 -61
$$ packed form
7993A2O6j66J00m0K7Q5m9j6K8n3J2KK4k9q4K23j02p9N4%o0PQ5L6j14J0L7p9J00
8022C7M9n9j59J26M8j21J01j16J48l5K7n0JMO4j88rJ62J6k6J1k7L3J3l1p5lM9
8050a0P5j48J64q6j5o2J09j01P5O6p2L1k8n7n0Q8O%R0o2Om7L7p5J85q3l9Q8m2
8079D3q1P0KL1qj97L38r3r8j6J87j48l7jO8j30m4NJ40q5M3k0m0P5J4K0r1J0N2
8108Ij1J3J9mk0KL8M3j00pq1J28j73K85j09M5j02K4KK7L2n0n0M8O2n3L0j24R6
8137A9n9O7j22J38m5j5R4j21M0m1P2j5n8o0M8noj8P9K1J01j04qn5M7k0N5m9k9
8166d9%J3J02OM2j38l6P3l7k8K0PJ17j16o8Q7n8P7K8l6o5J30Lk25R0
8191f1
$$ Imaginary data points
##PAGE= N=2
##DATA TABLE= (X++(I..I)), XYDATA
$$ plain form
0 0 0 0 0 0 0 0 0 0 0 0 0 0 0 0 0 0 0 8 -8 8 -8 8 -8 16 -16 16 -24 24 -29 32 -40 40 -48 56 -62 69 -77 88 -96
39 -96 109 -120 133 -149 165 -181 199 -221 245 -269 294 -325 358 -396 436 -482 534 -593 660 -739
59 -739 831 -944 1080 -1252 1478 -1789 2239 -2959 4305 -7659 36500 35101 -22117 15912 14339
74 14339 -17782 -7166 17558 -10327 -20182 -4357 -10876 -20424 7451 13257 -5586 3318 15045
87 15045 -5210 -2501 18251 12050 -544 4636 3657 -1316 672 1998 -3315 -5094 -4110 -7611 -9866
102 -9866 -4939 -2734 -2753 -1591 -2120 3746 11262 5801 4973 11086 2846 -3896 5423 5676 -5282 -6569
118 -6569 -3681 -7668 -8154 -179 1227 -3473 667 1723 -5080 1011 9362 3259 493 4261 -113
133 -113 -3017 2564 5480 1654 -1768 -1459 -3445 -5833 -1347 1131 -2991 -3014 -1365 -2765 -852 3771
$$ packed form
0@%%%%%%%%%%%%%%%%%Qj6J6j6J6j6K4l2L2m0M8n3O1p2Q0q8J04j18J31j46J65j84
39i6K05k29K53k82L14l46L80m20M66n14N63o19O83p54Q32r18J016j127J253j399
59g39J570j775K024k332K730l267M028n198P264j1964M4159j399n7218L8029j573
74A4339l2121J0616K4724k7885r855J5825o519r548K7875N806j8843Q904J1727
87A5045k0255K709K0752o201j2594N180r79m973J988J326n313j779R84l501k255
102i866M927K205j9J162n29N866P516n461q28O113q240o742R319K53j0958j287
118f569K888l987m86P975J406m700M140J056o803O091Q351o103k766L768m374
133a13k904N581K916l826l422L09j986k388M486K478m122k3J649j400J913M623
$$ plain form
149 3771 6096 4059 750 1821 2594 -331 1242 2767 -2669 -4726 -2681 -3446 -2507 993 1117 -1671
165 -1671 -1523 1919 1265 300 4466 3093 -2651 -611 1743 -852 772 2297 -1327 -2704 -1229 -988
181 -988 -1133 457 1084 -2162 -2823 714 1094 1028 3605 2401 -134 539 386 341 1738 4 -2323 -2877
199 -2877 -2683 -1975 -1026 368 965 -512 -291 1167 1413 3012 3086 230 85 369 -1272 -343 1038 -437
217 -437 -1802 -2078 -1796 -1109 -227 374 -196 -1078 -47 -41 288 3028 2720 387 876 955 210 785 615 -447
237 -447 -1573 -2684 -2480 -1656 -844 165 -759 -975 481 555 1164 2931 2284 1209 634 -131 376 777 243
256 243 -224 -1194 -1900 -1506 -1472 -632 23 -950 -1297 -507 -98 949 1596 1395 1649 923 437 1286 1447 752
276 752 175 -1084 -1442 -1367 -1583 -1003 -655 -1229 -947 -837 -15 1301 1382 1070 1093 571 478 1056 797 1040 422
$$ packed form
149C771K325k037l309J071P73k925J573J525n436k057K045p65R39L500J24k788
165a671J48L442o54r65M166j373n744K040K354k595J624J525l624j377J475K41
181i88j45J590O27l246o61L537L80o6K577j204k535O73j53m5J397j734k327n54
199b877J94P08R49J394N97j477K21J458K46J599P4k856j45K84j641R29J381j475
217d37j365k76K82O87Q82O01n70q82J031OL29K740l08k333M89P9p45N75j70j062
237d47j126j111K04Q24Q12J009r24k16J456P4O09J767o47j075n75p65N07M01n34
256B43m67r70p06L94L4Q40O55r73l47P90M09J047O47k01K54p26m86Q49J61o95
276G52n77j259l58P5k16N80L48n74K82J10Q22J316Q1l12K3n22r3N78k59K43o18
$$ plain form
297 422 -881 -760 -725 -666 -302 -683 -866 -888 -1256 -509 362 539 801 500 260 1050 1085 898 1136 526 -295
318 -295 -532 -958 -362 -341 -847 -793 -957 -924 -153 48 455 743 114 -71 563 645 754 680 201 96 -196 -282
340 -282 207 -2 -299 -411 -817 -656 -132 -252 86 251 -183 104 112 444 921 505 168 205 -124 -118 128 -151
362 -151 -77 -358 -711 -334 -130 55 297 -40 -137 -16 -111 223 545 206 -16 -128 -122 13 82 72 129 -409 -453
385 -453 -73 -161 136 211 -91 -55 87 139 235 251 159 75 -373 -189 23 -24 -56 -44 -309 -116 78 -22 344 269
409 269 133 102 -13 134 283 -45 62 -29 -365 -269 -2 -76 -5 -314 -370 -119 19 145 271 69 201 268 -79
432 -79 217 387 227 112 -148 -129 -218 -272 -180 -83 -407 -192 -189 -183 194 157 106 157 166 124 221 246 306 156 -232 -88 -66
459 -66 -150 23 -158 -352 -238 -290 -327 9 78 -31 106 165 178 404 356 412 112 55 134 -128 -115 -5 -231 -280 -230
$$ packed form
297D22j303J21L5N9L64l81j83k2l68P47Q71J77K62l01k40P90L5j87K38o10q21
318b95k37m26N96K1n06N4j64L3P71K01M07K88o29j85O34Q2J09p4m79j05k92q6
340b82M89k09k97j12m06J61N24j20L38J65m34K87QL32M77m16l37L7l29OK46k79
362a51P4k81l53L77K04J85K42l37r7J21r5L34L22l39k22j12OJ35O9j0N7n38m4
385d53L80q8K97P5l02L6J42N2R6J6r2q4m48J84K12m7l2J2k65J93J94j00L66p5
409B69j36l1j15J47J49l28J07r1l36R6K67p4P1l09n6K51J38J26J26k02J32O7l47
432g9K96J70j60j15k60J9q9n4R2R7l24K15LOL77l7n1N1Rm2R7K5O0j50l88J44K2
459f6q4J73j81j94J14n2l7L36O9j09J37N9J3K26m8N6l00n7P9k62J3J10k26m9N0
$$ plain form
484 -230 -287 -174 -199 -25 79 45 63 271 333 241 244 51 114 167 -42 35 108 -142 -187 -192 -310 -124 -123 -171 -140 -42 -70
511 -70 0 18 316 281 100 168 167 87 149 -17 47 -124 -214 -250 -157 -243 -71 -87 -214 19 -88 39 228 59 127 163
537 163 100 149 110 12 18 124 -96 -67 -55 -132 -54 -205 -71 -32 -160 28 80 -19 209 -12 -21 100 117 99 62 -29 20
564 20 61 16 3 62 -187 -143 -167 112 13 -101 -24 -51 -66 10 112 86 155 -25 -68 42 59 -124 -34 11 -30 -3 -42
591 -42 39 61 62 -30 5 37 -19 64 -2 28 -32 -58 -26 38 60 36 -71 0 35 103 -3 113 -34 48 -118 -117 -1 -87 -10
620 -10 -18 -46 15 52 -29 10 97 85 -4 -62 82 51 23 119 -122 -77 -102 -32 -79 -27 -27 -34 -44 -28 -52 -12 -11 -20 40 26 24 57 163
653 163 18 -96 6 28 -26 70 -32 -103 -125 -13 -128 -41 -41 -48 72 -30 -35 -71 71 -6 30 22 104 0 68 112 68
680 68 -73 -142 -54 -66 45 111 -64 -56 -1 -122 70 94 60 128 143 229 39 49 45 54 -66 73 -30 -161 -29 -42 42
$$ packed form
484b30n7J13k5J74J04l4J8K08O2r2Lj93O3N3k09P7P3k50m5nj18J86Jm8L1R8k8
511g0P0J8K98l5j81O8jq0O2j66O4j71r0l6R3q6J72j6j27K33j07J27J89j69O8L6
537A63o3M9l9r8OJ06k20K9J2p7P8j51J34L9j28J88N2r9K28k21rJ21J7j8l7r1M9
564B0M1m5j3N9k49M4k4K79r9j14P7k7j5P6J02k6O9j80m3J10J7j83R0M5m1K7l9
591d2Q1K2Jr2L5L2n6Q3o6L0o0k6L2O4K2k4j07P1L5O8j06J16j47Q2j66JJ16q6P7
620a0qk8O1L7q1L9Q7j2q9n8J44l1k8R6k41M5k5P0m7N2%pj0J6k4M0JrO0j4kL3J06
653A63j45j14J02K2n4R6j02p1k2J12j15Q7%pJ20j02nl6J42p7L6qQ2j04O8M4m4
680F8j41o9Q8j2J11O6j75QN5j21J92K4l4O8J5Q6j90J0mRj20J39j03j31J32j3Q4
$$ plain form
707 42 29 -65 17 -76 30 3 24 66 28 29 18 107 54 -81 24 123 24 -17 65 -121 -65 23 -48 18 38 -9 -93 -12 7
736 7 9 104 152 140 140 72 -110 43 -17 -17 27 6 26 -151 -79 -82 -41 -9 -26 -93 64 53 58 94 -7 107 46 29 32 -19 52
767 52 -96 -49 59 44 13 -44 55 134 63 65 -17 89 -16 33 41 66 18 -4 -71 52 -14 -35 -113 -135 -137 -49 -3 19 116 -62
797 -62 -14 29 107 -27 82 -96 24 73 60 10 25 9 -27 -46 -15 -49 -18 48 8 23 31 -48 -63 83 -14 15 -29 -68 -54
826 -54 -84 37 144 -19 41 58 77 72 60 144 -85 -56 48 113 -100 -70 86 -82 -103 55 -46 36 -42 50 19 34
852 34 58 -72 -36 100 -97 18 65 144 6 -36 -2 34 -35 -60 -90 -28 -54 -28 -56 33 85 5 61 -84 -48 92 74
879 74 121 19 -28 -64 52 -10 -4 -118 50 85 -94 75 29 -6 -26 81 53 3 47 123 99 56 -53 -5 -23 -28 50 9
907 9 -53 -60 -59 191 25 -107 18 20 -55 41 85 -119 -45 13 66 85 -7 133 16 -25 -39 15 62 -66 -15 -67 -61 -29 -21 37
$$ packed form
707D2j3r4Q2r3J06k7K1M2l8Jj1Q9n3j35J05R9r9m1Q2j86N6Q8p1O6K0m7q4Q1J9
736GKR5M8j2%o8j82J53o0%M4k1K0j77P2lM1L2j7o7J57j1NL6j01J14o1j7Ln1P1
767E2j48M7J08j5l1n7R9P9p1Kq2J06j05M9QK5m8k2o7J23o6k1p8k2kQ8M6K2R7j78
797f2M8M3P8j34J09j78J20M9j3n0J5j6l6j9L1l4L1O6m0J5Qp9j5J46r7K9m4l9J4
826e4l0J21J07j63O0J7J9nj2Q4k29K9J04O5k13L0J56j68k1J58j01Q2p8R2l1J5
852C4K4j30L6J36j97J15M7P9j38m2L4L6o9k5l0O2k6K6k8Q9N2q0N6j45L6J40j8
879G4M7j02m7l6J16o2Oj14J68L5j79J69m6l5k0J07k8n0M4P6k4m3j09M8j8nP8m1
907Io2pJK50j66j32J25Kp5R6M4k04P4N8N3J9r2J40j17m1j4N4M7j28N1n2OL2QN8
$$ plain form
937 37 22 -39 -18 -4 8 9 49 15 84 -9 -38 8 12 -1 -56 68 -50 -69 29 -8 39 -17 14 -8 -17 84 84 -8 -28 24 15 8
969 8 108 14 58 -29 68 0 -19 -24 -121 58 36 113 126 -44 -29 -25 -8 -51 -12 -66 -54 -21 21 61 29 -5 71 68 19 67 -64
1000 -64 61 -90 -19 15 -72 112 16 41 -68 50 65 142 -212 -17 112 34 -11 37 -36 105 -70 -51 0 -39 2
1025 2 -17 8 -64 87 -45 10 50 85 -7 16 14 -49 63 62 -123 -1 50 61 63 -65 -71 -57 16 -95 49 -17 -1 41 -74
1054 -74 105 89 69 65 -10 -11 -135 78 -18 2 -35 59 -89 -5 11 3 25 50 -94 -65 -7 -22 88 33 -18 56 56 4 -86
1083 -86 18 72 9 -52 24 130 -104 88 24 -68 33 77 4 28 44 43 43 33 44 -43 6 148 -13 55 -77 0 8 21
1111 21 43 -107 -39 -17 81 132 71 71 -22 20 -14 -84 7 -43 50 -19 118 -52 -21 24 -115 -13 12 -45 -19 -10 77 -128
1139 -128 10 29 22 54 -48 38 65 2 22 3 -59 36 -37 123 74 -71 -59 -23 56 65 -37 26 15 147 79 16 14 -18
$$ packed form
937C7j5o1K1J4J2JM0l4O9r3k9M6Mj3n5J24j18j9R8l7M7n6L1k2rJ01%r2k0N2rp
969HJ00r4M4q7R7o8j9nr7J79k2P7J3j70J5MJ7m3L9n4J2L3M2M0l2l4P6lm9M8j31
1000f4J25j51P1L4q7J84r6K5j09J18J5P7l54J95J29p8m5M8p3J41j75J9N1l9M1
1025Bj9K5p2J51j32N5M0L5r2K3ko3J12jj85J22N1J1Kj28oJ4P3j11J44o6J6M2j15
1054g4J79j6k0mp5jj24K13r6K0l7R4j48Q4J6qK2K5j44K9N8j5J10n5n1P4%n2r0
1083h6J04N4o3o1P6J06k34J92o4r2J01M4p3K4J6j%j0J1q7M9J42j61O8j32P7QJ3
1111B1K2j50O8K2R8N1o1%r3M2l4p0R1n0R3o9J37j70L1M5j39J02K5n7K6RQ7k05
1139a28J38J9pL2j02Q6K7o3K0j9o2R5p3J60m9j45J2L6P9Rj02O3j1J32o8o3kl2
$$ plain form
1167 -18 -102 100 88 -28 -78 62 -57 16 -27 4 23 -59 -32 60 11 -47 -145 -135 -31 76 -62 41 -9 -57 47 -12
1193 -12 34 -6 -43 54 -123 -78 5 -35 -61 -47 134 2 -26 -64 -9 152 83 -24 -30 -32 -74 108 -129 -13 1 -157 25
1220 25 9 22 62 -50 -64 47 112 20 67 -9 13 -36 0 15 67 -92 98 50 -19 30 -27 47 -15 36 63 24 37 -3
1248 -3 -22 -11 6 -5 30 -75 4 42 2 -63 103 -37 -116 10 35 -24 -19 94 106 -60 56 -115 24 -21 -73 103
1274 103 105 85 56 111 55 0 -14 -50 51 -167 -53 0 -32 55 -74 49 -45 9 15 -21 33 -23 -62 169 45 -48 -78
1301 -78 0 -60 21 35 6 32 -160 -31 39 50 -27 -117 23 -39 81 -4 72 85 -2 78 -96 -44 -53 108 -42 124 92
1328 92 1 -9 -10 -69 44 45 -64 33 -40 50 4 -15 -43 -45 -10 67 -34 30 44 72 -56 25 15 -34 -52 -78 -25 -27 35 -30
1358 -30 -13 73 35 107 36 -2 -39 -92 -54 97 87 -50 -3 -7 -25 -80 30 22 -24 81 63 -54 -49 33 -23 -88 10 -41 81
$$ packed form
1167a8q4K02j2j16n0J40j19P3m3L1J9q2K7R2m9n8r8J0J04J07j38J03n0m8J04n9
1193a2M6m0l7R7j77M5Q3m0k6J4J81j32k8l8N5J61o9j07okm2J82k37J16J4j58J82
1220B5j6J3M0j12j4J11O5r2M7p6K2m9L6J5N2j59J90m8o9M9n7P4o2N1K7l9J3m0
1248cj9J1J7j1L5j05P9L8m0o5J66j40p9J26K5n9NJ13J2j66J16j71J39m5n2J76
1274A03Kk0k9N5n6n5j4l6J01k18J14N3l2Q7j29J23r4N4Ol6N4n6l9K31j24r3l0
1301g8P8o0Q1J4k9K6j92J29P0J1p7r0J40o2J20q5P6J3q7Q0j74N2rJ61j50J66l2
1328I2r1j0jn9J13Jj09R7p3R0m6j9k8kL5P7j01O4J4K8j28Q1j0m9j8k6N3kO2o5
1358c0J7Q6l8P2p1l8l7n3L8J51j0j37M7mj8n5J10qm6J05j8j17NQ2n6o5R8n1J22
$$ plain form
1387 81 -31 2 53 121 -157 76 31 -39 17 -24 -47 7 205 35 61 33 -39 43 -43 -19 18 25 -49 -32 6 -26 31 67
1415 67 59 20 -46 81 -6 -61 -32 55 75 52 -2 -55 45 -58 -3 10 30 -13 17 77 47 -19 20 -37 -19 -12 -14 0 -70 2
1445 2 -4 13 -22 12 -69 -17 73 102 -62 -51 -38 -61 140 -60 -24 -2 -99 72 72 29 36 -130 -15 -78 -62 95 48 -160
1473 -160 -28 -20 -36 20 -26 49 -11 -33 -22 -147 32 -58 -17 -12 -121 92 24 70 -29 -51 41 -19 42 6 10 -54 -9 76 -120
1502 -120 21 21 -68 126 106 2 51 -49 22 -60 -71 45 -23 96 -24 30 27 153 -124 40 -113 -38 -98 23 -53
1527 -53 62 50 75 -7 2 -13 -68 -78 55 114 -20 96 -19 49 17 44 -36 -66 -108 40 43 -62 24 85 -121 -14 44
1554 44 -10 -46 -2 112 65 67 114 -61 -30 -6 -72 -37 36 6 67 -102 -80 -7 -34 71 -25 47 116 25 4 -10 54 17 27
1583 27 -28 -57 -6 -30 29 29 -40 91 -27 -77 2 -7 -145 7 -115 74 -27 42 22 81 -30 -37 -88 -58 59 39 75
$$ packed form
1387H1j12L3N1O8k78K33m5p0N6m1k3N4J98j70K6k8p2Q2q6K4L7Pp4J7L8l2N7L6
1415F7ql9o6J27q7n5K9Q7K0k3n4n3J00j03N5J3K0m3L0O0l0o6L9n7J8PkJ4p0P2
1445BoJ7l5L4q1N2R0K9j64J1J3k3K01k00L6K2r7J71%m3Pj66J15o3J6J57m7k08
1473a60J32Qj6N6m6P5o0k2J1j25J79r0M1Nj09K13o8M6r9k2R2o0O1l6Mo4M5Q5j96
1502a20J41%q9J94k0j04M9j00P1q2j1J16o8J19j20N4lJ26k77J64j53P5o0J21p6
1527e3J15j2K5q2Rj5n5j0J33N9j34J16j15O8l2K7q0l0m2J48Lj05Q6O1k06J07N8
1554D4n4l6M4J14m7KM7j75L1K4o6L5P3l0O1j69K2P3k7J05r6P2O9r1k1j4O4l7J0
1583B7n5k9N1k4N9%o9J31j18n0P9rj38J52j22J89j01O9k0N9j11pn1L0J17k0L6
$$ plain form
1610 75 27 61 85 16 111 -98 -121 39 73 -69 -29 7 28 -59 57 85 -73 22 55 77 14 -82 13 -67 -101 122 41
1637 41 -32 -33 78 161 -89 91 68 -7 3 102 70 -13 40 -46 14 -29 -36 9 93 -96 9 -24 20 126 68 -18 -32 -47
1665 -47 82 22 36 65 -22 -82 -50 -9 -6 14 -27 -8 8 37 -36 -33 22 -107 15 -36 -101 -145 -16 -16 -19 -28 -93 53 90 -118
1695 -118 -135 64 59 -47 71 38 -40 -131 87 20 -75 -76 125 -40 106 -5 118 82 -139 38 -61 0 2 -156 -13
1720 -13 77 -43 11 85 -27 -1 108 6 -73 4 78 16 15 3 -38 90 16 -13 -20 -23 -57 -29 -49 39 -44 48 -7 21 -63
1749 -63 14 100 28 1 93 1 76 -29 20 1 -72 -110 10 9 -52 24 20 -27 -1 56 1 3 -6 -114 -44 17 9 41 -18 -75 -21
1780 -21 -14 -11 28 -32 -13 82 -40 -59 110 -60 -51 -40 53 -35 135 24 -77 -2 -53 216 -73 0 73 46 4 4 7 3 17
1809 17 76 -49 9 -159 113 -16 -77 12 -29 -12 -8 49 -86 175 51 -37 59 28 -6 65 -17 101 -80 36 -46 4
$$ packed form
1610G5m8L4K4o9R5k09k3J60L4j42M0L6K1q7J16K8j58R5L3K2o3r6R5q0l4K23q1
1637D1p3jJ11Q3k50J80k3p5J0R9l2q3N3q6O0m3pM5Q4j89J05l3M4J06n8q6j4j5
1665d7J29o0J4K9q7o0L2M1LK0m1J9J6K9p3LN5j29J22n1o5m4J29%lro5J46L7k08
1695a18j7J99nj06J18l3p8r1K18o7r5jK01j65J46j11J23l6k21J77r9O1Kj58J43
1720a3R0j20N4P4j12K6J09j02p9P7P4o2jj2m1J28p4k9pll4K8k0Q8q3R2n5K8q4
1749f3P7Q6p2k7R2r2P5j05M9j9p3l8J20jo1P6mm7K6N7n5Krj08P0O1qL2n9n7N4
1780b1PLL9o0J9R5j22j9J69j70RJ1R3q8J70j11j01P5n1K69k89P3P3k7m2%LmJ4
1809A7N9j25N8j68K72j29o1Q9m1J7MN7j35K61j24q8R6l1l4P1q2J18j81J16q2N0
$$ plain form
1835 4 -66 -86 81 44 97 -16 -29 -87 18 -22 24 -33 11 60 -35 0 -112 100 17 -14 -19 66 90 -8 103 2 -24 21
1863 21 163 -67 -15 -78 50 44 17 -164 20 125 157 -11 -10 14 -103 26 -27 -99 23 63 72 -29 90 -55 -54 -25
1889 -25 -75 36 -46 -18 20 29 -3 78 -42 10 -33 -4 -43 -39 61 -52 -46 -60 -7 16 -19 1 53 123 27 -70 27 -92 -10
1918 -10 20 76 -58 -63 -52 -62 39 87 33 -15 -11 -80 -58 -128 14 -1 3 -24 19 -42 -10 16 -39 -40 -74 13 15 30 -11 -39 77
1949 77 -16 -55 191 10 -141 -33 -32 29 -57 -3 10 13 38 -22 38 -37 35 -25 -108 21 -57 1 -70 -91 -57 15 -51 55
1977 55 2 66 -47 49 -56 -62 -38 75 -12 -22 26 -108 20 -15 33 -62 -87 44 -45 71 -15 93 -17 -28 12 -61
2003 -61 90 30 8 116 -2 50 7 -44 67 35 28 22 39 5 0 42 -46 5 -2 -51 26 61 -14 20 50 0 3 -10 8 -98
2033 -98 -8 11 -60 52 92 -4 9 -8 -55 28 -50 60 71 -75 18 60 -3 -74 -45 12 91 61 -26 -12 -11 -78 96 36 15
$$ packed form
1835Dp0k0J67l7N3j13j3n8J05m0M6n7M4M9r5L5j12K12q3l1nQ5K4r8J11j01k6M5
1863B1J42k30N2o3J28ok7j81J84J05L2j68JK4j17J29n3p2J22M0Rj01J19j45JK9
1889b5n0J11q2K8L8Rl2Q1j20N2m3K9l9MJ00j13Oj4N3K3l5K0N2P0r6r7R7j19Q2
1918a0L0N6j34nJ1j0J01M8n4m8Mo9K2p0J42j5Mk7M3o1L2K6n5jl4Q7KJ5m1k8J16
1949G7r3l9K46j81j51J08JO1q6N4J3LK5o0O0p5P2o0q3J29p8N8p1k1L4P2o6J06
1977E5n3O4j13R6j05oK4J13q7j0M8j34J28l5M8r5k5J31q9J16q6J08j10j1M0p3
2003f1J51o0k2J08j18N2m3n1J11l2poJ7l4nM2q8N1pm9P7L5p5L4L0n0Lj3J8j06
2033i8R0J9p1J12M0r6J3j7m7Q3p8J10J1j46R3M2o3p1K9N7P9l0q7J4Jo7J74o0k1
$$ plain form
2062 15 52 -30 91 -70 -44 -21 -20 54 37 26 90 -72 -62 104 25 17 50 -58 6 -18 75 78 34 2 -10 -117 -26 40 11
2091 11 52 -29 -74 -53 -53 -5 27 78 -36 3 -94 202 -68 63 -2 -57 7 44 36 -72 -24 30 40 -39 4 -33 53 -40 32
2120 32 54 -32 79 -42 83 18 15 -57 -63 17 13 -7 -83 31 49 12 1 -10 43 -37 46 33 6 10 42 16 -73 30 -45 98
2150 98 -32 -1 31 -16 8 -58 54 34 80 -40 -7 8 124 20 -11 -15 -69 104 -18 45 -39 41 -5 -48 40 90 15
2177 15 86 -11 -60 71 48 -3 91 -66 -104 42 36 -28 -25 -38 -1 -10 -26 18 -71 67 -10 8 -27 -118 -21 36 -10 10 -52 34
2207 34 -50 25 21 30 -10 -70 -47 0 104 46 7 10 94 15 9 -32 -54 20 -36 97 1 -10 -48 16 6 132 -17 -44 16 -62
2237 -62 30 13 -14 -23 136 -3 -14 -11 77 -29 72 -67 16 185 71 9 -73 8 -69 17 -35 3 29 -20 -19 23 -5 12
2265 12 -60 -149 -40 66 -17 -18 15 -19 37 55 13 93 110 15 -71 -18 144 -33 -15 8 51 16 40 -13 -25 -118 68 -10
$$ packed form
2062A5L7q2J21j61K6K3JP4j7j1O4j62J0J66p9qL3j08O4k4R3Lm4l2j2j07R1O6k9
2091A1M1q1m5K1%M8L2N1j14L9r7K96k70J31o5n5O4L7qj08M8N4J0p9M3l7Q6r3P2
2120C2K2q6J11j21J25o5lp2oQ0mk0p6J14J8l7j1j1N3q0Q3j3k7ML2k6q9J03p5J43
2150I8j30L1L2m7K4o6J12k0M6j20L3J5J16j04l1mn4J73j22O3q4Q0m6m3Q8N0p5
2177A5P1r7m9J31k3n1R4j57l8J46oo4Lj3L7rj6M4q9J38p7J8l5r1R7N7m6K0o2Q6
2207C4q4P5mRm0o0K3M7J04n8l9LQ4p9om1k2P4n6J33r6j1l8O4j0J26j49k7O0p8
2237f2R2j7k7rJ59j39j1LQ8j06J01j39Q3J69j14o2q2Q1p7Q6n2L8K6m9JM2k8J7
2265A2p2q9J09J06q3jL3l4N6J8m2Q0J7r5q6N3J62j77J8K3M3l5K4n3j2r3J86p8
$$ plain form
2293 -10 0 -73 2 -16 25 -59 24 -28 62 -91 14 60 25 4 34 -17 42 4 56 -27 -23 -32 104 78 -89 -4 -43 36 -24
2322 -24 1 -107 42 -19 -82 -74 -59 -139 -50 -54 -159 62 -93 46 40 -43 -111 -32 -11 -3 17 96 25 -37 3 24 59 74 27
2351 27 -139 -48 -26 25 -23 -34 75 -40 104 -44 125 -57 -2 47 -39 72 -29 43 -10 91 12 29 -60 -31 -35 -23
2377 -23 -48 22 -89 -26 -22 -109 11 129 31 53 -1 112 -37 36 -27 -155 -44 -24 -133 -97 -57 -64 -23 -42 20 -5 -60
2404 -60 -36 -85 -20 -31 -87 31 -33 1 2 59 40 36 -120 -32 46 -91 64 22 23 70 2 -49 13 -16 40 26 20 127 -54
2433 -54 191 -7 13 28 -20 38 -35 -43 -39 49 -120 38 77 -14 42 151 -44 -65 78 -79 -75 -70 -60 -16 -18 -31 76 -102
2461 -102 1 -42 84 -6 52 -34 -32 36 -57 99 -35 -126 38 5 -66 -16 5 -55 46 -82 -8 62 -55 -21 -63 -50
2487 -50 -78 -30 -22 -5 -6 -18 2 7 -69 -89 -48 -28 -38 -62 87 -10 34 24 -8 62 63 -9 6 133 40 40 -40 13 84 93 129 -47
$$ packed form
2293a0J0p3P5j8M1q4Q3n2R0j53J05M6l5k1L0n1N9l8N2q3MrJ36k6j67Q5l9P9o0
2322b4K5j08J49o1o3QJ5q0Q9mj05K21j55J39oq3o8P9K1QK0P9p1o2M0K1L5J5m7
2351B7j66R1K2N1m8j1J09j15J44j48J69j82N5M9q6J11j01P2n3J01p9J7q9K9mJ2
2377b3k5P0j11O3Mq7J20J18r8K2n4J13j49P3o3j28J11K0j09L6M0pM1j9O2k5n5
2404f0K4m9O5j1n6J18o4L4JN7j9mj56Q8P8j37J55m2JM7o8n1O2k9N6j4oJ07j81
2433e4K45j98K0J5m8N8p3qMQ8j69J58L9r1N6J09j95k1J43j57MNJ0M4kj3J07j78
2461a02J03m3J26r0N8q6KO8r3J56j34r1J64l3p1N0K1o0J01j28P4P0j17L4m2J3
2487e0k8M8QJ7jj2K0Np6k0M1K0j0k4J49r7M4j0l2P0Jp2J5J27r3%q0N3P1RL6j76
$$ plain form
2519 -47 -75 -18 106 -88 85 25 101 -25 1 86 -19 -18 41 17 9 -43 -109 24 21 -144 -48 42 -57 -192 9 66 -49
2546 -49 30 8 -11 20 -24 4 15 1 54 -79 -102 -123 18 60 37 80 -141 -1 4 -45 -28 38 -66 37 46 44 -41 60
2574 60 58 69 -141 19 -28 -17 37 12 -152 -13 -40 -31 29 54 10 78 58 51 -21 -126 8 6 11 25 -47 -37 28 19 58 66 26
2605 26 -38 -52 11 67 96 -16 96 -14 0 61 9 -64 12 49 40 53 -30 -22 50 9 -10 -29 58 -14 16 -4 -20 36 1 -44
2635 -44 -14 77 -29 -166 -16 -28 -6 49 110 65 8 10 -2 -44 -47 -2 41 107 111 -15 -15 -37 -15 -21 -80 86 -62 -13 5 14
2665 14 24 5 -77 -67 -60 -22 -101 -78 50 -34 67 13 -22 -51 26 66 29 8 -28 -54 9 19 9 80 -134 122 108 -30
2693 -30 -68 -17 -113 148 -52 24 -47 34 63 41 13 14 7 -87 -33 -84 51 8 -117 110 -53 -42 88 12 9 21 -3 -22
2721 -22 32 25 -16 -85 -17 -35 -44 -76 -46 -50 89 86 34 49 -6 25 76 47 -19 -83 36 20 -57 2 -64 -68 143 80 -91 -88 -12
$$ packed form
2519d7k8N7J24j94J73o0P6j26K6Q5j05JN9k4qn2o6J33lj65R6R0r9j35K01N7j15
2546d9P9k2j9L1m4K8J1j4N3j33k3k1J41M2k3M3k21J40Nm9J7O6j04J03Rkq5J01
2574F0kJ1k10J60m7J1N4k5j64J39k7RO0K5m4O8k0pp2j05J34kNJ4p2J0O5rL9Qm0
2605B6o4j4O3N6K9j12J12j10J4O1n2p3P6L7rJ3q3QP2m1j9j9Q7p2L0k0j6N6l5m5
2635d4L0R1j06j37J50j2K2N5O1m5n7Kj2m2lM5M3O6Mj26%k2K2on9J66j48M9J8R
2665A4J0j9q2J0PL8p9K3J28q4J01n4l5k9P7M0l7k1l6k6O3J0j0P1k14K56j4j38
2693c0l8N1r6K61k00P6p1Q1K9k2k8Jpr4N4n1J35m3j25K27j63J1J30p6lJ2k4j9
2721b2N4pm1o9O8j8rl2L0mJ39ln2J5n5L1N1k9o6o4J19j6p7N9o6mK11o3j71LP6
$$ plain form
2752 -12 68 -1 12 -160 -32 143 -86 -21 -34 -90 -17 -27 41 33 -37 -20 42 5 -98 184 72 52 97 -20 18 7 119
2779 119 110 -46 -7 62 24 -15 53 25 3 -12 -25 -18 -65 -1 41 -30 2 202 68 5 -22 -51 3 71 42 -71 -38 -37 -102
2808 -102 -44 -8 129 19 -86 119 -3 -14 -5 -20 -60 -27 29 30 73 20 -23 150 33 25 18 -54 25 8 84 25 -9 9
2836 9 -39 74 -149 -81 -61 77 55 -61 19 3 -63 49 4 -19 39 22 69 38 80 -130 -4 -16 -74 0 70 3 36
2863 36 56 -42 103 45 89 13 -4 -81 -32 27 74 7 6 -50 -23 -8 14 -61 -28 -76 -70 -47 -54 12 57 -50 -36 136 -51 -83
2893 -83 0 18 33 53 25 99 -69 -17 -6 20 -76 -110 7 -25 29 -13 -25 -15 -4 45 89 -79 -40 41 -113 -143 -20 22
2921 22 45 -1 6 16 76 -2 50 0 3 -46 -21 16 -94 -60 -39 -14 -59 58 118 91 -121 78 -25 -49 20 23 3 20 42
2950 42 -114 -24 -4 82 61 -29 75 -22 -46 13 54 -106 -95 41 -174 -90 -47 -16 33 -40 18 13 10 21 33 44 128 -38
$$ packed form
2752a2Q0o9J3j72J28J75k29O5j3n6P3j0O8qp0J7O2l7j03K82j12k0M5j17L8j1J12
2779A19rj56L9O9l8l9O8k8k2j5j3Pm7O4M2p1L2K00j34o3k7k9N4O8k9j13L3Jo5
2808a02N8L6J37j10j05K05j22j1Rj5m0L3N6JM3n3m3J73j17qpp2P9j7P6n9l4J8
2836Im8J13k23O8K0J38k2j16Q0j6o6J12m5k3N8j7M7l1M2k10J26j2n8P4P0o7L3
2863C6K0r8J45n8M4p6j7p7M9N9M7o7jn6K7J5K2p5L3m8OK3pO6M5j07J4J72j87l2
2893h3Q3J8J5K0k8P4j68N2J1K6r6l4J17l2N4m2j2J0J1M9M4j68L9Q1j54l0J23M2
2921B2K3m6PJ0O0p8N2n0Lm9K5L7j10L4K1K5m5J17O0k7k12J99j03k4O9Lk0J7K2
2950D2j56R0K0Q6k1r0J04r7k4N9M1j60J1J36k15Q4M3L1M9p3N8nlJ1J2J1Q4j66
$$ plain form
2978 -38 -57 -48 -56 98 57 -49 35 -35 86 20 -81 -72 -31 51 26 54 -24 26 -28 -27 -2 35 69 30 6 -12 -40 9 -17 42
3008 42 25 55 -116 -33 11 -41 -65 52 -22 60 -39 9 -16 23 66 -67 -17 40 -18 -22 -66 -10 51 -49 5 98 88 -88
3036 -88 17 -97 -8 133 71 -100 -42 25 27 98 64 80 47 -52 105 -32 -46 -84 91 43 17 1 32 76 -31 27 96
3063 96 -75 -41 -28 12 -18 -2 -78 102 -20 -70 -9 65 156 -33 -19 33 7 0 20 -1 -19 -34 -57 -30 0 52 42 46 22
3092 22 24 -49 74 55 30 -14 42 57 -10 2 -10 20 110 66 -13 -22 7 52 -54 -100 -18 89 -54 56 36 33 -29 -7 7
3121 7 -27 34 10 41 -90 -177 -130 -53 -41 24 27 2 77 66 45 -10 21 27 75 64 -102 121 134 14 119 -2 -52 -44 28
3150 28 -63 -83 77 -59 102 67 -75 -36 18 -53 26 -33 3 -70 70 153 -45 -29 -57 -40 35 -18 -66 -19 106 -62
3176 -62 -68 123 -18 -2 -10 57 7 20 -60 70 -32 50 -64 28 103 -38 1 -34 -67 -42 11 78 -11 -21 -30 -22 -23 -81 -59 22
$$ packed form
2978c8j9RqJ54m1j06Q4p0J21o6j01RM1Q2k5K8p8N0n4JK5L7L4l9k4j8k8M9k6N9
3008D2j7L0j71Q3M4n2k4J17p4Q2r9M8k5L9M3j33N0N7n8mm4N6O1j00N4R3j0j76
3036h8J05j14Q9J41o2j71N8O7KP1l4J6l3r9J57j37j4l8J75m8k6j6L1M4j07N8O9
3063I6j71L4J3M0l0J6p6J80j22n0O1P4R1j89J4N2k6pK0k1j8j5k3K7L0N2j0Mk4
3092B2Kp3J23j9k5m4N6J5o7J2j2L0R0m4p9rK9M5j06m6Q2J07j43J10k0lo2K2J4
3121Gl4O1k4L1j31q7M7P7J2O5Lk5P5j1k1n5L1OM8j1j66K23J3j20J05j21n0QP2
3150B8r1k0J60j36J61l5j42L9N4p1P9n9L6p3J40Q3j98J6k8J7P5n3m8M7J25j68
3176f2oJ91j41J6qO7n0J3q0J30j02Q2j14R2P5j41L9l5l3K5N3O7q9j0rQjn8K2Q1
$$ plain form
3206 22 32 91 20 -19 -52 -39 25 -27 -7 30 33 61 -16 41 -66 1 82 -114 -89 50 -61 28 -34 59 42 32 -31 53 35
3235 35 -46 41 27 28 -69 31 -78 -71 -51 -11 22 -43 -37 30 -35 95 39 -3 89 -46 1 -34 26 -40 -81 -11 159 -50 -29
3264 -29 89 33 -8 -66 -16 110 -72 2 -16 -20 0 -6 47 46 -17 26 -2 -57 26 83 36 34 42 -78 -38 -42 52 -105 59 -16
3294 -16 -117 -155 -87 -97 -14 63 70 14 -97 -6 31 45 -79 -6 -57 -126 -71 -43 -72 -16 -10 -44 3 51 118 20 -8 5 -61 92
3324 92 3 -30 33 55 64 15 -41 68 87 -43 9 64 -30 -64 -34 -58 -46 38 55 125 115 70 -12 -17 -14 -62 92 77 44 -42
3354 -42 70 130 33 -5 13 -50 1 25 -27 49 147 49 78 -63 62 108 17 50 155 36 35 3 104 -109 -59 -3 163
3381 163 -34 -3 -11 -68 -131 -27 -28 -10 -11 -104 -17 -67 -10 25 -31 67 16 -23 23 61 -54 86 -113 8 9 52 -20 -1 51
3410 51 55 121 44 83 11 -47 7 98 48 -25 28 -31 43 51 -63 -2 -7 16 50 -53 103 117 25 -15 -40 -38 -68 62 -9 30
$$ packed form
3206B2J0N9p1l9l3J3O4n2K0L7LK8p7N7j07O7Q1j96K5J39j11Q9o2R3j7j0o3Q4j8
3235C5q1Q7j4Jr7J00j09PK0M0L3o5OO7o5J30n6m2R2j35M7l5O0o6m1P0J70k09K1
3264b9J18n6m1n8N0J26j82P4j8mK0oN3jo3M3k8n5Q3N7m7kQj20M0mR4j57J64p5
3294a6j01l8O8j0Q3P7Pn6j11R1L7J4j24P3n1o9N5K8k9N6Ol4M7M8O7r8k8J3o6J53
3324I2q9l3O3K2Rm9n6J09J9j30N2N5r4l4L0k4J2Q4J7P0j0m5q2nLm8J54j5l3q6
3354d2J12O0r7l8J8o3N1K4n2P6R8r8K9j41J25M6r1L3J05j19jl2J01k13N0N6J66
3381A63j97L1qn7o3J04jJ8jr3Q7n0N7L5n6R8n1l9M6L8j15J40j99J21JM3p2J9N2
3410E1MO6p7L9p2n8N4R1n0p3N3n9P4Qj14O1nK3L4j03J56J4r2m0k5Kl0J30p1L9
$$ plain form
3440 30 110 24 2 -40 -25 98 10 6 8 -60 26 81 21 43 -73 48 -17 36 87 14 -18 -59 30 -8 32 0 -16 82 163 -56
3470 -56 -22 0 32 -1 -21 -12 -33 -90 -79 108 22 -44 17 46 66 6 -3 -30 36 60 -10 0 14 -20 -49 25 17 -36 36 -34 58
3501 58 -9 82 93 -47 -1 1 27 -30 45 128 -124 -56 33 59 85 33 164 8 -5 -22 -1 101 -70 52 -192 -65
3527 -65 32 64 83 -69 -8 -17 16 -4 -50 -132 58 77 113 -113 24 51 5 -39 -8 43 -10 -59 29 41 -56 89 108 37
3555 37 125 -63 -60 7 56 24 -136 45 -16 -96 25 37 -50 -25 107 -4 -23 40 51 28 90 49 51 -16 98 116 -118
3582 -118 -2 -124 79 37 -77 -9 -87 -70 -7 -86 20 101 51 -82 -75 85 -62 16 -91 2 2 17 -37 20 -12 86
3608 86 92 -91 -38 -56 57 -86 -103 131 -59 115 14 34 3 -6 -9 -108 76 99 -41 37 -30 2 39 83 -16 21 -38
3635 -38 -27 95 -4 17 -39 43 -22 76 76 -76 51 18 52 158 106 1 38 41 136 -59 -79 8 -20 1 51 -8 -28 -31 10
$$ packed form
3440C0Q0q6k2m2J5J23q8mKo8Q6N5o0K2j16J21o5N3N1p3l2m1Q9l8M0l2j6R8Q1k19
3470e6L4K2L2l3k0Rk1n7J1J87q6o6O1K9K0o0rk7O6K4p0J0J4l4k9P4qn3P2p0R2
3501E8o7R1J1j40M6KK6n7P5Q3k52O8Q9K6K6n2J31j56j3j7K1J02j71J22k44J27
3527f5R7L2J9j52O1rL3k0m6q2J90J9L6k26J37K7m6m4L1N1n3m9Q8J2r7J45J9p1
3555C7Q8j88LO7M9l2j60J81o1q0J21J2q7K5J32j11j9O3J1k3O2m1Ko7J14J8k34
3582a18J16j22K03m2j14O8p8J7O3p9J06Q1n0j33PJ60j47P8j07R3%J5n4N7l2R8
3608H6Oj83N3j8J13j43j7K34j90J74j01K0l1rlr9J84K3j40P8o7L2L7M4r9L7n9
3635c8J1J22r9K1n6Q2o5R8%j52J27l3L4J06n2j05L7LR5j95k0Q7k8K1N0n9k0lM1
$$ plain form
3664 10 10 -55 -15 -50 84 41 -53 -42 11 -66 53 -13 -7 -25 120 10 53 85 35 -11 23 10 -87 84 -94 -64 40 -36
3692 -36 0 4 22 -72 67 73 45 1 62 122 19 -14 -31 44 14 -37 -25 -14 43 57 -3 32 49 -43 -42 10 37 18 31 17 -58
3723 -58 -60 -98 -45 85 5 -90 2 -58 9 -19 -10 -24 -28 12 -18 -48 18 -51 34 33 46 5 -39 85 -17 -61 18 39 -54 54
3753 54 28 17 -24 6 -17 66 -49 -27 29 91 -30 -33 169 -1 87 -23 -9 -48 23 11 -111 -53 -77 -21 -55 -1 23 12
3781 12 -26 1 62 -5 9 26 -31 113 78 53 11 -82 129 -82 45 31 -88 -21 -78 28 -32 -55 5 20 -117 73
3807 73 38 58 31 105 -61 -81 -34 -33 31 -179 143 -81 13 -69 -9 15 30 -43 -19 55 77 80 -65 1 -65 38 -32 117
3835 117 30 89 162 63 12 47 -34 -51 -60 -45 -33 -94 -68 68 30 -44 -6 -12 -14 52 45 -3 8 -67 63 -68 -46 -21 -64 16
3865 16 5 45 -53 43 -20 71 34 2 59 102 45 65 43 28 -69 -21 -4 -39 -11 94 111 30 17 -84 18 -27 -87 -32 33
$$ packed form
3664A0%o5M0l5J34m3r4J1N3p7J19o6Oj8J45j10M3L2n0m6L4j3r7J71j78L0J04p6
3692c6L6MJ8r4J39Ok8m4O1O0j03l3j7P5l0n1J2J1N7J4o0L5J7r2JN2K7j9J3j4p5
3723e8kl8N3J30q0r5R2o0O7k8Rj4mM0l0l0O6o9Q5jJ3m1m4J24j02m4P9K1r3J08
3753E4k6j1m1L0k3Q3j15K2N6O2j21lK02j70Q8j10J4l9P1j2j22N8k4N6l4N4K4j1
3781A2l8K7O1o7J4J7n7J44l5k5m2r3K11k11J27j4j19O7n7J06o0k3O0J5j37J90
3807G3l5K0k7P4j66k0M7JO4k10L22k24R4q2O0K4J5p3K4P4K2Lj45O6o6J03p0J49
3835A17q7N9P3r9n1L5q1j7rJ5J2o1K6J36l8p4L8okO6pm8J1p5J30j31K2K5m3Q0
3865A6j1M0r8R6o3R1l7l2N7M3n7K0k2j5r7M8J7l5K8J05J7q1j3j01J02m5o0N5O5
$$ plain form
3894 33 -3 -115 18 66 -81 -44 -8 28 8 -68 -26 14 115 -4 -19 -60 26 28 75 34 47 79 14 -63 -3 13 -34 -23
3922 -23 51 -45 41 -9 -73 -40 26 86 -8 -19 23 86 -62 -26 1 -28 -33 -62 -46 -98 57 28 -36 11 -79 -8 10 -77 47
3951 47 28 -46 -16 -34 108 68 56 64 77 -34 -9 -20 30 59 -41 -1 -79 54 -40 -103 -52 -40 -22 108 -74 61 32
3978 32 -8 -24 -14 -28 60 5 -67 -3 -73 -65 99 -7 40 22 -8 -1 84 -26 -28 -8 23 62 -53 76 -2 19 18 -70 76
4007 76 -64 -38 -59 -83 60 18 52 -6 69 3 177 8 11 70 16 24 59 -90 70 82 113 -23 17 22 -13 -25 -64 45
4035 45 -7 -11 89 -117 -22 118 15 53 -19 -51 -59 77 -31 -83 -52 98 -73 -50 -32 -49 23 -33 -48 46 148 24
4061 24 88 -23 -2 108 -40 79 -8 55 93 29 140 20 -82 10 -82 102 7 -48 59 -105 -78 -9 -5 45 18 66
4087 66 45 -116 -5 11 -83 -68 -3 71 -12 10 13 -53 33 -49 27 7 -32 107 -32 82 -21 32 -73 -52 98 52 -6
$$ packed form
3894C3l6j12J33M8j47L7L6L6k0p6M2M0J01j19j5m1Q6KM7m1J3L2o5p7O0J6m7J1
3922b3P4r6Q6n0o4L3O6O0r4j1M2O3j48L6K7k9nk9J6n2J55k9o4M7r0P1J8q7J24
3951D7j9p4L0j8J42m0j2QJ3j11K5j1N0K9j00M0p8J33r4o3N1J2J8J30j82J35k9
3978C2m0j6J0j4Q8n5p2O4p0QJ64j06M7j8l0PQ5j10kK0L1L9j15J29p8K1jq8J46
4007G6j40K6k1k4J43m2L4n8P5o6J74j69LN9n4QL5j49J60J2L1j36M0Nl5j2l9J09
4035D5n2mJ00k06R5J40j03L8p2l2qJ36j08n2L1J50j71K3J8j7P2n6j5R4J02j24
4061B4O4j11K1J10j48J19q7O3L8o4J11j20j02R2r2J84r5n5J07j64K7O9MN0k7M8
4087F6k1j61J11J6r4J5O5P4q3K2Lo6Q6q2P6k0l9J39j39J14j03N3j05K1J50m6n8
$$ plain form
4114 -6 -12 75 21 0 66 -16 15 55 -11 89 -101 27 55 -46 29 -8 16 -32 -55 36 -10 80 47 61 -55 17 94 -25
4142 -25 -21 -44 114 -73 30 27 -17 9 4 36 54 -29 -20 42 61 118 -36 20 -6 22 -61 83 -6 -77 88 121 -3 -35 64
4171 64 -59 -104 52 85 -8 54 -1 -6 60 63 -78 10 -69 -57 2 64 -141 18 -18 -46 22 -32 36 17 -23 -13 90 -28
4199 -28 -14 44 -11 29 -58 -26 -17 9 16 -64 82 -29 -48 -48 -41 104 70 38 -9 -31 -71 38 -2 27 -6 -116 -65 4 -39 0
4229 0 -40 50 52 -2 -27 19 -21 22 -17 7 -31 -37 12 32 41 -40 -93 -63 -36 -1 -50 111 76 7 48 32 -15 41 -36 100 147
4260 147 -86 -22 -26 35 17 -16 -55 -1 60 -60 18 -111 29 -60 -22 -73 2 33 -88 22 -57 27 37 -51 -28 -7 12
4287 12 -9 -2 37 60 5 -6 -10 71 54 7 -80 96 -25 27 -49 -47 11 -76 -42 139 -122 40 5 21 69 48 20 -80 -5
4316 -5 -22 89 -67 -57 9 -58 -30 -103 -46 201 -46 11 -83 -63 -1 -66 33 -83 -13 -36 -53 25 -23 -60 59 -176 88
$$ packed form
4114foQ7n4k1O6q2L1M0o6J00j90J28K8j01P5l7K4m8k3R1m6R0l3J4j16P2P7j19
4142b5Mk3J58j87J03lm4K6nL2J8q3RO2J9N7j54N6k6K8q3J44q9p1J65L3j24l2R9
4171F4j23m5J56L3r3O2n5nO6Lj41Q8p9J2N9O2k05J59l6k8O8n4O8j9m0J0J03j18
4199b8J4N8n5M0q7L2RK6Pq0J46j11j9%PJ45l4l2m7k2m0J09m0K9l3j10N1O9m3L9
4229@m0R0Kn4k5M6m0M3l9K4l8oM9K0Rq1n3L0K7L5m9J61l5o9M1j6m7N6p7J36M7
4260A47k33O4mO1j8l3l9N4O1j20P8j29J40q9L8n1P5L1j21J10p9Q4J0q8K3K1J9
4287A2k1PL9K3n5j1mQ1j7m7q7J76j21N2p6KN8q7L4J81k61J62l5J6M8k1k8j00P5
4316ej7J11j56J0O6o7K8p3N7K47k47N7r4K0O2o5R9j16P0k3j7P8m8l7J19k35K64
$$ plain form
4343 88 -20 -14 39 -17 44 1 -107 3 46 -93 -42 35 3 -29 3 -58 -135 4 -45 9 -43 22 -2 -63 7 13 4 64 -34
4372 -34 -57 100 18 -54 -6 -47 9 -68 -84 13 86 16 -38 157 22 -21 79 15 52 -47 0 -22 -48 -42 46 8 10 -17 -10 40
4402 40 -84 34 68 4 -18 -17 -24 -107 25 -8 64 3 52 -57 49 49 -58 7 -68 69 -88 -15 18 109 -38 13 -55
4429 -55 -28 -12 6 -16 77 13 60 -27 113 5 -93 -13 0 -60 87 50 -6 20 -5 1 57 30 -18 18 -42 29 -38 -62 69
4458 69 -71 30 -74 107 -19 -132 -38 -21 -4 84 -12 3 49 80 60 17 40 -132 -54 -2 -20 57 -96 9 86 -87
4484 -87 -20 72 -80 -97 -3 129 -61 -9 -14 33 20 -12 69 81 -48 -62 -61 -163 -37 0 99 112 8 -85 11 -53 36 -19
4512 -19 -10 44 30 2 -54 42 -31 17 -35 -74 17 74 -25 34 92 41 -97 48 11 -3 49 -38 6 34 132 -73 -66 52 -72
4541 -72 17 64 -33 3 21 -25 -161 -60 98 131 12 56 90 46 26 35 -22 76 -49 27 -27 37 55 90 56 -89 -29 -60
$$ packed form
4343H8j08ON3n6O1m3j08J10M3j39N1P7l2l2L2o1p7J39m9N4n2O5k4o1P0OrO0r8
4372c4k3J57q2p2M8m1N6p7j6R7P3p0n4J95j35m3J00o4L7r9M7k2k6OQ8l8Kk7PN0
4402D0j24J18L4o4k2Jpq3J32l3P2o1M9j09J06%j07O5p5J37j57P3L3R1j47N1o8
4429e5K7J6J8k2R3o4M7q7J40j08r8Q0J3o0J47l7n6K6k5ON6k7m8L6o0P1o7k4J31
4458F9j40J01j04J81j26j13R4J7J7Q8r6J5M6L1k0m3K3j72P8N2j8P7j53J05P7j73
4484h7O7R2j52j7R4J32j90N2nM7j3l2Q1J2j29j4Jj02J26L7R9J3j04r3R6o4Q9n5
4512a9RN4j4k8n6R6p3M8n2l9R1N7r9N9N8n1j38J45l7j4N2q7M4K8R8k05PJ18j24
4541g2Q9M7r7L6J8m6j36J01J58L3j19M4L4m4k0Rn7R8j25P6n4O4J8L5l4j45O0l1
$$ plain form
4569 -60 -27 -20 18 -61 -60 91 4 15 -16 -54 93 -13 35 77 -100 -12 -27 45 63 44 53 6 -32 39 83 110 -11 -23 -20 31
4599 31 62 95 65 -45 3 33 -16 -46 -87 -65 -23 28 10 69 -11 -31 -17 57 -70 -52 -90 37 50 53 69 -130 -3 -73
4627 -73 -113 -45 77 -1 -16 38 -11 -10 -45 -78 -178 -8 46 -31 63 -28 -124 35 -56 -100 48 -146 59 53 3 187 100
4654 100 3 57 66 -77 -101 -19 34 -39 -19 -46 95 14 9 50 -99 15 1 27 32 -114 15 -18 -131 -29 82 136 24
4681 24 99 46 94 51 13 -8 122 98 -50 65 6 7 45 -5 -34 44 6 69 32 39 5 27 -48 83 -12 -73 -27 23 -72
4710 -72 179 27 -18 145 93 46 -69 18 58 -17 83 -1 -148 10 -45 -81 61 -4 14 -35 -37 -71 166 12 -130
4735 -130 91 21 -24 8 -102 29 -34 8 -6 29 -2 -42 26 97 78 40 36 -6 -41 118 64 -25 4 7 56 -46 12 66
4763 66 47 33 37 -98 -60 8 -141 -7 -53 -15 90 -27 -81 -54 80 42 -51 5 -23 -4 -51 -7 -24 14 -54 -16 -5 84
$$ packed form
4569f0L3PL8p9JJ51q7J1l1l8J47j06M8M2j77Q8j5P2J8j9Rm7l8P1M4K7j21j2LN1
4599C1L1L3l0j10M8L0m9l0m1K2M2N1j8N9q0k0J4P4j27J8l8J27J3LJ6j99J27p0
4627g3m0O8J22p8j5N4m9Jl5l3j00J70N4p7R4r1r6J59r1m4J48j94K05on0J84q7
4654A00r7N4Rj43k4Q2N3p3K0k7J41q1nM1j49J14j4K6Nj46J29l3j13J02J11N4j12
4681B4P5n3M8m3l8k1J30k4j48J15n9JL8n0k9P8l8O3l7Pl4K2p5J31r5o1M6N0r5
4710g2K51j52m5J63n2m7j15Q7M0p5J00q4j47J58n5l6J42o5J8m9kl4K37j54j42
4735a30K21p0m5L2j10J31o3M2j4L5l1m0O8P1j9l8mm2l5J59n4q9K9LM9j02N8N4
4763F6j9j4Mj35L8O8j49J34m6L8J05j17n4K7J34l8r3N6k8J9m7M4j7L8o8L8J1Q9
$$ plain form
4791 84 -50 68 1 6 30 -54 51 -98 7 24 113 -103 -14 28 -35 37 18 21 -12 -28 -68 -109 15 -67 -4 -19 -21 20
4819 20 33 -24 -16 -124 -19 -38 29 -10 174 -28 -36 57 -20 2 -2 -41 13 -19 23 10 -104 32 73 -7 -49 94 25 -28
4847 -28 -9 37 72 75 3 38 -86 159 -5 19 -75 9 -78 -87 17 -59 -130 -102 141 -12 -5 -35 -60 19 -4 34 -44 53 -132
4876 -132 -8 92 -19 -3 -54 -60 93 18 83 70 37 -64 -66 40 -34 -24 -40 47 82 92 74 -36 118 -81 61 39
4902 39 -39 -25 43 30 -50 27 58 4 -48 -41 113 -77 11 16 -54 5 91 -119 -79 -47 27 10 -74 -41 44 -143 -25 16 32
4931 32 151 -36 -51 3 -91 29 45 35 127 64 56 -10 -19 5 50 -11 -25 -53 -102 -79 64 -21 -2 16 6 26 28 -12 104
4960 104 -107 109 8 81 -69 -32 64 34 -28 12 -18 78 -51 26 43 -1 91 74 8 -23 53 45 14 -67 -6 -35 -1 15
4988 15 -71 28 -63 88 -37 82 1 -41 34 -23 19 23 16 14 11 70 7 1 -42 -32 81 -16 19 -7 -6 -5 37 112 -16 -28 82
$$ packed form
4791H4j34J18o7NK4q4J05j49J05J7Q9k16Q9M2o3P2j9Ll3j6m0m1J24q2O3j5kM1
4819B0J3n7Qj08J05j9O7l9J84k02qR3p7K2ml9N4l2M2j3j14J36M1q0m2J43o9n3
4847b8J9M6L5Lp2L5j24K45j64K4r4Q4q7rJ04p6p1K8K43j53Pl0k5P9k3L8p8R7j85
4876a32J24J00j11J6n1oJ53p5O5j3l3j01kJ06p4J0j6Q7L5J0j8j10J54j99J42k2
4902C9p8J4O8j3q0P7L1n4n2PJ54j90Q8Np0N9Q6k10M0L2P4j7q4L3Q5j87J18M1J6
4931C2J19j87j5N4r4J20J6j0R2o3qo6rK4M5o1j4k8m9K3J43q5J9J8j0K0Km0J16
4960A04k11K16j01P3j50L7R6l0o2M0l0R6j29P7J7m4R2j7o6l1P6ql1q1O1k9L4J6
4988A5q6R9r1J51j25J19q1m2P5n7M2MpklN9o3om3J0J13r7L5k6JJM2P5j28j2J10
$$ plain form
5019 82 -5 82 53 -15 76 134 15 -41 3 -79 -41 115 17 76 40 -56 48 -41 -51 30 -1 -1 -18 54 -4 -78 37 -60 -39
5048 -39 2 -15 2 8 40 -47 14 6 25 26 -15 8 3 -15 56 50 -48 -23 26 -94 78 -53 -41 -25 19 17 45 41 -27 78 84 -94
5080 -94 -22 55 138 17 -18 22 5 -70 -62 -93 -10 -42 34 -47 -90 -6 0 -4 26 -51 15 -44 -92 -52 -42 -31 85 -67 7 -31
5110 -31 37 -57 71 45 -10 -31 -15 -36 -45 43 48 38 -72 23 -124 -7 -48 67 -134 -1 27 15 -93 -94 19 -97 23
5137 23 15 -9 -47 170 56 -57 -9 94 53 -67 68 -79 -19 1 -46 138 -58 -12 52 -54 85 -15 21 31 -41
5162 -41 97 35 2 13 -3 -63 -52 -52 14 -23 54 -24 31 38 -16 69 -22 -29 30 22 9 32 42 -4 65 22 -63 3 44 24 15 -18
5194 -18 73 -64 -17 -71 8 -77 -117 -26 -32 -29 34 25 2 15 -4 29 5 -66 -63 -16 24 -21 40 -12 -43 -16 -73 10 -23 -15 -35 8
5226 8 3 -46 117 -16 -29 93 1 -47 -9 -65 5 -113 100 -20 51 -42 -103 58 91 30 61 -77 10 12 -69 120 -6
$$ packed form
5019H2q7Q7k9o8R1N8j19n6M4q2L8J56r8N9l6r6J04q9j0Q1l1%j7P2n8p4J15r7K1
5048c9M1j7J7OL2q7O1qJ9Jm1K3nj8P1or8K5M9j20J72j31J2J6M4kK8mo8J05Oj78
5080i4P2P7Q3j21l5M0j7p5Ql1Q3l2P6q1m3Q4OmL0p7O6n9m8M0J0J1J16j52P4l8
5110c1O8r4J28k6n5k1J6k1rQ8Nj0j10R5j47J17m1J15k01J33K8j2j08jJ13j16J20
5137B3qk4l8K17j14j13M8J03m1j20J35j47O0K0m7J84j96M6O4j06J39j00L6J0p2
5162d1J38o2l3J1j6o0J1%O6l7P7p8N5Pn4Q5r1pN9qj3K3J0m6O9m3q5O6M1k0rl3
5194a8R1j37M7n4P9q5m0R1oLO3rk3J3j9L3k4p1LM7M0m5O1n2l1K7n7Q3l3Qk0M3
5226Hnm9J63j33j3J22r2m8L8n6P0j18K13j20P1r3o1J61L3o1L1j38Q7Kq1J89j26
$$ plain form
5253 -6 -10 -1 -60 -88 -51 45 -35 -63 11 -61 35 66 41 0 -47 -84 61 73 92 -29 41 69 29 3 27 -11 -37 40 58 -22 -10
5284 -10 -7 15 -71 -20 26 -72 63 -7 -46 45 28 -14 -19 83 -11 -21 -149 -28 -78 8 -83 -23 -17 58 -96 -36 -11 61 -67
5313 -67 -2 82 0 -30 -43 58 -76 -30 1 -31 93 105 60 -96 89 -14 31 -13 156 22 25 37 -77 -8 -42 -4
5339 -4 90 -41 10 57 5 84 -92 -71 -32 25 -17 -127 -28 81 20 -42 -47 -83 19 -19 -36 -11 54 1 77 -43 1 54
5367 54 7 -53 -63 18 -6 -34 71 53 116 -24 -172 57 42 -12 34 98 -26 -22 -50 15 9 -96 -19 -90 50 42 -38 39
5395 39 88 46 53 4 -51 3 -9 -45 -22 -36 -71 1 44 17 -29 -52 101 -103 -67 -45 -76 4 79 -79 48 -32 77 -45
5423 -45 -32 -73 55 -1 21 -31 -50 55 -109 -91 62 42 -65 59 2 -32 17 52 0 40 -2 72 10 -12 31 130 -9
5450 -9 -92 34 -63 -45 -45 -24 -11 24 45 -6 2 -42 27 87 53 25 -67 59 41 0 32 -64 27 -50 -10 -33 -118 26 -7 11
$$ packed form
5253fmRn9k8L7R6q0k8P4p2R6L1k5m1m7l7J45J2J9j21P0K8m0k6K4l8k6P7J8q0J2
5284a0LK2q6N1M6r8J35p0l9R1j7m2nJ02r4j0j28J21n0Q6r1O0OP5j54O0K5P2j28
5313f7O5Q4q2l0j3J01j34M6L1l2J24J2m5j56J85j03M5m4J69j34LJ2j14O9l4L8
5339dR4j31N1M7n2P9j76K1L9N7m2j10R9J09o1o2nl6J02l8j7K5O5n3P6j20M4N3
5367E4m7o0j0Q1k4k8J05j8O3j40j48K29j5n4M6O4j24Mk8O5oj05P7p1J40qq0P7
5395C9M9m2Pm9n5N4j2l6K3j4l5P2M3k7m6k3J53k04L6K2l1Q0P5j58J27q0J09j22
5423d5J3m1J28n6K2n2j9J05j64J8J53k0j07J24n7l4M9L5n2M0m2P4o2k2M3R9j39
5450iq3J26r7J8%K1J3L5K1n1Qm4O9O0l4k8r2J26j8m1L2r6R1p7M0k3q5J44l3J8
$$ plain form
5480 11 65 1 34 0 -26 -14 120 132 -29 93 -26 16 74 -28 -26 -65 5 -11 22 -8 -20 -29 80 67 65 -22 126 -105
5508 -105 -51 13 -38 -18 6 -38 29 26 -18 3 -80 -38 34 37 21 56 77 129 2 12 -29 -124 27 -147 -78 16 51 -8 74
5537 74 22 81 18 34 152 40 -69 37 38 12 -29 27 -29 18 -4 -184 76 -42 49 -21 110 42 -44 -4 -29 74
5563 74 -52 63 21 -100 87 0 -46 -102 75 -45 -13 -23 -137 38 -24 44 -46 41 21 51 26 -31 50 36 -45 -20
5589 -20 -41 -10 -152 -108 89 -33 53 74 -56 2 -106 21 83 -21 -15 -21 -66 29 -88 65 39 58 59 -14 -2 -80 94
5616 94 -105 16 43 24 -19 22 -15 21 29 116 -56 82 100 -71 59 66 -30 -41 65 54 87 9 -25 -43 4 25 14 54
5644 54 -60 -58 15 25 35 -120 -26 58 -29 56 -11 20 19 -37 -18 -57 22 -35 34 109 -51 -82 81 -73 46 33 -11 21
5672 21 7 -92 12 7 12 109 -68 -70 -17 -70 -80 31 52 113 -18 81 -12 1 15 6 56 15 -12 9 72 48 -26 55 44 -27
$$ packed form
5480A1N4o4L3l4k6J2J34J2j61J22j19M2N8j02Kl9P0j6L3l0j2rJ09j3kq7J48k31
5508a05N4O4n1K0K4m4O7lm4K1q3M2P2Lj6L5K1N2j27J0m1r5J51j74O9R4L5n9Q2
5537G4n2N9o3J6J18j12j09J06Jk6m1N6n6M7k2j80K60j18R1p0J31o8q6M0k5J03
5563G4j26J15m2j21J87q7m6n6J77j20L2j0j14J75o2O8r0Q7k0L0k5n7Q1j4q1K5
5589b0k1L1j42M4J97j22Q6K1j30N8j08J27O2j04Oom5R5j17J53k6J9Jp3J2p8J74
5616I4j99J21K7j9m3M1l7L6QQ7j72J38J8j71J30Pr6j1J06j1L3p8l4j8M7K1j1M0
5644E4j14KP3J0J0j55R4Q4q7Q5o7L1jn6J9l9P9n7O9P5j60l1J63j54J19j3m4L2
5672B1j4r9J04nNR7j77kN3n3j0J11K1O1j31R9r3J3J4rN0m1k7K1O3k4p4Q1j1p1
$$ plain form
5702 -27 -58 -2 25 32 2 -83 110 -21 16 15 -88 -8 19 26 45 0 -77 -94 -14 -4 19 61 -72 -64 8 -132 45 -6 -17
5731 -17 -86 -34 32 -88 -8 64 -14 -31 72 64 -93 31 61 -75 -5 51 -174 39 105 -24 53 14 -53 -27 13 -36 54
5758 54 -39 62 -49 31 21 -52 -48 -159 14 18 -106 40 -18 31 -22 -53 -87 -19 34 -3 46 -90 -77 10 -5 -35 -62 -48
5786 -48 11 78 -66 -37 65 -54 -60 -34 -62 1 -31 7 -82 -69 -37 40 69 28 -66 164 -54 33 -46 -37 58 36 57 -103
5814 -103 -67 -16 -55 16 -42 -36 -32 31 -45 -104 -30 -39 -26 -6 -88 32 -62 47 56 26 62 -73 -131 -76 16 -40 -19 -23 74 53 32
5845 32 3 53 -95 -94 -3 -72 10 12 153 112 -8 -109 27 34 -75 23 -75 -75 -21 6 29 -43 -120 -74 15 -15 45 -46 30
5874 30 34 46 -25 50 77 11 -4 21 26 29 55 60 -1 -122 13 43 38 -49 17 105 7 11 38 -44 -29 -21 3 -52 -8 -9 -71 43 -98
5907 -98 -72 99 85 38 -57 -41 31 89 32 40 40 119 -68 35 -37 -16 -95 -48 97 53 -35 13 -115 -17 -8 -10 67 -28 91
$$ packed form
5702b7l1N6K7Pl0q5J93j31L7jj03Q0K7PJ9m5p7j7Q0J0K3M2j33QP2j40J77n1j1
5731a7o9N2O6j20Q0P2p8j7J03qj57J24L0j36P0N6k25K13O6j29P7l9o7K6M0m9R0
5758E4r3J01j11Q0j0p3Mj11J73Mj24J46n8M9n3l1l4O8N3l7M9j36J3Q7j5l0k7J4
5786d8N9O7j44K9J02j19oK6k8O3l2L8q9J3L2P7K9m1r4K30k18Q7p9RR5k2K1j60
5814a03L6N1l9P1n8OMO3p6n9P4rJ3K0q2J20r4J09Rl0L6j35n8N5R2n6K1mR7k1k1
5845C2k9N0j48JR1o9Q2KJ41m1j20j01J36Pj09R8r8%N4K7K3p2p7M6Q9l0O0r1P6
5874C0MJ2p1P5K7o6j5K5NLK6No1j21J35L0nq7O6Q8r8MK7q2J5QK4n5M4jo2J14j41
5907i8K6J71j4m7r5J6P2N8n7Q%P9j87J03p2K1p9M7J45m4q8M8j28R8RkP7r5J19
$$ plain form
5936 91 -110 43 57 31 -6 -1 7 -61 13 5 63 -3 -18 -21 55 -18 44 -18 29 -47 -34 -14 88 52 26 -60 -124 42 -59 -129
5966 -129 -14 -23 13 -14 32 98 -89 24 124 46 -32 14 58 -86 71 0 -3 30 35 34 48 88 47 82 9 -183 -3 19
5994 19 -82 -55 -27 -76 -50 -51 -76 -37 87 58 52 -96 40 19 -3 41 -4 3 -114 -20 65 -38 -38 -23 2 -34 90 108 63
6023 63 101 1 -28 99 137 -32 -46 52 -38 -4 9 59 16 96 15 -129 15 3 35 8 15 -8 40 -164 0 16 4
6050 4 -44 -77 59 48 -56 -125 11 45 8 -5 -52 -4 34 -57 36 24 67 -69 -37 15 89 -86 -39 18 -149 -42 -156
6077 -156 -23 54 -61 -43 43 5 -49 -81 61 58 -18 37 10 120 -58 114 -31 6 15 -86 -99 -30 58 -126 -31 85
6103 85 -2 -34 7 -47 18 47 11 -18 -40 9 30 -102 -86 11 58 35 -40 102 61 47 58 17 77 141 -58 -9 44 24 -25
6132 -25 97 4 69 -114 -72 38 -46 46 1 -106 18 -124 1 15 58 -42 -4 -133 77 79 -29 24 -3 -53 8
$$ packed form
5936I1k01J53J4k6l7NQo8P4qN8o6j5lP6p3O2o2M7p6J3K0J02l6k6q6o4J66j01p0
5966a29J15rL6k7M6O6j87J13J00p8p8M6M4j44J57p1lL3NjJ4M0m1L5p3j92J80K2
5994A9j01K7K8m9K6jk5L9J24k9oj48J36k1k2M4m5Pj17R4Q5j03%J5K5l6J24J8m5
6023F3L8j00k9J27L8j69j4R8r0L4J3N0m3Q0q1j44J44j2L2k7Pk3M8k04J64J6j2
6050Dm8l3J36j1j04o9J36L4l7j3m7M8L8r1R3j2M3j36L2N2P4j75M7N7j67J07j14
6077a56J33P7j15J8Q6l8n4l2J42lp6N5k7J10j78J72j45L7Rj01j3O9Q8j84R5J16
6103H5q7l2M1n4O5K9l6k9k2M9K1j32J6R7M7k3p5J42m1j4J1m1O0O4j99M9N3k0m9
6132b5J22r3O5j83M2J10q4R2m5j07J24j42J25J4M3j00L8j29K10Kj08N3k7n0O1
$$ plain form
6157 8 -152 -76 -152 -6 -112 40 -12 -28 129 11 52 -38 -86 -50 29 -76 -10 -44 10 40 67 76 32 -15 4 -10 -45 14
6185 14 1 -62 184 -78 -123 40 -27 81 -35 18 40 -39 58 -18 42 21 -32 11 22 13 20 64 -73 25 4 -34 -12 87
6213 87 -53 10 -89 -38 36 -13 -16 -121 -49 -39 -87 34 -117 -2 -16 -71 -38 -47 45 27 27 138 85 -20 -27 -32 18 45 62
6242 62 51 -25 -73 23 97 55 -44 64 -23 -47 42 83 -52 -10 131 69 20 -101 -14 -20 -12 46 20 -71 16 -42 39 -141 -51
6271 -51 -39 -30 -141 109 -27 31 -9 76 -14 5 -89 33 -17 -83 -4 6 14 -91 -87 -14 -11 1 -29 -87 -12 90 38 -17 -7
6300 -7 40 -38 26 -43 53 51 -128 40 -10 -9 19 -14 -32 5 -88 71 13 22 -62 -82 -126 45 -37 4 36 17 68 60 8 -21 3
6331 3 103 45 33 -12 -28 0 -22 -42 88 -74 -80 79 62 -19 -55 -19 -101 37 -68 -2 -105 -14 -33 -117 -49 -15 -58 0
6359 0 51 -122 4 -24 -22 -71 41 43 65 -10 71 -69 -28 -82 -35 -56 -27 -98 29 32 -49 -3 -26 -17 -17 -3 26 42 -10 -7 -4 -46
$$ packed form
6157Hj60P6p6J46j06J52n2j6J57j18M1r0m8L6P9j05O6l4N4L0K7Rm4m7J9j4l5N9
6185A4j3o3K46k62m5J63o7J08j16N3K2p9R7p6O0k1n3M3J1rPM4j37R8k1l8K2R9
6213H7j40O3r9N1P4m9lj05P2J0m8J21j51J15j4n5L3rR2j8%J11n3j05pnN0K7J7
6242F2j1p6m8R6P4m2r9J08q7k4Q9M1j35M2J41o2m9j21Q7oQN8k6r1Q7n8Q1j80R0
6271e1J2Rj11K50j36N8m0Q5r0J9r4J22n0o6P9J0Qj05MP3LJ2l0n8P5J02n2n5J0
6300gM7p8O4o9R6kj79J68n0JK8l3j8L7r3J59n8Rq4k0m4J71q2M1L2j9N1qn2k9K4
6331CJ00n8j2m5j6K8k2k0J30j62oJ59j7q1l6L6q2J38j05O6j03R1j9q4O8L4m3N8
6359@N1j73J26k8Km9J12KK2p5Q1j40M1n4M7k1K9p1J27Lq1M6k3R%J4K9J6n2LLm2
$$ plain form
6391 -46 -37 47 41 11 18 59 -6 152 -38 -113 78 63 46 17 -54 139 21 -71 88 -32 23 -10 35 62 -34 -24 -26 92
6419 92 69 -63 57 34 56 -150 -16 1 94 -73 43 25 -44 24 -47 -45 -59 51 28 47 -22 -8 -93 50 50 40 -84
6446 -84 -97 21 89 -25 20 -27 21 84 -97 -48 57 -96 -39 -81 23 -49 53 3 77 2 -82 48 -139 5 -31
6471 -31 -37 44 -24 16 70 93 23 -40 24 7 -2 -20 -65 -121 -70 78 10 8 -23 -23 -65 -47 76 137 -18 -48 -28 20 -16 1 85
6502 85 -2 -13 -46 -96 44 71 5 54 13 16 41 -51 -66 -30 23 -44 19 5 -64 18 76 1 -59 -33 11 -38 8 39 -20 107
6532 107 -93 -43 -51 55 -32 41 49 55 43 -42 -141 -37 -41 30 64 -38 89 13 9 14 57 95 53 2 -33 -23 -64 -82 -26 -12
6562 -12 -92 -15 -3 64 106 9 47 -24 -28 4 -20 -42 -17 -29 58 65 27 3 -25 43 -26 15 135 8 39 -96 -63 107 58
6591 58 49 -18 26 -44 35 -31 7 -16 -22 60 -70 -23 -51 33 17 -132 30 -49 52 82 -61 40 -16 135 -103 -2 -13
$$ packed form
6391d6RQ4ol0PM1o5J58j90p5J91j5j7k9p1J93j18r2J59j20N5l3M5K7r6J0kJ18
6419I2k3j32J20k3K2k06J34J7R3j67J16j8o9O8p1Kj4J10k3J9o9J4q5J43%j0j24
6446h4j3J18O8j14M5m7M8O3j81M9J05j53N7m2J04p2J02n0P4p5q4J30j87J44l6
6471c1oQ1o8M0N4K3p0o3O4j7rj8m5n6N1J48o8kl1%m2J8J23O1j55l0K0M8l6J7Q4
6502H5q7j1l3n0J40K7o6M9m1LK5r2j5L6N3o7O3j4o9Q2N8p5o0K6M4m9M6L1n9J27
6532A07k00N0qJ06q7P3QOj2q5r9J04mP1L4j02J27p6mNM3L8m2n1l5J0m1j8N6J4
6562a2q0P7J2O7M2r7L8p1mL2k4k2K5j2Q7Pl8k4k8O8o9M1J20j27L1j35L3J70m9
6591E8ro7M4p0P9o6L8k3oQ2j30M7k8Q4j6j49J62p9J01L0j43J01n6J51k38J01j1
$$ plain form
6618 -13 74 68 8 -17 -9 48 -97 56 51 40 114 36 -77 11 -61 47 -43 42 8 -2 -31 -56 -36 3 4 -48 29 -39 52 1
6648 1 -56 40 -106 -9 5 23 70 -25 -59 33 -77 -5 -38 -68 125 44 -34 69 -49 41 -25 -68 -64 -2 -45 -117 -15 -27
6676 -27 8 -71 -30 -7 136 -7 -60 -51 -94 -56 -50 14 -50 30 -34 -44 -33 -41 -22 45 19 -9 -18 -49 -51 -38 15 -9 -93 -172 12
6707 12 67 56 -58 -38 40 -24 2 -143 -15 73 58 38 -100 -12 -8 -112 -39 -16 15 -49 71 -56 27 42 -39 47 69
6734 69 82 16 -8 -15 -129 -142 -66 -23 -63 23 -161 5 -45 -33 -73 -65 52 13 99 80 47 -35 -7 -67 66 -18 -63 1 -85
6763 -85 48 -68 -6 -71 -204 -5 12 -51 -182 88 34 -15 99 -78 71 10 -8 -67 -58 -41 52 -45 -40 -36 -68 -100 93
6790 93 -29 -31 18 85 79 -176 -5 88 62 -3 20 53 -3 -131 -8 -52 -57 -36 29 -5 31 -5 -15 36 51 -9 -33 49 28
6819 28 8 -72 -44 9 -137 -49 3 -15 -25 -12 -20 95 138 34 -15 -49 -97 -36 134 87 -8 2 -13 -97 116 1 -115
$$ packed form
6618a3Q7oo0k5QN7j45J53nj1P4p8j13Q8p2J08r0Q5l4j0k9k5K0L9Jn2P7o8R1n1
6648An7R6j46R7J4J8M7r5l4R2j10P2l3l0J93q1p8J03j18R0o6m3MO2m3p2J02j2
6676b7L5p9M1K3J43j43n3Rm3L8OO4o4Q0o4j0J1qJ9O7k6k8rl1kJ3N3k4q4p9J84
6707A2N5j1j14K0P8o4K6j45J28Q8j5k0j38Q8Mj04P3K3L1o4J20j27Q3J5q1Q6K2
6734F9J3o6k4pj14j3P6M3m0Q6j84J66n0J2m0QJ17l9Q6j9l3q2K8o0J33q4m5O4q6
6763h5J33j16O2o5j33J99J7o3j31K70n4m9J14j77J49o1j8n9RJ7R3r7NMl2l2J93
6790I3j22kM9O7ok55J71R3k6o5K3L3n6j28J23m4nK1O5l4L6l6j0N1J5o0k4Q2k1
6819B8k0q0K8N3j46Q8N2j8j0J3qJ15M3j04m9l4m8O1J70m7r5J0j5q4K13j15j16
$$ plain form
6846 -115 15 -69 -22 -50 79 -10 71 34 -4 50 -59 -32 -127 18 -35 26 -22 -67 78 86 15 -32 -19 -85 13 138 25
6873 25 89 -18 64 -71 1 -28 42 20 14 55 54 -73 -22 31 -93 44 -7 15 45 27 -47 -45 41 -92 -58 -51 -58 6 3 -74
6903 -74 -27 62 14 46 5 -46 15 -26 -26 66 18 34 -18 -70 -42 49 -12 48 80 32 52 -86 -66 37 -3 30 81 91 91 1
6933 1 -83 15 42 -33 73 -42 95 38 1 -38 83 64 21 -45 88 15 37 61 -47 -50 30 -36 55 32 26 -9 -36 43 5
6962 5 -36 21 11 30 91 73 41 -48 -29 -33 -92 48 62 98 -1 19 75 106 -36 -4 3 -44 -23 35 66 6 26 77 -3 -133
6992 -133 -72 6 -46 -14 1 -53 -9 -41 -71 10 -21 17 -58 -15 10 17 -19 -69 -80 39 139 8 16 16 12 -23 60 -41 -29 22
7022 22 27 -23 68 -13 12 132 3 -32 -46 53 7 53 30 47 -26 15 -6 -43 -43 76 -41 -50 28 -24 67 20 -53 4 -6 -75
7052 -75 9 -6 -39 -82 -91 -77 168 -36 16 108 38 -17 -37 6 65 37 26 -50 93 136 1 71 -19 4 7 -15 -39 27 -8
$$ packed form
6846a15J30q4M7k8J29q9Q1l7l8N4j09K7r5J45n3O1m8m5J45Qp1m7J3o6R8J25j13
6873B5O4j07Q2j35P2k9P0k2oM1jj27N1N3j24J37n1K2L0j8p4KQ6j33L4PpO4lp7
6903g4M7Q9m8L2m1n1O1m1%R2m8J6n2n2K8R1o1O0L2m8K0j38K0J03m0L3N1J0%r0
6933Aq4R8K7p5J06j15J37n7l7l9J21j9m3o6J33p3K2K4j08lQ0o6R1k3ol5k7P9l8
6962Em1N7j0J9O1j8l2q9J9mn9J40J4L6r9K0N6L1j42L2Pm7K1N8L1o0K0N1q0j30
6992a33O1P8n2L2J5n4M4l2l0Q1l1L8p5M3K5Pl6n0j1J19J00j31Q%ml5Q3j01J2N1
7022B2Nn0R1q1K5J20j29l5j4R9m6M6k3J7p3M1k1l7%J19j17rP8n2R1m7p3N7j0o9
7052g5Q4j5l3m3rJ4K45k04N2R2p0n5k0M3N9k8j1p6J43M3j35P0r0K3Lk2k4O6l5
$$ plain form
7081 -8 -42 11 -28 85 -103 -32 20 -59 8 88 37 105 38 -5 67 -55 -39 78 70 48 -65 23 -13 70 -96 43 40 45 108
7110 108 -9 -50 48 0 -76 -27 -23 -13 -3 67 60 6 1 -70 5 16 75 -47 -42 19 40 32 20 -53 14 20 -92 -48 -7 42 -45
7141 -45 49 -8 2 -42 -90 -60 8 -65 82 20 33 83 15 78 33 34 -39 -21 -40 68 -52 -29 -73 9 -47 92 -33 21
7169 21 -55 -59 8 -19 11 -25 -6 32 -21 8 -23 84 42 -66 41 41 60 30 68 -24 -7 -52 70 6 -30 -23 38 1 103
7198 103 99 -33 -33 -54 39 -36 41 11 69 23 -157 87 -39 -54 21 25 48 71 -76 -28 167 55 -12 -15 -5 8 -28 11
7226 11 -76 -27 35 13 -40 105 -3 25 98 -21 -50 3 -15 37 51 -15 13 60 2 8 17 -30 49 -46 -21 57 14 -27 67 25
7256 25 72 -12 -35 30 -4 65 23 45 44 52 32 -24 30 8 -45 16 -55 -10 -7 31 67 81 105 24 45 -59 -26 -40 -60 -17 -50
7287 -50 -4 -55 -63 -54 23 -49 172 119 -88 109 -24 40 -30 35 -18 -62 -123 -174 -13 62 56 -11 -91 49 -4 -14 10 -13 27
$$ packed form
7081hl4N3l9J13j88P1N2p9O7Q0n1O8o7m3P2j22J6J17qk2j13Q8l6Q3j66J39lNO3
7110A08j17m1R8m8p6M9MJ0J0P0pn4np1P5J1N9j22NO1K1qj2p3O7Oj12M4M1M9q7
7141d5R4n7J0m4m8L0O8p3J47o2J3N0o8O3m5Jp3J8j9J08j20K3m4Q2n6J39j25N4
7169B1p6mO7k7L0l6J9L8n3K9l1J07m2j08J07%J9l0L8r2J7m5J22o4l6PO1l7J02
7198A03mj32%k1R3p5P7l0N8m6j80K44j26j5P5MK3K3j47M8J95j12o7lJ0J3l6L9
7226A1q7M9O2k2n3J45j08K8P3j19k9N3j8N2J4o6K8M7n8ORm7P9r5K5P8m3m1R4m2
7256B5M7q4k3O5l4O9m2K2jQk0n6N4k2n3O1p1M5LL8L6J4K4q1K1j04L3j4k0M3l3
7287e0M6n1qRP7p2K21n3k07J97j33O4p0O5n3m4o1n1J61P5oo7q0J40n3j0K4k3M0
$$ plain form
7316 27 -89 18 48 117 33 -43 87 0 -18 -133 47 72 -10 8 -41 -16 33 29 -107 -21 71 -149 39 109 -31 19
7342 19 28 -63 -47 108 65 -15 31 70 74 -5 5 5 -75 -38 -21 -70 -91 31 9 129 8 47 7 30 -5 42 -43 75 -42
7371 -42 -25 -71 -63 -5 46 -74 -63 -44 83 16 -39 44 -6 24 8 38 -53 98 67 82 115 18 30 -56 10 -14 -104 30 -21
7400 -21 40 -37 -5 38 -52 14 -24 65 70 -73 45 24 144 86 -73 133 139 -32 -72 23 163 -22 -27 -27 95 -134 37
7427 37 -28 -6 89 45 -93 17 44 -21 17 86 29 7 -23 -108 -35 -10 18 -6 -54 -78 -15 97 -6 118 12 -42 48
7454 48 28 -98 39 16 -68 -35 -112 -49 81 0 -77 35 -23 -76 -62 -79 49 90 106 -39 -28 -8 -112 11 40 -2
7480 -2 17 70 183 77 -15 89 32 -43 80 2 -99 75 -13 -32 -58 -4 -78 -60 1 -24 14 154 -96 -85 112 -7
7506 -7 -6 -103 -65 -25 -51 98 47 -91 -103 -31 48 -32 12 -20 -71 101 111 -67 73 25 -32 -127 2 24 152 31 -36
$$ packed form
7316B7j16J07L0O9q4p6J30q7j8j15J80K5q2J8m9K5M9mj36Q6R2k20J88P0j40N0
7342A9Rr1J6J55m3q0M6L9Mp9J0%q0L7J7m9k1J22k2J20j21L9m0K3l5M7q5J18j17
7371d2J7m6QN8N1j20J1J9J27o7n5Q3n0L0j6L0r1J51l1J5L3r7J2q6O6k4r0J34n1
7400b1O1p7L2M3r0O6l8Q9Nj43J18k1J20n8j59K06Oj71m0R5J40j85n%J22k29J71
7427C7o5K2R5m4j38J10K7o5L8O9n7k2l0q5P3K5K8k4m8k4O3J12j03J24j06n4R0
7454D8k0j26J37k3q4L3p7O3J30q1p7J12n8n3J4j7J28M1J6j45J1K0j04J23K9m2
7480bJ9N3J13j06r2J04n7p5J23p8j01J74q8j9k6N4p4J8O1k5L8J40k50J1J97j19
7506gJr7L8M0k6J49n1j38j2P2P9q0M4l2n1J72J0j78J40m8n7r5J29K2J28j21o7
$$ plain form
7533 -36 67 25 -133 70 42 70 -73 -77 13 -66 -56 -49 23 126 -84 -51 -24 40 1 -75 75 28 -1 -45 20 -43 -84 -5
7561 -5 101 5 17 -5 -83 13 65 -115 36 -72 -24 -32 -6 -4 -31 -44 -39 -65 33 -68 -45 -57 -89 10 -99 28 -62 -16 17
7590 17 -94 65 -102 128 30 40 80 -20 29 57 14 42 0 102 -66 103 7 -51 21 -120 18 -57 86 -45
7614 -45 -43 -59 27 -126 -30 -73 -27 -112 -106 -88 -34 146 111 -57 0 -70 18 -16 -77 57 -40 21 78 -32 -113 -7 45 29
$$ packed form
7533c6J03m2j58K03k8K8j43mR0p9J0PP2J03k10L3K7O4l9p6J50m7k9m4O5o3m1P9
7561eJ06r6J2k2p8R6N2j80J51j08M8qK6Kk7j3Nk6R8j01K3j2l2R9j09J27r0M6L3
7590A7j11J59j67K30r8J0M0j00M9K8m3K8m2J02j68J69r6n8P2j41J38p5J43j31
7614d5Kj6Q6j53R6m3M6q5OJ8N4J80l5j68N7p0Q8l4o1J34r7O1N7j10q1J06N2j6
$$ [...]
8191C0
##END NTUPLES=NMR FID
##END=
