##TITLE=1H_DE-80H_X3
 200.13MHz, d2o
 8 sc
 
 19ns.26.2.2025
##JCAMPDX= 6.0         $$ Bruker NMR JCAMP-DX V2.0
##DATA TYPE= NMR FID
##DATA CLASS= NTUPLES
##ORIGIN= UXNMR, Bruker Analytische Messtechnik GmbH
##OWNER= pz
$$ XWIN-NMR		Version 3.5
$$ Thu May 15 14:38:31 2025 Russian Standard Time (UT+4h)  Yarkov@DPX200
##.OBSERVE FREQUENCY= 200.1313
##.OBSERVE NUCLEUS= ^1H
##.DELAY= (6, 6)
##.ACQUISITION MODE= SIMULTANEOUS
##.ACQUISITION SCHEME= undefined
##.AVERAGES= 8
##.DIGITISER RES= 18
##SPECTROMETER/DATA SYSTEM= spect
##.PULSE SEQUENCE= zg30
##.SOLVENT NAME= CDCl3
##.SHIFT REFERENCE= (INTERNAL, CDCl3, 0, 14.3821)
##AUDIT TRAIL= $$ (NUMBER, WHEN, WHO, WHERE, WHAT)
$$ ##TITLE= Audit trail, XWIN-NMR		Version 3.5
$$ ##JCAMPDX= 5.01
$$ ##ORIGIN= Bruker BioSpin GmbH
$$ ##OWNER= Yarkov
$$ C:/Bruker/XWIN-NMR/data/yarkov2/nmr/H-C/1/audita.txt
$$ ##AUDIT TRAIL=  $$ (NUMBER, WHEN, WHO, WHERE, WHAT)
(   1,<2025-05-15 14:37:39.43 +0400>,<Yarkov>,<DPX200>,
      <created by zg, POWCHK disabled, PULCHK disabled
       configuration hash MD5:
       00 E9 B6 7A A2 85 ED C7 34 08 36 98 17 FE 4E 26
       data hash MD5: 16K
       8D 87 21 BF 99 EE 17 7B A9 51 6B 14 37 C8 4F 80>)
$$ ##END=
$$ 
$$ hash MD5
$$ C2 32 AD D6 FA F7 F1 95 26 EC E5 0F 6D B8 CE 47
##$RELAX= 
##$RELAX= 
##$RELAX= 
##$RELAX= 
##$RELAX= 
##$RELAX= 
$$ Bruker specific parameters
$$ --------------------------
##$DU= <C:/Bruker/XWIN-NMR>
##$EXPNO= 1
##$NAME= <H-C>
##$PROCNO= 1
##$TYPE= <nmr>
##$USER= <yarkov2>
##$AMP= (0..31)
100 100 100 100 100 100 100 100 100 100 100 100 100 100 100 100 100 100 
100 100 100 100 100 100 100 100 100 100 100 100 100 100 
##$AQSEQ= 0
##$AQ_mod= 1
##$AUNM= <au_zg>
##$AUTOPOS= <>
##$BF1= 200.13
##$BF2= 200.13
##$BF3= 200.13
##$BF4= 200.13
##$BF5= 200.13
##$BF6= 200.13
##$BF7= 200.13
##$BF8= 200.13
##$BYTORDA= 1
##$CFDGTYP= 0
##$CFRGTYP= 5
##$CHEMSTR= <none>
##$CNST= (0..31)
1 1 145 1 1 1 1 1 1 1 1 1 1 1 1 1 1 1 1 1 1 1 1 1 1 1 1 1 1 1 1 1 
##$CPDPRG= <>
##$CPDPRG1= <>
##$CPDPRG2= <>
##$CPDPRG3= <>
##$CPDPRG4= <mlev>
##$CPDPRG5= <mlev>
##$CPDPRG6= <mlev>
##$CPDPRG7= <mlev>
##$CPDPRG8= <mlev>
##$CPDPRGB= <>
##$CPDPRGT= <>
##$D= (0..31)
0 0.7 0 0 0 0 0 0 0 0 0 0.03 0 0 0 0 0 0 0 0 0 0 0 0 0 0 0 0 0 0 0 0 
##$DATE= 1747305458
##$DBL= (0..7)
120 120 120 120 120 120 120 120 
##$DBP= (0..7)
150 150 150 150 150 150 150 150 
##$DBP07= 0
##$DBPNAM0= <>
##$DBPNAM1= <>
##$DBPNAM2= <>
##$DBPNAM3= <>
##$DBPNAM4= <>
##$DBPNAM5= <>
##$DBPNAM6= <>
##$DBPNAM7= <>
##$DBPOAL= (0..7)
0.5 0.5 0.5 0.5 0.5 0.5 0.5 0.5 
##$DBPOFFS= (0..7)
0 0 0 0 0 0 0 0 
##$DE= 6
##$DECBNUC= <off>
##$DECIM= 32
##$DECNUC= <off>
##$DECSTAT= 4
##$DIGMOD= 1
##$DIGTYP= 9
##$DL= (0..7)
0 120 120 120 120 120 120 120 
##$DP= (0..7)
150 150 150 150 150 150 150 150 
##$DP07= 0
##$DPNAME0= <>
##$DPNAME1= <>
##$DPNAME2= <>
##$DPNAME3= <>
##$DPNAME4= <>
##$DPNAME5= <>
##$DPNAME6= <>
##$DPNAME7= <>
##$DPOAL= (0..7)
0.5 0.5 0.5 0.5 0.5 0.5 0.5 0.5 
##$DPOFFS= (0..7)
0 0 0 0 0 0 0 0 
##$DQDMODE= 0
##$DR= 18
##$DS= 0
$$ [...]
##$SUBNAM2= <"">
##$SUBNAM3= <"">
##$SUBNAM4= <"">
##$SUBNAM5= <"">
##$SUBNAM6= <"">
##$SUBNAM7= <"">
##$SUBNAM8= <"">
##$SUBNAM9= <"">
##$SW= 18.0517328524113
##$SWIBOX= (0..15)
0 0 2 0 0 0 0 0 0 0 0 0 0 0 0 0 
##$SW_h= 3612.71676300578
##$TD= 16384
##$TD0= 1
##$TE= 0
##$TE2= 300
##$TE3= 300
##$TEG= 300
##$TL= (0..7)
0 120 120 120 120 120 120 120 
##$TP= (0..7)
150 150 150 150 150 150 150 150 
##$TP07= 0
##$TPNAME0= <>
##$TPNAME1= <>
##$TPNAME2= <>
##$TPNAME3= <>
##$TPNAME4= <>
##$TPNAME5= <>
##$TPNAME6= <>
##$TPNAME7= <>
##$TPOAL= (0..7)
0.5 0.5 0.5 0.5 0.5 0.5 0.5 0.5 
##$TPOFFS= (0..7)
0 0 0 0 0 0 0 0 
##$TUNHIN= 0
##$TUNHOUT= 0
##$TUNXOUT= 0
##$USERA1= <user>
##$USERA2= <user>
##$USERA3= <user>
##$USERA4= <user>
##$USERA5= <user>
##$V9= 5
##$VALIST= <valist>
##$VCLIST= <CCCCCCCCCCCCCCC>
##$VD= 0
##$VDLIST= <DDDDDDDDDDDDDDD>
##$VPLIST= <PPPPPPPPPPPPPPP>
##$VTLIST= <TTTTTTTTTTTTTTT>
##$WBST= 1024
##$WBSW= 4
##$XGAIN= (0..3)
0 0 0 0 
##$XL= 0
##$YL= 0
##$YMAX_a= 24426
##$YMIN_a= -22038
##$ZGOPTNS= <>
##$ZL1= 120
##$ZL2= 120
##$ZL3= 120
##$ZL4= 120
##$ABSF1= 10
##$ABSF2= 0
##$ABSG= 5
##$ABSL= 3
##$ALPHA= 0
##$AQORDER= 0
##$ASSFAC= 0
##$ASSFACI= 0
##$ASSFACX= 0
##$ASSWID= 0
##$AUNMP= <proc_1d>
##$AZFE= 0.1
##$AZFW= 0.1
##$BCFW= 1
##$BC_mod= 2
##$BYTORDP= 1
##$COROFFS= 0
##$CY= 83.5205535888672
##$DATMOD= 1
##$DC= 2
##$DFILT= <>
##$DTYPP= 0
##$F1P= 10.8118882576601
##$F2P= -7.23987719738617
##$FCOR= 0.5
##$FTSIZE= 0
##$FT_mod= 4
##$GAMMA= 1
##$GB= 0.15
##$INTBC= 1
##$INTSCL= 1
##$ISEN= 128
##$LB= 0.25
##$LEV0= 0
##$LPBIN= 0
##$MAXI= 10000
##$MC2= 0
##$MEAN= 0
##$ME_mod= 0
##$MI= 1.114404
##$NCOEF= 0
##$NC_proc= 0
##$NLEV= 6
##$NOISF1= 3.799351
##$NOISF2= 2.8
##$NSP= 1
##$NTH_PI= 0
##$NZP= 0
##$OFFSET= 14.38212
##$PC= 1
##$PHC0= -1345.591
##$PHC1= 7.133752
##$PH_mod= 1
##$PKNL= yes
##$PPARMOD= 0
##$PSCAL= 0
##$PSIGN= 0
##$REVERSE= no
##$SF= 200.129724274929
##$SI= 16384
##$SIGF1= 3
##$SIGF2= 2
##$SINO= 400
##$SIOLD= 16384
##$SREGLST= <1H.CDCl3>
##$SSB= 0
##$STSI= 0
##$STSR= 0
##$SW_p= 3205.1282051282
##$SYMM= 0
##$S_DEV= 0
##$TDeff= 0
##$TDoff= 0
##$TI= <>
##$TILT= no
##$TM1= 0
##$TM2= 0
##$TOPLEV= 0
##$USERP1= <user>
##$USERP2= <user>
##$USERP3= <user>
##$USERP4= <user>
##$USERP5= <user>
##$WDW= 1
##$XDIM= 8192
##$YMAX_p= 0
##$YMIN_p= 0
$$ End of Bruker specific parameters
$$ ---------------------------------
##NTUPLES= NMR FID
##VAR_NAME=  TIME,          FID/REAL,        FID/IMAG
##SYMBOL=    X,             R,               I
##VAR_TYPE=  INDEPENDENT,   DEPENDENT,       DEPENDENT
##VAR_FORM=  AFFN,          ASDF,            ASDF
##VAR_DIM=   8192,          8192,            8192
##UNITS=     SECONDS,       ARBITRARY UNITS, ARBITRARY UNITS
##FACTOR=    0.0002768,     1,               1
##FIRST=     0,             0,               0
##LAST=      2.2672688,     0,               0
##MIN=       0,             -22038,          0
##MAX=       2.2672688,     24426,           0
$$ Real data points
##PAGE= N=1
##DATA TABLE= (X++(R..R)), XYDATA
0@%%%%%%%%%%%%%%%%%%%%%%%%%%%%%%Mj0J4j6J6j6J6j6J6k2K8l0L2l3L9m5M7n1
$$ 0 0 0 0 0 0 0 0 0 0 0 0 0 0 0 0 0 0 0 0 0 0 0 0 0 0 0 0 0 0 0 4 -6 8 -8 8 -8 8 -8 8 -14 14 -16 16 -17 22 -23 24 -27
48b7N7o3P1p8Q6r4J03j15J25j38J54j70J90k14K40k71L09l54M08m59M38o21K2538
$$ -27 30 -33 38 -40 46 -48 55 -60 65 -73 81 -89 101 -113 127 -144 165 -189 219 -240 198 -423 22115
71B2115j8751j6051J7603r931j7023J3708J2898q583K602J0313q721n863J5413
$$ 22115 3364 -12687 4916 -5015 -22038 -8330 4568 -4015 -1413 8900 179 -5684 9729
84I729K27j0059J0090J658j5441L150P203q933n350J517k384p14L911M551L63
$$ 9729 9956 -103 9987 11645 -3796 -646 6557 -2376 -7726 -6209 -8593 -9307 -5396 -845 -482
99d82K32L013j308j215L895J161L32o83m992J715J981o056J865L174p946j302
$$ -482 -250 2763 1455 240 4135 5296 5628 4945 -47 1668 3649 -2407 -542 2632 -5314 -6616
115f616O766j439l307J951J026k861O71O541J359j464N012k075p255M485K179
$$ -6616 150 -1289 -4596 -2645 -1619 -4480 -3809 2732 4091 2627 7639 5564 -1691 2794 4973
130D973n751J645P49o700j613L569J458j097P69L316j801j708N563O75l029J934
$$ 4973 -778 867 1616 -5084 -6697 -3128 -1670 -2767 -1998 1318 -483 -2191 3372 4047 1018 2952
146B952j227l600J469J801M37j056k018N36j396j190M673j41l798J838j23k065
$$ 2952 1725 -1875 -406 1395 1832 776 -1242 -706 -2102 -3292 1381 1240 -2558 -720 -843 -2908
162b908K753K832k31j450l38R59j736M17L664l491l845K677j965j535M813Q88
$$ -2908 -155 2677 2446 996 658 1617 -119 298 3962 471 -3374 -697 -2662 -4197 616 1504
178A504k429O31M67k3O59J937J085l331j319J185k376N59L237k430j143R76j534
$$ 1504 -925 -294 173 150 809 2746 3831 500 -819 366 -2010 -1451 1786 -644 -1787 -811 -2345
195b345R17K331j50jo60q12J153J26J244Q76j799l62k60j171J784j29k373L78
$$ -2345 -1428 903 753 752 92 -720 433 559 1803 2679 880 518 258 -913 871 742 -1631 -1253
213a253j214j374K616P22j98J187o16J98J471Q29J401j027j546J18k220k87K324
$$ -1253 -2467 -3841 -1225 -503 -701 486 -130 68 1539 2368 3769 2742 1196 1314 -906 -1193 1131
230A131j853j327P20j834j3K355M74N32J19p87M59K8J639J929j633j98J55k189
$$ 1131 -722 -2049 -1329 -3163 -3176 -821 -347 185 304 -483 -24 4 1643 3572 1939 1741 1896 -293
248b93P49J334j584o15j078j989N74N18P15J075p16L18R37j3K308J220j052K07
$$ -293 456 1790 206 -409 -1487 -3476 -2902 -2384 -1669 -594 -1310 -992 -55 -68 2240 3460 2408 2615
266B615j087j292J019k98q49P5j985q09O09k9J110M36j283P69o4K16K359K46j81
$$ 2615 1528 236 1255 957 108 183 -1802 -2611 -2002 -2031 -921 -485 -1768 -999 -1063 -847 1512 1758 1577
285A577O19j346J30J212p30K19p60j898n00m39rJ172q49m93Q31n44J074J857O
$$ 1577 2196 850 980 2192 1462 1681 921 -977 -1477 -1916 -1925 -753 -1602 -2095 -1264 -1808 -734 1123 1129
304A129P07l54j047R94l9k77P53j463j066J69q88N06Q84r77j26l59n07J338O45
$$ 1129 1836 1482 435 1429 1390 1113 1866 403 -663 -494 -1382 -876 8 -969 -1095 -1454 -1961 -623 22
323B2K25Q51j035LJ195k96O63O44j701n38j55o32O87k87l90J25j251K12J319J05
$$ 22 247 1098 63 66 1261 965 1628 2272 571 33 -122 -754 -67 -354 -744 -619 -1870 -1658 -339 -234
343b34N55K98j014M41M51j20Q78j47p31j73p81M74R92q48J30l25j269N78M91l5
$$ -234 321 619 -395 46 497 377 1255 1108 377 204 -577 -103 889 41 171 -154 -1423 -845 -354 -389
363c89P43m15n00K92qP76Q65j034K36k55j185R10N70o21M01p44n17P36kO19L82
$$ -389 354 -61 -561 -269 -277 499 1364 330 566 311 -874 36 606 -15 386 -358 -875 -139 -141 478 860
384H60j140K29o8o54J146K21p82L8m13j97P43nM94o7r53L07J94k97J260r5r36
$$ 860 -280 -51 -119 -773 373 594 -188 -150 -563 -760 -17 -22 472 405 -548 -241 -47 -344 916 821 -115
405a15L77m06j48R28j55l00k53j082L91K69j37R33n46n70Q07k02N50Q92l98j94
$$ -115 262 -144 -292 636 481 181 -72 -1154 -763 -494 -631 302 -244 -814 -7 -209 341 1233 835 641
425F41j07o82N38K94n14J32p32p27L47J22K74M95q70J67J65m5Q79O38n37K45l22
$$ 641 534 -148 390 684 170 302 -430 -1157 -810 -688 -414 81 -789 -622 -457 -502 377 1015 478 723 401
446D01k99R80j42k20k3j023k55q4j08N47l59n72M39l27K18J222K3M1N32o90J57
$$ 401 102 1082 940 720 697 -326 -581 -665 -773 -226 -585 -1157 -718 -1045 -827 395 418 459 991 301 458
467D58O85r2Q6m57q80k1m08J36N28o58k70K4n85O45Q23k61N22m3m30P71K64K78
$$ 458 1143 1051 1137 680 -200 -221 -629 -493 35 -623 -893 -869 -1454 -809 14 -247 275 232 -198 573 837 1115
489A115L00n84m57o8n77M20mr84M18p00m44R56q6M48M95n61K45O11m1O06R9n51
$$ 1115 1415 831 374 306 -271 149 145 -839 -421 -1121 -1565 -609 -695 -247 248 -313 -68 543 502 1108 1207 656
511F56O5m67j65M08m11k13o1q85K44M51m86O45j29n56N87K35K02O28O7j50ql83
$$ 656 721 254 89 497 86 -127 -188 -1073 -829 -378 -864 -219 -348 -904 -317 -82 120 748 815 665 657 274
533B74M10l2l85R8n84p59N60k4l10P95n25l49O50p7L23N74l47P7m56P5O06k58
$$ 274 684 652 267 365 -219 -978 -418 -442 -752 43 -482 -831 -181 -258 65 639 292 369 -87 -12 594 336
555C36L6L82r95k27N49k78J99J05o03K5M5j90O36J41o0J40l40J60K46j29K07n1
$$ 336 372 754 -241 -468 81 -197 2 107 -496 -471 -426 -616 20 161 101 241 -99 61 307 178 385 334
577C34n94J46Nk22Q68m21l66K22k11l5M27n9l7k17k46K00m0L07L97n11j30M58
$$ 334 -260 -114 -109 -331 537 116 -250 -28 -239 -274 153 94 57 -160 -406 -206 -246 61 458 -53 -183 275
599B75o07N22M90n89rJ19m25J97K50k46K13m41L5Q8j92L89L2n61K67J0l37O55
$$ 275 -332 190 680 91 82 201 -224 -27 223 -23 190 -251 -216 -128 -320 69 101 -460 -193 -183 -520 135
621A35P2j53L66k70K2K88o7J2k8m47k17J33k59M70l27k42K11l26L81N39m64M23
$$ 135 207 54 420 150 172 460 393 405 377 -70 -287 -154 -413 57 -270 -512 -301 -627 -246 293 -171 252
643B52Q9n46M34L66j39J16j86j97j30k19K57P6n82J37k01m56N84L09m25M89K1
$$ 252 341 -205 229 595 456 572 386 189 59 -160 97 173 -409 -272 -473 -929 -345 -36 -461 28 49
664D9k58L76K76R9K56l24j11j17l81N02k34n17K29l40k71N76k16J05J96l42K85
$$ 49 -209 167 443 542 798 474 363 246 -135 367 133 -384 -155 -495 -766 -190 -406 -301 -105 -447 -162
685a62J59J60M42kk72K15l43%N22l96r1k10o21K38Ml80N23j71l28K75J46K10N82
$$ -162 -3 157 599 597 325 540 197 197 719 323 232 22 -599 -361 -357 -737 -214 -385 -713 -438 -292 -82 500
708E00k20R0mk07K93K2k99L23l97n89L79j63j22K53k21j51J29JL23J28pJ71j32
$$ 500 280 370 366 159 452 474 175 498 101 -488 -109 -272 -394 -141 -362 -513 -384 -383 -60 68 61 232 100
731A00o2M58k17j6K63l56j49J28k97J77j79k74J23j06j34N63k01K71P6l46J71
$$ 100 38 496 279 263 526 170 21 149 -148 29 -150 -424 -301 -407 -541 22 -179 92 168 -178 -7
752gM05j47J79j44k24J39k47J38L43m09k02J08l83K40J98k11J13l1l02L65L6J89
$$ -7 398 251 430 286 62 201 -46 92 435 26 -176 -68 -451 -211 -13 -224 -111 -142 -444 -79 -43 146
774A46K68k76L5Ml00K67J89l83N1j06k19K07%P4K04l95QL03k08K14Q0l61J93j36
$$ 146 414 138 173 177 -123 144 333 -50 1 -105 -324 -117 -117 -43 161 -234 -226 77 -131 83 163 -198 -5 -141
798a41l7M21n8Q6ml31J9L01k16J25mm38K09p9r6L63r6j20L0k92K95J38q3J29m8
$$ -141 -178 243 185 271 267 -64 -45 256 40 165 161 -277 -68 -147 -243 120 24 -96 -66 -358 -63 75 -8 121 73
823G3k40K67J63k11K74k42L5K8j85l5K56m26P8P7k97K24J32p7J86j31j3J57n0
$$ 73 -167 100 263 52 326 84 119 147 -38 -73 183 -243 -165 -88 -385 -161 -29 -106 80 -51 -64 93 43
846D3J67K09l57J72j65j07K50j97j1m3l20M1K47l26K67J22l29K41J19j18K84Q8
$$ 43 210 419 62 234 69 -38 212 15 4 -39 -359 -318 -71 -397 -130 -8 -337 -96 23 -95 189 277
868B77q2J28q5J0J03j51J6k27k45J42K8k58J83j43%J48n3J38J74l6J28l0j84K52
$$ 277 195 323 238 248 351 200 216 -11 -256 -114 -86 -344 -161 -304 -304 -156 -209 -71 103 67 195 165 -19 233
892B33J7p9J43k10j32P0k14J71l8l87N1l5q2L91%l2K73j93N9K91r2K10k8l71K64
$$ 233 250 171 314 104 -28 42 -172 -1 -39 -426 -375 -410 -492 -101 -101 -133 140 -53 6 297 205 415 387 16 280
917B80k09j69Q6p1r7m7p4p2K37mJ55J2k18J69J32j06L16kj48J47k53N5J37j60
$$ 280 71 -98 -12 -83 -180 -227 -301 -373 -136 -140 15 27 -191 -22 110 4 320 318 170 317 64 119 256 96
941I6k55J08k33P4P7j08J02q3j5K65j08J60K54k47L4Q9j27J50j12j65J82p2k93
$$ 96 -159 -51 -284 -210 -133 -241 -139 -222 -237 28 -80 80 334 87 121 210 83 233 121 -44 138 66 -227
964b27K39o7p9J79l93J91P3p7J54Jj04Q3k3J3K35j44NK12k56J46j54KO0k01k2
$$ -227 12 -55 -134 45 -348 -157 -84 -161 -7 -6 -110 -27 -50 -37 198 54 59 271 15 161 7 9 69 -132 -154
989a54J66j94m1L25l03J67O4j83R9J79p3R0j62k1J70n3n9J20j30O8O4k16K8Kj79
$$ -154 12 -182 -223 102 -201 -34 30 -153 -54 125 52 142 -20 -41 129 76 17 137 7 75 139 -77 -49 -47 -226
1014b26J99j24m0P5L6o5K74k43N4K22r4J24M0k97J05P9j83K61j39k9j5k35R2J05
$$ -226 -27 -151 -191 -116 -80 -145 129 -114 -60 162 68 192 232 -65 40 119 -64 197 58 29 14 -221 -129 -24
1038b4j70J24R4k13J32q4Q3L21j56L1N1j63J58k1k28J84j30p5K4m0j9J50k02j03
$$ -24 -194 -70 24 -189 -57 -141 -58 263 107 138 189 26 184 163 -65 119 -11 -86 -62 -102 -121 29 -173 -276
1062b76K17j51J79J02p4N8R5j52K13o4m2K17k68KJ02l30J50n9j38J25n7r8K86
$$ -276 -59 -210 -31 71 -3 55 150 -2 211 147 105 322 54 56 158 -172 -22 -81 -219 -94 -151 -249 37
1085C7j42n7J84j69K46J44k24J27J47j29p4J13k49K08j57j20k3j29J31N8k24K03
$$ 37 -105 -162 22 -147 99 243 19 146 293 164 90 203 -46 162 5 -115 -138 -267 -136 -78 -302 -99
1107i9J21k18J66J24j20J81Q7j04J38j94k3N5p4o4R6k43J43j4j22J58j10j41K34
$$ -99 22 -196 -30 94 -26 155 242 138 276 82 59 114 40 -24 72 -171 -28 -42 -164 -6 -116 -257 -23
1130b3M1k6J49j70J78J8p5L6kP2n0j07j21J44j75O3J5j34M0J05o0j4O4o1K22p0
$$ -23 18 -8 141 -29 149 167 92 128 126 198 148 41 -80 64 -111 -48 -33 -167 -127 -22 -82 -96 -32 -93 129 59
1156E9j4P2m4P6l4k04J67j19j35K21N5j24k4o3l2J35K0o1N4p9J52j70J87J00q2
$$ 59 45 117 73 149 115 -89 78 -41 -176 45 100 -24 -48 -111 -143 -8 12 -49 5 -74 78 -92 95 195 113
1181A13n7J05n0j09J10j02J6j18o7J48l9j55J74j00n5K35J6r0L9j05N0J35o9J04
$$ 113 56 161 111 2 112 10 26 -92 -159 -11 -50 -205 -31 -131 -186 49 65 -25 14 -91 -41 94 25 129
1205A29m9j64M1J04j88L25k23lM5k01J55m2p3K09Mo3J01l7n6K97l11k6K88k83
$$ 129 80 -84 -43 61 -127 198 -25 -28 17 -184 -29 -71 -144 65 69 6 107 70 14 311 0 -26 262 -21
1229b1p5J58p3O8P6j65N6r9M3L3k03N3KlO5J12RJ3L0n2j4P1m2M6lp9M7oj59R9
$$ -21 -96 62 -11 57 133 -32 24 -75 -32 1 -202 -149 -147 -150 -85 27 36 49 79 27 13 84 42 88 85 6 53 47 -112 -13
1259a3r2J58j86j63L08j80K33lr3j0J43n5l1J57j28n7J05j30L5l2l9R7k48J59
$$ -13 -105 53 -133 -296 12 -168 65 62 -31 -41 102 47 16 173 45 -12 93 -37 -2 -34 -73 24 -224 -65
1283f5K5j02P4R4j37J04Q1j03J49l2j09J14n7k8J38j34J28j87j40K30n8o6N0l9
$$ -65 -40 -142 -68 26 -111 -7 74 -29 120 88 -21 93 36 8 146 12 140 -47 -187 43 -15 -81 -31 -70
1307g0k1L3k0J69nj26N5L2QJ49j41q0J65j55P2l6j32P7p1q7M6no1J72J6l6Q7p9
$$ -70 -91 -58 -78 91 86 -40 15 47 55 204 63 -17 148 -7 65 29 -103 -26 -97 -184 -138 -143 -204 -32 -16 -52 35 -44
1335d4R4M5l8J5R6j51M5r8M9J06r3q1Km5q0K31k01O8M3p2J65p0M1O9p0K8R3j17
$$ -44 50 95 57 72 168 17 62 -36 13 119 26 -55 -53 -98 -178 53 -148 -80 -37 -109 56 -14 27 96 26 54 147 30
1363C0q2J97j80R4m9j51J98k15NJ66o8k5k5K9Q4Q4j95K58j02m3R3m6j15J07Q8
$$ 30 -52 145 -35 59 10 -141 57 -158 -153 13 -55 -80 -105 -76 8 92 -103 155 53 10 103 57 -58 49 137
1388A37k83J60l7K0j06l1J87j15P0qL7l9Q0j66P9J91r5k0nl8M2M8m4m2m8ok0M6
$$ 137 -146 14 -23 -3 -109 -140 47 -68 2 -6 31 -8 72 -94 -15 176 81 61 56 18 60 108 64 22 -26 -32 -52 -6
1416fK3Nj61J84j12QO6M4n6R7k8QK7l6j0M9n7r2N0j4Q9k23J09n2J57p7L7r5J7
$$ -6 17 22 -139 45 -67 -59 7 51 -5 92 64 72 99 63 53 102 45 -47 3 -11 78 -145 -36 -88 69 -8 29 -66 -49
1445d9J65j14PN0n1J39j52N8j1m6o9Q5r5M0M7orj0j41J55j0n6J2N9K8K6j7KO6
$$ -49 116 2 9 59 8 147 -5 53 42 -4 -73 12 -83 -43 4 -2 -11 -21 -162 -7 -17 -73 -61 -2 26 52 35 37 103
1474A03r3M2m5p6R0p8l0R4n2j53J25q1J71q7jk2J20rO6p5L3L0o9nR8o6q2R3o7
$$ 103 10 52 7 -69 21 -57 -87 7 -45 -198 -73 -154 17 -70 -71 -93 27 18 84 9 42 72 3 -2 96 30 -52 41 -26
1503b6k1nK1J2p2m2J16J1J1n3O3L6J16j72J03l8j16J25j43R2qkj69K16k09J11
$$ -26 -47 -52 -31 -19 -91 -133 -17 -6 5 -48 15 51 167 -5 98 60 -56 69 -74 18 10 8 -161 55 -154 -43
1529d3m9r8J15J09P1j66J04J9o7n0J50K9j80M6O2j99J36o3k0M3l4k8J12l4m1K16
$$ -43 -92 -190 -75 34 105 -61 43 62 -5 -55 95 124 -56 -10 52 -147 -11 -74 -94 -51 -85 -113 -1 -35 -76 140
1555A40j24m7P8mR4j03p7J36Mj15P2p2l2Q4j72P0l8j2P2Lm5J27k49K00o4R7l8
$$ 140 16 -31 47 43 137 34 -43 93 97 -18 54 -18 -50 34 -138 -68 -106 -118 -46 -43 -88 39 -210 -10 -74 23 -15
1582a5R7jk9n6NJ01j64J14l9P3j83J7N9k6J01n2j8P7j84J58q8P2M0r7O5N4q2K4
$$ -15 82 81 52 -4 1 102 -62 52 13 86 -97 -80 -21 -47 54 2 -16 61 -123 35 -53 19 59 -38 27 81 -1 23
1610B3K0m5J01j99J09j15J98j33j02J41o3O8M3n3N1j9J7l6j5k6J8J6J3KK3o4L
$$ 23 43 -2 99 -100 9 -106 92 -41 -143 -2 -65 3 46 -7 44 25 42 6 -9 -35 -17 -1 12 14 37 -27 -24
1637b4k0M1j67J20j09J02mM8K7N4l6m7O2k3n6O4m4J16Pj39oR3j79R6r1O6pk7P9
$$ -24 -44 -3 -170 -50 -159 -57 -61 -13 14 68 32 -15 47 24 -32 32 -12 104 111 -28 -34 59 -120 -24 -115 -49 -56 -83 -4
1666dO6j23K3Q4k4l6Lm6K04l9j4j53M5M4J1J4r4r4M4K7Q4j32N1m4J15p9J25P5
$$ -4 62 -61 -38 46 22 -14 -11 -57 147 108 94 -59 -14 30 41 55 -39 -133 -89 -62 22 -110 -59 -103 12 -67 58 133
1694A33q6l3L0k5n9J14k1q3ok02K37n8j6P2p9K4N4Or5J57m9k3J06o7O5r4J0M2
$$ 133 47 14 44 19 -40 74 53 -30 -36 -238 -1 -59 -75 -3 -82 -58 -4 2 -93 64 15 -8 98 31 96 2 12 54
1722E4Lj9Q2j10m0L3j31J14j18R3Mk7J18J3Oj35J06n2Qm7J63r6L5l3Q3p6O1r2
$$ 54 57 38 120 10 -30 3 -128 -14 -132 -39 -35 -62 56 69 75 -60 46 -6 2 -45 118 22 57 24 107 31 92 0
1750@o7k4P7k8J7L3n9J00P3j59J58m4j7p2R7n5o3P8j8K3p2m5PJ2l1Q2o0O2L7r4
$$ 0 -67 -91 -14 -42 -25 8 -51 49 122 -37 121 77 60 -12 85 30 -33 45 27 50 -22 -67 -60 -48 -79 3 -57 5 42 -52
1780e2RN1J8o4L1M2J40j78O7N5j61mM3q9K4m4J14o0K9O6n9j17J82j3n4J65m4K0
$$ -52 -43 8 26 -38 -7 35 175 -3 64 119 -42 -46 -3 -92 -68 -112 2 -58 -29 37 -22 -139 43 30 -24 141 97 117
1808A17j19m2Q4l7k0J12l3o2p0J05j39P9J9N5q6Q6j22j1l0J90Q0j23n0Q5l9p8
$$ 117 -2 -44 40 3 -17 95 62 0 -70 35 -104 -25 -6 49 -37 49 -73 -84 -114 76 156 33 -17 68 29 -49
1834d9K17j84O8n3m0pL8ML6j89J16J46j50M8%J9M3k1k5J0l4l2LP5j2Mj02P5J10
$$ -49 168 -16 52 -1 -41 -48 -10 -6 30 -159 -43 103 -47 1 1 20 63 42 17 27 -7 -39 -36 39 27 31 -71 4 114
1863A14k04J09l6L1l2k7N1mj33M5Q4j1J00j50J13m7%q3J72n4j19J10o4Q2L9o7
$$ 114 -90 19 -17 14 -18 -45 6 2 -131 -86 -2 -13 87 -63 50 3 3 -80 92 38 -81 29 -35 47 86 19
1889A9L3j08j9Q9L7Q6j04j32J48Kj10N0p3J04L0j7k0q1O1q7J8O7rqj89L46r6p4
$$ 19 52 -56 -75 14 51 137 33 -99 49 51 -59 -9 -82 22 52 35 15 -66 -5 -92 -74 -7 -16 -24 -213 133 37 -37
1917c7O6%r7J04Kl7K3n2J08j06N8%K0p2N2r0jM7j05J05O3j28J94l2n2K9p9M1o1
$$ -37 29 29 -68 36 38 1 24 -28 80 -26 32 32 52 -20 32 -58 -59 -12 -117 -12 51 -77 117 85 33 62 -17 24 -37
1946c7J23l6j07N9m1J00j03K4J0k1R6j13m9J90j81K9J22Om1p0JQ0n3M0l6O3o6
$$ -37 86 50 -57 2 -39 61 -42 -18 -8 -29 67 -46 -95 95 -86 -57 65 71 30 -40 -39 41 -12 28 -8 55 -11
1973a1Q4j9j37J51j24L4M6o3Q1k0kL4K5N1n6j39M1J5k7J3R2o5j1jj32J65M4p1
$$ -11 73 54 -83 68 -56 -22 24 -39 42 22 20 54 79 130 74 -65 -24 -9 -36 -23 69 4 -7 -8 -140 25 69 -2
2001bn3lO0J9M8l2qL1n0M2p5Q4L5k9q7K4j7J06j10M7m8n5J99j26J7O7j15lJ09
$$ -2 -55 -58 2 21 69 37 29 60 10 52 -23 61 96 67 -20 4 -13 93 -17 30 -18 -73 126 0 17 84 -31 -34 75
2030G5oJ1q3Q8l8jR0j30n3pJ22p4l4j00J09k3PJ22m9Kj21Q4J5K3Q0j47j9J43j55
$$ 75 69 80 -3 85 47 46 136 6 -47 -54 68 -6 -40 -140 -31 -54 -47 75 26 28 -93 -9 6 29 109 -38 -57 86 -69
2059f9O8P2m8k6l5J06j76J06O0K4p6o1Q6M7j37M2P0K9l8m6K2n0L4N1p8Lp4J05
$$ -69 -1 71 23 -3 -38 68 -108 -2 58 82 6 -55 31 78 -59 -17 53 82 44 -2 20 -30 4 55 -23 -20 -94 11
2087A1l7n1J03o7M5m9J38j47J15J8j50Q5J33j74mM1Q1p9rn4J86j46k4j6K4m5l1
$$ 11 -26 -77 26 -41 4 -45 93 -54 61 79 -71 14 147 -27 -31 10 91 12 3 -51 135 -11 -35 -51 -27 -72 -103
2114a03Q2O5q9Q5O8k41J60J5L2J6p7j29Q4K5m0JR2J8m8J9n8m7N8l5K7PM7Rp9J15
$$ -103 -21 44 -45 40 108 -133 27 42 74 90 13 -116 -32 -7 -47 -46 46 64 16 35 -23 -70 -12 -47 -20 -13 34 43 -36 79
2144G9O5k19JJ04o5jL9m9l1O7N5j1j2p1R1j15K4K4l2J9N8m3K7k6m4P6k8k3M4o8
$$ 79 144 -75 -74 30 -35 -36 3 -46 -77 -10 45 34 22 -49 42 -73 -49 -25 -57 -38 20 -23 4 -22 -66 10 -18 -41 3 -65
2174f5R8m0r3J85o2o4pP7p3K1O9K5K3l3r3P7n1J36j02k7L2j56J93j13R1R0k28
$$ -65 33 -7 -100 85 23 -41 -48 29 -44 -23 46 71 94 61 -32 45 -6 130 28 1 33 -123 70 -43 48 138 -90
2201i0J29K5k7n3L3O1o6m9KN8l4J7J01m0j11M3J7j7L0n4m7Q0K2m2R8n0q2J43j86
$$ -90 39 64 37 -16 17 78 12 -37 -35 23 -11 6 107 67 -44 -1 16 -1 29 -25 -72 8 30 -12 86 36 -46 97 -89
2230h9J24K4j08L9N6r0J8NM0Np1J1J4K8K1kO5r1M0o3J9k8P0L5j03R4j9r4l8J32
$$ -89 35 59 -49 -10 46 -44 -26 -21 19 24 -47 -36 -22 6 27 25 90 -1 39 -24 -5 -33 37 72 -31 63 44 -50 -88 44
2260D4Q6j33j06P3P8j51J74j65N4qK4N7M9j18K5j3M5N5l4ro9J41j81N5j4L2m2
$$ 44 130 -3 -109 -36 42 -109 65 -100 -46 -54 -30 27 76 -42 -17 -30 15 70 36 27 -42 99 -82 -27 -41 -9 -51
2287e1L7J37j54M5J51k05oM8K2r4m1P9N6o2L7kl0J90r5j10J81j72j8o8P2N3n4
$$ -51 -14 123 -31 14 165 -40 -46 2 24 -70 -111 -32 24 -38 -1 -3 -33 157 62 -48 133 -39 -57 -125 -53 0 -54
2314e4nP3P0j36J07k2L3k2j3L0l6mM7O6p5r9O9l8Rj2L7j31J3R7l1M2Nj13O3n3
$$ -54 -59 14 84 -52 55 33 66 44 31 61 25 21 68 134 59 -40 29 -9 0 -12 25 -106 -93 4 -27 15 20 -93 -30 -83
2344h3J57j00M4kK6k2j10L3M5Q1o5p2N6k3J15Q5r1o3Op9J52q3l2J8l6L0O8K7n2
$$ -83 74 -26 18 16 42 20 -90 -57 -12 69 4 -68 -12 -35 80 165 74 11 17 -62 90 7 -25 -7 -43 -13 55 82 30
2373C0j17M3J84j68n2R2O8j23L1j1J61j28K0M4P3j43K5l3l6J04R9k03Rk9J15q7
$$ 30 -87 -44 140 -28 -80 12 80 -43 -12 -23 138 10 30 74 147 4 29 -4 -40 64 163 -40 -31 -60 55 -32
2399c2Q5l5LJ1p4kR6J09j32O1j45N3m4J51j77P3K1n7P4oj7lK2l6J17J1j30l5J6
$$ -32 53 18 21 32 -42 -44 52 161 29 90 -55 -2 -46 105 -72 1 22 -35 39 33 16 13 35 -1 116 127 -3 -38 -22
2428b2p8J80lr8Pm2k1J27q4K3n5J22p2J06n0J09o5m1q8O0m7Q1p5N8o7M7Q1r7N8
$$ -22 -100 80 77 -21 -14 -56 -77 50 -34 -11 -66 56 -16 90 40 149 84 43 -45 15 -32 49 -26 32 -35 12 93 -4 54
2457E4j49J27K2J6j14j05J54kk6p0K40l89K58l3r0J0R7J26j54k3P0J7j51L1O4
$$ 54 -95 32 54 70 -44 -149 5 3 -23 -93 147 -242 16 -17 -107 -97 0 126 -28 -51 19 36 -115 -84 -20
2482b0M2J13j30N1j13J6L9Rj21J09J35o6q1L3j6m2KJ7Q8l9l4n5lk7J42Ln0k9j8
$$ -20 22 135 5 56 -57 -41 -2 7 -114 -5 130 64 -17 16 0 -42 -40 -23 65 26 -8 -63 -66 -93 49 52 2 -27 -45
2511d5o5J38Oj42L3J46p8l8K8Q5M5n3j29K06Qj66N7O7k8l3j21J57j11Q6K5j54
$$ -45 -110 28 34 -108 -75 71 -7 -45 -17 68 113 60 -69 137 145 -21 36 103 75 42 -79 78 -33 53 78 -76
2537g6J17j3L7k8j28J66j29J19j11P5l5Mr2L1P5n4O7j01J12j02n3L6m1J06J03
$$ -76 41 28 65 37 -91 75 -54 65 -46 29 -6 -2 -94 -63 12 -42 25 -76 36 -66 -119 -83 -124 -18 85
2562H5l1m5Q0j34kM6k5K0J14l2n8m7n6J68p8K0l7K2J9mP5n3k5l5%j47K23K0r8
$$ 85 54 9 89 -45 -47 -1 -26 -6 108 76 18 -29 -85 83 5 25 -12 10 29 25 100 47 22 -13 -13 -160 63 83 -15
2591a5J39j00M8k4n8N5rp6N6n7O9l1j6J16j30J0J15j11j0K16j62o7L2O3m3L7n0
$$ -15 124 24 72 48 -10 45 36 -40 16 -41 28 -3 -19 97 -33 -23 92 -19 -29 187 25 -42 -10 53 10 47 -3
2618cn8nJ20l0lK9nj3K0qj51P3J83k03O4r6J42J7r0pJ36j34j4L3L3N9n4l9NK1
$$ -3 -61 -66 54 24 21 50 45 32 52 44 -107 -34 149 -54 10 -86 56 73 -17 -24 112 -22 -36 -3 30 89 35 -4 1 22
2648B2k4P7m8O4o9nJ5r9P8J6j3M0j44l1J48j07J01p1q5J13j7K6k3j5K4L3Q0q6
$$ 22 -2 75 27 91 22 17 32 -67 11 27 14 54 -90 -121 27 -80 21 -50 -135 -22 -39 -13 -36 -51 -27 6 86 0
2676@pQ8l9m6Oj24J32M1L6j15L2k6M2jk0P5r3l5J06j08L9M5p0J20J7oj38N3J8
$$ 0 -7 81 42 -4 2 -122 10 51 87 -28 4 -22 20 19 -1 74 -19 -54 52 -56 -17 28 -42 78 95 89 -49 4 22
2705B2K5j02Q0j05P6L5l2K9j31J02P1J1j33J16r1Q4l1O8l9j0r4J52j07oo0J31
$$ 22 47 -55 25 -80 -4 31 -1 28 -103 -1 70 81 -52 64 -27 57 26 94 55 45 -49 103 -4 -10 -70 61
2731F1J5j37kJ42L3o3m6o7J05Kl8K7M7l1j00qN5M4p1J02n3p6P7j14O7Pj3L1J02
$$ 61 76 -61 -63 79 112 49 3 -64 41 43 5 32 79 48 -52 -60 -5 39 -32 70 17 -59 18 -96 -29 -22 -35 -4 98
2760I8j01J6o4M9L9j9k3p1O7j5j2M0qlJ23r7n2J03j85LR9M4Nj14Q2PO6j45RJ07
$$ 98 -3 13 -51 -2 37 18 -5 -76 -9 -24 -36 4 -4 -7 116 19 -33 70 -115 -112 -13 31 36 -78 4 11 77 -68 -59 48
2790D8J14j57Lq1j12K48j46K3N7n2J67j65J3J09nkj13KM9J7k3J51j62P4j2r4P8
$$ 48 162 5 8 -73 -185 63 -83 -60 -3 -55 112 -53 -40 69 64 62 -51 -49 0 17 -6 145 -17 57 45 -49 29
2817B9J37j25p1O8mq7N5j7O4k5m3Q0q6Rk0L0M3l4K5K2l7K0n2m5J24p5K4J8m3m7
$$ 29 166 41 -30 38 34 -53 2 -15 49 24 -19 61 -25 -16 -36 -6 37 3 28 50 13 33 -19 -64 60 -15 9 27 -16 -63
2847f3J22o6QP2Qp4o9N2J0LK6n2J40j58L5j42J68J6n1j09J93L1%M7j82m3J00m4
$$ -63 59 -7 1 73 81 7 -62 -10 0 3 29 -23 117 -41 -6 -148 20 36 -15 -124 69 100 100 147 -35 -78 22 -22
2875b2Q4p7oM7r6N4KQ6j33J02m0rm3L7pO8o9j8j5R5K9oj32J69j08O7j50k3K4J88
$$ -22 62 -15 -21 26 -70 -16 -14 72 -61 41 1 -8 -51 -14 -21 47 -22 -40 -55 40 69 63 -69 100 -8 59 -91 -114 -90 98
2905I8j80J48o7j45K92k52Q7OM0j35J23p3N7p4J40j03M5K6m9l8j0M2m3K5J06j02
$$ 98 -82 66 -1 -146 146 -106 -19 -13 27 -108 15 -58 -1 -75 65 -38 7 33 -16 -54 -64 -22 -65 -40 66 -36
2931c6J3M1j1M7o4R2k02J23O7p2k6J28n2k1m4K3k5J9R7q3J06j09k3l2R2n1p0J10
$$ -36 -23 18 7 54 -10 82 -120 3 70 -2 -28 100 48 27 -17 6 -19 0 97 14 120 11 -12 -44 48 -3 -73 37
2959C7q6R5L4q6j1R2j49J27rp8J14j43M6L2k0m1l8J29k9j0k4L9R0j99O0P9O4j85
$$ 37 -49 46 80 -6 -17 75 -74 53 44 -34 80 -63 -17 15 -5 -46 -84 45 16 6 -18 21 111 -88 -28 51 115 -70
2987g0J72n5P4j86M0Q3k04J05j3L7J32j09klQ2j27j20J33j4J04j65J58j3k5j6
$$ -70 102 47 121 -65 -25 58 -146 -41 -54 -17 115 6 4 1 83 -44 -164 -31 -45 59 -106 52 39 14 -2
3012bM7n6rn5rr1K91j50qQ5o6J8O3r7k7Q6j15M6J1K1N1j53J49K5k1pk5j7MN6L2
$$ -2 45 -11 -20 -75 -84 -175 116 -34 -42 43 -23 -5 58 -39 -66 20 -95 -49 -38 -17 34 -119 30 55 34 27 2 -15 -11 45 77
3043G7O3j72Qrl1P4q3m5J28l7Q6J04k46J4N6n0L6lN5p5J4J51n6l3q5O0j64K93
$$ 77 140 -32 -24 -33 -64 10 -73 -118 10 -27 59 163 -83 -69 -13 -63 -27 -30 25 -50 -36 115 59 26 -59 1 -163 130
3071A30k51J06n2N6r4J13Rq7P7r4J05j9O0O7l8k52J31J34q9j3L4p6M7K5N7o8n6
$$ 130 -121 -15 -67 -11 -105 8 17 -70 7 -87 18 -1 59 126 88 -164 -33 101 12 -1 33 -43 4 29 86 18 -38
3098c8j2k6J04K7k4j41MK2Q3On8Q9j2Rm3N1J25j38K9j89J18l9J03Jq3R0qj7Q8
$$ -38 -50 -76 28 55 31 -110 -106 -84 -1 5 -53 36 24 33 -10 41 166 28 57 -132 -14 -53 50 51 -32 58 50 33 121
3127A21j2j27q7J40o2k2L6M4k8l7O6j0Q5o6K9r3M9j92L32k07Rk3OnJ47q2jRj70
$$ 121 109 -18 -105 35 -27 -49 -13 31 3 -34 32 22 107 41 70 -23 26 -166 166 -41 -32 -55 -49 -54 93 11 10 19 -151
3156a51J47J73j38K0j18k3kJ58j96J46K5j7R6j24%k5n1J95j27n8P7M7j67Q4J3
$$ -151 -4 169 31 51 -67 -90 -92 66 -130 16 41 24 120 -4 -4 -29 -80 115 -12 -70 7 54 -113 -29 -16
3181a6J1J13r9Qm1k7K8O4j7K8p0m6LR7m6N4l7n5J7j45J16J5m2P6O4NK5j32M5O
$$ -16 -5 108 9 17 -24 -51 -23 41 24 52 -18 -64 -61 36 -10 44 7 -48 -31 -176 -60 -45 -87 -11 53 58 83 -49 -4 2
3211BK7Nq9J12j01O9k7J06Oj56R5o2P3l2j71K73k04J28m6K4n3J10n7j2j5k0qJ11
$$ 2 29 34 -55 57 -44 25 -2 104 110 -46 49 -13 60 28 -143 130 -74 54 8 32 -21 89 32 20 5 -15 -23 88
3239H8j51R2m1K1K4k0J3j22R2LN3K8o7O3j04l0O9rkm3M8q5P4P8j82J59n5L2n5
$$ 88 -63 29 -12 9 33 13 26 -96 -4 -1 52 80 13 76 -28 -58 11 2 0 -43 5 -80 -6 72 -110 49 -6 26 -29
3268b9K7M6j49J9lJ18K2o1L8p0K3J6n0Q7M6j49J24n1PJ6p9PJ2M2r8J38m0R7o3
$$ -29 -2 44 -105 -86 -89 29 51 -10 28 -42 -19 -3 -53 34 80 -69 55 4 11 27 -52 -45 -33 9 -89 49 9 106 43
3297D3m2j0nq2J0R3k0K04k17j00R7N2o0J7j2k6R7oj32Q6L9K3m7k4N6K3K9j22L3
$$ 43 1 -9 -14 -96 -86 7 -13 191 -26 -126 -29 23 -37 -20 -32 -58 39 33 -99 -13 26 49 2 -22 34 57 86 -36 -3
3326cJ0O5o7n8J25r3P1m4j8O5Qr7M3L9n0k9L6l2J3J04p1r4J29m8p7ok3K74j43
$$ -3 7 72 5 -53 72 -21 50 6 -12 53 61 -36 7 46 -4 -33 3 -29 -16 88 17 -77 52 4 -73 -79 -102 172 29
3355B9K5M7j05j81P7%j3J52m7N8%m8K2Lp2Q0J9k0nMp4j9m2J90On9nq4O1L8ml9
$$ 29 54 101 -4 -185 -108 -108 -121 31 -16 42 42 -6 16 19 -53 27 46 26 21 25 -49 -68 -110 80 86 27 22 -62 -1 37 33 -6
3387fo8M0J05K5K1l0j02L8L7j41J49j62K6K6JL1k4k5R2j0n8j9o4J21J4q5P1J04
$$ -6 -74 -34 71 96 117 87 -15 23 60 -81 68 -94 -68 -42 -41 -10 -34 -59 33 23 -35 -54 -118 3 17 -68 3 107
3415A07k09J59p0Q2k5r1K7J03j38J09o7Pn1J7J24p0j22J10m5M3L0m%n3K6R6r7
$$ 107 -102 57 -13 69 44 -47 -20 83 -55 54 -13 -6 -57 -40 84 14 -108 2 -43 0 30 26 26 -27 -1 95 -2
3442bJ0L5o9N7L0m0M8L3q3KP8j45K1K6J6j50J78n9n7J17r7Q1J0j1j04R0o2M0N8
$$ -2 8 43 -26 31 61 21 69 102 19 21 99 -46 -25 1 17 -133 45 -14 -71 46 -51 30 40 29 -75 15 -47 -7 51
3471E1j83J39oN8p5k5L8k4K9Qn6K9K5j51K49p6P1j9p6j33N2O5l6N5J0o4rJ22q9
$$ 51 -132 7 1 59 -16 -41 -3 -27 2 10 -46 -17 8 -143 106 30 101 82 6 -127 -75 -10 -46 9 19 -45 -54 68 -21
3500b1J1M2p4J44j75M3R3k3o4m5L0l2m5J81j85J3R8m2J68l5J01k72P1R8j05R2
$$ -21 -10 32 -42 102 -73 -30 63 40 -24 -69 -39 -71 -116 65 -120 -107 -9 -51 117 82 183 -89 -18 80 -25 67
3526F7q2l6J03j71J71jmJ6j46J05J9J03j62L5o9m9J42qL6l3L0m6n3oJ33q7j1P
$$ 67 -15 -51 52 -119 52 51 47 63 -83 22 41 144 -18 17 -52 -101 41 33 69 36 66 20 -33 -39 94 7 -4 3
3554Ck2P5J1j96Q1J2P5j8n0L2O8nQ7o9j25J08k32J77J6k2l1P1o6O2J2j82K16j67
$$ 3 -19 56 67 -129 -48 -36 39 21 -29 3 71 66 153 84 -41 67 -165 12 28 6 -25 46 -20 42 54 -128 88 -79
3582g9J0J46p5kl9J02pjm4q6J20m4r1J29J8O6j51k4J7O8L6m5k4J6l0J2RM9Oj19
$$ -79 -69 77 2 0 -39 63 56 55 11 -75 45 1 -90 39 57 123 -28 -52 -35 33 69 24 0 16 -14 -2 7 56 62 -57
3612e7K2J09j28J00j5P2o4q9J74q2r4jK3K7j1R8p7N9l2r1JK02j45M7j08M8p2J21
$$ -57 -35 74 -54 46 31 103 39 -50 124 42 -52 -53 -30 -3 -14 84 7 66 34 -57 -56 146 1 48 -60 -12 -84 37
3640C7J09k23J47l9n8K5J5r1Q5LK8m2o8L7k2N1N1j16O6R3q5j8K2k4R8j17R0j27
$$ 37 146 -77 70 31 -27 -2 13 -78 7 10 38 -4 -72 -35 -57 -6 45 -71 -5 88 3 -15 7 -17 81 -36 54 -73
3668g3lQ6k6P4n1m6P6j9o6J2Nl6L3Q3r0M8p7J35Lq2O9j80J18L9M6o0L5r5jl5k6
$$ -73 -76 10 -16 58 7 -39 37 18 -48 -36 -31 -67 -34 49 -41 7 -70 65 68 -14 55 -125 -7 32 78 18 53 -42 -43 -78 -104
3699a04J30j58J38m4L6Q5j01n2J08j3n3N0M5m4K7q0K1%q4J27j40J40j3j17L2J03
$$ -104 26 -132 6 -38 -2 83 -18 -70 38 25 -28 22 67 23 50 -30 -9 -9 -93 34 -106 34 21 -96 -64 39
3725C9r7J15l6R4j79R4O5j46J05p6L9k5OQk1P3j07O4J02j23J6OM4q2L6RP3j22
$$ 39 -58 57 21 115 -64 30 95 -51 54 -22 17 -8 -2 6 -15 58 -49 15 117 -6 10 16 60 -22 14 23 96 -26
3753b6O8j21O5K3K9M8j54K07j82K4L8J09n5r2J8j3N6l3J01r9J7J4po3J8k9J60
$$ -26 42 -79 -14 9 38 86 -68 139 -43 -19 19 128 73 -19 -1 -14 42 9 110 11 28 42 35 -28 -10 -39 121
3780A21r7n4J10q4K1K8%q0%l8L7R6k5l2m0J67o0J6m2n7R6K6j77J4L1P5PK8r6R1
$$ 121 24 -30 80 -4 17 45 45 -35 -35 -73 -36 60 35 3 -37 130 70 86 44 -13 83 109 -68 -54 -23 52 59 87 -9 82
3810H2r9m0n1pK24j37o7R3M1q2J4K1J07o3MJ8l5ln1J53K9j45K2j23K5M5Qn9J81
$$ 82 -17 -57 -108 -115 109 -28 -95 -2 39 -43 -29 -8 99 36 40 58 23 20 -31 122 151 6 28 -95 -70 -25 -17 -76 105
3839A05j99N2J6Op9M8K2l0m2Q0Ll7K3j9M3O7j12j6P3k7KJ0Q2j63M5J8Q1k18J85
$$ 105 -94 -42 -26 -20 -99 -51 -29 -59 -101 -21 -18 -55 -32 -51 -8 59 -53 -69 4 -23 -21 -11 71 -92 -47 -29 52 -166 19
3868A9mO3j19J89j31j01K14r2r2nNOJ14l7N5j10J0Q4j5m7p9j6O8R5q9M8r5OQ9
$$ 19 15 78 -41 148 17 -84 130 38 -54 -59 -54 -48 66 29 84 -26 -16 68 53 6 -73 -89 -21 74 -15 33 -62 -56 33
3897C3o7J00k07J04O8kl6J02J0r1k8J0L0j46J54n1K6lo9R0q9J7M3j8j7N2N9p2
$$ 33 -34 66 -141 -37 31 29 -7 95 105 14 -14 -4 26 -120 34 -17 9 6 -63 27 -62 -45 -2 -20 -37 15 74 2
3925BM0j04Q9j74Q6J79j29J09K1j39O3j28J37j6o0k0Mj2R0r4mJ28j27L9O0L8j08
$$ 2 42 -62 27 -147 -61 118 -11 98 119 -20 43 -85 52 36 -24 -44 -40 -52 38 -56 -60 68 -59 -20 40 78 -30
3952c0L4l3J33k3j7r6N5n7J9N9q0QK2o1K7lO7o6J38m1J2j56K44k05J15q9l0J35
$$ -30 4 -29 104 81 64 -32 23 -34 -15 44 -36 -28 -6 -67 -40 -43 24 -42 96 55 67 -89 155 -50 65 -24 -54 81
3980H1k5j03K9P5p9P9j28L1O0n7J3J6Q1j08M7j3pN1j05J8K1o5K9J10l5j01J34
$$ 81 56 -47 -18 57 -22 57 -71 -40 20 -37 -24 -8 73 -35 12 -1 -8 43 -62 -44 -23 -88 -59 51 16 -85 49
4007D9p7Q1l0J7n7j6J1P1j42J1J09o0j6m0R6j00N8Q7J6op0L8j7n2J82k20J5J1
$$ 49 -28 53 23 40 -17 -33 -22 49 -93 -82 27 -33 -49 -89 7 -93 -35 52 68 62 -8 30 13 -39 143 -77 -62 -51
4035e1N3k4Nj5n1N2J3L0o7O8%k3J07o8p1MR4q2M8K2p0O3J5n3L2o3l8j8M1Lnk2
$$ -51 2 -22 -17 -32 -83 -31 -18 12 -55 13 13 -10 97 29 -42 -38 56 -26 22 44 -26 37 52 -1 31 -32 -70 -88 -47 -44 -49 -71
4067g1N0j2o2J18O2km6M8n5ppJ83j66O2r5Mo4R7LJ4j7j4p5K3l9N7j03J92q9l0
$$ -71 -21 -33 -95 23 85 83 37 85 30 23 16 199 33 95 0 4 -60 37 40 54 37 23 -52 -29 -68 -11 -114 78 -11 -41
4097d1Q7L2N2j69PP0j53Q5n2j6K05pj56J56j04j40J48n2L0n9%J54j35l3l2J03
$$ -41 46 78 130 -39 -32 38 -115 -30 -82 -98 107 100 -56 100 -4 -144 4 -48 -18 -77 -77 77 -58 -91 -123 -20
4123b0L3Q1o7Mp9L3P6N1j17J4j0l7M5K7k9M7J6j22J50lj15p3KJ39j11K5O8j47
$$ -20 13 94 27 31 -48 -15 61 112 -5 9 -1 -38 7 34 5 52 68 -54 96 93 -22 -95 -93 46 -65 -40 28 -119
4151a19J16m3J9k5k8P8K6q6J37r4m4J0Lj00K03%k6O4j30Q2j5m6J44j37J33p9p2
$$ -119 -3 -46 -27 -52 -80 -2 24 -62 75 -19 -63 -53 -50 -150 53 53 27 91 -39 43 28 -18 126 -11 122 43 -29
4178b9m5P6mk2J08o7n0m7N6j5O4rk7O1n3L1N8L5j57L9J4p4K35j24J64k52J3j6
$$ -29 -74 2 -2 -24 84 17 -33 -80 -24 -39 25 16 -11 50 -3 28 86 121 -36 3 17 -57 178 54 218 -34 -21 -37
4206c7P3m0L4j34R5n6M8k8MR3n4j2N0r2K27j44p2j30K17n5N4mj49J41q4K1k7O7
$$ -37 36 -4 30 -104 -9 -65 -17 -45 -41 52 -2 -14 36 -56 171 27 -45 -175 42 -13 41 37 -112 29 -55 -34 -61 6
4234FN0q4L5O0j07J8j08J61pj0P1p1Ok1Q8l1j24J24M4n9o9rQ5r7Q2m8J0J3l4o0
$$ 6 56 -28 7 67 -40 -22 -130 31 24 14 85 14 20 -1 87 56 -68 56 100 41 -28 -37 48 -49 33 -15 -5 8 -26 -86
4264h6O4N3rOJL4j13J5Q9j1n0P5o5o3j3L9JJ32r7pMj2jJ11j10N9j7k8L0P3j42
$$ -86 -22 31 22 28 29 63 -50 -35 54 43 -7 68 3 -60 -73 -34 -33 99 2 -5 -1 -13 -14 97 -13 46 29 1 31 104 -38
4295c8NL3K8j09J25j3o8J76j81J10nr6k7J13r5m0J03j03J39m2OM7m6k9nM0Q2j44
$$ -38 -33 0 28 -81 44 31 -37 139 -42 68 63 -33 -60 53 -42 -82 21 -82 57 15 21 68 22 -7 -12 28 110 -34
4323c4Lj9j2R3Q5j63J15j01k8k5J44Rk7n6j7q7Q9P1Rr6J78n1j48J06o5P8J0l0
$$ -34 -31 -50 -62 31 116 -47 68 -33 -61 -86 58 67 40 -16 -33 -120 -31 40 49 -47 131 80 -68 38 -27 51 61 31
4351C1M7p2k9L6k6l2P0M3j61k9K16Jq9j4l7Q3K7n9J4j21R3M5k8j4L6m7J3J8Q3
$$ 31 78 6 -23 13 -13 -45 25 68 -93 -122 94 95 6 -8 -45 38 65 6 20 -101 -8 37 9 -5 31 -16 -3 15 98
4380I8l4n6j9L2l3P9l2j56J69r5J18j14P1r5J35qj35R4o7J21j24m8N5O2L2m6M
$$ 98 64 8 -11 21 -12 67 35 -121 48 -47 71 -43 28 -67 68 60 -75 19 -48 73 -51 -99 -44 18 50 4 8
4407HL7n1l7J2J2L2n3Q5j11L5J37k20J07l9j1O2J0O2o2k7k6L3J1J6m9J32j25n4
$$ 8 45 -6 -43 -31 -19 13 -40 45 -66 -31 106 -114 -7 -46 -57 5 15 77 15 -12 -38 -5 6 22 -27 105 -20 -74
4435g4jN3N8l1pK0jRm7P9r7NK1O8M3j24p6J08J5O6j79L3J40q7j53J15P9l0pl5
$$ -74 -75 -22 36 5 -2 18 17 26 -21 58 -39 -34 -13 55 98 -26 -102 6 21 87 -92 -59 81 -6 -159 -44 35 5 -2 -37
4465c7K9qO2L7Jk5J4r6m2KK7o3P3Mk8PK5P3p8l7R7m7M4L2m6J4L1j9m2M9J4j20
$$ -37 -8 -16 46 83 84 59 73 -23 -65 -63 -36 -99 -26 -22 -50 -43 -18 55 -23 -60 37 -10 34 66 20 34 65 46 4 53 67 -53
4497e3J56p6Q1j17j3N8m9L1J06o1n6j9j58K37j89J30o5P8k0N%m5k0J17r7N8Np0
$$ -53 103 27 108 -9 -22 36 -13 18 124 63 7 -12 -170 67 -122 8 -57 21 1 6 6 -39 -59 58 -39 19 24 -46
4525d6R7k0m8K1K6N7j44J55p0r2J46k3l8L8j08N0n0J1O8P3q1L5n8M6M8n2L9qq8
$$ -46 51 31 -17 4 30 87 -57 98 28 -64 82 59 21 59 -49 1 -49 -38 30 103 22 57 -1 45 93 41 80 72 -16
4554a6l3J03j0l8K9J18j60M9Q2m7l4J8j00Q6M9m3Rm2m5J21j54L5m9J03j3Q9o8
$$ -16 -49 54 44 6 35 153 -7 42 124 77 43 61 -39 47 96 53 62 20 -25 96 -58 -23 -72 31 18 107 39
4581C9n8L7K1o1m6J02q8Q5j0J6QK8j69K6jK7N6Pp8PJ9n7K8RJ80j56Q6q6J9N1J5
$$ 39 -19 18 39 -22 -68 34 -54 31 21 37 45 73 -96 -70 -71 -44 12 19 -59 -52 -33 -90 -62 -53 127 -29 57 -29 -10 41 56
4612E6j00J50j10j3K7j16J22O6qj24o8J23O2L6m1j93J86o7P1j6l2n3K0M2m2R4
$$ 56 -44 106 -4 -17 10 -106 16 82 74 -50 -118 5 67 103 62 -131 55 -12 59 43 11 -42 -22 20 -22 72
4638G2j32K5J0K5Q5q4r1J9J13r6Q4j6r3mJ47j2p9m7J15On8J46q1k0l4l7j0Q2n7
$$ 72 -60 -35 -25 0 85 1 -90 -71 42 -54 30 14 -79 -83 64 52 -27 -74 41 47 -11 135 54 34 0 -37 -47 35 -22
4667b2O5j21L3J10k6jn5p4j4R8J12p3l5O2K8N4l5q9Q6j10J41j38Q6o9j0OJ3k0
$$ -22 43 -78 -45 65 39 38 -17 -91 -105 -7 105 32 -3 59 87 141 106 17 103 -7 134 -4 82 13 3 9 22 2
4695Bm4j5L7K4J02n6q5J0N9q8R5j7k8M%K5mj14R7j62K00P5j55j0J22j27P5lm3
$$ 2 -42 -57 -20 4 106 50 -35 -25 34 -54 41 24 -4 0 0 25 21 -93 4 -158 42 117 -38 -48 74 -53 22 19 -24
4724b4k5O0m2O7RM4n6jq7N2k6P4k9j12P6J66j97QQ2j56J19J8J2N4r5Lj0J34j02
$$ -24 -49 11 -31 36 45 89 33 32 -55 -3 -29 45 16 -96 -20 146 -51 -43 39 -117 2 20 32 86 -9 -6 -16 118 16
4753A6m0M6P1p2n2K6m7R9j5n8o2J94o8k6J1L1p7O6r3O6n0J00J5j70L2J64j56R2
$$ 16 -24 22 93 21 -31 -5 -52 47 32 -26 -88 106 38 12 23 54 -23 43 -50 16 -34 66 81 -89 -57 107 -49 43
4781D3k4r0Q3N4Pq0j2n4O3K8o4Q5n7lJ1L2pL2L5p2K2mJ2r2M8k4J43q5k7q3MJ02
$$ 43 19 -71 12 66 73 -7 -19 -73 -10 18 -46 39 -18 -21 -10 22 15 47 82 10 32 28 40 -52 -4 -28 115 30 3 -80 -76 26
4813B6NO1j38J46jj91J55K0l9k6K4j5n7J7M7L0j49O1j8Q1n0m1J20m9j2M6j6j12
$$ 26 31 92 -46 100 99 -92 63 83 44 18 42 27 -30 -13 34 64 -85 -24 -42 39 -11 -52 68 19 7 53 37 -75
4841g5J26K8j48M3J11Kj45J37j00nj8mJ02j13K8M0m8J68n1MNj14Mk7K4L3J9r8
$$ -75 51 79 -69 -26 85 87 -58 79 -21 -26 -44 -48 54 -59 -31 9 -39 129 78 82 87 -27 -23 -50 -26 7 26 -72
4869g2K9ppN1Q5o2O4j64J63j48R8M9n0o6p0O4J26jj47M7L8Or3J8m0J23L4L1o4
$$ -72 -43 -50 -57 -6 79 17 81 -83 80 -68 30 79 29 -37 -107 -43 83 82 -65 -18 20 26 -67 -49 -89 34 68 99 35
4898C5M4o0o7k0J41l9M2m1r4L8l1qR3j02J21j2p5Q1p8nk5K6M2J8m1M0M1o5p9J02
$$ 35 79 19 -48 -68 73 34 76 35 -59 -21 -52 -60 33 -69 52 40 -35 46 -32 -37 -62 -36 6 24 -17 23 64 -1 -80 22
4928B2Q4j17M9o5J05j2k2l2j7qq5J22QR2q1l3J0l4J6rl0R0N5q2r6j8J22o2k2j4
$$ 22 106 -11 38 -27 78 66 44 12 -5 -13 -98 24 32 124 43 10 20 -14 2 -7 -37 53 108 26 -70 -88 34 -28 -50 -64
4958f4N2R8n3n6O4m5pL3Q5j73P0QL3M7j49Q7k1l0K0J33j43O6k04K17j51K52j70
$$ -64 -12 86 33 -23 41 -4 -11 22 107 -66 4 12 45 92 -57 30 9 -21 -1 132 -11 55 -149 68 -83 169 -1
4985aq0Q8oOLj1R7Oj49J27j08M1k3k8K5O2p4J61j65%Q4o6J3K4RL4q0r0J35j4L
$$ -1 -81 7 1 7 10 -1 96 102 -47 80 -28 13 -10 -38 -13 49 -25 136 -29 -29 55 -11 2 26 35 69 -11 -101 34 20 23
5016B3no2J12r6R1o3pO6ol1K6K0j07K3p6P2L5P9l8j12J06n3N0Qq2Q5k0j10M2J4
$$ 23 18 -44 68 -28 63 0 -7 59 53 22 48 68 -39 -16 -92 -20 15 94 56 -56 50 -3 47 55 -27 58 38 -72 -30 -16
5046a6kj7K1J10j12j13O7M0q0J29n5R7K4r5m6L3J8r1O0LK3qN8o3J1l9k7O9L9j07
$$ -16 -18 -35 -14 96 -16 -129 -62 -22 -102 27 -28 69 93 -2 -48 -15 3 -88 -28 -25 -2 -10 48 -15 -4 -43 -70 -1 38 -69
5076f9R1m5J02J4q8n4JJ39j75J12J41j25j1l1r7J59p4K4J5m3n4m0Oj3R3J00j65
$$ -69 22 -23 79 93 5 -49 -48 91 -84 28 169 44 33 2 -95 64 -10 14 29 -14 -68 -108 -102 -115 -22 78 -87
5103h7J11K4n2M4r9L3n7K9J90j01j05J00q1R2j14J44l4o0L2K2N7p7K5Rq3J44p0
$$ -87 24 48 -4 40 -59 -26 -83 -54 136 35 -70 30 -51 41 -73 71 37 -23 9 31 88 11 36 45 -38 106 36
5130C6J5j9j9q2J56j07Ml3R9Kn1P8q1K0j17J34k6o9M8N2qm4R0j47M5L2q9L0N3
$$ 36 51 32 13 -69 87 -20 -16 -49 50 52 1 79 -2 18 -99 35 9 -60 -12 40 32 -12 78 -69 -24 8 -81 -51 2
5159BJ46j03n3K6m2L8P6l0r9J35k26N9L8N6j9k9m0R5r8J4O2N1j66J29Q2j14M1
$$ 2 148 45 -8 18 -24 14 90 60 -39 96 -130 -71 -33 23 4 -25 -65 30 -68 -54 8 59 -107 22 104 -10 31
5186C1n6J03q8J3o7M7JM4J6n8R2j0o9p7J94j04l5j7K1L2L2k6r1J8N3j3R9qj29
$$ 31 -25 78 -10 3 -64 -17 -16 28 44 -14 78 68 -1 -78 116 12 -23 -40 -19 13 45 19 -72 -54 -1 -14 85 77 -52
5215e2J34l3l8k2j4K6J09k27J73o2O2L2k3l2q1J42j24J29j57J12r7RM8L9j54J07
$$ -52 82 49 11 -11 -25 1 110 -117 56 -6 56 88 65 33 -48 94 -30 99 -58 54 -43 -34 14 53 -101 6
5241FO1j7l3p2J40m5n6l7J17r1Nl5L2M7j45R0j0M1k9j8M4J25j90J26L7r1j2j03
$$ 6 67 50 17 -55 85 40 -16 -53 64 -27 -22 -57 -25 22 -123 -33 -43 -2 -31 -49 -5 120 -70 56 93 2 -10 -113
5269a13K5O6j6P0L6o7q1J59l5j42L8oJ1K4L9J01r1O9l8k8o4j4M1n0N1P0l8j04
$$ -113 -88 -22 -38 32 68 1 -80 79 44 -98 -60 -66 -55 -31 8 109 18 87 49 21 -43 -57 -16 -66 -15 55 17 -87
5297h7mL2P4P7j25mQM9kj9MN0n2O0j15O7r3lJ12j3kK2j03R4mlmJ8j34R5L6j89
$$ -87 -91 -59 15 92 -33 -37 -29 20 18 -1 3 53 1 61 -54 13 -80 -83 29 16 14 36 -67 27 23 20 16 34 -100 -5 31 -158
5329a58J10M8J3Q2j12j2k7m9kN7L8l3Q8m2j51P7J6P5j64K22j42O7l7n5J22J8j48
$$ -158 -48 0 13 95 -17 -29 -56 -105 -107 -50 -12 -45 43 1 -150 -73 -57 18 -146 76 -66 1 -36 -91 31 49 -99
5356i9J79j06r4J23k1pN2r9L8L4l9M6P2r3j15P7P2j20K44j03k6o4K1J66j50n7
$$ -99 80 -26 -120 3 -18 -25 27 -72 -34 0 -39 7 79 -14 -129 -52 20 -100 144 41 15 -49 -28 138 -12 -69
5382f9J30N3k17J02j3J70j91O5j00L3N0N8k0n2j59J55l8L2k5k1P0J5q7K7J7j8
$$ -69 61 114 -103 -1 -14 156 -35 30 -70 -37 13 71 51 -1 -160 -5 -43 -11 -36 -57 13 28 -59 -32 -15 -33
5408c3J0J8j27J06k2J03j0Q0j16J2R1j93J23J2k5L0j51MJ98r8J8n8j5M7n0J10
$$ -33 -23 -5 -132 -26 -48 55 45 125 9 21 112 -81 42 54 29 59 -92 -88 110 12 30 -28 -43 4 -46 64
5434F4l8m0J21j92N6k4N5J2m6K5L4j24J18kj10J91j13Q8J7j51P3k0j01P1j3J71
$$ 64 26 -14 107 -85 -29 -53 2 14 -32 -7 27 -97 21 19 -91 100 -13 75 92 -59 14 -6 -107 -36 -49 122
5460A22j17L6L4k6m5O6j38R8J16k16J9mL1mO5m1M1p5L2o6NJ20k1n0N7j00J7k2
$$ 122 5 41 75 49 4 70 -68 30 146 -70 -51 -55 -24 -28 37 -4 37 -38 -6 -72 -67 53 32 -18 39 -61 -44 -66
5488f6J02l0J40q3j74LJ97or9k4O8l3K9j3k2P1q1K5jp6J43j13K7N7mq2O8R0j60
$$ -66 36 6 146 63 -111 -108 89 83 -16 -40 28 -5 24 11 -11 60 -21 4 3 -73 70 -43 -16 41 37 -45 23 113 -47
5517d7Q4j6J8Q5o3j65J17l2r4Q3J09j34J7N0J6J17j49L6k1K4p2j9N8j0K8oK3o0
$$ -47 37 21 39 124 61 -104 13 -19 -113 -30 79 -55 -38 12 28 145 -4 32 11 35 -37 -56 2 -8 20 14 37 -23
5545b3M6j24J66l3j8M7p7l1N0N6n7J5j15R7Oro6J21j7NJ4n8M7r1o0J22N7j26N1
$$ -23 23 -101 65 32 14 61 -16 -47 3 59 2 17 -98 -1 5 -4 -70 51 34 39 53 -5 42 -49 -109 13 70 -56 -5
5574ek8M5P2r4o4K19k6j22O3n7J38r5q2P2m5m1Q5l1J42j42j1j0l2J0j25J90p9
$$ -5 -33 12 84 -10 -74 145 119 -3 60 3 141 46 -36 36 -9 -50 35 4 146 4 -7 -17 -49 -39 -164 26 -53
5601e3K8m7Om0J72j02J24j50NNj7R3q1k5J03J5q4O9q0N9K4o4l3J17n8J09r3OM2
$$ -53 -25 -72 -66 -106 66 -36 88 -62 -57 -52 -69 24 -57 -82 21 36 -48 21 -59 0 24 -40 -73 44 -14 95 2 8 50
5630E0r4J42Nj96J31p6K3N1k0m3L0%m2J03o8J10l4m3n5P5Lj01M8j1k2m5J04l1
$$ 50 -44 98 103 -93 38 -38 -15 36 16 -27 3 3 -39 64 -4 106 72 29 -26 49 52 -49 -1 -12 -34 -79 25 -6
5658fM7N7j65J25n7J1L5q7O4nP8N3j36L2n7J7L5K5k2n6j50J60M4M1j23L7O4l4
$$ -6 41 98 -67 58 1 12 47 -40 24 19 97 150 14 46 -11 6 41 66 44 -12 -162 -2 42 83 -40 -3 61 27
5686B7l1j1K6j9o9J82n7%L2j32J6J01p1N3j13J23o7j9J9k4qJ07K2r6J0K0o3k6
$$ 27 -4 -15 11 -8 -77 105 48 48 80 -52 -36 65 -6 47 -66 57 -10 -29 -10 -34 -42 65 87 -9 1 21 -42 -68
5714f8N5P2j66O4J4nL5o5J26j07j7Q1kn4N1l7o2J41Kp1R0j11R0o2J20j52qO0R
$$ -68 -13 59 -107 -43 -29 -34 1 -64 62 -45 -62 19 17 -37 14 -23 -85 56 58 -13 77 -34 56 -6 114 -38 -46 14 23
5743B3M8L0j18m2J5L3L4j0N6k2p5m2J82j56n0R2J7J1N4j48qN9jN7q8N2m4J63j51
$$ 23 71 101 -17 -59 -44 -11 23 13 69 47 -28 -70 112 -44 -94 -2 15 26 80 -68 -76 -17 -18 39 -49 3 -41 122 -29
5772b9PPM3K4j20N2K9l6KN6K9p1NJ9N3k29K0K44k2r7J22k55J47l3L1J6j30P4O8
$$ -29 -22 -15 28 52 -68 -16 13 -23 -21 35 64 -7 -2 17 70 -159 -139 105 83 -14 108 -147 0 -33 -2 14 -116 -42 26
5801B6j12J10q6R0o0P6mr2J75l4oK7j02n2J04m5n0O2J72j95k8k3n2J10m3J64k47
$$ 26 -86 24 -62 28 -32 44 40 -52 123 89 83 110 8 -44 60 15 -35 27 199 4 -24 -47 -99 11 -32 132 -115
5828a15Q2Q8q0k8J4J15j36n3K14q2p3O9j7m2k5M0ll6Q5m2M0l2m4JJ37j18M5J7
$$ -115 -33 55 -25 -53 -39 76 -60 -113 101 19 -54 15 -2 -44 -69 -29 -32 -68 17 -25 15 -17 -61 -60 77 -41 4 21
5856B1m4MK1J9O1Mj17l5Q1j12L8N4l3P3k6j9n0oR6N9K7m0Nk1m6j3l0J21L3j25
$$ 21 -23 -19 2 21 82 86 -31 -66 15 -97 -59 -5 -38 35 9 -10 -60 -66 30 89 116 76 81 60 14 1 -29 92 125 0
5886@K6n0P7o0l0k6J46r7L0P3p1p7k7Q0Rj0n5L9J3p3Q1%o1O0o4J30J0j25jJ8N4
$$ 0 26 -24 53 -7 -37 -63 83 -14 16 89 18 -59 -86 -6 3 -7 -62 -23 -10 -83 -2 -2 -63 -3 -67 63 73 -52 -53 -35 19
5917A9K2j29N0L7n3R7LL0n4o1J45j43M2Q0p1k6j6K6O9q8p7P3%J08j36P0j21J35
$$ 19 41 -88 -38 -1 -54 43 46 76 22 -39 106 -37 5 85 14 -12 -28 -2 67 -21 -98 -25 -25 83 -53 17 -104 31
5945C1j19P9nj5J6j5M9L7j14L6Qj21N6N0P8o7l9q4J02J4J25n7m0qR2j12n7J12
$$ 31 -88 -9 -14 -29 -13 -28 21 58 -56 -20 -12 -133 -77 -27 51 -16 -55 -139 -37 -23 102 45 5 -3 89 -23 -80 32
5973C2k0j0q9Q2R2o4o1j7o4J10k6O5K1j06p0O3O1k6k9QN5m7k5M6L6m2J13o2n1
$$ 32 12 2 -87 -5 87 23 -38 -55 -119 -9 -35 30 51 -55 -125 -62 -1 -27 -56 -48 7 -40 -65 -19 17 -25 88 26 -25
6002b5J45k02J55o6m4L5p9%J17p4N7m2N4k5r8J13p9J12rK8j78M6J30j13K5J11
$$ -25 120 -82 73 7 -37 -2 -81 -81 36 -38 19 -23 31 6 -92 21 -58 54 45 73 -105 -59 71 -42 -17 94
6028I4j15k0J99r0j04Q4j8k1P0j00N3kj6l7R3L1p5J2n1n9N6K0j2R8K5j79J43k1
$$ 94 -21 -41 158 68 -36 48 30 9 79 -21 32 30 14 -23 70 101 26 38 -13 -72 -16 4 -8 90 115 -64 79 58
6056E8N9j84O8j4nPq8O2O4J2L0j31P9n7km4J19l2j6k0o2J48m9n4R3q6L9j5o0J58
$$ 58 117 -67 1 -13 -18 -11 -99 -37 27 39 69 -62 17 -40 -42 -86 33 1 -15 -35 -97 51 2 -52 41 -45 -6 -21 -81 77
6086G7p4jP3o6J07n0j23J16O6o5o6j3l0P7j30Q2Oj1Q5j01J49n2k1k4m0j0M2q6
$$ 77 3 2 75 9 116 66 -57 59 125 60 -6 -19 -49 28 -102 -20 -14 -25 60 -41 108 56 35 11 -29 -39 3 -83
6114h3O7K2p0L0j1P3mJ0j04RJ35Jj07L5L5Q1j06l5k1N7j33K5J8l5L5Q9mq7O3M1
$$ -83 -16 6 -64 -34 -45 28 24 34 -70 -61 74 75 -32 3 38 119 13 -22 -43 14 -119 -94 -76 -111 -76 13 9 -78 -15 26
6144B6r8M8R2n0l3J60j77k0J15j32P4J2o2M6m9J32j98J10L2j6pn6M3j6J03j94
$$ 26 -72 -24 68 18 -15 145 -32 -52 63 -69 5 17 -45 1 -48 84 -114 -4 28 12 5 -51 -8 -24 79 -115
6170a15P0K7J23j55N6k3M4j24M9k6P3N9o3p2J52L7q6j7j6J18j48L5kR3k16Q7K3
$$ -115 -45 -18 105 -50 6 -17 27 -97 -48 -74 -1 58 -5 -77 75 112 26 9 -7 111 -37 -2 -4 89 -127 -40 -17
6197a7K3q6L6oO6O1j6k2n3Mn8KN9OrO4p0l7Kj2Q8k7o6K3QL4J4p7M5J59p2om8n2
$$ -17 6 -80 -44 -50 16 77 61 39 -14 -10 -68 -66 -7 -1 -10 54 -16 -53 -51 -63 25 -2 -68 -45 -37 -3 11 -66 -21 138 66 60 12 -40
6231d0k9P3q7J04o1N8o9P7j29Q5l1K5J4LO0j09j0J5mL3lr5N5J19p8K0q7J32j28
$$ -40 -69 4 -83 21 -40 18 -51 26 -103 -18 -49 -24 -10 -7 53 -56 -66 -51 -55 -22 -25 -120 -65 54 -24 -4 -91 41 -87
6260h7J61j02L7%j07R4r6M5O4l2M3j6m8K8l8m6J95nj79J06j02J52j9j21J60j38
$$ -87 74 -28 9 9 -98 -4 -100 -55 9 -23 20 4 -44 -16 -54 -100 95 90 -89 17 -85 67 48 -73 87 -51
6286e1J5N1K9J6k5p2L5k5n4J35l4q1pN4j3q2M9J53k6j19J3Q2l1j19P9Ok7J24K7
$$ -51 -36 15 44 60 35 -37 -2 -27 -81 54 20 -61 -68 -14 -27 -109 -60 93 67 -52 -39 43 12 -107 -28 -22 -49 75 102
6315A02l0p7J7l8Rr0J07M9q8j00Q1K6K5r4R8l6M5m0K9J5Q0k1r2MP2k3j31N4M6
$$ 102 72 -5 12 -26 -17 -107 0 49 -39 -139 -58 -32 -7 -101 -3 -39 6 -34 -5 10 90 69 -23 -19 53 30 -101 -47 -1
6344aj1rk3R8K0L1j07o4L2K0M7O1r6k8L2L6q9P6N5j35L6p8J90o5j14K7R9j11P7
$$ -1 -12 -21 -44 54 74 105 -2 -66 -34 -14 33 94 -2 -30 2 38 -51 25 80 -55 -19 -97 93 28 -86 -59 40 -71 6
6373FL1m3o0Q7j06J59o6L6K9j12JJ02n6p2R4jm5M8k6n9J5oJ19qj75R7K5O9j08
$$ 6 37 -6 -66 21 -85 74 8 44 73 -39 -38 64 8 -64 30 29 -16 32 6 -53 -38 -44 75 67 -108 -11 14 83 -25
6402b5m3P8M5r8K3P2m6o6K1m2J17n8Q6j39J7M9k4L1M3o9n6M0O1M2o3N1K2j04P0
$$ -25 -68 10 55 -43 -20 52 6 -60 -39 -81 36 -22 64 -75 -58 -9 -33 -2 41 -28 -84 -44 17 59 -4 47 69 -35 35
6431C5o2J05j72Q6K0p9J5J28r1L0r3P9Qko4nO6Q9r4p7J72m8n0K8l0J38j34m5o7
$$ 35 -27 78 -94 -8 12 -67 -52 76 -15 15 -78 1 9 7 -57 -62 4 93 -1 -78 94 46 -4 24 -6 132 -2 -47 -114
6460a14Q1K9O5q0Q4k1J3j19K05j44o7Q4j06J27p2%Q5q0Q1m9M8Pj76J54O1%q7J24
$$ -114 -33 -4 61 -19 65 44 57 -62 143 -1 -68 16 -90 37 -35 -35 50 -30 51 2 50 57 -119 35 96 96 9 133
6488A33p1Qo3J19j16K0rr4N2j9%P1n6Q7j28J12j15ON3q7R1M3l9OP5j5m0L8K0n0
$$ 133 62 70 7 126 10 30 21 -73 -21 -40 -40 31 -25 62 -66 46 -69 -63 -10 -97 -6 37 -2 4 79 64 24 62 82 32
6518C2o8J8R6j13J3L9n4qO9j03J81j43j9O3L9j5L8q7J8j10R2nn5K6M5N0q4qP9
$$ 32 -36 -18 78 -35 -22 17 -37 -45 24 -79 102 -41 -60 3 42 27 65 -22 -4 -114 -22 -27 -82 -56 -11 39 -45 -53 26
6547B6j08M5Q2q9J0J17k0r1Q7j34Q2N2n6N2j28lO6pj33J90J9O2j73M5k5J19l2
$$ 26 -82 -37 45 -44 -34 83 63 -28 59 -75 7 59 3 55 -73 -76 -10 -17 -150 40 59 121 -52 -7 -32 87 55
6574E5o6P7J7o4n3J6qO4j36J04KJ3L1N1j65J44o4J7k7P5k42K98j98J6Q1j16J49
$$ 55 -11 66 83 19 -34 -18 -26 38 -98 6 8 21 52 103 -62 82 18 35 8 83 -159 139 -59 -43 38 -78 71
6601G1j2Qr8J48m6j54J42j08J17m8j38P2O6j25R8N2j72R6n8RN7q2R2Q5r9J2l6
$$ 71 59 67 -31 117 71 -83 59 -49 68 20 -118 -46 20 -105 -7 45 -127 -31 -89 -80 -23 -105 -13 72 -27 -15 -51
6628e1l5J09p8M2k9Q9j23M7J03r0RLjm9m9K03j51R7q4K2o9K3lP0N2n2j04J41k8
$$ -51 -86 23 -55 -13 -42 47 -76 -29 74 -16 -7 -4 -5 -54 -103 100 -51 46 -38 -16 -85 -62 -65 5 57 5 -99 42 14
6657A4l9m3O7j27J44l3L8n2m2M5J59j56m6J60m9qj05N6j0k9N1J2J2l7n9j8J14
$$ 14 -25 -68 -1 -128 16 -17 21 -31 -73 -28 131 -25 -71 89 40 32 -73 -17 -27 -56 -5 7 19 -18 -77 -95 19
6684A9O2N4p8p2l1r1P2rj3MO1K6J58k34J36n0J1n2M4R2Lq7p0k3M4m5J6M5L8J6
$$ 19 81 135 57 -15 -46 -137 -65 -74 -87 -83 -22 4 162 -72 64 14 25 -27 17 109 112 25 -45 -68 -24 -69 -53 -8 30 46
6714D6o9O5Mn5N9n4O6j25P9P2p4k0l4J2Oj05J20P9j59Q8m2N3O5j87P9L5r6J62
$$ 46 -23 42 46 -9 50 -4 62 -63 16 88 14 -6 -40 -28 -22 -127 -7 72 -87 1 -41 12 77 -110 -31 4 -92 70
6742G0j13l4K2M1l6N3n3J2P7j11J24N9o6j80J60q5P7j44J57l4k9N2J03j06Q7j13
$$ 70 -43 -77 -55 -14 -50 3 -50 -38 39 -72 52 111 45 -135 25 -60 17 -127 30 -4 -33 19 122 16 103 -10
6768a0L7n5N7jM3k3j43N5MM4j9kp1J47j48O6p0N7Q3n1j03j4K19p7m4j0r9P2J9
$$ -10 27 -28 29 28 71 48 -95 -40 -36 8 -11 -13 -84 63 -85 -19 -89 -32 51 0 -103 -117 102 25 -19 -29 -128 -56 -37
6797c7r3L4J82j17k8m1P1KNK6J2k5L1K7j64J20N6q3r6L5J09o4J12q9J19j24m2
$$ -37 -130 -96 86 -31 -59 -100 -29 -27 -22 4 16 -9 22 49 -115 5 61 -22 -118 -83 26 -38 74 -15 104 -20 -62
6824f2J6O1J6n6%P1j20L9L4o2L9K2p8Q3n4O9n0J22j64J25M8j88N1K2oL1J8j05
$$ -62 -46 15 31 -25 -25 46 -74 -35 -1 -63 -24 -2 -80 3 -51 18 -32 90 -74 51 99 -89 -38 -16 -22 9 27 -78
6852g8OKJ1K7R0qN8p1J4KP9j16J2l3l2N7P6p6J21j30ml6L5O6q0J2q1J23j58P9
$$ -78 -72 -70 -59 -32 58 50 108 37 51 53 132 16 28 -5 -37 20 96 20 141 11 7 -29 6 72 -8 4 -77 46 -112 -33
6882c3Ml7J27p0K6l8K9n7Q4j35K6O9k1O4m4j24K00q4k8J60j30J4R4k2l3q1O3l1
$$ -33 -29 -66 61 -9 17 -21 8 -49 35 -100 -74 -5 -26 38 -6 -130 70 -14 -42 118 -12 2 96 74 41 -40 23 -8
6910hM3L0j1j7O6j11Nj6pp4k8J35j25J07r4K6o8J34j14P6MP8l5Qo5J34j54O0L1
$$ -8 35 65 54 37 103 -8 -3 -19 -26 -100 -128 7 -118 -11 -105 -79 -147 -13 -127 -51 -47 31 -4 4 -61 73 -81 -21 10
6939A0O4r4Q5j04Q8J9j4j22JL3Q2j73M9J66j67J03K6k9r3L9M3k4N1o9K8%JLk3
$$ 10 74 -20 65 -39 49 68 54 -68 -67 -34 48 -125 -76 90 -77 26 52 23 -70 -31 12 -12 39 -30 -2 -2 -1 2 -21
6968b1l2K5J62k12K39j14j10j03K47j69J72r6p7L5jJ25j17R6q3J45j48j6J91q6
$$ -21 -53 -28 134 -78 161 47 -63 -166 81 -88 84 -12 -89 -54 -55 70 -47 49 -34 111 -37 -53 138 52
6992E2l2p6%J65j42L0n6K2K8m7M3K1l3J13p8Q5j03mJ64k48Q9J9J8R4j36j3q8L4
$$ 52 20 -56 -56 109 -33 -3 -59 -37 -9 -56 -13 8 -25 88 10 95 -8 -12 152 -96 -7 12 30 124 -12 -25 -113 -79
7020g9J74k13J01O4%m5q8M1R0j30N5QJ0k7J01r3Q3M1j13l8P6l9J9JJ7o3N8P3m1
$$ -79 95 -118 -17 47 47 2 -86 -45 45 -85 -30 -22 -12 -39 62 -31 52 93 -20 -58 18 -21 -2 -1 16 -47 11 84 43
7049D3p0J9n3p0J22n0N8M7Lj49R7J05j86Q1j20Q8k1r9J81j06P2Km7NK8O3n7Q7
$$ 43 -27 -8 -61 -131 -9 -59 -1 46 49 -100 -3 102 -84 -3 -123 -35 -56 -155 26 -80 -8 -6 -53 -48 -20 43 -14 73
7077G3j05N2k7j8M2o3R7n5m8J04n1p3L3l2J14l4m0l2K9k8R2j15J85j36m4M4P6
$$ 73 -32 20 -7 -25 17 -46 51 -4 -52 52 1 -72 -39 -71 43 9 -31 -63 -34 -62 30 -85 100 -36 -80 -36 40
7104D0j93J0J26J3j01j4K31q5p6O5J7m1k0K6M8j61M6R6K3q5p3J38K8j00R2oo7
$$ 40 -153 -143 -17 -4 -105 -119 112 27 -49 16 33 -8 -28 -2 46 -115 -69 27 50 -35 -108 30 58 -42 50 44 -23
7131b3j1oP0q3J03j10O3M2J3j19O9R5k00J59j65J58r3N9l0j1P7J4j06q1J49j16
$$ -23 -34 -40 30 -53 50 -60 3 45 58 -61 8 103 -97 62 -103 55 -38 21 -9 -20 57 71 -35 -116 33 -83
7157h3O7K2j03J41k8%j1Oj2n6Q8N1l0p0J10j90K29j76n0J01jj6Qr7N3J68n6J12
$$ -83 -16 6 -97 44 16 16 5 11 -1 -57 31 82 52 -18 92 -98 131 -45 -95 6 5 -11 -3 -100 -47 121 65 177
7185A77j69k8k2K5N1n3r2J01J85k47P2N2l7o8j0Q6j11P0M0PQ9m9l9Ok0n3rR7n6
$$ 177 8 -20 -42 -17 34 -19 -111 -10 175 -72 0 52 15 -53 -63 23 -88 -18 22 29 118 69 30 36 16 -37 -46 51 -5
7214ek4j8PJ32j43J64k07P9Q0j53L4rJ70k22J33l3l0L2oj38J6J31m5P2k3J1qQ2
$$ -5 -29 -47 -40 92 -51 113 -94 -15 65 -88 -54 -63 107 -115 18 -15 -45 -13 -19 -157 -141 -10 -55 17 -6 5 -3 79
7242G9M9j32r5k8M7R4o7J65j63l0J35p1l6l0O6J1nO5p0O2L3k22J08J26j8p3Q7
$$ 79 128 -4 -99 -127 -80 14 -53 112 -51 -81 54 -17 -53 -83 -17 -6 -11 54 -16 46 79 -143 -35 91 73 0 87
7269H7r1k9M7n8N2L0k5l2J0o3j9J30q8J40j04P8m9K0L4n5n0LOL2l6J18n1pk2r1
$$ 87 -4 -33 14 -44 8 38 13 -19 -9 -72 -91 39 -49 91 -13 65 16 36 70 15 -35 -32 -26 6 -30 88 37 30 8 -83
7299h3P7q3J08qN1m2jmO6o2o1J19q3k9J16n2o3O6k2Jn9m2J57j50lL5J3K1o9J30
$$ -83 -6 -89 19 11 62 20 19 15 81 19 -42 77 -6 -35 81 29 -34 32 10 11 -48 -90 67 -83 -86 -51 -38 -17 -86 44
7329D4P1j3p4j1j5j2mK8Qo3N1k3M2m2k2J6M3n1J0N4o1L2Km5J16j7j33Q5j36K04
$$ 44 115 102 28 17 2 -10 -14 14 22 -41 10 -13 29 -13 -35 -19 24 -27 -17 37 -24 8 10 -35 81 64 -69 16 -120 84
7359H4L4j10jn8q1J39j7n5L0R9q2m6k0O1j1M3R0l0K3j82J16K7n7j3j4J40j58R1
$$ 84 118 8 7 -51 -132 7 -10 -65 -35 64 -18 -64 -84 -23 -34 9 99 69 92 -90 26 53 -4 -17 -31 109 -49 42
7387D2O5r7J09k09J2J40j54P7Q8n6p2L5k0O2k8j02J43j25QR4o0N0M1q5rmj7J2
$$ 42 107 10 119 -90 -78 62 -92 -15 73 17 -55 -20 -40 22 -6 -108 35 -90 -82 12 -48 2 43 -42 -51 -55 -72 -60
7415f0J08P9o9j14K4L9P1j63%J21J6j42O5O9r4J49k8kj46J60o9JO3j16M5q1jJ03
$$ -60 48 127 58 -56 -32 7 78 -85 -85 36 52 -90 -25 44 -50 99 71 69 -77 83 14 15 78 -38 7 -74 -75 28
7443B8J7r9J3J21l1p2k8J28l9J7q2J39j52KK7J2pJ6qOq5J21N9j15j2N3K4k7j12
$$ 28 45 -54 -41 80 49 -23 -51 77 38 55 -27 112 -40 -38 -11 1 -6 10 2 8 -77 44 103 -12 -24 29 53 26 -86
7472h6J3Q0k5l3lO0o2O1rnM7j14K23k25N4M6p3N9p4K01l7j48N5n6J14P2k18K8
$$ -86 -73 7 -18 -51 -54 6 -56 5 -4 -9 38 -76 147 -78 -24 22 -51 8 -66 135 98 -50 5 -51 63 135 -83 -55
7500e5J19j00J6K4k1n8K8M8l0Q2l7Q3j9o5kKj4o0k2o9K43p5p7K8J04j0M6j01k1
$$ -55 64 -36 -20 4 -17 -75 -47 1 -29 53 16 99 80 15 13 15 1 -59 -81 -150 93 18 -59 -31 73 63 109 8 -13
7529a3N5p4Q5j67J67j27K9N5Q9j04j4L0k9J4q3L2O4k1l1K3oJ7J5pl6O1m7j2k0
$$ -13 42 -32 53 -114 53 -74 -45 10 99 -5 -19 11 -18 -4 -87 -55 9 -12 -43 -20 -26 -9 6 -1 -37 24 -23 -35 -55
7558e5JJ6L6j7P8j03%j6l6J29k9M6K0j58J49j8qNj11J42r6L3K7km6L8k3K0m7o5
$$ -55 -54 -38 -2 -19 59 -44 -44 -60 -96 33 4 50 70 -88 61 43 35 40 -71 71 -25 8 35 33 -13 25 2 22 -25 -90
7588i0M5Q4n7N1q4qOJ26n9p7P5J8k1j01J7R2L1j45J13J7r1J46j40N2j8k3R4j90
$$ -90 -45 39 -18 33 -51 -59 -53 73 14 -63 12 30 9 -92 -75 17 48 -97 16 33 -58 88 -52 0 -18 -41 53 -137
7616a37J41N9j21Q3mj1l4oJ09j26J45k39J64j00R2M0p5Q3P5p6Pj0J5j10O2j05
$$ -137 4 63 -58 25 21 10 -24 -30 79 -47 98 -141 23 -77 15 55 -20 63 138 62 69 59 74 -36 26 -79
7642g9P1M3j14J45m1j10J12j61J10O0r0J9nL6k0L3m0l9J89j62m0J64q4L2j29J66
$$ -79 -8 35 -79 66 25 -85 27 -134 -24 36 -54 -35 -40 -4 -24 9 -31 -70 119 -43 -83 81 -3 29 -100 66
7668F6p4p0o3P3R7q3l4O9Q9O1j74P0j28J18p4Q1R7p3ml9kp5L3qJ11j22m2N2P6
$$ 66 -8 -78 -141 -68 29 -54 -88 -19 70 131 -43 27 -101 17 -57 24 121 48 44 5 3 -72 -39 -47 64 -58 -100 -48 28
7697B8j2p9J63j39M3Jo9J84L6j47j2P5n2N4m6J3j41J20q1M6k5M1J6q1J39n2j55
$$ 28 16 -63 100 -39 4 5 -64 120 156 9 -3 72 20 74 28 41 -100 20 -61 -15 -40 1 17 -64 75 23 -132
7724a32Q3J3k3p5J51k9M5J4r2J01k18J17o6K1Q7p2N6L4p8P0p7j2P9M0N6pl6j16
$$ -132 -49 -36 -59 -134 17 -12 33 47 -45 56 -162 -45 -111 -90 -3 -75 -19 15 -63 7 -70 -82 -3 37 93 86 50 -66
7752f6M0J0L1M3j76R7O4k5j7j9j00M1N7lM4p6J29p0j9qN6j17R4j5l2j01J55L0
$$ -66 -26 -16 15 58 -118 -21 43 18 1 -18 -118 -77 -20 -23 21 -55 74 4 -15 -23 33 -84 10 -5 -37 -138 17 47
7780D7j30R1k6Q8k7ql8j8J68k39P5J07kj56M0r3K3O5O3n6J12n5J9p6n2m9Q7o0
$$ 47 -83 8 -18 70 43 35 -3 -21 147 -92 -17 90 88 -68 -28 -121 -98 -33 30 -26 86 31 50 -26 -78 -127 -40 -100
7808a00P2N8r2J36oj28k2N0k7K1K5Lr6J30j03K31j15J04j69p5O2P9n8qn4P9O4
$$ -100 -28 30 -62 74 68 -60 -82 -32 -59 -38 -13 -10 -106 24 -79 152 37 141 -28 -103 -41 38 -20 -28 -82 -3 61
7835F1m7M4p8OQ5q7rO2J1k1Qo9m5O2k9J01q9K5M3jm6J20q7j28M5J00n9j35J83
$$ 61 14 58 -20 -14 71 -16 -25 37 48 27 35 -34 -79 -17 -46 55 -34 -9 34 33 -13 107 20 -108 -63 37 -22 -157 26
7864B6Pr0J09k6Nj02J19p0lJ08j50L0O3o0J13l2j07j6J01j77R6J00o0MP0m6N5
$$ 26 33 -57 52 26 31 -71 48 -22 -25 83 -67 -37 26 -34 79 47 -60 -76 25 -152 -56 44 -16 -12 58 12 67
7891F7q5m1J0J22n9j6j6j1n3J79j46J7J6l1l6J93j64J71q1L6q2n4KJ1J67k02J54
$$ 67 -18 -59 -49 73 14 -2 -18 -29 -82 97 -49 -32 -16 -47 -83 110 -54 117 36 72 -10 -64 -62 -51 116 -86 68
7918F8j02L0L5j23J67p9l7Q8MLl7O2m2j3r9J68p0j6L2N5p5P8j84K4J31k5l2r5
$$ 68 -34 -4 31 -92 75 -4 -41 47 51 54 17 79 37 24 -75 93 23 7 39 94 19 97 -87 -63 68 43 11 -84
7946h4M4j22K80r7j01K9N2L2J5j20O8j16Q6p7Q3J00j54K4j6j29K74n7j16R7J43
$$ -84 -40 -162 118 21 -80 -51 1 33 48 -72 -4 -120 -34 -111 -28 72 -82 -58 -74 -203 71 14 -102 -5 138
7971A38j65j3J33k30Q9Om0J02l0l6Q2jM5j86R8JJ14q7o8J28n6K0O5j20J00r8l9
$$ 138 -27 -40 93 -137 -48 -42 -82 20 -10 -46 36 35 80 -106 -8 -7 107 20 -48 80 24 44 109 -11 89 -9 -48
7998d8R7o9l3Q9O3p9L1r3P8j69J00oj0J45j36O7J0m7M5q7MO9j03N7j7N6J5o3R1
$$ -48 49 -20 -53 36 99 20 51 -42 36 -133 -33 -39 -49 96 -40 27 37 -10 35 -52 -48 21 -82 -25 -42 14 29 -34 57
8027E7L3j14J6oO6j4j33L8k9R1M7l1o8JJ60j88J70l8q2J17m2q6J6M1j9M0J3j18
$$ 57 90 -24 -8 -14 52 38 -95 -57 -86 5 52 21 -47 -46 114 -74 96 58 -24 93 51 -35 -19 22 3 43 56 -62
8055f2k0N3J3M5nL9n7k2l3J5K1j6J16j49J41n0r2Q1O2l9j44J38p6k5QQ1n5k7m1
$$ -62 -82 -29 -16 29 24 63 6 -16 -49 -34 -13 -29 87 -62 79 29 -63 18 80 41 -103 35 -41 -66 -58 23 -32 -59 -100
8084a00M8ON6r5J31N1q9ql1Q9j38N1K8qkMp8M1R1m8k2M6j19K0J21o1J08j68Q3
$$ -100 -52 -46 10 -85 46 97 8 0 -31 58 -80 -29 -1 -9 -11 -7 -85 -44 47 -1 -23 23 -96 -76 45 -16 92 -76 7
8113Gj01J34o9l3J5J63o6K6o7OQ7k30J07pL9N6j08K5pL2l9O9L1m6k31K38L7j15
$$ 7 -94 40 -29 -62 -47 116 50 76 9 15 102 -128 -21 -28 11 67 -41 -16 -23 9 -30 39 70 24 -207 31 68 -47
8141d7P4N5p5Nj9M0Ml8p0N1j14R8L0j25J57r4R9o9P0mo6O9M7m4m9j9K3Q8q8J9
$$ -47 27 82 7 12 -7 33 37 -1 -71 -20 -134 -36 -6 -131 26 -68 31 -38 32 28 -38 31 78 34 -15 -34 -11 77 -11 8
8171Hj9j7J64k63J42J25k21j8J12O7j55R4p2K9l6P8M9j9m5n2
$$ 8 -11 -28 136 -127 15 140 -81 -99 13 80 -75 19 -53 -24 -60 18 67 48 3 -49
8191d9
$$ Imaginary data points
##PAGE= N=2
##DATA TABLE= (X++(I..I)), XYDATA
0@%%%%%%%%%%%%%%%%%%%Qj6J6j6J6j6K0k8L2l2M0m8N0n8O6p4Q7r6J05j20J36j52
$$ 0 0 0 0 0 0 0 0 0 0 0 0 0 0 0 0 0 0 0 0 8 -8 8 -8 8 -8 12 -16 16 -16 24 -24 26 -32 34 -40 47 -49 56 -64 72 -80
41h0J68j85K05k27K51k77L05l36L70m09M50m94N47o05O68p41Q24r20J033j167
$$ -80 88 -97 108 -119 132 -145 160 -176 194 -215 235 -259 288 -317 351 -390 434 -486 547 -620
61f20J330j535J799k149K647l418M776p868K9464k97l6147K0113n830j8119Q467
$$ -620 710 -825 974 -1175 1472 -1946 2830 -5038 24426 24129 -12018 8095 2265 -15854 -7387
76g387J5546j4646n050P812m222q102J6118N580j0202P230Q940j2884K709J1968
$$ -7387 8159 -6487 -11537 -3725 -7947 -16049 69 5649 -4553 2677 11617 -1267 1442 13410
90A3410p179p398M308q38j980J339P63l871m007J7j259k193M354K910l21J585
$$ 13410 6231 -1167 3141 2303 323 1662 2425 -1446 -5453 -5436 -6695 -8888 -4534 -1624 -1945 -360
106c60p98K677N964l138N4M791o258l832O189k521p060J05O33k792j26N671J711
$$ -360 -1158 1519 7483 4345 4399 9190 2932 -900 5289 2768 -4292 -4187 -3554 -6346 -6472 -801 910
123I10l640K839R76n510M679O227m854R6L111n256j236M691P30l062j718J242
$$ 910 -2730 109 1085 -4425 254 6481 1627 1723 4834 -422 -1658 3033 3763 701 -1017 225
139B25j957l324L686J758m412J217J795j996K985L787J49q49j741M04p2j788K469
$$ 225 -1732 -5056 -1370 388 -4024 -2807 -1012 -3008 -23 3764 3913 3064 1323 1727 1655 -133 2336
156B336k62n576K72J544k044K217K968j188j377K94J707o3K1L009k250m454K935
$$ 2336 2074 -3502 -3230 -1686 -3730 -1513 1455 267 -1110 -816 891 828 849 3858 1608 -2846 89
173H9P83k585L435Q21m277l95J113k07O33J261M24k395j110L138K9j2L323j884
$$ 89 872 -1713 1722 2543 -1734 -2129 -1016 -1223 -590 671 1095 -1300 -2410 728 757 745 4068 2184
191B184k834J434r09n98J711j489j550n44o82J635J114Q44J284j216j26J539l32
$$ 2184 -650 784 -125 -723 988 -501 -2051 -2595 -3277 -1642 -528 316 1600 384 258 1797 1465
208A465J243M80k930l49m6j870J817O87k120J27l87o67J616R03O02m64j230J385
$$ 1465 2708 3188 258 -91 -137 -2007 -190 497 -1623 -1496 -1883 -2550 -934 -31 571 107 -1123 262
226B62K15M62K802p27k442J107j113j083J807p32j887q68j334L72Q11Q97J913
$$ 262 477 939 3741 3014 572 1679 566 -517 1290 558 -1329 -2197 -3531 -3159 -2348 -1451 462
243D62r93m85K126l30R44K484j487j217l6j607J71P82q61l06j377j125R43l00
$$ 462 -531 -1016 1110 780 1724 4208 2721 1504 1468 -139 32 814 -47 -353 -1730 -2855 -1912 -2212
261b212J031J183j434J50Q34j70K165J077o89M76r23o56J181l96n45n77k326p27
$$ -2212 -1181 2 -1432 -1282 -448 -618 1547 2624 1935 2411 1488 832 2013 1617 1072 495 -1831 -2558
279b558M11n04J294K50q62R08p7O38K353M7j1K80j413k4Q33n03M19r21j732L18
$$ -2558 -2147 -2651 -1357 -1107 -1969 -1061 -1138 -500 1853 1900 1889 2169 756 732 1565 1062 1481 560 -1172 -854
299h54n61j05J119p88m67J95o94J319J370n9J005k98p60J346n5p4O49j569j080
$$ -854 -1415 -1520 -401 -1189 -1656 -1461 -2155 -836 534 475 1480 1182 422 1768 1713 1639 2288 719 -361
318c61k02p35N07M68r22J95o44j92J699L02J74J000j179k94J104q2N77O2r33j05
$$ -361 -563 -1298 -791 -323 -1245 -1050 -1694 -1886 -187 115 289 1289 110 -184 920 838 1415 1477 544 439
338D39p24m59J293m70o94J51j169K06J021p4P77J98r86M13L01K40J218o96p47
$$ 439 -285 -744 549 79 -615 -464 -1633 -1427 -406 -480 297 495 -491 -78 223 463 1681 985 238
357B38K63j206J53J155o82J38l36r74O99K39M45O91q83n16N46m13M99J070q71
$$ 238 501 -705 -552 603 -79 59 -277 -1251 -552 -313 132 823 -60 -576 -30 -443 56 1126 255
376B55l20j24l72P41K14j57L14j165j26O58l11O99O26j136R9J42m71Q95J37m10
$$ 255 -65 -189 -561 180 394 237 551 -614 -740 -82 -393 306 932 -204 -105 37 -434 461 598 188
396A88k14q81K01N99k92O75N5j131O27L19j11R06k3n63po89L01N88n12Q9l77r39
$$ 188 -26 -907 -706 -107 -399 276 331 -800 -173 146 35 941 918 355 348 -341 -40 548 36 125 -252 -1191
418a191O39N6r0Q85m73o29N70j99O88Q27n47J00j30n00N91L33n07N4j043l79L92
$$ -1191 -552 -496 -586 299 -174 -803 -233 -432 256 1083 536 636 506 6 597 930 423 477 -566 -945 -553
439e53m87N25L78j008L25L09k08J255L99l40K67k67k22M33r2J33l13j123K11j39
$$ -553 -1040 -515 -137 -1145 -820 -511 -719 536 935 595 862 595 373 806 714 847 534 -589 -378 -517
459e17m49Q72k71p49M30l84J61J027J53MJ55j99M46K91L2N29q89o26P5o51L7M61
$$ -517 -966 -94 -365 -1114 -684 -1068 -907 120 273 277 432 233 679 970 1002 1531 642 16 91 -560 -523 -62
481f2p22j96J7m90P09O36k0O23l87k08P65j27M11L62q15q4j15n17L35P4o46k3
$$ -62 -784 -980 -963 -1453 -744 -108 -128 495 108 -100 665 538 949 1311 496 412 297 -220 115 189 -457 -480
503d80m65n38Q24pK75L26m79L48L11L39P10Q4n77J59o32m6N29o09k85rq62J33
$$ -480 -945 -1483 -659 -666 -391 -65 -544 -196 115 454 1164 1248 671 830 198 152 681 72 -213 -222 -1084 -951
525i51N66k48M21J3k32J64J59L33N32l97K38o2o70O92K24o04K44k55q69L99R0
$$ -951 -385 -633 -212 -199 -431 -267 -108 225 757 360 598 536 -134 558 782 178 422 167 -702 -303 -213
546b13k13K14l06p1Q2J41O52R8k10M46n59j90P19r4j89J59o16k67L51k06L91J3
$$ -213 -426 -212 -518 -589 -507 -366 286 384 174 620 61 -129 590 496 307 466 -150 -417 -66 -272 119 132
568A32l07r5k01R1N38j57J13j1m66L43M27m39O65j58p17L47J14m34N59k06l50
$$ 132 -175 -270 -471 -380 158 1 114 103 -363 -20 407 -32 633 475 -242 105 219 -215 344 138 -212
589b12Q2k38L39R4n5K97k74o38O88j51j79P43o65l58M29j59L38N45l20j18p4j49
$$ -212 -130 -368 -29 65 10 307 33 -605 83 -68 -247 496 -169 -527 -98 -257 81 626 306 188 114 -35
611c5L65j58M7K09q07M4K88m30L44K06m54R3O5j09N55J61j78l0j40R9K37j26K64
$$ -35 330 172 219 428 -379 -335 -47 -477 -133 73 -381 -288 -223 -332 223 384 206 176 36 135 372 246 510
634E10j79m58J78k11l5M00m60l62M30m85J24N68j11J95K31j78Q7L18n6L33n44
$$ 510 331 -127 51 -160 -195 205 -255 -617 -187 -672 -548 20 -91 104 335 157 244 562 506 839 295
655B95k7M9o26L03K42p03L5J58m51L14K44o4K62k57Q9K85l7N63J90o73J66pm63
$$ 295 268 317 -309 -6 236 -467 -432 -274 -725 -411 -167 -231 31 -226 -137 148 111 674 864 191 357 350 -113
678a13N17o4n66J02m65j65L29r5K44P6l67M66J93KN78k49l5J56k58n2L68m45n
$$ -113 404 340 -226 -124 -589 -754 -425 -520 -276 -200 -567 -101 92 94 672 423 388 544 286 234 602 157 152
701A52j11m62J21l0N4N9j91j64L38j05K65L64l02L66l8k60M80Q3l53K39m10k64
$$ 152 41 -421 -300 -330 -276 -217 -408 -572 -234 -339 -74 290 -12 354 316 56 536 619 266 505 95 -169
723a69K8j24J06K9l55k7J33k57P15M5j59L43j53j29L97q9R1j01k61J04j50j15
$$ -169 -141 -265 -159 -130 -485 -512 -379 -636 79 124 -35 308 155 26 423 334 425 324 63 167 17 -98
745i8L36m18j99K57k57j01L50m3k0J28l32L79R1R4L92k47j92Q5k35K6L57l26k08
$$ -98 238 -180 -379 -122 -379 -480 -130 -173 -193 -65 -397 -18 73 167 559 312 120 205 -30 -4 353 27 -181
768a81P1m20L29J17k0J57k37o1K86k57K48L91l20j50R4K6J29J4j27J04k30j09
$$ -181 -110 -530 -201 -84 -104 53 -184 -245 41 -216 32 423 103 -47 47 73 202 216 89 193 -37 -146
790a46K14j32j4J56l53k0K20k20L78Q5k96K62k01j00M43j48n2K4j64N9K32j44
$$ -146 68 -64 -78 78 -275 -295 -75 -295 83 168 -128 134 -67 -167 276 128 76 100 -64 -5 227 83
812H3J01m9l27K43k61q4M81l97k8J42k19M6K72j6J44o3j19L81k11Q7K77m40KN2
$$ 83 184 135 -192 51 -210 -294 187 -210 -238 -96 -315 -269 3 -13 131 68 -51 330 119 206 483 43 45 97
836I7l90L10J49k60M9k32j15L46o7p3J30j75J21K94j53R2K73k17J7M9j08J18j06
$$ 97 -293 17 166 -94 -45 -277 -392 -46 -113 -186 -56 -231 -110 184 31 123 396 179 196 245 137 255 149
859A49j74M5l97J7K46m27L80k4k03L47j4mK66l1o2K72l96J36K20k53J19j88j87
$$ 149 -25 20 -377 -360 -114 -541 -161 -185 -388 -41 -55 -59 207 176 114 386 -10 126 346 93 212 24 -163
882a63M1m9RO1k20mJ08j37L31J30j20J56K01l06L78j19J9m4j22j92L6j95P5J47
$$ -163 -122 -171 -162 -101 -321 -325 -217 -354 -23 107 -13 143 344 38 416 297 316 272 150 -42 -6 -201 -126 21
906B1k48j01J08j21J32K04j77L24k47J13K43p3K09K3k20j71K63l42K25k70m1O1
$$ 21 -227 -328 -220 -341 -209 -5 -182 142 -105 8 251 178 387 410 190 19 282 -60 165 -105 -146 -85
928h5l09J83J21j93J19J57k60K57O1J73J24k07PJ45l3j73J81k81O0j55j11R1m5
$$ -85 -394 -211 -90 -283 -164 -7 -267 -10 51 224 348 141 148 293 260 87 268 -13 47 -108 -219 -128 -173
951a73k0J67k48K8O0RJ98J32jk0J4j9Q7l9om2j36j19K98k39k6R6k25P7R6p0J24
$$ -173 -193 -26 -274 -246 -186 -177 21 153 152 132 146 127 214 175 169 127 -9 -128 170 -69 -95 1 -224 -147 -51 -121 3
978CJ18k07J88j15n5K92j82R7J26l47J89%k7M3j25p3J3j9q3K38j86M6L0q7J63
$$ 3 121 -86 102 -13 -68 224 42 139 265 -82 107 107 80 123 -2 -75 -62 -81 -164 74 -112 -66 -36 -123 40
1003D0n9L0K02j36j40J24j23J24K88l64M5k8j48J57N8j58J60j84j78K14j11Q0
$$ 40 -19 11 213 77 -63 61 -62 62 350 -14 31 3 -145 12 70 -88 72 -112 -290 -76 -187 -107
1025a07R9P6j02O9o8J92L0j75J20j18o9K76k34o4N2j83J24K31l75K33o1p9N0p2
$$ -107 -8 68 -34 35 -33 159 189 14 134 16 -53 223 -11 -75 -23 -206 -82 149 -226 7 -54 -133 -83 -155
1049a55R0K22N2k46K90k38J76k0j46K00j84j96K25j81rP0k33J13O1q9J95l9l2
$$ -155 -65 157 209 -37 253 15 191 171 25 225 41 -155 70 -111 -120 -50 -283 -170 -109 -198 -3 -42 -74
1072g4K08k5p1K40m1Mkj38L2q4j68K25j64j11nL0p3K30k18P0J08j25J20J76K4
$$ -74 134 109 38 278 237 241 239 101 133 49 -119 106 -58 -169 -174 -144 -217 13 -205 -135 -27 -152 -32 144 168
1097A68J8J11k74K05j29r1O3k03j7J20j40rJ08o4J79j21o9P5J11RK35o5kk8j77
$$ 168 186 297 23 228 99 8 71 -132 -149 -29 -169 -178 -70 -134 45 -76 -145 -70 41 50 285 220 218 190 13
1122A3O1J45j22R7j89r3l9q6J0K66k43k9J74m1N1J63k1j4J1k68L00J5J6j18k8
$$ 13 74 219 97 194 5 -88 -127 -213 -203 63 -180 -209 -35 -76 -25 138 117 103 114 -154 146 161 177 59 31
1147C1K9j37m2k3J06j34JP8o4J92Qp2J36j96J04K21j06j5P7k55J20lj12Q2k8q1
$$ 31 60 -77 -119 -142 -36 -170 -169 -91 -155 37 45 -27 109 -87 17 238 132 117 194 -61 59 56 -56 26 -2 -83
1173h3J95l49Q1J67o0l0J8r4J98Q3j35N9O9k14K00j14O0J24o3j17O9j44JMQ1K6
$$ -83 112 -237 -156 11 -49 -79 -61 -155 43 126 -9 50 119 -95 105 -9 51 175 112 -5 64 -80 -79 -75 6 32
1199C2p5j39J87Q3q7J4o3J90r6j62K10Kr6J52k19M5J4J6J6k0Lj29R5q7J03k3j55
$$ 32 -43 -182 5 88 1 15 -48 142 46 -116 94 96 0 152 -67 -22 -8 8 24 4 7 -122 -27 -114 -11 -34 -189
1226a89J82j8j5R6M3L9j14k9Q8N3n5M8o5p5P8l6j89J91j25Q3p6r8J27J6K9J39
$$ -189 -7 -25 -40 56 99 138 24 -5 83 136 81 129 64 -11 67 31 -158 33 -92 -9 -85 -183 -56 -40 -11 128
1252A28j45l8P1L4J03k6j67P6J0j33J06Nj75P6r4O4N3r2R4Q7j31R4M7n5J48n1
$$ 128 -17 -55 16 50 153 127 -40 36 46 -87 19 24 -151 -75 -169 -105 -52 -144 -50 37 -94 0 47 -8 140 89
1278H9QR5r9j61K64k27o0Q2j37%L5M6K5q7J4M9M7k3J15j09J44Jl6n6Q8p7k5p7
$$ 89 97 192 93 -68 196 -31 -91 -9 -146 -146 -111 -65 -40 -127 -113 -64 -17 -40 75 -34 110 111 75 19 107 30 5 -72
1306g2k7J24j56NJ50j50k5R5%R6O3j75J51k3P6NO9j58J06j22k28K57j16l5j71
$$ -72 -99 25 -131 -126 24 -126 -151 -56 -56 40 103 -72 79 56 132 137 206 48 154 32 -196 61 -55 -90 -261
1331b61K96j67P6k7Q7j40J37O1j77J91J33j73JJ89k31K1k1j00J71k08PK03k16
$$ -261 35 -132 -56 -83 4 -136 1 62 -115 76 209 36 37 226 -5 16 -5 -105 66 -142 -135 68 -148
1354a48L7J10n4J8K5K9jm9o5K38j81J85j1j57K6L7k2N6j80J4J23j14j6J75j67
$$ -148 -111 -1 -55 -37 -12 17 16 -33 -98 140 -41 144 133 -24 2 39 17 73 -107 -93 30 -84 -100 75 -92
1379i2N1J65j95L9R6j74J75j0l7J06j46P3N4j24m3J56j07M0K7r1J5K4M2o7k8K9
$$ -92 -41 124 -71 -32 64 -110 65 55 18 124 -22 51 105 -19 -62 94 -13 27 54 -37 -22 2 44 -23 -51 -22
1405b2J9j38MK34n2k0J14j77J27r5%K42k24j1P6n7o5n4J6M3j03R2N5P1j05P5j29
$$ -22 -3 -141 -137 97 45 25 139 -38 89 -6 -6 236 12 1 77 20 -45 -99 -83 -40 -143 -51 4 75 -30 45 -84
1432h4K3J35n9N2L7P1j03k6k9P7p4J0n3j34P3J13q9j9M1K0M4L5m1R4m3k2P6o5
$$ -84 -61 74 15 67 104 175 72 46 17 94 20 30 -23 -157 -84 29 -60 -79 -38 -18 26 61 20 114 71 49 125 60
1460F0n6J03j94P4J0Kj33L5N7l7n6L4P5j5o7K8O1P2O5K8j6m5m1Q1j85K0K1m9o6
$$ 60 4 107 -87 -13 -3 -1 -134 -99 -42 -79 -135 -101 -26 -41 -108 -80 -19 53 118 146 130 85 44 125 -60 -40 -19 -68 -134
1489a34R8p1%N4m9K01j15P4Nj35N1J70r4M9J3j00m2J5j21J27p4n2m1K2O9Q1mN0
$$ -134 -36 -107 -107 -53 -102 99 -16 58 63 -72 -21 149 55 104 117 17 -25 -10 -131 -4 -78 -130 -171 -149 -80 1 -3 47
1517D7j09J38j7Rk0Q6r4q1J16p1R7j33M3j40J55k15J73o2P1Lk5j7oR5p4J34j08
$$ 47 -62 76 59 68 48 134 40 -41 75 4 101 -32 11 -129 26 -189 -16 -78 -7 -4 -29 -46 -52 43 -31 103 -5
1544eJ4N4O0m2r5L3m4J24j49pl8R8n3N4J3nj43R4N9J4Mm3N3L2o6o5M2n3J33r2
$$ -5 9 63 123 81 -14 19 -25 99 -50 -57 -95 3 -50 4 17 12 -131 -37 22 36 40 -3 50 82 16 -49 -7 -60 73 -19
1574a9l5kM9q0O5p7R2m6k6N7R1q8J28L2p7J17r2k16J80j55J59L3j57J57m2k65
$$ -19 -54 -56 -7 -87 -22 -99 -7 -53 -79 -22 69 -19 109 141 64 181 89 -127 53 -102 57 90 -67 90 48 -217
1600b17R3P8J3jj7J4J12j62J85p1o8J1J09j02J06o2Lrll4pl9j1N4J28k57J33q
$$ -217 -124 -46 -33 -34 -51 -37 75 -87 98 27 -41 -30 79 -23 83 21 24 15 12 -22 -29 -68 -79 -25 103 -154 -21 -29
1628b9l8J73j21R4J27k56L9J21j37Q3r0Q0r0k1j4M4j18K9J54j47J03j7p4J94j22
$$ -29 -67 106 -15 79 206 -50 -11 110 -27 56 -34 46 -44 -65 -79 -35 -153 -124 30 -117 -14 -31 -105 89 -33
1653c3Q3m8j1J00mr6J17r5Q4j55Q6q1l6J27o7P2k20M0K37j82J29j6K7J31j23j62
$$ -33 50 2 -9 91 87 -9 108 13 97 -58 28 -53 -89 38 -29 43 -177 -137 100 -82 47 31 58 189 66 -96
1679i6J47L8p3j7J1j2k3K1K4l4Rr0K2PQ2o3O2qkJ03Mj95K09L3j14L1o8O0j97J1
$$ -96 51 89 16 -1 10 -2 -25 -4 20 -14 -5 -95 -73 -66 16 -47 15 7 5 108 112 -83 126 159 45 76 8 68 -129 -118
1709a18J24n0j30J06J7q1K11j28K5K3L2J3j50J94j49Q6p2J12l4p4Qj2N2q4M0j3
$$ -118 6 -44 -174 -68 -51 -132 79 -49 -24 -1 31 44 -106 88 -61 25 -47 65 31 -43 -35 -47 5 -79 -39 -52
1735e2k1P8r5J03q0N9J39j74Q1L1q8L8Q8n2j01P5l2k8L0P5q7rK6J07k04J56j14
$$ -52 -73 5 -90 13 -67 -8 131 -43 38 69 -19 19 107 55 -46 29 -3 -31 -1 74 -13 -22 4 111 -93 63 -51
1762e1rJ88k47l1K28ln7j31J68M3j22j85K18N6j71J49q1J7jm8P7J6m1J63q4L7
$$ -51 -60 128 -119 -150 78 75 18 -113 55 98 -24 -209 9 65 -106 43 -38 -21 -22 -70 7 23 -18 145 61 98
1788I8j15L8l2P9l0K5k0k4MR9j6o6n1N1j30R3K0p1q8J96n1j09J32m9O9m2Qj19
$$ 98 -17 21 -11 68 38 63 43 19 23 122 106 40 -11 40 -90 3 23 -48 -136 60 9 -100 32 -17 52 10 18 -101
1816a01J46j18N0J5QJ7j32Q0o0Ml9K02j55l1J77p1P0k5j1O0Pk22K15P8r8o1l2
$$ -101 45 -73 -23 -8 0 17 -115 -35 -95 -91 -130 72 -83 -114 63 -8 62 37 26 86 93 -129 86 164 66 5 -27
1843b7O7L2o9m1Nj89K23o5J0J12q7M7L5r7R4j4k5l9J68k28J64k0j04R3l2j41O
$$ -27 40 72 3 -38 -33 -222 1 -64 -54 58 -29 18 53 -44 50 36 11 -28 140 -88 76 56 -48 45 13 -128 -122
1870a22P4N3K0J8k1K4k6K5n9Q1q1O1J11j74m0Q3jO8k33R3jK9l4P3m7n5Q8K9Q2
$$ -122 -48 5 25 43 22 46 20 45 -14 67 -14 47 158 -16 -56 27 26 94 -139 -46 -47 -18 -52 21 -26 -81 7 36 118
1899A18j76J19K9Rk5k3N7j04L8J2j13J50j46k3J37j68J67l8j0k7L0N0l3K9K2O
$$ 118 -58 61 90 99 74 51 108 4 42 54 -59 91 -55 -78 59 -109 58 20 10 -17 13 63 30 59 81 87
1925H7j0j11K0M3m9l0R2r0k8J41j96M5oj4M3J03j11J80j81J55r0r4N8jQ5ok9p5
$$ 87 77 -34 -14 29 -20 -50 42 -48 -76 65 -131 -86 -92 -106 -63 40 -71 109 -72 83 -7 -101 -43 -44 41 35 6 -69
1953f9J55q9ql7J1P2j49J21j2r0R5R4j6n9M4K4M6q1J3nq7j5R4l9J5k1l7m4J1K9
$$ -69 86 -3 -11 -48 -37 35 -114 7 -5 -95 0 94 78 19 63 87 133 52 65 60 -27 -42 52 13 28 7 -30 -74 -63 -34
1983c4J9P8k14J59K9q1O5N3k4j26K7J09N0n2j91J83N2j29m3j7J51j43J02j9K6
$$ -34 -15 63 -151 8 37 -44 21 74 50 -76 -49 60 110 58 -133 50 102 -27 -70 -87 64 -79 23 4 30
2008C0Jj1q1J05Lm9M0O6j35nJ16j28Q4o8k6L5r8J04l5R1p7Q6m9J3P0q4m2o7J24
$$ 30 31 20 -61 44 47 -2 38 104 -31 -36 80 -48 36 -32 -58 -23 -121 -17 -52 39 -38 48 -1 12 82 -2 -44 -111 13
2037A3Q2j60J20n2K2k4p2J54r7m0K7L0K1rL7j14O2M6j7j05O1P0oj57J74n4j0n
$$ 13 95 -65 55 3 25 1 -71 83 -14 -54 -27 3 24 15 52 -62 0 46 29 -76 -15 55 49 -108 66 12 2 -3
2065cm7L7Rk2j12J84r4K0N9o4j9KJ13n3N1j41J60m5n4O8K9j6q4J0Nm5p3J32J7
$$ -3 -50 -13 -4 -26 -138 46 -48 -28 31 -33 -52 -50 63 10 61 -80 80 35 -19 49 78 62 -22 -12 -7 -52 -125 7 24
2094B4k6j3M8pj01O5p0J82k16J51k7J2j4L3M1p7j7j04P8L9k1qJ3K5Mj01N2L8L5
$$ 24 -2 -15 33 26 -75 -10 -80 102 -114 37 10 22 8 41 82 5 -12 -116 -38 1 -20 -28 -15 10 14 -87 -35 3 38
2123C8qp1O2J3J09k19J4K17j26Q5j20On0Q8j6k1l9J7RLlN7r0r9Q9J54j08O4J0
$$ 38 30 -41 21 34 143 -76 -62 155 29 114 -6 0 -50 38 22 1 -38 -21 -12 -9 -12 45 -45 -144 -55 99 -9 55 65
2152F5p8n0N1J0JK5l1M7j34R6m1qR5j87J71l8M7NLp7R0l5n6J9M8o3Pl9MJ47n5
$$ 65 -13 -63 -12 -2 -1 24 -7 40 -94 2 -39 -47 48 -139 32 -6 41 46 49 -28 62 27 -29 -10 38 -25 -18 -57 -53 94 39
2183C9n7j3Rj8m5J28m6l2M9Qo4k1j5jJ09j1M6Q6j94j4RJ5%P5n9J1pQ3o3L7p4N3
$$ 39 -18 -31 -22 -40 -85 43 -3 -35 14 22 -42 -63 -78 -79 30 19 65 151 -43 -57 -48 -33 -33 42 -17 -6 -13 70 7 44 -30 23
2215B3q0L5L5K5N6o0O1q4n0LL9l1L5j3J45j06Lm6k0J5p0L0J26o3M1J2j08M7P8
$$ 23 -57 -22 13 38 94 34 95 11 -39 -36 3 -28 7 -6 139 33 36 -10 -30 -15 -85 -55 71 8 49 61 -47 0 78
2244G8o8kOp3N6P1k7m1o9m6J55k0K1q6Q7J8N7q8j7L8j04J19n5Plpr9OJ60k14J17
$$ 78 10 8 14 -59 -3 68 41 0 -69 -115 40 20 41 -45 42 60 117 29 12 50 -54 65 10 17 14 7 -92 -86 74 -140 -23
2275b3Mn6M0Q9m5K8j37O8Q4r7J67o7m1k6P6j50J06j55J09m0n8Q9J48j59L4M5m7
$$ -23 -19 -75 -35 54 9 37 -100 -32 52 -45 122 55 14 -12 64 -86 20 -135 -26 -66 -124 -35 113 -46 -12 33 -14
2302a4R8j1Jnq2R2j36lM1m8J10p4K8r8P8K9j62J60n5J20o4L0m0k1K7J3M2M9J2
$$ -14 84 73 74 69 -13 79 -57 -60 -19 -67 43 -31 -3 -101 -23 6 -156 4 -51 69 5 35 -5 -26 1 14 56 105 117
2331A17j66J3Pm9K0L9N7M1j18o2J51k3K9l2qM7rr4N7r6J15l6q7P1K8o6mj38J50
$$ 117 -49 -36 -29 -78 -58 -19 38 79 -39 -101 50 27 56 24 16 63 54 -40 17 -79 36 0 -87 -16 12 -54 -58 -196 -46
2360d6L2n9J08q5m2L1J15L9n1j28Q6or0P7n5M2j7J10j03n3J62J1k2j31Q3N1j28
$$ -46 -14 -73 35 -50 -92 -61 54 93 42 -86 0 -6 -96 -19 -74 -32 -49 61 -42 -95 67 78 56 -75 8 59 -69
2387f9Q6R7j53N4K5n1j6RJ9q1M0P3j4j95K01p3m1L1K1o6L9N0R4j41n3J03J13q1
$$ -69 17 114 -39 15 40 -11 -27 -18 1 -80 -40 33 19 -176 25 -48 -89 -58 -37 -103 -64 -14 80 -61 -114 -11 102 21
2415B1j15L5J11J6l3Lr7O2K8j6j04oJ67rj11K2L4N4l8M4R2n3q7l8j7oJ6K8l6J72
$$ 21 -94 -59 52 68 35 38 -59 3 31 15 -89 -95 72 63 -48 -26 8 62 24 68 160 107 20 -18 -35 -41 -25 3 -33 139
2445A39p8q6Q0j02qj2P4oL2j06J41n0J06K3j41O2K7j32O3r2J02r8J09j25J23K5
$$ 139 61 -25 55 -47 -55 -67 7 1 33 -73 68 18 124 147 6 68 95 -37 26 -66 36 -62 47 -78 45 70
2471G0j08m4J44m2j9Mj03K53k19qJ18k7p8O9j65J62o5L5nQ8o2p8L0k2%k0J07N2
$$ 70 -38 -82 62 20 1 5 -98 155 -64 -72 46 19 -59 10 -155 7 -58 -23 -28 60 -2 -80 -50 -72 -72 -92 15 67
2499F7r6k0R4On9N5Ok8lk3M3o8P7M9j07M4l7o6J22m7MN0L0j74J08k4o5J01j07
$$ 67 -29 -49 45 51 -8 47 53 25 22 -1 42 -26 51 100 -7 37 0 -66 56 9 13 63 93 -81 27 3 -62 39 -68
2528f8P1P8n0j21M5M8J20j16q4N4Q3j57N3K19j90J7Rj94J44M5l3P7Oj21J07m4
$$ -68 3 81 31 -90 -45 3 123 7 -77 -23 60 -97 -44 175 -15 2 11 -183 -39 6 -27 50 56 -65 42 -2
2554bk5J2P4q5R5j3l3j8J6J9q5MJ2J4l5J02o3N5m0O5j66K2J96j42J0N3p4K04j32
$$ -2 -27 -15 59 -26 69 56 23 5 21 40 -45 -41 -29 -15 -50 52 -11 44 4 69 -97 -75 121 -21 -11 42 -32 172 40
2583D0j79J07OK0J0l7M2J9j5K7P0k6qP7j01q2K7n1O0k1JL6jn0k8N4M2K2jm5l4
$$ 40 -139 -32 -26 -6 4 -33 9 28 13 40 110 84 76 153 52 -30 -3 -54 6 -15 -14 22 21 -29 -57 -3 39 61 60 15 -19
2614a9K5n9pR8j13J13Mp3M3m4L0j9K7L4l0l6n4Q0m7R7r2Q7P5q5N2l7oo6M3m6Q2
$$ -19 6 -53 -60 38 -75 38 42 -31 12 -32 -2 -21 6 40 10 -26 -80 0 -47 50 -42 45 120 35 87 50 44 -22 21 -25 57
2645E7n5%Q9j62J62q9L0j65J26M6k8N8o8J9j07Q2o4N8k6J33j17J9m4N9j07J29
$$ 57 2 2 91 -71 91 2 32 -133 -7 39 11 69 1 20 -87 -5 -69 -11 -37 96 -21 -2 -46 13 -94 35
2671C5q6Q5l3L0mk7J3n0L3Olp6P2J6L2n2N0l8J32k32P6J20n2o5j23J86q7M9j2
$$ 35 -51 34 1 31 27 0 13 -37 -4 2 -1 -77 -5 11 43 -9 41 3 135 -97 -21 99 47 -18 -141 45 -42 7 -5
2700eL1R2q3o9P9J6j37M2mnM2J2kk1L9j18J20Q2j48qJ0N2r5Q9Q7j31Q9p8N0P7
$$ -5 26 118 35 -34 45 61 -76 -34 -38 -43 -1 11 9 -12 27 -91 29 111 -37 -45 -35 17 -78 11 98 -33 56 -22 28 105
2730A05q7Mj7Ok5l9O2O0n1L3p5j3L8l0K1O0j50Q2m2J3M3lo0J26j5m4R7j36R2p7
$$ 105 18 22 5 11 -14 -53 9 69 18 51 -24 -37 1 -29 -8 52 -98 -16 -58 -45 -2 -5 -65 61 46 2 99 -37 55 -22
2760b2J4j77K08N5m0j2o6k8J01L3r2m4J18Lj11J72j41R4q7K7r2M2J01o5lp7J42
$$ -22 -8 -185 23 78 38 26 -40 -68 33 66 -26 -70 48 51 -60 112 -29 65 -22 5 -87 -45 56 -9 -12 -89 53
2787E3l7L8rm2o1Nj3o4Q9M4j20R9j6oN2M4r9m6M9L7j25R6Q7K0q5R2q6l4Q9K2n0
$$ 53 16 54 45 3 -58 -53 -66 -130 -41 3 -117 -18 -34 -40 12 56 -43 -89 -40 -3 -128 -32 55 75 -10 82 -4 -38 51 73 23
2818B3j9M9p6q5R5O7r5K3M8m1m4O5n6J3L4m2O1o3j7J4R2m6N0o2j8N9OQ9r0j1K8
$$ 23 4 53 -23 -108 -13 54 -41 -18 30 -11 -55 10 -46 -33 1 -41 20 -43 -60 -46 46 0 50 -12 -30 29 35 124 34 23 51
2849E1j51J16j03j4P2l3q1K13k5jj1n7J2o8N5L4r6O4L0L7O3p2r6K3o0J59j46P1
$$ 51 -100 16 -87 -101 -29 -62 -143 70 45 44 33 -24 -12 -80 -25 9 -87 -23 7 44 107 35 -61 -38 -98 61 -85 -14
2877a4J09j16L6o0Q9q4J13j45J38m0l3j9m5J82j11P3l3L6j10J34J5K5j63J27j05
$$ -14 95 -21 15 -45 44 -40 73 -72 66 26 -7 -26 -71 111 0 73 40 76 -34 100 115 140 -23 104 -1
2902aj3O5n0J7K0O8p5q5N0n3O7O6j55J15j00O4o9R0N8m3l7J25j04q2o4O1P9l6
$$ -1 -14 51 1 18 38 106 31 -54 -4 -57 10 76 -79 36 -64 0 -69 21 79 36 -1 124 20 -62 -126 -65 14 -22
2930b2j0m3qQ7r0N9L7l0N4p9O9r4N6jK6j6N8Lk1k16J17J80q0jR6j72J28o5M7j02
$$ -22 -32 -75 -83 4 -86 -27 10 -20 34 -45 24 -70 -14 -15 11 -5 53 56 35 -181 -64 116 36 35 131 -41 87 22 69 -33
2960c3j2J6KN4o6J38j73J1J12j05M2o2K55j70n0P6L5j04M0rJ0p3M7Mk9l2N8j4
$$ -33 -45 -29 -27 27 -39 99 -74 -63 49 -56 -14 -76 179 9 -41 35 70 -34 6 -3 7 -66 -19 -15 -44 -76 -18 -32
2988c2R9q5P5k1m7k6J85j05j22J14j24J47l6j24J37J7j20J53j26O6n5PM8r0J68
$$ -32 67 -18 57 36 -11 -37 148 43 -79 35 -89 58 22 -102 35 52 -68 85 -41 25 -30 -23 25 -65 103
3013A03Mk26J38J0r2J57j6j32L6L1O7N1j67J31j16Qk8R8n8l6J55j27mr1J00M1
$$ 103 107 -119 19 29 -63 94 78 -54 -18 13 80 131 -36 95 -21 -13 -41 57 -1 -37 118 -9 -13 -104 -4 37
3039C7Kj15Q3P4l0K0q3MK6L7j3o1p1QJ33j12mR0K0M9R3j22n0mq1J13l7K5j31J29
$$ 37 39 -76 7 81 51 71 -12 -8 18 55 42 -19 -90 -82 51 -61 -65 25 45 94 187 65 15 11 -70 43 6 31 -100 29
3069B9nQ2k16p1J56Pj0P2q5j8J58o0k7j21L9L5Lj5K2J26r5p3J01k2p3J43j16j33
$$ 29 24 106 -110 -181 -25 -18 -28 44 -41 -59 99 39 12 -109 -70 -35 -32 -47 -25 101 6 -67 34 12 -61 82 -34 -167
3097a67J69j19J59l3K4r8J39p4q0P6Pj6o4N3j7M6J6Mq6K10j68p3P7J0L0k6m3J21
$$ -167 2 -117 42 9 33 -65 74 0 -80 -4 3 -13 -77 -24 -41 5 21 25 -61 149 -19 -92 -15 -5 25 -1 -44 77
3125G7m0j45N4R1j07q3N4Q9K4m8NO8q6L6m5L5l4l0N5J4QR2m5No6N2m3Q3p2OO7
$$ 77 37 -108 -54 37 -70 -153 -99 -10 14 -34 -29 39 -47 -11 -56 -21 -55 -85 -30 -16 -8 84 39 44 -22 30 -13 70 -2 4 71
3156G1j29J63n9j18J08k5n8p9P8M0q9J11m8P6qk4N1o2l0n9qP4J18p2n7J8j5M7
$$ 71 -58 105 46 -72 36 11 -47 -126 -48 -8 -97 14 -34 42 34 10 61 -1 -31 -90 -98 -24 94 22 -35 -17 -32 15
3184A5j45J76J7j11O8J7K8K2m3M2j16N7l2j4l7jO6j41P9R2j02J7Q7o2J02j39j18
$$ 15 -130 46 63 -48 20 37 65 87 44 86 -30 27 -5 -19 -56 -57 9 -132 -53 39 -63 -46 41 -21 81 -58 -176
3211a76J52N8n7m0O1j46K50j11j60J69n1j4M7J11n7l3K0M1j17N6j69K47j07R2
$$ -176 -24 34 -23 -63 -2 -148 102 -9 -169 0 -51 -65 -18 93 36 3 23 64 -53 3 -166 81 -26 66
3235F6r9P7l5J12j56m3J73P0j84Q8m0o1QN0k1r6Q8R0p7L3l1O9rj84J47kj31O5
$$ 66 -33 44 9 121 -35 -78 95 165 -19 69 29 -32 -24 26 5 -91 -3 87 10 43 12 81 72 -112 35 33 -98 -33
3263c3o3J11J9j2m8k0P9p6n6J11RO8j18O3j28J45l9m8J60q5P2j03M5j1K3j11P3
$$ -33 -96 15 34 22 -26 -46 33 -43 -99 12 21 89 -29 34 -94 51 12 -36 124 39 111 8 53 42 65 -46 27
3290B7Pnn1k7L3o8J8N1K7k2p0J27r1m2J49m1J8k3q9P7Qk9Rj3o6N9J01j0j01L8
$$ 27 34 29 -22 -49 -16 -84 -66 -15 12 -10 -80 47 -44 -86 63 22 40 17 -72 5 13 -16 -7 -20 -86 -27 74 64 -37 1
3320AP8r1Rj01R9j2N2M9j24r3J70p4J3k8R6j0m3k2o2mJ21p8J62k14J20K2k6K5
$$ 1 79 -12 -3 -104 -5 -17 35 84 -40 -133 37 -37 -24 -52 44 34 -9 -31 -93 -97 24 -54 108 -106 14 36 10 35
3348C5o0O4n2k9m0N1Q0K9j28O7k8l9J05m7k3Q4j49M7J1O8m6K9QN3o3Q9j20j1k1
$$ 35 -25 39 -13 -42 -82 -31 49 78 -50 17 -11 -50 55 8 -15 69 -80 -33 -22 46 0 29 37 90 27 116 -4 -15 -36
3377c6QJ0kN0j24nJ84r8M5L5o2M6k4j18J53Jp8KmPM4l6JJ12r9k8p4J60q1q2J07
$$ -36 -28 -18 -20 30 -94 -99 85 -13 32 67 5 51 27 -91 62 63 -15 -13 -17 -10 34 -2 -1 111 12 -16 -90 70 -11 -93 14
3408A4K9o7J46o6j14J49r1J0j3M5m8K5j17J27j26O7JL6K9M2j37P2r0K4j7Q2p0
$$ 14 43 -24 122 56 -58 91 0 10 -3 42 -6 19 -98 29 -97 -30 -29 7 36 78 -59 13 -77 -53 -70 12 -58
3435e8O0j21J88m2j02L6p6Q8KM8J1q3N3J7NJ7j11J24k3m6j2kkO4m7N8j11o6K06
$$ -58 2 -119 69 27 -75 -39 -115 -27 -25 23 34 -49 4 21 26 43 -68 56 33 -13 -25 -27 -29 35 -12 46 -65 -131 75
3464G5p7J9N4j37k4J04n9OP1j6O7j00J06p1l6Pj5%k8Q4j4N5J8r2K0M3q5M2K0q5
$$ 75 -2 17 71 -66 -90 14 -45 -39 32 16 83 -17 89 18 -18 -11 -26 -26 -54 30 16 71 89 -3 17 60 -25 17 37 -48
3494d8J25j65J49n7J03j12j4R3k1r1K7l4Q3J39r9j91J86mMo9RJ5or2R5Nl3n8R5
$$ -48 77 -88 61 4 107 -5 -19 74 53 -38 -11 -45 38 177 78 -113 73 69 73 4 13 28 22 -70 25 30 -3 -61 34
3523C4J4q4N3J27o6k9k2J4J02k01L3rP3J13j57L3j4p0RQ1q3k5J39J5r9l7M1J9
$$ 34 48 -36 17 144 78 49 27 41 143 -58 -25 -34 39 152 -5 28 14 -56 -47 34 -49 -74 65 80 -19 -56 -15 4
3551DK02k71%J06j05K6J1J0nL1qk4J0R9j16J3P5j39J06K5l6K9j05KR7Qp8N9l1
$$ 4 206 -65 -65 41 -64 -38 -27 -17 -22 9 1 -23 -13 86 -30 -17 58 -81 25 50 14 43 -62 -60 37 45 -33 26 -5
3580eM1j7j03L2M0Km3L7J41o2Qp4lj8mNL3M8p7K7M9o8P4l1k0p8P1k0M6M5m4j02
$$ -5 36 19 -84 -52 -12 -10 -53 -16 125 63 71 -3 -6 -24 -28 -23 10 58 -19 8 57 -11 63 32 12 -66 5 -15 31 76 32 -70
3612g0J90j05j21O5Q8L9j30J76j28R1j69J15n2m6q6J15k8O6k1N5m7o4O0l7K4j30
$$ -70 120 15 -106 -41 47 86 -44 132 4 95 -74 41 -11 -57 -143 -28 -56 10 -11 44 -3 -67 -7 -44 -20 -150
3638a50O2M2J4P0o7M3J7o0N0n4J20q9Kk4N2or1Q6L5L0l7k3O8j12N1j7o9Q4l7R2
$$ -150 -88 -46 -32 38 -29 14 31 -29 21 -33 87 -2 0 -24 28 22 -69 17 52 82 45 22 90 -22 29 12 -57 27 -10 82
3668H2j60Q4Q4l4p9Q0j43J32o3M2J2j01j0M8N4L5j00R4K7j03L6Mj04Q9m3NM3p2
$$ 82 -78 6 90 56 -23 57 -86 46 -17 25 37 -64 -74 -26 28 63 -37 57 84 -19 17 21 -83 6 -37 -32 11 -61
3696f1P1M5m5L2q4M1K7n0K8m0L6k2j09J50p3MJ22n4j4k8Q7o8ok5rN0k8O6k01K33
$$ -61 10 55 10 42 -42 -1 26 -24 4 -36 0 -22 -131 19 -54 -50 72 18 4 -24 63 -5 -11 -36 -45 5 -23 43 -158 75
3726G5r9J46j63m2K25k08J36j21R3Lr0L5M5j22O4J14n2J10r2j10R8j11J23L4j09
$$ 75 -24 122 -41 -83 142 -66 70 -51 42 45 -45 -10 35 -87 -23 91 39 149 57 -53 45 -66 57 91 -18
3751a8L2N2j50R5J11r5l0j9oj6K6L4K6j28k4J14M9m6l1J9p7P7L4P0j70L2K8K1
$$ -18 14 66 -84 11 122 27 -3 -22 -28 -44 -18 16 42 -86 -110 4 53 7 -24 -5 -82 -5 29 99 -71 -39 -11 10
3779A0j19O3p0N4Q6r1K43j59N0r0Q3j61M5J8Q8K9r1j07J1J07L6j0n1L4k0Nj2j0
$$ 10 -109 -46 -116 -62 24 -67 176 17 67 -23 60 -101 -56 -38 50 79 -12 -119 -108 -1 35 25 -26 8 -12 -7 -19 -29
3807b9O0j14J63jp5M4j07J95j91j4J79j08j10O2J01q9NK5L6K9j17j7Q0l9L1K7
$$ -29 31 -83 80 79 4 48 -59 136 -55 -69 110 2 -108 -46 55 -34 -29 -4 32 61 -56 -73 7 -32 -1 26
3833B6J4j48Q7o1J19M6r3m6J82k69P3R0o0P5q3n6j2J64k35P4K4J08p9Om7R3l6
$$ 26 40 -108 -21 -82 37 83 -10 -56 126 -143 -70 20 -40 35 -48 -104 -116 48 -187 -113 -89 19 -60 -54 -101 -8 -44
3860d4O1o8J7%J0l5K3j27J25J20j32J37p6m6J10M1o2pN5l0o2r3k4R2l7J31q9n
$$ -44 17 -51 -34 -34 -24 -59 -36 -163 -38 82 -50 87 11 -35 75 116 54 47 102 72 10 -83 -107 -15 -52 79 -10 -15
3888a5K8Nq5J3j6nJ42m1L2q6ol6J06n9r6J79Pq1m2J5Q3o5J65j10P0j28P8j4k0
$$ -15 13 18 -67 -54 -70 -75 67 26 58 -28 -34 -70 36 -23 -119 60 67 -14 -56 -41 42 -23 142 32 102 -26 52 38 18
3917A8O2k09J07qm1P9J3Q3r6P4j14N6K7j34N7Q8j05N2o0o4J67j02Q7p7N5J8j4
$$ 18 80 -129 -22 -30 -71 8 21 104 8 82 -32 24 51 -83 -26 62 -43 9 -51 -115 52 -50 37 -40 15 33 19
3944A9J8J01j50K9L7l4m8P9q4k3q5K05k1m0J01n4j39M8kL0l1K7l3J04q7n0O9r
$$ 19 37 138 -12 17 54 20 -28 51 -33 -56 -141 64 43 3 104 50 -89 -41 -43 -13 -44 -17 -50 54 -33 -83 -14 -23
3972b3J03o5jj37J69k9n7l8J23m1N6j13j0J20m7j04J05p9J35j44J4J69m8j72J80
$$ -23 80 15 14 -123 46 17 -40 -78 45 4 60 -53 -63 57 10 -94 11 -68 67 -77 -63 106 58 -114 66
3997F6k2P0j14p1J60q0J7O3r0j1m1k8L7O9r5P4L2kJ6Rq3n9J64k35J27j7L5j27
$$ 66 44 114 0 -71 89 9 26 89 -1 -12 -53 -81 -44 25 -70 4 36 34 50 59 -24 -83 81 -154 -27 -44 -9 -136
4025a36J57q0L6J32j97J38o9k3K0l3J81j0r8m9j9N0J12j80P8k2n3R4Mp7J03qJ9
$$ -136 21 -59 -23 109 -88 50 -19 -42 -22 -55 126 116 18 -31 -50 0 112 -68 10 -12 -65 29 33 -44 59 51 70
4052G0n7P8j16nl2L5O6j3k9j52J08o1K21q0l2P5k8p6O8j81J28K6K2o0J02p5j07
$$ 70 13 91 -25 -30 -62 -27 39 26 -3 -155 -47 -108 113 33 1 76 48 -28 40 -141 -13 13 35 -25 77 2 -105
4079a05K39j75RO1q7J1J27j39J29j54J11O7o0K9n3j3J1k0J06j11L2j3O8q3P6m1
$$ -105 134 -41 -32 29 -58 -47 80 -59 70 -84 27 94 34 63 10 -3 8 -12 94 -17 15 2 70 -13 63 22
4105B2o3JJ0L1N3q4M7j0l0nJ6J09p5r2K6j6L5lk9R5l5M2n8P8j9J2r9J02j31M6
$$ 22 -41 -40 -30 1 54 -30 17 7 -23 -28 -12 97 22 -70 -44 -60 -25 -28 -57 38 3 45 -13 65 46 58 -41 61 -70 -24
4135b4O3q7L6j2L5j8N2P7m9n8K0j02J15o9nJ26q6P7j9o4rJ13j77Q4j9J09j9n0
$$ -24 39 -48 -12 -24 11 -7 45 122 73 15 35 -67 48 -21 -26 100 14 91 72 8 -1 112 -65 19 0 109 90 40
4163D0N4k20J28m3R8J4m9jl4n3J34j08P6k7R4o2l1j7n3O0j18J03K5P1q6N1n9Q1
$$ 40 94 -126 2 -41 57 71 22 21 -13 -66 68 -40 36 9 103 41 10 -7 -60 0 -118 -15 10 81 -5 46 -13 68
4191F8j01M4k5Q8j11J13j14J59k23O8Q9J9k4n5k2K8l6j9R5j10Q6j14J50j9j30
$$ 68 -33 11 -14 74 -37 76 -38 121 -102 -34 55 74 50 -5 -27 1 -35 -54 41 -69 17 -97 53 34 -96
4216i6n8J14L4j0Q6m8n5k0J08q4R5q4n9J34rr0J24m2o2N2kjm5j3N8J9l8L6J5j40
$$ -96 -154 -40 -6 -16 70 22 -33 -53 55 -29 66 -18 -77 57 48 -42 82 40 -22 30 28 27 -18 -31 27 46 8 44 59 -81
4246h1Q1rKJ61j28Rk6k9l3Q1n6n1P6R3j10O9j63J57l6q6K7Q3P5o1j36P7P1r9j
$$ -81 0 -9 -7 154 26 35 9 -20 -53 28 -28 -79 -3 90 -20 49 -114 43 7 -79 -52 31 106 45 -91 -14 57 -42 -43
4275d3N5m6K6P8k40J90j34R4NK9j64J05J10n9pPO9J3n1p5K3R2j22P5m9n5J35o2
$$ -43 12 -34 -8 70 -170 20 -114 -20 -15 14 -150 -45 65 6 -1 6 75 88 37 -38 -15 77 -45 30 -19 -74 61 -1
4303ak5N8p3O0J7p1J1K1m6Q4j82K01o9O4R2j30P8j25qO8JN3mj22J17l6q3R6j26
$$ -1 -26 32 -41 19 36 -35 -24 -3 -49 35 -147 54 -15 49 141 11 89 -36 -44 24 25 78 74 -48 69 33 -50 46 -80
4332h0K37j06k9j9K5k3j07Q6l3K4k9J8j9p8K17j18K09k13m1J24l9Mr6R4n4P5o8
$$ -80 157 51 22 3 28 5 -102 -16 -49 -25 -54 -36 -55 -133 84 -34 175 -38 -79 45 6 10 -86 8 -46 29 -39
4359c9k1l0N4M1n9O9N1j54N5J05p7J0r1J9J25j7K9n%j36J69m8j34J36J5j16J17
$$ -39 -60 -90 -36 5 -54 15 66 -88 -33 72 -5 5 -86 -67 58 41 70 65 65 -71 98 50 -84 52 67 -49 68
4386F8j05J78j10n8o8J49l5p6L9j2Q4o8M7o6J43j09oo6l9J97o7M6r5P8j24pLK6
$$ 68 -37 141 31 -27 -95 54 19 -57 -18 -30 54 -14 33 -33 110 1 -5 -71 -110 87 20 66 -29 49 -75 -82 -79 -53
4414e3L9n9J11p9Q7L0N0r8qn3r1J83k6j81J44n8k1J28j4k4O7n5O9lp4j0M4j3m6
$$ -53 -14 -73 38 -41 46 76 126 28 20 -33 -124 59 33 -148 -4 -62 -83 45 31 7 74 19 88 85 11 1 45 32 -14
4443a4j8M0k1O5n7k5M8k3j6j07P7J2o7J16jr1j4J10K0j6q0Q5k1L4k6n5NN5M7o5
$$ -14 -32 8 -13 52 -5 -30 18 -5 -21 -128 -51 -39 -106 10 9 -82 -96 14 34 18 -62 23 2 36 10 -45 -40 15 62 -3
4473cqm3J31l8j35P8O2rl8K6j22N1O6J02j55M2rJ4l6p6J47j2j8mq0J1K0J14Kq8
$$ -3 -11 -54 77 39 -96 -18 44 35 -3 23 -99 -48 18 120 -35 7 -2 12 -24 -100 47 35 17 13 -67 -56 -36 78 80 -8
4503hL5j09O9n2K00m4j01P2l5R1p5l2M8OQ8n6k0r7J55j52J62k31j6J45j15J53
$$ -8 27 -82 -13 -65 135 91 -10 62 27 118 43 11 59 65 153 97 77 -20 135 -17 145 -86 -102 43 -72 81
4529H1j09m9J67j47Q4l8J9j7L5q7J7K3k6jR8pj05LJ36l4n4n2j8J55oo9p2K9m3
$$ 81 -28 -77 90 -57 27 -11 8 -9 26 -61 -44 -21 -47 -48 50 43 -62 -59 77 43 -11 -63 -81 74 68 -1 -73 -44 -87
4558h7O6K7m1k2m0J9J29j30J62q3Nq0K6Q1n5L7n0J26o4j36OQ3J31j67O1l7M5K0
$$ -87 -21 6 -35 -57 -97 -78 51 -79 83 0 5 -75 -49 32 -23 14 -36 90 26 -110 -104 -21 110 -57 4 -33 12 32
4586C2Q1q0l4k1J5o1O0J26j35M3JP3j30O1LR6k36J38l1pP3r7k8NR2nq5R3j00P
$$ 32 113 33 -1 -22 -7 -68 -8 118 -17 26 27 100 -30 31 34 130 -106 32 1 -6 67 -30 -58 -53 39 34 -51 42 -58 -51
4616e1R2j17p3K77j27j07N5R7J08j08m8l5N7r3P1Jj2L8J8m6O5lj09k5J27o2q2
$$ -51 41 -76 -149 128 1 -106 -51 46 154 46 -2 -37 20 -73 -2 -1 -13 25 43 -3 62 59 -50 -75 52 -10 -92
4643i2J74j12k1R3p2P6J0k3j2K7r3l7P6K4o8J11q6n4J07j62J60N0r9L6mj64K14
$$ -92 82 -30 -51 42 -30 46 56 33 21 48 -45 -82 -6 18 -50 61 -25 -79 28 -134 26 76 -23 13 9 -155 59
4670E9n4p4j3K7O8RjK1L5j86J28l6m3Q1N8r3P7j71M7L9P5j23J12j07L8J07m3k9
$$ 59 5 -69 -82 -55 13 22 21 42 77 -109 19 -17 -60 21 79 -14 63 -108 -61 -22 53 -70 42 -65 -27 80 37 8
4698HO4j24J3M5o0J00j73J85j29OQL0P1M3k26K49j51J2N8p0M3O1o4Q3K1j83%R7
$$ 8 72 -52 -39 6 -54 46 -127 58 -71 -65 -57 -27 44 87 -139 110 -41 -29 29 -41 2 63 -1 82 103 -80 -80 17
4726A7m6k2K4j6J4N4rM3r2J23o0J06o6q4l5J3NP6J9J8q5K7q9m7N3P0J0J2n5rJ13
$$ 17 -29 -51 -27 -43 -29 25 16 59 -33 90 30 136 70 -14 -49 -36 -31 45 64 82 -3 24 -65 -112 -59 11 21 33 -22 -31 82
4757H2j54R3j09L3LpP2j1j9Q1j64M0J54m9r9l8J22j4M1m6J2L0p0Q3j23k6LM1L1
$$ 82 -72 21 -88 -55 -52 -59 13 2 -17 64 -100 -60 94 45 -54 -92 30 16 57 11 23 53 -17 66 -57 -83 -80 -39 -8
4786hrj19J09P1o5N6j00o0M8j3J87j77P3Q8l4Pj19L3J12r0J0K4k0ML7l1k1pJ4
$$ -8 -17 -136 -27 44 -21 35 -65 -125 -77 -90 97 -80 -7 81 47 54 -65 -32 80 -10 0 24 4 8 45 14 -7 -14 0
4815@j73J82J5r3J39k1j87J56k3R8o8O1o5j8rm6P7qJ2j40J19j18J03m1m2Q8P4
$$ 0 -173 9 24 -69 70 49 -138 18 -5 93 25 86 21 3 -6 -52 25 17 29 -111 8 -110 -7 -48 -90 -2 72
4842G2J3q5k3J14l1kj8P0j0j15K9o6R7p2M9lm6k7p3J54m7j09Q7L2P7j95Q4KM8
$$ 72 85 0 -23 91 60 58 40 110 100 -15 14 -52 45 -27 22 19 -27 -54 -127 27 -20 -129 -42 -10 67 -128 -44 -42 6
4871Fo1m7P1N8N8k0J0j43K5OJ77j75n7jK9O6l9K7k9P2n5k0L3N4p5n6R7n1l0J07
$$ 6 -55 -102 -31 27 85 65 75 -68 -43 -37 140 -35 -92 -93 -64 2 -37 -10 -39 33 -22 -42 -9 45 -30 -86 11 -40 -70 37
4901C7m7j02O3J27j35j5R1k8K6J8j29J20q0pQ3P9j45K5K4J9Jn3J1M7N3r7K2m9
$$ 37 -10 -112 -49 78 -57 -72 19 -9 17 35 -94 26 -54 -61 22 101 -44 -19 5 24 25 -28 -17 30 83 -14 8 -41
4929d1R8K8j11oR4j01P9j32O1O4n7N4M3l4j15k8Q6o6J89k80J29j20M9O0J4N8q4
$$ -41 57 85 -26 -32 62 -39 40 -92 -31 33 -24 30 73 39 -76 -104 -18 -84 105 -175 -46 -166 -117 -57 -43 15 -69
4956f9J06J2j80J26m1M1l7O1o8N6%m3R3o1n3J50lj04O8M0n6r0R6n0Ol6q9J54j32
$$ -69 37 49 -131 -5 -46 -5 -42 19 -49 7 7 -36 57 -4 -57 93 90 -14 54 94 38 -52 44 -6 0 -36 -125 29 -103
4985a03J62n7Lj04Q7Q1o5k5j10J07J42r9J5o4O1K5j23K8j0k4O5R3j63J23l1M8
$$ -103 59 2 5 -99 -12 69 4 -21 -131 -24 118 19 34 -30 31 56 -67 -39 -49 -73 -8 85 -78 45 14 62
5011F2Q2j59N3P3n8K6j08M8L3k0qO0r5L9j32O1R0j74J67m7J62k28M8O8K3o0k0
$$ 62 144 -15 38 111 53 79 -29 19 52 32 24 84 -11 28 -104 -43 47 -127 40 -7 155 -73 -25 43 66 6 -14
5038a4Q2j7j32J73j14L2N7o6l2j06K00o4p2J09n1P2j01O0n0mQ7j14K9Qp7M9M6
$$ -14 68 51 -81 92 -22 10 67 1 -31 -137 63 -1 -73 36 -15 57 -44 16 -34 -38 49 -65 -36 -28 -105 -56 -10
5065a0N8j3n0o2J03l0O7j75NO7N7j8oP4P6j42L5j04J00k7L3P0j91kQ1J58k10j
$$ -10 48 35 -15 -77 26 -4 63 -112 -107 -40 17 -1 -7 67 143 1 36 -68 32 5 38 108 -83 -85 -4 154 -56 -57
5093e7O9L2q2l5K30j72k1J00j4Pn0J28p1j21R0k4J03j95N0P9n4J8K9p8J5J2P2
$$ -57 12 44 -38 -73 157 -15 -36 64 50 57 7 135 64 -57 33 9 112 -83 -33 46 -8 10 39 -39 -24 -12 60
5120F0j8o6R3j12l0j1R1J24j45R3j3j73M9N3J2m0J67j26n9N6R7l9l3p6K7jo4J15
$$ 60 42 -24 69 -43 -73 -84 7 131 -14 79 66 -107 -58 -5 7 -33 134 8 -51 5 102 63 30 -46 -19 -20 -84 31
5148C1r0K6J8J4m0O0N2l3m3J1N1j18P5k2O1rp1L8m9Mn0P2o6J43j22O3L2j71J70
$$ 31 -59 -33 -15 -1 -41 19 71 38 -5 6 57 -61 14 -8 53 44 -27 11 -38 -34 -84 -12 -78 65 -57 6 38 -133 37
5177C7j25J0j0J6P7O6J9j26RJ28q0O5j09oP6p9J02o5R6n1J8ok08J11n4N1L9QO8
$$ 37 -88 -78 -88 -72 5 71 90 -36 -27 101 21 86 -23 -29 47 -32 70 5 101 50 68 62 -146 -35 -89 -38 1 9 77
5206G7l1P0j49O7Ro2O7k4n6j9J03L2n9n3rmJ56j52l8Q5Orl2O8j49O3R8K3n5J0
$$ 77 46 116 -33 34 43 -19 48 24 -32 -51 52 84 25 -28 -37 -41 115 -37 -75 10 16 7 -25 43 -106 -43 55 78 23 33
5236C3N6J9q5N7ln0m7pK8l8j47O3Q7J07q2J24j63J23j11N5j6KPN8j02j00J98j63
$$ 33 89 108 23 80 77 27 -20 -27 1 -37 -184 -121 -34 73 -9 115 -48 75 -36 19 3 5 12 70 -32 -132 66 -97
5264i7J74j20M5J15j53J2J17j05P4l1Q0j92O3jj5J0j4oj85K12K6K5j00j7P9l0
$$ -97 77 -43 2 117 -36 -24 93 -12 62 31 111 -81 -18 -19 -34 -24 -38 -44 -229 -17 9 34 -66 -83 -4 -34
5290c4P5p6P9n9M1q5PJ41k7j03NJ37Oj82J00j8j7M9j01JJ07N2j27J08k0M7j11
$$ -34 41 -35 44 -15 26 -59 -52 89 62 -41 -36 101 107 -75 25 7 -10 39 -62 -61 46 98 -29 79 59 106 -5
5317eL3m6J5Kj0O0j57J22j9Q2qn8o5J38r6Pn8R2r2O3K6m7Q3np9n6R0M2r4L6ok3
$$ -5 28 -18 -3 -1 -11 49 -108 14 -5 77 69 11 -54 84 -12 -5 -63 29 -63 0 26 -21 62 57 -22 -78 12 54 -40 -4 -10 -33
5349c3J5L5k2j01J31j44K0J99j36P6l9m0MK2P1l5n0k6K1n4k9J50p9M0M4j20L4
$$ -33 -18 17 -5 -106 25 -119 -99 100 -36 40 1 -39 -35 -13 58 23 -27 -53 -32 -86 -115 35 -44 -4 40 -80 -46
5376d6J12O6j10JOk9K3No5q7J26q1R3J7O3jj33k6M9J25j45P9n7o7J24K4j1j20
$$ -46 66 132 22 23 29 0 23 28 -37 -124 2 -79 14 31 94 93 -40 -66 -17 108 -37 42 -15 -82 42 66 55 -65
5404f5J38m9J6n3n3lJ99j18p7O8O3L8q2q2O3pJ3K5m6K2o2J1R8l3j1O1j02O5j08
$$ -65 73 24 40 -13 -66 -69 130 12 -65 3 66 104 22 -60 3 -4 9 34 -12 10 -52 -41 57 24 13 74 -28 37 -71
5433g1J24m0o4J39mj11l0N6J6N4j06m3N9OJ58k20pJ25p0J4m8O3k3L5o4J23j40
$$ -71 53 13 -51 88 84 -27 -57 -1 15 69 -37 -80 -21 -15 143 -77 -84 41 -29 -15 -63 0 -23 12 -52 71 -69
5460f9M3J73j07L1j7q7k7n6n1J77O6j28J74p3K2n5m5P9k33K40L6k7J7Kl1r1pK4
$$ -69 -26 147 40 71 54 -33 -60 -116 -167 10 76 -52 122 49 71 16 -29 50 -183 57 93 66 83 85 54 -37 -44 -20
5488b0N5j49J05L4n4R0o7j8K5J5Q1j60J04j5M4K3j02j37P4J12n0j9L4J4j2l5O8
$$ -20 35 -114 -9 25 -29 61 -6 -24 1 16 97 -63 41 26 70 93 -9 -146 -72 40 -10 -29 5 19 7 -28 40
5515D0O2j8n6J20j54J9L0j5N2j86K13mj37J59j02m5RJ3N2j00mO8K9n1j9L8L9j71
$$ 40 102 84 28 148 -6 13 43 28 80 -106 107 103 -34 125 23 -22 -13 0 52 -48 -52 16 45 -6 -25 13 52 -119
5543a19K41j11ql4K6Q5j10L1M7l5k2n4n7J26J5O1j43J10LL8p1J22r2j35P3J05
$$ -119 122 11 3 -31 -5 80 -30 1 48 13 -9 -63 -120 6 21 82 -61 49 52 90 19 141 49 -86 -13 92
5569I2r3L5K1j00O4J00j47mK9L1p4K8qO1p7nj7Q8r7N4OR2j07rL6n2P5%j2m1J25
$$ 92 -1 34 55 -45 19 119 -28 -32 -3 28 -46 -18 -26 35 -42 -47 -64 24 -73 -19 -13 79 -28 -37 -1 -53 22 22 10 -31 94
5600I4p1p3P0K4Qp6k6J24j85J05K8n4J7P3Rn6om0L3L1J26j74m0Q3n2N3M1l1j70
$$ 94 23 -50 20 44 52 -24 -50 74 -111 -6 22 -32 -15 58 67 11 5 -35 -2 29 155 -19 -59 24 -28 25 66 35 -135
5629a35L6J21L0p4L1j66J69p8J17J4j48J88j61J7M2k1j4M8Qj2m8J0n6J55l7j49
$$ -135 -99 22 52 -22 9 -157 12 -66 51 65 -83 105 -56 -39 3 -18 -32 16 24 12 -36 -26 -82 73 36 -113
5655a13J56K4o3j4j8O3p9Q5O7j76L5J4R0o8J3qr9J00k4mJ35j30L8ol0nJnj6k8
$$ -113 43 67 4 -10 -28 35 -44 41 108 -68 -33 -19 71 3 16 8 -91 9 -15 -19 116 -14 24 18 -12 -17 -16 -21 -37 -65
5685f5j0M6joJ61j97M5P1j82J92l4l8Kj2k8J33J5J8r2Qpq1J63k0j06J7O6j32J03
$$ -65 -75 -29 -30 -36 125 -72 -27 44 -138 54 20 -18 -16 -28 -56 77 92 110 18 26 19 -62 101 81 -25 -8 58 -74 29
5714B9L0k2Mq5l4N6n6j3Q6j8L7r2L8Lp9R0j8p0J88n7p1N9P0r5L7j2KR1o6o0M7
$$ 29 59 37 41 -44 -78 -22 -78 -91 -5 -23 14 -78 -40 -37 -116 -26 -44 -114 74 17 -54 5 75 -20 17 5 7 98 32 -28 19
5745A9j05O1k4J3n7J66j6l4L2r9O9J1j03K9M2R5j88J12Q4r2KRl2O5o0K7r0O3j20
$$ 19 -86 -25 -49 -36 -93 73 57 23 55 -44 25 36 -67 -38 4 99 -89 23 107 15 17 26 -6 59 -1 26 -64 -1 -121
5774a21J15m6J48j0o8PkNL8m7k5Kl0L9M5M0j36KM2L2m4j85J22N0k0J90j86K9P2
$$ -121 -6 -52 96 86 18 25 23 28 66 19 -6 -4 -34 5 50 90 -46 -44 -2 30 -14 -199 -77 -27 -47 143 -43 -14 58
5803E8j13l9J98j80J33j22L2k2R6k1n4jJ11l6L5p0K4N8j76R2j3k2N6n0K6k4m7
$$ 58 -55 -94 104 -76 57 -65 -33 -55 41 20 -34 -35 76 40 75 5 29 87 -89 3 -10 -32 24 -26 0 -24 -71
5830g1L7J2j9P6j06O8L6o5pN4k9J0J0n2j1J3J06j97J28j3M2k6Q5j27J2J15j24
$$ -71 -34 -22 -41 35 -71 -3 33 -32 -39 15 -14 -4 6 -46 -57 -44 62 -135 -7 -20 22 -4 81 -46 -34 81 -43
5857d3Ok1M3O5J2o1K7mn3L8Qj8m3J21r4PO1n4p7R0M4o4nK5k2j00N3M7M1p4O8o7
$$ -43 -37 -58 -15 50 62 1 28 24 -29 9 17 -1 -44 77 -17 -10 51 -3 -80 10 54 -10 -15 10 -12 -112 -59 -12 29 -45 23 -44
5889d4K8M2O0p1m2j9Q4o9Q8j15N2Kk3J0l8m6J00p4L7o7N8J9J13q1M6r8L7J01m2
$$ -44 -16 26 86 15 -27 -46 38 -31 57 -58 -6 -4 -27 -17 -55 -101 -1 -75 -38 -105 -47 -28 85 4 50 -48 -11 90 48
5918D8l1r3R6LK4o1N1J22l8k25J38n2M8p7J11j18J9L7J2j9r8O1oLn8N1O5m9M5
$$ 48 17 -76 20 23 47 -14 37 159 121 -104 34 -18 30 -47 64 -54 -35 2 14 -5 -103 -42 -48 -45 -103 -52 13 -36 9
5947Ij7J21j69J29q2Mj0Q0j06P7J09j25j26J55j17J0qQ7p3R4j06N8o1R7P5k8K
$$ 9 -8 113 -56 73 -9 -5 -15 65 -41 36 145 20 -106 49 -68 -58 -66 21 -52 42 -64 -6 -67 30 105 77 79
5974G9j08M5L7LJ3o3%j6L3r4oJ11o9nJ2Mj0l5L6m5R4J4j01L9K0mJ07o5p8J52j85
$$ 79 -29 16 53 56 69 6 6 -10 23 -71 -77 34 -35 -40 -28 -24 -34 -69 -33 -78 16 30 -71 -32 -12 -16 91 26 -52 100 -85
6005h5l9K45j85M9LM9J3q4J37q4L6j46J42m0p6N4O2Nm8P3j20K6Q1j27J2P5j17
$$ -85 -124 121 -64 -15 -12 37 50 -34 103 19 55 -91 51 11 -65 -11 51 56 8 81 -39 -13 68 -59 -47 28 -89
6032h9j1K03k35K13Kj46l3J10o8O6L3q4j9J34j25L7K4m0RK5L5n4qL1q1o6Q9J2
$$ -89 -100 103 -132 81 83 -63 -96 14 -54 12 45 -39 -58 76 -49 -12 12 -28 -19 6 41 -13 -21 10 -71 -137 -48 -36
6060c6J07n4m6N1O6n1o3j2J7M9n0q4J77r0PQ0p3K5L2l8j6L1K5q6K0QM3q9m5P0
$$ -36 71 17 -29 22 88 37 -26 -38 -21 28 -22 -106 71 -19 -12 68 -5 20 52 14 -2 29 54 -32 -12 -4 39 -50 -95 -25
6090b5M7N0q8l0M9q9O9k9KN3m2K2K05n9k8j02o4j19J18N4n9J15k8Qk7m4O3l6j7
$$ -25 22 72 -16 -46 3 -86 -17 -46 -44 9 -33 -11 194 135 107 5 -59 -178 -60 -6 -65 50 22 30 3 -41 22 -14 -31
6119c1P8p3M8K8n3j1P1o9j9M0P1r3p3K18m9k2o0N1l6n3NK0q5J32m9j01J78j34
$$ -31 47 -26 22 50 -3 -14 57 -12 -31 9 80 -13 -86 132 83 61 1 52 16 -37 -32 -12 -97 35 -14 -115 63 -71
6147g1J62l2j0J5oq3Q2n9R3j12L9L1q4P9j3K3n1K6N0o7Lk2r3J21n1K0M8j08J55
$$ -71 91 59 49 64 58 -25 57 -2 91 -21 18 49 -35 44 31 54 3 29 79 12 15 -7 -100 21 -30 -10 38 -70 85
6176H5o5M3q1NQ8m6j9n8j7P7j24K1J80j45M3M0j2j30N8L8k6J08r3J28p9p7J12
$$ 85 20 63 -18 -13 75 29 10 -48 -65 12 -112 -91 89 -56 -13 27 15 -115 -57 -19 -45 63 -30 98 19 -58 54
6203E4j45J44Pj0n2RPl2J0K9rJ9m8M8J29j06j1lj54N0J87k62P9J8N3L9N1o6j9
$$ 54 -91 53 60 50 -2 7 14 -18 -8 21 12 31 -17 31 160 54 43 40 -114 -64 123 -139 -60 -42 11 50 101 35 16
6232A6Q3j58M4J93j45j88K02j42K7O5L8o8l6kJ07Kr8K5J67j60N2q4P3p2j3M9q6
$$ 16 99 -59 -15 178 33 -155 47 -95 -68 -3 35 -33 -69 -71 36 38 -60 -35 132 -28 24 -60 13 -59 -72 -23 -109
6259a09J23qp6J57j16K1n3L2R2k1m7O0p7k5q2J59j55QJ84lk3K0p2k7J04K4n2m6
$$ -109 14 6 -70 87 -29 -8 -61 -29 63 42 -5 55 -22 -47 -129 30 -125 -117 67 64 41 61 -11 -38 66 90 38 -8
6287hr3Q2N5m9KrL5p9J09r9K6K9Qj4Mm7R5l4q4R3j25Q3r7J47J03j73M3n6RJ1M6
$$ -8 -101 -19 36 -13 -11 -20 15 -64 45 -54 -28 1 9 -5 -1 -48 47 13 -71 22 -103 -20 -117 30 133 -40 3 -53 -44 -33 13
$$ [...]
8191B0
##END NTUPLES=NMR FID
##END=
