##TITLE=1H_DE-80H_X3
 200.13MHz, d2o
 8 sc
 
 19ns.26.2.2025
##JCAMPDX= 6.0         $$ Bruker NMR JCAMP-DX V2.0
##DATA TYPE= NMR FID
##DATA CLASS= NTUPLES
##ORIGIN= UXNMR, Bruker Analytische Messtechnik GmbH
##OWNER= pz
$$ XWIN-NMR		Version 3.5
$$ Wed May 14 16:39:17 2025 Russian Standard Time (UT+4h)  Yarkov@DPX200
##.OBSERVE FREQUENCY= 200.1313
##.OBSERVE NUCLEUS= ^1H
##.DELAY= (6, 6)
##.ACQUISITION MODE= SIMULTANEOUS
##.ACQUISITION SCHEME= undefined
##.AVERAGES= 8
##.DIGITISER RES= 18
##SPECTROMETER/DATA SYSTEM= spect
##.PULSE SEQUENCE= zg30
##.SOLVENT NAME= CDCl3
##.SHIFT REFERENCE= (INTERNAL, CDCl3, 0, 14.3821)
##AUDIT TRAIL= $$ (NUMBER, WHEN, WHO, WHERE, WHAT)
$$ ##TITLE= Audit trail, XWIN-NMR		Version 3.5
$$ ##JCAMPDX= 5.01
$$ ##ORIGIN= Bruker BioSpin GmbH
$$ ##OWNER= Yarkov
$$ C:/Bruker/XWIN-NMR/data/yarkov2/nmr/H-C/1/audita.txt
$$ ##AUDIT TRAIL=  $$ (NUMBER, WHEN, WHO, WHERE, WHAT)
(   1,<2025-05-14 16:38:28.34 +0400>,<Yarkov>,<DPX200>,
      <created by zg, POWCHK disabled, PULCHK disabled
       configuration hash MD5:
       00 E9 B6 7A A2 85 ED C7 34 08 36 98 17 FE 4E 26
       data hash MD5: 16K
       C2 47 52 E6 1E 03 24 7F 1E 94 1F 71 21 77 CE 80>)
$$ ##END=
$$ 
$$ hash MD5
$$ CC D9 2A A6 DD 29 A9 C0 32 9C 26 6D 56 96 99 6F
##$RELAX= 
##$RELAX= 
##$RELAX= 
##$RELAX= 
##$RELAX= 
##$RELAX= 
$$ Bruker specific parameters
$$ --------------------------
##$DU= <C:/Bruker/XWIN-NMR>
##$EXPNO= 1
##$NAME= <H-C>
##$PROCNO= 1
##$TYPE= <nmr>
##$USER= <yarkov2>
##$AMP= (0..31)
100 100 100 100 100 100 100 100 100 100 100 100 100 100 100 100 100 100 
100 100 100 100 100 100 100 100 100 100 100 100 100 100 
##$AQSEQ= 0
##$AQ_mod= 1
##$AUNM= <au_zg>
##$AUTOPOS= <>
##$BF1= 200.13
##$BF2= 200.13
##$BF3= 200.13
##$BF4= 200.13
##$BF5= 200.13
##$BF6= 200.13
##$BF7= 200.13
##$BF8= 200.13
##$BYTORDA= 1
##$CFDGTYP= 0
##$CFRGTYP= 5
##$CHEMSTR= <none>
##$CNST= (0..31)
1 1 145 1 1 1 1 1 1 1 1 1 1 1 1 1 1 1 1 1 1 1 1 1 1 1 1 1 1 1 1 1 
##$CPDPRG= <>
##$CPDPRG1= <>
##$CPDPRG2= <>
##$CPDPRG3= <>
##$CPDPRG4= <mlev>
##$CPDPRG5= <mlev>
##$CPDPRG6= <mlev>
##$CPDPRG7= <mlev>
##$CPDPRG8= <mlev>
##$CPDPRGB= <>
##$CPDPRGT= <>
##$D= (0..31)
0 0.7 0 0 0 0 0 0 0 0 0 0.03 0 0 0 0 0 0 0 0 0 0 0 0 0 0 0 0 0 0 0 0 
##$DATE= 1747226307
##$DBL= (0..7)
120 120 120 120 120 120 120 120 
##$DBP= (0..7)
150 150 150 150 150 150 150 150 
##$DBP07= 0
##$DBPNAM0= <>
##$DBPNAM1= <>
##$DBPNAM2= <>
##$DBPNAM3= <>
##$DBPNAM4= <>
##$DBPNAM5= <>
##$DBPNAM6= <>
##$DBPNAM7= <>
##$DBPOAL= (0..7)
0.5 0.5 0.5 0.5 0.5 0.5 0.5 0.5 
##$DBPOFFS= (0..7)
0 0 0 0 0 0 0 0 
##$DE= 6
##$DECBNUC= <off>
##$DECIM= 32
##$DECNUC= <off>
##$DECSTAT= 4
##$DIGMOD= 1
##$DIGTYP= 9
##$DL= (0..7)
0 120 120 120 120 120 120 120 
##$DP= (0..7)
150 150 150 150 150 150 150 150 
##$DP07= 0
##$DPNAME0= <>
##$DPNAME1= <>
##$DPNAME2= <>
##$DPNAME3= <>
##$DPNAME4= <>
##$DPNAME5= <>
##$DPNAME6= <>
##$DPNAME7= <>
##$DPOAL= (0..7)
0.5 0.5 0.5 0.5 0.5 0.5 0.5 0.5 
##$DPOFFS= (0..7)
0 0 0 0 0 0 0 0 
##$DQDMODE= 0
##$DR= 18
##$DS= 0
$$ [...]
##$SUBNAM2= <"">
##$SUBNAM3= <"">
##$SUBNAM4= <"">
##$SUBNAM5= <"">
##$SUBNAM6= <"">
##$SUBNAM7= <"">
##$SUBNAM8= <"">
##$SUBNAM9= <"">
##$SW= 18.0517328524113
##$SWIBOX= (0..15)
0 0 2 0 0 0 0 0 0 0 0 0 0 0 0 0 
##$SW_h= 3612.71676300578
##$TD= 16384
##$TD0= 1
##$TE= 0
##$TE2= 300
##$TE3= 300
##$TEG= 300
##$TL= (0..7)
0 120 120 120 120 120 120 120 
##$TP= (0..7)
150 150 150 150 150 150 150 150 
##$TP07= 0
##$TPNAME0= <>
##$TPNAME1= <>
##$TPNAME2= <>
##$TPNAME3= <>
##$TPNAME4= <>
##$TPNAME5= <>
##$TPNAME6= <>
##$TPNAME7= <>
##$TPOAL= (0..7)
0.5 0.5 0.5 0.5 0.5 0.5 0.5 0.5 
##$TPOFFS= (0..7)
0 0 0 0 0 0 0 0 
##$TUNHIN= 0
##$TUNHOUT= 0
##$TUNXOUT= 0
##$USERA1= <user>
##$USERA2= <user>
##$USERA3= <user>
##$USERA4= <user>
##$USERA5= <user>
##$V9= 5
##$VALIST= <valist>
##$VCLIST= <CCCCCCCCCCCCCCC>
##$VD= 0
##$VDLIST= <DDDDDDDDDDDDDDD>
##$VPLIST= <PPPPPPPPPPPPPPP>
##$VTLIST= <TTTTTTTTTTTTTTT>
##$WBST= 1024
##$WBSW= 4
##$XGAIN= (0..3)
0 0 0 0 
##$XL= 0
##$YL= 0
##$YMAX_a= 41599
##$YMIN_a= -36707
##$ZGOPTNS= <>
##$ZL1= 120
##$ZL2= 120
##$ZL3= 120
##$ZL4= 120
##$ABSF1= 10
##$ABSF2= 0
##$ABSG= 5
##$ABSL= 3
##$ALPHA= 0
##$AQORDER= 0
##$ASSFAC= 0
##$ASSFACI= 0
##$ASSFACX= 0
##$ASSWID= 0
##$AUNMP= <proc_1d>
##$AZFE= 0.1
##$AZFW= 0.1
##$BCFW= 1
##$BC_mod= 2
##$BYTORDP= 1
##$COROFFS= 0
##$CY= 83.5205535888672
##$DATMOD= 1
##$DC= 2
##$DFILT= <>
##$DTYPP= 0
##$F1P= 10.8118882576601
##$F2P= -7.23987719738617
##$FCOR= 0.5
##$FTSIZE= 0
##$FT_mod= 4
##$GAMMA= 1
##$GB= 0.15
##$INTBC= 1
##$INTSCL= 1
##$ISEN= 128
##$LB= 0.25
##$LEV0= 0
##$LPBIN= 0
##$MAXI= 10000
##$MC2= 0
##$MEAN= 0
##$ME_mod= 0
##$MI= 1.114404
##$NCOEF= 0
##$NC_proc= 0
##$NLEV= 6
##$NOISF1= 3.799351
##$NOISF2= 2.8
##$NSP= 1
##$NTH_PI= 0
##$NZP= 0
##$OFFSET= 14.38212
##$PC= 1
##$PHC0= -1343.791
##$PHC1= 7.133752
##$PH_mod= 1
##$PKNL= yes
##$PPARMOD= 0
##$PSCAL= 0
##$PSIGN= 0
##$REVERSE= no
##$SF= 200.129724274929
##$SI= 16384
##$SIGF1= 3
##$SIGF2= 2
##$SINO= 400
##$SIOLD= 16384
##$SREGLST= <1H.CDCl3>
##$SSB= 0
##$STSI= 0
##$STSR= 0
##$SW_p= 3205.1282051282
##$SYMM= 0
##$S_DEV= 0
##$TDeff= 0
##$TDoff= 0
##$TI= <>
##$TILT= no
##$TM1= 0
##$TM2= 0
##$TOPLEV= 0
##$USERP1= <user>
##$USERP2= <user>
##$USERP3= <user>
##$USERP4= <user>
##$USERP5= <user>
##$WDW= 1
##$XDIM= 8192
##$YMAX_p= 0
##$YMIN_p= 0
$$ End of Bruker specific parameters
$$ ---------------------------------
##NTUPLES= NMR FID
##VAR_NAME=  TIME,          FID/REAL,        FID/IMAG
##SYMBOL=    X,             R,               I
##VAR_TYPE=  INDEPENDENT,   DEPENDENT,       DEPENDENT
##VAR_FORM=  AFFN,          ASDF,            ASDF
##VAR_DIM=   8192,          8192,            8192
##UNITS=     SECONDS,       ARBITRARY UNITS, ARBITRARY UNITS
##FACTOR=    0.0002768,     1,               1
##FIRST=     0,             0,               0
##LAST=      2.2672688,     0,               0
##MIN=       0,             -36707,          0
##MAX=       2.2672688,     41599,           0
$$ Real data points
##PAGE= N=1
##DATA TABLE= (X++(R..R)), XYDATA
$$ [...]
745i0J26j03OL2R2r0J50j20O1J8j01L4l3Q9J8j08q3pO4m4K0J73j67L4lPQ7n2L0
774D0j8jO1J6j32J30m1r7o6J13n5J85j38M1j03QK2P5q1J2L8OJ8K8j09R7J28j95
802a8Lm8J05m4q6q7K24k6n2O6m6Q8j48j6J68j53R4m1L1l5P5J5j13P7o7n7R6K9
830C4n4k8J47k2j11K7k2L3m6O6n9L1Lj3O1r2J28j02KK3j2m6J10m2Ok7J2j05K23
859A25j29j44J32l0J2K5m9P0j33J98k4n5L5K4o1l9L0j9N1j16J24n4OQ7L0j70M2
886c2P1j66J59j3O8j44M4j10J21p6P3m3n9J60J6j07M4k1p9J16Ok5p7Nl0J05O7
913G3j32P1oQ5j29l2o4nJ81k5r4K3Q4Qj10RJ65j04J1j9M4j8L8m5Q5j77m2L2J71
942G8j25J4j6L7n9J03m7P4o7j5O7q4KO3l9q6J40o6O6j12O9r3J33j05J48l9q9m4
$$ plain form
745 -90 36 -67 -61 -29 63 -27 123 3 64 82 -19 15 -18 71 89 -19 -102 -109 -45 -89 -69 104 -63 -29 -32 -25 62 10 40
774 40 22 21 82 98 -34 96 55 -42 -108 5 -50 135 -3 38 -65 -57 -35 40 -41 -29 9 15 33 61 -48 49 177 -18
802 -18 -15 -63 42 -2 -88 -175 49 23 -29 37 -9 79 -69 -85 83 -70 24 -17 14 -21 54 69 -44 33 -34 -91 5 34
830 34 -20 -48 99 77 -34 -7 -29 4 -42 24 -35 -4 -1 -14 47 -45 83 -19 -17 6 -6 -52 58 16 22 -5 7 -98 125
859 125 -4 -148 -16 -46 -34 -9 -58 12 -121 77 53 -2 33 57 -4 -43 -13 -32 19 -97 27 -27 -21 66 96 -74 -32
886 -32 39 -127 32 19 87 -57 -13 -123 -2 -78 -5 -48 -107 53 69 -38 6 -15 -94 22 28 3 -74 -69 -99 6 73
913 73 -59 12 6 91 -38 -70 -134 -139 42 17 -77 -54 30 38 -72 -63 102 -2 9 -10 34 16 54 9 94 -83 -125 -93 78
942 78 -47 -33 -49 -12 -71 32 -15 59 -8 -23 44 -40 -38 25 -14 -100 40 -26 40 -72 -3 -96 37 -68 80 41 -48 -92
970i2Q2OnM8p6J45m2r1L8m1L3J33r3j34J54n2o0N3p8J36p7j06P6K4p3kR5n0J1
999c8O7j04J41j6j79K23p9L3J03j53J05j72P3K2j74N6J24j24MJ0J43r1L7k2M1
1024C0J8K9M6p4j19N3l5r3J42J13l6j08o7J32l0K1j45P7J52j10J32j09%O5k3l7
1050B4l2k04J70L8L9L5n3n8O6L2k0n2M9o5J68q1p6j8Q9j1q1R4L9j15L8n9R2o5
1078a7n8k3J75o4Kj0p5Q5K0n3N5N8j06l0Q2K2p9j7QOJ39r7j01O5M5nk6J0m7J95
1108A59j43j09N7O0k4O0p4K3on9J61r3j18Q9j04L9P7Qm8JK4NN2%n4j9J08j06P5
1137D1k1m4RP6j7k8m1M3l1j9J51q4n4l5k2J35l0J69j61p6J07j29R1k0l8j6J14
1164G0j04J0M7k0j43J3J24K2j5QK3j7j6J4L8K6j05o8O3q0P2J4j5o9k3O9K15j5
$$ plain form
970 -92 -10 -4 -9 39 -37 108 66 -25 13 -28 5 138 45 -89 65 13 -47 6 -72 64 -13 -119 -43 -19 -92 -94 1 -49 -38
999 -38 29 -75 66 50 -129 94 15 48 151 -2 103 -69 4 26 -148 -92 32 -92 -88 -78 65 -26 11 -11 30
1024 30 48 77 123 49 -70 -17 -52 -145 -3 110 74 -34 -101 31 1 22 -123 -46 106 -4 128 19 19 84 61 24
1050 24 -8 -212 -42 -4 35 70 17 -41 25 57 37 -15 34 -31 137 56 -20 -38 51 40 -41 53 92 -23 15 -44 48 -17
1078 -17 -75 -98 77 13 15 5 -70 15 35 -18 37 95 -11 -41 41 63 -16 -33 -25 -19 120 23 -78 -13 32 27 1 11 -36 159
1108 159 16 -93 -36 24 0 60 -14 9 3 -56 105 12 -106 -17 -121 -82 -5 3 -45 -44 -20 -15 37 37 -17 -36 72 -34 41
1137 41 20 -24 -15 61 44 16 -25 18 -13 -32 119 35 -19 -54 -76 59 29 198 37 -39 68 -61 30 10 -28 -44 70
1164 70 -34 -24 23 3 -140 -127 -3 19 4 12 35 18 2 16 54 80 -25 -93 -30 -110 -38 -24 -39 -108 -131 -62 153 138
1192A38k02O5nJ4j4M0m2nJ8Q4q0m1J2l9J29p4O6p3n7L8L2O4n2j04O8P0j01J08
1220E7k4l8M1j19Q2l5M7l0m2O7p2N3m7R8r2M8M2q6J13j65J08j0j6m0J24l5j0K5
1248D4j13L3K1K5q4K3J3l8L0L4Nj4qm5O4J2L7L2n8j3K2M0R7k52J77r6Q8j5k3j01
1278f3J9L0K4N4j29K0mL8pO3j7o6J32k09J16n4K7O1p6j3O7q0j8O0M8k6J2k2No
1308a4L2j6N2j4j2j7M7o2N3j76J94p5RL1L2o2j9qK5P5j05Rj6J13q4J9o0M1m6J32
1338G8Oj01N2K0n2Nj6n4R5l7P6rj05N9j70J77J3J41j87l5j7J2R8m7J1j64K09p9
1366b1jJ8k6J3mq4P8q8J68k03J06J68k56lJ67j06Q4P0j04K1q3J90j44P5j1p1m9
1393i6R2q9O5J7l7m%K5N8k7k5m1Q9n5p8J58O7r8k4J6Mn7JJ0O7p8J96k81O2K06
$$ plain form
1192 138 -64 1 -4 10 -4 36 -6 -11 7 91 11 -30 -18 -57 72 -2 64 -9 -66 -28 4 68 16 -88 -20 50 -51 57
1220 57 33 -5 36 -83 -1 -36 11 -19 -61 6 -66 -13 -60 38 -54 -6 36 -50 63 -102 6 -4 -20 -60 64 29 19 44
1248 44 -69 -36 -15 10 -74 -51 -38 -76 -46 -12 -7 -21 -29 -74 -10 2 39 71 13 0 22 62 159 -93 84 -12 76 61 38 -63
1278 -63 -44 -14 10 64 -65 -45 -49 -11 -18 45 28 -38 94 -115 1 -53 -26 35 -41 -54 13 -67 -85 -25 23 -3 9 -13 -8 -14
1308 -14 18 2 54 40 28 11 58 -4 49 -127 67 -8 1 32 64 2 -17 -25 0 75 -30 -21 -37 76 -8 11 -49 -8 -54 78
1338 78 84 -17 35 55 3 8 -8 -62 33 -4 72 63 -42 17 -153 24 37 178 -9 -44 -61 -49 49 2 13 -151 58 -21
1366 -21 -22 -4 -30 -17 -21 -105 -27 -115 53 -150 -44 124 -132 -135 32 -74 10 80 -24 -3 -86 104 -40 35 24 -47 -96
1393 -96 -4 -93 -28 -11 -48 -52 -52 -27 31 4 -21 -62 27 -28 -106 52 119 21 -3 13 17 -40 -39 -29 38 -40 156 -125 -63 143
1423A43j12%oqr1O9P0m1o6J23n1j10J1P6N7j02pJ96j98O3j18L2N3K6J3o6Q5o0
1451a9l1J00j20P9O1o1q4M5R9m6Q9r9l0L9m7K6j6J6J5j58J07Q2q9J17p5n9j8n
1479h2Q5pk9N2n2K6L5m7J81k40J88j02l7J60r0j0%J7j15J36j32K9K03k07J50j70
1505e8M1O4K5j37L7N8o4J0P6n7m3Q4o5j13Q6J15m6j7Rp1k4J61k7j56P5O5J16j67
1533b3R2j34KJ34j02P4n1K6N4r7J06j52N5J13r9rj4j5pm0P9qm4O6p5J20q1Q3R4
1562A47r3m7L6o7J4K0M2j56R4RJ4m6J18j18Q5l5j8N1O3j47n7Q1R8k50J35k7O6
1589A2j04K39j05n1nj42J49n8J8J8K0J10j3l9Ml6N4j8j30J9N2Mm0m0R6M6oq1j1
1618c8rn6Q4j04J05lK5K1n3J60j47m2Q5P7p7j00O8J86k56J11n6o8Q4k1J8J30j13
$$ plain form
1423 143 31 31 25 17 -74 -5 65 24 -42 81 30 -80 -69 7 64 -38 -45 151 -47 16 -102 -70 -17 9 22 -44 41 -19
1451 -19 -50 50 -70 9 70 9 -75 -30 69 23 112 13 -17 22 -25 1 -15 1 16 -142 -35 47 -42 75 0 -59 -77 -82
1479 -82 3 -4 -33 19 -33 -7 28 -19 162 -78 110 8 -29 131 41 31 31 48 -67 69 -63 -34 169 -38 112 -58
1505 -58 -17 47 72 -65 -28 30 -34 -24 52 -5 -48 36 -29 -142 -56 59 13 -4 5 -66 -90 71 44 -112 -37 28 144 -23
1533 -23 69 -65 -63 71 -31 43 -8 18 72 -25 81 -71 -16 97 -2 -11 -25 -40 -47 -87 -8 -16 -60 6 -69 51 -30 53 147
1562 147 54 7 43 -24 -10 10 52 -104 -10 -1 13 -33 85 -33 52 17 -1 50 113 -34 -91 -10 88 -162 -27 -54 12
1589 12 -92 147 42 -9 -14 -156 -7 -65 -47 -29 -9 101 88 49 53 17 71 53 -77 -58 -6 -2 -42 -82 14 60 54 -27 -38
1618 -38 -47 -103 -19 -123 -18 -21 4 25 -28 132 -15 -57 28 105 28 -72 -4 182 -74 37 -19 -87 -3 -24 -6 124 11
1645A1%o3NK1m2K3K7J8k9O7r7R7r0Q1j0j2O9Lr1J8n3k1M7N0q3O1K0j21P3K2k8
1676b7J40j29P8p6j5Nq0Q2J20m6rq5P7Ok2j53K25j02J23j25P0K7n7l9L8k3pj4
1704a8J2J6j04J8J03N9k02J60l3nl5J4J12j29N9L8pj3j04K09l3j77J43j46j9L9
1730d3j4j7R9q1j5J07j09Q9Np1R2l6m4K3J22j32n5J05j7k0NK4l2o2P7j7M7n8O
1759b2M8Nj9N1r2L6%j17l3M6M8N9l7K0J9o9N9j8JN1p6K9J07j45N8qL9m4p2M8p
1790c5k1p2J55o1Kr3J33r4R3j13J07M0o1K0N9Q9j22j8o9K3o4J01k1O6MoOj42Q6
1819hN5m7k9k4N5M7l4M5o8J5L7j1J0L5o7j47J19q3R9R0j43L6j5P9j01J48r9k5
1847c1RnM0l4K6Lj5J26k38R9P7k15J13l1J66j29p4O1j1R8o6p0J89o5mj05K32k23
$$ plain form
1645 11 11 -52 -47 -26 -68 -45 -18 0 -29 38 -59 38 -52 29 19 7 76 79 -12 6 -47 -68 -21 29 -54 7 27 -94 -21 1 -27
1676 -27 113 -16 62 -14 -29 -24 -104 -22 98 52 43 -42 35 41 19 -134 91 -11 112 -13 57 84 27 -12 26 3 -4 -18
1704 -18 -6 10 -94 -76 27 86 -116 44 11 6 -29 -15 97 -32 27 65 58 45 -59 150 117 -60 83 -63 -82 -43
1730 -43 -57 -74 25 -56 -71 36 -73 16 21 -50 42 6 -38 -15 107 -25 -80 25 8 -12 -7 17 -15 -77 0 -17 30 -28 -22
1759 -22 26 31 12 63 -29 7 7 -110 -143 -97 -49 10 -27 -7 12 -57 2 -16 -15 36 -40 -11 96 -49 9 1 40 -4 -76 -28 -35
1790 -35 -56 -128 27 -34 -32 -125 8 -86 7 -106 1 41 -20 0 59 148 26 8 -61 -38 -102 -1 -22 44 48 42 48 -94 -8
1819 -8 47 0 -29 -53 2 49 15 60 -8 7 44 33 43 78 11 -136 -17 -100 -1 89 -54 -18 -33 46 -55 93 -6 -31
1847 -31 -22 -27 13 -21 5 8 -7 119 -119 -20 57 -158 -45 -76 90 -39 -113 -52 -63 35 -31 -101 88 23 19 -86 146 -77
1875g7M2jO6l1l7N2j2j2n0KJ58j05P2K1j81J14j27J07K2j47M0J06n3k0j9J09L0
1902F9q0M8j00J14j8M3n6p6N0R2o3m8J26r2oqn7J11j9m6j3J4R8r8L2L4q2M8M9
1931F6p3j29J12p1J15pO4j30J21j85L5J2J08qj19J41p6O2j42K7J05o1Q0m4J1j10
1957i6J6J09k0j26K3J47j68J45K9j60J9J94j53K8L4JK9k4N7j50Q3l8J30q4no2
1983d2R1pP2k8j57rK4P8m9j5l3O8l8k4N7o4K8r5J46n1qQJ08K3K0k3j64J08m1N7
2013D0j38J54j11P9j36N7q4L0J41j32k5M3l0R0j10P9L5J24n4K2n2k8Q5k2j7k6
2039A4Mo0N9k2M9Lk2RQ2j18l4j9J39j33L3K2M1n7mJ2K2l8L0j18K62n9n6j5k1k9
2069b4K9qK2KN2L3q4k4N0K4j08j2o6J74q6m3Q3M4j27O6Q5m9O3j18j4N8j5k8J6
$$ plain form
1875 -77 -35 -36 30 -1 -38 14 2 -10 -60 -58 100 -5 67 88 -93 21 -106 1 23 -124 -84 22 -31 -51 -70 39 69
1902 69 -11 37 -63 51 33 76 20 -56 -6 86 23 -25 101 9 3 -5 -62 49 30 -16 -29 -15 83 -15 17 51 -31 17 66
1931 66 -7 -136 -24 -95 20 13 77 -53 68 -117 -82 -70 38 30 -89 52 -24 38 -104 -77 28 -33 47 3 14 -96
1957 -96 -80 29 9 -117 -94 53 -115 30 59 -101 -82 112 -41 -13 21 22 51 27 84 -66 17 -21 109 25 20 -42
1983 -42 49 42 114 86 -71 -80 -56 22 -27 -42 -75 -7 -45 -69 -12 -76 -48 -143 3 -48 -56 -48 60 83 103 80 -84 24 -17 40
2013 40 -98 56 -55 24 -112 -55 -139 -109 32 -100 -125 -82 -112 -22 -132 -53 -18 106 52 74 22 -6 79 57 40 14
2039 14 18 -42 17 -5 44 47 25 34 116 -2 -36 -55 84 -49 -16 6 47 -10 -14 -2 20 -18 12 -106 156 97 41 26 5 -24
2069 -24 5 -3 19 21 73 106 22 -2 48 72 -36 -48 -114 60 -26 -69 14 58 -69 -3 82 33 96 -22 -36 22 7 -21 -5
2098eJ3j5m7K01j51j7m8J24nK3p7PK6r0N0J43j40M5j17J25r8J5K34k21K9p2j8
2125h6Q7%N3Jpk7ROJk2j91J77L0q4P3K5o9M1kn6k6K1R0L6j22m3RO6m1jJ18m0p5
2158d9R2qml6J02p4j68K05j15L7J23p5L1r0r3J05l3l6P7j22M5J85m7m3K7q1O2
2185A7oL8j31M4O7j01N4O9r5J41j08qjO9K2k54K28o5n4J6K0P3Mj8Oj5n2K2N9q6
2215d5j03J21P4j32J34j12N9P3k1j27P1p7J67n2J0n9j19J40J8K7r4J10j31Q5k6
2240iP3j43N1J5j76K03r5J48j8Q2k54J73QQ4k26O4L9mNK7n5j4l4O7p2O8rK7p9
2269e4J83k92K27p0o6M1p7K11j67p1J99j05N5kr9J64l2rr4J13j13n2N4o1J42l2
2295gn9O0j8J6Ql5n9R9K5n1K1L0n6N3p0M5O6r8o5k9J45j2k9L5j01j4P0K3P4r4
$$ plain form
2098 -5 8 -7 -54 147 -4 -21 -69 55 50 73 -4 3 29 -61 -11 132 -8 37 -80 45 -53 -38 196 -25 4 -68 -86
2125 -86 1 1 54 55 48 21 30 36 37 15 -176 1 31 -53 20 45 -24 17 15 -41 -67 -46 44 80 -42 -85 -76 -10 -51 -52 66 26 -49
2158 -49 43 35 31 -5 97 23 -145 60 -55 -18 105 30 61 -29 -122 -17 -50 -86 -9 -131 -86 99 52 9 36 -45 17
2185 17 11 49 -82 -38 29 -72 -18 51 -44 97 -11 -19 -20 49 71 -183 45 -20 -74 -58 -38 35 39 21 27 12 -40 -18 41 -45
2215 -45 -148 -27 47 -85 49 -63 -4 69 48 -79 -8 -85 82 30 40 -19 -138 2 20 47 -47 63 -68 17 -9
2240 -9 64 -79 -28 -13 -189 14 -81 67 49 131 -123 50 58 142 -84 -20 19 15 20 47 -8 -22 -56 11 -61 7 -2 25 -54
2269 -54 129 -163 64 -6 -72 -31 -108 103 -64 -135 64 -41 14 12 -87 77 45 36 -58 55 -58 -110 -56 -117 25 -7
2295 -7 -66 -6 -24 -8 0 -35 -94 5 30 -21 0 30 -26 27 -43 2 68 -30 -95 -124 21 9 -20 15 -86 -100 -30 -7 67 -27
2325b7P6p0ol3j4J41j7l5j10Q2k5J06j12p0J29j6J7n4N8M0j10J5NM8j08J46j21
2352f5m4J09qn3kM8j44J40J1j3OO4j13Q5j49J04P2o0O3mp7j3J3J5M5P0q5J9N1
2381H5j06K7j7k3R4r8Rk9L6QJ6m6o8J51m8J7jn1pL4j8L5j10K00r8k1k3L4lJ19
2411I8p7j3j32K36p0N9o3K1j03j3L0J9J3m8J34j36P3j4kK0m2K2jJ2j6m6L3O0p
2440D7m4%p0oQ6K8k4Oo4K2K6p7K12k56J15M3j7K8j16J01l7k7j2m8J81j73j4j0
2468a00J28l9Q8j45MK1k7J10J7K5o2K8m3j8M7p1N0pp6J26n7L1m7o4Q2R5j26M2
2496A2j28J28k8J31p8j3q4J11j07M6r4j6J97j52J53j41K6q2J59q4n1Q2K8K5k9
2521A1r6M1J15M0j14R%p9O2J3j01Q8%N5k9K9j5k3L5K8L5m8P8r1j3n5O7m9O6l8
$$ plain form
2325 -27 49 -21 -27 -60 -74 67 50 15 -95 -13 -38 68 -44 -114 15 -1 16 -38 20 60 -50 -35 -30 18 -90 56 -65
2352 -65 -109 0 -8 -61 -63 -15 -159 -19 -8 -21 -15 49 -64 21 -128 -24 48 -12 51 47 -30 -43 -30 -15 30 100 15 34 85
2381 85 -21 6 -11 -34 60 -38 -29 -58 -22 -14 2 -44 -112 39 -9 8 7 -44 -51 -17 -35 0 -110 90 -8 -29 -52 -18 -21 98
2411 98 21 8 -124 112 42 101 38 59 -44 -57 -27 -8 5 -43 91 -45 28 14 12 32 -10 12 11 23 7 -39 -6 54 47
2440 47 3 3 -67 -73 13 41 17 23 -41 -19 7 -70 142 -114 1 44 27 55 -61 40 3 -24 -36 -84 97 -76 -90 -100
2468 -100 28 -11 77 -68 -64 -43 -70 40 57 82 20 48 5 -13 34 -37 13 6 -70 56 -1 30 -17 -81 1 96 -30 12
2496 12 -116 12 -16 115 37 24 -60 51 -56 -10 -104 -120 77 -75 78 -63 -37 -119 40 -44 -95 -13 15 40 11
2521 11 -85 -44 71 111 -3 6 6 -73 -11 2 -99 -11 -11 44 15 44 29 6 41 69 104 56 134 43 30 -25 42 -7 59 21
2551B1p4p8J35M0q1Q5o9n2j3R7j26J34k8o9Q7kj04J34m0n8K6L5M7j1jL8j04N6
2579B5j34J78o7q5R5m2JJ05j62Q6N6j7j32K5O0J04q7M2j21J09r1M0j2J09j29q
2605e2L7K3M4j32O1J39r6j10M9L9K1M9k8j22J23j10L4O4n4K2l2R7jj05pj2J2M7
2633@j37J97j32R0rRj3K9L8j30J29k05K76j74n0NL8m9N3O9l7kK9p1K7l1Kj3P9
2662A7r2J32j22J41oj38Q1P1l5n8l1l2Q3lm3J7N5o3lp7Q7j20J89l2j31J15n2Q4
2690C4n2L9l8j0QQ5j26Q9J4r3N5o8nJ22l0r7J81q1m9l0J17o5m8m7J93p6l6J57
2718A43j92J10o3lk05J92r3RJ44jj78K14j30j0J08j9J54k34J5k2J03j01N1omR1
2744G3j04P2k9l9N8n4K0J08n5m6J6k3l3M1L3k8l4Mn1k2MQ1k6K7J1L3m8O4n5j0
$$ plain form
2551 21 -53 -131 4 44 -37 48 -21 -73 -86 11 -115 19 -9 -78 9 7 -97 37 -3 -61 -35 0 47 36 35 73 -31 25
2579 25 -109 69 2 -83 12 -30 -29 76 -86 0 56 39 -93 -68 -8 96 9 51 -70 39 -52 -12 -24 85 -44 -52
2605 -52 -15 8 52 -80 -19 120 24 -86 -37 2 23 72 44 -78 45 -65 -31 33 -21 1 -31 66 65 -40 -47 -59 -47 0
2633 0 -137 60 -72 18 9 18 5 34 72 -58 71 -134 142 -32 -82 -77 -39 -88 -35 34 -3 -5 24 -47 -20 -51 -49 -62 17
2662 17 -75 57 -65 76 70 -68 13 84 49 -9 -40 -72 11 8 -35 -18 37 -26 -29 -106 -19 -139 50 18 -113 2 -50 34
2690 34 -18 21 -17 -27 -19 66 -60 29 43 -50 5 -63 -68 54 24 -73 108 27 -22 -52 65 0 -48 -95 98 22 -14 143
2718 143 -49 61 -2 -5 -210 -18 -111 -102 42 41 -137 77 -53 -63 45 26 180 -54 -39 -61 42 -59 -8 -14 -18 73
2744 73 -31 41 12 -27 31 -23 -3 105 50 4 20 -3 -36 5 38 10 -24 -20 -71 -93 -89 -8 -34 -7 4 37 -11 53 -2 -12
2774a2N2l5M2k3j13J49l7n8K4nN7n0N3O5j90J64j47J21K4K2j36K6r3J9O4k1Q0
2801D2j00r5J42K7on2J9P9J01j30O1n7n0o1J22j36N6P2Ok4p0O5n9MmJ03K5K2j23
2830b1P3j08J04O7r3N5km4o4jM5L6q5Q7o3P1o3L1o8k2N8P6L7j33l3K2N3P4p4J10
2860A25o9L1j44J32j38M4o7J64j38K53j12q3N5j79J61j4npr3O7K6J9P8j64J40
2885H2j4o7mr2R4K9q3K8J8L4o9L9M7j41P6J86j47M6m0mM3l2m2k1oQ7j5j01R5j1
2915A5M2J4j52J96k52J75o1Nj23J40N2j26J6p6J71j36K16k17J11l3M6n6l0P2n3
2940d4J05q1L0k7Jl1J4J16m3k05J32P0K9j5j82J39m4m7J20q4Q3l1L3k03M8J35
2966A8m5j8J17l0L6L9j95J9J1rJ81o9J15k06J3O0o9K9J4n4J05k3q8R7j13J28J91
$$ plain form
2774 -12 40 5 47 24 -89 60 23 -35 -11 -16 41 -9 44 109 -81 83 -64 57 81 103 -33 -7 -100 -81 -17 -38 42
2801 42 -58 -153 -11 16 10 -42 -23 56 157 27 88 31 -19 -80 42 -94 -38 34 40 16 -54 11 -48 -44 -48 55 80 102 -21
2830 -21 52 -56 48 115 22 77 75 31 -33 -34 11 47 -38 49 -14 57 -6 25 -43 -65 -7 69 106 -27 -60 -38 15 89 15 125
2860 125 56 87 -57 75 -63 -19 -86 78 -60 193 81 -2 53 -126 35 21 16 9 -84 -17 9 28 106 -58 82
2885 82 68 1 -3 -95 -1 28 -55 -27 -9 25 -44 -5 42 -99 -23 163 16 62 22 18 61 29 -13 -34 -40 47 32 -69 26 15
2915 15 57 71 -81 115 -137 38 -23 -18 -141 -1 51 -75 -59 -135 36 -100 116 -101 10 -23 23 -33 -63 9 -44
2940 -44 61 -20 10 -17 -16 -47 -33 83 40 -165 -33 37 66 51 -131 8 -36 -83 37 -47 36 5 38 -165 -117 18
2966 18 -27 -45 72 42 78 117 -78 -59 -48 -57 124 55 170 -36 -23 37 -32 -3 11 -43 62 39 -49 48 -65 63 254
2993B54l00l3O9k6J7Jj4n1J82j9q1k6nRJ8K02j31j56J47j1nM1n8j9K2o0P3p4K
3022c2lM7O0n6l6L9K9M9r3L8k5l5nJ02j07P6N5j27k1J26q0j69J60k5l3J72r8j20
3050a12K01p5p9j9J52j36R0l9J09n7o6N4k5pR2m2l5n0JJ69j41l3M2jJ00p0jM4
3078F6J4J04j75M7O0j63L8L6J6k9Q3o6q0Q5j01J78j10l5P4l0m4K5q6J16m1m6k4
3105h8J36N6j18R7j71N3OJ05L4k52J75j46R7K2rj10J37k3n3P7k2K8J02j07O3n0
3131C9j62K30j71J02j6J5j00O7p9J29k04J76K5n3o2l5K3L4k0J1K5pP6j50J00n
3157a2p5M8L6q3K22j29O6j80J51M0j72m4J03J3j2N2k5L5j22K34j66q5R1J5Nk1
3183a5J19j00j2l6l8J33l3r6J50m5m4J7n9J06l1mq0J35L1l8j33Q3qq0M3mL6O3
$$ plain form
2993 254 -46 -79 -10 -36 -19 -18 -32 -83 99 80 -1 -27 -32 -23 -5 197 66 -90 57 46 41 82 24 5 27 -33 40 -34 -32
3022 -32 -35 12 72 16 -20 19 48 97 4 42 17 -18 -23 79 -28 48 103 -24 -45 81 1 -168 -8 -33 -66 106 8 -112
3050 -112 89 14 -65 -84 68 -68 22 -17 92 35 -31 23 -2 -9 83 41 6 -44 -43 126 -15 -48 -6 -7 93 23 22 66
3078 66 80 184 9 56 116 -47 -9 27 43 14 97 31 -49 36 -65 113 3 -32 42 12 -32 -7 -93 23 -18 -64 -88
3105 -88 48 104 -14 83 -88 -35 -29 76 110 -142 33 -113 -16 6 -3 -113 24 1 -52 25 3 31 133 26 89 39
3131 39 -123 107 -64 38 22 37 -63 4 -75 54 -150 26 51 -2 -64 -99 -76 -42 -62 -51 -26 -33 43 -107 -7 -12
3157 -12 -87 -39 -3 -86 136 7 73 -107 44 84 -88 -132 -29 -16 -28 24 -1 34 -88 146 -20 -105 -14 1 6 -15
3183 -15 104 4 -8 -44 -82 51 18 -78 72 27 -17 0 -59 47 16 12 -68 67 98 60 -73 10 2 -78 -35 -39 -3 60
3211F0p9nQ7K5j18Q5j45J38L4n4j4LM0j15J31m4J35k80J12Qm2m5L7K6m2N6MPJ0
3240A5R1m5p0L6n3N0j06J00kj3J5%q0N9J26j77J2N0n1J54k08J29n5Lp2J82j36
3267d6P0J2o4M3L1k0pN2j97J36k0j17M6J15m5J1n3R1Lq1NN9o5N3r9J09o9n4J34
3296C3k1N1k0j00M5m5j5J8Q8o2J0J6L3P1j33n7O8K0Q7j48L8J2K5R5j83Q3L8jL3
3325G9L8j29OO5RO0j07r5R6o2J28n5o5L0M6o9L8N0l9j18N3M6J8q2QpJ28m5l5P
3355cl4J06j18pN4m6O0j2J1P0j14O0L6p8J8l6j7pJ49r7M3o5j3J5N5n9J13n6P5
3384A03k05J37l4K7j1J4pN1o0l1J5KO7L8q9P9q0nj3N4p8J25o1Pno8J00kq8q7J20
3415A5n0QR6r0NM0K3J4j38P4rK6m0oO7P9q7P5j85P8r4N6j7l2P2%m9J42n0M4p6
$$ plain form
3211 60 -19 -24 63 88 -30 55 -90 48 82 28 14 17 57 -58 73 29 164 -116 -4 4 -38 -83 -46 -20 -62 -6 -2 5 15
3240 15 106 61 -9 27 -26 24 -82 18 16 3 18 18 -62 -3 123 -54 -42 8 -43 111 -97 32 -23 -20 -92 90 -46
3267 -46 24 36 -28 15 46 26 19 71 -126 10 -10 -127 -81 34 -11 0 -53 38 41 -40 -35 24 -41 12 -87 22 -47 -101 33
3296 33 12 63 43 -57 -12 -57 -72 -54 34 -28 -18 -2 31 102 -31 -88 -20 0 87 -61 -23 -11 14 109 -74 9 47 46 79
3325 79 117 -12 -6 59 68 128 21 -74 22 -40 88 33 -32 -2 44 -25 13 63 24 -94 -41 5 23 -59 -51 -58 70 25 -10 -3
3355 -3 -37 69 -49 -56 -2 -48 12 0 11 81 -33 27 63 -15 3 -33 -50 -57 92 -5 38 -27 -40 -25 30 -29 84 28 103
3384 103 -102 35 1 28 17 31 24 75 15 -16 -1 1 68 106 17 96 16 11 -2 52 -26 99 38 45 40 -28 72 70 -18 -105 15
3415 15 -35 -27 69 -21 -16 24 47 61 -77 -3 -12 14 -26 -32 35 114 27 102 -83 -5 -99 -43 -60 -92 -20 -20 -69 73 23 67 -9
3446ij8o4O5RJ74j05m6J9K1n9l6M1J7k6K7n8L7N4mn4O5j3r2QJ59j4r0m3N2k6k1
3477c0J07n8o6R8j3q9J16j23M3jO4j7L0n2l3N0j70P2M1R5j60J16Qo7N3p1N9KO9
3506G3j12M0o2J38q8r4J30p3J82j09n8j7O1J3m5J30k05O6Ml5Lk4J9J61r8l4J54
3533A20j15o5J77o7q3J39j78Q0l0M9r3M6N0j09N0J1O6Ro1K0k0p5J20M4j45nQM8
3561ik2pm5L6J27j14Q3n0L9m2L3j29%J23p6L6r5P4K0nM4L4J3r3J40j61P6Ln4j12
3591a33K14p5M5l0M4p3L0M4k2l7m8R2l1k7m2PNP5l8m7m2J22QJ2j16R6j08j1N0
3620c6l4M5jr2K15r6k0M7o2J09j2j72P0J70j78R1j18O9m8J11m2j03P0Q3j10Q9
3646D5j92K20m5j81J92J6r1lJ4K0l2J0K4q2%M6m1J03qj7o7Q0Kj16P0j2K28k73
$$ plain form
3446 -9 -27 -91 -26 -17 157 52 6 25 46 -13 -49 -8 9 -17 10 -48 -11 43 39 -15 50 37 -55 -47 112 98 8 -35 17 -9 -30
3477 -30 77 19 -47 51 38 -51 65 -58 -15 -16 48 31 61 9 -24 26 -144 -72 -31 64 -96 20 28 -39 14 -57 2 4 73
3506 73 -39 1 -61 77 -11 -105 25 -48 134 25 -33 -50 11 24 -21 109 -96 -30 -26 -61 -58 -82 -63 98 0 -34 120
3533 120 5 -60 117 50 -33 106 -72 8 -22 27 -66 -20 30 -79 -29 -18 48 57 -4 16 -4 -79 41 85 -60 -65 -57 -9
3561 -9 -31 -38 -83 -47 80 -34 49 -1 38 -4 29 -100 -100 23 -53 -17 -112 -38 -18 -23 21 55 68 -25 115 -46 30 33 -21 -133
3591 -133 81 6 51 21 65 -8 22 66 44 7 -41 51 20 -7 -49 -42 -37 38 0 -47 -89 33 41 53 -63 33 -75 -86 -36
3620 -36 -70 -25 -26 -118 97 1 -19 28 -34 75 63 -109 -39 131 -47 44 -74 -5 -53 58 16 -87 -17 66 -44 45
3646 45 -147 73 28 -153 39 55 -36 -39 -25 -5 -37 -27 -3 -85 -85 -39 -80 23 15 -2 -69 11 13 -103 -33 -45 183 -90
3674i0O7J03r8j0k8L2K4K3nmK00k68J32j76J86j43M5n5R9m7o1O8R3r5L2j26J09
3701GJ29k45J07P9j85J26o0jQ9l7R7j30n3J7JlJ69j09l7J36q8M2o6L1N0j31q1
3728a46J98rQ4r9k1L5o1K3m9%L7J46j25k0J1Q4n9M4j28J4M6lo8J56j04L1L1m7
3756Al6L9q7K6K0k2k6lM8J1P0p5RL8J6J20j06j37P2l1J13j02O4n1j05O2J13N9
3784A00oj64L7O5q5QN5q9L7P8m3l6k2J25p7N8p0N2n5n7Q9K7r3O6QO2n4n1m5R2
3814A2K9r4j0P1L0m0O0J4p3q1O8j0Q6K6j50Q4j78K05K2q3n1J56j13j07J38k7Q3
3841F7l3m9L7J1o9L0l3K4J0r5J05j2K9J2j4m1l3P2p5M2m9K8N3r9NP6r7Q1L7j1
3871IN0o4Jq4J40M4r8J3m0L5J3j3L4p3O5m1J9l9l1Q7k6n8M2L5k7n8O3J12j7n8
$$ plain form
3674 -90 -23 80 -18 -28 -56 -24 0 23 18 14 214 -54 78 -98 88 -55 -10 -65 34 -13 -74 -6 87 -8 24 -102 7
3701 7 136 -109 -2 77 -108 18 -42 -43 46 9 106 -24 -77 -60 -59 -62 107 -2 -39 97 9 51 -15 16 66 -65 -146
3728 -146 52 43 127 28 7 42 -19 4 -45 -45 -8 138 13 -7 4 88 29 73 -55 -41 5 2 -66 90 -14 17 48 1
3756 1 -35 4 -83 -57 -37 -59 -85 -88 -40 -29 41 -34 -25 13 29 149 43 -94 -22 -53 60 -42 22 -29 -134 -72 41 100
3784 100 94 -70 -33 32 -53 -45 10 -79 -42 36 -7 -43 -65 60 -17 41 -29 23 -32 -89 0 27 -66 0 8 70 16 -35 -80 12
3814 12 41 -53 -63 8 38 -2 58 72 -1 -82 -14 -24 62 88 -62 22 -156 49 71 -12 -63 93 -20 -127 11 -16 67
3841 67 34 -15 22 33 -36 -6 -39 -15 -5 -100 5 -7 22 34 20 -21 -54 18 -57 -15 -64 -36 17 -82 -77 -1 -98 -17 20 9
3871 9 59 -5 -4 -88 52 96 -2 11 -29 6 19 6 40 -33 32 -9 10 -29 -60 27 1 -57 -15 20 -7 -65 -2 110 93 35
3901C5M8rq9L8k6n6J20n6m4J07j21O4p1L0m8P2J63r2r3J07q8j5R2j14Q8rj1N8
3929H0j34k7N8K7m1N7L6o8n3K3M0m1K0O3p0nN0n1R9o8jP3j42J04K9m7k5m5l1j
3959i1M8N9N7j16L4K4N5r4k4mJ17j27J44j27p6M3J39m1r3m1J70m0Jk5q8rQ2j9
3987d2N8n7r9K07n3n8J01L1j23N4O6k8kL0m0n3l0MnN7K7r4P0j35N4N0K8m7J44
4016A15j21P5m8M5jp3K3J17r6N0l8K3L8j38M4m1%R1p8q8J25Rj46Q5lK9qN5M6j55
4046f4M6P2j22Q7l3N0p4k9L7Q6j25J30k6N0l0q4M1M6m1%o1N7%m2Q4j0j1J7j1J0
4076E0M2j30P3nK3k3j4Mm6o3P7K4n4J32r0Nq3L9m7R5J35k28Q8O6j40nQ1N7N9j57
4106c5j00R7j2J9J8o2J02j95J97P3n2m0j8m0J06j50J22l9jp2N0Q7q1NK4j04J63
$$ plain form
3901 35 83 74 -15 23 -3 -59 61 5 -39 68 -53 11 -60 -30 -78 -6 157 65 -28 79 -9 -24 68 -46 42 33 22 80
3929 80 -54 -81 -23 4 -37 20 56 -12 -65 -42 -2 -43 -23 40 -30 -35 15 -36 63 -5 -6 67 -75 29 58 11 -14 -59 -90 -91
3959 -91 -43 16 73 -43 -9 15 70 -24 -48 -52 65 -62 82 -45 -121 -78 61 20 -73 -114 56 16 17 -8 -96 -105 -23 -42
3987 -42 16 -41 -140 67 14 -44 57 88 -35 19 85 57 55 85 45 -8 -38 -34 -39 18 45 -49 21 -114 -60 -10 18 -29 115
4016 115 -6 69 21 66 65 -8 15 132 36 86 48 71 109 -29 15 -26 -26 65 -13 -101 24 33 -113 -28 -31 -2 -10 45 91 -64
4046 -64 -18 54 -68 19 -14 36 -38 -67 -30 56 -69 61 35 85 55 -29 12 58 17 17 -44 13 13 -29 55 45 34 51 40 50
4076 50 92 -38 35 30 53 30 16 20 -26 -89 -12 12 -42 90 0 5 -78 -39 -86 9 144 -84 4 70 -70 -75 6 63 122 -35
4106 -35 -135 -38 -50 -31 -13 -75 27 -168 29 102 50 10 -8 -48 58 -92 30 -9 -10 -82 -32 55 -26 -21 3 -101 62
4133F2r8k4K0J28j18N1k4J17j17kN3n1M5j51L8O5L4k03J46lJ07k2k13J66j4J17
4159A09j15qk3O2M9j00N5J0K0j3j06R7j10P2j7J2r8K21j22j7m8M4M4J8j03J01
4185C4K6o9n2M0l1%P7M3l8j12Q2j9k6P7k9O7p2J6J11j08l1P2K2p2m1R9n8P1J4
4214I3j16n3J23K4m9j12R4m7m5J42r8N1m6Jk0J14j25P2O8j33O9K9j1o5K8L6J8
4241D2j1r2m3P5n7Q6O9k80K57L0q8n3J29l0j09J75j07Q5j19O8n2J18k6k2j1N0
4267H4n8oq0K3k5K07j06j13Q1m1M9l3Q2O6j05k9J36j0j23Qm3N1o9P3q6J26l1r8
4295g0P0Lk1l0L1q8O1M6L7m7n1N5J3J4j3l6o6Q1K2j3m7L1L3n6J63r0o0J1P1N4
4325A08q8k1k6%J39j33L5O7%j26N8J11l7j71J67q0N1n2%j9p7J98n9l4j16R7L7
$$ plain form
4133 62 -36 -60 -40 88 -30 21 -3 114 -3 -5 48 -3 42 -109 -71 -6 28 -175 -29 -32 75 53 -160 6 -8 109
4159 109 -6 -14 -37 25 74 -26 29 39 59 46 -60 37 -73 -1 -18 -6 -104 117 -5 -22 -70 -26 18 36 -67 34
4185 34 60 -9 -61 -21 -52 -52 25 68 30 -82 0 -19 -45 32 3 70 -2 14 125 17 -14 58 80 8 -33 66 8 79 93
4214 93 -23 -76 47 71 22 -90 4 -43 -88 54 -44 7 -39 -38 -58 56 -69 3 71 -62 7 36 25 -40 -12 24 42
4241 42 31 -61 -104 -29 -86 0 69 -211 46 76 -12 -65 64 34 -75 100 -7 78 -41 27 -25 93 67 45 34 84
4267 84 26 20 -60 -37 -62 145 39 -74 7 -34 15 -18 64 130 25 -4 132 122 -1 7 -36 15 -54 19 -67 59 28 -70
4295 -70 0 3 -18 -48 -17 -105 -44 2 39 -8 -59 -4 9 23 10 -26 -92 -11 11 -2 -49 -18 15 -41 122 32 -28 -17 54 108
4325 108 20 -1 -27 -27 112 -21 14 81 81 -45 13 124 87 -84 83 3 54 2 2 -17 -94 104 45 11 -105 -8 29
4352B9n1Q0k2m8j15J92j34J13j82O0J20m7j0J05n4k1k1P9j01O3j0Q0j66J81j73
4377e3j4K9J7N6L3j44O2o7J20p0J0RQ4q1l8KJ03j38j4N8j4J66m2j1l9P5r7K0j09
4406h7O6K4k5M7Nl0k6L5q1Q0o9R7p0J4N4n1n8J09p7J41j20q8L7K0J03j69K09n
4434H5j09M2j15R2K7lM7k2m8j9J2L9M0m9m0J5M8J1Q8j56J38j59K8N3m5R0j20L2
4462Bk8Q7j39Q5j13R7L3m4p0R6J11k30J60r0N8O1r2j9J8J08J5j90J06l1j8J8N5
4489D6j18j7L2j0k7P5m1Q0NR0q0l2o9J05j55Q4j7kN3P7q2NL3L4j38K9R0j89R1
4518d8J7m8J44k5j34R4R6o4K4j18J62j64K8p8K15Qj45N5o0P0p7R9M4q6Lo2j0M1
4546a9J32j02L5n6m1j9J59l9j0p9KM3qn2J42l9j19J64n3n6L9Nj18K7k4J69l0p1
$$ plain form
4352 29 -22 58 36 -12 -127 65 -69 44 -138 -78 42 -5 -15 90 36 15 -6 73 -28 35 25 105 -61 120 -53
4377 -53 -67 -38 -21 35 68 -76 -14 -81 39 -31 -21 -12 72 -9 -47 -45 58 -80 -94 -36 -50 116 74 63 24 99 2 22 -87
4406 -87 -21 3 -22 25 30 0 -26 9 -72 8 -61 36 -34 -20 34 -17 -75 34 -43 98 -22 -110 -73 -53 50 -119 90 85
4434 85 -24 18 -97 -5 22 19 66 44 -4 -23 -11 28 68 19 -21 -6 42 53 141 -15 123 -36 -8 45 0 90 -30 2
4462 2 -26 61 -78 7 -106 -9 24 -20 -90 6 117 -113 47 -43 15 76 -16 -35 -17 91 106 -84 22 -9 -27 -9 46
4489 46 -72 -89 -57 -67 -94 -19 -60 20 25 115 35 3 -66 39 -116 -32 -49 -51 2 79 -3 2 35 69 -69 -40 50 -139 -48
4518 -48 -31 -79 65 40 -94 0 96 32 56 -62 100 -64 -36 -114 101 109 -36 19 -41 29 -48 51 95 9 12 -50 -60 -19
4546 -19 113 11 46 -10 -51 -70 89 50 40 -39 -37 6 -2 -54 88 49 -70 94 41 -15 24 29 -89 -62 -86 83 53 -18
4574a8N5o3q1J96r5k2K0nJ22j28J8m9KR7n9p1J13k4m6l4J45k0q5R8o4j8J14j4
4602H4j93J61p0Lk2Q0r2K3k2K7l4n9Q0N9jj57J46P9j02pq8R1L1n1m0J39P0j19
4630A6Rr0R0M9j62J55n2n3K6o3jP3o3k1J32J9r9R8j57J91q6o0J11r7N0Q2o7j04
4658g4J14JP4j80J17LK9j51L1M2P0l4Mm2p0P8J1K2q0j3J04rj1Rj25N6P9O1j89
4687g3M1J33k49J16M6k8N3q2l3J39k1p4j28K25j12N7j6j9m7L6J20k9o5l4j4o3
4713a21J40J02j71pJ42q0JkJ05o1j02Q2J4k4J09r6o9j9J7P1l4JkP5j1l3p3N1r8
4742i3K9J01l6K5m6K5n8J30m3k7M3L2m0N9k1m8nL3m2l0L4J9r2J55r0q7J34j44
4770h3rJ36m8j4M0K0mp2R9m7m5Krl2J00qk6Q1j15M2K9J9m7k6k2o1J10l8J6J1J5
$$ plain form
4574 -18 37 -26 -107 89 -6 -28 -8 -13 109 -19 -1 -50 -48 49 -10 -81 32 8 -38 -72 73 53 -32 66 2 -16 98 84
4602 84 -109 52 -18 -15 -37 43 -49 -26 -48 -21 -55 -114 -34 25 24 -133 13 92 -10 -17 -105 -14 17 -34 -74 65 135 16
4630 16 25 -65 25 74 -88 67 15 -38 -12 -75 -76 -3 -66 -87 45 64 -35 63 -94 97 11 -49 62 -35 15 97 30 -74
4658 -74 40 41 115 -65 52 55 84 -67 -36 6 76 42 46 4 -66 12 23 45 -35 -48 56 47 36 45 -80 -24 55 116 -73
4687 -73 -32 101 -148 -32 14 -14 39 -43 -76 63 42 -32 -160 65 -47 10 -6 -25 -72 -36 84 55 -10 -44 -58 -121
4713 -121 19 121 -50 -57 85 5 6 4 109 48 -54 28 42 18 127 31 -38 -57 -40 31 -3 -2 -4 71 60 27 -46 5 -93
4742 -93 -64 37 1 26 -20 5 -53 77 34 7 50 82 42 101 80 32 27 60 18 -12 22 41 -51 104 14 -73 61 -83
4770 -83 -92 44 -4 -18 22 42 38 -34 65 18 -27 -25 -34 -66 34 26 0 81 -34 8 37 56 9 -17 -39 -100 10 -28 -12 -1 14
4801A4R2r9P0M5n5j6o8l0k1J16K3o6P7j36J47j7q7j4P5j26J18n6K1J9m7J3j7Q0
4829E5j41J48j27j3J45q6QQJ0K6n6Kj7PM1n0J8m3J82j29lK4K5Mj18NJ37r2k1J90
4859A39j40n6J45M0j89n7Q0J5m3J06j39R9P3Lp7L2j92Q0MJ3p0J35m5RO3m2M2j12
4887h4P2j1Q9j18L1J1M9j36K24k09J31j60J95m2j0K6%J4o8K2n7M7om7k01J97m0
4914h1J12O5n9q3j8O4J6r0N4K8N2j12L8n1J02k9o7O7j5k4L2J3P6n7m2j04N6P8
4942B1o6N1n6P3J7L2r8O4o9L4j12J38n6O1q9m5RJ53j54J44N0j25PL2O2m8l4J01
4970I7n1j91O5J03J13j32J9K7l0M5q9j6J4m1Q2Qj20Q4k9O5J00j67jM4Q2j07LP3
4998E0l2j4K1jj02kL2q4J93m7j8J8k6m4N1k0J3n6o1J26PM5o9P3j25Q9nj13J20
$$ plain form
4801 14 106 7 77 122 67 51 -17 -47 -68 48 71 5 82 -54 93 76 -11 -25 50 -76 42 -14 7 26 -21 -8 -25 55
4829 55 -86 62 -65 -78 67 -19 -11 -3 7 33 -23 -21 -38 -31 10 -40 -22 -65 117 -12 -15 9 34 38 -80 -75 62 -30 -51 139
4859 139 -1 -57 88 128 -61 -118 -38 -23 -66 40 -99 0 73 76 -1 31 -161 -81 -77 -64 -134 1 -44 -35 28 -14 28 -84
4887 -84 -12 -23 66 -52 -21 -10 39 -97 127 -82 49 -111 84 42 32 58 58 72 4 26 -31 16 10 -37 -238 -41 -81
4914 -81 31 96 37 -46 -64 0 16 -74 -20 8 60 -52 -14 -65 37 8 -59 8 -7 -31 1 14 90 33 -9 -113 -57 21
4942 21 -45 6 -50 23 40 72 -26 38 -31 3 -109 29 -27 34 -55 -100 -91 62 -92 52 102 -23 -16 16 78 30 -4 97
4970 97 46 -145 -80 23 136 4 23 50 20 65 -24 -40 -26 -67 15 23 -97 -13 -42 23 123 -44 -45 -1 81 -26 -23 50
4998 50 18 4 25 24 -78 -80 -48 -132 61 14 -4 14 -12 -56 -5 -25 -12 -68 -129 -3 4 49 -20 53 -72 17 12 -101 19
5027A9j1njO0o1j37K12j5j20J34q9N6j84J29kP2k6J6m1m2n3K43j31nK0j48O5o3
5055a08J60j49N3OoN7j04J59rp3N2l0j17J94j26R7Jj6l7L5J0j07J93j83J25q9
5081a2J04o3k5j0j3nJ0j6R6k9m5l0O6M0j11OK3N9j38L6L8J14ON5k71Q7m7J48j30
5110e7J79j39j8J5o0J62N8j68Q9j1j1Q1l1j04l2J45j14l6Q2o1J7K0r4J40k1m3
5136a2m9J54o7k3Q1j50J09ql6P4p8K9np3O6j57J15O1kK4n1j09J40on8l5J18r7
5164d5RN8L6K4k4q4R5n9k4q7N9PQ4q9M7k5k6j5k6O3j7Q1p8Q0jj12J55p3Qn0K7
5195bPj7O7r4o2L9Q4p2O9k0l7N0o3M1K5P4Rj54M1l0K1Q3n2J1K7r6m1k5R8lN4l0
5227BOL5n9O4k6qo0M1O4l2n6P7J1m2o9kNJ0o6J70j9j41L3K1p7P4LJ11j27O2l1
$$ plain form
5027 19 8 3 2 62 1 -136 76 61 -59 75 -14 42 -142 -13 -15 57 31 47 6 -36 -89 154 23 18 38 -110 -45 -108
5055 -108 52 -97 -44 -38 -44 13 -91 68 59 -14 38 8 -109 85 -41 56 57 41 4 39 49 -58 135 -48 77 -12
5081 -12 92 29 4 -6 -19 -24 -14 -30 66 37 -8 -38 28 68 -43 -37 -14 45 -93 -57 -19 95 101 156 -115 -28 -75 73 -57
5110 -57 122 -17 -35 -20 -80 82 140 -28 61 50 39 120 89 -15 -47 98 -16 -52 30 -31 -14 6 -88 52 31 -12
5136 -12 -61 93 26 3 84 -66 43 35 -1 73 -5 24 19 -54 12 -145 -30 31 29 53 2 -107 33 27 -31 -66 52 -45
5164 -45 -36 22 58 82 58 -26 69 10 -14 -101 -42 -35 49 -40 7 -18 -44 -59 -85 -22 -39 42 -36 44 43 -69 86 13 21 -29 -2
5195 -2 5 -12 55 -39 -101 -62 22 -50 19 -1 -38 12 -51 -10 15 89 98 -56 -15 -45 -24 59 7 18 45 -51 -92 -117 -19 -22 32 2
5227 2 8 43 -16 48 22 14 -46 -5 59 27 -29 48 59 17 -52 -54 -49 -39 -105 65 46 -95 -62 -41 -118 -44 -41 70 -57 5 -26
5258b6N8j06RN4k6Q8k7L6k6p2J4k0J05l5l5P2on4j16J24kpj7Q9jj5p3M3J0l3O2
5289F7j01m0J06l7j4j7n2R5K8j6o9J8J04J2o7L6j4p0m2J11m7L9J9j08J3M2M2L
5317D1o3j3Q4n9M5p8KJ22r0m3K9l7O6JJJ8q0j00J42O4k8q9JP8Q1j8j66J40q7K9
5347gJ39j69Q2Oj09nL0M0J8nQ6r3Q1j26M4m1M6M2Nj8m5N3j89J17J39j32O1p6N8
5376C2j03qL7n7L0m0L2J57m5l9J05m8r8J02m8Oq1N4O1j03P3q2J5K9L1L7j05OR3
5405D3j33N2J13j50M2n0O0Lo9J6J70m7j6j52N8P2J9n9J23j13M2o2l6Q4pK2O5p3
5433A7K9k1k1p1N1K9p9j6M0K0J7J5J38q3j08J66o9r8p3J73q1O8J5J5r2n3M1N6
5461B5ok1l3l2JLO7P8q8J9K1j80J16N8n2K8o1M9n1Q8J32j90J17J2k63K23K9o1
$$ plain form
5258 -26 32 -74 -65 -11 -37 51 24 60 34 -38 -24 -44 61 26 -9 63 57 3 -113 11 9 2 -15 74 73 58 -15 28 38 5 67
5289 67 -34 -74 32 -5 -19 -36 -88 7 35 19 -50 -32 72 84 17 53 39 -31 -73 38 -9 30 49 -59 -46 -4 38 41
5317 41 -22 -35 49 -10 35 -43 -41 81 -9 -52 -23 -60 6 7 8 26 -54 -154 -12 52 24 -65 -64 14 95 77 -89 51 -36 -7
5347 -7 132 -37 45 51 -58 -63 -33 7 25 20 106 13 94 -32 12 -29 17 59 64 46 1 54 -135 -18 121 -11 50 -26 32
5376 32 -71 -79 -42 -99 -69 -109 -77 80 35 -4 101 53 -45 57 9 15 -66 -12 49 -54 19 -63 -48 -19 12 49 -56 -50 43
5405 43 -90 -38 75 -75 -33 -83 -23 -20 -89 -73 97 50 34 -118 -60 12 31 -28 95 -18 24 -38 -74 10 3 25 90 17
5433 17 46 25 4 -67 -16 13 -66 -82 -42 -22 -5 10 148 65 -43 123 54 -44 -117 56 -25 43 58 73 -19 -72 -31 25
5461 25 19 -2 -35 -67 -66 -63 4 82 -6 13 34 -146 -30 28 -24 4 -57 -8 -59 29 161 -29 88 100 -163 60 89 28
5489B8m1k8R1pj23K3kO7J45q2j08K9K1q6OQ0l9J00j2Kj97J58J63j73M5k8k2l8
5517b8J2P7r3M4koMj19J21J8o1Q1m2K0oN8q8P3j46N9O7m8RM0j33J27q1Q1n1L1
5547A8nJ23j04Q3q9O3o0j33R1n9J53mK0r2N5K8p5L2N0p9O2j43R8j82J32N0kj3
5575A8m0Rk7P4Q0q3K2m9P0j17J17j24JQ7k6J0p4Q1k9r5J55n8j08m5K02M6n2k7
5603A8j3K4o8J38r5p5J04n3k7R9m1j01R8pM4j3n9l7O8M6q2J04j24m4J65j30j1
5630g2J11lj51O6P0RJ5Lp8M1l2n6K6K9J05n4j9o1J17p3PM8pj6J71j47N8r7j5N9
5660E4q8m2J59n3o6J12p2o6L6L9q3L7j6N0PnJ5j28K23j61J12j3l0L2k8k1k7j0
5688c3M1j6m3k1KL5%N5j17J54l4on0j19Q9P6Q2K1j22N3r5J2l5J16j28M2J01k3
$$ plain form
5489 28 -13 -41 50 43 -80 -57 -59 8 153 71 -37 -8 13 -73 -67 13 -26 74 62 64 -133 25 188 15 60 32 10 -28
5517 -28 -16 61 -32 12 10 4 8 -111 10 28 -33 48 6 26 20 78 -10 63 -83 -24 43 -5 4 44 -89 38 -43 38 -13 18
5547 18 13 136 32 115 26 89 29 -104 -13 -72 81 77 97 5 60 88 13 45 95 16 78 -65 33 -149 -17 33 31 18
5575 18 -22 -13 -40 34 114 31 53 4 74 -43 74 -50 -49 38 12 22 -52 29 0 -95 60 2 -106 -151 51 97 45 18
5603 18 5 29 -39 99 4 -71 33 -20 -47 52 11 -90 8 1 45 32 -27 -64 4 50 -32 72 -52 -96 69 -61 -72
5630 -72 39 36 -115 -49 21 30 45 48 -30 11 -21 -77 -51 -22 83 29 10 -51 66 -7 0 48 41 25 196 49 107 10 -5 54
5660 54 -34 -76 83 30 -36 76 4 -62 -26 13 -70 -33 -49 1 8 3 18 -110 113 -48 64 51 21 53 25 4 -23 -33
5688 -33 8 -8 -51 -72 -70 -35 -35 20 -97 57 23 17 -33 -152 -63 13 95 116 -6 47 -48 -36 -71 45 -83 -41 60 37
5716C7j4o6Q4j14J07j59N3K4N8Ml2l4j6J53j99J47r5P0J2Q5q3%n0k8J01Q7j77
5743d5O6K2L4j21O0Ql5J28j41K9J03m7n2J0n4k4k7J32j09O0K4p8J26j03m4R7n
5770A4l5L6%P1j8q5J41r3j17J19N9Ok1j15Q7j22Q6N8j71J06N9N9n4j08l1J45r2
5797a6n1L7O6q0M7J14k36J16L6j2o6Q4j71J37N8n2m2O1M8o5%m3Qj7L3Or5M5M6
5826dj9R0j35J91Kj32J06j74P3l8J26p3J8l4n0J30j48O7pO8q4k7M9J0N0j02Q6
5853C9O9p2O1k01J04%R3j27Q9q4O0M0p8K1q5K06j38L2j02J8Q1l7j18Q1Q9j30N2
5880c7L5q3O8Q9j10O6j6Lk6J4n6J0m2O9K2M4j15M3Q1J7p2Q1J6q6M1j33Q2Ko4L1
5910b6L4J11n1J1p3K7o5J09j37j9R4l9lO3k6J4j8j24Q4R4J7j61PO7L4l4j17Q9
$$ plain form
5716 37 23 -43 41 -73 34 -125 -72 -48 10 14 -18 -52 -68 85 -114 33 -62 8 20 105 22 22 -28 -56 45 132 -45
5743 -45 21 43 77 -44 16 24 -11 117 -24 5 108 61 9 19 -35 -59 -86 46 -63 -3 21 -57 69 -34 -78 19 14
5770 14 -21 15 15 86 68 -17 124 31 -86 33 92 98 77 -38 49 -73 13 71 -100 6 65 124 70 -38 -69 76 -16
5797 -16 -67 -30 36 -44 3 117 -119 -3 33 21 -45 39 -132 5 63 11 -31 30 78 13 13 -30 -22 -39 -6 0 -95 -50 -4
5826 -4 -23 67 -68 123 125 -7 99 -75 -2 -40 86 13 31 -3 -53 77 -71 -4 -11 57 -27 -54 -5 5 55 -47 39
5853 39 108 36 97 -104 0 0 93 -34 55 -29 31 71 -7 14 -71 135 -3 29 -73 -55 26 -11 -129 -48 41 -89 -37
5880 -37 -2 -85 -17 72 -38 28 12 15 -11 3 -53 -43 -85 -16 6 50 -65 -22 59 76 4 85 101 15 56 -77 5 7 -57 -26
5910 -26 8 119 68 79 6 33 -32 77 -60 -79 15 -24 -27 36 10 24 6 -118 -34 60 77 -84 -77 -10 24 -10 -127 -38
5938c8J23O5j47L6n9rLJ3j1K7k9M9l5n5N0m5N0o5R0p0K6L2j33M8nmJ04l0P3P7
5968A31k11JJ5J10o6J7J8m6N1r8J05j10J57p3K5j13J46q4L5N3N7p9k14J46R4M1
5994A08o0J7p0k7J1MlOK5l0J01n5n8N2K2P0r7%M5OJ2j31Q9k7k4Jl5J05j36R5R5
6025A11j0o0j1Nj5J8r7m1J04M4n2j2M9n6M8l1NL1r2M9m2O5j08R4J0L0p5J11j4
6054E8o7Q5o2p0O3%l7L6J16r6K1k3k4L4o5L5o0J00j1n3K2oQ4lp5K3o6M9Q3k4n
6085F2j10L9q9J50N0j74J89p3n0J6RN1j14L2K8r1L2j6R5J23j51M8L7j51K8L2J1
6112A3j0j07P3l5mR0N9J18j16j71J06J6L8p2j6k4p1R9l3J4O9q6L5l7K5M2j7Lk6
6141b5J30p3p8l5J21N5r4k7M9l6j3j9P5k6o7J12pJ1oo0K3o0K8KQ8j17rj20K04
$$ plain form
5938 -38 85 150 3 39 -20 -29 -26 -13 -24 3 -26 23 -12 -67 -17 -62 -12 -77 13 -57 -31 1 -132 -84 -89 -93 11 -19 54 131
5968 131 -80 -79 -64 46 -20 -3 15 -31 20 -78 27 -83 74 1 26 -87 59 -25 10 63 120 41 -173 -27 67 108
5994 108 48 65 -5 -32 -21 -17 -20 -14 11 -19 82 27 -31 21 43 113 16 16 61 67 79 -52 37 10 -14 -13 -48 57 -79 16 111
6025 111 101 41 30 35 20 38 -59 -100 4 48 -4 -16 33 -23 25 -6 -1 30 -62 -13 -55 10 -98 -4 6 36 -39 72 58
6054 58 -9 76 14 -56 7 7 -30 6 122 26 47 24 0 34 -31 4 -56 44 33 -20 2 -4 80 77 2 25 -41 8 91 67 62
6085 62 -48 -9 -98 52 102 -72 117 44 -6 10 19 70 -44 -12 16 -75 -43 -59 36 159 8 56 93 -58 -30 2 13
6112 13 3 -104 -31 -66 -70 20 79 197 81 -90 16 32 70 -2 -18 -42 -113 -14 -47 -33 36 -50 -15 -52 -27 15 -2 1 -25
6141 -25 105 32 -46 -81 40 95 1 -26 23 -13 -26 -45 30 4 -63 49 42 53 47 -13 10 -50 -22 -20 68 -49 -58 -178 26
6170B6kQ6n4j9O2L7j17RJ3J1m8j2K8j2n4K0Q9l8J6J00k08J50j22NO6j14j8J06
6198FqR2p4Lq8J32M0j10L1k2p9Q2J3q0J05k4K2j8J56j75m6J14Rn1k9l3L1j31Q6
6227d6m1J34k3k7m0J20j23J37p4l7j5P2L3r8R0rk8m9N5j10K05j79M5m5k2J17n7
6254a5L8k8J2l0j5jk3J58j55M2Q5j9l9l2n9J02Kmj3r2P8jJ19j44K1n7J07q2J56
6283A11m8j32J24p1R3j8q2J05j12JJ00Ql3Km4n2J80j07q1n1J23o5n5O7n8J39K5
6310F9p5N9q1K3n9J07p9K4K6J8l4R1j25NL9m5J14j43m9J22J6l9K0L4n1n8K6N9
6338A4j8M4j68J4OJ59L1j62R7K4r1J29q1p2K3p7K03o2M5j02M5J41j77j01J99j47
6364h4J80m2J9j51M4P6m7k2j9Q1m8l0Q4p3O8r1J14m6L0nm8M9K1j00L3NN2o9L9
$$ plain form
6170 26 24 110 56 37 99 136 19 28 41 52 4 -8 20 8 -46 -26 63 25 41 141 -67 83 -39 -34 32 -82 -100 6
6198 6 -2 90 16 19 -69 63 103 -7 24 2 -77 5 18 -62 43 19 41 23 179 4 -42 72 81 30 1 -32 -1 -132 -46
6227 -46 -87 47 24 -3 -43 77 -46 91 17 -20 -35 37 70 -28 62 53 25 -24 31 -79 126 -53 -8 -53 -75 42 -15
6254 -15 23 -5 7 -23 -38 -39 -62 96 -59 -17 68 49 10 -22 -81 21 23 19 6 -86 -8 -9 110 -34 -13 -70 37 -45 111
6283 111 63 -69 55 -16 77 59 -23 82 -30 -29 71 79 46 48 4 -48 132 25 -56 -107 16 -49 -104 -37 -95 44 69
6310 69 -6 53 -28 -5 -64 43 -36 -12 14 32 -2 89 -36 -31 8 -37 77 -66 -115 7 23 -16 4 38 -13 -71 -45 14
6338 14 -4 40 -128 -114 -108 51 82 -80 17 41 -50 79 -2 -74 -51 -128 75 13 58 -44 1 142 -35 -136 63 -84
6364 -84 96 54 73 -78 -34 42 -5 -27 -46 35 -13 -43 41 -32 36 -55 59 13 43 38 -10 39 60 -40 -7 -2 50 -19 20
6393B0k6j0J29j72J90j11l1O2k7R4q5J6j04R4n4N2k4k7R7j09J36l2l6j7lj05J12
6420B9j00J41r0lJ4J21j74L3kk5Q9m8j14J40k18J93n5R8K1j03L8q0J32l6L7p5
6446c7N4o9MO8Kj20J36J9l6l3M5j42J0O4N4j39K44j75n7rK06l4o7Q2q3n1P5O7
6474G8j37O8M3n4O6o0M4j9j03J77j2j81P9J9m3Q5p7M5m4m6J04nr7P1j29J54j6
6501A0Jp9oJ08OJ0j00M7O3p8q4O9N0k6K7jJ12j95m7J34p9J5q1Q4L2K9okP7J6j45
6532c9P8p3Q7kj9N4m8p1M5JK0M1l2m3k8L4J09q1K3r9L5l1J0O1j6Mr0j9M6j5K2
6563c6j0Q3n5j10J78L6r6JK8j52Q5Rp0J48L8k38K69j80N2QJ15j6j50J80k02M0
6589d5r1J90l3l6jk9O3j06Q3J11j98J21o4r2J27O5j6j48Q8M7PM3p5k9J1J0N3q3
$$ plain form
6393 20 -6 -16 113 -59 131 20 -11 51 24 118 33 49 -55 39 -15 37 13 -14 83 -26 110 78 42 25 22 -83 29
6420 29 -71 70 -20 -23 -9 112 -62 -29 -31 -56 33 -15 -129 11 -207 -14 -69 29 50 -53 -15 -95 37 1 38 -37
6446 -37 17 -52 -48 20 22 -98 38 57 21 -12 33 -109 -99 -35 19 -120 124 -51 -108 -117 89 55 -12 70 -13 -64 11 78
6474 78 -59 9 52 -2 64 4 48 29 -74 103 91 -90 -11 8 -35 50 -27 18 -26 -72 32 27 -70 1 -128 26 10
6501 10 11 -68 -74 34 40 50 -50 -3 60 -18 -102 -33 17 -9 18 17 129 -66 -113 21 -58 -43 -124 -40 -8 21 15 13 90 106 -39
6532 -39 39 -34 53 51 32 86 38 -33 12 13 33 74 42 -1 -29 5 114 33 56 -43 -8 -39 -29 32 16 20 -70 -89 -43 -58 -36
6563 -36 -46 37 -18 -128 50 86 -10 -9 19 -133 -48 -39 -109 39 77 -161 108 -72 -20 -12 103 87 -63 117 -85 -45
6589 -45 -136 54 21 -15 -16 -45 18 -88 -5 106 -92 29 -35 -127 0 65 49 -99 -11 36 43 86 11 -18 -7 3 56 -27
6617b7J45j81P7K7j06O2K7Qp5J18po1j8k5k3PJ21K3k05L0j9P3O5k4p5R9r9J64
6645A01o0k7q4J20o0o3J28j51K3J62j18L2L4l2j9j2M0k8p7P8n9R5m3J24j96J71
6671G9r6JJ3K4p1O7m7Q2p4o5l5Q4K4k00L31l7p9%p5J02n3l4M0p1K06q1j2j06J39
6700E6n0K5K8j55J39l8k4N2n3n8J58j27O9K4k4k1j00J0O5l5P7n0J6P4j26Qk2P2
6728a0l5Q0M5J00j80k3l9P9k3M4l5J14j40O2l7M7j27Pm7Q8O1j02PJ02m4J7m9L
6756c5Q3p2P5p9J09n4l2o7J26j14Q2M2m3j15%J61r1Oj30K58j01o1N1l2J8Q5M9
6783A19r4N7j11L7L8q3Q7mk9n6qp0N7M4N9q0l9J31p3J12j43RJ75j35Llj10J03
6811gM8l7k1N6r5jJ14O5o5r5k3Q1km4m8J86p8q6pK5k1PJ05j7m4n3%J29q2l4O3
$$ plain form
6617 -27 118 -63 14 41 -65 -3 24 32 -43 75 68 7 -11 -36 -59 -52 69 92 -113 -83 -102 -29 36 12 -63 36 -63 101
6645 101 41 14 -70 50 -10 -73 55 -96 -73 89 -29 3 37 5 -14 -26 14 -14 -91 -13 -72 23 -20 104 -92 79
6671 79 -17 -16 -3 21 -50 17 -30 52 -22 -87 -122 -38 -14 -214 117 80 1 1 -74 28 -25 -59 -19 -90 116 35 23 -83 56
6700 56 6 31 59 -96 43 5 -19 33 -20 -78 80 -47 22 46 22 1 -99 -89 -24 -59 18 -32 -16 58 -68 -60 -82 -10
6728 -10 -45 35 80 180 0 -23 -62 17 -6 38 3 117 -23 39 2 49 -78 -71 -118 -30 31 -71 -64 38 -6 11 -38 -35
6756 -35 48 -24 51 -28 81 27 -5 -72 54 -60 22 64 21 -94 -94 67 -24 -18 -148 110 9 -52 -1 -33 -15 70 119
6783 119 25 82 -29 8 46 -37 50 46 17 -39 -47 -117 -60 -16 43 -37 -76 55 -18 94 -49 -40 135 0 3 0 -110 -7
6811 -7 41 4 -17 39 -56 -57 57 122 57 -38 -61 20 18 -26 -74 112 34 -52 -59 -34 -55 -48 57 40 -4 -57 -57 72 -10 -44 19
6842A9p6Q1r9M2K1K0J0l8L7J01j07j19O7M8j7J4n7mJ15J9j33P6L8n8Q0k6N0p5
6870B9Oj23M4N3j8m7J02r3N3L3j2j01N4P5j9j22l1O2L3J0%m2K6j6L8rN0pO2j11
6900b1p7LQ9L2n1J8PQ0j35K9OP2r7L9l5j8Q0j02J46m5n9Rn5J19n5qJ57j00N3n6
6930B5Jj18Q3Q1n5o2j1J57n7l1LNn7l7J32m3N1j43J73o2k3K7m1l5p0Q0J12r6o7
6959g8P8p2P8k5O7p3N3P9j60J25j86N3K8n3J9O2q1O0J33M3j30L0j49Q6mM4o8p
6987d8J15j7l6l6K2j4o6O1l8k4J86j45k9J70k01O2O1o3o3J49q7N5rn9M9p3oP0
7015a4q4J65l0j45J00K8n4K0Pl0M9q4M9m3J36J4o7J9n1k6R5p4Ml3J39r7q1M3R3
7044D8m1l7R4j2l9k5m3Q1k3j4J7k7L0R8p3M3k2j78R4N2l2K3Q0qk38K43m9j44N4
$$ plain form
6842 19 -57 24 -75 -33 -12 8 18 -20 17 118 11 -108 -41 7 -10 4 -53 -57 58 77 -56 20 58 0 80 54 104 29
6870 29 35 -88 -44 9 -9 -56 46 -47 6 39 27 -74 -20 55 36 -86 -117 -55 -22 -12 -12 -54 -28 -44 -6 -15 35 28 90 -21
6900 -21 -98 -95 -6 26 -25 -7 0 80 -55 -26 -20 52 -45 -6 -41 -59 21 -81 65 20 -39 -30 -85 34 -21 -29 128 28 81 25
6930 25 26 -92 -9 72 17 -45 -56 101 44 13 16 21 -36 -73 59 16 67 -76 97 35 12 39 -2 -37 -107 -27 85 -11 -78
6959 -78 0 -72 6 -19 48 -25 28 107 -53 72 -114 -61 -33 -86 -67 -5 -86 -26 107 150 20 50 -99 -13 -17 27 -41 -48
6987 -48 67 50 14 -22 0 -14 -80 -19 -57 -81 105 -40 -69 101 -100 -38 23 -40 -103 46 -41 14 5 -54 -5 -78 -84 -14
7015 -14 -98 67 37 -108 -8 20 -34 -14 -7 -37 12 -72 -23 -66 70 84 17 36 -15 -41 54 -20 -16 -49 90 -7 -88 -45 48
7044 48 7 -30 64 52 13 -12 -55 26 3 -11 6 -21 9 107 34 77 55 -123 -29 23 -9 14 94 86 -152 91 42 -102 -48
7073d8N7k3P1j72J14M4j98J83r0N6K9p6L1Lk0l0Q9J5j56N1K4%m4P7l5O6n9P4j45
7102a12J28j19N7K2j3k1M5l7n5J31l0L7m6J87j14k0j3j32J45q4Q5K5j15pl8J14
7128B0m2R2m0j5n0km7P2j6N8o5L9j14P3j8L6O7k9p1J68j20j2N2j09M0RK3j6P8
7157F1j24O9m0Q5k0K8K8j24J38k18J95j58J55r8J50L1j33p1m6k4K34j38N2j5l4
7182a7J5P2r9P5k3n1l4J68p8p0P9j55J25j27J56J2j32R9L7Jj45%O2l5J28j68J35
7209C0ql6J08j18L5jl5J04n0Rr6n4J26N3n1qk4P6k9p3l8M5J3N9L4j21l3J29n9
7238a3o7J01J1Rm4k3J21k1j35k7J74o8J1J28j90J3R1L7j66j5P1K2p2P8l6j63J97
7265B4L9L1j31J64j77prl0LK2J27r1O8o1N4q8N8R3n8O2j14J04j53K13j64l0J4
$$ plain form
7073 -48 9 -14 57 -115 -1 43 -155 28 -62 -6 23 -53 -22 -19 -39 -69 20 35 -121 -70 -46 -46 -90 -13 -48 18 -41 33 -112
7102 -112 16 -103 -46 -24 -37 -58 -13 -50 -105 26 -4 33 -13 174 60 40 27 -105 40 -44 41 66 -49 -56 -94 20
7128 20 -22 70 30 15 -35 -37 -84 -12 -28 30 -35 4 -110 -37 -55 -19 48 19 -52 116 -4 -16 36 -73 -33 -24 -1 -17 61
7157 61 -63 6 -34 51 31 59 87 -37 101 -117 78 -80 75 -23 127 158 25 -46 -92 -116 118 -20 32 17 -17
7182 -17 -2 70 -29 46 23 -28 -62 106 28 -42 37 -118 7 -120 36 48 -84 15 52 53 -92 -92 -30 -65 63 -105 30
7209 30 22 -14 94 -24 11 10 -25 79 29 38 -58 -112 14 67 16 8 -16 60 31 -42 -80 -35 -22 37 71 -50 -83 46 -13
7238 -13 -80 21 32 41 -3 -26 95 74 -61 -88 86 18 29 157 -33 -20 71 108 -58 -73 -2 20 -52 26 -10 -173 24
7265 24 63 94 -37 127 -50 -57 -66 -96 -93 -71 56 -35 33 -28 26 -62 -4 89 31 93 -21 83 -70 143 -21 -51 -37
7292c7J4p0L0R3M8p1R7j48J05j16oR2p4j0P2r1O9QO0nq2Q0l9j5m1qP6J2L9L7j56
7323c7O1m0J8J05k9p0Q8J03k19P4o4Q6q1L8m6m5L5m1l5J67o6m3m5Q0K2M8j50N9
7351b7J04L2j86J25N0Jj26J28r5m8K3K4P0j50R0n4j0R6oj8pNk1l6R5L0m6m9k6
7380c2N2m8P4j42Q4j1L1P7p7o5j0J29j37K1q0O0O3P4j39J40n8p8N2O9j07J68j09
7407AKkl7P5o2p0L6J83j47Mp2j3P9L5J05p6o1J47j04j12J6Q6r7P5M6q0K4P8j18
7436e9k6J25q5J1J27l3J8n8m0O4j2L3j55O6p5K10N5k12k8Q6N7k3r4Q5l6K4L6p4
7464a3MM7o4%RL0p3O0K6j26J61j71J40q2J03m8M2l1j1k8m2J36n3l9j1m0R0q3J38
7493G1p4q9Q7r3J29m5L5J01k16P4rJ0n8l9J08o7N8J40j73K5j7rM9o6j6N1nN6N3
$$ plain form
7292 -37 -23 -93 -63 30 78 7 104 -44 61 -55 -61 31 -43 -53 19 -72 -3 5 65 60 -22 58 19 4 -37 -45 31 43 82 119 -37
7323 -37 24 -16 2 107 78 8 96 199 -20 54 -10 76 -5 33 -13 -58 -23 -64 -99 68 2 -41 -86 -6 16 64 -86 -27
7351 -27 77 109 -77 48 98 99 -27 101 6 -42 -19 5 75 -75 15 -39 -49 47 41 23 16 21 0 -36 59 89 43 -6 -32
7380 -32 20 -28 46 -96 -12 -23 8 85 8 -57 -67 62 -75 -54 -134 -74 -11 63 -76 64 6 -72 -20 49 -58 110 1
7407 1 3 1 -36 39 -23 -93 -57 126 -21 -17 -89 -102 -23 12 117 41 -20 127 23 -89 -73 13 -84 -9 37 -43 -19 59 -59
7436 -59 -85 40 -45 -34 93 60 78 20 -20 44 32 65 -90 -24 -99 111 166 -46 -74 12 69 46 -48 37 1 25 61 -13
7464 -13 -9 38 -26 -26 -17 13 -60 0 26 -100 61 -110 30 -52 51 3 45 14 3 -25 -67 69 16 -23 -34 -74 16 -67 71
7493 71 -3 -92 -5 -98 31 -14 21 122 -94 -20 -29 -19 -77 -116 -8 -75 -17 123 -50 -25 -42 -51 -2 -68 -84 -33 -38 18 71
7522G1j23J52j17J7k0j8N7J6j09J92n2l2oj1M3k0j03J52j29l0J1J6Q2jj16k0N1
7549d7MN1P3j19l5N3MrO2m9P9k2o9K7M7j03J5M2l1%o3RJ03o3k5rM6J05j04P1m2
7580Am5M1j9j5J4j1K7O1o6K7P4j69n3J89j43j30K38L3k2J5n4p0M4n8J05J5p2M
7608c9L6j3J30j79J61P4j31r4K8J31j04RQl3o2j3R0J6m7Q8q6J4p6J03jJ9o9m0
7636h0P9j7Nj59J75J5rl2J0Q5K5j61N5OJ27r2n3K5k8jJ01j4p0j7k3K00j57Q2q9
7665a2K6M2o0J4qJ35j16O6r7K9r6N7OJ4N4j35J39m0J7M1q2P0K3k8lr4J6m9M4M3
7695A6K4L8m5O7r7N6j54J47K4l6m7o6J15o9R1l8K8j57J33k5J35r3j9qr8J57m5
7722C4j01k4P3m6N9j51K56n5j32J35oM8pr5J9K6L0n9o7NM3R8j31J65l2q6l8m3
$$ plain form
7522 71 -52 100 -17 0 -20 -38 19 35 -74 118 66 34 28 17 60 40 -63 89 -40 -70 -59 -43 39 38 -78 -98 -47
7549 -47 -43 8 81 -38 -73 -20 -16 -25 37 -12 67 45 -24 3 50 -53 -38 4 -27 -27 -90 -81 22 -41 -66 -75 -29 76 -28 43 1
7580 1 -44 -3 -22 -37 -23 -34 -7 54 -12 15 89 -80 -133 56 -87 -217 21 54 32 47 -7 -77 -33 -91 14 29 -43 -39
7608 -39 -3 -16 114 -65 96 170 39 -55 -27 104 0 9 17 -16 -78 -91 -1 15 -32 56 -30 -16 -92 11 10 29 -40 -80
7636 -80 -1 -18 -13 -172 3 18 9 -23 -13 72 97 -64 -9 -3 124 32 -21 4 -24 -25 76 62 -8 -25 -48 152 -5 77 -12
7665 -12 14 56 -4 10 2 137 21 87 -10 19 -77 -20 -14 0 54 -81 58 18 35 76 -6 64 87 59 56 -38 -22 -71 -27 16
7695 16 40 78 33 100 3 59 -95 52 76 40 -7 -73 42 -27 64 26 54 -103 30 5 140 47 28 20 -78 79 34
7722 34 -67 -91 -18 -64 -5 -156 100 45 -87 48 42 90 83 -12 7 33 63 4 -63 -58 -15 83 -48 117 85 -1 -39 -82
7750h2J31r5jL6R4l0j66K0J12m1J52j81J47j29m8L8L1O5k14J76L2M6Jj2l9n4O
7777eP2p3J6q5J66o2n4L8O6r7l5O0k0p8K0j1J48m7N2j23Q6P7j21PJ1pp8J21m1
7806Cj09J88j52Q4m5j4J10O1j96J44l9j22K6N5N3J58k24j1K2J1l1N1J71k37nJ
7832d7L9j8k2m3J74j31N5M8rj11R2n7N1mo1J12j90O9N7J6o1M7jj09J88j10Q0o7
7860a3J54p3j50J78J1M5k56R4N2j66J51or7P3jOJ4L3o7L0J5n1Q1r3Q2q8o7L0J63
7889H4p6n3l1J05ko3J58j37m2J65r3L6k8q4L8rO3j45O8O2J2O9n9o7J72p2j26N2
7917cJ4j9L1m3j10K01p1P0L0k06J34k3R1l1j31N5j2M7n0P5j96R5l7J25O3j22J21
7944I8j44K68j60j26q0P9K01Rj60m7J17q1jNj0R6n6q2L0J10p8p9J11J4oq3M5n7
$$ plain form
7750 -82 49 -46 -47 -11 83 53 -113 -93 19 -22 130 -51 96 -33 -81 -43 -12 53 -161 15 47 93 94 82 43 -11 -5
7777 -5 67 -6 10 -75 91 29 -25 13 79 -18 -53 7 -13 -91 -71 -82 66 19 71 -52 34 111 -10 -3 8 1 -77 44 3
7806 3 -106 82 -70 14 -31 -45 65 126 -70 74 35 -87 -61 -6 47 205 -19 -30 -8 3 -28 23 194 -43 -48 -47
7832 -47 -8 -26 -48 -91 83 -48 7 55 46 -65 27 -30 21 17 -44 68 -122 -53 4 20 -41 6 5 -104 84 -26 54 -13
7860 -13 141 68 -82 96 107 152 -104 -10 42 -124 27 21 -76 -3 -4 2 16 49 -18 12 27 -24 57 -36 46 -42 -109 -79 84
7889 84 8 -45 -76 29 27 -36 122 -15 -57 108 15 51 23 -61 -23 -32 31 -114 -46 16 28 97 38 -29 143 71 -55 -3
7917 -3 11 -8 23 -20 -130 71 0 70 100 -106 28 5 96 65 -66 -11 -23 24 -26 49 -147 -52 -89 36 99 -23 98
7944 98 -46 222 62 -64 -144 -65 136 145 -15 -62 55 -26 -27 -22 -32 64 8 -74 -44 66 -12 -91 20 34 28 -55 -10 -67
7972f7K0J83m1j58M3J71k23kR9K1M1o1k5j4p6J31q8K3O3j16J56j7p0J2J9J1o2
7999b7q2Q4O9K2n3m5L8p0J09r9J60k67J98j15l1J10O2n5%N5r1j1K7O2j4l4J1R6
8027A09l5m6nPJ3m8j2P2j24Q1o5q3J20n2J43n1m0L1n3Q8r5M6p8MK9J01j06LP1
8056B5l5K6J2P5j47R4j05n7O8R1O8r2jj21Q0L9K0m1l3%o6J38r0N2j08J38Qj6O1
8085H3j62J03k8J9r6Q4k6j06K24o3L7q8K3j12R6lKo7K8K5N5l6k2%l8J12k1l4O3
8114E2L6j53J00P9r1P8p1R6rj90P7pK8M2kJk4p8nJ8q3J87k2j19%M2o1R9o6L6O1
8145E1r0M8L8r3K5M8N6p4NKj68J38P6j14o9K08q7J9Q8q4l4l3O6j03P4J2K6j4l5
8174a8o3O9rJ07j29P0q0M7n0O2J07j52K1p1O8L5l9
$$ plain form
7972 -67 -47 136 95 -63 -20 151 -72 -74 25 46 87 26 1 -13 -89 42 -46 -23 40 -76 80 63 -7 5 24 35 -27
7999 -27 -109 -25 44 66 13 -32 6 -64 45 -54 106 -161 37 -78 -109 1 63 8 8 63 -28 -39 -12 50 36 2 13 109
8027 109 74 28 23 30 43 -5 -17 55 -69 12 -53 -136 -16 -68 75 24 -16 15 -38 50 -45 1 -77 -73 -44 57 -49 -46 25
8056 25 -10 16 28 103 -44 50 -55 -112 -44 47 115 23 22 -99 -19 20 40 -1 -34 -34 -100 38 -52 0 -108 30 38 22 83
8085 83 -79 24 -4 15 -81 3 -23 -129 95 32 69 -19 4 -108 -12 -15 -13 -80 -52 -27 28 -8 -30 -30 -68 44 23 -11 52
8114 52 88 -65 35 114 23 101 30 126 117 -73 4 -3 25 67 65 66 42 -36 -41 -23 -106 81 59 -60 -60 -18 -79 20 -46 -10 51
8145 51 -39 9 47 -46 -21 27 83 9 14 16 -152 -14 62 -52 -121 87 0 19 107 23 -11 -44 22 -81 -7 5 31 17 -18
8174 -18 -81 -12 -21 86 -43 27 -53 -6 -56 6 113 -39 -18 -89 -21 14 -25
8191b5
$$ Imaginary data points
##PAGE= N=2
##DATA TABLE= (X++(I..I)), XYDATA
0@%%%%%%%%%%%%%%%%qJ6j6J6j6J6k4L2l2L9m7M8n6O8p6Q8j04J17j29J45j65J84
38I6k04K28k55K83l13L49l86M27m71N19n72O29o93P63q40R26j025J136j260J401
58G38j564J756j985K263k609L056l655M506n824Q142j3425N0200m59o4404M1461
73A8197k369l6729J1880K8737l1005j1707J9820n308j5318K7023Q512j9524J0073
86B282J5643k1993j848J9419m607j0406P310k45o825j050K288k454l010N11k48
101e233k378J956J438J240J572q66N497P637n147l24N663r686o028R970j214r484
117e387J114J695o452n85Q887J925m034N331J865p898L565P080n081k78M366m931
133A182l658K864J262j792j356P30j193l206K164K055k029J073J827m44J421J795
$$ plain form
0 0 0 0 0 0 0 0 0 0 0 0 0 0 0 0 0 0 -8 8 -8 8 -8 8 -16 16 -16 23 -24 24 -32 36 -40 48 -56 61 -68 77 -88 96
38 96 -108 120 -135 148 -165 184 -202 225 -246 273 -299 330 -363 400 -440 486 -539 597 -663 738
58 738 -826 930 -1055 1208 -1401 1655 -2000 2506 -3318 4824 -8601 41599 41140 -23264 18197
73 18197 15828 -20901 -9021 19716 -11289 -22996 -3176 -8484 -23802 3221 11733 -7791 2282
86 2282 17925 -4068 -5916 13503 8896 -1510 5800 5555 -1270 -2320 -32 -2486 -5496 -4985 -5233
101 -5233 -7611 -5655 -4217 -2977 -1405 -2271 3226 10863 5716 5392 11055 1369 -4659 5311 4097 -5387
117 -5387 -4273 -2578 -9030 -9615 -728 1197 -2837 2494 4359 -3539 26 7106 2025 1747 6113 1182
133 1182 -2476 388 1650 -142 -1498 -768 -1961 -5167 -3003 -948 -2977 -1904 -77 -521 900 2695
149B695J453L21k733N23Q05l868P47K131m952k133K400l79j95K824J908j884j184
166a521K884L96j637L397O28m870M84J334k761J545K033k201j096Pl36j01P87
183a028J637r50j121K028O9o13K612k43j278O10j416o26J026j380o82O3j016O3
201b245J257O49O87j10M05L11m78J466O50k106L14P1k414Q92J268j139l53J96
219f79q84q5N89J177N0m98R75l88p82K309N26j518Q93k79j496k7m0l67m19p94
239a737J56j46K3J466J62l80J290p2j85J197j88l39k10j057K29Q0p78M00k35j169
259a493L27j25J65R07k26O4J10j18Q22N94m9R16m78j000M28l16m90K03o56m76
279h91l95n30P53L01o8R12o9k95R14J45j4N97n27k18n9m04L90j51q65K78n28l29
$$ plain form
149 2695 4148 4469 1736 2259 3064 -804 -57 2074 -2878 -5011 -2611 -2990 -3185 -361 1547 -337 -1521
166 -1521 1363 1759 122 3519 4147 -723 -239 1095 -1666 -121 1912 -289 -1385 -1378 -1714 -1815 -1028
183 -1028 609 -341 -1462 566 635 22 2634 2391 1113 1723 307 -319 707 -673 -1355 -1292 -2308 -2245
201 -2245 -988 -339 348 238 643 954 476 1942 2592 486 800 871 -1543 -651 617 -522 -875 -679
219 -679 -1563 -1648 -1059 118 168 -330 645 257 -525 1784 2310 792 1685 1406 -90 -117 -157 -524 -943 -1737
239 -1737 -1581 -1727 -1704 -238 -76 -456 834 762 577 1774 1586 1247 1037 -20 209 289 -489 -89 -324 -1493
259 -1493 -1166 -1291 -1126 -219 -445 -381 -271 -389 433 1027 978 1894 1416 416 844 528 38 241 -415 -891
279 -891 -1286 -1816 -1063 -762 -830 82 13 -282 632 777 763 1360 833 615 556 152 542 391 -474 -196 -724 -1053
301a053M99q1m3K83l08K15M38K90O17J7m18N11l90k64N21l07o60J7o67q1L28j85
323g21M19jl75N56rj7Q14k58j27J07k81N7J55n1J25l86l00K96k10j51K51m23r0
346f20L93k07L01L58r3K24r6q7M51k45j95L56o26k51J50r4R7K15l83K85n1m5M76
369C13j75j08L39n42n3N79l02P7P3j86P8r8j41K49j60j75L41m00J9M10k02J49
391H5K26l75J5O9K6K29l92o0J34l03P7K89j32P5N5q1J47J21oK5j77l1N8k42L9
416a29J14j31k0n7J06M7J6o0L49k59LJ56j40J89R7k74Q3J63k84J02j14j65P8k02
440c32J10K18j96Q8K24k00J18Q6p9K41J25k77J01k40nJ39k29j5Pj49J80p6n1J57
464e5o1o9K16j31J18J90j40J37M0k69K85k9l00N0o2j42j7m8J88L4k66K42M1k22
$$ plain form
301 -1053 -554 -635 -678 -395 -703 -488 -50 240 857 874 456 967 577 313 834 527 -133 -116 -783 -864 -536 -721
323 -721 -302 -303 -678 -122 -131 -148 666 408 281 388 107 164 319 268 393 7 -293 3 -207 -358 -107 -530 -620
346 -620 -227 -434 -133 225 132 356 260 173 624 379 184 540 -86 -337 -187 -281 -184 31 -352 -67 -118 -163 313
369 313 138 30 369 -173 -226 353 51 128 201 15 93 -5 -146 103 -57 -232 109 -291 -272 138 -64 85
391 85 311 -64 -49 20 46 275 -117 -177 -43 -346 -269 20 -112 -37 18 -63 84 205 199 224 47 16 74 -168 -129
416 -129 -15 -146 -166 -223 -117 -70 -54 -114 235 -24 -21 135 -5 184 281 7 90 253 -31 71 -43 -208 -130 -332
440 -332 -222 -4 -200 -112 112 -88 30 116 37 278 403 126 227 -13 -18 121 -108 -123 -116 -265 -85 -161 -212 -55
464 -55 -116 -185 31 -100 18 208 68 205 245 -24 261 232 -68 -18 -80 -222 -239 -287 -99 -65 -331 -89 -48 -270
488b70M67J36l35J83o3J0pJ09j21j4k59R0m8j32K42p8j63K34m6j12K40m1J24r9
512D7J7M3O0O4Q7k70j32K48k48l5M4n0O3n4k3m1J41j4J38N3j89L36j66n9J57j46
538G1J04k14J1M5K6k02L6l6n4J42r7J01Ol1JJ46l2L1J17o9R1j67q7J07p1j9lJ85
566A38j06o6o4R3p4R4j08pP0K28k61L4J03k17J13J16o6j9qm2L1j3K6r3M6l0M8
593c4lk8J18j17K12j78n6J92j93J92K9j9j86J02j7o3K61l67K32q6m9J40j75k3
617a16R9p1r8J77j58J85M4q3j6O2j31M2J35n2n4m6J38l2r4J65m1j8m4m6JL8J8
644DKR3j48k5J70n6NJ05n2j24n0J13m2JO5o2L8j23J17l5n8J14j19k6L1k6K16k18
672i0K15j18rl0J07j1j16L6l8J02j11L8lr5R6k01R3J33J65k04J41o4mR6p2j6j24
$$ plain form
488 -270 197 333 -2 181 118 128 121 230 109 95 -164 -74 -122 -254 -12 -90 -253 -19 -65 -177 63 22 146 47
512 47 64 107 167 231 318 48 -84 164 -84 -119 -75 -125 -62 -116 -139 -180 -39 -53 85 138 -51 285 119 60 217 71
538 71 175 -39 -28 17 43 -159 -123 -159 -213 -71 -168 -67 -61 -92 -91 55 23 54 171 102 193 26 -61 46 -25 -44 -47 138
566 138 32 -34 -98 -5 -79 15 -93 -100 -30 198 -63 -29 74 -143 -30 86 20 1 -7 -49 -18 -31 -5 -98 -52 -82 -34
593 -34 -37 -65 53 -64 148 -30 -86 106 -87 105 134 115 -71 31 14 -49 212 -155 77 -9 -58 82 -93 -116
617 -116 -17 -88 -186 -9 -167 18 62 -21 -37 25 -106 -64 71 19 -35 -81 57 25 -69 96 55 37 -7 -53 -52 -14 4
644 4 6 99 -49 -74 96 40 45 150 98 -26 -76 37 -5 -4 61 -1 37 -86 31 -4 -62 52 -67 -93 -62 -88 128 -90
672 -90 125 7 -2 -32 75 64 -52 -16 -54 48 -63 -25 -28 -123 -27 -228 -135 -2 163 -41 100 36 32 128 56 40 -84
699h4P3o4O2n8Q4l1j20K11n8j24J01N5r1O0M4p4L4KO2P2j46OP4r4k4M5j49L7J29
728C4j24O2j7K6P8o9m3O1N7M2p7L7k4Q0p8k6O2j04k6n3K1J09nL1n9M8k4j7L7K1
758F0R2j47J09j48N7J9p7J48j45l4J04j21N4j5j24J20k6N3N9q2Q3q3N2R8j09q
784a1J6J76j78MM1r7JO0j02J01m1O6j5j04JL6R5K4p8N2Jj7p2j05J77jL8q6P4r9
814d3n4M3J4Q3J03j09l7m9Q6Lk7l0kj6l8nJ8k1N2O6p3J61k05J22j31Q7n2j3O3
843dp2NJ07n6m2K6P7rK7O3j23p9J73j65PJ46p3p8O2K1J9j3j07J07N8j95J07K4
871A3J5j5L3J9%k8M7Jj83R4o5R0n0J11q8mkJ74j73m3R3j37J08Q0o2j8K8o1M5n
901A7Ok5n1Q1J4l3L6j44J54p2n2K8N7L9l6qO6j84J50ML9M9j52P3j04j7j8K1P7
$$ plain form
699 -84 -11 -75 -13 -71 13 -18 -138 73 15 -109 -8 47 -44 16 60 -14 20 22 84 156 10 16 90 -4 -28 17 -132 -95 34
728 34 -90 -28 -45 -19 59 -10 -53 8 65 107 30 67 43 123 45 19 81 -23 -49 -102 -81 28 23 54 -5 43 19 2 39 60
758 60 152 5 114 -34 23 42 -35 113 -32 -66 38 -83 -29 -44 -168 -48 -74 -21 38 -44 39 -44 8 106 -3 -11
784 -11 5 181 3 7 48 -49 -48 12 -90 11 -30 36 21 -83 -82 -46 49 73 -5 47 48 31 -41 -146 31 30 68 -18 56 -43
814 -43 -97 -54 -40 43 146 37 0 -49 37 40 13 -17 -19 -35 -73 -78 -60 -81 -29 37 -36 125 -80 42 -89 -2 -54 -67 -4
843 -4 -76 -71 36 -20 -62 -36 41 32 59 122 -1 -80 93 -72 -65 81 8 -70 -8 13 32 19 -88 19 77 -118 -11 13
871 13 28 13 46 65 65 37 84 85 -98 -4 -69 21 -29 82 -6 -10 -12 162 -11 -54 39 -98 10 90 28 10 38 -23 22 17
901 17 23 -2 -53 28 42 9 45 -99 55 -17 -69 -41 16 55 19 11 77 -107 43 47 86 135 -17 56 -48 -65 -83 -62 15
930A5n8q3K09n6k9l5J18m7p6M5J7m2O0l1Qj15R6m5n8J58j34p4O1M5P7O9j32K2
958a5K2p5R8j29R6j3P5j75J25m3P9l3N2m7o6P0j12J22nj20N8J4n3J44o9R0j54
985f4O2O4Rj51J29k3n2M4O6j98Q4ML3m4L8m5j7J20j29J80k94J59q8P2Q9j23O8
1012gk6jJ14k2j23Q6p1O6n3P1Mp5K7p1J76r5R9j21R2J%k2j03L6Q9N8j66N5l1L8
1042B5n5P0j36J43m4O5r5P3m0l3JL2Q4j33K0O7j67J39N7k7m2K3o1J5k1KL1J07
1070A00j44R4j0O5Nj91J83qj04O1k2l2m4j1J0J08q9J03j35P1Jo9P4j06J27k8l5
1097b6O1N0m7j12J63j7j23JK1N1q5K5L7L0j8l0J38j59J59j31R1j44J4K8N9j07
1123g1R2j3j18J46M0j34NLN4M2n3J6l9K1n4N7o2O9k9K5Q3j66K90k17kN8m4p9O9
$$ plain form
930 15 -43 -126 83 27 -2 -37 81 34 -42 3 20 -22 38 7 15 -100 -4 -49 -107 51 -83 -157 -96 -51 26 95 -37 -15
958 -15 7 -68 30 -99 -3 -16 59 -116 9 -34 45 12 64 17 -49 21 -91 31 26 -94 -36 -22 -75 69 0 90 -64
985 -64 -2 62 71 -80 49 26 -26 18 84 -114 -30 -26 7 -37 1 -44 -61 59 -70 110 -184 -25 -113 -41 48 -75 -7
1012 -7 -33 -34 80 58 -65 21 -50 16 -37 34 38 -37 -10 -81 95 0 99 -22 70 71 71 49 -54 -18 71 129 -37 18 -13 25
1042 25 -30 40 -96 47 3 68 -27 46 6 -27 -26 6 90 -43 -23 44 -123 16 73 46 4 27 -34 -19 -40 -38 -7 100
1070 100 -44 50 40 105 110 -81 102 94 -10 51 29 -3 -47 -58 -48 60 -29 74 -61 10 11 -58 16 -90 37 9 -26
1097 -26 35 85 38 -74 89 72 -51 -50 -29 22 -63 -38 -1 29 11 -19 119 -40 119 -12 79 -65 -51 -23 36 -71
1123 -71 21 8 -110 36 76 -58 -53 -50 4 46 -7 9 -30 -9 -63 -6 -68 1 -28 -3 80 -86 204 -13 -15 43 -1 -80 -11
1152a1J2O0j15J04j08Ln1J35q5k4J16o5N8J3q8j8P9OrQ7m1j43J01Mn0j7K0k7N8
1181DL9K8r7qN1j05J51j28J33j73N1L4P6o1j6O4J00j45K6N7j60L4M3P4m6m0m5
1208e9P9kj2j0m4Q4r1M7P1k4nk0Q9j12N2k5j53L5N9M3O0J6j24o0L1Q7Q7q8l9J29
1238A01o3J5r0OO8P3j95J01j48R6M9p0rP3n0R9Rj09K1K0%K6m6j7j6P2%j5l6M9
1268A4Q5j15k5lM4K0k1Q9k1r5Q9m3k2Mj4qLk4pk7J2O8J02j04L1jp2N9J4M9n9o4
1300d2N5n1P7m5PN6nL5j09m7N2R2j33K9Q5k5K2op2P0lo1pJ13n1j09J25L3q7j8
1330b0j9Q4J8j47K2N5n6Q0rR8m8qr0l7K3M7j19P0q6J55j5N6q9K5M7j31J27j53
1358a20Q7O0q2J16j36J18o2p4K6K05j30K8p5j9M9MN5k12K25m1m9q6R1O6J0l6o2
$$ plain form
1152 -11 1 61 -54 50 -58 -55 -106 29 -56 -80 36 -29 29 42 -46 -64 15 21 12 99 58 -85 16 20 -30 -47 -27 -54 4
1181 4 43 71 -26 -34 17 -88 63 -65 68 -105 -54 -20 56 -5 -21 43 143 -2 24 81 -79 -45 -2 72 26 -14 -59
1208 -59 20 18 6 -4 -48 36 -55 -8 63 39 34 14 103 -9 43 18 -135 -100 -41 2 62 78 -46 -106 -75 12 99 11 -28 101
1238 101 38 53 -37 -31 37 110 -85 16 -132 -36 13 -57 -66 7 -43 56 65 -44 -23 -3 -3 23 -23 -40 -56 16 16 1 -35 14
1268 14 99 -16 -41 -44 0 20 -1 88 67 -28 61 18 -4 0 -14 -22 -19 -43 -50 -77 -65 3 105 1 32 31 -41 18 32 81 22 -42
1300 -42 13 -38 39 -6 1 57 52 87 -22 -69 -17 75 -58 -29 56 31 53 47 -25 45 42 -19 -26 87 36 -73 52 85 -2 -20
1330 -20 -39 45 63 -84 -62 -7 -63 17 8 106 58 50 -40 -77 -54 -7 -126 -56 -142 13 -2 54 -35 -10 37 -94 33 -120
1358 -120 -33 27 -55 61 -75 43 -19 -93 -67 138 8 36 -39 -58 -9 -5 50 -162 63 22 -27 -113 -22 44 54 18 -44
1385d4K4J04M7j89N0oj0m2O4O8Qq1o7J49K5j05N6j0j61K16M2j53Mj53J57L5ol5
1413a3j9q5J07O8j00P7n3K5m0M9j06m4J41K5n0%q3l3K46j41N3m4M4k9M1L3m5N2
1441G6j6J9j13m8o0J68qO0j61L7n3N8l9M6P2j62k4J79L5j61O3k8q0J93n9J11j61
1468e6M9q4M2%O3o4mJ12K3l1Np1p7J38j32J30q4oj2P7Q4l4p6N8l7p9M5q9J48J
1498C9Nj0m9n0J7K5o6J09L0p4O4p4p8J19l8N9Rj15J34q4M1j31J54K6q7j00J35
1525A0K6j06N8m0L6M1M0j3M4q0q1Q1Km3J86r5K6j99N7O4k9k4JL6o1N5K5n3M2P7
1555H3q7m8p9J40L1r5O8J03J3j09N6j26L6o1j4R5m3JQM6j27J12j7k6O1r3RQ9m9
1584b3J74j40L3L6o9pL2j04Q5P7K5j35K7q2J02n4N9l4o8N7r3J68k2j06P1J7o0
$$ plain form
1385 -44 -20 84 131 -58 -8 -14 -24 -66 -2 66 74 -7 -74 75 100 -5 51 41 -120 96 138 -15 -11 -164 -7 28 22 -13
1413 -13 -32 -117 -10 58 -42 35 -18 7 -33 16 -90 -134 7 32 -18 -18 -101 -134 112 -29 24 -20 24 -5 36 69 24 76
1441 76 60 79 -34 -82 -142 26 18 78 -83 -46 -99 -41 -80 -34 38 -124 -148 31 66 -95 -32 -60 -140 53 -6 105 -56
1468 -56 -7 -91 -49 -49 14 -50 -54 58 81 50 55 -16 -93 45 -87 43 -41 -47 -59 18 102 68 -8 50 13 -66 -21 -110 38 39
1498 39 44 34 -15 -65 -48 -23 -89 20 50 -24 40 -34 -112 7 -31 28 37 -78 56 -28 13 -118 36 62 -25 -125 10
1525 10 36 -70 -12 -52 -16 25 65 52 96 16 -65 16 18 -25 161 66 92 -107 -50 14 -15 -39 -38 -2 -63 -8 17 -36 6 83
1555 83 -4 -52 -131 9 40 -55 13 116 129 20 76 -50 -14 -75 -89 6 -37 -36 -28 18 -109 3 -14 -40 21 -72 -63 26 -23
1584 -23 151 11 44 80 11 4 36 -68 17 94 119 -16 11 -71 31 -23 36 2 -66 -9 -102 66 44 -62 9 26 -34
1611c4o0J54l7k2J8m8O6j52j3J60k0k0J2Ol7Q1j07K9M6q7N5R3o1N7omj02qJ7P9
1641E5ql6N3r3N0m9Oj9R1j05M9q3J29J00j63m0j7L3k0OO0L2q2O1LJ5k9l9J12q5
1671a3J13m3j12M4M4qO4q3J30k8q5p6J17m1k3J34J1r6k9l3n5K3R4l9k7L0N8o8
1699Cl1P8r7J41m0l3n4jj7J49n2q6J03Lo9N6j27M0O3%K1Mj23m7J33L8m0p6Q4r4
1729g1O2R8j0q3j6P7M3j67oO7J4l8l7O1L8n2N3n4k1K0J43m5l3Qj50J00K2j7J3
1758A9l5Q7n2K4qK1k1j28J98K1p0n8M6m5J3p6M7R8j34R5L4n8j69J63O4Mj5n2k7
1787a4o0J25j88J51m7Q5p7K8j24K6O6Kj23K09j25NRJ05M0j3r2rO1kq8k5R6j4J1
1816A8N5j20O9L2q9J33r5o9J29j73%L9qQ6M7q9L7K8p6QO5j26J02jN0n1K4K4m4
$$ plain form
1611 -34 -94 60 23 1 19 -29 37 -115 -128 32 12 -8 4 10 -27 54 -53 -24 22 -65 -10 83 22 79 73 69 -33 -41 -24 55
1641 55 47 11 64 -29 21 -28 -22 -41 50 -55 -6 -89 40 140 -23 -63 -80 -47 -67 -61 -1 31 -51 10 13 28 -1 -40 72 -13
1671 -13 100 57 -55 -11 33 25 89 6 136 108 23 -53 64 23 0 134 145 49 20 -13 -68 -45 49 10 -17 13 71 3
1699 3 -28 50 -47 94 54 21 -33 -34 -51 98 46 -40 63 66 -3 53 -74 -34 29 29 50 54 -69 -116 17 55 15 -61 23 -71
1729 -71 -9 89 79 -4 -20 57 100 -67 -73 -6 8 -30 -67 -6 32 -20 33 -21 -42 -22 121 76 43 51 -99 1 23 6 19
1758 19 -16 71 19 43 35 56 35 -93 105 126 56 -2 44 -1 12 -64 -17 81 -53 42 76 18 -151 12 76 80 65 13 -14
1787 -14 -74 51 -137 14 -33 52 -25 3 -121 -95 -29 -27 -150 59 -66 -61 -52 53 93 80 -12 -21 40 38 -50 -75 21 7 18
1816 18 73 -47 22 54 -35 98 3 -66 63 -110 -110 -71 -79 7 54 -35 2 30 -46 -38 27 -99 3 2 52 1 25 49 5
1845EK3m1rK1L5J9j3N6k2p8j9n4R9P7j29R8j53J60m4o0k7Q2J5p9qL6J12j67J32
1874F7o4M0j15l2Q5R6j01P8m8%q3L3m7N1J04j20Q6k6j15Q7J21j82Q3l8Q1N0r1
1901@Prl5P9j02R5j00P3p0O8L4kK1J8p5qK6o0M1m7Q3j45M3j6J27n3K2M2N3j00
1931A0l7M1p6Q8m6n0J40L3j13P5j57J63j06P5m1j5O5n6J7j4o2R0j7j04J37K0j41
1958h1J01M8l9L7j37P0n0R1n3l2L5l6k1MJ42J8j42J9P9q2J6k7J02m2p4L1j2J41
1986A06j98J34n7Nl5j9J23j8o9Q2K4k3j01%J35j33J08m3Q3j52R5j55J85l2j11
2011f6N6NM2j12%J55j67K20j35P3N8j12K1n3M3k7l9J39m4l1l5r8J73n6k8J5L2
2038B9k9KJ0l9rr8J21q6O6P4l7n1JK9P2o1l2L2m8M1N2j10L0N1k0O3j87K02j12
$$ plain form
1845 5 28 -13 -22 -1 34 53 40 96 74 -4 -23 -77 22 99 -30 68 -85 75 31 -29 -56 26 41 -38 -46 -10 102 -65 67
1874 67 3 43 -72 -104 -19 77 -24 54 6 6 -77 -44 -91 -40 64 -56 30 4 -111 -24 97 -85 -2 -40 41 91 0
1901 0 7 -2 -37 42 -60 35 -65 8 -62 6 40 38 59 77 2 -6 20 -40 1 -46 37 -108 -65 -81 46 -7 15 57 110 10
1931 10 -27 14 -62 26 -20 -70 70 103 -10 65 -92 71 -35 40 -1 -16 49 -7 10 -4 -66 24 7 -97 40 60 -81
1958 -81 20 68 29 66 -71 -1 -51 40 -13 -45 -10 -46 -67 -63 79 97 -45 -26 53 -29 -13 -40 62 20 -54 -23 -35 106
1986 106 -92 42 -15 -10 -45 -64 59 41 -28 54 78 55 -46 -46 89 -44 64 21 104 -48 47 -108 77 45 -66
2011 -66 -10 -5 37 -75 -75 80 -87 133 -2 71 129 17 38 -15 28 1 -38 101 57 26 -9 -107 66 10 -18 -3 29
2038 29 0 2 12 -27 -36 -134 -13 -99 -33 41 4 -47 -46 -17 55 -6 -38 -6 -54 -13 39 -71 -41 10 -10 53 -134 68 -44
2067d4O2k4n6o7J98o3JJ21o2K4m8k1j27J88j13L2j2o5L7J84k28P0M2o2R9j36J
2094f9R4J1r8J24p7m9N9M5l9n8R5j07K9O8N0m8m1lk2L3J38j08Q1j47L9J7J35j36
2122A6j09L1Q1k0k9J72j40o8J28m0j06J27kj04N6QJ3j28J35k6O8nj23J23o4p5
2148h1N5r1J42J9J2o3l5R4r6K8J24n1j0p7K1RRo6O7o4N0k1l6R3L0N1j26Q3j49
2177g9RmR0nL4n5P8r7K6j18J04K2k5K1J19j45N2J0O0M3j63r8J40P3o3R7q6k1j09
2206i0NJ22j17Q4m1L6J7m9O7o7p7J70Lo0Qk5j7K7M0j5j90J25M5p4j0J48n3kq%
2236Bo0O2l2J26j32k4N2p3J47p5j0N2l6Q4j03L1J05j41j02J77k6P5r9kM4J2n5
2263aj4O5o5J45j61O1p9N7o7O9J30q6j56J25K8q1J01l9m9P6n1k5oK1l0k4P6J6
$$ plain form
2067 -44 18 -6 -62 -129 69 6 7 128 66 90 42 21 -106 82 -31 1 -11 -76 -39 145 -83 -13 29 -33 66 -70 -69
2094 -69 25 36 -62 62 -15 -64 -5 40 1 -57 38 -69 -40 28 78 30 -11 -14 -36 -3 135 27 108 -39 0 17 152 16
2122 16 -93 -62 19 -1 -30 142 2 -66 62 22 -84 43 41 -63 -7 1 14 -114 21 -5 63 58 -65 58 -6 -81
2148 -81 -26 -117 25 44 56 -7 -42 52 -44 -16 108 57 47 -30 -9 0 9 -57 10 -54 -4 -25 -61 32 62 113 -13 70 -79
2177 -79 -70 -74 16 11 45 -10 68 -29 -3 -121 -17 5 -20 1 120 -25 27 37 97 140 -23 -121 19 92 29 126 40 19 -90
2206 -90 -85 37 -80 4 -37 -1 16 -33 34 -33 -110 60 63 3 11 -14 -31 -4 36 21 -169 -44 1 -73 -83 65 12 10 2 2
2236 2 -58 4 -28 98 -34 -58 -6 -79 68 -7 -17 35 -1 83 -20 11 116 -25 -127 50 24 99 0 -2 42 54 -1
2263 -1 -15 50 -15 130 -31 30 -49 8 -59 10 140 54 -102 23 51 -30 71 32 -17 59 8 -17 -23 -2 -32 -56 20 36
2291C6L8j84J52M5j1j17K4L8j06P2j4m3JJ6Q1l0J3K3q2k7M2J33j04N0M0m5K1r3
2319c1k8J35K2n9n0n1Q0K8k2K5m2k1k6k2M0L0J20j75J7p6J39%j50J28m9J01n2
2346A1j27J48R7k46J17Ro5K1qJ52k43kJ07j6P3J3m3M2L4j8pj21n7J12p0R5N8j24
2374e8j07K06J6r4M0q2P3M4Q4k3l1q0K6J21k17M8J4j2j5M1n2J91k33J50mp9Oj8
2402d5k1J52lr3J14j04P0j33K1k5J00oo2mmO3j20R5P3m1j00qJ46k8k7J8n8J21
2430I1m6r1N3m1M4L0l4M5p5K4k7l0Q1Mj20Q5p3O7O3n5Q5j15n3kJ25j08j4Q2N1
2459D6n2No3K5J61j46J48m3l3J6k4j73J08n2M1QN6K1P4j59J10r5l9N8rO4o7P5
2487F1p3Ko2R2Q1p9l4mO4l8q7J1M8k6O3m8J2K7k0K1m9J10j83J45Q9m9j5k6qo2
$$ plain form
2291 36 74 -110 42 87 76 -41 -17 21 -85 -13 -27 -70 -69 -53 28 -2 11 34 -48 -75 -33 100 -4 46 86 41 62 -31
2319 -31 -59 76 98 39 -11 -62 18 46 24 49 7 -14 -40 -62 -22 8 128 -47 -30 -106 33 33 -117 11 -38 63 11
2346 11 -116 32 129 -117 0 9 -56 -35 -43 109 -134 -136 -29 -45 28 41 -2 40 74 56 49 -72 -129 -17 -87 8 66 -58
2374 -58 -165 41 57 -37 3 -79 -6 38 122 99 68 -12 14 135 -82 -34 -20 -32 -47 -6 -58 133 -100 50 46 -33 -27 -45
2402 -45 -66 86 83 -10 104 0 70 -63 -42 -67 33 27 -35 -39 -43 20 -100 -5 68 27 -73 -81 65 37 10 28 -30 91
2430 91 45 -46 7 -34 10 40 6 51 -24 0 -27 -57 24 28 -92 -7 -80 -13 50 -5 80 -35 -88 -90 35 -73 -87 -5 46
2459 46 -6 -1 -64 -39 122 -24 124 81 48 64 40 -133 -25 -77 -36 -28 28 49 123 -36 74 -21 -60 -2 -11 53 -14 61
2487 61 -12 -10 -72 20 101 22 -12 -16 48 10 -77 -66 -18 -44 19 -29 -17 10 -10 11 -38 72 -111 34 123 74 59 33 25 -37
2517c7j1k2O3JJ26j28N8J8j34K0R0n4M5o7K5o6O9K5K9l9m6P0Lq3O0J6j34J56p6
2546b3N9j1j1K7m9j54J18j7N7QQk7R3j04K1O3kL9j38R4K3j14M8j1O9nr7P4N1j65
2576g6J1J0ln2J83lq7j5M0J8l8k1o2O3r1k8J88j11P5R4n9j91K51j27O7j2j05N9
2604b2Q3k08J91m0J5J4K7l3m9J8n1N6Q1p1N2j22Kl7O1k9J23m4J0M0j99K7J11k6
2632b0m4J26k0kn4j20J08P2p6L8k2j0R9k9p5Q3j45jK54j32r0R6l8j40J81j14J51
2659G6J6j11O0q4L1K4L8j30O5J8J21j32K8N5K0j39M2J12j15J13j46l5K1r6K43
2684I5p1n9N7j33J52j2l4n7J22Qk0r0N6J05j37J27j14j6L7M0n2J6n6o9OJ32Kr3
2712e8nnO2M2m7j8K6p0L8M9K0n7P2j18P7l9R6r1M7k1NL0k4Mj14R1L1p5N7l2j1
$$ plain form
2517 -37 -48 -70 -7 -6 120 -8 50 68 -66 -46 44 -10 35 -32 -7 -73 -4 21 50 11 -35 35 38 -45 15 31 -103 53 -23
2546 -23 36 25 14 41 -8 -162 -44 -61 -4 4 12 -15 78 -26 -5 58 56 95 -43 51 74 -40 8 -3 66 61 -36 38 89 -76
2576 -76 -65 -55 -58 -110 73 70 -17 -32 8 26 -12 -33 -95 -32 -123 -151 37 -74 1 95 36 -155 96 -31 36 24 -81 -22
2604 -22 61 -147 44 4 19 33 60 27 -22 -4 -55 1 82 11 63 -59 -57 -94 -33 -62 61 17 27 67 -132 -105 6 -20
2632 -20 -64 62 42 40 -14 -134 -26 46 -30 8 -14 -24 75 46 -29 54 -91 -92 162 30 -60 36 -2 -142 39 -75 76
2659 76 92 -19 41 -43 -12 12 50 -80 -15 3 124 -8 20 75 95 -44 -2 110 -5 108 -38 -73 -52 -148 95
2684 95 24 -35 22 -111 41 29 -5 -62 60 68 48 -42 14 119 -18 109 -5 -21 16 56 4 20 -36 -105 -99 33 35 -58
2712 -58 -63 -68 -6 36 -11 -29 -3 -73 -35 14 34 -23 49 -69 8 -31 65 -26 21 0 5 35 11 15 -99 -8 23 -52 5 -27 -38
2743c8R1n9j1l0J9J15jj75L0R3l1Nm3l3R5L8k05J42j7M0k3N9j17J50o6O4k0q4
2771a2Ko2P2r5J42j10O6o4K6R5lm9j32K08q7k5O4k4j03q2K14k6J9j92J05ON5j28
2799a20J38k4k6l1R1%j5j6j06J56j71K38j15Pm6PpQ5p8n2QJ17r9l4Q5Pp3j7K17
2828A26j76qkl2Q8P3m4j54J16J26k06P1Q5m8n7J32n9r2P9q2O0J9qj7Oj7r3J73
2856E9r8K0L9Rm3l1J22r7k9J65p9L6j37J43j01kJ03k48J79R9j23o4J87n0Qo0p3
2883f6J10j7k9p9J4jJ03j17j1K24n2j26M0P0r3M3N7j32J03Q1j43j0O2k7n5Q4j52
2910a19J29N7J2r6N2O7Jj30mP5j19J39m5O7K7q0M1k00J18o4P4M4r8N0M4m9kk8
2938c7N3j9R6j33k0J05r5j8l8Q0N4Mj49J04Q1j14jM9KlL5l9p7K0L6P1p3KK2L0
$$ plain form
2743 -38 53 -6 -17 -47 -28 87 86 -89 -59 34 3 8 -35 -68 27 65 -140 2 -15 25 2 61 -56 94 28 92 72 -12
2771 -12 -10 -72 0 -95 47 -63 3 -61 -35 60 57 8 -124 84 -3 -28 36 12 -91 -173 41 15 34 -158 -53 -47 8 -120
2799 -120 18 -6 -32 -63 28 28 13 -3 -109 47 -124 114 -1 6 -40 -33 -40 45 -33 -85 -77 40 -59 -93 -8 -1 -74 -91 126
2828 126 -50 -58 -60 -92 -4 69 25 -129 -13 113 -93 -22 63 15 -42 90 31 -61 18 -64 -4 15 7 -10 -4 -21 -114 59
2856 59 -39 -19 20 29 -14 -45 77 -20 -49 116 37 73 -64 79 -22 -24 79 -169 10 109 -14 -78 109 59 67 7 -66
2883 -66 44 27 -2 -81 -67 -68 35 -82 -93 131 79 -47 -7 63 -30 13 70 -62 41 122 -21 -31 31 4 -51 33 -119
2910 -119 10 67 79 -17 35 102 103 -27 -31 44 -75 64 19 86 113 33 74 -126 -8 -72 2 46 -52 -2 42 -7 -9 -37
2938 -37 16 -3 93 -40 -60 45 -50 -68 -106 -26 28 32 -117 -13 68 -46 -47 2 4 1 36 -3 -80 -60 -24 47 -26 -24 -2 28
2968B8k3r0N2j2J95n6j23Q1n2m1j8J46j50nN9N9Rj19O7lj6o4R7j36K8N2P9k7m4
2997b7rR9o0l9Q6o3k3PK9l4K3J08m5q9N8p5M3J30j01k0l4N5j36J01rj3L6J3m9
3026c8lJ5o4J07j0K6q5j4R7Lp1J15r7J2j09J67P8j91l%K6J66j28J4j21J38o3l0
3054f3M3N8n8j3J20J3j59P9m2%O9q5n5Q4R6j43O0rj21J65m0j33L9J38j4Kop9L5
3083a9O5p3L0No8L5J55j81k0Q1M3k6L8K5k9j37NJ8J13K1j10j9o7K20j20j00Q1
3110c4Q5j3o6R7j51J50RMj68Q0m1O8r3m3P2J8P7r5J34j5j45J15j50J00J0j16P3
3137c8J72j29j3Q4j10R7r3K3L3n2Pn0R1p5L3K7j8l0J2m2N2q8R1N7k0L6j4p6R4
3166F1o0j21J81j45J25r0J22L3k05J03L2k0O9M5n5j3l9m5R8l6r4O5M0J8o3l0o1
$$ plain form
2968 28 5 -85 -33 -45 150 94 -29 52 0 -41 -59 87 -63 -68 -9 50 59 -60 7 4 -12 -76 21 -115 -87 -35 44 17 -27
2997 -27 -36 63 3 -36 50 -13 -36 -29 0 -34 -11 97 52 -37 21 -54 -11 119 18 -2 -36 19 -117 -16 -25 -38 -2 11 -38
3026 -38 -41 -26 -90 17 7 33 -52 -66 31 34 -37 78 -19 -7 -116 51 129 -62 -65 -65 -39 127 -1 13 -108 30 -33 -63
3054 -63 -20 38 -20 -33 87 100 -59 20 -22 -22 47 -38 -93 -9 87 -56 4 -5 -126 39 -1 -134 -95 43 29 31 25 -54 -19
3083 -19 46 -27 3 8 -60 -25 130 -51 -71 10 53 27 65 90 61 -76 -71 -53 60 81 -29 -48 -115 105 -15 -115 -34
3110 -34 51 38 -28 69 -82 68 77 81 -87 -7 -48 20 -73 -116 -44 -26 51 -44 90 75 -70 45 -105 -5 5 -111 -38
3137 -38 134 5 -8 76 -34 63 -30 -7 26 -26 -19 -69 22 -53 -20 7 -11 -41 -29 -71 -19 -107 -16 41 21 57 43 -33 61
3166 61 1 -120 61 -84 41 -49 73 106 -99 4 36 16 85 130 75 62 23 -22 76 40 -54 11 51 69 6 -24 -85
3193h5R8nq5J42j2l3p8J43r6J8J01j31J32j27q4J07M3L5j12L2m8m6mJ30l0N2j82
3220a25J68m3NJ9j0q8qO2L3rm7M1pml9J04j9j7M0p7J2l2pJ80j88P3Ml3O9p9K8
3251FK6p2R4q1j73J26J10n8k1Rn1J04J15l7j61O0K1l6o9P5lo6J25n7P9n6m1J30
3279I8j40Q2j21O8N7j28R4M6R9j4j70j00J89p5J08k0k02Q1O8j6KM2Q7j95Q9M5
3305G4J5p1j68J47K4k6P2n6K8no6n4J13N5m4p9m1Q9J0R1k08J35m4N8L6k4J1q5
3333a3j7m1R6k6o3J35o3n0J15m1p6O3p1j0J98o6r5M6n2M7Kn5L1j7J1MM5J2j01
3362e2k1N1P0J1r2j4OM5L5RnKQ0j49k3pn9J44%q5N9PM0q0PM8K8N1j57M2O4m7J84
3395A92j36o7K0M5j27K09k16J66oj13O5q2N4Q2j55n3J12L1j5k2J25j77O6k0J21
$$ plain form
3193 -85 13 8 -77 65 53 20 -58 85 -11 7 108 -23 109 -18 -102 5 48 83 -29 3 -45 -91 -95 35 5 57 -125
3220 -125 43 0 5 24 14 -74 -82 -20 13 4 -43 -2 -9 -13 -52 52 33 16 56 -21 -9 -41 -48 132 -56 17 21 -12 57 -22 6
3251 6 32 -40 54 -27 -200 -74 36 -22 -43 -34 -85 19 134 97 -64 -4 17 -19 -88 -13 -16 -82 43 -14 65 9 -32 98
3279 98 -42 40 -81 -13 44 -84 10 56 155 141 -29 -129 60 -15 93 73 -129 -48 20 4 6 48 135 -60 29 74
3305 74 89 18 -150 -3 21 -5 67 11 39 34 -32 -86 27 82 38 -41 -82 7 17 108 -100 35 -9 49 85 61 72 -13
3333 -13 -30 -71 25 -1 -64 71 8 -42 73 32 -44 19 -52 -62 136 70 -25 21 -31 16 18 -37 -6 -23 -12 -8 37 49 -52
3362 -52 -73 -22 48 59 -33 -47 -41 4 39 48 43 45 125 -24 -47 -54 -113 31 31 -54 5 12 52 -28 -21 27 55 106 -51 -9 55 8 192
3395 192 56 -11 9 54 -73 136 -80 86 80 -33 32 -50 4 86 -69 -122 -10 21 6 -16 109 -68 -2 -22 99
3420I9j47J3O8K0k3Mm1r3J37K4oj5n0l1k9L2m8J05O3j36L8p2P8J06j06K3L7J9
3448F9m6j39J15j28J48j2m3N4kM2p0n3J12r3r0Q7nN1l5k3j6J28j24J16j4l8N6
3475D7j15j2K3J41K4r6q3J30N7q7j3P9k0j18P4n0o3J98k7j00n2M1j11J96n7N5
3501F1r2J07o7ok8LL7O0o7N1r9J60o8m3N9n7R8k46J64kJ5p4K6N2k3J4l0N4n3j04
3531i8P9m4O5p0Q8o6nk2j02N3K4O2K7L0n2K9m6Q7k0r5L0P7j24nJ29j08J45n3r4
3560g9J32p3Q9p0j7O3O3p5K1L6l9k9j5k4K0p7J19K4j90J88L8j54K6J39p5p2L5
3587Dp0P3P3n4j48J41K1K1j12N1Kn9j7J52j39P6lL6p1k8M4l1R8Pk8k9mK8n9o4
3617h9J5K24j01j65J68j26J65j01k3%l2Q9j25J28J0n6Kp5R2k3N4o0R5j56J61o3
$$ plain form
3420 99 -48 -35 33 53 30 34 -7 -100 37 61 55 40 -10 -41 -70 -38 -86 19 82 -54 -16 -88 -10 96 -10 13 50 69
3448 69 23 -116 -1 -129 19 7 -36 18 16 58 -12 -65 47 -46 -136 -49 -54 -3 -38 -61 -77 51 -73 43 29 -9 47
3475 47 -68 -80 -57 84 108 12 -71 59 116 29 16 95 75 -43 31 -19 -82 116 89 -11 -63 -22 -133 63 6 61
3501 61 -31 76 9 3 -25 -22 15 75 8 59 -40 120 52 9 68 11 109 -137 27 25 40 -34 -8 44 21 35 5 59 6 -98
3531 -98 -19 -63 2 -68 20 -46 -51 -73 -175 -122 -98 -36 -9 21 -31 -2 -48 39 19 -76 -46 31 -93 -98 31 -77 68 15 -79
3560 -79 53 -20 69 -1 -18 45 108 33 54 90 51 22 7 -17 3 -74 45 69 -121 67 105 -49 -23 116 41 -31 4
3587 4 -66 7 80 26 -122 19 40 61 -51 0 2 -57 -74 78 -61 15 12 48 -23 -51 -7 -38 60 67 39 10 6 34 -25 -89
3617 -89 -74 150 49 -116 52 -74 91 -10 -33 -33 -65 24 -101 27 37 -19 -17 -92 0 -23 31 -29 66 -90 71 8
3643Hj01O7L7j3N0n2L0j1J1N8K2kj03m6k2K0K2O8k7J2p7k1qJ25K1q9M8J0o8O5
3673C4L2p1J32o9k7n0q7J68j01J83j9j66P3N1m4p3R3K5j03N9j35J52j3L4j06m1
3699f9Q4k1N1m2r7J21km4p8N8k8N7L2rpq6l8R9r3M6N9J1J00m7k0l5q8OR1Lj5O9
3731F8k7M5k8q4m9N4J12j37nM2n2J5q4J08R5p1J49j42p6L8k5J40j47J34rp9kP
3759a0J24n0j81J26k9J40j02Q1k66J22L2L3j5P2l9q2m3J37M8j4j46J43j19l5K7
3784d6M0N5P7k9l7n5k0J27o8j13L8Q6N1j56J44j31J37j73N3L1rO3Qj22o1M6N7
3811gM0j39J19p3N5rj9N5J8n9N3j44L7J16o7Q0j71J87o2j07P5j11L30j72n0L0
3837Ek0k8rN0k7M8n9M6PJ21j09n5R5m1N4o9j8o5J26jm9k5M1o1J32Qp2J1l4j9J09
$$ plain form
3643 8 -93 -26 11 -2 48 -4 26 15 26 84 106 104 1 -45 -67 -47 -25 43 16 28 -49 -70 -78 47 68 -21 27 37 -31 34
3673 34 66 -5 127 58 31 -19 -106 62 -39 144 125 -41 32 83 39 -34 59 84 -19 40 -95 57 44 78 -28 -69
3699 -69 15 -6 45 3 -94 27 25 -19 -97 -39 -67 -10 22 13 6 -80 -118 -19 -112 -66 -7 4 104 57 37 2 -86 -80 11 14 -1 68
3731 68 41 86 58 -26 -75 -21 91 -46 -51 -9 -61 -46 -130 -22 73 2 151 9 -67 -29 -54 86 -61 73 64 -15 -17 -10
3759 -10 114 64 -117 9 -20 120 18 99 -167 -45 -13 20 5 77 38 -44 -87 50 98 84 -62 81 -38 -73 -46
3784 -46 -6 49 126 97 60 5 -15 112 44 -69 -31 55 106 -50 94 -37 100 -73 -20 11 2 65 73 -49 -110 -64 -7
3811 -7 33 -106 13 -60 -5 -14 -33 22 40 -19 34 -110 -73 43 -24 56 -115 72 10 -97 -22 -133 197 25 -25 5
3837 5 -15 -43 -52 -2 -29 19 -40 6 13 134 25 -30 65 24 78 9 -9 -74 52 51 2 -23 18 -43 89 97 25 36 2 -17 92
3868I2l3j37K4O9n4MK6J5j8m5J15j65J11l0k7KP3PRr0P8J4m6L0p2J0K09r1j18
3897c8Q7J2o5j6lJ0j24K11q1m9J09j89J48mK5O0m4p8O7j03Q1M6p5M8q2L5n6J24
3925E6n0J76j17j00J6Q1j06n4O9N8o7M1JJ11p4m7O1m3j22N7L5pj1L2J6m1K5l7
3953d1L8Ol2n3L8L0j4rJ6k8m6K8r8J85l7m7J8O6l9M4M0j65J76k29K7J97K4j07
3981a2M2j61K16k10J08K4k2K6nK8l4J48l6m1j31J21j48O7j7J6J2r1M1P5K42k34
4007B4q9M8Q8j23Q7m8rl1J90j15LL7j62R7J04j19o0M3O3K0o3k1PJ20n0q2k7J1
4035e7J39j42J54j24Q1l0j56K90k00M2l9J88j88M6K0pj1j66K43j69J0R2L6j05
4059e3J1j46J02J08J3nj0L3j16L0o9J82p6m4lJ70q4Jj44P5R5n4K0Qo6J9p3J33
$$ plain form
3868 92 59 -78 -54 15 -39 -35 -9 6 -12 -57 58 -107 4 -26 -53 -51 22 29 38 -52 26 40 -6 24 -48 -38 171 80 -38
3897 -38 49 61 -4 -20 -23 -13 -137 74 -7 -56 53 -136 12 8 33 93 49 -29 38 -65 16 62 -13 35 -47 -12 -68 56
3925 56 6 182 65 -35 -19 62 -44 -98 -29 29 -38 3 4 115 41 -6 55 12 -110 -53 -18 -25 -36 -4 12 -29 -4 -41
3953 -41 -3 3 -29 -82 -44 -14 -28 -37 -21 -49 -95 -67 -165 20 -17 -64 -46 20 -19 25 65 -100 76 -153 -126 71 95 -12
3981 -12 30 -131 85 -125 -17 7 -15 11 6 34 0 148 112 71 -60 61 -87 -20 -37 -21 -9 -100 -59 16 258 24
4007 24 -65 -17 71 -52 35 -13 -22 -53 137 22 25 62 -100 -3 101 -18 -78 -35 28 48 -15 -36 -29 91 41 -41 -68 -57
4035 -57 82 -60 94 -30 51 21 -135 155 -45 -3 -42 146 -42 4 24 17 6 -160 83 -86 -76 16 52 -53
4059 -53 -42 -188 -86 22 35 30 20 53 -63 -33 -102 80 4 -40 -43 127 43 44 -100 -25 70 16 36 44 -22 -3 -76 57
4087E7j01o7j1J07k5J00p3R2N1j12M3j07J38j17M8P1j14M8J51j95L1lOJ09j78
4112e1R3q7J23r8N8o0r6J13m2J27o6J05p8m7K2p1rO5K9p2m1J42p5J14j99P3O2
4139C4o4O8o9R0KL0m3K8j22MM8K9n2Lm8J99j91n5R4N3K9M6j67P9K8j06O9K8p7
4168c3L4j03o8K63j12K6K8o8j1L6kJ7J4M9j39K0M5OJ1o8O4J8p1R2j0P1j04l5K
4197b8L6L5j04L1O5q8j5L3J4p5O9l0J0j14J37M7p3J27r1j2R4j5o5n6kk4J63n4
4225A5N1Kj98J84Pj02J7N0n7MP6k2K4n3M9L7j55J07J0M4q7n6N6L0j33J51k17M2
4253a24N1k1Q1J1P5j67Q8O3o5j2k0J42j82J15m5QJ1P8r7J58j47Mm9K0R8j06L7
4280El1K9j7R5j47K9J4j07N3J43K3o9l8J34n9p4l3L0J11j60M4N1K5M3j10M3Nq5
$$ plain form
4087 57 -44 -111 -122 -15 -40 60 -13 79 130 18 61 -46 92 -25 23 94 -20 28 179 -16 15 12 18 127 -51
4112 -51 42 -45 78 -20 38 -22 -118 -5 -47 80 14 119 41 -6 16 -55 -64 1 30 -42 -83 59 -16 98 -101 -28 34
4139 34 -30 38 -31 59 61 91 48 76 -46 -42 6 35 -17 -14 -62 137 -54 -109 -15 38 67 113 -54 25 53 -53 16 44 -33
4168 -33 1 -102 -170 93 -19 7 35 -33 -44 -8 -10 7 21 70 -69 -49 -4 2 13 -55 9 27 -44 48 38 109 5 -30 -28
4197 -28 8 43 -61 -30 35 -53 -68 -35 -21 -96 -27 -57 -47 -161 -24 23 -50 77 -14 -26 68 53 -12 -68 -70 -94 69 15
4225 15 66 68 -130 54 61 -41 -24 26 -31 -27 49 27 51 -2 47 84 -71 36 46 90 3 -53 3 33 -100 51 -166 -124
4253 -124 -73 -94 -13 -2 73 -94 -6 57 -8 -20 -40 102 -80 35 -10 -2 9 87 -10 148 1 5 -44 -24 74 -32 5
4280 5 -26 3 -14 81 -66 -37 -23 -130 -77 66 89 20 -18 116 57 -17 -50 -20 91 -69 -25 26 51 94 -16 27 32 -53
4308e3J42m7o9j3J27j8j08J3N0j11J68k1m9P0q7j31K07j15J31K9j24J89k52k01
4332b73K24O9m1L9J00j72N4m5L6n5J72q2R4o2n1l4M5n8pm5M9j4P5n3M0J6l0N3
4360D4j44K2J30n9PJ4p2K6J6O5p3L3J23j54M3l5m7N9o6J06j68N3J56j39J6J71
4386A27j59j3J80j40Qj7J06j19R0j37OJ41j25R8j47K09np9r9J40o3R1r1O3Lj75
4412a07M4P6o1J4P2Q8k10N9l6J31j51P4j13R3R7j30R7r8Q2M7j61J12M9r3l2J72
4438A15j29l0Q6j5m2j2K8J15r1N3j70M1P4R6j37p7J97j49j7LL2k8oj1O1M7Nj7
4466B2j6r4L0Q0q8rJ10J6o8J28j59l7k1J71n9K3o9k9Q5N8n5j18J2L1K1p2j0J66
4494D9n1m6j5J1O0q2J27n2O9om8k4J28n5p9NP3n4pj4L7n2R8%k4n9P9r9mk5J49
$$ plain form
4308 -53 89 42 -27 -40 87 69 -39 -26 24 -87 81 60 11 81 -6 -137 70 -45 86 115 -9 180 -72 -273
4332 -273 -49 20 -21 18 118 -54 0 -45 -9 -64 108 26 120 58 7 -27 18 -40 -47 -92 -43 -57 18 -35 5 21 -9 44
4360 44 -100 -78 52 -7 0 14 -58 -32 -16 49 -24 9 132 -22 21 -14 -61 -2 -68 38 -130 -77 79 -60 -44 127
4386 127 -32 -45 135 -5 3 -14 92 -27 63 -74 -68 73 -52 46 -101 108 103 24 -75 65 2 93 2 65 68 -107
4412 -107 -63 13 -48 -34 38 126 -84 -25 -61 70 -81 -7 -120 -27 70 -60 37 -61 21 68 -93 19 68 -25 -57 115
4438 115 -14 -44 42 27 -15 -27 1 116 25 78 -92 -51 23 119 -18 -95 102 -47 -64 -61 -29 -57 -63 -74 -13 34 39 22
4466 22 6 -88 -58 22 -66 -75 35 51 -17 111 -48 -85 -106 65 6 29 -40 -69 16 74 19 -99 -87 -56 -35 -107 -117 49
4494 49 -2 -48 -63 -52 8 -74 53 1 70 64 16 -8 120 65 -14 -9 64 10 3 -11 26 -26 72 72 48 -11 68 -31 -35 -60 89
4525H9q2k1J00j3o3k9K2j39J02M0J4j59J01J03l9j16K2J22j8q5J55n6n9L1M2L0
4551I4L7j75q5J91m3n9J15q6l4M7J48j80k2L3M1N4j68L9%J2Nj5J13j41P3j4L4
4578A4qL0K8q3QK6M9q5O2Lj3Q7k00J05Lp4O9k2k3O9lq0O8l9L4j52L8J66m7jj62
4609a33J22R7k6r8O9K5j53J56k09J81K3j06J15j12J84k12K3nJ43m5Q8l1q0j45
4633a29K19r3j99J40J38j12k3M2N4K7l0r7J16m8p4L7pJ0M2qL3o6O2p9P1J5j09
4660f8N7K9j1j4n6k3Q2Nl8J3k2J25pr0L9k0P3k5j50J28qJ52j58l3o1M8J4j9P8
4689D0q1JJ2M9l2Kl0M7L0n7k5P5N9o4o7Q1M9j03m7O3o9o6M5K26k63J43pm4L1p6
4719g8Q0P1j07nR0p5J06j02M8n9O3j2m2j5J03kk7mp2R0k9K1J6r1NQ9rj11R4j32
$$ plain form
4525 89 7 -14 86 73 10 -19 3 -136 -34 6 20 -139 -38 65 26 -90 -68 54 36 -49 106 50 -9 22 64 94
4551 94 131 -44 -129 62 19 -40 75 -11 -45 2 150 -30 -52 -19 22 76 -92 -53 -53 -41 -36 -51 62 -79 -6 -20 14
4578 14 6 36 64 -19 -11 15 64 -21 41 44 31 118 -82 23 26 -48 21 -1 -24 45 42 -38 30 -9 25 -127 -89 77 30 29 -133
4609 -133 -11 86 60 -38 31 56 -97 59 -150 31 54 -52 63 -49 135 -77 -54 -59 84 39 127 96 16 -129
4633 -129 90 -3 -202 -62 76 -36 -59 -17 37 64 34 -63 53 5 -69 -32 -39 -29 13 5 38 -28 34 -45 26 41 -68
4660 -68 -11 18 7 -7 -63 -86 -4 1 -37 -24 -46 79 72 -18 21 1 74 49 -101 27 19 171 13 -20 -81 -33 -19 -38 40
4689 40 -41 -40 -28 21 -11 -9 -39 8 38 -19 -44 31 90 26 -41 40 89 -14 -61 2 -67 -133 -88 138 -125 18 11 -33 -2 -78
4719 -78 2 73 -34 -39 51 -24 82 -20 28 -31 32 20 -22 -37 66 64 37 33 -39 51 22 43 59 -32 -27 62 53 -58 36 -96
4749i6J54m1Kj1m8J2R4m9NJ52k10m5M9J05Kj52L4k9K20j26m1O3l2M1o3Q9j10K7
4777dj1m2P1%p4N3M0j42P9K7Q5k8k9K7j21M2J0q9J0M2N5k7J24pk3p1K8j2K2q9
4807e4Q1j35Q2J1j4M4j3J25k14J53j21l3O4k2P4k8K1p1M3K7j11Q8n1R5n8j16J13
4834b0L8Q9k7p4r0PJ80r9m3j0J15K5k50Q2M3Mn3J40q0m0P1R1q5q4N0L1rK0N5q5
4864hR1j81R4j24O8L8Q6j15M9J8o3J31j09k9N8L9L7k22J64l7K5Mn8J07j5j9j11
4891h2J26o6Ro3J18l6%k5K4k9kM6n0p4J03J04j25J3M0q4JK3L8j14O7O0q3L0L9
4920HJ08j23J6J1qJ7M5jn5oM8p3rM7l5K1j02K06j23J51j09l5jON5j51J12L5j94
4949a39J62J5o5J07k05J61j18O4Lj14J68m4p8J36l5Mj1Q5j25O0m2P3j2q2O0j34
$$ plain form
4749 -96 58 17 19 8 -40 -28 66 17 22 174 -36 -81 -32 73 75 -77 -43 -72 148 22 -19 44 12 53 -10 79 -31 -4
4777 -4 -15 -57 14 14 -60 -7 33 -109 -30 -3 82 54 25 52 -69 -27 -17 -106 -96 -54 1 -26 98 91 68 -3 25 13 35 -54
4807 -54 27 -108 -26 -15 -29 15 2 127 -87 66 -55 -88 -24 -46 28 0 21 -50 -7 20 -91 -3 -54 41 -17 -133 -20
4834 -20 18 107 80 6 -84 -77 103 4 -39 -49 66 91 -159 -77 -34 -30 -83 57 -23 -63 8 99 14 -70 -20 11 2 22 77 -8
4864 -8 83 -98 -4 -128 -60 -22 64 -51 -2 16 -47 84 -25 -54 4 43 80 -142 22 -15 10 14 -44 63 48 29 -82
4891 -82 44 -22 -13 -76 42 6 6 -19 5 -24 -26 20 -30 -104 -1 103 -22 -9 31 -53 -52 -29 9 -105 -38 22 -61 -31 8
4920 8 116 -7 9 20 12 29 74 73 18 12 60 -13 -22 25 -10 11 -91 115 -8 143 34 -1 -2 4 59 -92 20 55 -139
4949 -139 23 38 -27 80 -125 36 -82 -18 -15 -129 39 -5 -83 53 18 22 11 96 -29 31 -11 62 50 -32 28 -106
4975a06J88j81K11l5o3MJ8j04R7l4J5m7J4J80j47r4J04L6q5J42j37M5N2J4j15
5000b8N1n1Q8j43J03j54J74Ln2P6j08R9q1p5J16P0m8K3j79O4L3L9j77J25J17l2
5026E3o9N6j4k3K7j5k4k2K1J9K2o6J00j20J00L7r5N8n8K9o0k8J24o9pk8Q6l6M0
5055C8pj05J16j8l7j0J29j67K4K0M5KL9r3J2Q7p4O0j81N1qJ48J6j03j8j8O3j14
5083a03O2O2r3K4M0JJ0o2J0q6J86p9K2M8m4R3j68J70o6p8J06rL1n7k8k0J5j11
5111a24J01l8M9Q8j0j35J00mm4J08m4Jm5o7N7J10m0j09L4j0o6L9M6P3O7j66J44
5138A15j54k6M6Pl8J65j78L0k9PP5m3Q0k5K5j78O6kk2M1P1L9j37J23r1O9o4LK2
5167cO2q0L3J5N1j28J14j22N1jl0J0j01J83M1j55J12k2p9p1K5Q8O9Q9j82J7Lj6
$$ plain form
4975 -106 82 -99 112 77 14 18 36 -68 29 -5 10 -37 -23 157 10 -84 20 56 -29 113 -24 21 73 87 -28
5000 -28 23 -28 60 -83 20 -134 40 43 -9 67 -41 58 -23 -98 18 88 40 63 -116 -52 -19 20 -157 -32 85 53
5026 53 -16 40 26 3 30 15 -9 -31 -10 9 31 -35 65 -55 45 82 -13 45 -13 16 -44 -72 52 -17 -24 -52 34 -2 38
5055 38 31 -74 42 24 -13 -23 106 -61 -37 -17 28 30 69 -24 -12 75 1 61 -120 -69 -77 71 87 -16 -34 -52 11 -103
5083 -103 -41 21 -72 -48 -8 -7 3 -59 -49 -135 51 -28 -6 42 -2 91 -77 93 27 -51 55 46 77 20 -8 -28 -13 -124
5111 -124 -23 -61 -12 76 66 -69 31 27 -17 91 47 48 3 -64 -7 103 63 -46 -12 -22 -88 -49 -3 70 137 -29 115
5138 115 -39 -65 -19 -12 -50 115 -63 -33 -62 -55 20 -23 57 32 57 -121 -55 -57 -79 -38 33 72 -65 58 -33 36 -28 -25 -3
5167 -3 59 -21 12 27 78 -50 64 -58 -7 -8 -38 -28 -129 54 95 -60 52 30 -49 -120 -95 -7 62 151 -31 -14 -11 -27
5195b7J40j64Q4o0M2m3q7J15L7Nk8j5J7k6k1L1q5J18P2n5nj77J65O2o4j07MJ76
5223A04j30L1L8j03M0Q1pj07P5j9r8J02m6n6J10Oq7n6K15J7j21L8j31R0L0j34
5249a18J06L6j16J01N4l7p7K2j6L3Qn5R0o4l0R5j9J1n4QJ59k11J5n0J33Rj62J94
5277F5j17J02m7O3r1L9K1j18J39k3PQp5Rq3R0jR3q9J37j55qJ48o2k3k7n9LmN8
5307@q9R9j6NK2M2k6j62K40q8P3l2j23K3j9J08q6Q7L3j06j3J1K4p3L7j00O4L3
5335c2o5N4k7N0n3J08l0o9P9J6j1kr6J6J82m2j30K8N7j52J51K0K4k2o8K1m6k3
5363f2k0QMJ0N1l8J31j63J27m3j7j18N8QQ7P4o8o4oR1n3O2K5L7j69Q4N3r1k7J26
5393I7r7K7K2J18k11J0K6j0M3o5l4O7QM4q7J92j15J3ql5j4no1R3k0O2j21mJ19
$$ plain form
5195 -27 113 -51 33 -27 15 -28 -115 0 37 42 14 -1 16 -10 -31 0 -85 33 105 50 45 -132 33 95 31 -76 -72 104
5223 104 -26 5 43 -60 -20 61 54 -53 22 3 -95 7 -39 -95 15 21 -66 -122 93 110 -11 27 -104 -14 16 -118
5249 -118 -12 24 -92 9 63 26 -51 -29 -45 -12 -4 -59 31 -33 -63 32 13 24 -30 -22 137 -74 -59 -109 24 33 -129 65
5277 65 -52 50 3 66 -25 14 35 -83 56 33 40 48 -27 -18 -101 -11 -12 81 -8 129 -26 -34 114 52 29 2 -57 -54 -58 0
5307 0 -89 10 -6 -1 21 63 37 -125 115 27 100 68 -55 -32 -51 57 -29 58 91 -15 -28 -17 7 -66 -29 -129 -65 -32
5335 -32 -97 -43 -70 -20 -73 35 5 -64 15 31 20 18 -78 -62 120 78 -52 -24 33 -119 32 52 76 54 -14 7 -39 -62
5363 -62 -82 -74 -70 -60 -9 -47 84 -79 48 5 -12 -130 -72 -64 23 97 29 -35 -41 50 -3 59 84 121 -48 36 89 -2 -29 97
5393 97 0 27 49 167 -44 -34 -8 -18 25 -40 -74 -7 1 45 -42 150 35 48 40 5 -9 -14 -75 18 -2 60 -61 -65 54
5422E4j37J23l6p8O7M4%r4plO6K6j51J25m5L1k3M9LM9q8J2om7n2K09m0o3K9o6
5452d9O0n9N1l0N5q6Qj8P5L3j04M9j0Ln7J19m6J08k22R8m4L0Mn0L5N1P4j79J72
5481G1p0R6j4p4pj6p9k0O2k9J22j16KN9k9j2P3J29j55n9K25k70J39m2k0mrP5o2
5510c4j5j04L02q4p2R6p7N3p4n8lJ10o6N6n4J2K6l2rJ7%P3j82Q8j21J24M9Om3
5539a6L6n7p6J07p4K2O5p9J23q5J36k39J72K0o3l5L0K1k54M06j18j45J61m1j06
5564h9J04l6j4P5P9j14L1jj05M4J07o1m6J04j5M3kk98K95j66P6o9L5k2oR8j39
5591i2j0N0L7K6J9L2p3%O1l4m7N2k2OL5J6j10k4J35r2p3J65r1O1j60L7J02Oj06
5620i4RJ14p3oN6M7j3K4j48J41L5m2L0O6j30j01J03q4o0J71j3k2P7Nj13p6J46
$$ plain form
5422 54 -83 40 4 -74 -7 37 37 -57 -64 -67 -1 25 -126 -1 -46 -15 -38 11 14 63 -25 -13 -19 -66 -118 91 51 -12 17 -49
5452 -49 11 -48 3 -27 28 -58 -50 -68 7 40 -64 -15 -25 -22 -79 40 -6 102 -120 -22 -66 -36 -32 -82 -47 4 78 -101 71
5481 71 1 97 83 9 2 -14 -93 -113 -51 -80 42 -74 -72 -13 -42 -54 19 148 -7 -66 159 -111 28 -14 -34 -38 -47 28 -34
5510 -34 -49 -153 149 65 -7 89 12 65 -9 -67 -70 40 -26 30 -24 -12 14 -18 -27 -10 -10 63 -119 -31 -152 -28 21 27 -16
5539 -16 20 -37 -113 -6 -80 -58 7 -72 51 -34 102 -137 35 55 -8 -43 -13 8 -246 160 42 -103 58 17 -89
5564 -89 15 -21 -35 40 119 5 36 35 -70 -26 81 20 -26 78 63 106 104 -194 101 -65 11 -58 -23 -45 -51 47 -92
5591 -92 -102 -52 -15 11 30 62 -11 -11 50 16 -31 21 -1 5 40 56 -54 -78 57 -35 -108 57 -34 27 -133 -96 6 12 -94
5620 -94 -85 29 -44 -50 6 53 40 64 -84 57 92 50 80 146 16 -85 18 -66 -126 45 32 10 87 92 -21 -97 49
5647D9mr0N7k2J55q6m8r3k8K07j11P0P5k14J34m8j8Lm6K8q3O8O0J2Jn4J6L0k9
5676iL6%j06K9N1q4%L8O7jj40J64l4n6J02q6M5pk8J3J0Kkj6L4j4k4k3R5n6PL2
5708C9j0q5K8J15m2r7L2M8l7k7J21j55r6J30n5R8Oj21J22J4pj54J38%J06j74N3
5735a0q1J33Rj47Q1Q1j29J46k4n6lJ8M3rm9L3n6k2P8M7j04j9J2P4m1m7l9K9m6
5764i8J00r4R8J4N3o5M9p9Rq5J40N2j44J59k38J78k3m3n9k1K23j18n6J11n6N2
5790E9j05K5j9M1m2o5P7J06r6O9q2j3J7p8KL3Q3P5n8M1l6j56K10j3j63K3J08j
5818D2m3o5J36j01K9q3J1J45l3MMj43J7N5J9K1J1m6o9J03n3P1m8M7k2q4P9p0J13
5847D7o6J29j24O2n6n8MJ43p6KJ4n4O7k3k3rR8j80J44p2m7M0o1Q9n4p4K21j23
$$ plain form
5647 49 45 -45 12 -10 145 59 11 -82 -110 97 -14 56 131 -83 51 3 -15 -12 -58 -30 -113 -45 15 27 28 -26 -10 20 -9
5676 -9 27 27 -79 -50 1 -83 -83 -45 22 21 -119 45 11 -45 57 -29 16 9 -19 -6 4 6 4 -12 22 8 -16 -39 56 0 7 39
5708 39 29 -56 -28 87 45 -52 -20 28 -9 -36 85 -70 -166 -36 -91 7 13 -108 14 28 21 -133 5 5 111 -63 -10
5735 -10 -91 42 51 -96 -15 66 -63 83 59 3 0 18 61 52 3 36 -20 -42 36 83 -21 -40 -28 46 5 -42 -81 -52 -98
5764 -98 2 -92 6 20 73 8 57 -22 -13 -98 42 94 -50 109 -129 49 26 -17 -76 -97 126 8 -48 63 7 59
5790 59 -46 -21 -40 1 -41 -106 -29 77 -19 50 -32 -45 -28 -106 -104 -71 12 87 29 70 34 -122 88 75 -88 -65 43 42
5818 42 -1 -66 70 -31 -2 -85 -74 71 38 42 46 -97 -80 -25 -6 15 26 -20 -89 14 -39 32 -16 31 9 -75 4 -66 47
5847 47 -19 110 -14 48 -8 -66 -62 81 5 7 21 -33 34 11 -12 -21 77 -103 41 -31 -78 -38 -99 -10 -64 -138 83 -40
5875d0P3j3n7Q4q8K2J4K6r9J34J6j63J67j35J32q3n4M1M6j35R6q6Q7l8O7o8p6
5902a30Q0N7j2m5poP%Q4p8J12p5k6lK2j8J03Q3k55J77j74J20q4r2J09O7L8p7L
5931b0m6J54q2J61j64j17Q2L2K4j64J63Nj27J9k0P8L6lp2PQ9pJ9N4j56k7J90j52
5959d4l1M4m3L4J03r1j5J3J13o8J9p5N8j60J00O9n9m5Q8m0P7j55J74l4l9k1PL
5987a8k5M9j44J79o2P2k02J94j00Q4L6j02K9Qo3Q6j8k2j34K17oL3p0m4J22jj6
6014H2q7J3m5L9p3K2P2R5j51R6j9n0J3m0J4q3J3J20J0m2J9r6J62j04P5m5o4m8
6042a02J62m6K4l5N9r1J42L2j36k3j10L5Q7k1Rl6J17j3j25M7M5q4P2q1N1K9KM3
6070E3lQoo3L5n9p2O3Q5m4K9m0No5L6m5R5j20M9lQ3p3O0L4J7j38K8J71l8n1j29
$$ plain form
5875 -40 33 20 -37 47 -41 -19 -5 21 -78 56 72 -91 76 -59 73 -10 -64 -23 23 -112 -16 -102 -15 -53 14 -54 -130
5902 -130 -50 7 -5 -50 -57 -63 -56 -56 28 -50 62 -13 -39 -42 -20 -38 65 148 -107 70 -104 16 -68 -160 -51 16 54 -23 -20
5931 -20 -66 88 6 167 3 -114 -32 0 24 -140 23 28 -99 -80 -100 -22 14 11 -61 -54 35 28 47 101 -55 -82 108 -44
5959 -44 -75 -31 -74 -40 63 -28 -43 -30 83 15 34 -41 17 -143 -43 26 -33 -78 10 -30 47 -108 66 32 -7 -28 -21 -18
5987 -18 -43 6 -138 41 -21 51 -151 43 -57 27 63 -39 -10 -2 -65 21 3 -19 -153 64 58 91 21 -23 99 98 82
6014 82 -5 8 -37 2 -71 -49 23 118 -33 63 44 -6 7 -33 -19 -102 -89 31 41 -1 18 -78 84 -20 55 10 -54 -102
6042 -102 60 14 38 3 62 -29 113 145 9 -14 -124 -89 -2 -23 -14 -50 67 54 -71 -24 21 -63 9 -72 -21 8 10 53
6070 53 50 58 52 -11 24 -35 -107 -44 41 -3 26 -14 -9 -74 -38 -83 12 -108 -59 -62 21 -52 8 42 59 -79 -51 120 82 31 -98
6101i8P1j9nM5K6o9L1j0P1l7m5O5OJ0k8M5j99J28M7lK0l4K5m3j4o3L3J12m3j01
6131g6J42j19K4l5j3J03P2j40J07j6j64J76j24J50j20P8k2J21j32J9L4np6L6n7
6156c7m5L8O3K3n1l2n1M5J60N7k29N0j0M0p3J2M8P5jn9j17K6K6Q1n4N7J7j74J34
6185A9n9J24j67J2P1K5RNLJ9n7k0K0N8j10N7l7L4k0N9p0mo3L5jK0J7K0R5j67O
6216f7L2M5l4R6j14j32J79o9K00j81oP8Lq2P6r4J58q1j3k8N8n4Q0r3J15n8J6M8
6244G8j01m4P2j21J22lN4p6l2m9J07L1n1o1O1M4m7J6o2KoJ48j23N8O4o7n0P1l9
6273dj0l4J12n0m6m8P0K5j9o0K6k4LJ10j41L6R5l5r2j0N0J31mjk04L3R3j2L0j33
6303a13J27m5lO4m3o1K13k31J01j12J34m6J3j1J9o3n0R9O4k1j35J31j27J25l1
$$ plain form
6101 -98 -27 -46 -51 -6 20 -49 -18 -28 43 6 -39 26 32 42 14 59 -140 -12 35 32 52 18 43 0 -14 -77 -44 68 25 -76
6131 -76 66 -53 -29 -64 -77 26 98 -42 65 49 -115 61 -63 87 -33 45 23 144 12 31 65 60 -16 20 -37
6156 -37 -82 -44 19 42 -9 -41 -92 -47 113 170 -59 -9 -19 21 -52 -40 8 83 82 23 -94 -68 -42 39 -15 42 59 -115 19
6185 19 -40 84 -83 -71 0 25 34 39 42 61 4 -16 4 62 -48 9 -28 6 -14 45 -25 -29 -92 -57 -58 -38 -21 -1 94 -73 -67
6216 -67 -35 10 -24 72 -42 -174 5 -64 136 -45 -51 27 30 -52 24 -70 88 7 -6 -34 24 -30 50 -43 72 14 30 78
6244 78 -23 -67 5 -116 6 3 57 -19 -51 -100 7 38 -13 -74 -13 31 -16 0 -62 -60 -66 82 -41 17 81 14 -36 35 -4
6273 -4 -14 -48 64 14 -32 -80 -10 15 -4 -64 -38 -62 -59 51 -90 -54 41 6 -86 -96 -46 85 81 80 -124 -91 2 -10 20 -113
6303 -113 14 -31 -34 30 -13 -74 139 -92 9 -103 31 -15 -2 -13 6 -57 -107 -8 56 35 -100 31 -96 29 -2
6328bM9j24J62o5K8j24Q5J8o7L9J0l0J06j60J49j9j10L8N8K0P8k29P2M8q3N9P2
6355G8o6K2J9p4k1MR3n0k9P8j63J05Jk1M5k8R6j09k8J8p4R3NN8J2O3o0j5m3m3
6385c4O6m4m8J10p6k0P2Rp9J27j08O8j16R3R3k9q8N8n3r2k3J51j19R1Q4q1q6J21
6413D7q0m7N0J5oQ9J4m7m4r7J32q7J20no2J25j34O5j32J13n2Rp4n3J15L7Q1m9
6441D3m0J8Q5o7M3J4q4J6N1o7M2j36L2R8j11J0qj3K0m1P2n2L0kL8L0o8k3M1QN0
6472B9l3J91j16j40KM0M3L6M3j15J11j50R0j51K48j69L1P2j99M4J03q8J34r5J03
6497F4r0j31J55j0j9J41q4k6p6j4J69J2j04PN4l4Q4J4j92KJ22O6j84R4L6q4O5
6524C7n7O0k3j1P6k7m2P0r0j6P2j46J0J55j18J4KN7L1j20MO9LO0m9q6J10l7M2
$$ plain form
6328 -2 47 -77 85 20 48 -76 9 27 -40 -1 9 -21 85 -75 74 55 -55 -17 41 61 139 -90 -18 30 -53 6 78
6355 78 12 34 53 -21 -42 -38 55 5 -24 54 -109 -4 -3 -24 21 -7 89 -20 -48 -30 -104 -11 -6 52 64 127 67 52 9 -34
6385 -34 32 -12 -60 50 -26 -46 26 35 -44 83 -25 43 -73 20 113 84 -4 54 1 -91 -114 37 -82 9 93 12 -74 47
6413 47 -33 -80 -30 -15 -21 68 82 35 -9 -106 26 -61 59 54 -8 117 -17 48 -84 29 -23 -14 -88 -141 -26 11 92 43
6441 43 3 21 106 39 82 96 12 28 79 12 54 -82 -50 48 -63 -53 -61 -74 -54 -95 -23 -75 -45 -47 -9 21 -47 -70 -29 -21 29
6472 29 -4 187 71 -69 -67 -27 16 52 95 -20 91 -59 31 -120 128 -41 -10 62 -137 -93 10 -78 56 -39 64
6497 64 -26 -157 -2 -12 -31 110 26 0 -76 -90 79 91 -13 -6 48 14 98 112 -80 -78 44 110 -74 20 56 -28 37
6524 37 -20 40 17 6 82 55 13 83 -7 -23 49 -97 -87 68 -50 -36 -34 23 54 -66 -62 7 10 70 21 -65 45 8 50
6553E0j7O0k45R7Q6j67J82q4J21j23l4O6p7O5N0m8j00O3J1J0q0J18j9J04l1j06
6579d8J21j76J29o6n8J18R0j25o2N8N8j59P3q4J03l2J17M8j24l9q8K49j84K19
6603A38j32J1j5J5m1L5o3R6k07Q7K9L1rN3r6O5O5l1k9k0P7r4J18j56j8J49m2O
6631B2m6J34j28O7p2kj6j1O4M1O9j68R0m9n1J97j35j29J47l0l2N3O9j71J43l5
6657B1j11L8N2L9l9N2J4J8l8m4r8J06j7l3n8N2J4K0O4l0m0o5Q8m0Ol3Q3P0l9j13
6687f1M0M1J1n5j9K1n0M1pJ7k8NJ62r4M0j19P6j50J52j5L6p6J09j59j4Q7j0N4
6715C5O9p2o2K2Qj03L3m8K35j22K7NKl1K3N7o3o5M2r9J31r5pRn9J66j16P1l4J23
6745H2j49J8j4N3M2K8o2j0RMK3K2m3MJ4J0q0Q7n0M6N5j45%J6Q8m1k4J09j7m3%
$$ plain form
6553 50 33 93 -152 -55 31 -136 46 -38 83 -40 -74 -8 -85 -20 30 -18 -118 -55 -44 -34 -114 4 -15 89 58 -48
6579 -48 73 -103 26 -40 -98 20 110 -15 -77 -19 39 -120 -47 -131 -28 -60 57 105 -19 -58 -146 103 -81 138
6603 138 6 17 2 17 -24 11 -52 44 -163 -76 -47 -16 -25 28 -68 -3 62 31 2 -18 59 -35 83 -73 -91 58 16 22
6631 22 -24 110 -18 49 -23 -25 -41 -52 12 53 122 -46 44 -5 -56 141 6 -123 24 -6 -38 15 84 -87 56 21
6657 21 -90 -52 0 39 0 52 66 84 46 2 -96 10 -7 -40 -98 -46 -32 -12 52 22 -18 -83 5 -35 -29 -62 21 91 52 -61
6687 -61 -21 20 31 -24 -43 -22 -72 -31 -38 -21 -49 -44 118 24 64 -55 21 -129 23 8 44 -32 77 -82 -96 -9 -19 35
6715 35 104 32 -30 -8 0 -103 -70 -118 117 -5 22 27 29 -2 21 78 15 -50 -8 -107 24 -71 -78 -69 -128 38 -78 -7 -41 82
6745 82 -67 -49 -63 -10 32 60 -2 -12 -3 1 24 46 3 7 21 31 -49 38 -12 34 89 -56 -56 -40 48 7 -17 92 75 32 32
6776C2l8Nl8J04o0o2q0J89o3L3J6o2M4k7o4k3Q0k4M5l5J7N2r6KR8n9m7k6Q0L8
6806C1k5k3m3J9K7J3j10J7R4q5J08Pl2m5R5j25P4j04J51q4J5q5J13j7J5K4N0o2
6834A3O3q3r5N5O7p2m2J02N5j50lm8J28O4j43N9pN7m3Q2r0J30j23K1M3N5j50K3
6862c2O3or7J48j7O9j84P7o8J4P3j0q2N3o4J4N9j10Q6Q8r6K1M9o0j1n7J76j6q6
6891fmm8O9K0r2J35o4K7J1Pj42P2M2l9P2p1P2r3Np7J19j4pl7N5j9m7J09J8j46
6921g3J14l3J4Q9n1j01Q9%l5L9o4J14k6q2J20p6l4J1j1n9L9Q7k9j02n1J00l8M1
6949hM0K2L9j46l0M3K22l15J06r6J23q3K11j02rlm5P1p8Q4L2j45O0L3q1O2M5j41
6977h9LO0N9k2M5k1O6j44K3K7k2o6J30o4n3nK09o0L4j21N3j05Q1M9j61J95r3p0
$$ plain form
6776 32 -6 -1 -39 65 5 -57 -137 52 -11 22 38 -24 20 -7 -71 -94 -14 -38 7 -28 -11 41 -55 -53 45 -14 -61 -87 -7 31
6806 31 6 -17 -60 -41 -14 -1 -111 -94 0 -85 23 30 -2 -47 48 -77 -3 -107 44 -40 -25 -110 3 -14 1 25 75 13
6834 13 76 -7 -102 -47 20 -52 -94 8 63 -87 -90 -138 -10 54 -89 -30 -37 20 -23 59 -31 99 -24 -3 40 95 -55 -32
6862 -32 31 25 -72 76 59 128 -56 21 -47 -33 40 30 -52 1 -63 -49 10 -100 -14 74 -22 -1 48 -12 -23 -80 96 80 -6
6891 -6 -10 -58 11 31 -61 74 10 37 48 55 -87 -15 27 -12 60 -11 61 -32 -27 -104 15 1 -6 -43 12 -7 -54 55 73 -73
6921 -73 41 8 22 111 60 -41 48 48 13 52 -12 102 76 -6 114 38 4 15 4 -55 -16 71 42 -60 -111 -11 -49 -8
6949 -8 32 54 93 -53 -83 -40 182 -133 -27 -123 0 -83 128 26 17 14 -31 40 -38 46 78 -67 -7 26 -55 7 52 -89
6977 -89 -86 -26 33 11 56 35 101 -43 -20 7 -15 -81 49 -15 -68 -73 136 76 110 -11 42 -63 18 67 -94 101 8 -62
7005f2J32p9q4J43k9l4P7k9n0j6J06j29p2J13O3r5L2J5Mj4K2n6N5k9o0R9j32J11
7033Bj4R5j30L1NJ06j17O9r0n2L3L9k8O8J3M8J8n2q0%K1j7L2L7n2J4J07j7k3j45
7063g9k8J64n5K4j07M6J37p8p8M5P5Qj13m1R8L8j9q0J23q6m1P9Rk0o9N6j2J2j35
7092a27J21O6m1J5pj53J82j1pOM2jo1j5j43J79l5L4l5N2n0n1q3R2M4j2j10Q2p
7121c4m6R1j4j6mQ9Ko7m2J14j77J40M9l6L2q2M5n4J17p3p1m8j2J21r2R1n9L3o
7150im5J13j34k8J4J71l8r2L0R0m8q8O2m5J1L3j0J13j10j0l4oO4Rm8P0j12J45
7178F8l0r1N9K0r3O4J8n8j7J10m6J2QOmo5L8j04J89K8j55o6J33J00j84q4J14j03
7206a33J04R1j11j7O0k8%M6m6J53j66p4Q1J33j05Q6j90N2J00J1r2N1k4J53j36
$$ plain form
7005 -62 70 -9 -93 50 21 -13 64 35 -15 -31 75 -54 -126 -13 50 -45 -13 2 6 -8 14 -42 13 -16 -76 23 -109 2
7033 2 -12 83 -47 -16 -11 95 -22 47 -43 -95 -62 -23 -51 17 30 78 96 44 -36 -36 -15 -32 0 37 -15 -1 106 89 66 -79
7063 -79 -107 57 2 26 -81 -35 102 24 -54 -9 66 74 -39 -80 18 56 37 -43 80 -6 -47 32 41 21 -48 8 -4 8 -127
7092 -127 -6 60 19 34 27 -126 56 45 38 44 86 85 24 9 -134 45 10 44 9 61 11 -40 -123 -31 13 1 -109 -27 -34
7121 -34 -80 11 -3 -19 -23 66 68 1 -41 73 -104 36 85 49 81 -1 44 -10 107 34 -37 -85 -97 24 -68 23 -36 -3 -9
7150 -9 -54 59 -75 -103 -89 82 44 -48 -18 72 24 -64 -2 -47 -36 -3 -13 100 -10 -20 -54 -60 4 13 -35 35 -77 68
7178 68 38 -53 6 26 -67 -3 15 -43 -60 50 4 16 24 30 26 -39 -1 -105 84 112 -43 -109 24 124 -60 -144 -30 -133
7206 -133 -29 62 -49 -66 -6 -34 -34 12 -34 119 -47 -121 -40 93 -12 74 -116 -64 36 47 -45 6 -18 135 -1
7231aK1p5Q7R2l6j13J26r2j24Q4K6kq9Q5R7n6j55P9J4q0N2R4l0O1o3l5J18q7j01
7260a03O0M4n2Q4q3M0j9R2l8m4j9Q2j14OJ60j09O1j69J27J34k39J25q4J43j64
7285g9N2N2k0q0J4R4L%o1N3J03j06r4P7r1k4J20k5m8O0r8J08Q9p7J9r0J6j8J34
7314H3l7J9o0Ljj5K2j7n7J21o3Rk0J12j47lN6M6j48J52lj39j06J23J35n7J6Ko6
7343d0J00l2j17J08k4m9k0L6J57j97Q0q3K58k23n9P1N9k8n1R7Qn6l7M2j3k6MK4
7371a1N0r7kL3J4J3q9L1M7J38j22j8l9J1N4o5J59r2r4J05J93k26L2j68O3O4N4
7398C8KL3q0p5Q5qJ0p7M0n2K4M1m9J1N5o6Q1mk1Q2k9m1o3K33k14K5K4q7pK4K7
7429c8qJ19j20L8J8j8N8K0o5P4k1rp1Jn3J64q5p1J34n0N2l6j2j9nm6K3N3r3J20
$$ plain form
7231 -1 20 -55 32 124 88 -25 101 9 -115 -31 -5 -7 -96 -11 86 30 -125 -46 -32 -112 -60 34 4 65 2 -33 85 -2 -103
7260 -103 -43 1 -51 33 -50 -10 -29 63 25 -19 -38 44 -70 -64 96 -13 48 -121 6 140 -99 26 -58 85 -79
7285 -79 -27 25 5 -75 -61 33 36 36 -25 28 131 25 -69 8 -83 -107 13 -12 -60 0 -98 10 99 22 41 -49 -33 -51 83
7314 83 46 65 5 8 7 -8 14 -3 -60 61 -2 7 -13 99 -48 -51 5 51 -97 55 52 -87 -193 -70 65 8 24 26 -40
7343 -40 60 28 -89 19 -5 -54 -74 -38 119 -78 2 -81 177 -46 -105 -34 25 -3 -54 43 51 -5 -42 0 -13 -39 -35 -11
7371 -11 39 -58 -60 -27 -13 0 -89 -58 -11 127 5 -13 -52 -41 13 -52 107 15 -79 26 219 -7 25 -143 -80 -16 38
7398 38 40 73 -7 -82 3 -5 5 -72 -32 -84 -60 -19 -68 -57 -2 -68 13 9 -12 70 41 0 -63 170 -44 -19 5 -82 -89 -65 -38
7429 -38 -46 73 -47 -9 9 -9 49 69 4 78 57 48 -23 -22 -75 89 4 -67 67 17 69 33 21 2 -3 -49 -26 27 -66 54
7459E4r5K9l6K6n2K8J17r4J1p4L2%J1Q1n4J0j2Q0p3N4Lq2N1p6J30j53J09Nj9M8
7489E9q1J35j39O9Lpn3J43p2l5n2N9j36J01l2J45j86R2O6o0j2jj3K4p1L5p6J34
7517C9J8m8q5N7L8j03J10n4n6J09n9K7J56j36J02j9j08M2Q4j42qO0Jq3J05m2M7
7544E2n6N7l2j9mk7Q7L8j2k1m7M3j17J20Q1j69Q3j10J08j17R5j08J45k8l2n9J19
$$ plain form
7459 54 -41 -12 -48 -22 -74 -46 71 -23 -12 -86 -54 -54 -43 38 -16 -6 -18 62 -11 43 46 -36 15 -61 69 -84 25 30 11 59
7489 59 -22 113 -26 43 46 39 -14 129 57 22 -30 29 -107 -6 -38 107 -79 13 79 19 7 6 -7 17 -54 -19 -95 39
7517 39 57 9 -76 -19 19 -84 26 -28 -84 25 -34 -7 149 13 115 96 -12 30 114 -28 -36 24 25 -58 47 5 52
7544 52 -4 53 21 2 -2 -29 58 96 84 63 16 59 -58 62 143 -26 57 -53 55 -62 33 -75 70 42 10 -49 70
$$ [...]
8191c5
##END NTUPLES=NMR FID
##END=
