##TITLE=1H_DE-80H_X3
 200.13MHz, d2o
 8 sc
 
 19ns.26.2.2025
##JCAMPDX= 6.0         $$ Bruker NMR JCAMP-DX V2.0
##DATA TYPE= NMR FID
##DATA CLASS= NTUPLES
##ORIGIN= UXNMR, Bruker Analytische Messtechnik GmbH
##OWNER= pz
$$ XWIN-NMR		Version 3.5
$$ Wed May 14 14:40:40 2025 Russian Standard Time (UT+4h)  Yarkov@DPX200
##.OBSERVE FREQUENCY= 200.1313
##.OBSERVE NUCLEUS= ^1H
##.DELAY= (6, 6)
##.ACQUISITION MODE= SIMULTANEOUS
##.ACQUISITION SCHEME= undefined
##.AVERAGES= 8
##.DIGITISER RES= 18
##SPECTROMETER/DATA SYSTEM= spect
##.PULSE SEQUENCE= zg30
##.SOLVENT NAME= CDCl3
##.SHIFT REFERENCE= (INTERNAL, CDCl3, 0, 14.3821)
##AUDIT TRAIL= $$ (NUMBER, WHEN, WHO, WHERE, WHAT)
$$ ##TITLE= Audit trail, XWIN-NMR		Version 3.5
$$ ##JCAMPDX= 5.01
$$ ##ORIGIN= Bruker BioSpin GmbH
$$ ##OWNER= Yarkov
$$ C:/Bruker/XWIN-NMR/data/yarkov2/nmr/H-C/1/audita.txt
$$ ##AUDIT TRAIL=  $$ (NUMBER, WHEN, WHO, WHERE, WHAT)
(   1,<2025-05-14 14:39:29.95 +0400>,<Yarkov>,<DPX200>,
      <created by zg, POWCHK disabled, PULCHK disabled
       configuration hash MD5:
       00 E9 B6 7A A2 85 ED C7 34 08 36 98 17 FE 4E 26
       data hash MD5: 16K
       CC 1A E4 BA 07 E9 6C A5 0D BD 5E 8D B1 5D 32 E2>)
$$ ##END=
$$ 
$$ hash MD5
$$ 7E 4A C5 0A E8 F7 7F 7E 48 8C 2A C6 2E F6 39 C0
##$RELAX= 
##$RELAX= 
##$RELAX= 
##$RELAX= 
##$RELAX= 
##$RELAX= 
$$ Bruker specific parameters
$$ --------------------------
##$DU= <C:/Bruker/XWIN-NMR>
##$EXPNO= 1
##$NAME= <H-C>
##$PROCNO= 1
##$TYPE= <nmr>
##$USER= <yarkov2>
##$AMP= (0..31)
100 100 100 100 100 100 100 100 100 100 100 100 100 100 100 100 100 100 
100 100 100 100 100 100 100 100 100 100 100 100 100 100 
##$AQSEQ= 0
##$AQ_mod= 1
##$AUNM= <au_zg>
##$AUTOPOS= <>
##$BF1= 200.13
##$BF2= 200.13
##$BF3= 200.13
##$BF4= 200.13
##$BF5= 200.13
##$BF6= 200.13
##$BF7= 200.13
##$BF8= 200.13
##$BYTORDA= 1
##$CFDGTYP= 0
##$CFRGTYP= 5
##$CHEMSTR= <none>
##$CNST= (0..31)
1 1 145 1 1 1 1 1 1 1 1 1 1 1 1 1 1 1 1 1 1 1 1 1 1 1 1 1 1 1 1 1 
##$CPDPRG= <>
##$CPDPRG1= <>
##$CPDPRG2= <>
##$CPDPRG3= <>
##$CPDPRG4= <mlev>
##$CPDPRG5= <mlev>
##$CPDPRG6= <mlev>
##$CPDPRG7= <mlev>
##$CPDPRG8= <mlev>
##$CPDPRGB= <>
##$CPDPRGT= <>
##$D= (0..31)
0 0.7 0 0 0 0 0 0 0 0 0 0.03 0 0 0 0 0 0 0 0 0 0 0 0 0 0 0 0 0 0 0 0 
##$DATE= 1747219169
##$DBL= (0..7)
120 120 120 120 120 120 120 120 
##$DBP= (0..7)
150 150 150 150 150 150 150 150 
##$DBP07= 0
##$DBPNAM0= <>
##$DBPNAM1= <>
##$DBPNAM2= <>
##$DBPNAM3= <>
##$DBPNAM4= <>
##$DBPNAM5= <>
##$DBPNAM6= <>
##$DBPNAM7= <>
##$DBPOAL= (0..7)
0.5 0.5 0.5 0.5 0.5 0.5 0.5 0.5 
##$DBPOFFS= (0..7)
0 0 0 0 0 0 0 0 
##$DE= 6
##$DECBNUC= <off>
##$DECIM= 32
##$DECNUC= <off>
##$DECSTAT= 4
##$DIGMOD= 1
##$DIGTYP= 9
##$DL= (0..7)
0 120 120 120 120 120 120 120 
##$DP= (0..7)
150 150 150 150 150 150 150 150 
##$DP07= 0
##$DPNAME0= <>
##$DPNAME1= <>
##$DPNAME2= <>
##$DPNAME3= <>
##$DPNAME4= <>
##$DPNAME5= <>
##$DPNAME6= <>
##$DPNAME7= <>
##$DPOAL= (0..7)
0.5 0.5 0.5 0.5 0.5 0.5 0.5 0.5 
##$DPOFFS= (0..7)
0 0 0 0 0 0 0 0 
##$DQDMODE= 0
##$DR= 18
##$DS= 0
$$ [...]
##$SUBNAM2= <"">
##$SUBNAM3= <"">
##$SUBNAM4= <"">
##$SUBNAM5= <"">
##$SUBNAM6= <"">
##$SUBNAM7= <"">
##$SUBNAM8= <"">
##$SUBNAM9= <"">
##$SW= 18.0517328524113
##$SWIBOX= (0..15)
0 0 2 0 0 0 0 0 0 0 0 0 0 0 0 0 
##$SW_h= 3612.71676300578
##$TD= 16384
##$TD0= 1
##$TE= 0
##$TE2= 300
##$TE3= 300
##$TEG= 300
##$TL= (0..7)
0 120 120 120 120 120 120 120 
##$TP= (0..7)
150 150 150 150 150 150 150 150 
##$TP07= 0
##$TPNAME0= <>
##$TPNAME1= <>
##$TPNAME2= <>
##$TPNAME3= <>
##$TPNAME4= <>
##$TPNAME5= <>
##$TPNAME6= <>
##$TPNAME7= <>
##$TPOAL= (0..7)
0.5 0.5 0.5 0.5 0.5 0.5 0.5 0.5 
##$TPOFFS= (0..7)
0 0 0 0 0 0 0 0 
##$TUNHIN= 0
##$TUNHOUT= 0
##$TUNXOUT= 0
##$USERA1= <user>
##$USERA2= <user>
##$USERA3= <user>
##$USERA4= <user>
##$USERA5= <user>
##$V9= 5
##$VALIST= <valist>
##$VCLIST= <CCCCCCCCCCCCCCC>
##$VD= 0
##$VDLIST= <DDDDDDDDDDDDDDD>
##$VPLIST= <PPPPPPPPPPPPPPP>
##$VTLIST= <TTTTTTTTTTTTTTT>
##$WBST= 1024
##$WBSW= 4
##$XGAIN= (0..3)
0 0 0 0 
##$XL= 0
##$YL= 0
##$YMAX_a= 67510
##$YMIN_a= -37815
##$ZGOPTNS= <>
##$ZL1= 120
##$ZL2= 120
##$ZL3= 120
##$ZL4= 120
##$ABSF1= 10
##$ABSF2= 0
##$ABSG= 5
##$ABSL= 3
##$ALPHA= 0
##$AQORDER= 0
##$ASSFAC= 0
##$ASSFACI= 0
##$ASSFACX= 0
##$ASSWID= 0
##$AUNMP= <proc_1d>
##$AZFE= 0.1
##$AZFW= 0.1
##$BCFW= 1
##$BC_mod= 2
##$BYTORDP= 1
##$COROFFS= 0
##$CY= 83.5205535888672
##$DATMOD= 1
##$DC= 2
##$DFILT= <>
##$DTYPP= 0
##$F1P= 10.8118882576601
##$F2P= -7.23987719738617
##$FCOR= 0.5
##$FTSIZE= 0
##$FT_mod= 4
##$GAMMA= 1
##$GB= 0.15
##$INTBC= 1
##$INTSCL= 1
##$ISEN= 128
##$LB= 0.25
##$LEV0= 0
##$LPBIN= 0
##$MAXI= 10000
##$MC2= 0
##$MEAN= 0
##$ME_mod= 0
##$MI= 1.114404
##$NCOEF= 0
##$NC_proc= 0
##$NLEV= 6
##$NOISF1= 3.799351
##$NOISF2= 2.8
##$NSP= 1
##$NTH_PI= 0
##$NZP= 0
##$OFFSET= 14.38212
##$PC= 1
##$PHC0= -1350.924
##$PHC1= 10.53375
##$PH_mod= 1
##$PKNL= yes
##$PPARMOD= 0
##$PSCAL= 0
##$PSIGN= 0
##$REVERSE= no
##$SF= 200.129724274929
##$SI= 16384
##$SIGF1= 3
##$SIGF2= 2
##$SINO= 400
##$SIOLD= 16384
##$SREGLST= <1H.CDCl3>
##$SSB= 0
##$STSI= 0
##$STSR= 0
##$SW_p= 3205.1282051282
##$SYMM= 0
##$S_DEV= 0
##$TDeff= 0
##$TDoff= 0
##$TI= <>
##$TILT= no
##$TM1= 0
##$TM2= 0
##$TOPLEV= 0
##$USERP1= <user>
##$USERP2= <user>
##$USERP3= <user>
##$USERP4= <user>
##$USERP5= <user>
##$WDW= 1
##$XDIM= 8192
##$YMAX_p= 0
##$YMIN_p= 0
$$ End of Bruker specific parameters
$$ ---------------------------------
##NTUPLES= NMR FID
##VAR_NAME=  TIME,          FID/REAL,        FID/IMAG
##SYMBOL=    X,             R,               I
##VAR_TYPE=  INDEPENDENT,   DEPENDENT,       DEPENDENT
##VAR_FORM=  AFFN,          ASDF,            ASDF
##VAR_DIM=   8192,          8192,            8192
##UNITS=     SECONDS,       ARBITRARY UNITS, ARBITRARY UNITS
##FACTOR=    0.0002768,     1,               1
##FIRST=     0,             0,               0
##LAST=      2.2672688,     0,               0
##MIN=       0,             -37815,          0
##MAX=       2.2672688,     67510,           0
$$ Real data points
##PAGE= N=1
##DATA TABLE= (X++(R..R)), XYDATA
$$ [...]
758C5o2k5J4L3M0j12O4k0J6Q0k29J94kj22kJ57Kn7M2n5J9K2m7mJ3q5J95j33M0
787A1P6l1r7J28j32J40j64P4j8q6P3JK0l9N6j62O1J11J77j87r6M5l0J66j22N4
813B9K8j23R9mM3q8L2j9N4j06P9q3rO7P8j40J84l3r1m2J9l6l2Q8J5J5p8R7n5m1
843e3M5m2M8k5O2N4n3kp7k5MO9n6M0J34p6j53N3L6N3j28J12Mj18J13n2K57k69
871d5J17Jo4K9mO4k11J47m6r5Q7Q6p3P8p9J13j56J33K1q6mj23M3J69r2n2Q8Pk16
900a63J59p2K6P1N4o9O8k4J5Mq2R5j12n4J61p4M0n9j1O8m0K1Q0p3j38J53m3M6
928D7q6L6O7l0l4R4q7j00K11r7l5l2j9Q1M5m8n0P9o6R3j30L6RQ9n7l2l6j1O6m7
958d4J21q1Pk5K6k4J25k7q5M7j05l4R3QL9J2l1j53N7N0k3J24r9Q1l3Lj76K28M8
$$ plain form
758 35 -27 -52 -38 -5 35 -77 -13 -33 -17 63 -166 28 26 -96 -98 59 61 4 46 -9 10 32 -15 -19 -6 -91 104 -29 11
787 11 87 56 -41 87 -45 95 -69 5 -13 -99 -26 -25 -5 -44 12 -150 -89 22 199 12 -84 -39 -69 97 -25 29
813 29 57 -66 33 29 72 -16 16 -3 51 -55 24 -59 -68 -1 77 -63 121 88 -3 -45 -26 -62 -94 -6 9 24 -54 43 -12 -53
843 -53 -8 -50 -2 -27 35 89 36 34 -43 -68 -64 5 -51 -11 123 47 -106 -53 -17 36 -92 20 24 -94 19 -33 224 -45
871 -45 72 73 9 38 34 98 -113 34 -12 -107 -20 66 -7 71 -8 105 -51 82 103 17 13 -110 -67 102 10 -42 46 53 -163
900 -163 -4 -76 -50 21 75 6 74 50 65 69 -13 82 -30 -84 77 3 43 -16 -27 41 1 22 102 29 -109 44 1 47
928 47 -39 -3 64 34 0 94 7 -93 118 21 -14 -46 -65 16 61 13 -37 42 -24 69 -61 -25 -16 73 16 -16 -52 -63 3 -44
958 -44 77 -4 3 -22 4 -20 105 78 -7 40 -65 -99 -6 2 41 53 22 -131 -74 -24 -47 77 -22 59 26 29 -147 81 129
987A29k07P9J9j9Q9L8k76J16P9j6j37Q6j58K09n3j7n7RQ7M2n2Q0j7j15J83o2O
1014F5p8n4O1k9P0Kj0j3k9L6L5r2KJ17r5k8K4L0J4m6r5Q9k5j4J24o6J5K4O5j22
1044b3l1K15j68j7m8J14pn0P9n7r3N0j3j5Q3k5M3nK0j15k4O8qR6p0K2M8r2O3n0
1074a0l2J17q7L9o1R9j03n3J31L0j1k6L6r3Q5j08m8J50o0j04Q6J8j8P7k3M0q4
1101a3O2j34P9J92j78J9J5j2j20J55K2m7o4l5m6JK6Q7M1J7q2P6j3l3lm5O8l8K1
1130A8q5J03r4nN7k1qJ8J0Q8j21K8k5OL8O1n0k4J5k9J09j48P4Kq3Kk4J37o7J5
1160cN2j13J26O8k44N4J30j48J8J27l2j18Q2Rj51J11l8K1k6n4K03q6l0Q6j54K18
1186A08j47L9Q8L3j01J5Pn2J1l6m9J27l4P4j14L7Qjp6J19j07M0R6K0l7p6M2k4
$$ plain form
987 129 -78 1 20 1 90 128 -148 -32 47 31 -106 -20 -178 31 -22 -39 -96 -87 0 42 -10 70 53 -62 121 59 65
1014 65 -13 -67 -6 -35 35 37 27 14 -15 21 56 -36 -34 83 -12 -40 -16 14 28 -18 -113 -24 -49 -63 61 -5 10 34 99 -23
1044 -23 -54 161 -7 -24 -72 42 35 -15 64 7 -86 -36 -49 -64 19 -6 37 32 52 -63 -87 -19 -27 69 -1 21 69 -23 40 -10
1074 -10 -42 75 -12 27 -34 65 -38 -91 40 70 59 33 69 -24 61 -47 -95 55 -5 -109 -23 -5 -23 54 31 71 -13
1101 -13 49 -85 -6 186 8 27 42 30 -90 65 87 40 -24 -59 -105 -104 -78 9 50 67 -15 61 48 15 12 -33 35 -3 18
1130 18 -67 36 -58 -63 -6 -27 -35 -17 -7 81 -40 -12 -37 -31 7 68 18 -6 9 -20 89 -59 15 17 -66 -64 -88 49 -18 -3
1160 -3 49 -64 62 130 -114 -60 70 -78 -60 67 35 -83 -1 8 -143 -32 -70 -49 -75 -129 74 -12 -42 44 -110 108
1186 108 -39 0 88 121 20 35 42 -10 1 -35 -84 43 9 83 -31 6 14 13 -63 56 -51 -11 85 105 68 -8 34 10
1214A0O5j12J7k6k4Pk1PJ50J2j23n2J40r7Q2k4Q8k9k0P7k42Q8J06j01N5l1O8j01
1242c1M7J1r5K3Q4KR8j77l3L4P4M3p3k5m7R9o4m3J23%M8o7lp8KN3k6L3J8K8k23
1273a65M5K85j45op2Kj2J24R9k86J37k16K77k3J4L4j48rJ51j74K06j71J13m6n3
1298c9O8ko8ko5J22j01K2KP6Rn2l1O7k1L2N2no5ON0r0J10k8j29M1K1Mk2q3Q8K7
1330fJ61p7m0k5j5q3J4m1R5M6j38M5J37q5M4p0L3J38j91o5J00J04m6q0L3l8n0
1357a00J13m4OJ05j13KO7q9J8m8P6M6j22M5L1K5OK0L4o2J30j38P6o2L6j35J05
1384B8m9r7J46M5j9r5M0p6K8J34L0l0q0nOr5J02j2KM4l5L3p8O8k5o1PM1o4N3N0
1415C6k1n7L0M4K1m3O6p6o4J34q3P6n2N7p4M9l9j20L9O6Nr1M9Q1kN9m3j9M8o2
$$ plain form
1214 10 75 -37 -20 -46 -70 -63 -84 -77 73 85 -38 -90 50 -47 35 11 99 70 50 127 -115 -27 79 -22 33 2 70 -31
1242 -31 16 27 -68 -45 39 41 139 -38 -71 -37 37 80 7 -18 -65 34 -30 -73 50 50 98 31 28 -50 -48 5 -21 12 30 58 -165
1273 -165 -120 165 20 14 -58 -56 -68 56 155 -131 6 -210 67 44 58 92 -56 -65 86 -88 118 -53 60 14 -39
1298 -39 29 27 -41 -43 -108 14 -87 -65 -63 13 22 -30 -61 6 -15 17 69 64 -1 5 55 -35 75 47 -82 -41 -20 -16 -38 -121 -33 -6
1330 -6 155 78 38 13 -2 -85 -71 -112 -17 29 -109 -64 73 -12 32 -38 -5 133 -58 -123 -23 81 35 -45 -12 -50 -100
1357 -100 13 -31 -25 80 -33 -31 36 -53 -35 -83 -7 39 -83 -38 -7 18 24 44 78 16 146 8 84 22 58 -77 28
1384 28 -21 -118 28 73 54 -41 -1 -77 -49 85 115 85 5 0 6 -89 13 1 3 47 12 45 -33 35 10 -51 -44 -3 -67 -14 36
1415 36 15 -42 -12 32 53 10 76 0 -64 70 -13 63 11 68 -6 43 4 -116 -77 -11 -6 -97 -48 33 31 90 47 28 76 14
1445A4L2K1m2k0J8M7n4M3j40R5J2j88J81jn0P1q9k4l4P0o4J2J23P2l7q3L5M9J2
1474H1j10k5J11j4M1j27p1O9J24K7j76q1K07l9O4p7R5n0l4j4o9J57r8p8K0N4j0
1501b3k7J53j81J00N4j76N3MQ0o1J33o7j31N3O4J0j5o0qO6o0L4j01J86k0n4J6
1528B2Rn8J05j35j3Q6n9n1N8oO5j9l0j1O2O7j06P7J5j27L9J12o1r0N1m7J51q9
1556A7J4Q9j30l0rJ5K2pm8P1o2J24L6q1L9m1j2j17J18l6P3j49k8K42q8k2j73J04
1584f9K2nJ19j53J53j92J28J2l1J1O1q7JK1P5q9M8m3Q8j4p7OR2K4l1o2m3M4m4
1613c5K3J41j65P6l0M7m4M7m4OR3j67M1m6L3J7j2M8k7P3l1k0l8L1L5N2q9k9M7
1642C3j26M1J31p6j0KL1l4RL9m2N7j35K3nJ5O2J8j8p2J51JK1j09m1J3K6L9j12
$$ plain form
1445 14 46 67 25 5 23 70 16 59 -81 14 26 -162 19 18 -32 39 -50 -74 -108 -38 -102 -90 33 105 68 -15 20 69 81
1474 81 -29 -54 57 43 84 -43 -114 -45 79 106 -70 -151 56 17 81 4 99 49 15 1 -68 89 -9 -87 -67 -13 -23
1501 -23 -50 103 -78 22 76 -100 -47 -43 37 -24 109 42 -89 -36 28 38 23 -37 -45 21 -39 -5 -106 80 60 6 22
1528 22 31 -27 78 -57 -70 16 -43 -94 -36 -42 23 4 -26 -37 25 92 -14 63 78 -49 -10 102 41 -49 2 -45 106 17
1556 17 31 120 -10 -40 -49 -34 -12 -19 -67 4 -58 66 102 21 60 19 7 -110 8 -28 45 -104 -132 110 22 0 -173 -69
1584 -69 -47 -52 67 -86 67 -125 3 15 -16 -5 56 -31 -30 -9 66 -23 25 -18 70 56 -21 -15 77 101 70 8 -35 9 -35
1613 -35 -12 129 -36 40 10 57 13 60 16 22 115 -52 -11 -57 -24 -7 -19 29 2 75 44 24 -14 17 52 104 15 -14 33
1642 33 -93 -52 79 3 -7 -5 26 -8 1 40 -2 55 -80 -57 -62 -47 15 33 15 -57 94 95 116 7 -34 -21 5 44 -68
1671f8k2K42j96j5O7K6m2J8k7q0K01j76P7j0j17J22l7L8NL1j22P8nM9k4k9o7J10
1699B7j05P1O5P5o3m6p0N7P2n9n1K7L0k7K3o9M4k8L3M3k3J9j9j20%R1K8q2J20
1728F3j43J19J30j57N9j10P9q4J16J7j00lJ14o7r4L1O6N3m0q9Q1k03J64lm0O4
1754B3j35J3J06J9kK9j62M1K6RP4L0o9q5R2L9P9r7k1Q2m2j2j38L5J77j29m5j6
1782g9K1J08J5q6j65K78n4m8l3P3m0q8J88k6J0p8k1o7P5J04k5L2j94Q9M1oP6n5
1810D5q3L5M0k6l0NO1l6Kp9K8l6O5O0j60J29N6q2n3N6L6Rl3JP9j20M0P2n0r2J53
1841I2j07J7q5R9j58J35P9q1M5j60J75n0N8r4K6Mq0L7J3P3J8Pp7o4L1kQ5n5N2
1870C3k7j8O4n0p7M4J5N8m1N1p4R0j90R9k7P1j1j4P0k5j7n4J07K1p5j7r9M3Q9
$$ plain form
1671 -68 -90 152 -44 -59 8 34 -8 10 -17 -97 104 -72 5 -5 -122 0 -37 1 6 37 -85 -7 -12 37 13 -16 -83 27
1699 27 -78 -7 58 133 70 24 -46 11 83 24 -27 0 30 3 26 -43 1 -27 6 49 26 45 26 -94 -94 -3 25 -57 63
1728 63 -80 39 169 12 71 -39 40 -44 72 89 -11 -14 100 33 -61 -30 36 89 49 -40 41 -162 2 -1 -41 23
1754 23 -112 -99 7 26 24 53 -109 -68 -42 -33 41 71 2 -83 9 48 127 30 9 91 49 37 -101 -66 111 -18 -63 -79
1782 -79 -58 50 65 -21 -186 92 38 -10 -43 30 -10 -98 90 64 74 -4 -25 -92 -17 87 62 94 -100 -11 30 24 100 45
1810 45 -38 -3 37 11 -19 -14 47 11 13 -66 -38 -74 -9 51 -109 20 76 -6 -59 -3 33 42 9 10 89 -31 9 81 31 -61 92
1841 92 -15 2 -83 16 -142 -7 72 -9 36 -124 51 1 59 -35 -9 -5 -85 -48 -35 38 56 63 -14 -78 -47 -49 36 -19 33
1870 33 6 -12 52 2 -75 -31 -16 42 1 52 -22 68 -122 -23 -50 21 10 -4 66 41 24 -30 77 98 23 6 -93 -50 39
1899C9M5p6K4j1k7R3q7j14M5Q9j15J6P4J6nq7J76k28O6J02n8M0p9J10j13P6L7
1926D8NM8j05L4n6KK4k1O7L1rr9M1Qj20J10k8O1o5J4j4J22K4n6j0j06J16j40K7
1955d7J02r4j0N9PJn2J19k2m7nq2K4R3MK6n4l8KJ23k07J91n8o0Q6q2J08r2J8m7
1985c4K1Mm7J03Po4J05j24km0J45q7j4M8Q4j30J46r8r8N4L2Nj80K40r3j7P8j01
2013e7J06n2L7o2J14m0k7q6R6K6m5K2j95K01J9K1j25K13j03m8L2p8R6Q8k8j75
2039e0J38p9M3o3O7j17Q0j32J19q6O7o0R4L7p6n0p6K47j87J73p8l8kO1l2L4r3
2066e9O5o1K5J92j31m3j6J7L1j07O2J3L9j07J38j6m4J05j22M2j20P4P7j21K8J07
2092F8j14L2k2m9K7l8P4L4M1J8j01kL2R3k15Q3O5o1O0pO7j50J4JK1p1J22j25J13
$$ plain form
1899 39 84 8 32 21 -6 87 0 -114 -69 20 -95 -79 -5 11 6 -81 95 -133 -67 35 -23 17 -62 48 -65 11 48
1926 48 53 101 -4 30 -26 -24 0 -21 46 77 68 -31 10 18 -102 8 -20 41 -24 -10 -24 98 122 66 56 -50 66 -74 -47
1955 -47 55 -39 -49 10 17 18 -34 85 63 16 11 -71 -47 46 50 76 22 -16 -14 109 -98 93 35 -25 61 -21 87 -5 13 -34
1985 -34 -13 -9 -56 47 54 -10 95 -29 -31 -71 74 -13 -27 21 105 -25 121 23 -75 -21 11 16 -164 76 -17 -34 44 -57
2013 -57 49 -3 34 -28 86 46 19 -67 29 55 10 32 -163 38 57 78 -47 166 63 15 47 -31 65 153 125 -50
2039 -50 88 9 52 -11 56 -61 19 -113 6 -80 -13 -73 21 58 -18 -68 -144 103 -84 89 11 -27 -29 32 0 34 -59
2066 -59 6 -55 -30 162 31 -12 -28 -11 20 -87 -25 -12 27 -80 58 42 -2 103 -19 23 -97 -23 54 -67 -39 68
2092 68 -46 -14 -36 -85 -58 -96 -22 12 53 71 -30 -32 0 93 -122 -39 26 -35 25 18 85 -65 -51 -50 -29 -100 22 -103 10
2121A0L2j43R7j4K9n8P9k6q4j6Q5j2k4J03m3J9j18J70j27R0m5o6M8N2J4n2k3l
2149b6n9N2K2r5J42l9l9r0J13N5p6N4m5O6j6j6J2l4J33j81N6K5p0J37k19N5J12
2176B9J5m2o3R5l5K6J9j03P1K8M6k29K34o7r7j1O5JJ03j35J6J06j65J18l4K4M3
2203E8o5P8M7q7j05J78q7Q5q0l8j5O0K0n9J20m9n0qJ4m6Q5p1O2j06M4k9rK04j11
2232D0k05J81q8J39R3k30L9k0R5j03L4l6J9J02q4n2n2J16R9j02O4l5o6R2m2O9
2258F7j24M3L4o5k8J22Mj41J11j60P3K3N6p0N6q0J33jj27N9J05j05q6K21j26K6
2284B0j29P6Q6K5j63N9J41j55J10p6N9j14Q5N4r2j09P2L2r2J42K4p7q2K33k09
2309h0M1J05p6j6L2J5o0P3q6J09m4L2o8R7j11%P4N2j10R0N3j46M9J19j08Mp1k0
$$ plain form
2121 10 42 -101 -4 -18 11 -47 32 6 -78 -94 -9 -21 -45 58 15 34 -84 86 -41 49 4 -62 -14 38 52 0 -23 -26
2149 -26 -85 -33 -11 -106 36 -3 -42 -132 -19 36 -40 14 -31 35 19 3 15 -19 114 -67 -11 14 -56 81 -138 -83 29
2176 29 44 2 -61 34 -1 25 44 -59 12 40 86 -143 91 24 -73 -84 -19 -18 85 -50 -34 72 -93 25 -9 15 58
2203 58 -7 71 118 31 -74 104 17 102 22 -16 -31 29 49 -10 110 61 11 3 17 -29 56 -15 47 -59 -15 -44 -53 151 40
2232 40 -165 16 -72 67 160 -70 -31 -51 44 -59 -25 -61 -42 60 -24 -76 -128 -12 87 -15 49 14 -52 40 -2 67
2258 67 -57 -14 20 -45 -73 49 53 -88 23 -137 -64 -41 15 -55 1 -79 54 53 -74 -15 90 -15 -101 120 -6 20
2284 20 -109 -33 53 78 -85 -26 115 -40 70 -6 53 -61 24 78 -14 -123 -51 -19 -111 31 55 -22 -104 129 -80
2309 -80 -39 66 -10 -26 6 21 -39 34 -52 57 13 45 -23 74 -37 -37 37 89 -21 69 122 -24 25 144 36 40 -31 -51
2337e1Q3lm8Q4q6J16p6JJ9l5j08J16o2J35L4j23K9O5p5L1k17K14M5j32J72n7j17
2364d6M0NK5r6L8n7K18j68Q2q1N8n9KN5o3P5o8P1l4j1K3l6N1l5N9P2o2j36J02
2393B4J08k04K0J48j75N0lP6j80L7l8J52Kk0K2j70J42j9j7L6J10j00p2m9J82o4
2419bP1j51j5R9k6K1KPN0o9o9N9J05l5m2j3n4Q7l4m5O8K3rl7l3oO1M3p5P0p1j30
2451a50P0J44n7m5n0Q1N0M2j45N2jo0j8Q0K4rqj05J49p1P0O6j23K9n2j4M6mn2
2480f1J07j71J23nr4J28p6MM2J4j10Q8K3J0N0j0O5j64N6r7J21j70J42N0K6l1j58
2507i8P8R3q3KQ3j30Q8m8O6r4K4L4q6j4N3k7jj2K1M2k6l6J46j78J36j16R0j8m8
2536e9L2l5Qjk9K4j9j8J09k8n4mJ39l1K3J0n8r1J39j10%M7N3r2p8J83K4j47J38
$$ plain form
2337 -51 32 29 -19 65 -21 95 19 20 39 4 -104 12 -50 85 119 -4 25 90 15 46 -171 43 88 -44 128 71 -46
2364 -46 -6 -1 24 -72 -34 -91 127 -41 41 -40 18 -41 -39 16 -47 28 -40 31 -3 -14 9 -27 24 -11 48 120 58 -78 24
2393 24 132 -72 -52 96 -79 -29 -32 44 -136 -99 -137 15 17 -3 19 -151 -9 -28 -45 -9 101 1 -71 -120 62 -2
2419 -2 69 -82 -97 2 -24 -3 -1 6 56 -13 -82 -23 82 47 5 -8 -62 25 -9 -54 14 37 28 -9 -42 -48 13 56 -19 51 -20 -150
2451 -150 -80 64 7 -38 -88 -7 43 85 -60 -8 -9 -69 -87 -7 17 8 0 -105 44 -27 43 109 -14 15 -37 -51 -5 -9 -61
2480 -61 46 -125 -2 -7 -101 27 -49 -45 -3 11 -99 -11 12 22 72 62 127 -37 19 -78 43 -127 15 65 91 60 -98
2507 -98 -20 73 -10 -8 75 -55 33 -15 51 -43 -19 15 -71 -85 -32 -59 -60 -72 -51 -9 -35 -71 75 -103 33 -83 7 -11 -59
2536 -59 -27 -62 -54 -55 -84 -60 -79 -97 12 -16 -70 -74 65 34 57 67 9 -82 57 -53 -53 -6 47 -45 -123 60 84 -63 75
2565G5j29K7K3R9j10M9p1M0l8o2K03j53J30o2j44N8Q6j9J0M0Nl0n7J2P6j18P2
2592A2j03J37r3O1j13K3J76n6qJ8p1P7j92J26O0n1p0J23j85J76j29J02k3JJ10
2617A08j15j9N7j42R5Q6n3o3j7J52m2j6l2M9j6Rj54K49j16n1O8J5l4K5J11j23
2643C1r1oj8J55p9Q7m6n5pJ0O7j23J11k01J76p3nL0pM4oL8m1p1K09j55m2MK0N8
2673A4N5p6P7jp6M3p5L9m2J0j8j9M6L5r1p2K80k13R0j0n7J20k20P5l4J72r1j9
2701e8N8K6OJ5p3K2M3J8J9j64Q0J6K1p2j7Q4R5k34J23R2q3J0o2J3L2mL6M3k17
2730a32K19p7O9j73R9Ko3J8lM7J5J0j18J11l8j1K5L2mM4j67J85j16R7L9k14P4
2757c0%J94k22J06j03R4j61J20q2J3nJ22p6K1J4m4l7O4O5J2l6j06J2K2P1k4j3
$$ plain form
2565 75 -54 -27 -4 95 -15 34 -37 3 -35 -97 106 -47 83 21 -123 -65 21 2 12 52 57 27 -30 -18 58 -60 12
2592 12 -91 46 -47 14 -99 -76 100 44 36 54 -17 60 -132 -6 54 3 -67 56 -129 47 -82 20 -3 -2 108
2617 108 -7 -26 31 -111 -16 70 17 -46 -63 89 47 31 -1 48 32 41 -113 136 20 -31 37 52 18 43 154 31
2643 31 -60 -66 -84 71 -8 79 33 -22 -29 -19 48 -75 36 -165 11 -62 -67 -37 -44 0 -6 32 -9 -80 129 -26 -68 -64 -44 14
2673 14 69 -7 70 69 -7 36 -39 0 -42 -32 -50 -69 -23 12 -79 -151 129 -84 6 -4 -61 59 -161 -86 -120 52 -39 -58
2701 -58 0 26 32 47 -26 -4 39 57 76 -88 -8 8 29 -43 -60 24 119 -115 8 100 17 27 -35 -22 10 6 42 85 -132
2730 -132 87 10 79 -94 5 7 -56 -38 -41 6 21 31 -87 24 -14 -25 0 32 28 72 -95 90 -26 71 110 -104 -30
2757 -30 -30 164 -58 48 -55 39 -122 -2 -84 -71 -76 46 -30 -9 5 -39 -76 -12 53 65 29 -77 -65 -43 28 4 -9
2784iJ14q0k9J5n2P3q0J2%J5M0n2J8L9j9K0J3j67J88j20J05n7J4o0R4m1q7J47
2812E4j42L7N1m8J5R4j26Rj7j7L7O8k5Q9r7Kl1k0L8J07n0q7Q7l7m1M1J6J35j95
2841e3j15K32Lj63O0PKp2k5P3K4J13q2l1L9j07K20j42L2L5M4k8j20RP6P2j32J21
2869I2m5q8P8o7R3rm7Q2j37Q8Mn4K9m0l3L9j37J02pJ4m7J17o7N9p9O7rN3k0j30
2899i9O4N1K6m1l4r0J70j73N3L1P1K9p7J02p5J25k54J76r8j2L9K9l1J0N4j02J35
2926G9r4K0Jo3P5L1l1j10R6l2k5J08j6p4M4K4l6j03M5L5K8N1J04l7k07K1J27j15
2954e4k2Q0k3kq6P7k8O4j9P8o7K1K4j40J75j57J02O9j61N1J16j39M5j6q2K5J3
2981e6m5R3q0l2J47k06R9N3nJ3L7nRp9J71r1j3k1O6q9M2q7N5KnL9Q9j31k6L4N3
$$ plain form
2784 -9 105 25 -4 11 -41 32 -48 -36 -36 -21 19 -33 -15 24 5 25 38 -129 59 -61 44 -13 1 -59 35 -6 -93 54
2812 54 -88 -51 0 -48 -33 61 -65 -56 -73 -90 -53 15 -10 79 -18 -16 -47 -67 -29 78 28 -59 28 -9 -50 -9 7 142 -53
2841 -53 -168 64 67 -96 -36 -29 -27 -99 -124 -51 -27 86 4 -27 12 -95 125 -17 15 50 94 66 -54 -45 31 103 -29 92
2869 92 47 -41 37 -30 63 54 7 89 -48 40 44 -10 19 -21 -54 -15 -152 -50 -57 -43 -90 27 -40 19 -60 7 -2 51 31 -99
2899 -99 -35 16 42 1 -33 -123 47 -126 -73 -42 29 58 -19 83 8 133 -121 55 -43 -55 -16 13 -18 -8 46 -56 79
2926 79 -15 5 6 -57 18 49 18 -92 4 -28 -53 55 39 -35 9 33 -3 -106 -61 -26 2 53 157 120 -87 -66 61 -54
2954 -54 -76 4 -19 -21 -107 -30 -58 6 -13 65 -2 19 43 -97 78 -79 23 92 -69 -18 98 -41 4 -12 -94 -69 -56
2981 -56 -101 -8 -88 -120 27 -179 -80 -27 -32 -19 18 13 22 -57 114 23 10 -11 55 -34 8 -79 -24 -22 -27 12 101 -30 -56 -22 31
3012C1M6J1r7O1P0m2mk9n3K9j8o3o5J86j85P3M0o3nJ07l4O0k5M4nk8j01k9k2J04
3042fQ7np6L0k39J36P6L2J0j69J82j3J4J1n3M1J3j67J12r2P4N7K1l3n6L2M6M5
3070A10j68j9M2n0P1o8M0J05l2m2J24j57qM1Jk8Q6l7p7M6O5j13J56n8Q0j24R0
3097G6n7K9L0j39M8l8O2n6J10l1J2q5J11j01j3k6oP6N5Ol2m6PQ9j00k8N9l1j3
3126c2R4r1O0n7K9Mk8P2k7l5n3J95j01k3j02O4R4m4m8Q3m5K4p8l0J13p1L3L6J4
3155E0l6j22J85p7r8ON4J56k93Q3Q0P9m9j6M4q8RM3m4k5R4r2Q9N3o5q3N4M9o3
3184b3M6j02M7m3R5j02J86j72J06K2n6o3K0n8J02m9O6J0j08J50l9r6J05p5jM8
3210A6j06J15j21R2Rj21J42j2q9Q2r0R2K6o0M6q3K9p9J75n9m2J2K5K7Q6j27n9
$$ plain form
3012 31 77 88 -9 52 122 80 76 47 -6 23 5 -58 -123 63 -122 -49 -9 -72 -77 30 -4 56 31 75 70 42 -59 -88 -110 -6
3042 -6 81 76 0 30 -209 -73 3 35 45 -124 58 45 59 70 17 58 71 -96 16 -76 -2 55 76 43 -13 19 65 110
3070 110 -58 -77 -35 -85 -14 -82 -42 63 31 -11 113 -44 -52 -11 -10 -38 48 11 -66 -20 45 -68 88 30 110 -14 76
3097 76 19 48 78 -61 -13 -51 11 -45 65 34 46 -39 72 -29 -42 -68 -74 2 57 63 31 -15 -8 81 -19 -47 12 -19 -32
3126 -32 62 -29 31 -26 3 7 -21 51 24 -11 -64 131 30 7 -95 -31 63 19 -29 54 9 33 -45 -75 38 -33 0 36 50
3155 50 14 -108 77 0 -98 -92 -38 118 -175 -92 -12 67 18 2 46 -42 -33 10 -34 -59 35 -57 32 85 20 -63 -9 40 -23
3184 -23 23 -79 -32 -75 20 -82 104 -68 38 60 4 -59 -39 -97 5 -44 22 32 -76 74 35 -61 44 -31 -32 16
3210 16 -90 25 -96 -4 5 -116 26 14 -75 7 -83 9 35 -25 21 -62 -33 -112 63 4 -38 -26 -1 26 112 -15 -74
3237g4P5k0k3L4R0r7M7p8O9Q0j55J49m5p3R0p8K6J48j99m9K0N6m1K2M8j05J30
3264D7l8J0m3J00j55Q6j0l8R6n9q2m1Q2Q0l6j6r0R2K5n4j2OQ7k1p8R0qo9J50l2
3294F9l4ln3J5Pj3J00j25M6j5N4o3O2k2k9j6j5kJ7Rn0J05M6o0l3j9m1K3J19p7
3324Bm8P7m5j2N0p8J13p9J9k6P7j66R3K5J6j18J10o1P1m3J16J5j45k7M7j8M5J03
3352A13j30O3q4J06q9r8Q3R5j08L3K7p8m4K11j09J23j41R4q7l2Q2o3O3o0O1p4
3378d3L6M7m5l4%l9R4ll2P6p7J23j57J59j13J13j45K1k7Q2j00K6j6N9L0m5o3m2
3406a15O2pk3Q1O3j86J95L1j70o9J43J7m9M1M8j24m6J50q5N8k2O0n1K1q9O9Kl0
3434b5M3n6O7KL1j33L4o1J51r1L7n2J53r2j4KQO5o7k3J25j20m7K7k8j8J49q6k9
$$ plain form
3237 -74 1 -19 -42 -8 82 -15 32 -46 23 103 -52 97 52 -21 69 -9 17 165 -34 -83 -63 -7 -48 -26 22 -83 47
3264 47 9 19 -24 76 -79 7 -3 -41 55 -4 -86 -127 -45 35 -1 -17 -107 -15 10 -44 -56 -50 37 16 -62 28 20 -49 101 69
3294 69 35 32 -21 -6 1 -12 88 -37 9 -6 48 -15 47 25 -4 -20 -35 -37 -20 -11 -61 44 90 30 -3 -22 -63 -40 79 2
3324 2 -46 31 -14 -26 24 -54 59 -20 -1 -27 50 -116 -23 2 18 -100 10 -51 20 -23 93 108 -37 -64 -17 -35 10 113
3352 113 -17 46 -38 68 -21 -119 -36 59 -49 -16 11 -67 -111 100 -9 114 -27 67 -20 -52 30 -33 30 -30 31 -43
3378 -43 -7 40 -5 -39 -39 -78 16 13 -19 57 -20 103 -54 105 -8 105 -40 -19 -46 36 -64 -38 -54 5 35 -10 -73 -115
3406 -115 -53 -60 -83 -2 61 -125 70 101 -69 -138 5 22 -27 14 62 -62 -108 42 -43 15 -7 53 2 23 -66 3 5 -25
3434 -25 18 -38 29 31 62 -71 -37 -98 53 -38 -1 -53 100 8 -6 -4 4 69 2 -21 104 -16 -63 -36 -64 -82 67 -19 -48
3463d8Q7M9j15l5J33l1l8Or2M6Q0m4oJ10o0o8J06o1K2K1p7J3o3Q1j5J26j87pJ01
3492C4K3j7Oj26O5K0J7j8l0J06j47J8J48Lp9O2lr9k2Q2N2r8n6Q8N9j15l9M7j7
3521c6Q2o1N6r4J04Kp2n2QJ10k6r1O6M5M0p1lJ3K4L5r7l0J3j5P6J04j12o4K8o3
3551h1J15j90J47L4l2j4Jk1O5l0r0Q1j01Q3O8m4r5J26q0l6J27N4jj14l8M7M6r7
3579g0M0n3J32J6j31J89j59M8r5J08j7j24P9j4J22q4MO9M5r1K0JN1m2Qm8j23K20
3607A01J1j44Q6r2J02p8pO0K1M5j45O2j7Krr9O8J04p6p5L9J2o2R3n3l6l5K20j20
3636b2kQ8r6M9j5P7j02k0J25j05J01J7o4J4r3R2Jq5J16j92J95k3r2oJ22kN1j64
3664c5L2%o8Q7m2O3m4J4k3o3J8O0l3J42j51O5r5O3k9J76j59J05k0L5j14N8k5k
$$ plain form
3463 -48 39 88 -27 -62 71 40 2 8 -84 -38 42 -2 -8 102 42 -26 80 19 41 62 -15 -2 -65 16 1 127 -60 -67 34
3492 34 57 40 46 -80 -15 5 22 4 -26 80 -67 -49 99 102 23 85 82 -17 -39 43 95 -3 -59 29 88 -27 -66 -19 -36
3521 -36 46 -15 41 -53 51 53 -19 -71 -63 47 21 -70 -4 41 81 10 7 20 44 79 -18 -48 -35 -50 26 130 18 -46 -18 -81
3551 -81 34 -156 -9 25 -7 -21 -20 -41 24 -6 -96 -15 -116 -33 35 -9 -104 22 -58 -94 33 87 86 -28 -66 -19 27 -70
3579 -70 -30 -83 49 65 -66 123 -36 12 -83 25 8 -116 -37 -51 71 -13 -9 60 105 14 34 35 86 44 52 4 -119 101
3607 101 112 -32 54 -38 64 -14 -21 39 60 105 -40 22 5 7 -2 -101 -33 71 -5 -80 -41 -29 -91 2 -51 -87 -122 98 -22
3636 -22 -24 64 -32 17 2 79 -23 -43 82 -23 78 95 31 45 -48 44 45 -40 76 -116 79 56 -36 -42 80 78 129 -35
3664 -35 -3 -3 -71 16 -26 37 -7 7 -16 -79 -61 -1 -34 108 -43 22 -73 -10 -39 137 -22 83 63 98 -16 42 17 15
3692A5j4N6j42J41m1LrkK1K7l5K6j02N6M7L5p5m7NJ17j29j2J19j15j2J55o8J00
3720A20j03N2j21L1K3l9J1J36j51J13oj33J14oj07R6l0k0P0q6M8n2J29j39J55
3745A05j83J54l5Kp0J05j02N6q1KQ6q5P0M2j34J23j03M2Km7Q7n2P2j39J59r1Q6
3772G1qM5j50M5l4P3N9j15j3RL3j51J72m7Pj08O3N0M7j00Q0o2o3K0J51j28Q0q8
3800f2N8L7J2j0Lo9J45m2l2P6j38M8j47R4L0j01J55p6M6j1J7j06j8K29p4n8R5
3827A01lj52L8j3J5J8n4J82k02j3K7J7J30j07m5R5j01P6K4j9j8J4N4j7jPp9P1
3855D5k4k4R3j53P7p4P1q4oK6J54r5j7K0K4j99J26J9oJ49j33L7mm2N8Qj7j26l4
3884a31J02n2R7j66J84J2k2n7J01m3j25J91O4k36O7J04p8M4l3j42Q6N0M2j22L0
$$ plain form
3692 15 1 57 -85 56 15 18 9 7 28 55 20 46 -56 0 47 82 7 -40 -35 82 -47 -59 60 -55 -67 88 20 120
3720 120 17 69 -52 -21 2 -37 -26 110 -41 72 66 -67 47 41 -66 30 0 -20 50 -36 12 -40 89 -50 105
3745 105 -78 76 41 43 -27 78 -24 32 -49 -47 39 -46 24 66 -68 55 -48 -6 -4 -51 36 -16 56 -83 76 -15 71
3772 71 63 108 -42 3 -31 42 101 -14 -27 -18 15 -136 36 -11 -4 -112 -49 1 48 -52 28 -34 -97 -77 74 -54 26 -62
3800 -62 -4 33 45 35 38 -31 114 72 40 116 -22 26 -121 -27 3 -98 57 -19 27 16 33 -73 -91 138 64 6 101
3827 101 98 -54 -16 -29 -14 4 -50 132 -70 -83 -56 -39 91 -16 -61 34 -67 9 33 14 -4 10 64 47 46 53 -26 45
3855 45 21 -3 90 -63 14 -60 11 -73 -79 -53 101 6 -11 9 33 -166 -40 -21 -27 122 -11 26 22 -20 38 46 29 -97 -131
3884 -131 -29 -81 16 -150 34 46 24 -33 68 25 -100 91 155 -81 -14 90 12 56 23 -119 -33 17 59 -63 -33
3909c3J42j23l0P5j8j48J34jm3O6J7L0M2j03Q7j41J0N4L3j44R2j5o5K3J13l5O6
3936H5o6N8j4p4n0L4m5K8J27o3l7J09j61L4P2j9j19j5J22J7p9K8l7O2L2j16R9
3963A2k9M6q8O2kr8R1L5m2o6J28J00j84R9j2q2K9J25j81M3k8J59j00%L7q4J59
3990A29n9pj65J85j07nM2O9n1JJ9o5pj05J17O3o9RR7j46R8r2l7J04m2j10K55j51
4018c0L6k1J9K2q2J14m4m8l0P7n8O1j6j4r8K4K30j41L6k9Lj02J02p1J7Q4q3n7
4046i9Q9Km9J8n3k3R7k5R1o1l5M5n8K1l4J07j4k3K3R6j67O3j07J63n1n0J42j15
4074gm3J5kk7N4o4P6l9lJ24n6J1k4N4p5m7O3R1j17k8QK8k6rJ74p3p4N1k2r3J63
4105H3J6r1j1N6j32J31q8J27j88Q1P6r4Q6qK7k1k6j33J87j68OO2Kj3M0k2j0N2
$$ plain form
3909 -33 109 -14 -44 31 13 -135 -1 -2 -45 21 38 68 110 7 94 -47 -37 17 50 -94 -2 -17 -82 -59 54 19 85
3936 85 19 77 63 -11 -61 -27 -72 -44 83 20 -17 92 -69 -35 37 18 -101 -116 6 23 -56 -28 -65 -3 29 -87 12
3963 12 -17 29 -59 3 1 -97 -6 29 -13 -79 49 149 -35 64 52 -30 -1 124 -57 -14 -42 117 17 17 54 -30 129
3990 129 70 63 -102 83 -24 -29 13 82 31 32 51 -14 -21 -126 -9 54 -15 -6 91 -55 43 -49 -86 18 -24 -134 121 -30
4018 -30 6 -15 4 26 -56 58 14 -34 -64 13 -45 16 0 -14 -112 -88 142 1 37 8 11 -91 11 -60 -43 41 -42 -99
4046 -99 -10 -8 -57 -39 -92 -115 -18 -43 48 -13 -48 -3 -61 -40 -74 33 19 -4 19 115 -52 11 -96 67 16 -34 108 -7
4074 -7 -50 -35 -37 -64 -10 -74 2 -37 -40 84 28 39 15 69 -6 -53 10 101 -16 -44 -36 -8 -34 -43 131 58 -16 35 13 -80 83
4105 83 99 8 -3 53 -79 52 -36 91 -97 -16 60 -34 52 44 71 50 24 -109 78 -90 -84 -22 -20 -33 7 -15 -25 27
4133B7n5M0Nl9l3N3n2J04q0j6R4j57J88j36j5J82k8J0j40N1m0J8K4rJ44j10k7
4160Cp0M6L2k4N3j75M3J19o8K8N3j28J84k6j34J22j18J20J1L0j33N5P6j19R5O2
4186A37k40O8O6o4r1O0L6J04j56l9J92j35K2J0k4J27o6k7L4j38R8P7Kr4J17j34
4212e8J06n3Q2j50J60p7J13qj67lM0J2n6P2m3j8J26Qj46P3j08R3l2N3P4l1J4k1
4240E5r3o8J19N9j27lj0N5k6J7M6j2k5M0R3l9j14R1p7p1J64j18M3o4J73j32J3
4267a1j7L2L8J38j71m4q8J7R1L5K8k8Lk4K1Rq6J5K0Q5r6O7L3Rj03M9j9J4L9k7
4297B9k0k0l8jOLN8m6L1M0o0lm4Q5k9O2n9R2m4m9k3L5J6l5J27o7p5qJ03j44O3
4328a5O6no4mj2J28r1o3QJ5J8k7P8pL3Ko4k3M5r0J68l7j27l1J18j07N9J29p7q2
$$ plain form
4133 27 -28 12 17 -22 -55 -2 -54 50 -30 -46 48 -109 79 -57 -72 110 82 92 -48 3 -37 -19 5 -4 140 30 3
4160 3 -67 -21 11 -13 40 -135 -92 27 -41 -13 40 -88 96 70 -64 58 -60 60 71 101 -32 23 99 -20 75 137
4186 137 -103 -35 31 -33 -124 -64 -28 76 -80 -119 73 -62 -40 -30 -54 73 7 -20 14 -124 -26 51 53 -41 76 -58
4212 -58 48 -5 77 -73 87 10 123 115 -52 -55 -15 -3 -59 13 -30 -48 78 86 -60 13 -95 -2 -34 19 93 62 76 55
4240 55 -38 -106 13 72 -55 -58 -68 -13 -39 -22 24 12 -13 27 120 81 -33 58 -19 -90 74 -44 -1 -65 108 -24 -11
4267 -11 -28 4 42 180 9 -35 -123 -106 -15 20 48 20 23 -1 20 29 -57 -42 -22 63 -33 34 67 76 -27 22 3 17 56 29
4297 29 9 -11 -49 -50 -44 -41 17 -29 2 42 -18 -21 -65 20 -9 53 -6 86 42 -7 -30 5 21 -14 113 46 -29 -37 66 -78 -15
4328 -15 51 46 -18 -22 -34 94 3 -60 -52 -37 -19 -46 32 25 58 60 -4 -27 18 -72 96 59 -68 -99 19 -88 -29 100 23 -59
4358e9R0m7K5j25J41O0j21J28j1p0p8l9M5J5rJ12j9k1L6j7Nl7N3m6rR6j24P0j5
4387B9l5k6J32n3j19m1R3N5r9N9N5L3j01J4N9k9N4o8N8k13J61L0r2J23j12J%J38
4415A06J6j15m2l6k8N2PP8j56P2K14j27rk3jkMK6n7m2j8J44k4r7q1J59o0J41j60
4444e9J09M6Rj21Ml9LL1m9mJ03K4Pm9m1m2J04J3n1M5J0j33J50q2m8NKK6J0p9L9
4475e7L8L0j7k1l9K09j62L7M8j0l0O0Kj44R6j50N5J5P2m7q8J86j18Q9N4j11k2
4502b5J60j52k4k9P3j6j12Q9K6M4n0J7L9K9k4p6j3J10j20J56r7J0n4P3R8j33j7
4529a8L6J19j96K1ok6O4nk4M6J00n3m3m5Q2k7j4P4j17P9n2m3P2j7k5P5k8r9J16
4558D6L3o2j00n1R7K6P7p5k6J16j11lO6p5J18l0L8j32L4O2q4J31r8k1N5m9L7o4
$$ plain form
4358 -59 31 -16 9 -116 25 85 -36 92 81 11 -67 -106 -61 -46 -55 57 38 17 53 36 41 4 57 11 2 98 -26 44 29
4387 29 -6 -32 100 47 -72 -113 -20 35 -64 -5 50 83 -18 -4 55 26 80 12 70 -143 18 48 -44 79 -33 -32 -32 106
4415 106 122 7 -35 -71 -99 -47 -40 38 -118 -46 168 41 32 9 8 6 10 36 -21 -63 -81 63 39 -58 -139 20 -40 101 -59
4444 -59 50 96 105 -16 -12 -51 -48 -17 -66 -70 33 57 64 15 -26 -68 36 49 -2 43 53 -80 70 -12 -60 -55 -53 -27 -17 -96 -57
4475 -57 -19 11 -6 -27 -66 143 -19 18 66 56 26 86 88 -56 40 -110 -55 -40 32 -15 -103 83 -35 54 108 -3 -25
4502 -25 135 -17 -41 -70 3 -13 -125 -36 -10 34 -16 1 40 69 45 -31 -44 66 -54 102 5 15 -39 34 132 -1 -18
4529 -18 18 137 -59 -38 -44 -70 -6 -11 -35 11 111 58 15 -30 52 25 11 85 -32 47 -5 -48 24 7 -18 57 29 -70 46
4558 46 79 17 -83 -134 -37 -11 66 -9 -35 81 -30 -33 33 -42 76 46 84 -48 -14 48 -36 95 -3 -24 31 -18 19 -45
4586d5MN2jk8Nk8l6O8o6K08j97J10j09O0j2R8o1p4p6J90q1n9J64j04J8l7O3p2
4614d6Q5Mmn1MP8jj9l1n7J25j00n5L0l8J23j72J83j15N4n6L5N9j37P0N1O5r7m
4643a7j4O6m2N5o2K1l2J6j04J50M9q4qj08J41r0L7J26rk15O8M3L4Q7j18No3K8
4671d0O8j0j02n6Q7p2J06M3J9p0N8N8l1l3j23P7J02j63J09K7l3o2n5Q3J6R5r7
4698Aj04P9K9kKK4Q6k17J26j31J19N4m2o5J42j62J49q9p6k2J21K4n8J9n8Q2k0
4725A1o5K0M5j13N7M0J4K2m4j7L7m7J12j22R5l7N3J6j74J40mk0L3p1M1j57J27
4752hO3n6K1o8P7oKp0Q7jK3j71J77L5j07J2nj0l1J03l9l2Q8j41J37r3Ql4j6LR4
4783D2J7N2j24oO4q4OJ43n0j17J57o1k9j12N5p4R6J51j42o0J86j67K0O7r4K3J5
$$ plain form
4586 -45 -41 11 10 -18 -13 -41 -77 -9 -75 133 -64 46 -63 -3 -15 83 22 -52 -128 62 -19 -78 86 -18 0 -37 26 -46
4614 -46 39 43 39 -12 -8 70 69 50 19 -38 87 -13 -68 -38 -76 47 -125 58 -57 -3 -59 -24 35 -102 -32 19 84 -13 -17
4643 -17 -31 35 -7 48 -14 7 -25 -9 -113 37 86 2 -6 -114 27 -63 -26 100 91 -124 -56 -13 21 108 -10 -5 -68 -40
4671 -40 28 18 -84 -140 -53 -125 -19 24 43 -27 31 89 58 25 -98 -21 81 -82 27 54 21 -41 -96 -13 3 98 1
4698 1 -103 -24 5 3 5 29 115 -102 24 -107 12 66 24 -41 101 -61 88 -1 -77 -99 22 46 -12 7 -51 31 11
4725 11 -54 -34 11 -102 -45 -5 9 31 -13 -30 7 -40 72 -50 45 8 61 77 -97 43 39 19 52 -19 22 -135 -8
4752 -8 55 -1 20 -48 29 23 25 -45 42 41 64 -107 70 105 -2 10 5 -5 -36 67 28 -4 84 -57 80 -13 -5 -39 -55 -52 42
4783 42 59 111 -13 -19 45 -39 -33 110 60 -57 100 39 10 -102 -47 -121 -25 126 -16 -76 110 -57 -37 30 -64 -41 -26
4810b6o6O2N9l5RO6j47J67j04Q9r7J21pj04M9r6j4P8N7r8%O2p2O3N7j99J29n8
4838e5M7M7j33N1L0k7P6J8j47K2J19j06J50m3j08Q2o6P6j6j6M8k3j11M1R0j08
4864f2O6m1R4k3j06N4M9Qk0M5j07k2J00jo2Q8M2j79L6J29j04lm1j0J64q6M6j85
4892a31R5J15o9jk6rKJ28n3j0p9J7NO5j6%l8jk6N6kJ1j41P6Q6L2o7m0o8J41L9
4923I1l4o5P9k32K02L1r0M0q2N4l4P1r2n2J97j7j49J7J04l0J02j97K6J69j16L6
4949B9O6p6P4j24Q8o0NL8m5K3n6O3k6MO8j34J65j36O3q1MM2K9Q5j88J48o6r6J53
4978E9k2J2j21M0l4J23Q3n3j29O5K2n6R9l2l5o9J44q6jJ51j08qr7P0j42J59k2
5005A2j21K37j06p7M8J1o9J77l1l9J1m8J29j04j23Q6R7j14j3P1m6J33r1j7o1n
$$ plain form
4810 -26 -92 -30 29 -6 3 69 -78 89 -15 74 -23 98 91 -13 36 -60 -74 4 61 -37 -37 25 -47 16 73 -126 3 -55
4838 -55 -8 39 -94 -43 -13 -40 36 54 -93 -71 48 -58 92 49 -59 23 -43 33 17 1 49 26 -85 -44 46 -62
4864 -62 4 -37 57 34 -72 -18 31 39 19 64 -43 -65 35 34 -28 60 102 -77 -41 88 -16 -19 -60 -70 94 8 54 -131
4892 -131 -36 79 10 9 -17 -26 -24 104 51 41 -38 -21 -16 49 33 33 -5 -6 -32 24 22 33 -108 -32 54 86 19 -21 -89 52 91
4923 91 57 -8 71 -161 41 72 -18 22 -60 -6 -40 31 -61 -113 84 67 -82 -65 39 9 111 -86 -60 109 -7 29
4949 29 95 19 93 -31 57 -3 2 40 -5 18 -38 25 -1 3 71 -63 102 -34 29 -52 -48 -6 23 108 -80 68 2 -94 59
4978 59 37 49 -72 -32 -66 57 140 87 -42 23 45 -11 88 56 21 -48 96 10 9 160 52 44 -53 17 -125 34 12
5005 12 -109 128 22 -55 -7 4 -65 112 81 42 53 5 134 30 -93 -7 90 -24 -37 34 -12 121 30 13 -48 -53
5031e3O5o8M8L6j54K53j02k5j0KkLoON7K8j1j47J59k1L1o1l0k4N9Mm4R6j20R8
5061F7j43J47l8o5R3k9l4o1K2K1R9j33j9M7J15j25L4p0Q8l4m4L7J4m0J9o6J05
5088GN2q4M4j32K81k77J04L1L6j63J02q6K3P0k5K7m9J05j11rn8O0R5o8J9P8j65
5115i3P6M0R5k56J45J06j41K2J18r3r7J66q7J16j27qP7k06K14j86J21M3p1J5k2
5140c3O5o5k0N0J21j05L4N8j81L6J4M7r5Q2R1j69R9j3j24mM0p0N8K3k2J97j02
5167A2Km5J06q0M6j3k0kP4n3m1N4k1L8L3q5m4n0J66m4m1O5m0n5j1J16l2L4j31
5196f2Q1q8J9J71j91Q0k5J5k7k4J67q1o2q9K23m7r3N5n9J84k91J81Rq9J20j97
5222a20J18j5JN1p7P7K0j31M8j22J89K7r5l2R7j13nJ73Qp6m1m3R1m7K2p3R6m2
$$ plain form
5031 -53 12 -56 -8 28 -126 127 25 0 -10 -8 -10 -7 -13 -7 50 78 67 -80 79 58 89 28 -2 -26 33 37 -7 89 -31 67
5061 67 -76 71 33 -32 61 32 -2 -63 -41 -20 79 -54 -73 -26 89 -36 -2 -72 16 -18 -62 -25 -11 -51 -32 -98 7
5088 7 59 -25 19 -113 168 -109 -5 26 62 -101 1 -85 -62 8 -17 10 -39 66 -45 -54 -112 -52 43 -25 -6 72 -93
5115 -93 -17 23 118 -138 7 113 -28 -6 112 19 -78 88 1 117 -10 -18 59 -147 67 -119 2 45 -26 -11 -33
5140 -33 32 -33 -53 -3 118 13 47 105 -76 -40 -26 21 -74 8 99 -70 29 16 -108 -112 -72 -142 -84 -61 -83 114 12
5167 12 14 -31 75 -5 41 28 8 6 80 27 -14 40 19 57 90 5 -39 -89 77 33 -8 57 17 -38 -49 67 35 69 -62
5196 -62 19 -69 -50 121 -70 10 -15 0 -27 -51 116 35 -27 -116 107 60 -33 22 -37 147 -144 37 46 -43 77 -120
5222 -120 -2 -17 -16 35 -42 35 55 -76 -28 -150 39 66 -29 -61 36 -77 -82 91 99 23 -18 -61 30 -17 5 -68 28 -14
5250a4%N1jj04R5n3N5N9l8j91J40M6Rmj81J53L5k24J59q9J41l4k0mo5J6P9L6l7
5279A5k4oM9m5K6l5Mj14Q2mJk3R7N2j90J58j87J26J15q3o9j2qPR1L6k5j9J0p6
5309e1J12j04O6o9k3J91j30M0J1L5j64J39j35L2N7j8j1Q1N7j66L1o5J54J8k15
5334a27K10J0p9j19J4J33J0Oj28mk0J59o2P7k0l7o0L7p0J38k2J5j4j36N5R2kj19
5362f3P8o4M5J17j08n5J19l5q7J84j14l0P9m2j1J3j29R4l8N2n4J35j82P5J0K1
5388A0m8n6N6O5K6RM6j39J06j56J63j13LM8k2l6K9O6m0n1J13j20J2K6M5r7n6J52
5416D1K3r7N9rp7Q5ro4N2o6L0Q4K7j11J13m4K1j01K9j1K9l3N7o9N6k9n7O2j1j7
5446c7O8kJ1L5l8Rr0N0l9K1L5j5J0l7nN2k4qP3j48R1m7L7j1O8p1N6j4m2M9pm2
$$ plain form
5250 -14 -14 37 36 -68 27 -26 29 88 50 -141 -1 45 54 50 -131 22 57 -167 -8 -97 44 10 -10 -14 -79 -63 16 52 15
5279 15 -9 -15 34 -11 15 -20 -16 -130 -48 -52 -51 -74 23 75 -115 43 -144 -18 97 14 -55 -67 -75 -68 23 59 34 15 25 -51
5309 -51 61 -43 23 -46 -69 122 -8 32 43 78 -86 53 -82 -50 7 -11 -22 59 116 -50 -19 -84 70 88 -127
5334 -127 83 93 14 -105 -91 42 52 58 -70 -74 -94 65 3 80 60 23 -37 0 -70 68 46 61 47 -89 -34 58 56 -63
5362 -63 15 -49 -4 113 5 -50 69 34 -53 131 17 -13 66 24 13 26 -103 -9 -47 5 -49 86 -96 -21 -11 10
5388 10 -38 -94 -38 27 53 62 108 -31 75 -81 82 -31 -28 20 -2 -38 -9 57 17 -34 79 -41 -29 -3 42 -55 -111 41
5416 41 64 -33 26 17 -60 25 16 -48 4 -62 -32 52 79 -32 81 37 58 -43 -14 -25 4 -29 28 -41 15 -14 -71 -9 -20 -37
5446 -37 31 29 40 75 37 46 -44 6 -33 -12 23 8 18 -19 -24 28 4 -4 69 -79 12 -35 2 -9 59 -12 44 30 -12 37 30 -12
5478a2rj13J20J2o5J64j57P3l4Q5j57R1P9k9p4N4N4jp2j0J2PL4p3M6O5j67L1J46
5507A00j09Q1m9j41L3N4j1m5J34R3o4j56J04k1nl3JN5m4n7j5L2J00J8j05RN4P7
5535I0j37j0L4nK7j03L6MJ40l7j3P4p6K0K4j54J76n9M1l4o9k6Q4j0Rk3O1K6p5
5564A5r8J03Jm5k1m3K2R5l3j05J27k7m2P6PJ18j19l1k8m8J10Pj0j3J0r0J74j39
5592b7J24j38m3K04j73N8R2j53J5J8J2J21k09J56k4N9l1L8j03K0mk9N0r7N4j3
5618b3J05j5n9j2j12Q9K9Q3o9n6J38j44O5l0o1K3K07j40j9j7o4J39m7P2n7o2J24
5645H7p2L9p6j2m9R5K9j14K0J04K8j60P1O7j16Q7M1j40J08K2j12N3l8K5L1J2Q0
5672A10m3M7r6Q6l4j31P6RJ2M4l0o2KL5r9O4OL4n9J14r1k2l2J9N0R3j12K1Rl6
$$ plain form
5478 -12 -21 -134 -14 -2 -67 97 -60 13 -21 64 -93 -2 77 48 -26 28 82 81 9 -1 11 18 52 -21 25 90 -77 -46 100
5507 100 -9 72 23 -118 -85 -31 -42 -87 47 140 76 -80 24 3 -2 -35 -34 21 -23 -80 -95 -63 37 55 -50 -41 13 90
5535 90 -47 -57 -23 -28 -1 -104 -68 -64 76 39 26 100 24 44 68 -86 90 31 72 38 -31 -57 27 17 26 3 64 90 15
5564 15 -83 20 21 -24 -45 -88 -66 29 -4 -109 18 -9 -51 25 32 150 31 0 -28 -76 34 41 31 18 28 -62 112 -27
5592 -27 97 -41 -84 120 -53 5 97 -56 -41 -23 -11 110 -99 57 33 92 61 99 -4 16 12 -17 33 -64 -10 -23
5618 -23 82 67 8 -4 -116 -27 2 85 16 -40 98 -46 19 -11 -72 -49 158 18 -1 -18 -82 57 10 82 25 -37 87
5645 87 15 54 -22 -34 -83 12 41 -73 -53 51 79 -81 -10 57 -59 28 69 -71 37 59 -53 0 -38 -13 18 30 110
5672 110 67 114 18 104 70 -61 15 24 36 80 50 -12 -10 25 -74 -10 -4 30 -29 85 -6 -28 -60 -41 9 102 -10 11 20 -16
5702a6K9rK2K6j59J26nm2J30j70J12l3o0Q1r0O3jm7K1K9j38P5qK2k9P5J0kr5J56
5732G3k05J41JNj4j7M5j4n0kj9P8Jq0N9M1k5ll1N5Kj04J73m1j7l1K3o0M4l0o4
5763f6J46o4j7J34j21O6q3P7j82J48o1nQ6kj18k4O6Lj05J15r7J41j75R7J9p0J29
5790C7oN2j13j6J20j58M8j23J31L1l0N4J00l1r6k0JK2o2J58j42J68j33qJ1P5j03
5817c3O3O1q4n9J0Q1q1J36M6j71O8kL6q5L0j64J27M7K3J6l5Lo9J00J2j17K48k86
5845g9N5q1K4R1L3j9K7l0k0O0o0K1Ro1J32k5q7n4qL8R1l6L7O9j73k6O0P6Mq5l4
5876e1JR0k4nj0O8p7Pj87K34k6j12O7M2j2M4m2M4l7o5O2j9J13j34N3q4R1m7kL5
5906A7K0j95J07Q0M0j30J32j2p7R1m5J9M3j25o3J75p8k9P4L1n4q1J8mJ48j19Q6
$$ plain form
5702 -16 13 4 26 52 -107 19 14 -28 102 -68 44 11 -49 32 -58 5 4 -43 -22 7 -131 -56 -64 -42 -71 4 14 12 -83 73
5732 73 -132 9 10 15 1 -16 29 15 -35 -37 -56 22 23 -57 2 43 18 15 -16 39 41 -63 110 69 52 21 44 -16 28 -2 -66
5763 -66 80 16 -1 133 12 78 -5 72 -110 38 -23 -28 58 56 -62 -86 -20 -17 -122 -7 -104 37 -138 -41 -22 -92 37
5790 37 31 83 -30 -46 74 -84 -36 -159 -28 3 -27 27 127 96 0 -20 -19 3 -59 99 -43 125 -8 -16 -5 70 -33
5817 -33 30 91 7 -52 -42 39 -42 94 140 -31 37 35 71 -14 16 -148 -21 26 49 65 30 33 -36 64 76 -41 207 -79
5845 -79 -24 -105 -81 10 43 24 51 21 1 61 1 22 31 -30 102 77 -10 -64 -72 -34 57 21 58 127 -46 -72 -12 64 68 -17 -51
5876 -51 -50 40 16 11 1 69 -8 -1 -188 46 20 -92 -25 17 5 49 7 51 14 -51 11 -8 105 -29 24 -60 31 -16 -18 17
5906 17 37 -158 -51 29 69 -61 71 59 -18 73 28 47 90 -35 -98 77 -1 -30 44 75 21 -60 -42 -46 102 -17 69
5933F9j45J65o4m0O3j32R8r0kM4j0J11jr0l2R5nPL8r8Q0r2O9j27J57L6l0R3k06
5962c9J11q4N9n0q9L5M4N4p3J5J40j48N5q3O4O8o8P9j54m0Q6L9j9j0M0k0P7j66
5990g7J28j06l4J12k8p0J1L1J5K5o5mP3Pp8N9j5J2M7o9N3O5j32J69j32l8J7L2
6018HJ14n2q8oj2O4r1O8L5m8N7j24M3Q3p9lm6Ql9K5J61p7MJ9J52m0j08n2L1J01
6048A08m9r7NP7k3n3J7J36r5l0l3Q0p9j4M3rMmR8o8Nm0J7J30j24RR3p4n0M0M4
6079F4j58J39j00O0n6nJ07M8j36L8q6lR7k3J31q0j0%l1oM8j13P7L0n4K7J7J4M3
6108G9j27k3P7J5L8%q1j6N2j9j7k9M6J59r1j47K9M3R8j14JJ4O4j13N8K7n4J84
6136A53j3j29K5o5O3m9R0Pn4r6K5J07r9P2J9j12j6R7J9M6m0j56J04L9p4N9j49
$$ plain form
5933 69 -76 89 25 -15 48 -84 14 -76 -78 -34 -44 67 66 -24 -56 39 34 41 79 -19 61 -31 38 -89 68 104 74 167 -39
5962 -39 72 -12 47 -3 -92 -57 -13 41 -32 -17 123 -25 30 -53 11 79 11 90 -64 -104 -18 21 2 -8 32 12 89 -77
5990 -77 51 -55 -89 23 -5 -75 -64 -33 -18 7 -58 -62 11 18 -60 -1 -16 -4 43 -26 27 92 -40 129 -3 -41 -24 8
6018 8 122 70 -18 -24 -36 28 -63 5 40 -8 49 -75 -32 51 -28 -31 -77 -69 -108 -83 78 1 5 24 176 136 28 -24 7 108
6048 108 59 -38 -33 44 21 -32 -15 121 26 -4 -37 43 -36 -50 -7 -16 -12 -16 82 14 19 -21 -4 126 2 11 104 30 -20 20 64
6079 64 -94 45 -55 5 -51 -56 51 99 -37 1 -85 -88 9 -14 117 37 27 27 -4 -10 38 -75 2 32 -22 5 22 36 79
6108 79 -48 -71 6 21 59 59 -22 -38 14 -5 -22 -51 -5 154 63 -84 -55 -12 86 -28 -27 -13 51 -62 -4 23 -31 153
6136 153 140 11 36 -29 34 -15 75 82 28 -68 -43 64 -35 37 56 -56 -72 25 44 90 50 -106 -2 37 -37 22 -127
6163a27K00p3n7j5M4N0K7l9j1O9J3n1j23M9J20m5j7KMJ4n3PJ08m3p7R7j23J49
6191I9j81M6N0m5M8j42J49PK0o5OL1p4N9J0n2J10p7L8j57K5J16NO3q8J0N0q6K9
6220DRN2j54N4P0o6N0q4O5J05r9J3k6j7M1n5p1J48J1Or5Mm5J00pM9N4q2L5j26
6250e7O5Lk5O9n4n7j0L7J1N9M0p3n8J22Oj5m2l0P7M6j08q6P2lnj1O1K9K7r6l3
6281c9L8R0m9k5R9n1q7l1R4J25j13o4m0k1m8K4LR8K6k8M3r9N5N2n7L4prj30J96
6311G9j67R6l5QM2No0l2j9J32j8J3k7M5%p5Q6o4o7P9n6m7J19j45J09L4Pm7l9r
6341e3L2N7K2n7J16p8n2M0l3R0j56J68j12o0J0Q8o6j5R1K0m9k6P2l3n0P3j5r0
6369f6L7k0L1M0pJ7MO3l4j52R7N6N0j33M2q3M9M6n9J42Nj75o1l2K01r2J22n3j06
$$ plain form
6163 -127 73 0 -57 -72 -28 22 49 10 -1 68 81 30 -93 -44 76 31 14 16 20 34 -19 -12 96 53 -24 73 -50 99
6191 99 -82 -36 14 -31 17 -125 24 31 51 -14 -8 23 -51 8 18 -34 76 -1 37 -120 -95 21 26 89 1 11 61 -25 4
6220 4 13 65 -89 -35 35 -31 19 -65 0 105 6 19 -7 -24 17 -38 -109 39 50 56 -39 -35 -80 20 13 62 116 34 69 -57
6250 -57 8 11 -14 55 1 -56 -66 -29 -18 41 81 8 -50 72 78 63 21 -9 68 114 6 -80 -8 -11 -16 -27 34 63 90 -6 -39
6281 -39 -1 89 40 15 114 63 -24 -55 39 164 51 -13 -53 -74 -122 -98 -95 3 29 1 44 -55 0 52 -5 29 22 13 -117 79
6311 79 -88 8 -27 -19 23 28 -32 -64 -83 49 31 44 17 62 62 -13 73 9 -58 21 -35 -82 37 -108 1 35 42 -5 -44 -53
6341 -53 -21 36 58 1 117 39 -13 27 -6 84 -72 96 -16 -76 -66 22 -44 -59 32 52 3 -23 49 16 -34 39 24 -66
6369 -66 -29 -49 -18 22 15 32 36 99 65 -87 10 66 116 -17 25 -58 -9 37 -22 120 125 -50 -111 -143 58 -34 88 35 -71
6398g1Q8J9j19m2J94m8m4o4J17R0j11J44j83j00K66o5j7j53R0L0JM9q1J4J1P8
6424I3r1m7M9K6n6j00J87j6o7N9q2N9n4O6n4R7o5Qn0J27j47J56j95O8L7L5l8j38
6452a33Q5P9l4p5k4J51l0J0m0K6M1J7L1j17J0K1MK9Kq8O1l5L1J8n3K4l5P6o5Q9
6482G6k7r1n9J28o3L8N7K0j72J92q2J2j08R0l6p6J09l9O0m5p2O8O1r6J08M9j11
6509iN5j39O5J19q6k6L0j8L3P5j38Q7qo8k3N2k2N8q2J16nj36J06NJ77j91j0n5
6537c8j45J51M2o4Q6q3L3MPP3j78K9R0j56J58m6n1J06K1r0P8l9jR9o4n9L6k8J20
6566I1m9k0Lnp5pR4j0k1j08J6J29j55K12j26J00r5m0N0j5O5k7k9L6J8j71J39M2
6594D2m6K5K7n0l3P0m9%J3LJ08j96L0J88p9p0J23n5n7k5m1J90j6k3K4n8Mm0k8
$$ plain form
6398 -71 17 36 -83 -125 69 21 -23 -87 30 120 9 153 -30 -130 136 71 54 -99 -9 21 22 71 -10 4 15 93
6424 93 2 -45 4 30 -26 -126 61 45 -22 37 -45 14 -40 26 -28 69 4 12 -38 89 -58 98 -97 -29 8 43 5 -133
6452 -133 -48 31 -3 -78 -102 49 19 29 -11 15 56 73 104 -13 -3 18 22 51 53 -35 26 -9 22 40 -13 11 -24 52 -13 76
6482 76 49 -42 -101 27 -36 2 59 79 -93 99 17 29 -79 11 -25 -101 8 -31 29 -16 -88 -20 41 -55 53 102 -9
6509 -9 46 -93 -28 91 5 -21 9 -9 24 99 -39 48 40 -28 -51 1 -21 37 -45 71 66 -70 36 41 218 27 17 -38
6537 -38 -183 -32 10 -54 32 -51 -18 -14 -7 66 -112 -83 7 -149 9 -37 -88 18 39 -51 27 -12 -13 86 22 -37 -1 -29 91
6566 91 42 22 25 20 -55 -62 32 22 1 -107 -91 38 -117 95 -31 69 -26 -66 -16 -31 34 7 -22 14 32 -139 0 42
6594 42 -4 21 48 -2 -35 35 -14 -14 -1 2 110 -86 -56 132 53 -17 106 51 -6 -31 -72 118 102 79 103 45 49 9 -19
6623a9%P0r4J00j35J3M2M0l9O5m5Q3o8qL5j23J65q2m3J36j26J7LnP0j0j07RM5
6652a1N0l8K5n5k6J65k3n1J1jr8O1Mm0N7q1J64k21J03J3P7n3j27Q1Q5j20J91j26
6680A6l7K0J1p0J3K6j04K00l9m7k3j09J07J02o9J7o5R5J8Ll0q9J63k38J60m3J01
6707H9k03J10L2n2j6j25J61M0r3L9O6p7J49k60R1lJ18m2Q2p3j06Q9P4l6q1o9J44
6734D8l7O2j13J85n9p7L0J03o1j05O0l6loP0j6j06K7K2o4J82j24P4p8J8P3j05
6761c6j80K44p7j9R0k0J07q3n8K2K0J9n7k4p0R2J09j8n2pm2J51j07mj43J20o2
6788h5N0M8l8j8O2Om3l5J00j9K6j71P5J05n7k5MJ7l6J15j5O7k06J67p3PR3j96
6816g5J80o8q6J8P1p8k5J48k0j26p1J62r0J09q8j39J59L3k14J62J0J44j13o4m3
$$ plain form
6623 -19 -19 51 -43 57 -78 -65 -23 17 -22 43 -2 81 13 5 40 -83 82 0 -43 93 -33 -16 -13 -18 52 42 -65 -56 -11
6652 -11 39 1 26 -29 -55 110 87 36 47 46 -52 9 13 -27 30 -51 113 -108 -5 8 85 32 -95 -14 71 -49 142 16
6680 16 -21 -1 10 -60 -47 -21 -125 75 36 -11 -34 -143 -36 66 -3 14 -51 44 62 65 35 -54 109 -129 31 -12 89
6707 89 -114 -4 28 -24 -40 -165 -4 36 -57 -18 48 -29 120 -140 -49 -52 66 24 106 33 -73 16 90 54 -27 -96 48
6734 48 11 73 -40 145 86 9 39 142 81 -24 36 0 -3 -9 61 45 -61 -34 -12 -76 106 -18 56 -22 -4 69 -36
6761 -36 -216 28 -49 -68 22 2 109 26 -32 -10 10 29 -28 -52 -122 -30 79 61 9 2 -40 111 4 0 -143 -23 -85
6788 -85 -35 13 -25 -43 19 25 -18 -53 47 28 54 -117 -42 63 6 -19 -15 2 -34 81 66 133 -73 94 21 28 121 -75
6816 -75 105 37 -49 -31 40 -38 -63 85 65 -61 -132 30 -60 49 -39 -178 -19 14 -200 -38 -28 116 3 -61 -104
6841a04R3k7P9M3q7m9j1M4m2L6L1m2J55j73qK6J0j4M4O5j07L9J11j90J29r6J12
6868F7n8J01q3p6O3j11L2P0mJ1O9q3P3j14Q4n2M5j38Q6N1K6j10k8M0K6k9k3J04
6896C9K6L0j81J46jo0M7o4j7M7k6N0N3j03L1N3j38J18J4j8j3l1K4k8qK8K1qj42
6925a11J96n4p4M4J0j04J81j48J26r8pM6kj15P0K5K4J2%jj3k3O9p0J06m8q5J21
6953G7j40J63j16P4o4k3K9pn3k5O7m0J02j44K8K8Nj0J29l2j74J42r0J46q0L9j
6980C0m7j01J34N2l9L3j12j8O0O1p0l3J44p7j30J90l9j6L1j0o8k1p8L9M3j8JO6
7008GMj21R1L1rLl9R6j54J25k7j27J70j25K1M5P6j43J50Qj23O7j25J71p4m3%R0
7036D5j23R0m3J45k21J21N0j18O2r2R4P5n4m4p2L6J11n7j3oO0M1j4q3pq1J37Q2
$$ plain form
6841 -104 -11 -38 41 84 -3 -52 -63 -19 -61 -25 6 -36 119 -54 -62 -36 -26 -40 4 69 -38 1 112 -78 51 -45 67
6868 67 9 110 27 -49 14 -97 -65 5 1 12 81 -2 71 -43 41 -11 34 -104 -18 33 59 -51 -79 -39 -13 -42 -65 39
6896 39 65 95 -86 60 59 -1 46 -18 -35 12 -14 36 89 -14 17 70 -68 50 64 46 33 2 26 -2 -10 18 39 31 -111
6925 -111 85 31 -43 1 11 -93 88 -60 66 -32 -39 7 5 -110 -40 -15 9 21 21 20 7 -16 53 -17 89 41 -44 77
6953 77 -63 100 -16 58 -6 -29 0 -7 -60 -85 -18 -58 44 -100 -72 -44 -39 -49 80 48 -126 16 -74 72 -8 31 30
6980 30 -17 -118 16 68 29 62 -50 -68 -8 53 -17 -50 94 17 -113 77 38 22 53 43 -25 -46 -124 -85 -42 -60 -59 7
7008 7 11 -110 -19 12 3 6 -33 63 -91 34 7 -120 50 -75 -54 -9 67 -76 74 82 -41 26 -99 72 -2 -45 -45 45
7036 45 -78 12 -31 114 -107 14 64 -54 8 -84 10 85 31 -13 -85 -49 62 5 -8 -14 46 87 73 -10 -17 -98 39 121
7064A21j72k1KR2q9J80j7p6M8j11m1K05j73Q4L5j06J7K1k3k3K9lJ36j71J55j45
7090d6jk5K5P5l7J4oJ29j42p2%M6J05p5o7M1K1J3m7J34l4j01L6j00J48r0J02j29
7118h3J49o6j04J26j0J04k69J44o0QlN6%M5j05L2K4RO2p5Jk6P3N3k32J54j9m8
7146f0J11L3l6p6l1N1M6r6K2J61j23K6n1k1KP8k6M0j08J02o8p7J53r4k5j0J25
7173D8k02J69L8n4p1P0M0m6l9J78r8k3Qm1l0P2o7J07J7n5J8j02L6J3N2j05R9n0
7201a8N9Or3J33j68J54Jj32k7J04M7q7pK4%J8j8M9o6O3l7l0NPK4K7n1L4M8j64
7231i5Q9q3O1lJ01k1n4m5Q2k9j16J14k9nQ5p9L4qj5J07n0j58M7M7J2mMp0J43j99
7261a37r2K16m6R8O1m7k6q1M5K0m8j0L5k8m5J14l2q2L2r3M7P2m3O9nq2O4r2J04
$$ plain form
7064 121 -51 -72 -70 22 -67 113 96 20 68 -43 -84 121 -52 32 67 -39 -22 -1 -24 -47 -18 -21 115 -56 99 -46
7090 -46 -47 -72 -47 28 -9 5 -1 128 -14 -86 -86 -40 65 -10 -77 -36 -15 -2 -49 85 51 -50 -14 -114 34 -56 46 -83
7118 -83 66 0 -104 22 12 116 -153 -9 -69 -61 -64 -8 -8 37 -68 -36 -12 -3 59 -16 -15 -41 32 85 -147 7 -12 -60
7146 -60 51 84 48 -28 -59 -8 38 -58 -36 125 2 28 -23 -44 -42 36 10 50 -58 44 -24 -101 52 -42 -67 -77 48
7173 48 -154 15 53 -1 -72 -2 38 -8 -47 131 33 10 18 -23 -53 19 -48 59 76 21 39 -63 -27 -14 38 -67 32 -18
7201 -18 41 47 -46 87 -81 73 74 -58 -85 19 66 -21 -28 -4 -4 14 -4 45 -21 42 5 -25 -20 -13 11 38 -13 21 69 -95
7231 -95 -6 -89 -28 -31 70 49 -5 -50 32 3 -113 1 -28 -33 52 -27 7 -1 -16 91 41 -117 -70 -23 -11 -15 -11 -81 62 -137
7261 -137 -229 -13 -59 39 100 53 27 -54 -9 11 -37 -47 -12 -40 -85 29 -3 -85 -53 -146 -99 -27 -70 -1 -6 -88 -24 -116 -12
7290a2kj35J94o9m0J31J0j15Ll5P0O7J9q8l9L6p8N1P3oj22Q2M5J9o6k2J2J9M7
7319D9j28R7k2L6j0j21J09o9J20p7P5n4PQ9j4r7pL2o9J09j3l7m2M1p9K23r8p5
7347b5J5J9K4p7J56j65J35m2j15J42m7j58J76j00N2N0k4m6O4j8n3P5n3p7J16j4
7373A0P4j13N7n5R4n1OM8q5rJ1k0P3l3l6J45r0J7m4r5J58r8m5L3oR7Pjj33J20
7403C6j21R3m1P1j7L3p0P2j20J12L3l1o6L3j72J95kj2j4M9l0K0j5pL0l3J05r5
7431C6rj90J79K0Lp1M8k6Q3m6J6l0lK4q2j7J1M6P6j13J00Qk3J0oL8j27j5Q8k7
7461Ak4O1n5Nk0M2mm0mP9J9p8L2Q6o6m1J0R6j07q0J56n6n0R6J4p0L1k5l4J36j10
7492@j4P8m9l4l3P1J07j70L1J9q7O1J0k4J22j36J14j39R3j09R1o9J52j50m6J17
$$ plain form
7290 -12 -14 -149 45 -24 -64 67 77 -38 -35 -70 0 67 86 -2 -41 -5 -83 -32 41 35 -87 -5 40 59 -7 -29 -17 2 49
7319 49 -79 18 -4 32 22 -99 10 -59 61 -16 59 5 12 101 87 -10 -17 15 -54 55 42 5 -37 4 -75 148 50 -25
7347 -25 -10 9 33 -44 112 -53 82 40 -75 67 20 -138 38 -62 -10 40 16 -30 34 16 -37 38 -15 -92 24 10
7373 10 84 -29 28 -27 67 16 22 70 -15 -24 -13 -33 40 7 -29 116 26 43 -1 -96 62 -36 -81 -48 -54 43 50 49 -84 36
7403 36 -85 8 -33 38 21 54 -16 56 -64 48 81 50 -16 17 -155 40 38 26 12 61 31 51 36 29 59 26 131 36
7431 36 27 -163 16 36 39 -32 16 -10 73 27 43 13 10 34 -48 -65 -54 -8 68 -45 55 63 40 50 44 82 -45 -60 28 1
7461 1 -23 38 -17 -12 -32 10 6 -34 -38 41 60 -18 14 100 34 -7 3 99 -8 -88 68 12 -38 58 72 2 33 8 -26 110 0
7492 0 -14 64 15 -19 -52 19 126 -44 -13 6 -81 -20 -10 -34 88 -48 66 -73 20 -89 2 -67 85 -65 -111 6
7518Fj0m8J9R5j0J1j01n0J96j20m7J14Pj15J35j4m6j41J07P6m5M5n3r5J07j01
7544g8Q8pM7o0N4Q1j01M2r3N3j21J12j51N8N1J38j19q2K6J23j46J55j59p7J13
7569e3j0Q0j8N6l6p0J6n8J01j0M9r9q2M6R9R1q1j9M0p3NJ52q3j65L2R2K2r2P9
7598A1P6o5o3J1%J06j35M3O0o9O0p6L9k7N6m6M1n9J7N9r5L2J8N2L3r3M7K0j17
7627f4K2J03m0J1n0j2Q0j9Qj34J82o7K6l9k6Q2mj2o3K6R1j32o0R0L9m5K9n5L6
7656CL6rO9j30L2L6M6j12P0r5P9o3O5K8j57J3J24n5m4R4j14N9k0J16j32PQqO5
7685A1nrL8k5k9j18J57n0l2M3j6O8q2J3J1O5Qj31Q4j3O4p6M2J7K8j35L4k5K2J56
7715A15j87l3J60j37J00j55K0J03J2J4J8j04O2J1q0R6k8N6j31P0K5K2N9j68M2
$$ plain form
7518 6 -4 -52 -33 62 52 63 -38 -88 108 -12 -59 55 62 -53 82 68 22 -119 -12 64 19 64 11 -84 23 -78
7544 -78 10 3 50 -10 44 125 24 66 -27 26 -95 17 -134 -76 -25 113 -6 -88 -62 61 -85 70 -89 -166 -53
7569 -53 -63 17 -1 55 19 -51 -35 -93 8 -2 47 -52 -134 -88 11 102 21 2 42 -31 -26 126 43 -122 -90 2 24 -68 11
7598 11 87 22 -41 -30 -30 76 -59 -16 44 -25 35 -41 -2 -29 27 -19 22 -37 -20 39 -56 -24 -6 46 79 -14 33 53 -64
7627 -64 -42 61 21 32 -18 -30 50 31 39 -95 87 20 46 7 -19 63 59 47 -16 10 101 -31 -91 -1 38 -7 22 -33 3
7656 3 39 30 99 -31 1 37 83 -29 41 -54 25 -38 27 55 -102 -89 35 -20 -64 30 -84 -25 -45 71 -61 -54 -46 -54 11
7685 11 6 -3 35 10 -19 -137 20 -30 -62 -19 -35 33 -49 -36 -25 40 48 -83 1 -12 52 -24 18 35 63 -72 -38 -63 -41 115
7715 115 -72 -105 55 -82 18 -137 -117 -14 -2 12 30 -74 -12 -1 -81 15 -13 43 -88 -18 7 29 88 -80 -38
7740c8K0L5oJ8n0KL3L3J8N3j40J6P7n0J4k0r0KQN7K7kMo4k9J03mj3j9M2J0nl3
7773Il1J39j94J34o6R3j52J4J28q4L8kr1R6p3R2r2K8J03k12J64J3o4n7l7J55L
7800E4p1Q3k01R9k6M9L3l0j2J3n0L1M7j2O3o0n8L1r9J69p4Nj6P6p5K7k3oj13J85
7830C9o9M1J21j47J20j03J8r2J27m5L8j51J87j22nr7J14r4P3O7l0O8j6j4m5L4
7856A7l5k3k1N9j30K61k01O6P9m8R1j18m5J20l7k9k2N0L2k3p2Q7o5m7J92k16K1
7883e7J5J1Po5J51j10P4m0J11j4j98J40m6j3m0J46j42Q0l3K7JK4j5p7J24j24R
7910e4J07Q4m5k3n7Qo1N6j8m8o7O1JP5o5M7k7O1j06L6RNO1J4j28J81j47L1J8j0
7940aj0j5J26Nj19kL3j3kJ9J6j9L1K8j00J39j90O4J44r1m1M6r4P7Ll8l9k1J01
$$ plain form
7740 -38 -18 17 11 29 -21 -19 14 47 65 118 -22 -6 71 21 35 15 -75 -73 -65 -8 19 17 21 -43 -72 31 27 14 -5 37 47 42 9
7773 9 -22 117 -77 57 -9 84 -68 -54 74 -10 28 26 -65 31 -42 50 -42 -14 89 -123 41 54 -10 -67 -104 51 54
7800 54 -17 66 -135 -36 -62 -13 20 -10 -22 -9 -59 -28 19 7 70 10 -48 -17 -116 53 -21 -16 -32 44 -31 -4 -27 -33 -146 39
7830 39 -30 11 132 -15 105 2 20 -72 55 10 48 -103 84 -38 -43 -140 -26 -120 -47 20 -10 58 42 28 -17 17
7856 17 -18 -41 -62 -3 -133 128 -73 -7 72 24 115 -3 -48 72 35 6 -16 34 66 43 -29 58 -7 -54 138 -78 -57
7883 -57 -42 -31 -24 -89 62 -48 26 -14 97 83 -115 25 -21 -34 -74 72 -70 10 -23 4 5 29 14 -63 61 -63 -54
7910 -54 53 137 92 69 12 20 -41 15 -3 -51 -118 -57 -56 19 -46 1 -26 35 -71 -35 -26 -21 40 54 -74 107 -40 -9 9 -1
7940 -1 -11 -26 100 105 -14 -16 17 4 2 21 37 18 49 77 -23 116 -74 -10 134 43 2 48 -46 31 34 -4 -43 -64 37
7969C7l8K9q3L0m2J24j16KK5m0J09l8m1kk06L04p9K1N0p8N1j38J34J0n0P5Kq3
7997c1k1J69j38%JO7j12j9O1n6J31j90O2M7O9j12L6L0n1Q4l1p1J87j66R7q1P6
8024C8j26N9o8N4P8n9J00l5n4N8J2k12K91j29J1M0l2q2J6N7J22r2j10O8l0k3M9
8051Ap2J00Rj7l2o5M8k58K82K6r1R9n7p0Q0P8p0L6j18L5m5J25o8M2J24o0Rj25
8079e4R7j16M7Q6nO8j54O0n9K5N0j25M5J03j51J01n7O3k2N7l1o4l3O6o0n7P6N
8107c9K8o7R5k7k2o%R1j1o0N9Kj69P2R3n9O5L7j87m6J60nO5l0p5l2K8KL7N8j35
8138g8R6o3O4j26K00r0O3Mj04P3q7L5q8J98q8LKR2j57O3O4j15l6J24j70J30mM7
8166E2r5M9K0j6j2j5j1jq2O0PJ44j25m2P4m0J19j0j29P9l3J02j68L4P0
$$ plain form
7969 37 -1 28 -55 -25 -67 57 -59 -57 -32 -72 37 -1 -42 -44 -250 54 -25 -4 46 -32 19 -119 15 25 -25 50 52 -31
7997 -31 -52 117 -21 -21 -20 47 -65 -84 -23 -79 52 -138 -76 -29 40 -72 -36 -6 -57 27 -4 -75 112 -54 43 -38 38
8024 38 -88 -29 -97 -43 35 -24 76 41 -13 45 57 -155 136 7 18 58 26 -56 -40 17 139 47 -63 5 -25 -48 1
8051 1 -71 29 38 21 -11 -76 -28 -286 -4 22 -69 30 -27 -97 -17 61 -9 27 -91 -56 -101 24 -44 -2 122 62 71 -54
8079 -54 43 -73 -26 60 55 123 -31 29 -30 -5 45 -80 -35 68 -83 18 -39 24 2 59 28 -36 -69 -3 -63 -120 -44 -39
8107 -39 -11 -78 17 -10 -32 -38 -38 53 42 -18 41 43 -126 -54 39 -20 45 82 -105 -151 9 4 69 39 -36 -68 -40 -38 -1 57 -78
8138 -78 18 -45 19 -107 93 3 66 70 -34 39 -48 -13 -101 97 9 12 14 106 -51 12 76 -39 -75 49 -121 9 5 52
8166 52 -43 6 26 10 -2 -17 -28 -29 -111 -51 -44 100 -25 -67 7 -33 86 76 -53 26 -7 95 -73 -39 31
8191C1
$$ Imaginary data points
##PAGE= N=2
##DATA TABLE= (X++(I..I)), XYDATA
0@%%%%%%%%%%%%%%%Lj1J6j6J6j6K4l2L2m0M8n5O3p2Q0q8J04j20J36j52J70j94
37a04K18k42K72l04L37l76M16m58N07n62O20o84P53q26R13j008J110j225J356
56G13j504J673j869K097k370K703l118L652m368N390o974R774j6223O1278J6656
71F7510p1526K3588j3452l3575o41J6921k2419m100J5944M101k831K6748R724
84A5992j2466N428R818j4119L344J1092o044k651L989j0240o780Q04k257o839
98a0929m991k663J22K313O975L085L855O956K077M382R476J89K51p67j4558q386
114b613L860p739j0626K078J194n745K85J0277Q928M124O297J445m612K404J064
129A0621o117J787K306o406l333l59k666N6O01k141k557j513J311J049J131N314
$$ plain form
0 0 0 0 0 0 0 0 0 0 0 0 0 0 0 0 0 3 -8 8 -8 8 -8 16 -16 16 -24 24 -31 32 -40 40 -48 56 -64 72 -80 90 -104
37 -104 114 -128 144 -160 177 -199 217 -241 266 -296 324 -360 393 -433 480 -528 582 -643 713
56 713 -791 882 -987 1110 -1260 1443 -1675 1977 -2391 2999 -3975 5799 -10424 50854 67510
71 67510 -4016 19572 6120 -27455 -28096 -11175 -33594 -37694 -21750 -17649 -20480 6268 15992
84 15992 3526 8954 18772 4653 7997 19089 13045 10394 14383 4143 -2637 -1833 -4090 -10929
98 -10929 -15920 -18583 -18461 -16148 -9173 -6088 -2233 4723 6800 11182 20658 20847 21098 20331 5773 -2613
114 -2613 1247 -6492 -17118 -15040 -13846 -19591 -19306 -9029 -101 4023 10320 11765 7153 9557 10621
129 10621 4504 6291 8597 2191 -1142 -1501 -4167 -4111 -3510 -5651 -8208 -9721 -8410 -7361 -6230 -916
145i16M584K586L194O23J216J271m927m392k053n244k640j46l276j64L549P60
161e975N61L950N519J891j675J329J025k794K48J40k443K09j344m584n89Q86m17
178d063M44P9k59K61J21J850K045K363L539J18j904O83l85j844r17k421j796j385
196c471l158p89J782J056K148J753P24J969J433O48K48p79L60o24l100k63R14
213H51j736p71k50j270M13J33k11O19M32M69O58N96K450J934k91K93q13j692j9
232A795p30j954n60j175j161j017R5K317J862K00J236N25N6Q16L09p7K05r64j410
251C68q59o62R23J3j200K3j37o12L39K38N54R28j74J54J064Q84J025j4p34j44
271A977q97j065j45p69r27l31p03j39J085J208J282K66k12Q79J27n05M20Jo16
$$ plain form
145 -916 3668 6254 9448 10071 11287 12558 7631 3239 1186 -4058 -6698 -6844 -10120 -10284 -6735 -5975
161 -5975 -5414 -1464 4055 5946 4271 5600 6625 3831 4079 4219 1776 1985 641 -3943 -4532 -3646 -4063
178 -4063 -3619 -3540 -3799 -3538 -3417 -1567 478 2841 6380 6498 4594 5277 4892 3048 2131 -290 -2086 -3471
196 -3471 -6629 -7418 -5636 -4580 -2432 -679 45 2014 3447 4095 4343 3564 3924 3300 200 -63 851
213 851 -885 -1656 -1906 -3176 -2763 -2630 -2841 -2222 -1790 -1321 -663 -67 2383 4317 4026 4319 3506 1814 1795
232 1795 1065 -889 -1449 -2624 -3785 -4802 -4707 -2390 -528 -328 908 1433 1489 2305 2614 2537 2742 1778 368
251 368 -491 -1153 -230 -217 -1417 -1394 -1531 -2143 -1804 -1566 -1012 -84 -258 -104 960 1844 2869 2855 2121 1977
271 1977 1080 15 -130 -899 -1826 -2157 -2860 -2999 -1914 -706 576 842 630 1509 1636 1131 1551 1552 936
290I36n24j114l18N50P2L38l27m19J65k89k90Q39N01r5J20l14O92Q07L6M6m5p03
312F64l27o78o55K87k23m97J31J28N69O50M90L82P5j13R0k35l38J49l91o80j62
333f84K4K91K65k37K35m5j67J24J28nN50k73k62K26J5K93M5p3M5l70m42k32j60
356g09K4L02k19nK97L32J84N18M6O0k31k14j40j48l29R4l91p1J35Q3J34J64J60
379G6J79k11j56L52K6M1m5p7k0M4j37J9J16k25j05k89k41K81R5j3R5P4K05K72
403C56p6N5J22j38j07j66j56K9r7j16o9k5MK35j77K35L36p5j26k41J95K69r1o6
427A10J05q7p2k3j07J20Pl25j74R5r8K89RR6Q7J39Q1O8K8J5l8k44j49r6R0n8N1
454h1j26J85k07R8J45K2J0R6j83l1lJ59L5L6m2j01j1l0J41k31J50k09p3J32R7
$$ plain form
290 936 412 -702 -1020 -470 -398 -60 -387 -806 -641 -930 -1220 -381 120 25 145 -169 523 1330 1366 1412 1367 664
312 664 337 -341 -996 -709 -932 -1429 -1298 -1170 -601 49 539 921 996 883 973 738 400 549 158 -522 -684
333 -684 -660 -369 -104 -341 -106 -151 -318 -194 -66 -71 479 206 -56 170 185 478 523 450 495 125 -317 -549 -709
356 -709 -685 -383 -602 -607 -310 22 206 724 770 830 599 385 245 97 -232 -138 -529 -600 -465 -382 -248 -84 76
379 76 255 44 -112 240 266 307 262 185 165 209 72 91 207 -18 -123 -412 -653 -372 -277 -290 -195 -121 84 356
403 356 280 335 457 319 212 46 -110 -81 -178 -294 -363 -388 -384 -149 -326 -91 245 170 44 -197 -2 267 176 110
427 110 215 128 56 33 -74 46 53 -272 -446 -351 -449 -160 -151 -55 32 171 252 320 348 363 325 81 -68 -164 -74 -132 -81
454 -81 -207 -22 -229 -131 14 36 46 142 -41 -72 -75 84 119 155 113 12 1 -29 112 -119 31 -178 -251 -119 -22
479b2j1j2K05j80K11k11K16No5Mk43M3Q7j05O7P2q6o9K11k12R1J86j85l7l2m6
505a18R2J59j42J97j27o5Q3j95J16%o6l3M7l1J44rJ8J34p9j15K7L0M7r3j16j5
531a10Q5q0J16Jn0N6n8O8j5p8M8J00l0k2n4O1J5j0m4O9j06R4j00moN5K9j40J08
560bl2M8q7K10Qk10J41M7r1M7j39K9N0p6q2J40n5P2Qj2q8K5n1J05j1J7Q8k5j08
589c4J22j58k6L6R2n3k7r1J42K5L8j19R1k8L8l0k0P6n8J06o6r5R7K7L5r2Nj55
617a22J68N1O8j17p7J02j53J17q8J8oJ01M3j27oJ46k14M2R2j69J89j11J5P2J8
642E2j09N3l2O3lK5k5q7K01j55Pk9P7j10O4O3N5j32k5R4J0Ml4N3k42J72Q8k3o2
671A3L9Or6P3j8or8O4J21j40N2k2J18r0r2J67j70N8o5R3Kj2M5j42R5J04j01J1
$$ plain form
479 -22 -33 -45 160 -20 191 -20 196 201 136 140 -103 -60 27 -78 -11 61 -25 -94 117 -95 -4 182 -3 -40 -72 -118
505 -118 -26 133 -9 188 61 -4 79 -116 0 0 -66 -99 -52 -83 61 52 70 204 125 10 37 67 114 21 -95 -110
531 -110 -25 -105 11 12 -38 18 -40 28 13 -65 -17 83 53 31 -23 38 53 43 -1 68 -38 56 -44 -48 -54 1 30 -110 -2
560 -2 -34 14 -73 137 145 -65 76 123 32 79 -60 -31 19 -57 -139 1 -54 18 26 14 -74 -49 -100 5 -6 11 99 74 -34
589 -34 88 -70 -96 -60 32 -21 -48 -139 3 28 66 -53 38 10 48 18 -2 74 16 122 56 -39 58 85 120 28 33 -122
617 -122 46 97 165 48 -29 73 -80 37 -51 -33 -39 62 105 -22 -28 118 -96 -54 38 -131 58 -53 -38 34 52
642 52 -57 -4 -36 27 24 49 24 -63 138 -17 -10 -39 38 -72 -8 55 110 -22 -47 47 57 61 27 80 -162 10 98 75 13
671 13 52 58 -38 35 17 11 -87 -23 98 -42 10 -12 106 16 -76 91 -79 -21 -86 7 9 -3 42 -100 -5 99 -2 9
699Io4P3m8m1J08l0m4NQ3j84J10O6kp6o7J68q7k8J17o6P3K5o3j3p0m4N5j5lR7
729D4J9q9J71m3j12J76j37j29n5J6R3m6M6P8j01J74r5O0l2M6n7k7L4j21J3L7n4
756i1J46m7K1J2q4P9j76K17j79J39p1J5J0j44J35j23K55j04j4P3q4J32j19j3n
781b0L0p7M3L9L2k4j14J07m2P7m5j5n5R0n4o9J76j4m5m2M5m7L7J9p3j1J04r4j0
810e2p1J62j2O2Q2n3j57K2P0l7j20J50j73O5j3k0N8LKmko5J56n6J8m2p0rK04o1
840C7j04L1k7L1n0R1o1M9J1LQ7m0j09R3k0l2L0J10j67k2P2K4J9j01k0k2N7L4J48
869A52k16O3N7o9O3K1j27O3O0j93R7K1J0n9KQ9m9j4P5p7Q2q7Q4j14N7R5r2M6m8
898hmJ53j84R2j36M7J9P6m8j17Q7K7JM1o4J24o8Q2j60nM6n1P6J16k46J43q8J20
$$ plain form
699 9 -55 18 -30 -71 37 7 -37 -32 51 -133 -23 43 41 -35 -102 66 -21 -49 68 2 75 100 37 24 -46 -90 -35 -50 -53 44
729 44 63 -26 145 102 -10 166 29 -100 -155 -139 -46 -92 -46 32 -69 105 10 70 38 84 27 0 34 -87 -74 -37 -91
756 -91 55 8 29 41 -43 36 -140 77 -102 37 -34 -19 -9 -153 -18 -141 114 10 -4 69 -15 117 -2 -15 -20
781 -20 10 -67 -24 15 47 23 -91 16 -26 51 6 -9 -64 26 -28 -97 79 65 20 -22 23 -24 13 32 -41 -52 52 -42 -52
810 -52 -123 39 27 89 171 118 -39 -17 53 16 -104 46 -127 -62 -75 -95 -37 -34 -32 -36 -38 -103 53 -3 15 -27 -97 -106 98 37
840 37 -67 -36 -63 -32 -82 9 -52 -3 8 11 98 58 -51 42 22 -10 20 130 -37 -59 13 37 56 -45 -65 -87 -30 4 152
869 152 -64 -1 56 -13 50 71 -56 7 67 -126 -29 -8 2 -57 -55 34 -15 -29 46 -31 51 -36 48 -66 -9 86 -6 40 -8
898 -8 -12 141 -43 49 -87 -40 -21 55 7 -110 -23 4 5 46 -18 106 38 120 -40 -45 1 -50 26 142 -104 39 -49 71
926G1q7j7K8M0n3j8L7J0n6O5j1p8q7j7J00PJ35n4pOK7K8j04J77Ko7j52oP2N5O2
957A08n5k5l3%N0j14p7J37P5k9q4Q8J1N9j29o0N2J9O9j12O8j12N3LM8n2R2J12
985A62k08N8N8p7N5p9M8J5O6r8j0N9o3m7P4K0K0M2p1n4J6K7o9J77j91J08pM7j07
1014b9m7O9j8K8kk1J2N2j08Q0m4N0O1j13J17j89J82l4O0r6K1r7J10Rp3PL8m4n5
1043g4J31j3p9L0N9jm9M8mj21J54r7o8O6J5J4L6n0k0L5q9J29L2q6r7J44jp3J68
1072A39k04J12m4q3jK8J19j55J19j35J18o8R8j6j4LoQ2p9On4J11m7RKJ7j48N6
1100c5N8J2q4L7RK2K9j26K3n3M7J12lL1k1j37L9P2J7j49L2J18m4J08j81J05j07
1127f9J47q2k2J10j8Kp2N9r4K6J4j5r0jR3j11L4R5n0LL8j72K18l3n4j4J37J6r4
$$ plain form
926 71 -16 -33 -5 35 -18 -36 1 11 -45 20 9 -69 -156 -173 -73 -66 69 15 8 14 41 69 -35 142 144 77 -75 -81 -9 46 108
957 108 53 28 -5 -5 45 -69 -146 -9 66 37 -47 41 52 111 -18 -78 -26 -7 62 -50 18 -94 -41 -38 10 -42 50 162
985 162 -46 12 70 -7 48 -31 17 32 98 0 -10 49 -14 -61 13 33 53 95 24 -30 -14 13 -56 121 -70 38 31 78 -29
1014 -29 -76 -7 -25 3 1 -20 -8 44 -64 16 -28 22 83 -30 87 -102 80 46 106 10 31 -66 44 53 -20 -13 25 -19 -74
1043 -74 57 44 -35 -5 54 53 4 52 48 -73 81 -16 -84 -18 -3 11 47 -3 -23 12 -77 52 84 -2 -99 45 44 -29 139
1072 139 -65 47 3 -80 -81 -53 66 -89 30 -105 13 -55 43 27 13 16 10 92 13 19 -35 76 29 38 40 57 -91 -35
1100 -35 23 35 -49 -12 -3 19 48 -78 -55 -108 -61 51 48 79 58 -79 -40 32 49 -100 -68 50 6 114 -67 38 -69
1127 -69 78 -4 -26 84 66 68 -4 55 -39 -13 1 -14 -104 -105 -12 -123 -89 6 -44 -41 -3 -175 43 10 -44 -58 79 95 1
1156AmoN0j50J00P5l5p9M6nN4l8K4L5o7o8J08j30M2J18Rp8M9M0r3n8J59m6j01
1185d8N8k11K11k3n1R4QJ9o7K4l4n4J20m9O5l6m0j1J04j69J30ml1L1n8o4P0n2
1213f8J52Kk3n6KPK0r1K6M3L0J2j54K41j44%J46k11M4k6M1O9j19l1KN1J73j11
1241B7O7n7L5O1k47M8N9j03J49n4J68k12N5P1k07J57O4j34J36n5k2J4M7j17nJ42
1267H7j28l5Q2m8m5J34o4k0M2l1O7J1j78L1K41l3q4n9K2M3J9k5m5K9mK0O4n6m1
1296dq9P0M6K2q8M3M4kK3p8J7J9k3k3kM9rJ2r4R0j83J05J23j6Njr5J25j4q1N9
1327E0l2r8J06n5k0Q1l4k7J32j21N9m3j4K4LP3j69J68j54l2R9J50m6l4mQ9j29
1354B2n3k3NJ15p0M9R2p2p5r3K08j62k6J28k2m7k3J1J40p6J5l1r4J48p4l6O7m2
$$ plain form
1156 1 -3 -9 41 -109 -9 66 31 -48 -2 -7 47 9 33 68 1 -67 41 -89 -47 71 80 2 51 91 -2 -60 99 53 -48
1185 -48 10 -201 10 -13 -64 30 38 57 -10 14 -20 -74 46 -3 62 26 -14 -25 79 -90 40 36 5 36 -22 -86 -16 -68
1213 -68 84 86 63 7 9 16 36 -55 -29 14 44 56 -98 143 -1 -1 145 -66 -22 -48 -7 62 -57 -88 -86 -35 138 27
1241 27 94 37 72 133 -114 -66 -7 -110 39 -15 153 -59 -4 67 -140 17 81 -53 83 28 6 20 67 -50 -55 87
1267 87 -41 -76 6 -42 -87 47 -17 -37 5 -26 41 52 -126 -95 146 113 29 -30 -8 35 54 29 -16 13 9 29 93 37 -4
1296 -4 -93 -23 23 45 -43 0 44 42 65 -13 4 23 0 -23 -25 24 15 27 -67 23 -160 -55 68 52 57 56 -39 86 72 -9 50
1327 50 18 -80 26 -29 -49 32 -2 -29 103 -18 41 -2 -16 8 11 84 -85 83 -71 -103 -4 146 100 66 62 151 22
1354 22 -31 -54 -49 66 -4 45 137 65 -10 -103 105 -57 -83 45 23 -24 -47 -36 104 28 43 12 -82 66 -8 -44 23 -19
1382a9J28n0r6L3m1k6L8J29n5j64P9R6j7J1k2K4J3n5J4p0m0K4q9P0K7J47j34K28
1410A83j81o0M0q7R0j31J65o2R5j32J26MM8j74P0j0M9N0K6j63K1pQ4L7j35J68
1436A14j45q4R0j9q4K34o2M8r9j9P4LK0j51Q2k0L3j8lK2O1r1Pm7Q7j6K9n5l4Q1
1466C8o1K3m5n8N9P9r0L1Q7M0o8L9QKq6qj7K2JM4r9n4J00Ol8mm1J36J8r6O8q9
1498e3r9R8J42m3q5O4j2Kj5l2P8r2KP0j26J07Nk5rJ15n0l0k6P9q1n2J2JJ9NM5
1529A4k2J4k6L0J09j53l5L9O0q8M8k6PK8J1l9l0J54j6l7m4j2N6Mk2l6L2K3Nn8
1559a0K3JJ1J03j87L5J52q1q1J6K9o9N8J16j26M3M5j30J93j74J5q%M9n0P7p7k8
1587e5JR4n7j32K10j36MJ15J2p6q%M2m1L3n6P6oj07J52p8P4o0J2K6K2j32K6J8
$$ plain form
1382 -19 109 59 -37 -4 -45 -71 -33 96 41 -123 -44 52 35 46 24 48 61 6 20 -50 -90 -66 -155 -85 -58 89 -45 183
1410 183 2 -58 -18 -105 -15 -146 19 -43 52 -80 46 50 98 -76 -6 -16 33 83 109 -54 -33 -40 44 81 -54 114
1436 114 -31 -115 -25 -44 -128 106 44 92 -7 -26 48 51 71 -80 2 -18 15 -3 -6 16 77 -14 -7 -54 33 17 46 -9 -43 38
1466 38 -23 0 -45 -103 -44 35 -55 -24 63 103 35 74 82 84 -2 -10 -27 -5 -4 40 -59 -113 -13 -7 -45 -49 -90 46 64 -32 36 -53
1498 -53 -152 -54 88 45 -40 24 12 14 -1 -33 45 -47 -45 25 -101 6 11 -14 -23 92 42 12 -14 65 -16 -68 -56 -55 -36 -31 14
1529 14 -8 6 -20 10 119 -34 -69 -30 30 -58 -10 -36 -29 -1 10 -29 -59 95 79 42 -2 -14 42 46 24 -12 20 43 48 -10
1559 -10 13 14 25 128 -59 -24 128 47 -34 -18 11 -58 0 116 -10 33 78 -52 141 -33 -18 -26 -26 23 -27 50 -27 -55
1587 -55 -54 40 -17 -149 61 -75 -71 44 56 -20 -28 -28 14 -27 6 -50 26 20 -87 65 -13 61 1 13 39 61 -71 -45 -27
1616b7K8k5J9n1l7O7j4k6J80o1K6k7k7n2J22m6m0j13Q9J88j31n5N2n9mJ53p7m6
1644FJ14j02Q5q5l5J63r5j18P1q7K9R5Ko8J5O0l9p8J76j29Q6j6j01LRJ16kj4l3
1673B8p9K4l1M8qJ4K1m5P5l8k3m4J2O8m0n7J97r4%o3N7M4p6Qq1N7J06q4MJ8n4
1704c6K3J5N4%N8j01J9m5L6n8J34klj36JM6j3p5Q2J37j14Mp5J02q7n3J58l8n5
1733b2P2p4k7k5P2M1M4j70J43l6j22Q8m0L2M6j7j26J19m8j5J5N4q1Q4M9j08M1
1760a1J25j24j5oK0p0J17O7l5n0J18j53J19k3r0J2P0j3q2J1k0J8mN8p7P3l0K8
1788C3p9L1q0K41j15j6m1L5q4LJ48q7P1m9p0N6L5r8J08OQ0j46p9J35k1J6l5m1
1816d3N6r3R6kj19J81m1L2O5j41J67j67k3%K6J00o1k4P9q2j20J92j04KK6kO3o2
$$ plain form
1616 -27 1 -24 -5 -56 -93 -26 -40 -66 114 53 79 52 25 -27 95 49 9 -104 -15 173 42 -13 39 -20 -24 129 52 6
1644 6 120 18 103 18 -17 146 51 -67 4 -83 -54 41 43 -25 -10 50 11 -67 109 -20 66 50 -51 -48 -39 77 75 61 28
1673 28 -51 -27 -58 -10 -18 -4 17 -28 47 9 -14 -58 -46 22 -18 -75 122 28 28 -35 22 66 -10 -2 -83 -26 80 -4 0 18 -36
1704 -36 -13 2 56 56 114 13 32 -13 23 -35 99 97 94 -42 -41 5 -8 -83 -1 136 22 26 -49 53 -34 -87 71 33 -22
1733 -22 50 -24 -51 -76 -4 37 81 -89 54 18 -104 -16 -56 -24 22 5 -121 -2 -50 -65 -50 4 -77 7 56 -52 -11
1760 -11 114 -10 -25 -31 -11 -81 36 103 68 18 136 -17 102 79 -11 1 71 58 -24 -13 -33 -15 -19 39 -38 35 5 33
1788 33 -46 -15 -95 146 31 15 -26 9 -75 -72 76 -11 60 11 -59 -3 32 -66 42 48 128 -18 -97 38 17 33 -2 -43
1816 -43 13 -80 16 14 -105 76 35 67 132 -9 158 -9 -32 -32 -6 94 33 9 88 6 -114 78 -26 -24 2 0 63 1
1844An7N0p9J33q0J63j11J03p5m8L3%n6m5n9M4J47k5q5N9M8n3n9m0J31K7p1m0
1872d4RJ05j36R8m2r6J22q3M3Nk6j19J99m3P4Nj14m2K9nN6k7J2l4K3L9k0pJ01
1901H2q4pL7k0p6J23n2o9MR9n4q1K7J3J03p8K8k1O1q8K7j1K1O5m1J86k43Q6j2
1930B5N1r8O2L2n9j6K0lOo6Q5j04O1o0P2k0R0j18j5J00l1L1M4k08J15P6j6o2K
1959dL2n2M6l9K6P8L1j10L9r8QJ4L8Q0L2l6j82J09K4m6LK0p3M9NP1K3m6p1l6J10
1990D5n8k5j38J99p8K4n3l1M0J0l6J54N2k07R9M9n0J68j78M3L3p6L5l7K2L8j4
2017C0M9j27J18nOj17K0N5OQP5j34J22j28Rl7J03o9O1j0q7%k2P9m0Pn1q3N0R3
2047a9O0O7n4o7K2J4J5o3p1J67o9J0N7j31JN9J67j30n7L9r3J53n0J8o6N2j25J29
$$ plain form
1844 1 -56 -6 -85 48 -32 131 20 123 48 0 33 33 -23 -68 -127 -83 64 39 -46 13 61 8 -51 -91 40 67 -4 -44
1872 -44 -35 70 -66 32 -10 -106 16 -67 -24 -19 -45 -164 35 -8 66 71 -43 -85 -56 -61 -5 -32 -20 -54 -31 8 -12 -19 82
1901 82 -2 -9 28 8 -68 55 3 -66 -62 37 -17 -98 -71 -58 45 -33 -5 -26 35 -53 -26 -37 -16 49 8 194 -49 37 25
1930 25 76 -22 40 72 13 -3 17 14 20 -46 39 -65 -4 -64 8 -12 78 -40 -55 45 14 45 89 -119 -4 72 56 -6 -4
1959 -4 28 -24 22 -17 9 87 118 8 47 -51 -43 -29 9 89 121 85 -97 12 36 -10 -7 13 -60 -11 -6 65 88 42 -29 -65 45
1990 45 -13 -38 -176 23 -55 -31 -84 -115 -75 -65 -101 53 105 -102 -3 46 -4 164 -14 29 62 -14 21 -16 6 44 30
2017 30 79 -48 70 65 71 -46 -26 29 35 43 118 -16 106 -22 -13 -50 53 -16 45 35 -52 -52 -74 5 -35 -28 -79 -162 -112 -19
2047 -19 41 108 54 -13 9 23 38 -25 -96 71 2 12 69 -62 -61 -2 165 35 -22 17 -76 77 27 45 -21 31 -94 35
2075C5k0l1n5J22Rj64N9N8k8j1J5M0p5N4j3l5J9P5l5n8J61j24l2k2R5M2j01J0
2103a0N2n6Jj43K06M0m4o2J07n4j01R1m9k1O1K1j12K7J20j47J15o8J15k57Q1P8
2129iK7%L3N1p5j7N0m9L2K9L1j63P9k4j8J20k45J78Oj03Q2q9J08M2q8j6r3P5J35
2158H9j55R4j44J13O8p3p0J57j04J2K7m5Q8l5j0p2J45m1K2j10m0J08j03N4r6Q2
2184c9O8l6j8j4K0K7k9j9K5n4J5O8q3J20j02l8J54j13R6n1N3m0j29J55kk7j1R
2212EO9m4Or9R0n1m2O9O0O5j71O3M2j3j04J2N6n4L9Mr0M0l3QK02j56l3O5n6kL1
2243b2M8j04J31p1M1N2j25J45k4o3N2n9q9K8j10J61J42k40L8M1m9L6NR9o7k8N7
2270B5K4j16Q3mj50J00O1m1K2Po6J39o2p1L7M9M9j36J22N5p2nj00O6j0m0jN9o8
$$ plain form
2075 35 15 -16 -71 51 60 -104 -45 13 -15 -26 -11 29 -46 8 -5 -40 -21 54 19 -39 122 -2 -34 -56 39 81 -20 -10
2103 -10 42 -14 -13 -156 50 90 46 -16 91 37 -64 27 -22 -43 18 39 -73 -46 74 -73 42 -26 89 -168 -87 -9
2129 -9 18 18 51 102 27 10 60 11 43 72 103 -60 19 -5 -23 97 -148 30 36 -67 15 -74 34 76 -12 -28 -121 -46 89
2158 89 -66 28 -116 -3 65 -8 -78 79 -25 -13 14 -31 57 22 12 -60 85 44 66 -44 -84 24 -79 -25 -121 -39
2184 -39 29 -7 -25 -39 -19 8 -21 -40 -15 -69 -54 14 -69 51 -51 -89 65 -48 48 -3 50 10 -119 36 34 7 -4 5
2212 5 74 30 36 -63 27 -24 -66 3 63 128 -43 20 62 49 -55 -43 13 -41 -2 2 -88 -48 -81 -73 129 -27 -60 5 -51 -53 -22
2243 -22 26 -78 53 -18 23 75 -50 95 71 8 60 1 -88 -60 -170 -9 133 -107 -69 -28 -77 -41 -36 63 -4 -32 25
2270 25 49 -67 16 12 -138 -38 23 -18 4 11 -55 84 22 -49 -12 37 86 -50 72 127 55 50 -50 16 6 -34 -35 24 -44
2299d4R6o9%P6o3O4L5l1j35l0O2j8k2P3q5OJ22j00J26l4Q6p9m0o9J20n0K9l3n4
2328f1J71p8q2L7Q3j8n8n6J15m1L2q1J02l9p2J8k1%M7O2j18Q1o2L2M1rqo3J25
2357G9q7J63k35L8m2L0K9P1p2R2o9k7N0j60P1K8L6Q3l2l6N7r5P4O9o1l5MP8j45
2386d4J48j39J35j26l8J92j35O3j32O1L5M2l3k2l9L1L4n2q3J74j14k0M9n5J27
2411E9p1K7LK9k8o5M4l0J12n5q5K6PO7N4j98J08K1n6J20j57J79j92J97r6q2J37
2438G5j51J81j86J78n6Om1n4jN7J8jj9RrKm0J29n2K4L5j32Pn3K4J00p4j6J10r3
2468b3m7N1o9O1q7J30j11L8j9Q6j6L8J7r7M5l6N1o7OL7K0K9j06J83j65jp3K49
2496A24j61m0J66r5p6J63j18K4Oj09J03K6j20J04n0K9N7o1j2m3J84p0J1qN3r7
$$ plain form
2299 -44 52 -17 -17 59 -4 60 95 64 -71 -101 -39 -57 -79 -6 -91 -85 37 -63 63 29 115 36 -4 -73 47 -3 26 -7 -61
2328 -61 110 32 -50 -13 70 52 -6 -62 53 12 44 -37 65 26 -46 -28 -49 -49 -2 60 -58 23 -39 -7 34 25 17 -46 79
2357 79 -8 155 -80 -42 -84 -54 -25 46 -26 66 -3 -30 20 -140 -69 -41 -5 78 46 10 67 -28 46 115 54 19 23 101 -44
2386 -44 104 -35 100 -26 -64 128 -7 56 -76 -15 20 62 29 7 -32 -1 33 -19 -102 72 -42 -62 -13 -68 59
2411 59 -12 15 18 47 19 -46 -2 -32 80 25 -60 -34 -27 40 94 -104 4 25 -31 89 -68 111 -81 116 20 -62 75
2438 75 -76 105 -81 97 41 47 6 -48 -49 8 26 25 6 15 6 8 -32 97 45 69 104 -28 -21 -74 -50 50 -24 -40 70 -23
2468 -23 -70 -19 -88 -27 -114 16 -95 -57 -76 10 -6 32 49 -48 -3 -39 12 -55 -49 -12 8 37 -69 114 -51 -52 -125 124
2496 124 -37 -77 89 -6 -82 81 -37 -13 -7 -116 -13 13 -107 -3 -53 -24 33 -28 -40 -83 101 31 42 34 87 -10
2522a0p3L9J7k5lP8o6J2J06rq4lm2J11l5K2o6m4j8J43q0P3j49P5K7L5k2L0k3o6
2552e0N0Rr1R5L0k9j8LM9o3Q9k11J51j6N7p6J64j54L7Rl3QRPj44J08J7N3j18P4
2582A6j4n7J33J3j06J61j84M5R5j20L5l0JN4j3o6M1p6j3K27j87RNMK7p7J22J4
2610E9l0k0l0J29j39L2n3K7P6l6JJ6k4q7J30j21M5K8r7J84j13JP5o1q7O6k7L1
2638b5O3N7r6N8j45N4L7j12J20j3L5l9L0O3L9Jj90J53j10L5n3O8j18N2O5j5Lj10
2666i3K7O5O6j30L7O1o4n2%JLJ07m2P1K3q7L7m2J25j06k5J0qMO6j35M8j1j04K24
2696G6jk6l5QjNl5q3K02p4r2j08J83P6q0RM0k8p4J9J43o3m0O8Nj11j2P1j45J2
2726i1K08j43l3rJ08p8J6K3J06r6L9q9K5Q6j35J04j02J31j04M1O5j60K04j18P
$$ plain form
2522 -10 -83 -44 -27 -52 -55 23 -43 -31 75 66 -18 -21 -63 48 13 35 -31 -75 -93 50 -30 43 -106 -31 -4 31 9 39 16 -50
2552 -50 0 9 -82 13 43 14 -4 -1 48 -15 74 -137 14 -2 55 -21 143 -11 26 35 2 10 19 26 -118 -10 7 60 -58 16
2582 16 2 -55 78 91 -15 146 -38 7 102 -18 17 -13 -12 42 29 -37 4 -72 -85 142 -45 -36 -31 -27 0 -77 45 59
2610 59 29 9 -21 108 -31 1 -52 -25 51 15 16 32 8 -79 51 -70 -25 3 -94 90 -23 -22 53 -8 -95 -29 -56 -25
2638 -25 38 95 -1 57 -88 -34 3 -109 11 -2 33 -6 24 87 126 127 -63 90 -20 15 -38 30 -88 -36 29 14 17 -93
2666 -93 -66 -1 65 -65 -28 33 -31 -83 -83 -82 -79 28 -14 57 80 -7 30 -12 113 7 -18 -8 -16 -12 54 -81 -33 -44 -148 76
2696 76 75 49 14 22 21 26 -9 -92 110 36 -56 -164 19 95 15 24 64 36 -38 -19 124 61 21 89 94 -17 -29 42 -103 -91
2726 -91 117 -26 -59 -68 40 -38 -22 1 107 11 50 -39 -14 72 -63 41 -61 70 -34 7 72 -88 116 -2 5
2751EM9j24K1J51j3o8j6K04j12k01O5L5J66j81P9m1j2Qj54J52m7J23r0J1mp1J8
2778d7Q5o1r3J06J2L0k5O3M0j83M5m1Q5k9q9J8J04M8j29Q9J1L8j14p1R2N5L3o9
2806CJoj9J13j45J18n4j5P1q0q0J56j48J21l3o5J4o8J22j24Q5%P3n4L8k8j2r2
2834a08P5LJ12j44J66N6j60N8o2K7j3R0j80%N7o7J2k2Q8oJ2K2J9O5j14m7J37j34
2862e8k1NO9j11N6Q3j19O3J39j45jJ69q7qJJ1j81J53K3J6MK1m5qj14J09K2o3j7
2891c4M8k4jk3Qk7J74j13lj6J33q2m3R3j1o7k4p1l3J12mJ9p3N3K9K5n4N3j0jr7
2922f4N6Ok9P9j9k9nm6O1P8jj11L7o7M7j6Q8K2j11P6L3j61N3k0jO2O1j09J09j44
2952f5L6J8o8N9L6j16R7P1j56o2J64J0k1M2J2j18J18j42P8o8N3j5N0Q2k8p4j07
$$ plain form
2751 5 54 -70 -49 102 89 21 5 209 97 -104 -39 -4 162 -19 60 19 7 15 -139 13 -34 89 -1 10 6 -65 -47
2778 -47 38 -23 -116 -10 2 32 7 70 110 -73 -28 -69 16 -13 -102 -84 20 68 -61 28 39 77 -37 -108 -16 39 72 3
2806 3 4 -2 -21 92 -53 65 11 -4 67 -13 -93 63 -85 36 3 -62 -48 -116 6 -118 -33 -33 40 -14 24 -4 -16 -108
2834 -108 -33 -30 82 -62 104 160 0 58 -4 23 10 100 -80 -80 -23 -90 -78 -100 -12 -18 -6 16 35 100 -14 -61 76 -58
2862 -58 -79 -74 -5 -116 -60 23 -96 -33 106 -39 -40 129 42 34 35 46 -135 18 41 57 61 82 37 29 -85 24 46 -17 -34
2891 -34 14 -10 -11 -34 -26 -53 121 8 5 -11 122 40 -3 90 79 12 -12 -83 -116 -4 -8 11 -62 -9 20 45 -9 44 34 33 -64
2922 -64 -8 -2 -31 48 29 0 -5 -51 10 88 87 -24 13 -54 -7 -23 65 87 -24 52 85 -76 -23 -43 -44 18 79 -30 79 -65
2952 -65 -29 -11 -79 -20 16 -100 -3 68 -88 -150 14 24 3 45 57 -61 57 -85 -7 -75 -22 -37 13 95 67 -7 -114
2979a14J94j42L8P6l5P7r7p1O8J62j66n0L3R7j94J20Q6l7q7L0r9J33mQmp4o2J10
3007d%nJ4O1q1Jl9R8m5L7MM3j17J05r5J5J67j26nJ8r5P8M0q6Q4j58J43l1N0k42
3037a71J48P9j17k4J3K3J4K9P2oK8o1pl0rQ0j49P9M3n4m6P5m4J3Q5o1o6O7l1J14
3067H6J4l1n6M4k07J82pj10J87j55J06j7m8%P4p5L5j1n4J27K5qn3j19J28j84J54
3094B7K5j09L4n0P0L7l7K2K0j44j31K60J04m0Lj39M2m0O0k0J75k26O2l5N4o3J9
3121b0L2j07N0J35j29J3n9J18R3r8o1K3K1J06j13N3m0j86J03k8J09K2q1J02%q7
3147b9J28j7j05K1P1j39J18j69K03J1j51J34j18R1oj7o4O5o3O5j02M4L6n2R4n2
3173crL4j38J90j7L7nq1K0l1p5J40o5J2K8ll8n5J2M3L8N0P0j64M5K2r7j9M5N6
$$ plain form
2979 -114 80 -62 -24 52 17 94 -3 -74 -6 156 -10 -60 -27 70 -124 -4 82 45 -42 -12 -111 22 18 26 22 -52 -114 -4
3007 -4 -4 -9 5 66 -15 -14 -53 45 0 37 41 84 -33 72 -23 -8 159 33 28 46 -49 29 69 -17 67 -91 52 21 71 -171
3037 -171 -23 56 -61 -85 -72 -49 -35 -6 66 60 88 27 20 -10 -19 61 -88 -9 34 -20 -66 9 -35 -22 63 2 -64 3 -28 86
3067 86 100 69 13 57 -150 32 25 -85 102 -53 53 36 -12 -12 62 -13 22 11 -43 84 109 101 48 -71 57 -127 27
3094 27 52 -57 -23 -73 -3 34 -3 19 39 -105 -236 24 128 88 91 -48 -6 -46 14 -6 169 -57 5 -30 24 -39 -20
3121 -20 12 -95 -45 90 -39 -26 -85 33 126 28 -33 -10 11 117 4 57 17 -169 -66 -94 15 37 -44 58 58 -29
3147 -29 99 82 -23 -2 69 -70 48 -121 82 93 -58 76 -42 49 43 26 -38 27 -36 29 -73 -29 7 -45 49 -3
3173 -3 -12 22 -116 74 57 94 89 8 28 -3 -78 62 -3 9 37 34 -4 -59 -47 -4 34 84 154 -10 35 57 -40 -59 -14 42
3203D2L2j38O0jR5p1q9Q5oM0L6n1M3K3n9J9r6m6KJ17L5j74O3M8M0K0M4p7j08R
3233f3P9N5Qo6r7L1N3%P3j17J00Q0j83P4j27J03p6P6k2q6J17O6j29lRQ5q9l5M0
3262d4L9n7L8k4p9K23l9p5k4QO4O8j70Q9oO4p2K8L1k0j9k1O7j25J00K3o9o9KJ15
3292D6p4K1L4r4K7J5M0M3j09N4r3nJ13M9qj0r1J16m2K3j17P2kj11L6J40n8J7q3
3321e1N2n8j5J10m5k0j8L5m6J5Q5Lj67J09K3l3n4L7N1r5J7P9K5p0L0q6R6p1m8
3350a10R9o5Q9n3J32q4JJj8kO8r2J55q6j2l2P4M2j61J34j9j09k3J4Q0n2L6M1P3
3379A21j19JJ71n8j78m6J46j86J54p9Q8j00o6J93m7LN1Nm7Oj29J17kQ5j15j1O3
3406B1m8P2j1o6K6O0q2O3jn8l5P1m4N9l5Q0l9mk0o4JOJ14j67m8J25P0l8P6j8o4
$$ plain form
3203 42 74 -64 -4 -5 90 19 -70 15 9 49 85 34 77 100 41 60 -36 -82 -80 37 72 -102 -39 9 49 69 113 36 -72 -63
3233 -63 16 71 79 13 -84 -53 0 0 73 -44 56 136 -47 27 -100 3 -73 3 -19 -105 12 78 -51 -54 -45 40 -49 -84 -44
3262 -44 -5 -62 -24 -48 -127 96 57 -18 -42 -34 30 98 -72 17 11 75 3 31 62 42 23 2 69 -56 44 67 -2 -71 -69 46
3292 46 -28 -7 27 -67 -40 -25 15 58 -51 3 -90 -95 18 67 59 49 -42 74 32 55 -62 10 8 -103 -67 73 15 32 -51
3321 -51 1 -57 -72 38 -7 -27 -45 -10 -56 -41 44 47 -120 -11 12 -21 -75 -38 13 -82 -65 14 39 -31 -1 -87 9 -62 -110
3350 -110 -11 -76 13 -40 92 8 9 10 -8 -10 58 -34 121 35 23 -9 65 107 -54 80 61 -48 -71 -57 23 -29 7 48 121
3379 121 2 3 174 116 -62 -108 38 -148 6 -73 15 -85 -151 42 -5 -2 49 54 7 13 -116 1 -1 84 -31 -42 21
3406 21 -27 45 34 -32 -6 54 -28 35 34 -24 -59 12 -32 27 -8 72 33 29 9 -55 -54 -48 66 -101 -149 -24 46 8 84 66 2
3437Bm3J3J35k54m7J72m5O3o1J26o5nL8Qr5P1k3jp4J68Jm3l9k9R6p4qK7k4P9k0
3468D9j57L9L0M2q4J52N1p9o6k4q3J53j19J15J5kP8j3p0lj22J40rR0j11n2l7J25
3496D8l6k7N8l9m2R9Lj49J16O3o7J4Rj15K13j14q9oJ00qk5jj12O0j0Q3j70J13
3524c1O3j38J11KM4o1PJ06j32J07P5j86R7q8J9L0Mj10L3J62q5l8o3J18q3Q6K3
3551G2j9j95J16p2j5L3J11Qq7j3J5L2Q7J3k3r7M7J9J17j53P0q9K5r2L9J30q7P1
3579F3l4j98K12j7J23k09J75k30R6mNJ16j58J10m0J8J17k29K06q1j06OJ20r2Q1
3604E0l6N4n9pQ4j29k1K1J00l5j3q7M0P1n0K6L3K5R1j96J7m8J26m1N3N6k09J62
3632G8M5j15Q7m2m0J18j67J49k47J45j69J03J20j27O9p8J8k9Q9l7m3M8J01m4K0
$$ plain form
3437 2 -41 -28 107 -147 -194 -22 -67 -4 -65 61 -4 -9 29 37 -58 13 -10 -11 -85 83 84 41 2 -27 69 -5 -13 14 -10 69 49
3468 49 -108 -69 -39 3 -81 71 122 43 -23 -47 -130 23 -96 19 34 32 110 97 27 24 -98 42 33 123 12 -40 -77 48
3496 48 12 -15 43 4 -38 61 64 -85 31 94 27 41 50 -65 148 34 -55 -61 39 31 6 5 -107 -47 -57 26 -144 -31
3524 -31 32 -106 5 7 51 -10 -3 103 -29 78 153 -33 64 -24 -5 25 29 -81 -48 114 29 -9 -72 46 -37 49 72
3551 72 53 -142 -26 -98 -113 -80 31 39 -48 -61 -46 -14 73 86 63 -34 13 32 149 -4 66 -23 2 -90 -51 79 -8 63
3579 63 29 -169 43 26 149 -60 115 -115 -19 -23 -18 98 -60 50 10 28 145 -84 122 41 -65 -59 61 -31 50
3604 50 14 68 9 2 86 -43 -64 -43 57 22 9 -78 -38 33 -17 9 42 67 158 -38 -21 -69 57 16 69 125 -84 78
3632 78 123 8 95 53 13 131 -36 113 -134 11 -158 -55 65 -62 7 -71 -53 -82 7 -30 -73 -25 76 32 52
3657E2k7n6l6P9k4J2l1j0J03j37J63j5j13O4k9L8j19M4MK0M8j1j7o3rJ00r2L7
3685b5N2m0r6J38n9K7P0k6Q3j36M2j06J20p0R8j30O4J09k1j87J48P8j28R0r2K4
3711B7m1R4n4j23Q3j04J59k8J17k17QQ9K2q5M0L0q7P8O9M9k19J63k8r9J06N5j07
3738cp2lO8LL3Q5m2n8N6O6p7M0j35R6q3J9q9K04j11J1k33K25Jp7J07m1J0j2j6
3767b8L9p5J29l0k5j16J34j61O3J21k6J3o9P0j31R9O4r8RP5k00J90N3j57j9J86
3793A10j21l9J28m0p1J4K7o1L5M0m9J6k7m0M9Q3n9qj8L9r5O8L6q2K0n4J3K7N4
3822ej04P2oJ34q4M8j5o3m3Ll8J48j00K2l6k8J77l6p3j1q2R4L4rR7j34pO9o6K9
3852a3oJ1L2pJ1o9N5NJ5jK2q0JM5l1o8P2O7j2j48M0K01l4o7m0j9nK3O3k2J1o2
$$ plain form
3657 52 25 -31 -67 12 -12 0 -31 -41 62 -75 88 73 -40 24 -5 33 -86 -42 -38 -18 30 19 2 -61 -70 30 -62 -25
3685 -25 27 -13 -109 29 -30 -3 67 41 124 -12 30 -76 44 -26 72 -58 6 115 94 -93 55 133 5 95 3 27
3711 27 -14 80 26 -97 -14 -118 41 13 130 -87 -79 10 32 -53 -13 17 -70 8 77 126 -93 70 42 -57 49 104 -3
3738 -3 -75 -78 -10 -7 26 111 69 11 67 133 56 96 -39 57 -26 -7 -96 108 -3 8 -225 0 1 -76 31 -10 0 -12 -28
3767 -28 11 -64 65 35 10 -106 28 -133 -70 51 25 38 -31 39 -92 7 71 -27 -18 57 -143 47 100 -57 -76 110
3793 110 -11 -50 78 38 -33 -19 8 -53 -18 22 -27 -11 -38 -78 -29 54 -5 -13 -31 8 -87 -19 17 -65 -45 -99 -86 -59 -5
3822 -5 -109 -37 -43 91 7 55 40 -23 -66 -63 -101 47 -53 -31 -67 -95 82 46 -27 -38 -120 -26 8 -1 96 -38 -45 24 -42 -13
3852 -13 -19 -8 24 17 28 -41 14 19 34 33 55 -25 -24 21 -10 -78 -6 61 49 -99 -59 142 108 41 1 -18 -23 0 63 41 52 -10
3884a0JKLP2j43J21j66O8R1J2m1n6L7NO1p9J02l0Qj26P2N2q1L7n0j3QP4nMK9j20
3916f1N6J26j07J3l8Q2l1L1j05J17l5n8P4k02k9J11P0p5P0o1N0j5K7M4lj26q4
3943a59N6J78j4k1pJ3o4%n4J26O6r8Nq5L2l5m8J80r0P1J2o8Q8j27J04K0j17n2
3971h8J72j95O5J4M5m7J59k94J67m9L3O9r7n2R8j38J15R7j70L7J05j59J40K1K2
3996G0j57J09l1%O4Qk2q6R9q6N1k7N5j42J19J22k19J51k33Q1N2P3m1j11L5N9n
4023a2p0J09%m4l1k4J13K1j1k0Qm8Rj3qk3K5L3L6j53J39j3n4m4J03n2k1N9oLo2
4054e1P3J6K6j37M5K2K0rnO1q8m4P0N1K5M3j77K5M2L3O7p8qPLn9K7J3N6n3o0L7
4086gNm5j1R1m7qJ02r6j3J44J9j23j07L7J81j22K9m9k3L4K7%j8O5p9Q5j20Q5j20
$$ plain form
3884 -10 -9 -7 -4 68 -75 46 -120 -52 39 51 10 -46 -9 -4 57 -22 80 50 58 -68 4 56 -25 12 -38 -51 -43 31 26 30 59 -61
3916 -61 -5 121 14 27 -11 71 40 71 -34 83 48 -10 64 -138 -167 -56 14 -61 9 -52 -2 -17 10 54 51 -75 -159
3943 -159 -103 75 61 40 33 46 -18 -18 -72 54 120 22 27 -58 -26 -61 -109 71 -19 52 64 -4 84 -43 61 81 -36 -88
3971 -88 84 -111 -46 -32 13 -34 125 -169 -2 -51 -18 51 -46 -98 0 -138 -23 74 -96 -59 46 -113 27 48 70
3996 70 -87 22 -9 -9 55 63 41 -45 54 -32 19 -8 47 -95 24 146 -73 78 -155 -74 -22 51 10 -101 -66 -7 -12
4023 -12 -82 27 27 -17 -48 -72 41 62 51 31 39 -9 0 -13 -21 -44 -19 14 50 -103 36 23 -31 -75 28 -24 -45 14 8 11 -51
4054 -51 22 38 64 -73 -28 -6 14 5 0 61 -27 -71 -1 50 75 118 -59 -34 8 41 108 30 22 29 32 -27 0 13 69 16 -44 -7
4086 -7 -2 -47 -58 33 -14 -22 80 -16 -29 115 134 11 -96 -59 122 0 29 -20 -43 -9 18 18 0 65 -14 71 -49 36 -84
4115h4O8q5k6J59olk3P0j70N9J08j6k6J7j6j9j9L6q3J33j30N8pj2m3J19r1M9q8
4144g1oP4n4K1R0m1j00J99L2r0j32M9R5j01R1j48J47o5p1J47p7J19j64J35j58
4169g9J89j65J04Ln2l9j5J06o1Q5r2p6J14J5p5J38j00o7P9Jj12K17j22N9Ml4r
4196A6k1N3l7l2j3O0j2M9r1Q8K0j38L4n2O3K8o0m7J48j02qo8P4M7PM0nJ8p7P6
4226E8j09R6kl7K5j7m4L1MK1k17J61K0N7j75J25Jm8k9l5J81k00J48o1J30n1J15
4253A48j80Q7j11J25q9o3K45j92oNmJ53j05p3L4L8N8o9Q6j18J7K5Kn8ML0l1n1
4281i3Q3j0L7O6n7k4N5o2j06J24l2l0M0R7j45J08r2J03l3oL5l0j24L0J03j26Q0
4308iJ10q7j76K0J75m2j4P6k5m0j3O2j52R0J15j41Q6q5N6q3J45j4M5j16M4L8o1
$$ plain form
4115 -84 -16 -101 -127 32 26 23 0 70 -100 -41 67 51 25 42 26 7 -12 24 -59 74 -56 2 -5 -17 -60 59 -32 17 -71
4144 -71 -77 -3 -57 -36 54 13 -87 112 144 54 -78 -29 66 -35 56 -92 55 -10 -81 66 -11 108 -56 79 -79
4169 -79 110 -55 49 52 0 -39 -54 52 -9 76 -16 -92 22 37 -38 100 0 -67 12 13 -99 118 -4 55 59 25 16
4196 16 -5 48 11 -21 -34 26 14 63 -28 60 80 -58 -24 -76 -13 15 -45 -92 56 -46 -54 -122 -48 -1 6 46 41 59 -18 58
4226 58 -51 45 43 6 31 14 -30 1 5 26 -191 -30 -10 47 -128 -3 -2 -50 -79 -114 67 -133 15 -46 84 33 148
4253 148 -32 55 -56 69 -20 -83 162 -30 -36 -31 -35 118 13 -60 -26 12 70 1 87 -31 -14 11 13 -45 -41 -11 -42 -93
4281 -93 -10 -20 17 83 26 2 57 -5 -111 13 -19 -49 -9 88 -57 51 -41 62 29 23 58 28 -96 -66 37 -89 -9
4308 -9 101 14 -162 -142 33 -9 -23 53 28 -12 -25 37 -115 -25 90 -51 35 -50 6 -77 68 54 99 -17 27 65 4
4335DK6M2j0j63J04r6J62l2j04J49j43O5n8R7k0M8l4N5l7K8r5m8N7o1Q1N6p7m1
4363d5J18q1ll8rM7p1J63k5J6o2q9l4R1k3R8m4m3P4p1M1k7k8Q3m7j8KM5k7L1N
4394B9j57P5j09J61Lj4m0J35m3m9K5j83K43r1P2N1k53J58p1KL0J22j26O6k7P1
4420H0j30R9q3n7J13l6j04M8J9L3L8q3P1o1J50j4j7q2Q1M3j15PM4n2N7j15l3O5
4448c4LJ88j59j2l5L8M8N3j8L2nj31kN2P4j13Q2l0n5Jm3oO8J30o8k4q6Q5k4n2
4478d3M4l9J4O0j34J05JJ7l1On2j0J06Ro6J20o1o0L3n4J38j8j10m0L5K2o4O1j9
4507c0kR9M9n7l2J1k7N3j03k6J08J46k05O5j51N8nl6J19n8j5L2J2N4j57O5JJ35
4535A03jk04J59M1P0j22L0o4M3p1J5j21Q1J18m7J6j16J42j64N8JJ43r8lL2l2K8
$$ plain form
4335 4 30 72 62 -101 3 -93 69 37 -67 82 -61 4 -54 43 23 71 37 92 55 83 -12 -60 -3 -64 17 73 -4 -45
4363 -45 73 -8 -11 -49 -58 -11 -82 81 56 72 10 -79 -113 -22 -45 53 9 -34 40 -31 10 -17 -45 38 -9 -27 -25 20 -7 24 29
4394 29 -128 -53 -162 -1 2 -12 -52 83 40 -9 16 -167 76 -15 57 108 -145 13 -58 -56 -26 96 -30 36 9 80
4420 80 -50 49 -34 -91 22 -14 -118 -70 -51 -18 20 -63 8 -53 97 83 66 -16 65 108 -7 0 44 -8 49 -66 -99 -34
4448 -34 -31 157 -2 -14 -49 -11 37 90 72 104 99 -32 -34 18 92 -21 61 31 -24 -23 -66 -72 -4 126 58 34 -52 33 9 -43
4478 -43 1 -38 -24 36 -98 7 8 25 -6 0 -52 -62 44 53 -13 107 46 -14 19 -35 103 85 -25 -65 -30 -8 -72 -11 -30
4507 -30 -32 67 116 59 27 38 11 64 -39 -65 43 189 -16 49 -102 -44 -49 -85 34 -24 -39 -7 5 59 -98 -33 -32 103
4535 103 102 -102 57 98 168 46 76 12 55 -16 -1 -122 -41 77 30 46 -70 72 -92 -34 -33 110 12 9 41 9 37
4562C7o8PPj8P4L2o9J0kn2J03j17J2J19j38J50j73N8j24K04O6k03J34J9p1qL9
4589B8l4J4m7J71j28r2O1O2q4kK5n7J17l4k0O0Pk5j37N5O1l5qj9L6Q8p3K9j1K5
4619C3m5M2J9n4k7N7k9qj9j15J17J00m2o4K7l7n5mJ02Q3n1j08J21l8l0P1J1j0
4647D7j04J10k2k9N6j20N8Nm6R9j2P8k39Q6K8lN6j9L0j23QM2K2j09Q5n2L7L7l2
4676b6R5rq4oL1L8p6l2j2J78j20m1M4JOQJ2k1R0r7r5J19o8K6P0lO3j14M8Lrqn7
4709d6K4P6n3P0K5q0Q8j49P7r1N5p4O1N5Q3o7j0k3p4L9J32j71J7J4j7J04l1mq3
4738e3J48j06O0l7N3n5J3k7J55j60J2P7K3n0n7%l4P9km2M1o7K3O3j16N7n9Q7r1
4767f5R3m8N6j07RK7n7Q6j32J37n1J02j16o3K12r5J01j82J11K1j28L9K2K9n0R1
$$ plain form
4562 37 -31 -24 -17 -35 39 71 2 12 10 -42 61 -56 -44 75 -63 87 -86 -28 -152 52 118 -85 49 68 -3 -11 28
4589 28 -6 8 -39 132 4 -88 -27 35 -49 -51 -26 -83 34 0 -20 40 47 22 -115 -60 1 -34 -42 -61 -25 63 -10 19 8 33
4619 33 -12 30 49 -5 -32 25 -4 -12 -31 -146 -29 71 29 -35 -8 -45 -100 -104 -2 81 30 -78 43 5 -25 46 57 47
4647 47 -57 53 31 2 58 -62 -4 1 -45 54 42 120 -119 -33 -5 -8 48 29 59 -64 -56 -14 8 -101 -16 -68 -31 6 -26
4676 -26 69 60 -24 -30 1 39 -37 -69 -81 97 -23 -64 -20 -19 -13 -5 7 -14 76 -21 -116 3 -65 -39 31 28 91 -23 25 28 19 11 -46
4709 -46 -22 54 1 71 96 16 104 -45 32 -59 -4 -78 -17 38 121 54 44 21 -53 -14 118 -53 -36 -22 -39 65 34 30 -53
4738 -53 95 -11 49 12 65 10 23 -4 151 -9 3 80 103 53 -4 -4 -38 41 39 -3 38 -29 -6 57 -59 -2 -61 26 -65
4767 -65 28 -20 36 -71 -62 -35 -92 -6 -138 -1 -52 50 -66 -129 83 -12 89 -93 18 39 -89 -50 -28 1 -49 42
4793D2k2o5M2j64L9J56o2L9j28N6O7P0k4N3j45J8J05n9r3N1J07j16N3j16J07n6
4819d5P7j04M7L5p7OL9k0J66k48J15r0L2M9j0M3q8N4n1J53n7J6q7J12k6j5ml0
4847hQ2K1j49K1M1m7KJ51j13Qj2r7J63o3J8J9j13K3Kl6j4P4K0q6J16n7o5J8J23
4876D2j06O0M6r6N1M2j51K40o6n4k6l6l9N7M0J01o8n1J0J02j21P4j19lP5N2r6
4903d0l3P2K1mk2p9Q9k1r4O2r0K81j83M5rM4k3l8J0K2O4l1PJp0rJ07l2J8PQr3
4935a3M1K8l8n5Q5L2j01K6r1N5rJ02p2J11q8q1P4K7r3R2l4qk4J07m3j2p6KP5o3
4965d4J13n7qK8J6q8l6P7Q1l9j13J49j45L6j9O8r9rJ25L7j44J35n5J32j90L9n2
4992f2j7J10r1M9p2J77p5j10P6k4J2K7L5j22R6J3m9Q1q9K8j2q7J62j56R4q1J31
$$ plain form
4793 42 20 -45 -3 -167 -128 28 -34 5 -123 -67 0 70 46 99 -46 -28 77 18 -75 -24 83 -33 20 -96 11 -45
4819 -45 32 -72 -25 10 -67 -61 -22 -42 124 -124 -9 -99 -67 -18 -28 15 -73 -19 -70 83 26 42 -45 67 41 26 22 -8
4847 -8 74 95 -54 -33 8 -39 -37 114 1 9 -3 -100 63 0 18 37 -76 -53 -51 -87 -101 -27 -7 -93 23 -34 -99 -81 42
4876 42 -64 -4 42 -54 -3 39 -112 128 62 8 -18 -54 -93 -36 4 105 37 -14 -4 98 -23 51 -68 -71 4 56 -40
4903 -40 -73 -1 20 16 -6 -85 4 -17 -111 -49 -139 142 -41 4 -5 39 16 -22 -12 10 74 43 50 51 -19 -28 79 47 65 72 80 -13
4935 -13 28 56 18 -37 48 80 -21 5 -86 -31 -40 62 -10 101 13 -68 6 33 -60 32 -2 -10 -34 73 30 18 -58 -56 19 -44
4965 -44 69 12 4 32 48 -40 -76 1 82 43 -70 79 -66 -30 -49 19 -80 -89 36 73 -71 64 9 141 -49 -10 -62
4992 -62 -79 31 -60 -11 -83 94 19 -91 -15 -39 -27 0 35 -87 9 22 -27 54 -35 -7 -19 -106 56 -100 -6 -87 44
5019D4MP5j44l1J9oJ18m5q0J38k04j0R0P0l4p2J68o6j89N8J75j28jj03K30k7l6
5046A3O6m6k2Mk2j6M7j74J29l4N7N6N1p1j1R7p9pl3J07j79M7J01j20J51j60J6
5073c2L5N7p0n6J05p5J39j42l7N1l8O8l3j2M2P7r2n5P8p9L6L8R4pr8j3j3Q6o9
5102a5L9j9P7p6ML1p2qL1Q3o0P3r5O3M7j15M0m2n8J42r2j4L3Q8j65O5mL5ll2r
5133b8O1J6q3M5r6J13K6j97J91r4L9P7m6l4k4J02j90M4K9Q2N5j31Q1n8M5m8l0
5160e3J03j10J86j52M2rp8POl6P2P1j43J03j7K0%q7J14R9j21n2J5J47r1l7K3M
5188B6m3JP5q6N9j28K37j32L0k2n0lJ03n0o9Q8q5J10o1n2OK8J31r9Lq0O6K5j73
5217a45J28k5MQ5k9o2K4J1K6N5l2j5m1J7k5O2l6J29j65J14j79J41Oq7J08j16L5
$$ plain form
5019 44 48 123 -21 -52 -33 -39 79 34 -46 92 -112 -122 -32 38 4 -68 100 34 -155 -97 78 -50 -51 -154 76 49 13
5046 13 79 33 11 15 -7 -23 24 -150 -21 -55 2 58 109 38 27 124 45 38 5 112 -67 -20 81 -39 112 -48 -32
5073 -32 3 60 -10 -66 39 -36 103 -39 -76 -25 -63 5 -28 -40 2 79 -13 -68 10 -69 -33 5 99 92 -6 -19 -32 54 -15
5102 -15 24 5 82 6 10 41 -31 -39 -8 75 15 88 -7 56 103 -12 28 -14 -72 70 -22 -36 -3 85 -80 -15 -19 16 13 -19 -28
5133 -28 33 49 -34 11 -85 28 54 -143 48 -46 -7 70 24 -10 -34 68 -122 -78 -49 33 88 -43 38 -20 25 -23 -53
5160 -53 50 -60 126 -26 16 7 -71 -64 -58 -94 -22 49 -94 9 -8 12 12 -75 39 138 17 -35 -20 127 36 -1 22 26
5188 26 -17 -16 59 -27 32 -96 141 9 39 17 -33 -36 67 17 -52 36 -49 61 0 -52 -46 -18 113 14 17 -63 3 28 -145
5217 -145 -17 -42 -38 47 18 -44 -20 -9 17 72 40 25 -16 1 -24 38 2 131 -34 80 -99 42 48 -39 69 -47 -12
5244a2l0j8l2P5k6O8p7MM6j53L08j23J19j50l0p7N9Q7j5k3m7k8J01K7n5oJ7M4
5272E3L4o2oN3j5r4L2n6M4QOn3L9P9J4j26P3j11P0k8R8l2j3k6J85j13J4q4r0J42
5302C5j49J72O3j12K5n2P9j83J29P6r6K9j7R5j81Q1l8NL7N9m6P2J6q9n6P0J1j12
5330g7L0L5No7M1M4M0P2k09J31n2o2O8o7J14n8M2j03N9J25p3j71K12K0j5j10J0
5357a6OjJ9Jk9L2m0OR1j35Q8q8R1p2P0k1K6J48j97L9nj09K6m9Q1j8L7K2J8m2q
5388b9K2Q0j27P6O0K6j36K6MRQ8j86rJ57q8J23j54l1J08R4o8n9O7o6m7K2M0J6
5416A8j01P6J2P3j33J47m4q5l5o5K05k32J60JJ72j29j57M8j3R5k1J23j03lp6J31
5442F4j23L2jM5K0j1O1o1q2M6j24J96p9K5o6K2P9r6J9pOO2J1lq9j0J39j03p7J65
$$ plain form
5244 -12 -42 -60 -92 -17 -43 25 -52 -48 -2 -155 153 30 149 -1 -31 -108 -49 38 23 0 -47 -75 26 53 -2 -8 9 53
5272 53 87 25 19 72 57 -37 -5 -61 -17 -9 -3 -56 -17 62 76 -50 23 -88 -18 -46 52 20 7 -19 166 53 67 -17 -107 35
5302 35 -114 58 121 9 34 -18 61 -122 7 83 -13 16 -1 94 -87 -6 -44 -39 -2 57 11 83 99 10 -46 24 35 -77
5330 -77 -47 -12 -7 -74 -33 11 51 123 -86 45 -7 -69 -1 -68 46 -12 30 -73 -14 111 38 -133 79 99 84 -26 -16
5357 -16 -10 -11 8 9 -20 12 -28 -22 69 -66 22 -66 25 -47 23 2 28 176 -21 18 13 -96 -70 -119 -38 -56 -19 3 21 -21 -29
5388 -29 -7 73 -54 22 82 108 -28 -2 2 11 99 -87 -96 61 -27 96 -58 -89 19 113 45 -14 53 -13 -60 -38 2 18
5416 18 -83 -7 5 78 -55 92 48 -37 -72 -137 68 -164 -4 -3 169 40 -117 -69 -82 13 -8 115 12 9 -67 64
5442 64 -59 -27 -28 17 37 26 87 26 -56 -10 -134 62 -17 8 -58 -36 43 -53 -34 -41 -35 27 38 35 -54 -64 75 -28 -105 60
5472F0j16M0k4O8N5j71j5N3Q5m3L8J3j13P4O7l4j1O2p4j6j1N3p5J29k06P8R4N0
5500A10p4q3j2M8K4QM4j34J21j02Q6o2k4J3Q1j08K32k60J81m1o6O3O3q3jN7j47
5527f6N3K9Kn3M3J17j64O4nM3Ro7K2mp4Q3p3K7o1qJ21M1Pm9N2j37K7Q3L9q6j65
5558a50K7J79j22J14p2Q9j30m1J41q2L0p7J21K2p5P4j67K06m9p3jn5Q2l3O8j4
5584A2L4K3n9k6j6M7j4j03J30M2l7NQ0k26P2RM3o4%O9j32J16j3q7jQ2j0j3j8O2
5614Gjp1L6J0J30r5L5j8r7qOM5j5P4n9J2p6J20Kn3L2K2m1k1O2K0Nj62J72l4n4
5645a5kL5j15J24j5o8l0j6R8p7O8k1Kj6o4K33k50J35l0n2%O8l1J4J2J2K8lm0p7
5675i3l8J38mnO4j16J4k3N4q0J19P3j03O1l1l0J4j4L1n4n2P1L6o0J10j10k3J00
$$ plain form
5472 60 -56 -16 -40 28 83 -88 -103 -50 35 -8 30 43 -70 4 71 37 26 88 14 -2 -13 40 -35 94 -112 -34 60 110
5500 110 36 -47 -59 -11 13 21 65 -69 52 -50 36 -26 -50 -37 44 -64 168 -92 89 48 -18 45 108 25 24 81 -66
5527 -66 -13 16 18 -35 8 125 -39 25 20 63 72 5 27 23 -51 32 -41 -14 -75 -83 38 79 86 37 89 -48 -21 62 101 15 -150
5558 -150 -123 56 -66 48 -24 65 -65 -106 35 -47 -17 -94 27 49 -26 48 -119 87 38 -35 -36 -91 -9 -42 26 12
5584 12 46 69 10 -16 -32 15 1 -102 28 70 33 38 118 -108 -36 -27 16 -48 -48 21 -111 5 -8 -95 -96 -14 -24 -37 -55 7
5614 7 6 -65 -29 -19 111 16 51 33 -64 -72 -66 -21 -36 38 -21 -9 -85 35 37 -16 16 38 -3 -24 38 58 63 -99 73 39 -15
5645 -15 -17 18 -97 27 12 -56 -86 -102 -4 -81 -13 -34 -32 -48 -112 121 -129 6 -24 -76 -76 -8 -39 -25 -13 -1 27 24 -16 -93
5675 -93 -131 7 3 -2 62 -54 -40 -63 -9 -89 30 103 0 61 30 0 14 0 31 -23 -75 -4 32 -28 82 -28 -51 49
5703D9M6n1k0m7p4J06l2kJ5M3J3l4L0m8N4o7P1j07kJ44m0j00kJ09q5J03k6r0O4
5732B0p8J49j00k6R7Q7j9j52k6K4L3J03j80mK5m0J26j25J21m2L0m2Jj4M5O8p7
5759DL5o5Q5%On7o8L4q2N7J31q5M8J5m3P0p4Ll2N9l0p2J25p8k2L1K4J19j32j3
5789gm9Q8j32J05M9p8Q6Qj14N3M8l2M8jj19N2l2Q6q5qk1j5J25j03k%N7n0L7M8
5819D2j02QN3R5m3pl6M6j9j06J27j69J22L4j11R6k4N4Nj33J01No6L9J6m0R8j06
5847b1j6Ll0J27q7o4P8M2L4r9Q5m3n0M0pJ6k6j9Q3M4j38Kj8Q2n4K6k8J3J2rK0
5878bk1k7L1M5m7Q2o2lM1q3J29m5n6m7J16K9n7m7Q2q1OM6p2O3Mj9j1N6q3K8P4
5909F9L8r3n7J72l7o8J14r0l3L7r6J23j11R1m3p6J25j00J41j46O4j47KP8j1J68
$$ plain form
5703 49 95 44 24 -23 -97 9 -23 -25 -10 33 46 12 42 -6 48 -19 52 -55 -57 87 47 -53 -55 54 -31 72 46 -44 20
5732 20 -58 91 -9 -35 62 149 130 -22 -48 -24 9 112 -68 -72 -47 -87 39 -86 35 -7 23 -19 -18 -32 13 81 4
5759 4 39 -26 59 59 65 8 -60 -26 -108 -51 80 -5 43 58 15 85 11 14 -18 41 11 -61 64 -14 -36 -5 19 138 6 -7
5789 -7 -56 32 -100 5 54 -24 62 70 -44 9 57 25 73 72 -47 5 -27 59 -26 -34 -55 -70 55 -48 -50 -50 7 -43 -6 42
5819 42 -60 -52 1 96 53 46 10 56 37 -69 58 -111 11 45 -66 30 6 60 65 -68 33 38 -28 11 27 -13 85 -21
5847 -21 -37 -34 -64 63 -24 -88 -10 32 66 -33 52 9 -41 -1 -8 8 -18 -37 46 90 -48 -46 -64 18 -36 -10 -38 -25 -13 -22 -2
5878 -2 -23 -50 -19 26 -21 61 -1 -4 37 -46 83 38 -18 -65 51 80 23 -24 58 -23 -17 29 -43 20 24 5 -6 50 -33 -5 69
5909 69 107 14 -43 129 92 24 138 48 15 52 -44 79 -32 59 16 -60 65 -35 106 -40 24 -123 -121 -43 -54 114
5935A14j72J03k7l9R6qk0M7j21L5p2J67j00k5q9K03j8r1k0o4R0J36j6k03R3L4
5961C3j11L3L7K9p8Jk7J05kK0o8MJ36j98J08j2o5O9l2K8N7j3j10OR7j40K4J40
5989G1n9O4p4q1J99j16l1K3Q4j19J31n8p6lQ6m8n5P1j14P0Q0o6J05j67R0J11j85
6016f7k8L7O4k3n4OJ05L0k0j20J29m2J03o1k06J88J6pn3N1j7K4o3n5R0Rl7L8j9
6045A8j7K3o4Q3p8l6J58k9j01P9q4J39k05o1K39q7J6n1o2J67j93R6P3J0j04L3
6071c8K4R4p3o3Q3r0L1N0%J44j07j9jj6K5j23k4M9O0L0q9O8r4P4Mq2OJ04l7JJ1
6102Bj12J09J06j92Q5r9J03J04q8k7l4pM6J25j54M0J14j49N0k3k0Ml0Q8J7K4L
6129H5r6J5M4j24J92j90Q6j60J34O8q8J8r3M0R8n6L6pJ44j12n9Q1j00J50o4n6
$$ plain form
5935 114 -58 45 18 -21 75 67 47 94 -27 8 -64 103 3 -22 -111 92 74 -17 -37 -101 -11 125 109 -94 -1 33
5961 33 -78 -45 -8 21 -57 -56 -83 22 20 40 -28 -24 112 -86 22 10 -55 14 -18 10 67 54 -56 -50 47 -93 -69 71
5989 71 12 76 2 -79 120 4 -27 -4 80 -39 92 34 -42 -45 41 -7 -62 9 -105 -35 45 -21 84 -83 7 118 -67
6016 -67 -95 -58 6 -17 -71 -65 40 70 50 -70 59 17 120 59 -147 41 57 50 -3 48 31 55 -8 -63 27 36 -1 37 18
6045 18 1 24 -40 43 -35 -71 87 58 -43 36 -48 91 -114 -175 64 -23 -7 -58 -120 47 -146 -50 23 33 -71 -38
6071 -38 -14 80 7 -56 27 -63 -32 18 18 162 55 36 35 19 44 -79 -103 -54 6 36 -53 15 -79 -5 -1 -83 -77 27 -10 -9 2
6102 2 -110 -1 105 -87 -2 -101 2 106 18 -9 -43 -50 -4 121 -33 7 121 -28 22 -1 -21 -17 -47 41 58 82 85
6129 85 -11 4 48 -76 116 -74 12 -148 -14 54 -34 -16 -109 -69 29 -27 9 2 146 34 -25 56 -44 106 42 -14
6155a4j39K11n6m0MRO7j4ol5M4j2L3L5k07O2Pj9J21j02J15q2J39j42J84k09N5
6182IM4m8O6q8P9j19R0k1j19Q0P4r5l4K00j15P6p5j0l2O2l1M6l7Q6j7j52J77j66
6210g0J16l3O6n4Rp3O4r1J17k7L1j9J0j12O5J19j96N5J6L8n4K5q3J37j63P7L7
6237Gl7m1M4M8q8J15Nm2M2k6k6nj7J4Oj4J24j39O7K0Kj21P4r2n6K57j22o7J22
6266E4n2n1QJ5J5Q7r0K2L3On3j29J22j7j6M5l6j5M3N7jK4K2j16J45j71O9r9J6
6295f3r1R6L1Kq3P9L3k1q4n3J27L7R7j31R2j28M0j0m0P3jK4oO3j05P7r4rR1n4
6325a1Q5j38l1O7J13l7j50J20m5J16l5o0j9N2kJ2lj10K2J95j61k7K2pJ03p0%Q
6353Iq6J28k7m8M5%J8moJ21Lj65N7Lj23P0lK2p0L7J7L1j4J0o4NN9o0m0P8j14J10
$$ plain form
6155 -14 -153 58 2 -38 -34 -25 42 28 22 -13 31 19 52 87 -120 -58 -51 -70 51 -51 64 -18 121 -21 163 -46 9
6182 9 53 5 71 -17 62 -57 33 12 -107 -27 47 -48 -82 118 3 79 4 -6 -38 24 -7 39 2 88 71 -81 96 -70
6210 -70 46 13 79 25 34 -39 25 -66 51 24 55 36 46 -66 -1 118 -78 -23 -7 31 -23 2 -81 56 -107 -30 7
6237 7 -30 -71 -27 21 -67 48 53 11 53 27 1 -4 -21 -7 -1 -15 109 -30 37 57 59 -62 12 -80 -136 121 -1 -68 54
6266 54 2 -49 -41 -26 -11 76 -14 8 41 47 -6 -135 -13 -30 -46 -1 -37 -52 -9 48 47 71 93 -23 122 -49 20 -79 -63
6295 -63 -154 -58 -27 -25 -108 -29 4 -17 -101 -154 -27 10 107 -24 68 -60 -20 -30 -70 3 2 26 20 83 -22 55 -39 -48 43 -11
6325 -11 74 -64 -95 -28 85 48 -102 18 -27 89 54 -6 -25 27 25 37 34 -76 -54 141 -20 -47 -25 -32 71 1 1 9
6353 9 -77 51 24 -24 21 21 39 35 29 150 153 -12 45 48 -75 -5 -8 14 -56 -19 -2 29 15 25 -39 -34 25 -35 -75 3 -111 -1
6385aj0r0P2lK0r3Q0k7n1K38j37j4O9p6m4Q6Q0r7m2J17r0K6p2k5J40p9NRo1J06
6415C6mL8q9nM5J0R9j23k4J02n5l5o9Q7o0P4L3k0n7K0M5l9K0k9K6n3J33j8m9r3
6445e4M0NKN7p1p4%J74m4q2P6r3K06j84N5K1j02l1nJ17P0Qk02M8o8K72j21q3J47
6474H4j08J48j94O1p8q1J62j7Q8n4j58K12n1J9J7j17J50p0k1Q2o0M1m8J2l3j0
6500b4k1M0mJ4q6J04j22J85j96j7J38K5j6j25R3Q7q4r7L9J62j02J7n6M9J6j04
6526h5L9J22n7L2j30J84q0j76J43R5j1p0L4q6J34j40R1j07K9k6R2M4p1P5r5L0
6552A0l9J4J2m2M3jo3J28j37j5J07l5j7o2J13J6J2J6r9N6R4k13Q2J51j43L8k3
6579CPj9O3k6j05J46o6J4l9MK5k0j51J02l8J67p5L5j07L5j6P8mo7j9J5J48j7p1
$$ plain form
6385 -1 -11 -101 -29 -32 -12 -105 -25 -52 -103 135 -2 -16 53 -23 -67 19 99 2 -40 77 -13 13 -59 -84 56 -23 -18 -9 -70 36
6415 36 32 70 -19 -24 21 31 130 7 -17 85 30 -5 -74 13 -47 27 60 40 -17 3 48 9 29 0 26 -27 106 88 39 -54
6445 -54 -14 -9 -7 50 -21 -95 -95 79 35 -47 29 -64 142 -42 13 34 -68 -99 -104 13 83 91 -111 -63 -131 141 20 -63 84
6474 84 -24 124 -70 -9 -87 -168 -6 -23 65 11 -147 65 14 33 50 -67 83 13 -8 74 14 55 7 19 -14 -24
6500 -24 -45 -5 -9 5 -81 23 -99 86 -110 -127 11 36 20 -105 -12 75 -9 -106 -67 95 -7 10 -46 3 19 -85
6526 -85 -46 76 19 51 -79 105 25 -151 -8 87 76 6 40 -46 88 -52 39 -68 -39 -65 27 71 0 75 -20 10
6552 10 -29 -15 -3 -45 -2 -3 -66 62 -75 -90 17 -18 -35 -97 16 32 44 60 -39 17 111 -102 -20 131 -12 26 3
6579 3 10 -9 54 28 -77 69 3 17 -22 -18 7 -13 -164 -62 -100 67 -8 27 -80 -45 -61 17 13 -54 -73 -58 90 73 2
6608Bl3L7J06o6q6lk3k2L1J21k7l5k3L2l5J8L6l2M9k2j55J99j37n0J21L8j3m8
6636b0k5OK7k3R8n2m8j1Q2R2j44N6j23M3rO5Ln5o0J60q0N5nM8p5J1k6k1K0J08
6666I7j73J69j30kO6k6Jn1NrJ41k7k9p7J30J2q5J4j24J58n6n1J5J02j02R1k9N2
6694H2j19M1k3o8M7J48o4Lm0k7p8K27j07pp8Q5m2M9n7P4K5j76Q0L8jr7J27j44
6722a02J25Q5j25j08J39Kp1N6q6J07L2m3O8r5R4Jm2K8n2J1o9J37q7m5J07n4N8
6749G1p5r0L1J37j38P8j2N5q6n5L8M2Ok5MQ2q1R9j40K8n0J02o5p5J04L5m2J3P8
6778F9j33J01l4L3Rj36OO7l4O1k9K2J7n0N5K5o8Jk9O0nq1L0rQ1J0m8N1n3L7k8
6809bo5q0J10M6k2P1k5j85J05P8M1l5n0k0j0J9L9q5J34J7j25LN5K3j07Q9qm1M5
$$ plain form
6608 2 -31 6 112 46 -40 -43 -66 -88 -57 64 37 2 -21 11 -24 -6 30 -2 47 25 -130 69 -68 -118 3 41 28 -20
6636 -20 -45 -39 -12 -35 63 11 -37 -48 34 126 -18 38 -85 -42 -51 14 17 -38 -98 62 -18 37 32 80 5 16 -10 -31 -11 97
6666 97 -76 93 -37 -39 27 1 2 -49 -44 -53 88 61 32 -45 85 97 12 26 -98 60 4 -47 -32 70 -32 59 30 82
6694 82 -37 4 -19 -87 -40 108 44 47 7 -20 -98 129 22 15 -63 22 -20 29 -28 46 71 -105 -25 13 12 -85 42 -102
6722 -102 23 108 -17 -125 14 16 -55 1 -85 22 54 11 79 -16 78 79 37 65 13 24 -45 92 5 -40 67 13 71
6749 71 -4 -94 -63 74 -64 14 2 57 -29 -84 -46 -4 2 -23 -19 63 -18 81 -59 -31 -81 21 -44 -119 -15 20 -22 -9 69
6778 69 -64 37 3 36 45 -91 -85 -18 -52 9 -20 2 19 -31 24 49 -19 -18 -47 13 8 -73 -43 -52 29 39 -9 42 -11 26 -2
6809 -2 -67 -147 -37 9 -13 58 33 -152 -47 31 72 37 -13 -33 -43 -24 15 -70 64 81 -44 -41 14 37 -70 19 11 -30 15
6838A5k8O6l2M2jM6k6j31P2m4j6J8M7m4Njp3O0O4KnM6k1q7J35k64K12n9l8rN4
6869Em5l8M8L9qK0RpK5n3m2M8O5r4R0n6NL1M5l3k9o0o6J59o6p5J40j02J5Ln7J22
6901C8q4N0J9p3J46j01l4J19lj50J06n1j3MO1l4LP6p7R0J3j04L1n6J7JM2m5k8
6930c7M1Q1j01J0Q4k6k8n9k0R4oJ6q1RK0K9M1L2q3j24J23j6l7L0LL5n5J32k11
6959a04J86o3n5j6R9j10K20j09kmj05J10j00j1Q1K2rj7k8l9K6j9K5l9N6n5J95
6986A35j46j11J05J0qJ46j21j64P1L7K7J24j32Rj9P8o9J1L5K6j22j2rJ5J26M1
7012H3j34P5ol7L6K4q0N6j21J10J02j58n4J60k4nn9J12L2j96Q0M9K7p0M9mj54
7039a07J41J26k16J37pj19M9Ml4J34r0o4n7k2J04Q3j26KQ9Or7K1K0K7j8o4P9p6
$$ plain form
6838 15 -13 53 21 63 62 108 82 -49 23 -21 -37 -19 28 -16 -11 -12 -85 -25 39 41 36 82 61 -26 109 -155 57 -2 -40 -49 5
6869 5 -40 -78 -30 9 1 21 30 23 48 -5 -47 1 66 -28 62 6 11 42 87 54 25 -35 -101 58 -8 -83 57 -45 -30 -27 -84 38
6901 38 -46 4 23 -50 96 -5 -39 80 77 -73 33 -18 -31 -27 34 0 3 79 2 92 105 1 32 -24 -7 -6 36 -9 -37
6930 -37 4 85 -16 -6 78 52 24 -35 -55 39 33 49 -32 -23 -3 26 67 99 16 -108 15 -1 -38 -8 -5 30 -25 107 -104
6959 -104 82 19 -36 -52 47 -63 157 48 46 42 -63 47 -53 -64 17 39 30 13 -15 -54 -28 -47 -22 -61 -5 -60 135
6986 135 -11 -122 -17 -7 -15 131 10 -154 -83 -46 -19 105 -27 -18 -37 41 -28 -17 18 44 -78 -90 -99 -84 42 83
7012 83 -51 24 18 -19 17 41 -39 17 -104 6 108 -50 -104 56 32 27 -32 80 112 -84 -4 45 72 2 51 47 -107
7039 -107 34 160 -56 81 74 -45 4 8 -26 108 18 -46 -103 -125 -21 62 -64 -62 27 33 -64 -43 -23 4 -14 -78 1 -75
7067g5j7J43j26R9o2l0k1P5R5o9j7k2J01o4Nm5qn7QJ06o1J20j8k4n0R1j13jr6
7096a33J71O5j72L8QJ9l3j12J78k7n2J09k0j20N1J6k9J84j20m9K3j0j6K7N4j83
7122a33P2L3njPm7L7k9k7J36j46K4M9N2j37Q6m0n7J37ml1J10o9L4j55N6J24p1
7150EO4j38N7K4Nn1nj0J07kj08K0j5Q9k0o0Q6nr6R1rN6o3j4k9o1M2O1o9M1M0j22
7182h9M9J17n4r0J28n2o7M0q2J67m4k2k8o6J36o8K0l5K1O5p8K8k8L6j7k5J9KJ28
7211A11j6l9N8j70n2J54r5J11O1j24m6Q7O5j98K09j53L2R5j14J3J25jn0q5M6P5
7237I9k6j42O7P8M3j82P2q3J02Nm0J39k19P8N5P0j52M0J0o2J33n0j28P6L3M0n7
7264ak1m1k1N5K5N5r6Q9k3K5l0q8J5J9R4j14q%J05j34L1O6n9N1O5n9L1M0j70Q2
$$ plain form
7067 -75 -92 51 -75 24 -38 -68 -89 -14 81 12 -5 -27 74 10 15 -30 -38 -95 -87 19 -42 78 60 36 -14 77 -36 -37 -133
7096 -133 38 103 -69 -31 -23 -4 -37 -149 29 2 -50 59 39 -81 -30 -14 -43 141 21 -28 -5 -15 -31 -4 50 -133
7122 -133 -61 -28 -33 -34 -27 -74 -37 -66 -93 43 -103 -79 -30 22 -115 -29 -69 -126 11 7 -24 86 17 51 -104 -48 76 5
7150 5 69 -69 -12 12 17 -34 -39 -49 58 56 -52 -32 -47 42 22 -38 48 43 -53 38 29 85 22 8 -21 -82 -40 21 -48 -7 33 -89
7182 -89 -40 77 23 -67 61 9 -58 -18 -100 67 23 1 -27 -93 43 -25 -5 -40 -19 46 -32 -4 -32 4 -13 -38 -19 -17 111
7211 111 95 56 114 -56 -108 46 -49 62 123 -1 -47 40 105 -93 116 -37 -5 90 -24 -11 114 113 63 -22 24 99
7237 99 73 -69 -2 76 119 -63 9 -74 28 33 -7 132 -87 -9 46 116 -36 4 14 -48 85 35 -93 -17 16 56 -1
7264 -1 -22 -63 -84 -29 -4 51 -45 44 21 46 16 -72 -57 -38 56 -58 -66 -66 39 -95 -64 2 -57 -6 59 0 31 71 -99 -17
7294a7PO7K1o2M3p1m9Q4N8k6o0j24J45m0pO6r7J48r7N6o6O2o5j6M9M8LRK8m9p6
7325b8p2K14q0Nn4Q9q8%K4k1n0J03q7P4jr7LP6n2p3J14j9P4l0j16R1R9kj35P8
7355C9r3k9K5K2j13J13N0k5Nj1k5O1M8j9O3j54NP7j29k4Q1k7J5j12K06k3qL7r5
7384d0K2K8L7j40J4P9K0n8Q7p6P4p7R3r9J13j12j28J72l5k9N0O1k7m3P5j08J07
7411F0l1M1J9j18J18k02N8Q5m9mM0L1j35J33L2j43J09j09K23j00j04Q9N0j32J15
7436G6p0p2O0n9J17r8l6J08L4j18J99j37J6m5K5K9j15Q1O2j26J18J0j21R0M5r9
7462b6M1l3N3rj05M4J05n1kM3l2p2Q1m4L1k4rm7J36n8k2Qj0K8q4P1m7Q9l3N1r3
7493b0J48j69J66j44J7o4L7L7L6rK4pm9Q9o5m8J0J1j6M2M1Qo3L2Qq8m1R8J3p8
$$ plain form
7294 -17 -10 57 78 16 59 -12 -61 23 81 55 -5 -129 16 -24 -31 35 -62 86 -11 45 -21 41 -24 -40 9 57 60 69 97 48 -28
7325 -28 -100 114 34 39 -15 74 -14 -14 10 -11 -61 42 -45 29 28 -69 -66 10 -42 -115 -1 -20 54 24 -92 -1 98 96 -39 39
7355 39 -54 -83 -58 -36 -149 -36 14 -11 -6 -17 -42 19 67 48 111 -43 -38 39 -90 -114 -33 -60 -45 -157 49 26 18 55 -40
7384 -40 -18 10 47 -93 -79 0 20 -38 49 -27 47 -30 63 -36 77 -35 -163 9 -26 -55 -5 56 29 -14 61 -47 60
7411 60 29 70 89 -29 89 -113 -55 30 -19 -23 17 48 -87 46 78 -65 44 -65 158 58 -46 43 93 -39 76
7436 76 6 -66 -6 -65 52 -46 -82 26 60 -58 141 4 20 -25 0 29 -86 -5 57 -69 49 59 -62 28 73 -26
7462 -26 15 -18 35 26 -79 -35 70 19 17 60 28 -44 37 -7 24 0 -9 -56 80 22 0 8 -2 26 -58 13 -34 55 22 73 -20
7493 -20 128 -41 125 -19 -2 -66 -29 8 44 35 59 52 3 92 27 -21 -11 0 -16 26 67 75 12 44 52 -36 -77 21 34 -44
7523d4O3J2j05J24j23J30j0lj10K5K2l5l7Q0Q9J4n9j87K22j58J44m0m3J41q4q
7549B0l9M0p6L9j9K0l1L6l5R0k04J92n3L0k3n3Q0o8R9k2R9j64O6q9OJ03j0qK4
7578E0K0j54N5o2K01j65J37j87M9J02J6r1m5k0J37l2RL4j06J08M6j01L0m3O2n4
7604dm5L3K1p1R6M5j22k0O5j4l3M5N2o4O9j77J60r1n4P9N0Q3k08J15o1KmJP0P6
$$ plain form
7523 -44 19 31 -74 50 -73 57 47 44 -66 -41 -19 -54 -91 -11 78 92 33 -154 68 -90 54 14 -29 112 28 20
7549 20 -19 21 -55 -16 -35 -15 -46 -10 -45 45 -159 33 -20 10 -13 -66 14 -54 45 23 122 -42 24 -65 -59 44 34 26 50
7578 50 70 -84 -29 -91 110 -55 82 -105 -56 46 62 -29 -74 -94 43 11 20 54 -52 56 102 1 31 -12 50 -4
7604 -4 -49 -16 5 -66 30 75 -47 -67 -2 -16 -49 -4 48 -16 53 -124 36 -55 -109 -30 20 103 -105 10 -51 -49 -53 -52 18 94
$$ [...]
8191f
##END NTUPLES=NMR FID
##END=
