##TITLE=1H_DE-80H_X3
 200.13MHz, d2o
 8 sc
 
 19ns.26.2.2025
##JCAMPDX= 6.0         $$ Bruker NMR JCAMP-DX V2.0
##DATA TYPE= NMR FID
##DATA CLASS= NTUPLES
##ORIGIN= UXNMR, Bruker Analytische Messtechnik GmbH
##OWNER= pz
$$ XWIN-NMR		Version 3.5
$$ Wed May 14 14:29:59 2025 Russian Standard Time (UT+4h)  Yarkov@DPX200
##.OBSERVE FREQUENCY= 200.1313
##.OBSERVE NUCLEUS= ^1H
##.DELAY= (6, 6)
##.ACQUISITION MODE= SIMULTANEOUS
##.ACQUISITION SCHEME= undefined
##.AVERAGES= 8
##.DIGITISER RES= 18
##SPECTROMETER/DATA SYSTEM= spect
##.PULSE SEQUENCE= zg30
##.SOLVENT NAME= CDCl3
##.SHIFT REFERENCE= (INTERNAL, CDCl3, 0, 14.3821)
##AUDIT TRAIL= $$ (NUMBER, WHEN, WHO, WHERE, WHAT)
$$ ##TITLE= Audit trail, XWIN-NMR		Version 3.5
$$ ##JCAMPDX= 5.01
$$ ##ORIGIN= Bruker BioSpin GmbH
$$ ##OWNER= Yarkov
$$ C:/Bruker/XWIN-NMR/data/yarkov2/nmr/H-C/1/audita.txt
$$ ##AUDIT TRAIL=  $$ (NUMBER, WHEN, WHO, WHERE, WHAT)
(   1,<2025-05-14 14:28:08.40 +0400>,<Yarkov>,<DPX200>,
      <created by zg, POWCHK disabled, PULCHK disabled
       configuration hash MD5:
       00 E9 B6 7A A2 85 ED C7 34 08 36 98 17 FE 4E 26
       data hash MD5: 16K
       8D 61 2E F7 BF E3 E2 98 82 B4 07 29 7C 30 C5 8B>)
$$ ##END=
$$ 
$$ hash MD5
$$ A0 BE 30 83 A9 C6 47 DD C9 46 64 1D F6 A9 46 BF
##$RELAX= 
##$RELAX= 
##$RELAX= 
##$RELAX= 
##$RELAX= 
##$RELAX= 
$$ Bruker specific parameters
$$ --------------------------
##$DU= <C:/Bruker/XWIN-NMR>
##$EXPNO= 1
##$NAME= <H-C>
##$PROCNO= 1
##$TYPE= <nmr>
##$USER= <yarkov2>
##$AMP= (0..31)
100 100 100 100 100 100 100 100 100 100 100 100 100 100 100 100 100 100 
100 100 100 100 100 100 100 100 100 100 100 100 100 100 
##$AQSEQ= 0
##$AQ_mod= 1
##$AUNM= <au_zg>
##$AUTOPOS= <>
##$BF1= 200.13
##$BF2= 200.13
##$BF3= 200.13
##$BF4= 200.13
##$BF5= 200.13
##$BF6= 200.13
##$BF7= 200.13
##$BF8= 200.13
##$BYTORDA= 1
##$CFDGTYP= 0
##$CFRGTYP= 5
##$CHEMSTR= <none>
##$CNST= (0..31)
1 1 145 1 1 1 1 1 1 1 1 1 1 1 1 1 1 1 1 1 1 1 1 1 1 1 1 1 1 1 1 1 
##$CPDPRG= <>
##$CPDPRG1= <>
##$CPDPRG2= <>
##$CPDPRG3= <>
##$CPDPRG4= <mlev>
##$CPDPRG5= <mlev>
##$CPDPRG6= <mlev>
##$CPDPRG7= <mlev>
##$CPDPRG8= <mlev>
##$CPDPRGB= <>
##$CPDPRGT= <>
##$D= (0..31)
0 0.7 0 0 0 0 0 0 0 0 0 0.03 0 0 0 0 0 0 0 0 0 0 0 0 0 0 0 0 0 0 0 0 
##$DATE= 1747218487
##$DBL= (0..7)
120 120 120 120 120 120 120 120 
##$DBP= (0..7)
150 150 150 150 150 150 150 150 
##$DBP07= 0
##$DBPNAM0= <>
##$DBPNAM1= <>
##$DBPNAM2= <>
##$DBPNAM3= <>
##$DBPNAM4= <>
##$DBPNAM5= <>
##$DBPNAM6= <>
##$DBPNAM7= <>
##$DBPOAL= (0..7)
0.5 0.5 0.5 0.5 0.5 0.5 0.5 0.5 
##$DBPOFFS= (0..7)
0 0 0 0 0 0 0 0 
##$DE= 6
##$DECBNUC= <off>
##$DECIM= 32
##$DECNUC= <off>
##$DECSTAT= 4
##$DIGMOD= 1
##$DIGTYP= 9
##$DL= (0..7)
0 120 120 120 120 120 120 120 
##$DP= (0..7)
150 150 150 150 150 150 150 150 
##$DP07= 0
##$DPNAME0= <>
##$DPNAME1= <>
##$DPNAME2= <>
##$DPNAME3= <>
##$DPNAME4= <>
##$DPNAME5= <>
##$DPNAME6= <>
##$DPNAME7= <>
##$DPOAL= (0..7)
0.5 0.5 0.5 0.5 0.5 0.5 0.5 0.5 
##$DPOFFS= (0..7)
0 0 0 0 0 0 0 0 
##$DQDMODE= 0
##$DR= 18
##$DS= 0
$$ [...]
##$SUBNAM2= <"">
##$SUBNAM3= <"">
##$SUBNAM4= <"">
##$SUBNAM5= <"">
##$SUBNAM6= <"">
##$SUBNAM7= <"">
##$SUBNAM8= <"">
##$SUBNAM9= <"">
##$SW= 18.0517328524113
##$SWIBOX= (0..15)
0 0 2 0 0 0 0 0 0 0 0 0 0 0 0 0 
##$SW_h= 3612.71676300578
##$TD= 16384
##$TD0= 1
##$TE= 0
##$TE2= 300
##$TE3= 300
##$TEG= 300
##$TL= (0..7)
0 120 120 120 120 120 120 120 
##$TP= (0..7)
150 150 150 150 150 150 150 150 
##$TP07= 0
##$TPNAME0= <>
##$TPNAME1= <>
##$TPNAME2= <>
##$TPNAME3= <>
##$TPNAME4= <>
##$TPNAME5= <>
##$TPNAME6= <>
##$TPNAME7= <>
##$TPOAL= (0..7)
0.5 0.5 0.5 0.5 0.5 0.5 0.5 0.5 
##$TPOFFS= (0..7)
0 0 0 0 0 0 0 0 
##$TUNHIN= 0
##$TUNHOUT= 0
##$TUNXOUT= 0
##$USERA1= <user>
##$USERA2= <user>
##$USERA3= <user>
##$USERA4= <user>
##$USERA5= <user>
##$V9= 5
##$VALIST= <valist>
##$VCLIST= <CCCCCCCCCCCCCCC>
##$VD= 0
##$VDLIST= <DDDDDDDDDDDDDDD>
##$VPLIST= <PPPPPPPPPPPPPPP>
##$VTLIST= <TTTTTTTTTTTTTTT>
##$WBST= 1024
##$WBSW= 4
##$XGAIN= (0..3)
0 0 0 0 
##$XL= 0
##$YL= 0
##$YMAX_a= 58153
##$YMIN_a= -57945
##$ZGOPTNS= <>
##$ZL1= 120
##$ZL2= 120
##$ZL3= 120
##$ZL4= 120
##$ABSF1= 10
##$ABSF2= 0
##$ABSG= 5
##$ABSL= 3
##$ALPHA= 0
##$AQORDER= 0
##$ASSFAC= 0
##$ASSFACI= 0
##$ASSFACX= 0
##$ASSWID= 0
##$AUNMP= <proc_1d>
##$AZFE= 0.1
##$AZFW= 0.1
##$BCFW= 1
##$BC_mod= 2
##$BYTORDP= 1
##$COROFFS= 0
##$CY= 83.5205535888672
##$DATMOD= 1
##$DC= 2
##$DFILT= <>
##$DTYPP= 0
##$F1P= 10.8118882576601
##$F2P= -7.23987719738617
##$FCOR= 0.5
##$FTSIZE= 0
##$FT_mod= 4
##$GAMMA= 1
##$GB= 0.15
##$INTBC= 1
##$INTSCL= 1
##$ISEN= 128
##$LB= 0.25
##$LEV0= 0
##$LPBIN= 0
##$MAXI= 10000
##$MC2= 0
##$MEAN= 0
##$ME_mod= 0
##$MI= 1.114404
##$NCOEF= 0
##$NC_proc= 0
##$NLEV= 6
##$NOISF1= 3.799351
##$NOISF2= 2.8
##$NSP= 1
##$NTH_PI= 0
##$NZP= 0
##$OFFSET= 14.38212
##$PC= 1
##$PHC0= -1350.924
##$PHC1= 10.53375
##$PH_mod= 1
##$PKNL= yes
##$PPARMOD= 0
##$PSCAL= 0
##$PSIGN= 0
##$REVERSE= no
##$SF= 200.129724274929
##$SI= 16384
##$SIGF1= 3
##$SIGF2= 2
##$SINO= 400
##$SIOLD= 16384
##$SREGLST= <1H.CDCl3>
##$SSB= 0
##$STSI= 0
##$STSR= 0
##$SW_p= 3205.1282051282
##$SYMM= 0
##$S_DEV= 0
##$TDeff= 0
##$TDoff= 0
##$TI= <>
##$TILT= no
##$TM1= 0
##$TM2= 0
##$TOPLEV= 0
##$USERP1= <user>
##$USERP2= <user>
##$USERP3= <user>
##$USERP4= <user>
##$USERP5= <user>
##$WDW= 1
##$XDIM= 8192
##$YMAX_p= 0
##$YMIN_p= 0
$$ End of Bruker specific parameters
$$ ---------------------------------
##NTUPLES= NMR FID
##VAR_NAME=  TIME,          FID/REAL,        FID/IMAG
##SYMBOL=    X,             R,               I
##VAR_TYPE=  INDEPENDENT,   DEPENDENT,       DEPENDENT
##VAR_FORM=  AFFN,          ASDF,            ASDF
##VAR_DIM=   8192,          8192,            8192
##UNITS=     SECONDS,       ARBITRARY UNITS, ARBITRARY UNITS
##FACTOR=    0.0002768,     1,               1
##FIRST=     0,             0,               0
##LAST=      2.2672688,     0,               0
##MIN=       0,             -57945,          0
##MAX=       2.2672688,     58153,           0
$$ Real data points
##PAGE= N=1
##DATA TABLE= (X++(R..R)), XYDATA
$$ [...]
792@o6j01L81j23j37J51Q9j00k64j29O12k08l07L91k34l8K48k81K35J5l15qk90
815d79N9N47j99j06M95k02j18J66p0K18L9l20j4l63k2M34m00K9N62l35j48L54
837A27q2M5Q7o2k69j08K89J46k93J60L12l58j72L92j09j5n8k05R5r5J06J69l44
860b42K67L02n24k0N30r3r7J9k79l1J13Q2J27l59K96R4m88L51K69k59N7j11q3
883g9l5j59K25kl2K80O4n84L83L11l20k6J19j77POj33K89k55J08q0k91K94K57
907A70k77q8J26P7J5j29J24K67k98N7j0n6K76J3l16k6J12k70Q9mJ70J14k79PJ26
932a0j34K94J12j95L1J15l52J89J6J09l5k67P0j37o6L10m0l75L92j24k15J12L14
955A14Q7o4j23O5J48j66J38j61J0J09j49k49J74J38j55k9j61R5K32k27J99P4j12
$$ plain form
792 0 -66 -167 214 91 -46 105 194 94 -170 -299 313 105 -202 189 -45 -83 165 -116 119 134 -181 -189 -479
815 -479 -420 127 -72 -178 317 115 -3 163 93 311 350 30 16 -347 -369 65 -335 -306 256 -79 -227 127
837 127 45 90 177 115 -154 -262 27 173 -120 40 352 -6 -178 214 105 90 32 -173 -78 -173 -67 102 -242
860 -242 25 327 -197 -217 313 220 123 142 -137 -168 -55 27 154 -205 91 185 -303 48 317 58 115 4 -79
883 -79 -114 -273 -48 -50 -82 198 262 -322 61 372 52 26 145 -32 -25 -19 -152 137 -118 -10 -90 -381 -87 170
907 170 -107 -195 -69 8 23 -106 18 285 -13 44 34 -22 254 267 -49 -75 37 -233 -144 -148 22 136 -143 -136 -10
932 -10 -144 150 262 67 98 213 -139 50 66 175 140 -127 -57 -194 -260 50 10 -365 27 -97 -312 -200 114
955 114 201 137 14 79 227 61 199 38 48 157 8 -241 -67 71 -84 -113 -274 -179 53 -174 25 99 -13
978a3J84n7k29L95j00P2k30j06P2J2k87L69k36r9K30j55j69L95N6j65P4M9N8m2
1002G8j8J93m8k74K97l27m9L14r1k84L0J20p5P3j23K73O5k28K06j8j44K72j48
1025I4p4p4O2or2j61M22j11k59L13j34m0K31k04n7J19j2p0m8J64J66m07P8L04
1049B04k06M5P2k09mJ60j24l4P7J92j02j76J38J20q4q9O0%m5j35n5L5L17j99M7
1074EQ4j18J99j55r9K58j29m4q7j37J25n5K25l9j94N4L57k63k9O6K1j18J67j98
1098a04J81N8K2k33MO9J63k40q3K84k99oJ85o4J37o8l4R9Q7q8L6N2Nm8j75k2P
1125g5qR9Nk12Q9MJ09lp5J2K16j80L1J78r8l1P5o7J6k5l3j6ko3l4k23K08J05q7
1154h5m1J08N5K9N1n8K45j95m0l2j98J49J12j72O0j9l6q1r5J53J11n3Q5q0p6K37
$$ plain form
978 -13 171 114 -115 280 180 252 22 -84 -12 0 -287 82 -154 -253 -23 -178 -347 48 104 -61 13 62 120 78
1002 78 60 253 205 -69 228 -99 -148 166 75 -209 -179 -59 -134 -61 -184 89 154 -74 132 114 -30 242 94
1025 94 20 -54 8 2 -90 -251 171 60 -199 114 -20 -60 171 -33 -90 29 17 -53 -101 63 229 -178 -100 204
1049 204 -2 43 115 -94 -98 62 -62 -96 -19 173 71 -105 33 153 69 -20 40 40 -5 -140 -195 -160 157 -42 5
1074 5 89 -29 170 15 -84 174 45 1 -86 -223 -98 -153 72 33 -161 -107 250 -13 -42 24 45 -73 94 -104
1098 -104 77 135 157 -76 -72 -3 160 -80 -163 121 -178 -184 1 -63 74 6 -28 71 158 70 106 158 163 115 -60 -82 -75
1125 -75 -83 16 21 -191 -102 -98 11 8 -67 -55 161 -19 12 190 92 61 136 69 85 60 27 11 9 -54 -88 -311 -103 2 -85
1154 -85 -126 -18 37 66 117 59 304 109 69 37 -161 -12 100 -72 -12 -31 -67 -148 -243 -90 21 -32 53 -27 -103 134
1180A34O0k58J91j05J4J9j22J51n7j37q9Qj44L07lj09J88M0j66J27j35J83K4k2
1204I9j37O1j34K87k14j36J62Kj39J22J1K9m6jp0K9O1Q0O5j29K28j55j49J81p5
1229C2qk7q1j1R6j28K11mj37J19m3j01l6J27K2j04j08N9P3n9J37Kr1Q6o2q8K46
1256A22Q9k05lj4J16L0j59L1J10l06J83j83K5J90k5m6J53j11O0m5j5Q8l5j43J33
1281D0j02l0J19j55K01j40q0J63k3k4j7J22j92J38p4O1J86j33p3J5R4j7p8n5M6
1306hQ1k41J24r1J61M7j52J09M7r6M5O7r6J56r9k4l5L9q2rJ1r4J14Kp7l1J01N6
1334B5q8O9K0k9PJ10j39J00q5R8M3l5j23L4j14J06j5p3k6J88q5n0J76m2R5m5n7
1361F5j38J8j8J62j65m2Q3M9r0K9j1J44p7m6N7o6j2J33j55J02J45k01N5r7J34
$$ plain form
1180 134 194 -64 127 22 36 55 -67 84 27 -110 -199 -191 -335 -28 -31 -140 48 88 -78 49 -86 97 121 99
1204 99 -38 23 -111 176 -38 -174 -12 -10 -149 -27 -16 13 -33 -34 -104 -75 -14 66 131 2 230 75 -74 107 32
1229 32 24 -3 -84 -95 1 -127 84 80 -57 62 19 -82 -118 9 31 -73 -181 -122 -49 -108 29 31 -60 26 -36 -124 122
1256 122 211 6 3 -11 105 135 -24 7 117 -189 -6 -189 -164 26 1 -45 108 -3 57 12 -3 85 50 -93 40
1281 40 -62 -92 27 -128 73 -67 -147 16 -7 -31 -48 74 -118 20 -54 7 193 60 -13 2 96 79 1 -54 -8
1306 -8 73 -168 -44 -135 26 73 -79 30 77 -19 26 93 -3 153 54 30 -5 34 -48 -57 -46 -140 -26 -24 -101 -132 -31 25
1334 25 -63 6 26 -3 4 114 -25 75 -10 88 131 96 -27 7 -107 -1 -16 -89 -115 73 -12 -62 114 72 167 122 65
1361 65 -73 -55 -73 89 -76 -118 -35 14 -76 -47 -58 86 9 -37 20 -46 -58 75 -80 22 167 -34 21 -76 58
1386E8J12j66j6j1O0K9ok14J82Q1k35J21O8p0L7j5Op0Lj21K21r9O9K8j33J04K5
1413D8LJ02j82kJ94k23M2N5j47N2L2o8J59k2J1J6j09Mj4P3k8O5M3o1p2J4j0j16
1441a41K6R2l0j2n8J03j5Q5JJ1q8M5K7O9k01J09l0M9p2j7L2k3Mm0J64k06K30n7
1469E7j63J94p9N6Ln4O2Q0j47R6o8j8M1r6p5JP4q2J86j57L4QL7j7J0lm4kL7J01
1499G2p2J0m7M9K3k6k06J18J67k31K13r2r8J74ql0K7P2l4j2j82J61j66J1J76k4
1525D5J5k2J00j30k5j16J13k0J7L4J6q5LQ2Kn0L2lKnK8p1L1N9p0l9O8L5n9J8o2
1556e7O7R6j13krk7Q4r6Q7R9j04M2k6n2M4P7q8j9R9j06j6L7q9O3Nn9m3kJ63k8
1586B7r1R2l6r9M2L8L4K7J7j3q8J49j92M7Lk2J49m9Jj35J20M3m1P8l5Q6j66n4
$$ plain form
1386 58 170 4 -12 -23 37 66 60 -154 28 109 -126 -5 63 -7 30 15 21 -49 -46 -167 54 -45 24 52 -81 23 48
1413 48 51 153 -29 -31 163 -60 -18 37 -110 -58 -26 -94 65 43 54 70 -39 -35 -49 24 -4 61 104 43 -29 -15 -25 -141
1441 -141 -115 -23 -53 -65 -123 -20 -35 50 51 62 -26 19 46 115 -86 23 -7 42 -30 -47 -15 -38 -34 -74 90 -116 114 57
1469 57 -106 88 9 65 68 14 76 156 9 105 37 19 60 -36 -111 -110 -36 -118 68 -89 -55 -47 -10 -27 -17 -20 -64 -66 -29 72
1499 72 0 10 -37 12 35 9 -197 -79 88 -143 70 -22 -120 54 46 16 43 115 81 69 -113 48 -118 -107 69 45
1525 45 60 38 138 8 -17 -133 -20 -40 -23 11 27 -58 -55 27 29 -21 11 8 10 5 33 -38 -7 52 -18 -57 11 46 -13 5 -57
1556 -57 10 106 -7 -9 -18 -45 39 -57 30 129 25 67 41 -11 33 110 22 3 102 -4 -20 17 -72 -9 -4 -63 -106 -108 55 27
1586 27 -64 28 -8 -107 -65 -27 7 34 51 38 -50 99 -93 -46 -43 -65 84 35 36 -99 21 64 23 101 66 152 -14 -68
1614f8L9P0j47J19q3QK2QP2j97J72j03J29l7M5q9N8L1o3J54j42J54k65J40q5k1
1640g9J7P1o5j4O2p2j9L1O1J3k3R6l0l2rJ69k05L9l8j09J38j7m5K7Q6r6mJ2J15
1669H0l0j05Q4k7n4J26j20M4l1L4n4J04j4o1N7K1j29Q8P3K6j28n1O6n8J2J01J8
1696G2k1l8j42J58j53J86j72J35Ko2J73j95J14j37J29j6q9M7nJ31Qj12M5p1k9
1721d2O0m1O9L1k5j59J18r8P2k7J17r1Q8M9j38q2KR4o3M3j5j6Q2o5OM2j27J11
1749em4L8k6Q1k9p1K2N1r0N4J8l9M7l7R3j02P7K4%j0J7m2K6r2J8l8nJ1k8k7J5
1780i3P8K1p0J10k06M5P0l1J2J16j22kp3J63M5p2o0Q5q4R4j27N8k8J25q9L2N3
1807E0PKq6M5j2J99k53J13q0O9j08O3m5J02j03lk8j5J02J7L2Q0j92o1J96j01o0
$$ plain form
1614 -68 -29 41 -106 13 -70 -62 -40 -32 40 -157 15 -88 41 4 49 -40 18 49 -14 140 -2 152 -113 27 -58 -79
1640 -79 -62 9 -56 -70 -8 -80 -99 -68 -7 6 -17 79 49 17 8 177 -28 11 -27 -136 2 -15 -60 -33 53 -43 -47 -35 80
1669 80 50 -55 29 2 -52 74 -46 -2 -33 1 -53 51 37 -24 33 54 -75 13 86 112 -16 -67 -1 -59 -47 54 72
1696 72 51 13 -129 29 -124 62 -110 25 27 -35 138 -57 57 -80 49 33 -56 -9 -14 117 125 13 58 -13 -42
1721 -42 18 -23 46 77 52 -107 11 -87 -15 -42 75 -16 72 121 -17 -99 -97 -3 -66 -23 -38 -54 28 -37 -31 11 -116 -5
1749 -5 -49 -11 -37 44 15 -56 -34 17 -73 -19 -1 -40 7 -30 63 -39 38 62 62 52 69 27 53 -39 -21 -59 -64 -53 -81 -108 -93
1780 -93 -15 6 -64 46 -160 -115 -45 -76 -64 52 -70 -72 -145 18 63 -9 -69 16 -68 26 -101 -43 -71 54 -35 -3 50
1807 50 57 59 -27 18 6 205 -48 65 -15 54 -54 9 -36 66 -37 -40 -68 -83 19 36 68 148 -44 -105 91 -10 -70
1834g0J12n0l4N9j7M1J30k50J32j10N8j7M0Q6p0p9m0P1N5R7k52K7J67J8k63K44
1860H5j44m5K06j43JP2J25j76J73j45M8j92J93l1K0o6m4LJ13J4k0l1j04N9M8j35
1886a16J09O6o6l8j7J00l1J09r6j31J23q5J13j5j83K73o4K8kq6ok7O2q1j7J01
1912B3N4r8nNQ5l3j0o2M6j5K6k6J3P7q7%j9J3o7p9J47J12kr3K6k0j74K01j20j2
1942i4K07k4p8l7KJ08m5p7nL6L4qN1j7q4QN2q2N5m2J40n2j61J09q0Q9J0k6j3K5
1972Aj04R6K1p6J4N7O0k7p1L1m7M8k6R5J17j28M5r9n6j4J5n7R5JJ8j56J26N7j10
2001g4k6J11J9j03N9M7j4r4M2J10r9lj3L1n8R0j61J67p9N5LL7o7J5N5k5m8m8J04
2030C3LJ0j00M9O2k7k2O7j2j05J13j63Q6ljj18R9l8j9J92j04Q2j22k2J2O0JN8
$$ plain form
1834 -70 42 -8 -42 17 0 41 171 -79 53 -57 1 -16 24 110 40 -39 -79 -8 47 144 -108 -81 86 104 -159 85
1860 85 -59 -104 102 -41 -40 32 157 -19 154 9 57 -135 58 27 47 -19 -63 -60 53 67 47 16 -88 -29 19 -116
1886 -116 -7 59 -7 -45 -62 38 7 116 20 -111 12 -73 40 25 -158 115 51 79 77 -9 -15 -42 20 -61 -78 23
1912 23 77 -21 -26 -21 64 31 21 -41 5 -10 16 -10 3 80 -7 -7 -26 -13 -80 -159 -12 100 98 5 31 11 -163 38 -82 -94
1942 -94 113 89 11 -26 -24 84 39 -38 -43 -7 27 19 70 53 -31 -23 29 -53 2 -40 100 48 -113 -4 -84 5 15 -11 -24 1
1972 1 -103 -7 14 -62 -48 9 69 42 -29 2 -45 3 -23 72 189 61 106 7 -49 -63 -48 -105 -10 -9 9 -147 -21 36 -74
2001 -74 -100 11 30 -73 -14 33 19 -75 -33 77 -22 -25 -38 -7 -65 25 -136 31 -48 7 10 47 -20 -5 50 25 -23 -71 33
2030 33 36 46 -54 -5 57 30 8 75 63 -42 71 -92 -6 -9 -10 -128 -29 -67 -86 106 2 84 -38 -60 -48 12 13 71
2058G1j10M6o1K9R1O2j45j24J84K8r2N4o4P5K1m2P7q1k4O1m8k7M3p0Q4l5q2m0
2086a19K28j69J18j17L9O4m8j5J4n1L5M9J05k36J29L6p0J7q1k6O8p4J21l0Q2l5
2112C4n1N5M0m0M1j24M9k6j4n6J43M8j08m5K4J2nO1K4r1l3P4P9L3j85M7r3J40
2140C3l7j26J02R6j15Q4r3J39j15LQ1m7o8P5qj0M7k7J4p3r3J77k3o8J0K8J19q2
2168B3j13J86p5J9j02K10j25q2J3L3Ol4J19j53J3J11n3n6J22L9j53J22k1l6K6
2193C9j31J70o2Q9p7l4qk2Q6L5Mj87J3J8J32K3j05M9p7O7k0R0j90J45l5Kp9P8
2221A3K9m6J30Jp9l8j1J4n5LJ35k4n4K2Pl2k4L4N7o6O7k7j30Q4k9J1m5J5M4M5
2251E1J9n9m4M4j27J91ql9o0j8P4K2J1r7J04l4J5k6j09L2J16j03J19j71lJ28o2
$$ plain form
2058 71 -39 7 -54 -25 66 128 -17 -141 43 71 -21 33 -31 44 65 23 100 19 -5 56 8 -19 24 -46 38 3 -79 -119
2086 -119 109 -60 58 -59 -20 44 -4 -19 -5 -56 -21 28 133 -103 26 62 -8 9 -72 -98 -30 -104 17 -13 69 34
2112 34 -17 38 78 38 79 -45 4 -22 -36 -92 51 99 -9 -54 -30 -18 -23 38 62 -29 -62 12 91 124 -61 -14 -107 33
2140 33 -4 -130 -28 68 -47 37 -56 83 -32 -29 52 5 -63 12 4 -6 41 14 28 -45 -138 39 16 -52 -42 -14 105 23
2168 23 -90 96 21 40 -62 148 23 -59 -46 -13 -7 -41 78 -75 -62 49 -4 -60 62 101 -52 70 49 13 39
2193 39 -92 78 16 105 28 -6 -14 -36 50 85 89 -98 -85 -67 65 88 -17 32 -45 22 2 92 -98 47 12 14 -65 13
2221 13 42 -4 126 127 48 10 -1 13 -42 -39 96 72 18 40 47 15 -9 25 82 16 83 56 -74 10 -19 -8 -53 -38 6 51
2251 51 70 11 -33 11 -116 75 67 28 -32 -50 24 46 57 -40 64 30 45 19 -90 -58 58 -45 74 -97 -100 28 -34
2278c4J04m4p0P9m3l6P8j04M2NL7M1p3Q7p9l2J39j51R6oj09rJ31Lj29j1J00l1
2306a9m4J27m9j07J01L3o1K4K8k1n9K5k8K6P0O8j25J03q3J10r6K9l1J06j01Nq6
2333e5P5j7l5L9l9j7m3J18m9n4J12o5LM0j09LJ14l0O0q3K7j4j0n8N5R1J5p7L0
2362B7L1k5O4p8j26M6J31q3M3j11J13O0k3j34J68o0j54J51j13M9k1J66j54J1l3
2387e5M6l1N1k4j09J93K6j13kN0j6J3Nl0p0R9L7l7JM4J9j58J19o4p9J26j30J22
2415C3m9mJ04j65M8J1pm7P8k9on0j2K28o0j25J10r5n1L1Q1q5Q3j5l9J9O6J3r8
2444c2O1p0Q2j5j9P7q2m5k2N5O5l5n7R9o8M2P6j81J1J13J1r0P3P5j94O9o3L5M2
2473A3j2n2L7PL7l3M4p5K4Q2p9MK5Q4j63J14j6p5P4o0m0R5Kk0L1n0KO0r5O5L5
$$ plain form
2278 -34 70 26 -44 35 -8 -44 34 -70 -28 -23 14 55 -18 69 -10 -42 97 -54 42 36 -73 -82 49 52 -77 -88 12 -19
2306 -19 -63 64 15 -92 9 42 -19 5 33 12 -47 -22 -50 -24 46 114 -11 92 9 119 23 52 21 127 26 31 -55
2333 -55 20 3 -32 7 -32 -49 -92 26 -23 -77 35 -30 -27 13 -96 -93 21 -9 51 -32 -5 -19 -29 -87 -32 59 74 -3 27
2362 27 58 33 97 19 -107 -61 70 -13 30 -81 32 92 69 -65 103 43 -111 40 -73 -24 -45 121 -33 -22 -55
2387 -55 -9 -40 11 -13 -122 71 97 -16 -18 32 16 29 34 4 -66 33 70 33 34 78 97 -61 58 -6 -85 41 -89 33
2415 33 -16 -20 84 -81 -33 -22 -29 -76 2 -27 -33 -83 -95 133 73 -52 58 -37 -88 -57 24 -61 22 7 -32 -13 53 66 -32
2444 -32 29 -41 41 26 7 84 2 -43 -65 -10 55 20 -37 62 -6 36 112 -69 -58 55 66 -24 49 124 -70 -1 -64 -29 13
2473 13 1 -51 -14 -7 30 -3 41 -34 -10 72 -7 -3 22 106 -57 57 41 -34 40 -20 -60 35 37 17 48 -2 0 60 -35 30 65
2504F5M6K7j62L4L0q7j2J25j26pN8r0P9o9N4P7r4J0R8O6m2j77J32n5J07o2J3m2
2532dnQ1pq4rj3N2o4%M2Q3m7PPr9j9o7J17K9J5k0k7K1K4Nlkj08J43o1L4L0k4l0
2566cP3j91R3L5j4J1n0R0J1P4q1j2r8K5L9pl1J6Q7n5J0L9m6j40L3J71j73J25N7
2595H8r8L8l0M6j04N7l7P8j20J67q8p7K5K1KJ2R1j51J10j10N6m7J75r6N7j69L2
2622g2K2M2K7J0m5J07p5l4o0Q7kn3L9J03o6j04l5M8M2j20J15J53p1n9Mj5L0L9
2650E7p1J20j48l6L4j8k6m3J18m1M1L0m5J18n2oK0m7j10O6pN1j09R6J1r5O5O8
2678D1j02p1R7k2O0n1m2J42j07m3J08k%K5r6N9J12j4p4J4K8q4O7J5K7L9j39Q3
2706G0ro9l2M0k2R4ml9L3m5Q4n8p4k6J87j06J46r6n7m1N8k5m0M9j13K1J24q5K9
$$ plain form
2504 65 111 138 -24 10 40 -47 -59 66 -60 -67 -9 -99 -20 -89 -35 42 -52 -42 56 122 80 -97 35 -20 87 25 38 -4
2532 -4 -9 72 65 -19 -28 -41 11 -53 -53 -11 72 25 32 39 -60 -79 -146 -29 0 15 -5 -32 -11 13 18 15 13 -95 48 -13 21 51 27 -3
2566 -3 70 -121 -28 7 -7 4 -46 44 55 129 48 36 -62 -37 2 -5 -36 -20 67 12 22 61 15 -125 -92 79 -94 31 88
2595 88 -10 28 -2 44 -60 -3 -40 38 -82 85 -3 -80 -55 -34 -32 -20 71 -80 30 -80 -24 -71 104 8 65 -104 -72
2622 -72 -50 -8 19 29 -16 91 16 -18 -78 9 7 -46 -7 96 30 -74 -109 -61 -19 -139 -24 129 58 -1 3 -12 18 57
2650 57 -14 106 -42 -78 -44 -62 -88 -131 -13 -54 -13 17 -28 90 38 32 52 5 -105 -39 -46 5 -104 -8 3 -92 -27 41
2678 41 -61 -132 -35 -57 3 -48 -90 52 -55 -98 10 8 8 33 -63 -4 108 94 20 34 62 -22 45 60 87 126 -13 70
2706 70 61 -8 -40 0 -22 72 68 29 62 17 101 43 -31 -57 130 24 170 74 17 -24 34 9 -31 18 -95 -74 50 -35 -6
2735fM2Km3m3M9k1J31o4N2p6R3k21J03O1m0L2j15Q9m6j09R1P2nj6M3K5ok01J53
2764B6j06P0L4j61J42l6O2n5J33m6j31O4l1L9L3k1l0PO0J0Q0q8q8PO6k2rl9N7
2793B7N1j26R5q4N1j96K15m0o2J13O2l1j04M1q7O9O6kM1j01pq5J82j45J6k3M9
2820a5O6q3L3l9L3Ll4k6P9j9J8j0Nn1J06J7M2r8N9j65kQR2O1J7j97O0O7j76j1
2850a60J62QP2j02j5M8kmm6Q1M9J2j02M8n0N6n6J09j94n8J86p8J20J4j31J06q3
2877a0N3L3n8m1Q1k30J44P2l8J53j77r5M2k5J55r5P8P6n2q6O6j2n2M3j39J83N4
2904A23n6L6j01m4P5P4k8m3j42Q8Q9M9k29J06rR0q7Q4j19JK2q6J50n2l1j4J06
2931E2o7M3j35R2K1j05k4J19l0m4J65r3J5j08N6J8J2lRN6k7N7j17P3l0M0p6O8
$$ plain form
2735 -6 36 38 -5 -48 1 -20 111 47 99 23 116 -105 -2 59 19 51 -64 25 -21 -130 -39 33 28 12 55 80 74 -127 26
2764 26 -80 -10 24 -137 5 -31 31 -24 109 63 -68 -4 -35 4 37 16 -14 -7 53 63 143 55 -33 -26 40 18 9 -30 27
2793 27 78 -48 47 -37 14 -182 33 -7 -69 44 106 75 -29 12 -75 -6 60 58 99 -2 -9 -94 88 -57 -41 -64 -15
2820 -15 51 -32 1 -38 -5 -2 -36 -62 17 -2 16 6 11 -40 66 83 125 27 86 -79 -81 -73 19 80 97 -100 -40 27 -149 -160
2850 -160 2 10 82 -20 -35 13 11 7 -39 42 91 103 1 49 -1 55 -1 108 -86 -144 42 -36 84 98 -33 73 -10
2877 -10 43 76 18 -23 58 -172 -28 44 6 159 -18 -113 -71 -96 59 -36 42 118 66 -20 46 34 -18 25 -114 69 123
2904 123 67 103 2 -42 33 107 79 36 -106 -18 71 120 -109 -3 -12 78 -9 75 -44 -43 -21 -107 43 -9 -40 -54 52
2931 52 -15 28 -107 -15 6 -99 -123 -4 -34 -78 87 -6 9 -99 -43 -25 -13 -16 -7 49 22 79 -38 35 5 45 -31 37
2959C7j02J00n7R4j67J35J4ML2J5j00J3M3j63J48o6J11n5j3J14p9n7l4K9l3j7
2985e4M8mKJ37p3l7M2j75Q8k3n0K00j53Q2k9Q0k1r6R0q6N9j40l7J67r2N0O2k9
3013Hn1J06k4m8J5j7M3r1M8LM7n1M2k0l8l4J10K1q6p8N9L0O8m6m6Q1r4M9l4M9
3043B1M4k5l8j04J18J01j22r3J23p4P8j30Q5J17rr7k5jJ22j7l0L9j14Q4j37R3
3069IJ3M0k2j12J16j78P8KJ78j51Q3L4j52K02j41q2M7O8j16P8J4o7J02Q4j62j9
3095e4J9k3L4l6Q9m3O7o0P2j22K03j41N2j16J23p9p5P4Jk8L2n0J17j45J15n7N0
3122A9QM5q9J17q3j09Q8J37n9l5o2q1Q3K10j00o3K3k0p4P5J2j15lJ19j1J23j72
3149a7O7o7j8Qk1p2K00k31J60l7J4K2l0J33j05M3o1J32j53l5O3P3r2M0J4qn8Q4
$$ plain form
2959 37 -65 35 -22 72 -95 40 54 58 90 105 5 18 61 -102 46 -20 91 36 23 137 58 1 -33 -4 -37 -54
2985 -54 -6 -10 -8 129 56 19 61 -114 -26 -49 -99 101 -52 30 1 81 60 -36 54 -32 27 -113 -150 17 -75 -25 37 8
3013 8 -43 63 39 -9 6 -11 32 -59 -11 -8 39 -12 30 10 -28 -62 48 69 -17 -95 -36 -6 62 16 -30 51 -43 6 -28 21
3043 21 65 40 2 -102 16 117 -5 -98 25 -49 29 -101 -16 101 92 -5 -30 -31 91 74 44 83 -31 53 -84 9
3069 9 22 62 40 -72 44 -134 -56 -54 124 -27 56 90 -62 140 -1 -83 -36 32 -84 -6 8 -59 43 127 -35 -54
3095 -54 -35 -58 -24 -60 29 -14 53 -7 65 -57 146 5 57 -59 64 -15 -90 -16 -15 -43 -11 -61 56 -89 26 -31 19
3122 19 27 72 -17 100 17 -92 -4 133 74 39 -23 -104 -21 189 89 26 49 29 -45 30 42 -73 -76 43 32 155 -17
3149 -17 50 -17 -35 -27 -48 -120 80 -151 9 -28 -14 8 -22 111 6 49 -12 120 -33 -68 -5 68 -24 16 30 22 -36 48
3177D8rj12R8j9n4k5N5m3J2O9j08PL3k1R7Jl7K2p6n6J23j31K8Q5n3M5rj5mJ22
3207G3n2j06N8J02k6r5QK5O6p1R5j63Q4o7J01j21J0J25m8o3O6M4Jm2JR3j40Pj6
3236e1o7lN3J55j42n3j8P5J2J24q2o2J06Kk4j20R4J32p2J2o7j35O8O6Nj03J32
3263C7m2o2J12j21R6J3pj59K07j02K1M8j59K26M3k54J22L9j72K70j52j0P2J6j40
3288e8Q8J8m5p1N2PN5p1O6P6n5o5m2J17m6L0Nq9j5pm9J46l0J6O1q1J6n7J9N5R
3319E5K7r4l1N8J9R9j06O5p4k4P6J2k5j7O0o1l0j2Ml7k0K9n5N5L2j25KO9R6mj18
3350g5M6j45J54q3L6M2p4Q8r7L9Q3p9J40n5r1j8k8P3NQ1p5M7k6o8Q9m8l8J24p3
3379b6N0P5j30R8p2J11j44j14J85ML5n4nj1j8rK5j0K3Q3l3k15J07Q2NOq7R4q2
$$ plain form
3177 48 39 -73 25 6 -48 -73 -18 -61 -49 20 -88 -81 -48 -69 28 29 -8 14 -62 -118 5 -126 -98 -13 -66 -21 -30 -45 -49 73
3207 73 21 -85 -27 75 49 -46 -38 -13 53 -18 77 -86 -2 -69 32 -89 -79 46 -2 -65 1 45 46 4 5 98 -42 -35 -51
3236 -51 -118 -121 -68 87 -55 -108 -126 -51 -39 85 3 -59 47 49 25 -95 -1 131 59 71 4 -131 -63 3 8 -95 37
3263 37 -5 -67 45 -76 20 33 26 -133 74 -28 -7 41 -118 108 151 -103 19 58 -114 156 4 -6 66 82 -58
3288 -58 30 48 3 -68 -16 -9 46 -25 41 117 62 -3 -45 72 26 56 61 -28 -43 -50 -99 47 17 33 94 13 29 -28 -9 46 55
3319 55 82 -12 -43 15 34 133 27 92 18 -6 70 82 57 40 100 39 9 -3 1 -36 -56 -27 -82 -27 5 -120 -118 -49 47 43 -75
3350 -75 -29 -174 -20 -103 -67 -25 -99 -11 -108 -69 14 -65 75 20 -71 -89 -117 -44 -39 42 -33 14 -12 -80 9 -39 -77 47 -26
3379 -26 24 99 -31 67 -5 106 -38 -152 33 37 72 18 13 2 -16 -25 0 -10 13 96 63 -152 -45 37 42 48 -39 55 -27
3408b7O5J0j11Q9mp3J19j34L3o4Q1L3K1k4k8r6K63j91n9R4K1j23J35Mo7l1R6R9
3436A31l10J15P6L7p8L6n6L3Ol0m4O9J22p4q1P2o4J2R0r3Mn3J14l9k2N5Q7j72
3464e7l0J13n4l7K9rL5N2J04j4r7j71J90q9K0o3J36j4r0N3j0m8J46j79J57Rq3
3491aJ05j06l3M0K8j15J48j35J11o2L2p7J38j23Q7o5M8Mo3J20J6r2m8k9R2R3j23
3518a0k3Q2mO3j14NQ4l2l9l5qn6J59l2j38mJ19r0J57j25O9j8NM1q7q8K38j06l4
3547b1n2j09J85P8r2O0p1J21m2jQ4j46L0PL6j35P7O7q8l7K2N7m8K9p7N1OM9l2
3576HP7j79J24j42J13P2M4j80mN8j37K65o7j10M0l3O3j4r5N9p4J20m3O0L8j17
3602e4K8m0L2n5J43r5L4m6N6q1L3pJ7pP6r0P2p3R1j05J04j9K9L3n2j5RJ10j64
$$ plain form
3408 -27 38 48 -63 26 22 -51 68 -66 -33 -97 -16 17 38 14 -14 -110 153 -38 -97 -3 18 -105 30 34 -33 -64 32 131
3436 131 -179 -64 12 49 -29 7 -49 -16 -10 -40 -84 -15 107 33 -48 24 -40 -28 62 -31 -27 -80 34 -5 -27 28 115 -57
3464 -57 -87 26 -28 -65 -36 -45 -10 42 146 132 35 -136 54 -35 -15 -78 58 44 -46 7 -3 -51 95 -84 73 82 -1
3491 -1 104 -2 -35 5 33 -82 66 -69 42 -20 12 -65 73 -50 37 -28 20 24 -39 81 97 5 -43 -72 20 113 -10
3518 -10 -33 49 45 108 -6 -1 83 51 12 -23 -31 -87 72 40 -98 -102 17 -73 84 -41 28 10 15 56 -31 -119 119 13 -21
3547 -21 -73 -182 3 81 -11 49 -22 99 57 56 140 -6 24 31 67 -68 9 76 -12 -49 -27 30 -18 11 -66 -15 -9 40 8
3576 8 85 -94 30 -112 1 73 117 -63 -67 -9 -146 119 52 -58 -18 -51 12 -2 -97 -38 -112 8 -35 25 63 -54
3602 -54 -26 -66 -34 -89 54 -41 -7 -53 3 -78 -45 -52 -35 -42 34 -56 16 -57 34 -71 33 14 43 76 24 9 18 128 -36
3631c6jQ8l2o5jJ3R8L0j37L1J7l7k6J9l6L8n4J62j2q8k9O5m8j05J90j54J67j21
3659f4L1P0r9Q0M3o8J8O4j07O9j17J5J13J16j77m4P3M2j3P0j65P5mOj03J38Rj31
3687f0J48p6o7q6J98r3J03o6N3j89Q1K5OK0j2j25J7J04R9r5N6q7K6J03q4M8o8
3714b1J6J01p7N9j05Q2m3Q8n4o8n5k5N3N2M9o9m7M1L3P3o8k2N7m8r6k4O2P4J8
3743C6m9L9l0M9o2N6j02p2Q3Q1j6oo1M6k3J6P9O0j1j11o0J49o6n6MK7K4q9R6n3
3773b2m6qo5J24L2L8k1j4J1j1j55J72Lp9O5K2m3n1M9l3NR4r1m2JJ15j00K34j82
3802BJ6j06J4KJ25K9k25J76p5N0L0K6q1mL7K7rJ5q7K5j6k0L0O9o7L9l5Nl3J24
3832H3m4N6%j17Q1j26J14p0K3L3J8r2N2M0m8Q5j51O4M4p1J09LnM1k06M9Q5o1J7
$$ plain form
3631 -36 -37 51 19 -46 -47 -34 64 94 -43 -12 5 -32 -58 -39 -75 -37 -91 71 59 -29 -58 7 -41 -146 44 -110 57 -64
3659 -64 -33 37 -62 18 61 -7 11 75 -32 37 -80 -65 48 164 -13 -57 16 58 45 115 -50 25 21 27 -76 62 71 -60
3687 -60 88 12 -55 -141 57 -36 67 1 54 -135 -54 -29 -23 -3 -15 -140 -123 -19 80 -15 41 -46 -20 83 -1 47 -21
3714 -21 -5 96 19 78 -27 55 12 100 46 -22 -77 -102 -49 3 52 -17 -64 -23 10 83 15 -7 50 2 -94 -118 -56 18 36
3743 36 -13 26 -4 45 -17 39 -63 -135 -52 29 13 7 -54 -8 -31 -15 64 124 113 2 -58 91 25 -31 -27 0 24 -65 31 -22
3773 -22 -68 -76 -141 -17 15 53 32 18 29 18 -137 35 38 -41 24 46 3 -48 1 -32 -27 67 -24 -66 -65 50 -50 184 2
3802 2 18 -88 -74 -72 53 82 -143 33 -42 8 38 64 -17 -21 16 43 34 49 -38 -13 -29 -49 -19 50 -17 22 -13 -8 -41 83
3832 83 39 95 95 -22 59 -67 47 -23 0 33 51 -41 11 51 3 88 -63 1 45 -26 83 86 81 122 -84 -35 50 -11 6
3861Fj4n7K9J02p9j16J04j0m0Q3k4n9J16K8mQ1j54k3R0k5ol2J14p4k8j38K00j13
3889d3M8N3j90O8mJ49j5j45%Q3J6j11R5n2K9O1p3o7J9J31q9j6P5p1k7K8P0k5J7
3918A4kJ4Jm5J47k25J27j8qJ6J1n2l8rP3Q2p0j1j3j3P1r0O9K7m6j03M8K1j1k5
3948e8j3N6j9J5J2LK4o8J47j10or3Q6P4J2n9J14q4N9m6m8j01J09l4K3M8o1p7J12
3977A7J5Q4l4j0j20J1k5K4n8L3m2J51Nj64K20j22r8M8P5j04Q9m7m2J5J9nPP2L0
4006D4L2j05p0p8J24J64j10l8L2j20J33j33J03Q6k0p5J24q4J92j81j22J09m3k9
4030f5K0N3j2n2J03k5n8l6j2P2Mj09N8J39p1RLO6j46K8L2kj7L4j06L6J4M8j0O
4060Dj61R6J71l6o3L4qj04J46n6q3M2m7J36j2m1l7L4J37k57R0J5j6j28M9O2M5
$$ plain form
3861 6 -8 -65 -36 66 -13 -129 -25 -35 -75 8 -16 -75 41 69 65 146 -8 -31 59 34 28 -4 110 36 8 -130 70 -43
3889 -43 5 58 -132 -64 -68 81 66 -79 -79 4 20 -91 4 -48 -19 42 -31 -98 -79 52 -37 -53 22 -49 -76 -48 22 -3 14
3918 14 12 26 27 -18 129 -96 31 13 5 21 32 -20 -58 -67 6 88 18 7 -6 -19 52 -38 31 58 12 -91 -43 -22 -33 -58
3948 -58 -71 -15 -34 -19 -7 -4 20 -48 99 -11 -17 -110 -24 50 62 3 117 33 92 46 -2 -103 6 -28 -5 43 -18 -95 17
3977 17 32 116 82 72 -48 -37 -62 -38 -96 -63 -105 46 51 -113 107 -15 -113 -65 10 -94 -5 -52 -94 -79 -60 -65 -58 14 44
4006 44 76 -29 -99 -177 -53 111 1 -37 -5 -125 8 -125 -22 64 44 -31 93 9 201 20 -102 7 -36 -65
4030 -65 -45 8 -4 -56 47 22 -36 -72 -84 -12 -8 -117 -59 80 9 18 21 87 -59 -31 1 -1 -18 16 -90 -54 -40 8 -2 4
4060 4 -157 -61 110 74 11 45 37 -67 79 23 -60 -18 -65 71 59 18 -19 15 152 -105 -15 0 -16 -144 -95 -33 12
4087A2lr1K51p0j13%J1K7o3m7J14J9p0J37j37N0q2M3lp9M6J09m0L6J27k35O3n8
4115d6Q8p4Q3n1n5K04j50q7J15k2JmJ64j28Lm7k0N9n6J45j13o2L9Q1o6j11P7J
4143c2j2K5L4P1j1j52O3k9j44J63P5j03M5O0r0J11o1n0o1q7K43m1j15M4m6J05
4169EJnJN2K4m0n0kJ19r4mj9O3j1p9P9rl9J04p2%Q0j77J04l2lQ3j17J04o7l0R1
4201F0m4j25J02k2k7J04N8l8j41j0l1R2L0l4j6j7RrL9J4n3lj7J28k0J6j42K14
4229A17j72Q0no3J61j95L3P0o2O3lj51J64L0k25L5K02j53J42j62O2J92j76N7o
4254C5l5O7r5Or1J72o7j15K22nj27nN5QL4o7M1n0NM1j3pP3m6Q4j21O4Jk2j4n1
4285b3j3J6L8m0o7K5J33j1j62J34jO8n8k1j21Q0R3n3N2o8M4Op0j6l6k9J64j01
$$ plain form
4087 12 9 -82 169 99 -14 -14 -3 24 -39 -86 28 47 -23 114 -23 27 -55 -12 -15 -94 -48 61 21 57 184 -51 12 -46
4115 -46 42 -32 51 0 -55 149 -1 -88 27 5 6 2 166 38 41 -6 -26 33 -23 122 9 -53 -14 67 1 -110 -33 -32
4143 -32 -44 -19 15 86 75 -77 -14 -43 -187 -24 51 -52 -7 53 -37 74 13 -37 -98 -185 58 17 -98 -54 -100 5
4169 5 6 1 2 54 78 38 -12 -14 105 11 7 -12 51 40 -39 40 31 -8 96 24 24 104 -73 31 -1 -4 79 -38 66 -1 -31 60
4201 60 16 -109 -7 -29 -56 48 106 68 -73 -83 -114 -22 8 -26 -42 -59 -50 -59 -20 -6 -59 -62 -79 49 29 45 -97 117
4229 117 -55 25 20 -43 118 -77 -44 26 -36 27 24 -127 37 67 -158 -123 79 -74 68 -94 -32 160 -16 41 35
4254 35 0 67 -28 -22 -113 59 -8 -123 99 94 -33 -38 17 25 59 -8 33 -17 -12 29 16 9 82 36 120 -1 63 64 42 28 -23
4285 -23 -36 -20 18 -22 -89 -64 69 58 -104 30 29 97 39 18 -103 -23 70 17 69 1 45 51 -19 -35 -71 -100 64 -37
4313c7j9N2oj2K2p1K9RJJ29j79k5J32P8j27O1J1r7J57j15l2k4L7jpL6O1p5j35
4342a47K93n5j19q0J43j6Oq1QJ01pq9N9k9K8Qm8kL5n0L8M5j19J48n6l2k5p1K4
4371i0N4J40n8J03j71L1m1J03j32mJ04K2j4QM5r2km5%k3N8J7L1J7Jj9l5J65j80
4400gJ9j9J8P1j50P8N5j54J03R5k03J95m8j63K49j09k0p1J11o1L0m5l0n5R9r6
4426a08O4K6K8k9l4K9M2j5LRL7j5m8N9k1r6o3J05j15J58o3J62k6j95J17n0N2k3
4454a0n5J38j58Q1M1M5p6j22J55m7O1O1l1j15j6n5PP7J22r3J0o7L9n7L8Q7j2j2
4482C6j12P7K0j77K78k10J15p3l1P3P5j37K4oJ57Lj63J69k74J99Mj04O3j6Q8j9
4508E9q9NQ9r5J1J7j23J25RP3j42N1K1R1p5o0N0ok6r9P7N9Jj2Jj31M9Q7l4O6n0
$$ plain form
4313 -37 -56 -4 -10 -22 0 -71 -42 -33 -32 97 -82 -107 25 103 -24 37 48 -49 108 -7 -39 -63 -26 -27 -34 2 63 -12 -147
4342 -147 146 91 -28 -108 35 19 25 -56 -48 53 46 -43 16 -13 15 23 -25 -27 8 -42 -4 41 -78 70 14 -18 -43 -114 -90
4371 -90 -36 104 46 149 -22 9 -32 71 -61 -65 39 61 47 55 100 8 6 -39 -39 -62 -4 13 44 61 62 43 8 173 -7
4400 -7 12 -7 11 82 -68 10 65 -89 14 109 -94 101 53 -110 139 30 10 -61 50 -11 19 -26 -56 -111 -12 -108
4426 -108 -44 -18 10 -19 -53 -24 18 3 6 15 52 37 -11 48 27 -69 -132 -27 -142 16 -47 115 89 -106 11 -39 13 -10
4454 -10 -65 73 -85 -4 37 82 6 -116 39 -8 53 114 83 -32 -48 -103 -96 -19 103 10 20 -47 -8 -65 -27 60 48 36
4482 36 -76 1 21 -156 122 -88 27 -46 -77 -4 71 -66 -42 -48 109 112 -51 118 -156 43 47 -57 6 -10 78 59
4508 59 -30 -25 64 -31 -20 -3 -126 -1 8 81 -61 -10 11 102 27 -33 17 11 -15 -114 -37 22 23 11 12 -119 -70 17 -17 49 -1
4539al6L4j1m1O0NO6n6O6n4J6M7r8J3l9Qj21J66N2o1O3Ol8j4n4P5j22J04q6N7
4569Fo0J7K7N3J2l2L6m8ok0N3j23K5P1P1j12jr6J04N0q3J24n9%J3J6L5l9j9P6
4599I1j2q9M9k3qN9Q1k4j35L9Q4n6j71O4n0O3M5Jn0KJ07j68P5r9K51j87J56j77
4627h2P3O7M4j46J22k2j76Q8k7J04j40J75k9j26K4J37p2kK3m2O3O1j51J22j66
4652g8J18N2q7p4O5n6j04K01j49P9J7M0%o2o1N9M7l3rP8j13l1J85o0Nj7n2O8j15
4681h7Q0K9n1kJ7n0R9P3j08M3j04M8O8o3n6K4M1jL8K5j9m7j38Q6O8PoM8j33j01
4711a72J82k0j3K9k4M2m8K7j5l3p4J15M9j56J68j91P0N9l5J0J24q0M5o6LN7j24
4738g1O5p5J43n9K9n0j00O1P5o0P7r2rL6J25m6Qj34M8J08rr4k5P6j52J44J3q5
$$ plain form
4539 -1 -37 -3 -14 -55 5 10 76 20 86 32 48 95 -3 10 -29 -21 -142 24 76 15 78 84 46 32 -22 53 -69 35 -51 6
4569 6 -54 -37 -10 43 55 23 59 11 5 -15 38 -85 -60 11 82 -30 -31 -127 -23 27 -56 68 9 9 22 38 73 34 15 91
4599 91 79 -10 39 16 8 67 148 124 -11 28 112 56 -115 -51 -101 -38 7 8 -42 -40 67 -101 -26 -125 126 -61 95 -82
4627 -82 -9 58 102 -44 78 56 -120 -32 -59 45 -95 80 51 -75 -51 86 14 12 35 -7 56 117 -34 88 -78
4652 -78 40 92 5 -69 -4 -60 -164 37 -112 -33 -16 24 24 -38 -99 -40 7 -26 -35 43 -70 -101 84 24 29 12 -40 28 -87
4681 -87 -7 22 -29 -31 -14 -64 35 108 0 43 -61 -13 55 -8 -64 -40 1 0 38 63 44 -3 -141 -55 13 20 14 62 -71 -172
4711 -172 10 -10 -23 6 -18 24 -24 3 -12 -45 -119 -4 45 -111 57 -134 -64 -5 -40 -30 94 14 59 -7 -4 53 -71
4738 -71 -6 -81 62 3 32 -18 -118 -57 18 -42 35 -57 -66 -30 95 49 57 -77 -29 79 70 -24 -49 27 -125 19 32 -53
4766e3J14j21r9J34M8K5j85R8J68j51n8J09J06j12J06r8J16k14J15j0q5R7M1k05
4790a14J51J5j0n9%Q1j9j06Q6n2m4J23Kj11nP7p4N1N6o6j4L9m5J45j20j07J29
4817IN5l2m7O4m6PL1j09Q1j6R0m3jp4P1m3j13N8J1Kj7R8m0n0Q6o9J09k0p5Q5n4
4848HJ12m3rpM9j48lJ50j59Q1Q3j48K5J7np8K4N3pM1j82K10l3P7j19k3jK4m8M8
4878a1r5R7Q0k5J9o8j7R6n6J09j55K3k0PN1j34J28P0nn2o3k3L9q5N3J10mm1M0
4907F8n7K3L2q6J0q3J70n5j09Q6j1K1rl7O7%j2r2O5L4j25J53J1J8p1P8j16r6J49
4936B6n9Q7j38J57M8j16RN6q1k1l0o8J20R7n2k7Jm9M6o9J51J3j07j02P9M8n4L0
4964eq5M8J7QJ8R1j24k3pQ3k1Q6o8N1j42J79q5r5M8qo1R1K4MK8%j67J70qn5LP1
$$ plain form
4766 -53 61 -60 -159 -25 23 48 -137 -39 129 -22 -80 29 135 23 129 31 147 -67 48 38 -47 50 91 -114
4790 -114 37 52 42 -17 -17 64 45 -61 25 -27 -71 52 54 -57 -62 15 -59 -8 48 -18 -32 7 -38 107 -13 -120 9
4817 9 64 32 -15 49 3 10 41 -68 13 -3 87 44 43 -31 40 -3 -116 -58 -47 -45 -62 36 -4 -54 32 -37 72 52 -23 62 8
4848 8 120 77 68 61 110 -38 -41 109 -50 31 114 -34 -9 8 3 -75 -51 2 -5 36 -146 64 31 108 -11 -34 -35 -11 -59 -11
4878 -11 -106 -9 71 46 65 -3 -20 76 20 129 -26 -3 -23 -16 35 -99 29 99 94 42 -21 -44 -5 -90 -37 73 69 28 68
4907 68 11 34 66 -20 -10 -93 77 22 -87 -1 -12 9 0 -37 30 30 18 -74 -9 25 -100 53 64 82 11 89 -27 -123 26
4936 26 -33 54 -84 73 121 5 14 70 -11 -32 -62 -130 -10 87 35 8 9 -40 6 -63 88 101 -6 -108 -29 19 -35 -5
4964 -5 -90 -42 -25 -17 1 92 -32 -55 -62 21 0 86 18 69 -73 106 21 -74 -26 -34 -95 -4 20 24 52 52 -115 55 47 -8 -5 66
4996F6k4j2r6J23k2n1Q8l0q3L4K0J2p2l5J40j43J19p3l8P9p1O0O9n3m1l1l5J16
5024A6O9p0j6l1L0o4J59j07K2J8k3l9q5J06N0J08j73o0R7o9M0J85k76O8J60p8
5050C7o7qj22J70j8Q1j34Qn9J53j2j5l9Q4j15p2J29J04n5m7M6l1o8l7M5N6p5r9
5078a60O5M8N4o4Rl9O0Q1k8or6J71j43L2J6N1l1j54J38lL9o5M8J32n4j34j6O0
5106A1Ol5N3j36Q6J6K1p9P1m5K1p8J76j07J8L2j9l1J3p6L9k9L3M0n9M6J3oJ6r2
5136h1K9O6l0p9K2O8l6R3j56J30m6m7J42p3k6N4mL7r5L0J6j62L32k07K4M9q7R6
5164E9j05P9q1J11j15RP0L5j00O0n0K0K5k3J5m4R0j04J1L7J8M3o5M6L5Oj5r9j6
5193d8J19p1j4j12J47J25r1j3n5O1Nn5POP4j10L9m7K2j25L04k31J01j90J22K5
$$ plain form
4996 66 42 30 -66 57 35 -16 72 42 -41 -7 13 25 -47 -82 58 -85 34 -39 -77 2 -69 -9 60 7 -34 -65 -100 16
5024 16 85 15 -1 -32 -2 -66 93 -14 8 26 3 -36 -121 -15 35 143 -30 -90 7 -62 -22 163 -113 -45 115 37
5050 37 -30 -38 -160 10 -8 73 -61 -53 -112 41 29 14 -25 59 -56 -128 1 105 50 3 49 18 -50 -87 -42 14 -61 -160
5078 -160 -95 -47 7 -57 -48 -87 -27 54 26 20 -76 95 -48 -16 0 51 20 -134 4 1 40 -25 23 155 101 -33 -49 11
5106 11 17 -18 35 -101 -15 1 22 -57 14 -31 -10 -88 88 -19 -1 31 12 -19 -6 -82 -43 -72 -39 1 -58 -12 1 -5 11 -81
5136 -81 -52 14 -16 -95 -73 -5 -41 52 -104 26 -20 -67 75 2 -24 30 26 63 -32 -2 14 -148 184 -23 1 50 -37 59
5164 59 -46 33 -48 63 -52 -43 27 62 -38 22 -28 -8 17 -6 9 -35 55 -49 -38 -1 17 60 -5 41 76 82 67 -32 -48
5193 -48 71 0 -14 -126 21 146 55 42 -13 48 53 -2 5 11 85 -25 14 -33 -11 -136 168 -63 38 -152 -30 -5
5219ej22L3J34o6p9P7j1kN1Q6k8k7L9q7k8M8j2J62j63q2J00Pk9J2J8p4J45o9l3
5248ej26J96j04j3qO7L2n0L0q5R0J9j22P8o0J50j25l0K6J49j6j63J56j44J7l0
5274g1qR7%j5j8R5K0p3KROj02J18j06l0N6K1pM5ML4k37J24q5J19nk6K6j5L8n6
5305d0M8j47K19j36rk1N6J40j57O5k8K1JJ0rn6M1m3KJ28j14J4r3J23M7k2K2J3
5333G5Mj15M7P2k34J86o4L6p4j2N1Q8J1o1k5l7kL5n3O1L3L0J39j03n7M1j03p4
5361a05J33L3o4K8o8N9J15j35M0K3J5M0o0j35J37j35P0K9J30j40o4K1J11j15l6
5386g3P8k2l7N3r3J43j21q9J75j0p0R5q6J33K4j58J87k58J45O1p7J7n5N7l2L9
5412B6k6l8J05j33J89j13j11O3l1L3J31k1q3LJ21k11Q5j18K63k5L1j70RK8k9L7
$$ plain form
5219 -5 -127 -94 40 -26 -105 -28 -39 -41 10 96 68 41 80 -7 -35 13 1 163 0 -82 18 25 -4 8 26 -48 97 28 -5
5248 -5 -131 65 -39 -52 -60 7 39 -11 19 -66 24 43 -79 -1 -61 89 -36 -66 -40 109 93 -70 86 -58 -41 -71
5274 -71 -79 18 18 3 -15 80 100 27 29 38 44 -58 60 -46 -76 -20 1 -6 39 43 77 -160 -36 -121 -2 -7 -33 -7 -22 16 -40
5305 -40 8 -139 80 -56 -65 -86 -30 110 -47 18 -10 11 12 22 13 -43 -2 -45 -43 85 -29 -15 -108 15 62 40 62 75
5333 75 79 -36 11 83 -151 35 -29 7 -67 -79 -28 60 71 10 -15 -52 -54 -19 -72 -11 22 52 191 88 31 72 -31 -105
5361 -105 28 61 -3 25 -43 16 131 -4 36 59 74 114 54 -81 56 -79 -9 20 150 10 -54 -33 78 -37 -73
5386 -73 5 -17 -54 -1 -94 49 -72 -161 14 4 -66 29 -57 76 100 -58 129 -129 16 77 0 17 -38 19 -13 26
5412 26 0 -38 67 -66 123 10 -101 -38 -69 -36 95 74 -9 -6 115 -96 -11 -129 134 109 140 -30 -21 7 -22 15
5438A5M9J17l10N3P0q1J56j06P5m0k7j7K01j56J4J4j8k2Q3l6k8P4l2j13K41r9
5464G7r5N7m2j12J21nn0J68j18P8o9o0RL8o9N8j5KO5No8OJ03j03MM7M2j4o2m3
5494d5j5NJ05j29J12J47k11m6R2j4P2m5j35J00Q6nj23L4k34K21K9O1p8Q3Kj31
5520f2O6n7okM8O2J4n4n7M7m7N1O6q8r6J34K2M4q7J6j11Q2N5j22P8J05l6j10o
5549e1L6l0qJ40j04r3P5K7n9K41j63M0j52J06q8O9Nl2L2N3P6j96N3P3p1K7pOm1
5578c6K05j46k3JoL6N1o2n2J67j36L9r3N3nL6p8J45m3n0m5M5P7l7q5N7l8m3Ko
5608g0J6k0J44oRj19Q0q8R4m6j17K25l8r6J7q6K8J13j11O6p5O2n7L9P6J21k10
5635d9K3k0L6R0j34J67l2j47l3J35OM7j25R4r9O3k0J2J5ol4j9R6r4J0jJ25j85
$$ plain form
5438 15 64 181 -129 -76 -6 -87 69 -37 38 -2 -29 -46 155 -1 13 27 9 -13 70 34 6 80 48 -65 176 77
5464 77 -18 39 -3 -115 6 1 -49 119 1 79 10 -50 -41 -3 -72 -14 -29 -27 38 43 -25 -19 84 -19 -15 32 74 60 -2 -45
5494 -45 -60 -55 50 -79 33 180 -31 -77 15 1 73 28 -107 -7 79 74 -49 -15 -249 -28 1 62 -16 67 69 -62
5520 -62 4 -53 -59 -61 -13 49 63 9 -48 -1 -48 3 69 -19 -115 19 41 85 -2 14 -97 -15 40 -82 -4 101 65 -45 -51
5549 -51 -15 -45 -53 87 -17 -110 -35 -8 -67 174 11 51 -101 5 -83 -14 -9 -41 -9 44 120 -76 -23 50 -21 6 -1 5 -36
5578 -36 169 23 0 1 -5 31 82 20 -32 135 -1 38 -55 -2 -7 29 -49 96 53 3 -42 3 80 43 -42 15 -23 -66 -64 -70
5608 -70 -54 -74 70 64 73 -46 34 -54 40 -6 -123 102 64 -32 -15 -101 -73 40 -71 -5 -80 -18 -75 -36 40 161 -49
5635 -49 -26 -46 -10 80 -54 113 81 -66 -99 36 42 89 -36 58 -41 22 2 14 29 23 -11 -30 66 -28 -18 -19 106 -79
5663g9J83K3r6R9j24k0P5K8j49N1l8J12r6P4J5o8rnQ7m4M4l4o8RjK5k7Q4j4q1
5693d4J9J38j82R1m6n5J36m2R3j33N3j15J89j12M8p3K9Jk2P6r9R7p3J10j59L4
5719d1J70j54R6p2p8Q5p2P9j35j0O2J21kr1mJ62r2K7L6j44PK9j12J33O7p3L7K4
5747E5p1KK8Q9o7j22Q9kP6j34M6M3J7J1j60J70j29o4J21J04k7j41M6Q7l2J05j69
5774b9m1J26j10J84j41K9P8k7N3o4o7ll3m8j8J35o7Lm0K8J94j36J7j3J4k2l9J4
5802b3J1K3j10jR1MN1k2J8n7k7J29j55N7P9k0j0q6J23l3r8P8o0N8o1J33m4O1k29
5831a20M8%J13n2P3p8j09N4R5m6P7j36M6k1L8l7k2N1O4j10N1L6oj16J30J3q2m8
5859i4O8j7J21k37J61l0P1k0j2O7j23J10J7o2j08J83J7k99J60L2o7Q8k9P6k6l9
$$ plain form
5663 -79 104 127 31 130 6 -14 61 89 -60 -9 -47 65 -31 43 58 -10 -19 -24 63 19 63 29 -39 -30 -31 -6 -33 51 37 -44
5693 -44 -25 113 -69 22 -24 -79 57 15 108 -25 28 -87 102 -10 38 -35 -6 -5 -27 49 -50 47 -26 84 -75 -41
5719 -41 129 -25 71 -1 -79 6 -66 13 -122 -132 -70 51 49 -42 -46 116 24 51 87 -57 -50 -21 -133 0 67 -6 31 55
5747 55 -16 -14 14 103 36 -86 3 1 77 -57 -11 32 49 60 -100 70 -59 -123 -2 102 75 -66 -20 67 35 140 -29
5774 -29 -70 56 -54 130 -11 18 96 69 122 58 -9 -12 -45 -93 -111 24 -43 -40 -80 -52 142 6 23 10 24 2 -37 -23
5802 -23 -12 11 -99 -100 -9 -5 46 24 42 -15 -42 87 -68 -11 68 48 38 -48 75 42 -56 22 -38 20 -41 92 48 109 -120
5831 -120 -72 -72 41 -11 62 -16 -125 -71 24 -22 55 -81 -35 -56 -18 -55 -77 -26 38 -72 -21 15 9 -107 23 36 -46 -94
5859 -94 -26 -43 78 -159 2 -28 43 23 11 78 -45 65 82 20 -88 95 112 -187 -27 5 -62 26 -3 73 47 8
5885HM7pq0P0l2p1L8Mo8J04r2P2l8J3%R0L6j20K3k6m8J33j6j0k2m5R5J6j43Q6
5915A7rM2n8L6K2j03%L2l0j3O4N4j84J01K3Q9o4l0O2j98R0J42o1r3K7K3O4q7P0
5944B8r8J41r6L0J4kj8pn0RK9kJ43n1r5L7kj8QL4n0K9j7m1K2J15l6j07j2P1k3
5975a5O0o2j16J10p4R5K3j9lO8p7j6N2l0m7J2J3j5j4J05l9k0R0j44M7N4j37P2
6003b7R6j25J69j76O0Pn6Q4q3J01r4p4P1K3k3L8oM5K6j62k4Q1l0R8P8r8ol2J18
6032G9p7R2q0j5J8jk9K0k8p0Q7p8N8q6J55l9J16q0j2j3l3M6l4j8j2Q1j99K48j08
6061a2qNj3O7oK0O3j86O4J1K4k5k1o8J10N4j09QQ7j04L9N9j23J22jm2m6M4rk9
6091b5R2j18J47j66L9o8J01O3j40J67q1O2j52m2O1J74j72mnJ45j14Q5m5p5K5J08
$$ plain form
5885 8 55 48 -32 38 6 -65 -27 -23 -91 13 -79 -7 -45 -32 -32 58 94 -26 -3 -29 -77 56 40 30 8 -37 58 74 -69 17
5915 17 8 50 -8 28 50 -53 -53 -21 -51 -64 0 54 -130 -29 -6 83 19 -11 51 -147 -57 85 24 -69 -42 -19 45 -42 28
5944 28 -70 71 -25 5 19 17 -1 -8 -58 -49 -20 -22 121 70 -25 12 10 -8 0 34 -16 13 -4 -45 -23 92 56 -51 -63 8 -15
5975 -15 45 -17 -133 -23 -97 -2 21 2 -1 67 -10 -26 26 -4 -51 -39 -26 -41 -55 50 11 -9 81 -63 -16 38 -99 -27
6003 -27 69 -56 113 -63 -3 4 -52 32 -51 50 -44 -118 -47 -24 -47 -9 -15 30 56 -106 -130 -49 -79 19 97 -1 -7 -39 79
6032 79 2 94 14 -1 17 16 -13 7 -21 -91 -4 -82 -24 -110 45 6 122 42 30 17 -16 30 -4 -22 -34 47 -152 96 -12
6061 -12 -20 -15 -28 39 33 53 116 -70 -6 5 29 4 -17 -85 25 79 -30 -22 65 -39 0 59 -64 58 57 15 -31 13 4 -25
6091 -25 67 -51 96 -70 -31 -99 2 65 -75 92 11 73 -79 -121 -60 114 -58 -62 -67 78 -36 49 4 -71 -46 62
6117F2l4j5p1O6j05N2K1L2q1J36k5N6j08mj3N6r9R9j11k8J88q4L4j48%J66j18
6144g6R7p5k6L6L6K3K6k28J99k5k4J71k03J19l8mJ2J16n9j00L7J8J50k74R3k0
6170a9k5M8J7p6M7om4J28q1lqJ51j36J6j43L7J07O1K2q4J53j35L1m5l3K2M7r0
6198d1Q6o0R5j80J09L0L5m6l1L0n4m4O9j0Q2k8L4q7R8q2j14J93r0L1j0M8j10%
6226d7k4MJ20Rj42J0L4l3J0M6m1O6l6O6q7o5J30l0nK5k3O8m6j29K28o7l1l4J34
6255A10j12jm4QJ4K5j10J33m8k0PK8j3P2L8k10R1K0j16J34l1Q2l3l0r5J11L4O5
6283A09j77J36Rq7Q2j1j21P7L4j16Q3q0Q5n1P1o2Qm8N1m2J12o0j4J4M1r2P9j02
6311g2J62r7K3k4j03M1R6o4m6J42j20J1N3l2J4j0M8l4o7J28l1j12J61J3Pm9J14
$$ plain form
6117 62 28 13 -58 8 -97 -45 -24 8 -73 63 38 94 -14 -18 -31 25 -74 25 -86 -114 74 -10 24 -124 -124 42 -76
6144 -76 21 -54 -80 -44 -8 15 41 -187 12 -13 -37 134 -69 50 12 8 20 136 77 -23 14 32 182 -92 1 -19
6170 -19 -44 4 21 -55 -8 -14 -58 70 -11 -14 -22 129 -7 9 -134 -97 10 71 93 9 162 27 58 13 -20 2 49 -41
6198 -41 45 -15 80 -100 9 39 74 28 -3 27 -27 -71 -2 -12 70 42 76 -11 87 5 -109 84 -6 25 15 63 -47 -47
6226 -47 -71 -67 53 62 -80 -70 -36 -69 -59 -13 -54 12 -24 42 -45 -110 20 -10 -15 10 -13 55 9 -120 108 41 10 -24 110
6255 110 -2 -3 -47 -39 -25 0 -110 23 -25 -45 -38 -10 -23 49 87 -123 -32 -12 -128 6 -25 57 24 -6 -101 10 44 109
6283 109 -68 68 77 -10 72 61 -60 17 51 -65 18 -62 23 -28 43 -19 -11 -59 -8 -50 62 2 -12 2 43 -49 30 -72
6311 -72 90 -7 16 -8 -111 -70 26 -38 -84 58 -62 -51 2 -30 -16 -26 22 -12 -79 49 18 -94 67 80 87 38 152
6338A52l4j23K7j47J39K3n3N0j65K07l9n1k8l1J74m7Pp8J4%N2J7j02n9J06O6r2
6365a5o4O2J06J6r4P8p9N6r3rJ7L7j4Qj10J55ro2l5J20n1m6M3O7p5j16J12O2p4
6394gK1k9q4N3J05l2n8r4R2m1J50m9o9K1j5R8Kr0L0K4k2J19j03P5j52J1lN8o9
6423e8J84j09r8J7QR1pl6J17o4k0K5p2Q6j05j2J23l1n0k0O0n1k8PJ9j39J50Ql9
6452d4m9qK7J30pk9k4o3J61k04J70m2nq4J58jo4n1l0m7P0R3j19J56j16O6j01J09
6480E2m1l5O3j06J82j30oo6N9K3o9O4O8j11j3M5M3km1oJ77q2p2K1qk8M6l4L4n8
6510c1N5K7l3N8k2q4r8J34l6l5J44j42j9L5k6j0J02J7J00k4q3n6O7k4j8N1q4K7
6538hmk4j1L8J5j20Q1J07l7k7L9N4j40R4J45j85l6J10j01r2R3K7J7p8o4K8N7O6
$$ plain form
6338 152 118 -5 22 -125 14 37 -16 34 -131 76 37 -14 -42 -73 101 54 61 -17 -3 -3 49 66 -36 -95 11 77 -15
6365 -15 -79 -17 89 105 11 89 10 66 -27 -36 -19 18 4 12 -98 57 48 -14 -49 71 20 -26 17 84 9 -107 5 67 -7
6394 -7 14 -15 -99 -46 59 27 -31 -125 -33 -74 76 27 -42 -21 -36 62 64 -26 4 28 6 125 22 97 -55 -44 -47 11 -58
6423 -58 126 17 -81 -64 -56 35 28 -8 109 45 25 50 -22 64 -41 -53 70 39 -11 -31 29 -22 -50 -43 -24 -163 -13 -5 -44
6452 -44 -93 -101 -74 56 49 20 -4 -67 94 -110 60 18 13 -71 87 86 22 -29 -59 -106 -36 57 -62 94 -22 44 -57 52
6480 52 11 -24 39 -67 115 -15 -21 -87 -28 -5 -74 -10 58 -53 -66 -21 22 20 -21 -27 150 68 -4 17 9 -19 27 -7 27 -31
6510 -31 24 51 18 76 54 -30 -128 6 -30 -65 79 -63 -82 -47 -73 -83 19 36 136 112 29 -27 40 16 -2 49 -35 -8
6538 -8 -12 -36 -47 -9 6 -114 -33 74 37 10 49 103 -37 57 202 17 -19 91 -10 -102 -9 18 35 -43 -107 -79 -22 44
6566D4j43J39kJ9l3k2N5oj20J12r8j23J37mJ9P2j25O5l3J22o4J2o5P3j3J02j78
6593e8P6n2oP6p0j2l0Q7l5J17j78J76j8J0p4j22QL8Qk3K5O3K4qj62J11Po1P6m3
6623e0L9Q9l9P9j35O2l0k0K5qJ8j5j60O0J34n8O1p6p6LnJ6J13l0r2J6P8ko2M1
6653b4K3m2j05J67J0j71J46jR4j88J45k7%K0j43M8J7N5k9qK9lkO2q0p3J56m6m9
6682a9J03j80J24Q9m1k2n9K6p4N3m2J20j48n3M9J54j17Pl6k5pk1OJ89k09J10O
6709a7Q1Nk1j38M6o7Q5J04q7K4j3Kn0N6L8K1q7j5jL4j29O0J24K2l1j56JM3J7N7
6739Hj08MJ60m3l0n0R5L6m2N2j23l9J66qj12kr3J57r4J15k6o6N5k9p5L8M0rO9
6768D6n8J20m0k1j5o4J04o7K0n0o5J43n8pp9J23qj10J25j8n2N0J00n3j9q9nn3
$$ plain form
6566 44 -99 40 38 57 24 2 57 51 -69 43 -55 -178 -41 -45 -26 46 -79 -14 -47 75 11 23 -42 31 18 120 -58
6593 -58 18 -34 -40 36 -34 -46 -76 11 -24 93 -85 91 73 83 9 -113 -105 -67 -59 -82 -57 6 30 22 -140 -29 -22 -83 -7 -50
6623 -50 -11 78 39 118 -17 45 15 -5 20 12 30 15 -145 -85 49 -9 52 -24 -100 -97 -102 -86 27 -3 -95 -79 -1 -3 -65 -24
6653 -24 -1 -43 -148 19 29 -142 4 3 97 -91 54 27 27 47 -96 -48 -31 24 -5 -13 16 13 11 73 -7 -80 76 30 -19
6682 -19 84 -96 28 117 76 54 -5 21 -53 0 -42 78 -70 -123 -74 80 -37 -30 -66 -91 -98 -119 -113 76 -133 -23 -17
6709 -17 64 69 48 -90 -44 -111 -26 78 -9 15 2 4 -46 10 48 69 -18 -33 -34 0 -129 -69 55 77 46 -110 -109 -66 -49 8
6739 8 -100 -96 64 21 -9 -59 36 72 30 82 -41 -80 86 78 -34 -36 -129 28 -66 49 23 -43 12 -17 -92 -54 -14 -23 46
6768 46 -12 108 68 47 32 -32 72 5 25 -25 -90 53 -5 -12 -91 32 24 -86 39 21 -31 19 119 66 47 -42 -47 -100
6796a00K37j39Lj4K0R3q6J16j43l0Q7K8l5j00J60n3J5j08J6J04j78J81j05Qn2
6821g5L5k5k6J13J0l4l9N3l5m8P7jlm3%J29p2m0q6N7jM2n9M9R5r2Q8j12M6K1N4
6852G8j57J25p6P9m3O9L1q8o8oP2q5j07P0Q1l6jjR6M4j85R0n0J19L5j47R1m9J19
6881A00j51O4J8Q3n3k8J4l4M9j38J8J33j07J36r5m5j1P6k9K1J4L9j12L1l7lk3
6908g0N7K0j2N0J3j09J34j30R1j12M3L5J4K0p8K5K1n2J9K5M9nr2J39l6L7k9n6
6936A1L2mJ06j72M5l4Nj9N0q3N4j01J29k8O4r6L9N4J0j16j31J66p8J41K9Rp9M3
6964D6L0m8l2o8P4m0J85k06M9M1m0m3O7J1P6r6Kj00L2Rm4J52m0j39R4K5N6M0m5
6993D8m3j15J16J9j7K6J10j72k2J27rp1%r3J75l1k1r5L2O8N3r7J80m8q1j11P8
$$ plain form
6796 -100 137 -2 1 -13 7 100 14 130 -13 -43 44 72 37 -63 97 44 59 -49 -33 71 -107 74 -31 -23 -75
6821 -75 -40 -65 -91 22 32 -2 -41 12 -23 -71 6 5 2 -41 -41 88 16 -24 -110 -53 -54 -12 -71 -22 73 -19 69 -43 3 24 78
6852 78 -79 46 -30 49 6 75 106 18 -50 -56 16 -69 -176 -106 -25 -61 -62 -63 33 77 -108 -18 -68 51 86 -61 30 -19 100
6881 100 -51 13 31 114 61 33 47 13 62 -76 -58 75 -32 104 9 -36 -47 29 0 21 35 74 -38 -7 -44 -47 -70
6908 -70 -13 7 -5 45 58 -51 83 -47 44 -68 -25 10 24 44 -34 -9 12 -40 -21 4 53 48 -44 95 59 96 67 11
6936 11 43 39 145 -27 18 -16 -11 -30 20 -63 -9 -110 19 -9 55 -41 -2 52 62 -54 -185 -19 -97 44 73 82 3 46
6964 46 76 28 -4 -72 2 -38 147 -59 -10 31 -9 -52 15 26 102 6 8 -92 -60 -51 -95 57 17 -122 -28 -3 53 93 48
6993 48 5 -110 6 25 8 34 144 -28 -50 77 68 -3 -3 -96 79 48 27 -68 -36 32 85 -12 168 120 39 -72 6
7020Fm1J10mk7Rn3j21P9J2N9L2j30P8k1J50j19J5n5J74j29l2J9l6J52k17J11r6
7047g5J61r3L9J9j04j1Q3k0o6L0K4Q8q4L1jM3N5r3L0l3r2J00n1L1pl8M2P0L7p9
7077C6l0k8j5J13j24J24j62J26j1kj4PM4l3j8j95J59J16j06r9Q4J6l6R5j5p9j
7104d8R5j15lJ70j48L8K6j10PQ6K2K0k9n0k1j1OJ15PK6m4q3N7P6r1jj04P2J02
7133F7j30M2j01J20J39j18k4m0R6p3K5Q8m6j08j3R1j7N9p0N8p5o2P3p5L3N3j1
7160a9j22J17N7o2l2j3nQ2J9j1k2O9p5n0N3M1J7j12M8n4J12l8l1l2M6pO1M0m4
7189C3j7j06L7K1%J5P2l4J1j82J42O8j60Q9k4j05K06j62J53n2l1M8K0P7p7k5m9
7216c2J47j77kJ37l5m2j3O9J1j2j16rN0J67j16m0O0m6J1P4n7K8Mmj24N2nPj08
$$ plain form
7020 6 -35 75 71 44 53 0 -121 -42 -30 29 61 -69 9 -12 138 19 34 -21 153 24 -8 11 -25 127 -90 21 -75
7047 -75 86 -7 32 51 -53 -64 19 -1 -67 -37 -13 75 -9 22 21 64 119 26 56 23 -69 31 -20 11 4 -34 8 78 115 36
7077 36 6 -22 -37 76 -48 76 -86 40 29 27 13 20 64 31 13 -182 -23 93 -13 -112 -28 -12 -48 47 32 -47 -48
7104 -48 47 -68 -71 99 -49 -11 15 -95 -88 -2 20 40 11 -39 -60 -71 -65 50 57 83 39 -44 13 89 -2 -3 -107 -35 67
7133 67 -63 -21 -122 -2 137 19 -5 -45 51 -22 3 91 45 -63 -76 15 -2 57 -13 45 -30 -92 -19 -94 -61 -8 -19
7160 -19 -141 -24 33 -29 -61 -74 -79 3 22 11 -11 58 -17 -67 -14 27 44 -68 -20 -74 38 0 -31 -63 -17 -24 37 77 33
7189 33 16 -90 -53 -32 -32 -17 55 21 32 -150 -8 60 -100 -11 -35 -140 66 -96 57 5 -26 22 42 119 42 17 -32
7216 -32 115 -62 -64 73 38 -4 -17 52 63 51 -65 -74 -24 143 27 -13 47 1 12 86 29 57 61 57 -67 -15 -20 -13 -121
7245a21J14M5n3j9j7J2M2j27J09J75j95n1J11J4m1M4j4r2K3NN1Nn1l6Q8Q3j19
7272a5J29k0k9p8P3j30P3joo1M0Q7k8j28k5P3O7n2N1m7m9P3k3j6M1R4l1j94M2
7301i0J51j1mj69J61j76N8P8k5J04q8P2N9k6j77O6Po4O9q0J24k6q1J18o2k6N4
7328A6n4J51o4j16N7k4n9R0j2J4P0l4p6K2j6KM8J9jq5nQ7Jkp2J22N5n6n5K8r0
7359c9J7j15J30P3p6l0j0L0m5J01n7n2M8K9om9j5p8J71p6JJ9n1p6J71m8RJ49j75
7388e0j5J08O8J9j81J4J3N0j12J98n9j14N6K1kon3K18k49J53k5r1N1q1J26N4j17
7415fk0Rq9J10l9p8R8N6q2J3R1j71L1j2k1N0K6J12k1p8n3N8J9O4j04j2m1M5J04
7444E9p6l0pk6K20j93p0O2J63j84R9j09P4mO1k8M2j14m5J73N8j07L3k8LO2j64
$$ plain form
7245 -121 -7 38 -15 -34 -51 -39 3 -124 -15 160 -35 -86 25 39 -2 42 28 -64 -41 -36 15 20 -31 -67 21 104 -15
7272 -15 114 94 65 -13 60 -70 3 2 -4 -65 -25 62 34 -94 -119 -46 21 -31 20 -27 -76 -3 -26 -42 -1 93 62 -132 -90
7301 -90 61 50 46 -123 38 -138 -80 -2 -27 77 -11 61 120 94 -83 -17 -10 -74 -5 -85 39 13 -68 50 -12 -38 16
7328 16 -38 113 49 -67 -10 -34 -93 -3 -15 -1 69 35 -41 -19 -35 -33 15 34 33 -52 -57 30 31 29 -43 79 134 78 23 51 -39
7359 -39 -22 -137 -7 66 -10 -40 -50 -20 -65 36 -21 -73 -25 4 -2 -51 -66 -144 27 -49 -48 -29 -80 -156 15 -33 -24 125 -50
7388 -50 -65 43 111 130 -51 -37 -24 26 -86 112 53 -61 -5 16 14 8 -45 173 -76 77 52 -39 12 -69 57 111 -6
7415 -6 -26 -17 -106 4 -35 -113 -15 41 -41 -28 63 -108 -77 -89 -110 -60 -34 78 57 -21 -74 -16 3 67 -37 -49 -90 -45 59
7444 59 -17 -47 -54 -80 140 -53 -123 -61 102 -82 17 -92 -18 -22 39 11 53 -61 -106 67 125 18 51 23 26 88 -76
7471g6J08N0j44n8K17j19L5R4q6L8j49J06P0r7k7m3J03Q6p2r0J34j35J7J32j03
7496ik1l4j37K02j72J84n0J50j71R7K6r7m0Pl5O9j6O0J6j14M1J04p6o1M6L1r7
7523i7J84j39K7J16m3n4Nk7P6j30M4P8o3l4M4K7r8K0L1O4q7J12q7J1Pm2J05j55
7551a05K2J05L2OK8p9l5P7r8Q8Jj3n1k4J10j35J07o6j13J50n4K8K8Q7j02R7j6
7578G5j15L5J7M3j1p5J02k18Q6J13l1n7K1n8R3N2nk0q4O4j33J57m6l5M7J08k02
7605g7J43j2j2j3mm9O7r0j8J73o6p8R8j05o5M0R0M3K7o7m0k0K8Qn5k8N6lNM1n2
7636c5R0ql2m3N2R0j15QK0L5j08K5k2J11j29M1J37j43L5P3q3M2l7OL9r1O6m5k5
7665d6p0Q8O2q1J67j98rQJ38j39R2j6l4Q9n6L3q2J82j11j3Q4l2n3N2%l1M6p4m6
$$ plain form
7471 -76 32 82 -62 -120 97 -22 13 107 21 59 -90 16 86 -11 -38 -81 22 108 36 -54 80 -55 -38 94 -9
7496 -9 -30 -64 -201 1 -171 13 -37 113 -58 39 65 -32 -72 -65 -100 -31 -47 13 29 -85 -44 60 -16 -77 -31 0 -97
7523 -97 87 -52 -25 91 48 -6 -1 -28 48 -82 -38 40 -23 -57 -13 14 -84 -64 -33 31 -56 56 -31 -20 -13 -55 50 -105
7551 -105 -83 22 54 60 88 9 -26 51 -47 41 42 29 -22 -46 64 -71 36 -30 -143 7 -47 -19 9 96 -6 91 75
7578 75 -40 -5 12 55 44 -31 71 -147 -61 52 21 -36 -15 -73 20 72 67 47 -37 27 -106 51 5 -30 17 125 -77
7605 -77 66 54 42 29 25 -24 43 -47 -65 108 42 -36 62 -43 -108 -68 22 65 92 25 -15 -35 -7 1 -54 -82 -26 -29 -24 17 -35
7636 -35 55 47 15 -28 24 114 -1 7 27 62 -46 -21 -43 68 -61 -20 117 -26 9 82 -1 41 4 10 49 -42 24 -21 -46
7665 -46 -116 -28 34 -47 120 -78 -87 -79 59 -80 12 -4 -38 51 -5 28 -54 128 17 4 88 56 3 55 55 24 70 -4 -50
7694e0J03J1j83J41K8j2ko5P3l3J8j13M3J49r4J17rj29l5r5K45j51J4Q0J7J0l7
7721D1P9j13P8j75J40J0k7M4o7m9M6P9nj31R3l7Q8M4J2k45kJ28J1Q6j76J11j80
7748a17J04j21J68j29K05r5n4O8q8N0J3L4M1j33lQ5lJj48P5o2J3P5oL7L3o1K9
7776A1J02o8n1l3N6jk2Q0l8k7m0l1Oj4J00m0n8J28n6P0j64O4n9N6J0m1J26l2J9
7805E3n9j39K62K2k24J09j8j6M7P1j78J47k7q5J20r2R5j2j2j32J25r5kQ8J04j78
7831b6K7M4j61mJ54Pr2j2J24p8J04j40Q3j3j5R8j43j7k8J02p8R2Nj20J56q7N7
7858C9J23j88Q0N8j82j6k0R2n9K34r1p7K9K0JK9q7J7o7J9Q6m4r3J05m6L4l7J54
7886A13p8m5N2j20N9O0p5j1M2J13p4n4L2mL9l7L9k0J1q7J30nr5PN8M2n6k1J2l8
$$ plain form
7694 -50 53 64 -119 22 50 38 36 -29 44 11 29 -84 -41 108 14 131 122 -7 -42 -137 108 -43 -29 51 68 78 41
7721 41 120 7 85 -90 50 60 33 77 10 -39 7 86 81 -50 43 6 94 138 150 -95 -97 31 42 128 -48 63 -117
7748 -117 -13 -134 34 -95 110 15 -39 29 -59 -9 4 38 79 -54 -57 28 25 26 -122 -47 -109 -96 -21 -27 10 43 -18 11
7776 11 113 45 -6 -39 17 16 -6 74 36 9 -31 -62 -56 -70 30 -10 -68 60 4 74 -90 -26 -85 -29 -19 -60 66 34 53
7805 53 -6 -145 117 139 -85 24 6 -10 37 108 -70 77 50 -35 85 -7 88 76 64 -68 57 -38 -40 48 152 -26
7831 -26 1 45 -116 -120 34 41 -51 -63 61 -17 87 -53 30 17 2 100 -43 -60 -88 14 -64 28 33 -87 69 -18 39
7858 39 162 -26 54 112 -70 -86 -106 -14 -73 161 70 -7 22 42 43 72 -15 2 -65 -46 40 -4 -97 8 -38 -4 -41 113
7886 113 35 -10 42 -78 -19 41 -34 -45 -3 110 36 -18 14 10 49 12 51 31 42 -45 85 80 -15 -8 50 92 36 15 27 -11
7916a1P5p1J12q6J02j23m4J33j60P8n5L3K5p0J4M6K9m4N6q5M9M0j18P1r3R7l8
7943c8Q3N7j13NJ8L1j0N9j54J7J07k2r5L6l1Q2j23J07q7R9oj53Q0k4LR5N0n4o3
7972d4k0N4Ol9O5K4j09P6K6q9N3km0O4%k0J9R4j42M4J0m2P2l2m2k5Q0j8No1P9
8003D6j39J02L3j38J28K6n5L4o9k7p1R7j6L5M8M4j60M4K7P7n5r8Q3n5J51j36K6
8030a8k7R4RJ3n9l8p6J33j2k4l8P0j06K5K03j55qp2J64Mj04O3k5j6K2j32K0K13
8058A23j89k4M1K8O1J62j59j7p8m6O1J56l2l4j6qR3r5N1q7j9j0R9j60K7R0n4l4
8086g0J09k4j56Q6K1J2K2j2l4R4j0l9J09p5j58J35R6Kq7nq3J14n9RP0m6r4Q9q8
8115g2L2p4J24J0M0K9n5Kl3J37k99O6J19r0J7J21j09l1L0k2%k7J11M0m4r2rK4
$$ plain form
7916 -11 64 -7 105 19 121 -2 -46 87 -73 5 -50 -17 8 -62 -48 -2 27 -17 39 -46 3 43 -75 -4 -97 0 -38
7943 -38 45 102 -11 -6 12 43 33 92 -62 -45 62 40 -55 -19 -50 32 -91 16 -71 28 22 -131 -51 -75 -72 23 73 19 -44
7972 -44 -64 -10 -4 -43 22 46 -63 13 39 -50 3 1 -39 25 25 5 24 118 -24 20 30 -12 60 28 -14 -39 41 23 28 -33 46
8003 46 -93 9 42 -96 32 58 3 37 -32 -59 -130 -33 -49 -14 34 78 -82 -38 -11 66 11 -87 -4 -59 92 -44 -18
8030 -18 -45 49 58 71 12 -26 -102 31 19 -5 -43 27 -79 -54 149 -6 -14 -86 78 82 -22 41 16 0 22 -110 -90 123
8058 123 -66 -90 -49 -21 40 202 43 26 -52 -98 -37 119 87 53 37 29 122 27 78 -9 -28 -38 61 -99 -72 18 -36 -70
8086 -70 39 15 -141 -55 -34 -22 0 -12 -46 48 38 -1 108 33 -125 10 106 108 21 16 -67 47 -12 -3 67 21 -73 16 -72
8115 -72 -40 -114 10 20 60 89 34 36 3 140 -159 -93 26 -64 -47 74 -35 -66 -36 -58 -58 -85 26 66 22 -70 -79 -55
8143e5J32n7q3R3m1p0Q2k4K1r0M2Q4l8PN4j43J09n6O2n0J6k3J08r6j4J07Ql8K7
8172G4j09o5P4O8qr9N3L8Q1j96J55j34N6j3J3L2o8mj2
$$ plain form
8143 -55 77 20 -63 30 -11 -81 1 -23 -2 -92 -50 34 -4 3 57 -86 23 -33 29 -21 -5 -28 80 -16 -30 77 85 47 74
8172 74 -35 -100 -26 42 34 -65 -12 26 107 -89 66 -68 -12 -25 -12 20 -48 -52 -64
8191f4
$$ Imaginary data points
##PAGE= N=2
##DATA TABLE= (X++(I..I)), XYDATA
0@%%%%%%%%%%%%%%%Qj6J6j6J6k4L2l2M0m8N6o4P2q4R2j04J20j37J58j81K03k27
37a20K56k88L21l56L96m42M90n40N97o60P27q01Q81r70J069j177J298j435J588
56H34j760J959k188K456k776L166l651M276n117O309q148J1376j8662O5858o721
71D7211r2843Q3644l680p6931J3327M5846m5502j3497L6528j934k2229L4306J2642
84A6888k3213J3766J8452k5660O207J6336j9600k178J4127j7178l715R121r850
97f497k802P634r945l972J0296j415p586J1922R660r079O394J6730j1326k262
111G752J7698j7566j8534K0124o010k7608J3735J2845k2129k46K2488m728p201
124i380J9066L374j6003Q631J0343j5782j043J4125q845j0883P198j70p972K595
$$ plain form
0 0 0 0 0 0 0 0 0 0 0 0 0 0 0 0 0 8 -8 8 -8 8 -16 16 -16 24 -24 32 -32 40 -44 48 -56 64 -73 85 -96 107 -120
37 -120 136 -152 169 -187 209 -233 257 -283 314 -346 381 -420 461 -509 560 -617 681 -754 834
56 834 -926 1033 -1155 1301 -1475 1691 -1960 2316 -2801 3508 -4640 6736 -11926 53932 47211
71 47211 -45632 38012 34332 -42599 -29272 16574 -28928 -42425 -5897 -7831 -30060 4246 16888
84 16888 -6325 7441 25893 233 6440 22776 3176 998 15125 -2053 -5768 3353 -6497
97 -6497 -9299 -1665 -11610 -15582 -5286 -6701 -14287 -2365 7295 -1784 4610 21340 10014 7752
111 7752 25450 7884 -10650 9474 3464 -24144 -10409 2436 -19693 -19939 2549 -2179 -9380
124 -9380 9686 13060 -2943 5688 16031 249 -794 13331 4486 -6397 801 631 -7341 -4746
138d746M027m216k314L212K16m4K938K514K733J089j553L591K037n523N6M55p994
155c522j180L459o588l097O982J227n930M225J0817k280m619Q185L5q193N416
170D937J740q153L149K401q711j974M637m8l220R88M264k250k950N949J774k478
186E5N256J303m081O53M97m62j175l606J004p95o508K235L026l893L485M676l101
203a431N21M845J528k713p42M744k143o725L794J565o854J525J318n248J887L336
219g93k371o01L036J874j786p41N512J149l877K941L11m618J112J020l300q25
235a957K09j037k021r95M063R83k178L711J703k900K521K467j980l48J438n25
251C154l612j317L632j729m439K589O77l430J695J878j433J262K133Kr07J845
$$ plain form
138 -4746 -719 -4935 -7249 -4037 -3821 -3865 -927 1587 4320 5409 3856 7447 9484 3961 4017 4472 -3522
155 -3522 -4702 -1243 -7831 -10928 -3946 -2719 -8649 -4424 6393 4113 -506 7679 7714 -479 4937
170 4937 6677 -1476 1673 4074 -4637 -6611 -1974 -2022 -5242 -4254 10 -2240 -5190 759 2533 55
186 55 5311 6614 2533 3186 3683 3221 2046 -1560 -556 -1351 -7859 -5624 -2598 -6491 -3006 1670 -1431
203 -1431 -910 3935 5463 2750 2008 6752 4609 -2116 1678 3243 -3611 -2086 -768 -6016 -4129 -793
219 -793 -3164 -3765 -729 1145 -641 -1382 4130 5279 1402 4343 4654 36 1148 2168 -1132 -1957
235 -1957 -1748 -2785 -4806 -5801 -1738 -755 -2933 778 2481 -419 2102 4569 2589 2241 3679 3154
251 3154 -458 -1775 1857 128 -4311 -1722 -1045 -4475 -2780 -902 -2335 -1073 1060 1062 155 2000
267B000L405k318k954L302r27m186J391P09k555o51O63n16o20J892K690j451r16
284a042L480q90k296L072N58k141K91j23j525n35J193J417k646q11K513j912k173
301c570L210O92j361J261J95l90O50J301M57k002K5J918l167j903L173m85k329
318b325J011P12l53N77J191O61j303M50J692k801o84L188j420k400J532O9p19
335i22N16Q68J73j125J78J292k033J27L017j769j458J506k8o10N05L61N0j116
353d68J86M81k101Q92K503k167j205K792j41j167R09J198j83j550N03L54j931
370a095P20J694k826o64K498q47r55J411Q34k84q59P22P21r93P80R07k191O6J571
389A210j516m82R40k14n57n26P8P92m70N30J030j653N64J627j156j29J363p4j104
$$ plain form
267 2000 5405 3087 133 3435 2508 -1678 -287 422 -2133 -2784 -2121 -2637 -3257 -1365 1325 -126 -1042
284 -1042 2438 1548 -748 2324 2882 741 1032 909 -616 -1151 42 1459 -1187 -1998 515 -1397 -3570
301 -3570 -360 332 -1029 232 427 37 687 1988 2445 443 468 2386 -781 -2684 489 4 -2325
318 -2325 -1314 -602 -955 -378 813 1474 171 621 2313 -488 -1172 2016 596 -1804 -272 -203 -922
335 -922 -406 462 635 -490 -312 980 -1053 -926 2091 322 -1136 370 342 -268 237 598 648 -468
353 -468 -282 199 -1902 -1010 1493 -674 -1879 913 772 -395 514 1712 1529 -21 482 836 -1095
370 -1095 -375 1319 -1507 -2171 327 -520 -1475 -64 770 486 -373 349 1070 77 857 1764 -427 -361 1210
389 1210 -306 -788 152 -62 -619 -1145 -1067 -275 -745 -215 815 -838 -274 1353 197 68 1431 1357 253
408B53q06P03N85j466O34O52k055L99J571j702J58J979l77j292N6J420J59r97
426a26J142L44j781N77Q10j695N87J035j431o35N80L56J16m03O34L47j227Q22
444E2N35j081R69O25j213j47L64M01j51n53O91jj408N84P01r87O86L12j212j25
464i58J099M23n81j58J145k56j620J223N15j159O32K15j430O04O74k15l97K36
482hO18q92q83J071M74j039O33J61r77Q00M08J03J12k01O38o42j118R02M40j128
502e28J95L59r80K90O63k2j59K46P15j006q08J784N1j568J044K78r78R14L45p13
522A22K41K32n52r77K47J045q50p37J286l01o73J326K22l71O88j74n57k57K33
541A93M00n19q37O73j68o78R12K32k10L75n09o2k72NJ200p70p95J422j35j012
$$ plain form
408 253 -553 150 735 -731 -97 555 -1500 -1101 470 -1232 -1074 905 528 -764 -708 712 871 -126
426 -126 1016 1360 -421 156 966 -729 -142 893 -538 -1173 -593 -237 -121 -524 110 457 -770 52
444 52 587 -494 475 1100 -113 -260 104 505 354 -199 492 491 -917 -333 368 -619 67 379 -833 -958
464 -958 141 564 -17 -175 970 714 -906 317 832 -327 305 520 -910 -306 368 153 -244 -8
482 -8 610 -282 -1165 -94 380 -659 -26 135 -842 -42 366 469 581 380 1018 376 -742 160 600 -528
502 -528 -333 26 -954 -664 -1 -23 -182 64 779 -227 -1035 749 800 -768 276 554 -424 490 835 122
522 122 363 595 43 -934 -687 358 -492 -1229 57 -244 -917 409 631 260 948 774 217 -40 193
541 193 593 74 -763 -90 -258 -936 -24 208 -2 373 -136 -198 -470 -465 735 -35 -830 592 457 -555
561e55J007M16k80j05l19k73l13R6L08r20n7J308p78m96J639M3o37M04o9l13J97
582C03Rn5p30K32N66q64o7J379m01p05N00l61k56K62K11pm33J48O00p75J35J356
604A047l00p81L65k55j40J0J49N1n71J48M80q35K99J150p19n08O52j83j62o2O3
625a02L75l80p8L95m82L12P37p15l00O32l59k43R7P9p2l89J27L89m74M85P54j049
647b61k69Q88l27k32M88J21k50m63K62pj63O95J47j075K61N40p60j90Q11j15j00
668Al42K57M21l65L32K93o33P3L60n88Q2M41o4k99l86K44M16o56M20K33q98K63
690c95P84n61Q8M35k37l13O6L92K33l61J21Q8p31K98K23n77L25N73p33k30L13
711a99J71K77j83J74J57m72l9K64k56N47J65o85K6k5J10J6m43L34K33p26J98M70
$$ plain form
561 -555 452 868 588 483 164 -109 -422 -326 -18 -938 -995 313 -465 -961 678 721 84 488 419 106 303
582 303 312 257 -473 -241 325 -539 -606 773 372 -333 167 -194 -450 -188 23 16 -417 -269 331 -444 -309 1047
604 1047 747 -34 331 76 -64 -54 95 146 -425 -277 203 -632 -333 817 98 -410 242 59 -103 -165 -102
625 -102 273 -107 -185 210 -272 40 777 62 -238 394 35 -208 -111 -32 -104 -493 -366 23 -451 34 788 -261
647 -261 -530 358 31 -201 287 408 158 -305 -43 -50 -213 482 629 -446 -185 355 -405 -595 216 101 1
668 1 -341 -84 337 -28 304 597 -36 37 397 -191 -109 332 268 -31 -417 -173 243 -413 7 240 -658 -395
690 -395 389 -172 -84 351 114 -199 -133 259 492 131 252 340 -391 -93 130 -447 -122 451 -282 -512 -199
711 -199 -28 249 66 240 397 -75 -114 150 -106 441 606 -79 -53 -78 32 48 -395 -61 172 -554 -356 114
733A14m97M43L09m06p1L38L6k61q5M82r4o64M64J05n57M11J79q30L55K41j44%
755a32q7L30n2n34L99M27k98M77k02l49L55j90j12Q4j49rj59n66N82L00l76M18
777A57k2k90J70J7j2J31m5K24l75j84N52q6m21N70k27l00K22ll63M7L9Q5k39j6
801c69O37N9m64M48p5k33L11k22j75K80l02k57J09K2M82j78l91M95j06m04K96
822c7R3J54L0l41k30J60P1M28r3k21M00k89l23L36o8k54K01j83j62K1R0M00j97
845a4L2L58l50j80L42np0L2k79M0J42J1P6k94J42L77n00j95N53j40k47M5j57J85
869i6KJ16R2j50O2J71k68M8L69k11l22K61k18l6J82o1J25O4l43L36l12l7M74k56
893hk06K32j94K16Jl1J88k1j42J63m07K82J94l27k05K93j83J19l2L1J33k73mK15
$$ plain form
733 114 -383 60 369 -37 -108 230 266 5 -80 402 308 -356 108 213 -344 67 246 -584 -229 12 -132 -132
755 -132 -219 111 59 -475 -76 351 53 530 328 -21 334 144 32 116 -33 -42 -201 -767 -185 115 -261 157
777 157 135 -155 15 32 20 151 106 330 -45 -229 323 237 -184 386 159 -141 81 78 -285 -238 -199 -114 -353 -369
801 -369 268 327 -137 311 236 3 314 92 -83 197 -105 -362 -253 -231 251 73 -318 177 71 -333 -37
822 -37 56 210 240 -101 -331 -171 -100 328 235 14 414 125 -198 138 70 -184 17 -166 -328 -307 -217 183 -14
845 -14 18 376 26 -154 188 183 113 145 -134 -94 48 59 135 -159 -17 360 -140 -335 218 78 -169 -124 -281 -96
869 -96 -94 22 114 -36 26 197 -71 -23 346 135 -187 74 -144 -180 2 -59 66 130 -213 123 -189 -226 248 -8
893 -8 -214 18 -176 40 41 10 198 177 35 198 -209 73 267 -60 -265 28 -155 -36 -68 -37 96 -177 -181 34
917C4j68J55J77k92Q3K52k33q0J68k8R1l32P5M1m6J96Q8l76o1L32j09q1L09J02
941B97q8j74k4J57j43PJ75l93J75K03m59O4J80J1p7j32M6K46j88J53J00j67J37
964A06J76k75J47J31k91P8k04N8J11q6J6L9j73J41r6r8K85J29k15r3J07P1J51
987B15j19J13L5l00Q8l2k88L75k5k75J6N3N5J4j14K84J95k73J4J0j30L02k3k86
1011i6J29O2k29J49j61K22P5m63K69j3j30K09p9n8Q9O5J86p6r6J43O1l82J43K0
1035C9j82J29p3j45J65L9n9N6Q9Q2j52q0K80j0l27K27l4k05K71j76n4K22Mo9j14
1060g7jK24j46j41J92j41n3J29lp6K28j41J75o8j51J75n6o9M5M0k20Q9M0J35r9
1085C0O7N1j00q4J57j81l8N5n3n3J07L3l7K33j79q2J21LK27l00qK04l11n1J67
$$ plain form
917 34 -134 21 198 -94 -11 241 8 -72 96 68 159 -173 -98 -57 -103 93 181 -195 -256 76 -33 -114 195 297
941 297 209 35 11 168 25 32 207 -186 -11 192 -267 -203 -23 -12 -89 -221 -175 71 -117 36 136 -31 106
964 106 282 7 154 285 -6 72 -132 -74 37 -49 -33 6 -167 -26 -122 -220 65 194 -21 -114 -7 64 215
987 215 96 209 244 -56 32 0 -288 87 62 -213 -197 -144 -89 -75 -189 95 290 17 31 41 -89 213 190 -96
1011 -96 33 95 -134 15 -146 76 151 -312 -43 -56 -186 23 -56 -114 -25 40 226 150 54 197 258 -124 19 39
1035 39 -143 -14 -87 -232 -67 -28 -87 -31 58 140 -12 -92 188 178 -149 78 44 -161 110 -66 -120 102 106 37 -77
1060 -77 -78 146 0 -141 51 -90 -143 -14 -17 -93 135 -6 169 101 -50 125 69 0 45 85 -135 -46 -6 129 30
1085 30 97 148 48 -36 121 -60 -98 -43 -96 -149 -42 -9 -46 187 8 -74 47 50 277 -23 -31 173 -138 -189 -22
1110b2p3L8L4j6n5J46k03K00j42L2J06j12P8J51q8p7K46k26mR4j29J2j0j01O3
1135e8k17N8L05j08j9Q6j06J29J7o4P8m7K3Q3k41m4K02j79Op7k1J24P4j44O2J4
1161f4J10pn3Q2J78o7j79Kj03J73o7n7R3j52m2O2l9k9K22j2n2m4k8J70m6j0J06
1188A47k7l1lk13J59J11k33J54q9L6j02O3K9J58j79O4k7L4O6R4j05p2J0r4L8Q4
1214G2j33L4M2oJ7r8J05R5j49p4J12j6J3K2K2j32o3J37P3p7jJ62k11L0R1j87O8
1241e2J41m6Po2j5J79j94M7J4o2M4M3j70R3L07l63P5k3J80r0j6OJ30j62J6k5m
1268bn7P9j5q0o3J27ro3O0Or3J43J0n0O8J3j21Q3j00J52R0k10k3M9k17J26J1j0
1296i6J16Rp2J64rl4R3k7k8j42M2p9M8k6P5j2j42K02q0o7P1o8J49j26j66K01R5
$$ plain form
1110 -22 -95 -57 -23 -39 -94 52 -151 49 -93 -61 45 -67 11 162 74 -3 243 17 13 107 -22 -10 -20 -121 -58
1135 -58 -275 -217 88 -20 -39 47 -59 70 87 23 101 54 77 160 -81 -125 77 -102 -96 -173 -194 -70 4 -140 -78 -64
1161 -64 46 39 -14 68 246 179 0 2 -101 72 5 -52 41 -111 -153 -91 -130 -159 63 51 -1 -45 -73 97 51 41 147
1188 147 120 89 86 -127 32 143 -90 64 -25 11 -91 -28 1 159 -20 44 17 51 117 211 106 34 44 -50 -12 72
1214 72 -61 -27 15 9 26 -72 33 128 -21 -95 17 1 14 36 58 -74 -137 0 73 -4 -5 157 -54 -24 67 -120 -52
1241 -52 89 43 50 -12 -27 152 -42 5 19 -43 1 44 -126 -33 274 -89 -14 -37 143 53 37 43 173 11 27 2 -2
1268 -2 -59 20 5 -75 -138 -11 -20 -83 -23 -17 -110 33 43 -7 61 74 -47 36 -64 88 178 -32 -55 -6 -223 -97 -86 -96
1296 -96 20 29 -43 121 112 78 171 144 116 -26 16 -63 -15 -41 34 22 -120 82 2 -65 6 -62 87 -39 -205 -4 91
1323I1o1J10j52M7J4q9M4O2j17j8j42M4J15N6p4O9oL7J81j35P8L8r6m4j59Q1N5
1350B9j33K6J22l0q6J20j62M6J29j15L6J1K4L7o5L2M7k1j12J23N5o4p4l5P8j85
1376a67J12K3l3P4no4J07R5j65Q7r1n8m2qO4J87j09J3N1j2j6P9r4P5Nj79J24j66
1404a13Q3R9k0n1ro5j4J73r3LJ7RR2o7r8R9j9m0N1p9k5J13q6j11K21j82R7q6M5
1433e6J05j09K0J19r6kJ95o9j30J41k32P4J53j29jj55J5n9J78o0Q1o8J37m8o6
1458f2J13O9j98O7q0K7M6O7r2J04j02kM5k0P3l1n8J64n1n0M0j00L6j9r6J05P2
1485F7mj19K1L1o2m3JR4j03K18n8m8J06k2o4P0l7M0J2j44N2R0j15J9lL2m1L7m9
1514b2J11j02P0j19O6L0m1L4Q8j21k5J42j19j06J06J9k6o1P8j08J50p5m0O3j0
$$ plain form
1323 91 30 140 -12 35 49 -40 4 66 -51 -69 -211 -167 -52 4 -70 -1 -7 30 211 76 154 192 96 52 -107 -26 29
1350 29 -104 -78 44 14 -72 48 -114 -68 61 -54 -18 -7 17 54 -11 21 68 47 -65 58 113 49 -25 -60 18 -167
1376 -167 -55 -32 -65 9 4 -60 47 142 -23 64 -27 -85 -127 -135 -71 116 7 20 71 59 43 122 28 103 108 -71 53 -113
1404 -113 -30 69 49 -2 -11 -76 -90 83 -10 -7 10 19 111 44 -54 45 26 -14 37 -42 -67 46 -40 -151 70 -112 -15 -101 -56
1433 -56 49 -60 -40 79 -17 -19 176 107 -23 118 -114 -40 113 -16 -17 -172 -157 -216 -38 -98 -17 -85 52 4 -62
1458 -62 51 120 -78 -11 -91 -64 -18 49 -43 61 -41 -43 2 -18 55 24 -34 130 79 29 69 -31 5 -14 -110 -5 67
1485 67 63 -56 -35 -4 -66 -109 -108 -14 -117 101 43 -5 101 79 15 85 48 88 100 -44 8 98 -17 2 -1 31 -10 27 -22
1514 -22 89 -13 57 -62 4 34 -7 27 115 -6 -31 111 -8 -114 -8 11 -15 -76 2 -106 44 -31 -71 -8 -18
1539a8m4R7jJ28p1j33J26p2k2oN8J2M5j58J23r8L2J40m1r6j6q9J51p1k4%Nq8J18
1568a3O8QO0m8j12j4J0P6k6j19K06j51NJ30m7pK3p2q7RK4k3J74Nj74P8j04J92
1596G1L8k9J8j46P0k3m6j00J38M0r9P3k5J16o3k4j8n6K3On8J90o1k0j9j49J71
1623A8P5q9K6J2k1p1Q2M6j35J03l1m2J01o2J03j9p5N4q4N3lmp5K3k4L1%M3j39
1652a04J09M9k4k7l9m7J08J2K9k8J4o0P5o8j8o8J10r7J1O0J5m4j4N6j40J62k4
1679HJ09j76K9J57j50L9k4O6r3J86k53L3P4q0J41l7p6j01O0R4Oj21R4P8p4J07
1705I6q7r1O4k4J0L0R0q0J2L2q9LJ0L9K1n0lM5Rl7L7p2J03n5Q3o4K9j02Q9r5R8
1736E1j10N1m3NJ00r4o4qK0J73pq0O9o4ol3J06o9n5J9R5l7K7j61K22j69J28q8
$$ plain form
1539 -18 -62 35 34 162 91 -42 84 12 -10 -16 42 54 99 -59 64 -34 -2 138 97 1 -15 -104 47 -24 -48 -48 -43 -131 -13
1568 -13 55 63 123 75 -37 -51 -41 35 9 -110 96 -55 -50 80 33 26 49 -23 -110 -101 -77 -100 74 79 -95 -17 -121 71
1596 71 109 80 98 -48 22 -1 -47 -147 -9 31 -68 5 -20 96 33 9 -9 -65 -42 -36 -94 96 35 15 -4 -153 18
1623 18 93 4 30 42 21 -50 32 78 -57 46 15 -27 74 12 115 96 21 75 -9 44 41 37 -38 -15 -39 -8 -8 35 -104
1652 -104 5 54 30 3 -36 -83 25 37 66 38 52 -8 67 -1 -19 -87 23 -74 -63 -3 12 -32 -46 10 -130 32 8
1679 8 117 -59 -30 127 -23 16 -8 58 -35 151 -102 -69 5 -75 66 29 -47 -148 -88 6 12 -109 -15 63 -11 96
1705 96 9 -82 -18 -42 -32 -2 88 8 20 52 -37 -34 -24 15 36 -14 -17 28 37 0 37 -35 68 13 96 32 61 -41 48 -47 51
1736 51 -59 -8 -51 -46 54 -40 -104 -112 -92 81 74 -6 63 -1 -7 -40 66 -3 -58 -39 56 19 46 -115 107 -62 66 -22
1764b2j3Jj15J77n0J9j1P0j09J63o2j28R3J3j4J37k31J79j17J19j90J08j3l2P9
1789E1p7K3l5O2L9M9l5k4k3j1n1Qm4L1O6m9Q0jOj04k9M2K8q5K08k03J57k2o2L8
1819C3m5n8J63j65J29r7m7P6P0j25K6J11j33oJ0O8K3L6j6o8m3L9J3q0L2J30j29
1846e3J45k9lN8k11Q2M8l8n9J01j7o3L0K2N6j49N3%l1R1J8kj24K4l4J05J4q6m
1875e6M6j6OM4o7K4N5pR4k9k15P1P0k0R6n4R3j23mk9n3j3J58j38R5N0m3n0J5l7
1905c7R2oj44J12o6J54j72k4Q9m8P1n8q8J02j17Q3R6n0OK3J59k19NJ08J4j60N6
1932a9PO2o3J08r2K3l4q2m7Q4N8p7M7J6j1M9N0j11N7n7K3m6j5Q9n2Np4l0J29J0
1962GLk3j32M3J96n5j0M7p6o3M7l7P5O%p2P2M0j03K3O1p6N3PL4k9N5j3J0j41n2
$$ plain form
1764 -22 -35 -34 -149 28 -22 -3 -14 56 -53 110 48 -80 13 26 12 149 -82 97 -20 99 -91 17 4 -28 51
1789 51 -26 -3 -38 24 63 112 77 53 30 19 -32 -24 -68 -37 29 -20 60 59 65 -39 -68 -26 2 -83 125 -78 79 57 -5 33
1819 33 -12 -70 93 -72 57 -40 -87 -11 59 -66 -40 71 -62 -68 -58 10 33 69 53 -15 -58 -19 -6 -86 -54 76 -53
1846 -53 92 63 60 118 -93 -11 37 -1 -60 41 24 -39 -9 13 69 -80 -27 -27 -58 33 51 49 -75 -51 -85 20 34 -52 -56
1875 -56 -10 -26 -20 24 -43 -19 36 29 123 94 -121 -50 20 0 96 42 135 12 8 -21 -74 -87 71 -67 28 78 35 -15 0 -37
1905 -37 55 49 -95 17 -49 105 -67 -91 -2 -50 21 -37 -125 -23 -140 -57 39 -11 -5 18 177 -42 -37 71 85 -75 -19
1932 -19 -12 50 -13 95 3 26 -8 -90 -137 -53 5 -72 -25 -9 -20 29 79 -32 25 -32 -9 -55 -70 19 -33 -28 -102 -132 -3 7
1962 7 10 -13 -145 -102 94 39 29 76 0 -63 -16 -53 22 28 28 -44 28 68 -35 -12 49 -27 26 33 67 38 93 80 90 -51 -103
1993a03P0l6J35J5j47P9O3pn6PM5p0m5J09m0R9j67o9J21l0NO0j04M5J7l0k0Q5
2021C1k4O0j17Q0Ok3o8j8N4L8L2j06m7qJ77Jo2NM9j26JNJ04q5Q5j38M9J00p4L7
2051A8r2J17j1p3J32j41N6L1J5m0p7J15l8N1j39J67M6j13l8Lo2J32n6m1n4J9J6
2078e7J0Q8L0j48L8R0j44J76j03J11L8j95J05o9q6J28L2j4o2K6L9N3p3MJ8p3L9
2105AK8J06j39p9m7J30Q6j0k7m7J8r2O0j2K0O5j16J21j41LJ06j27J55m5JO2j14
2132c4n8pO7o0O4P3n3L7n1k04J70J15o8j9K9k2j1o1p0J86np3K4K8k2J11n0j47
2160a11Q5Ol0j9J1J17n5M1k1N5j44rN7M9K4j20P3L6m5j9MN4J7J5oO1j51J6o0J06
2190C7r8J3n9J74j0l6l9n2J16m0J4N1k0m3N2k9P7n2j01L6L3nj03L9J20j42P2l9
$$ plain form
1993 -103 -33 -69 66 81 -66 13 76 69 13 20 65 -5 -50 59 19 118 -49 -118 3 -27 -22 38 -66 -21 -4 -34 -54 31
2021 31 7 67 -50 30 36 13 -55 -73 -19 19 51 -55 -102 -110 67 68 6 11 60 -66 -65 -60 44 -41 44 -94 -45 55 -19 18
2051 18 -74 43 32 -41 91 -50 6 37 52 12 -65 50 12 63 -76 91 137 24 -14 -11 -73 59 3 -38 -92 -73 -57
2078 -57 -47 41 71 -77 -39 51 -93 83 -20 91 129 -66 39 -30 -116 12 44 30 -32 -6 33 86 13 17 35 -38 1
2105 1 29 135 -4 -83 -130 0 86 76 49 2 20 -72 -12 -24 -4 61 -55 66 -75 -72 34 -93 62 17 18 80 -34
2132 -34 -92 -99 -32 -92 -28 45 -8 29 -22 -226 -56 59 -9 -28 1 -21 -32 -93 -163 23 18 -55 -31 -3 -25 86 36 -111
2160 -111 -26 -20 -50 -69 -58 59 4 45 24 79 -65 -74 -17 32 56 -64 9 45 0 -19 -15 39 56 71 65 126 -25 -9 -69 37
2190 37 -61 -48 -107 67 57 21 -18 -70 46 6 20 71 51 8 60 31 108 56 -45 -9 24 19 -84 -45 75 -67 5 -34
2218c4l8Q3k9Lj14J35J2j72P2K09k32J97m5l4o0rQ3l5M9M9q6n3Q3r0J09j09L5
2245b1k1l3J58q1Q3j34Pk9r3J73r2J67j81J90j86J60j40J42j06O0n4l4M2K2J19
2270A18j18J9n7L3K7l3J7m3%M0k3K1m4J23p1p8N4r6J50j13l2P7P6L7o8n1R9o8
2298dn9R3l7J3o6O8M8j22J22q4K8J3M5q1J24m3L7L7k69J95k7j1k9K4l5R6n0n6
2326c0J31r4j30O1O7L6o4J5m0M5o8Q3q1P6j9jJR2N9j31j4M8N0j81P1Q6l4ko1P7
2356D8j28J55m0LK9j08J27m2J10j67o6NM9o0J11o2P5p2J21j07l7J45j08L9o6Q6
2382D0L0j45jJ0J07l7m9R5rj06R6lj8m2K3o6N2J00j65J10n5Q3o4J10r7j4l0J14
2410F9l8Oq3QK7j6K3M1j05j4K30r9krL0%j01O4L2j22O2pj32J25jj8n2R3n4J44
$$ plain form
2218 -34 -72 11 -18 -15 -129 6 18 -154 -82 127 -105 92 47 13 -47 -56 27 -8 41 90 4 -49 34 -56 53 -56 -21
2245 -21 -42 -75 83 2 85 -49 -42 -71 -164 9 -83 84 -97 93 -93 67 -73 69 -37 23 -31 -65 -23 -1 118
2270 118 0 19 -38 -5 22 -11 6 -37 -37 3 -20 1 -43 80 9 -69 -15 -111 39 -74 -106 -29 47 84 16 -35 64 -4
2298 -4 -63 30 -7 6 -60 8 56 -66 56 -28 0 13 58 -23 101 58 95 132 -137 58 31 20 -9 15 -20 76 26 -30
2326 -30 101 7 -123 -62 5 41 -23 -8 -48 -3 -71 12 -69 7 -12 -13 -12 80 139 8 -6 42 92 -89 -18 68 34 32 -29 48
2356 48 -80 75 35 38 67 -41 86 44 154 -13 -79 -74 -25 -85 26 -36 39 -33 88 -19 -56 89 -19 20 -46 40
2382 40 70 -75 -76 -66 41 4 -45 50 41 -65 31 28 10 -32 -9 -75 -23 77 -88 22 -33 50 -14 96 -1 -15 -45 69
2410 69 31 37 -46 -38 -11 -27 -4 37 -68 -82 148 49 47 38 68 68 -33 31 63 -59 3 -4 -136 -11 -12 -30 -82 11 -43 101
2440A01r0l2O3q2J35m0R9k29J8L6J02j8j04L4O9q2P6j15J06q9K9n5M6K0Q8j18
2466c2J63l1j07j6r3J37j15Q9J5k7j9O8k8j5L6J49j98N0K3rp1K5L1l8J7j7m5M1
2494a7J8J11j07j9%m4Q6o2M5L6l2m9K4O0j20J1J23L8j2j05R3r0L2Lr6J02j17J17
2522B9q4Q1o3L5K6j5M9j8ll3r7J68n9k7J06j72J86j07J10j40J06r7jk4n8J01R4
2549I3k03n0J64p3J00r2J17rp7k2MR1j5m7J6%Nm0j12J65Ko2MM9QK9o3L9N2j03
2579c0O0o8M2pR9j10%p3j3Q0RM0o3M1n0l6l6J38o5M2L2m8mQL7N3p6mJ33j59K7
2610aq7P2k1MM5k4PmP7l0k12J17Q0J8k8j9j1ko1J23j69J24jJ4K9j04K30j51K4
2639C9j9JrO6j35P3o8Q6K0j03M5j5n9J60k2kq9QK0j5L3kLL7j6j18R0J71k37M2
$$ plain form
2440 101 11 -21 42 -40 95 55 154 -75 -57 -21 81 63 -41 -7 62 -20 56 -59 47 -42 -13 -68 -22 -2 86 -32
2466 -32 131 100 -7 -23 -116 21 -94 -5 10 -17 -36 32 4 -11 25 174 -24 26 49 40 -31 -6 25 -13 4 -13 -58 -17
2494 -17 1 112 5 -14 -14 -58 28 -34 11 47 15 -34 -10 50 -70 -59 64 102 90 -15 78 -12 20 23 -73 29 -88 29
2522 29 -55 26 -37 -2 24 9 58 40 37 4 -93 75 16 -11 95 -77 109 2 112 -28 78 -19 -20 -44 -102 -1 93
2549 93 -110 -160 4 -69 31 -61 56 47 -30 -52 -48 43 28 -19 -3 -3 2 -38 -150 15 17 -45 -41 8 16 45 -18 21 73 -30
2579 -30 30 -38 4 -3 96 -14 -14 -87 -100 -20 -11 29 -34 7 -43 -79 -115 23 -42 0 32 -16 -20 -12 25 78 2 -2 131 -28 -1
2610 -1 -88 -16 -37 -33 12 -12 -5 -9 68 38 -174 -57 23 41 13 -6 -17 -19 -80 43 -126 -2 -3 11 40 -64 166 15 39
2639 39 20 21 12 78 -57 16 -52 34 54 -49 -4 -19 -78 82 60 58 -31 -23 -3 -18 15 13 16 53 37 -81 9 180 -57 -15
2669a5j10J56j53J72J0L9k25J84K9P0k29L5j9Q8l1K9r3j02J45lN1j44R3J5M5m2
2695eo4K2J13n6M5p7J01j37N4k3orP3O4r0O1m4kjj36K6P4MnK9o3R1o0qJ6K0J1
2727A8rp4l5J7Q5J6M0Q9j68p8O0p2J21n5R2o8J02j02O2j24J19O8j06n6jJ17K0
2754G8m2k1J16J2q0k4r9jQ4L9m1p5P8p9P5j3n6J15n3L9J37p0j44N3q2L0OL2M9
2783F3j09m2J54j08J18q2J9m4q9R1J12r7Q0j42J87m3p4n6L8K6lJ7K0m9j26J68
2809B9K3j16N0n9P2Q7r0J25p3l8p6J47m5J6p9J65j27n6J10l2m9o9J51J2j40K8
2835c4kR4n8N1r9m9J14r2j0O7n9K0J94j92NO1m1J23j09n5J44o9j7O0j23O8j5M0
2863A7J2j77J01K2L4Q5j30p4J92m9r2j8J1J49q5n4R1Qn7J2K9p5J11m4m5l3P6l7
$$ plain form
2669 -15 -125 31 -122 50 60 99 -126 58 87 157 -72 -37 -56 32 1 30 -63 -165 -20 -23 28 -116 -23 -8 37 -5
2695 -5 -69 -47 66 10 55 -22 79 -58 -4 -27 -33 -42 31 95 5 66 22 20 19 -117 -91 -17 -13 -18 11 -52 39 -21 -29 -13 7 18
2727 18 9 -65 -100 -83 2 18 58 147 -21 -99 -39 -111 10 -45 47 -21 81 -21 41 -83 36 104 -2 -58 -59 58 78
2754 78 36 15 131 143 63 39 -60 -61 23 62 21 -54 24 -55 20 7 -49 66 13 52 189 119 -25 28 -54 -24 -18 14 63
2783 63 -46 -88 66 -42 76 -6 13 -31 -120 -29 83 -14 66 -76 111 68 -6 -62 -24 2 -1 16 36 -13 -139 29
2809 29 52 -64 -14 -73 -1 86 -4 121 48 10 -66 81 36 52 -27 138 11 -45 65 33 -16 -85 66 78 -62 -34
2835 -34 -36 58 0 51 -48 -97 17 -75 -85 -18 -77 -57 137 -55 -50 11 -30 93 -16 -71 73 4 -13 47 -76 -8 -23 17
2863 17 29 -148 -47 -25 9 94 -36 -110 82 33 -59 -77 -66 83 -2 -56 35 43 -14 -2 27 -48 63 19 -26 -59 17 -20
2891b0P1j6R2r5K1j00L9J5O0m8R6r7J2l3K6pl1P7q6o3J54P8r6ro9m6J24n6O6r3
2921c4J13j05J69k00J10m8P5j70R2l1N2j9j5m0JN1n2J02j15lO0J21j36J2P6p8
2947a2pp3Q2P2N%j40J8O9J01o9J2J1k8K4l7p4J04j24M3P1j43J95o4l8N1l7Q0j10
2976a8J14k1r9l6K0R8p9o3J33p7J0J17p4j43J02J19j73J12j3n4J27o8j67J55n2
3001c0J29j80J39n2r6K28k67K39q0n6J3m4J2J5O5r9L4L1O5nr7Q0j91J61O3nj26
3028e4O5rN1k1L4j22J60o1m0M0L6p4p8O2M0j9%m9O1k7P3L2j18m4J13o6N8j14P5
3057DN4j01O6R9j57L3L6Njj6L7o8P8j93J54r4J43n8o1L8p1J79j16K8Nj53K39j11
3085bnk7M2J5j09Q1o8LP4Rl0j78J88l9Q8o4J7L1m5%O2l2q9LJ47p8J34j86%N1R0
$$ plain form
2891 -20 51 35 127 32 53 -47 -8 7 67 19 115 18 30 -3 23 16 -15 62 -24 -87 67 145 49 40 -29 -75 49 -7 59 -34
2921 -34 79 -26 143 -57 53 5 80 -90 2 -29 23 4 -11 -51 -50 1 -51 51 -64 -67 -7 114 -22 -10 66 -12
2947 -12 -19 -92 -10 62 67 67 -73 -55 14 115 46 58 69 41 65 28 -46 58 -66 -23 48 -95 100 36 -2 49 12 92 -18
2976 -18 96 75 -24 -60 -40 58 -21 -84 49 -28 -18 99 25 -118 -16 103 -70 42 29 -25 102 34 -133 22 -30
3001 -30 99 -81 58 6 -90 138 -129 110 30 -26 -13 -57 -45 -30 35 -64 -30 1 66 61 -36 44 -147 14 77 72 -54
3028 -54 11 2 53 32 66 -56 104 43 3 43 79 5 -73 -11 29 10 10 -39 22 -5 68 100 -18 -62 51 -15 43 -71 4
3057 4 58 -43 23 122 -35 -2 34 39 38 22 59 -9 69 -124 30 -64 79 21 -40 -2 -73 106 -10 18 23 -130 109 -2
3085 -2 -7 -34 8 23 -86 -5 -73 -70 4 13 -17 -195 -7 -46 42 -22 -5 26 -19 -19 43 11 -78 -75 72 -6 128 -58 -58 -7 83
3116H3j64J67L3j24Pm2KN9m6J2l6l4K5j3o2M2J34m5Q5l0Ln1K0k3N2rm0l6J50n3
3146F6P1j03j09pj0M1J2J40j69N0N6l2r1J01k6qn7M8J4r2J53m3l7M0j9L2l9j2
3174c0J01m1o4J22j96Q8R5k56J24l0J54m7j07J97p8o4K0K2M0k2lJ10j75J4N6J03
3200A33j29J31j61n5R0j08O8M0NO5o2j31J09n2l2J00j18Q1j8K3J2J54j21O6j07
3225a7%M5ln2M8j55J89j04j5J12p5O5j9L9o7M7o2O9n2j25K84k52M2NP3k2M1O3
3253A02l1O8j81L2nR2j43%J18N7j13r1R6M6j8m9J1j09K33j12Q8p7q4J25n8k4m2
3280f9J20r9L5J06j6mm7P2q4Q6Mp9L9j29J14j41L6O5K9r5J36l5p7l2Q1o4M4K0
3308A6j34J41j83J30Q0l9J5l0l3K9jJn3J66j25O6n7J44j29Ol5m1J42r1O9k4m6
$$ plain form
3116 83 -81 86 119 -5 2 -40 -38 21 -25 -13 -49 -83 -58 -71 -133 -91 43 -2 83 53 56 5 25 2 54 45 5 -31 119 66
3146 66 137 34 -75 -82 -92 -51 -39 101 -68 -18 38 6 -85 16 -10 -18 -75 -27 -13 -105 48 5 -32 8 -11 21 -18 -30
3174 -30 71 30 -34 88 -108 -20 75 -181 -57 -87 67 20 -87 110 32 -32 -12 10 50 28 25 135 -40 -26 30 133
3200 133 4 135 -26 -81 9 -99 -31 9 14 79 17 -114 -5 -57 -89 11 -107 -26 -44 -21 -9 145 24 90 -17
3225 -17 -17 28 25 -27 21 -134 55 -49 -64 48 -27 38 19 58 -9 38 -24 45 -7 -132 152 -100 -58 -53 20 -2 39 102
3253 102 71 139 -42 -10 -15 77 -66 -66 52 109 -4 -95 1 47 29 -20 -9 -118 115 3 91 14 -70 55 -3 -27 -69
3280 -69 51 -48 -13 93 77 73 26 98 14 100 104 25 64 -65 49 -92 -56 9 38 -57 79 44 -33 -65 16 -48 -4 16
3308 16 -118 23 -160 -30 50 11 26 -4 -37 -8 -9 -8 -61 105 -20 46 -11 133 4 10 -25 -66 76 -15 54 30 -16
3335a6j7P9j65J72mJ6j15K2p8O6J0M3M9j18R6j3o0J6J87j32j06k0Q5n9j1P1P6
3362G4j43J16Mr3L6kK2n1j4J3p3Q0p6Q8n2K4N8K0k2Lj8L6m7j9K3M6m5J8q5M2Q5
3393D8L4r3qP0pl4L8O8j28J39j02J8m9J1j4kJ7j31R4J29j42Q9m1Mk8M0Q6q9mK6
3423C9r3K8o4O8k8P8M7n4j8lk2L4p9J18m8O9m5K3j10K2J2P2k1p3L9J06j23Q1q5
3452c0M6j23J83J9j10P5l4j04J42j5O5m3K3m0j97J28m8N9jM2r3O3L3r2J46j4j35
3479e5K0N5j05O1l5J17L3Pj03j6J08Nj55O1Q3j32P8q9K2L0%j6K1O0Rr6N5ml1n4
3509f6L6N2Nm5k9J02p7P3j8m3Kq7J04R6j15p3J41n6m8m5K08j31p2J43lo5o9L6
3537d4J9k2K10j20p0lK6k1K1k2kK5m8N6l9K8J41j91O1k2J64j58O4k4Q8k01J0Q2
$$ plain form
3335 -16 -33 46 -119 53 49 65 -50 -28 -106 -40 -30 13 62 -56 40 27 -33 -17 170 38 -68 -88 -3 -62 -73 -2 74
3362 74 -69 47 51 -42 -6 -8 14 -37 -51 -38 -111 -31 -107 -19 -71 -47 11 31 9 12 -6 30 -17 -36 -13 33 -12 6 -79 -37 48
3393 48 82 -11 -19 51 44 10 48 116 -12 127 25 43 -6 5 -9 -11 6 -125 -31 98 -44 45 4 8 -20 20 106 17 13 39
3423 39 -54 -26 -90 -22 -50 28 75 21 3 0 -22 12 -67 51 3 72 27 50 -60 -38 -26 46 25 -48 -9 97 -26 55 -30
3452 -30 16 -107 76 95 -15 60 26 -78 64 49 114 71 94 54 -143 -15 -63 -4 -5 37 -56 7 40 -52 94 80 -55
3479 -55 -35 20 -85 -24 -59 58 91 98 -5 -21 87 92 -63 -2 81 -51 27 -62 -40 -10 -10 -26 -5 55 64 -32 23 19 -12 -66
3509 -66 -30 22 27 -18 -47 55 -22 51 33 -10 -8 -95 9 105 -10 -83 58 2 -46 -91 117 -14 -86 57 54 -11 -80 -44
3537 -44 -25 -47 163 43 -27 -30 -4 -25 -4 -26 -28 -3 -51 5 -34 -6 135 -56 5 -17 147 -11 53 29 117 -84 -74 8
3565Hl1K2oj45J57M2n2NM3N6n5m2M4M7p9m4L5j5M8po1k7O2J12q0m7O6j03L3Mo5
3596g5m1M1J04rM1j0p3J51j10j53O7R1n5j20J72K7k4k2n1P0j3M3M9m5n0m5M6O
3624A2n0P9O6p6J7p6j4K2O2o3o9J59j7j00J06k3r5Q8q8jL4K9L1p1j9L1J75k14
3652f5jP5j16P3O7l1Q8k43J85l1j74K23n7Q9k9o4R1q5mJ2N6n9L6k1j41J50p2K0
3680b8J6M0j00M1oJ34j49O1k2R7q0M6m6L3O5q9j14JR5M9j7j18kQ5l7P5r1j5q5
3709a61K25o3n9K1J16j59N7O7n4O0K2o2o4k2R5j05J13q8m4J4KJ19j18P8L4J8k2
3736B0j00P2P3p7J4Mj8L6NK9l2j26N8J78j74P8j4Kq3O2O3K1oj51R4L4n0K7L2j62
3766i1N3m4J26j08R2J3r6J03m6q1N2o7J05j17R7M8j14J05l3O4L4j9k30K02j20
$$ plain form
3565 8 -23 -1 -7 -152 5 47 -5 0 43 99 44 2 46 93 14 -30 5 -10 38 31 -30 -57 5 117 37 -10 56 -47 -14 -10 -75
3596 -75 -116 -75 29 20 61 51 -22 129 19 -134 -67 24 -31 -151 21 48 24 2 -49 21 8 51 100 55 5 -40 6 12
3624 12 -38 41 107 31 48 -28 -42 -20 42 -21 -90 69 52 -48 58 35 -60 28 -60 -61 -27 2 33 -38 -57 -26 149 -65
3652 -65 -66 9 -107 -34 33 2 90 -153 32 1 -173 50 -7 82 53 -11 80 -5 -9 3 59 0 36 15 -126 24 -48 -28
3680 -28 -12 28 -72 -31 -37 97 -52 9 -13 84 4 50 4 37 102 13 -101 -100 -5 44 27 -91 -93 -8 -45 30 -61 -76 -161
3709 -161 64 1 -58 -37 79 -80 -23 44 -10 50 72 10 -54 -76 19 -86 27 -61 -105 -91 -89 30 -88 -10 24 42 20
3736 20 -80 -8 65 -12 2 6 -12 24 29 58 26 -100 -42 136 -38 40 26 28 -55 7 70 91 85 -66 28 62 12 39 71 -91
3766 -91 -38 -82 44 -64 28 41 -55 48 2 -79 -27 -94 11 -106 -9 39 -75 30 -3 61 95 76 -154 48 -72
3791g2P5L1K8n8m4K4L0K1r9l5J05MM5q6JK9LRJ8k2K7J4j11L8L9N5r0o8j4M0J37
3822G4l6j25J34j09J41r5Q2K2j30pP9j35K10r7J30j29K1K6j7l8n9P8O2r0L2l6
3848a2j9K8J4o5L2m6J15J8q3k1J51j82J35k4Pk8n5P5Ql4JR4j46n4R0j45K16j19
3876d9K9L9mk5o6R4Q5j44J25j88R4n2J23m2j8n7K7L6r8R6J8kq1Q6q4K6q4R5K2
3905AOr5J43l6N2k7n8N3rp3O2k7j4N4R9k01RO3Qj02J81l8o9M3J6j3q1N2l8qL3
3936a4Q2j49K5J8J12j26J07l7j5l9k3L0J46j27J63j80j4L6k04K62m0K6j9l8J01
3961H3M6j92N6r3J83j34Q1R2j44J05j36L0P3jK8j27J3N6l0r4M0P6J10k21J74j35
3987f1J32j13l9N5J3j4RJ4O6m8k9N2j18Q1j60J83N5m5k03K32j03L9l2M0K6PKQ2
$$ plain form
3791 -72 3 34 62 4 -40 -16 14 35 -64 -99 6 10 55 -31 -30 -1 2 11 29 7 34 48 -63 -25 14 69 -21 -89 -103 -63 74
3822 74 38 -87 47 -62 79 -16 66 88 -42 -49 30 -105 105 8 138 9 30 56 39 1 -58 20 82 -8 24 -12
3848 -12 -31 -3 11 -54 -22 -68 47 65 -18 -39 112 -70 65 41 48 20 -35 40 48 14 15 109 -37 -91 -1 -146 70 -49
3876 -49 -20 19 15 -10 -76 18 103 -41 84 -104 -10 -62 61 19 1 -56 -29 7 -91 5 23 21 -60 26 -58 -32 -116 -21 1
3905 1 7 -88 55 19 71 44 -14 39 30 -43 19 -8 -22 32 131 -70 -61 2 10 -92 89 51 -18 25 41 28 -53 -1 -39 -47 -14
3936 -14 68 -81 -56 -38 74 -52 55 18 3 -36 -59 -29 117 -10 153 -27 -41 -5 -209 53 13 39 20 -18 83
3961 83 129 -63 -7 -100 83 -51 30 122 -22 83 -53 -23 50 49 77 -50 -37 19 -11 -105 -65 11 121 -100 74 -61
3987 -61 71 -42 -81 -26 -13 -27 -18 -4 62 14 -15 37 -81 0 -160 23 78 33 -170 62 -41 -2 -34 6 32 39 41 123
4015A23j81J50n3j35L9M6n0O5j5j51K31j19M8P2j75M0J50j22N5l0m5R5l4j34J51
4040B1Q0j01j6pjJ27m4K2j58O8j1j7P2j3j36J32o2j1mR3M2k8j57N3J63q3n0N7
4068C1j1j05Q4m9Rj9NR5mk7J8J53j01r9J19k4m8Nm3M3l1j8k2PJ34m8q4q7J53p0
4098c4l0O2np8P7L5j3j14J33l1lj0o9K00j89N4Lk9M9j22J66o0O4j03oN5j9l6M8
4127ep1K3R0m8j3QO9j1n7JJ9p2J82k79R9l8J28n8M8k8j1M4j21J54j2k3L8Q0k21
4156h5J83r9N1j00L3k9J36j64J50j27K0p3J66o1j55J12O1l7j4J30mk8O9n1k2r8
4182c6j1lR3n5k6%R3r0N3p1J12rm3o7J48j19M5J7qo2lQ7o2J26k14N5j9j0N1M7
4212A9j09P8O2J9j24K5Rqj5k3J13J07n6j35J76j97N0o6J06m4o0l6O0J26j00N9
$$ plain form
4015 123 -58 92 39 -96 -57 -11 -61 4 -11 -162 69 -50 -2 70 -105 -65 85 -37 18 -12 -57 38 4 -130 21
4040 21 101 0 -16 -23 -24 103 59 81 -77 -9 -20 -37 35 22 -114 18 -44 -55 -59 34 76 48 -109 -56 107 24 -26 31
4068 31 20 -85 -1 -50 -41 -60 -55 40 36 9 27 180 79 -20 99 75 27 32 -11 32 1 -17 -39 -32 102 54 -30 -117 36 -34
4098 -34 -64 -2 -7 -85 -8 27 14 -100 33 2 -1 -11 -80 120 -69 -15 -12 -41 8 -114 52 -8 56 -47 -53 2 -17 -53 -5
4127 -5 -76 -53 37 -11 -24 -16 53 42 -15 -14 5 -67 115 -164 -65 -103 25 -33 15 -13 -24 20 -101 53 41 18 56 136 -85
4156 -85 98 -1 50 -50 -17 -46 90 -74 76 -51 -31 -104 62 1 -154 -42 19 -18 -32 98 94 66 135 84 62 -36
4182 -36 -47 -50 43 -12 -38 -38 55 -35 18 -53 59 50 7 -60 88 -31 14 31 23 -39 -42 45 -17 109 -105 -50 -69 -79 -28 19
4212 19 -90 -12 50 69 -55 -30 -21 -29 -44 -67 46 153 97 -38 138 -59 -9 -75 31 -13 -73 -109 -49 77 -23 36
4238C6n7o7J06m3J71j00J4Mr3K5J22j29O1m9j38J30K7Lj03J80j59R4n9l8R2m6
4264a6%R0j2j50J14n2J40j06r2K90k63n2J18J13j33m0P0K8j17O9O0p7j9q9J10
4289a6J12q1k9j0r9J35j11pK29j66J47j13O0L1o4r3Q8O2j32O0q0P0n1L5L1l1K3
4316@o5J5P2rK5Pj79O6Q2k06J69k4J9l5K8M8j01J44k4j03Rk9O3m0j4J70j59j5
4344h6M9p8J65K2l6j21O3J34n8Kq5P8j12J13k9q3N9Kp5J8L3M6J4L2j58N9N2p5
4372e5N0M7P2p6ro0p5N8N5k5J03q7j38N3M2R9p1M0N3j34J2j7NL0nJ4N3k1l2Q1
4402F2m6M2J2k1n7q5m6J77m6p7J60o2J03j57O3J6Qn0r3J98n9o6K8m7P2q6P3m4
4430b8J06j3m2R1j57O5r5J20P2j28k4L2j39J59n3P7j55J04ll3LK3O1j28NJ00m0
$$ plain form
4238 36 -21 -88 18 -25 146 46 60 64 -29 -4 118 -11 50 1 -137 -7 20 23 -80 100 -59 35 -24 -62 30 -16
4264 -16 -16 74 62 -88 26 -26 114 8 -84 206 -57 -109 9 122 -11 -51 19 47 -70 -1 59 -18 -37 -126 -16
4289 -16 96 15 -14 -24 -123 12 -99 -106 123 -43 104 -9 51 82 18 -75 13 75 -57 3 -77 -7 -58 -23 8 -23 0
4316 0 -65 -50 22 13 38 45 -134 -68 14 -192 -23 -47 -28 -63 -35 13 -88 56 32 -71 -62 -91 -28 -68 -82 88 -71 -86
4344 -86 -37 -115 50 72 36 -85 -22 112 54 56 -29 49 -63 50 21 -62 -3 -1 -76 -58 -25 21 35 67 -91 -32 20 -55
4372 -55 -5 42 114 38 29 -31 -106 -48 7 -18 85 -2 -140 -87 -45 54 -17 23 76 -58 -46 -63 -58 -28 -33 -19 34 13 -19 62
4402 62 16 58 70 49 -8 -93 -139 38 -8 -85 75 13 116 -41 22 38 46 -4 -97 101 42 -24 4 -43 29 -57 16 -28
4430 -28 78 65 23 114 -43 22 -73 47 119 -9 -33 -1 -140 19 -34 43 -112 -8 -11 -44 -41 -18 43 -85 -80 20 -20
4457b0k1J15M1j17j3k3k4L0O1n1M6J8l6qK2l4P4q1o0j35J35J87j24L4l2k8j3O3
4485Fj77Q6P9j42J58R2j15K2o3m9Q4j7J1M5Or2J20j78R8N3n2J08l5L9n7K8k4j01
4513f7J13j08J3J21j49Q8O8j80J63j14j5l6J01m2J26j57k9RJ23j34J29n6P4j5
4537B6ll9o7R2Lq5O9M5o7Nj24J81n6n9J09n2j9Q3J4J9j13o4J17Q6r2J04j78L0
4565c5J39r4o5O9L6m5k4J2N8j52K4L7J4m6N4m8J22j33Q5k9QR6Jo1j46J93Mm1m0
4594gp5J2m1J20N3m9j0P6Jp2j07J36O1j02O9j16J54r8O8o1q1J3J49k8J2rL9J0
4622A17j07Nn7L4O6j05P6l1L9l3q4J09ml0M8M5q8o3m3J52J5q3M0L5L2k6l3nm3
4651b2M1L5N1j69Q5j22J18j26J52j19J56r4q0Q9lN5n3Q5k19J40J11j34R1l0j53
$$ plain form
4457 -20 -41 74 115 -2 -15 -38 -62 -32 29 -22 24 42 6 -2 20 -14 60 -21 -81 -216 -81 106 -18 16 -16 -44 -57 6
4485 6 -171 -85 -6 -148 10 102 -13 9 -54 -103 -19 -36 -25 20 26 -66 54 -124 -26 27 -25 83 48 87 30 58 34 -67
4513 -67 46 -62 -49 72 -77 11 79 -101 62 -52 -67 -103 -2 -44 82 -75 -104 -95 28 -106 23 -33 41 26
4537 26 23 -16 -83 9 12 -73 -4 41 -26 -21 -145 36 -20 -79 30 -22 -41 42 56 75 -38 -102 15 101 9 113 -65 -35
4565 -35 104 10 -55 14 50 5 -19 -7 51 -101 -77 -40 -26 -72 -18 -66 56 -77 8 -21 -13 83 84 23 -123 70 74 33 -7
4594 -7 -82 -70 -111 9 62 13 3 79 80 8 -99 37 98 -4 65 -51 103 5 73 12 -69 -56 93 65 77 68 107 117
4622 117 10 15 -42 -8 58 -47 29 -2 37 4 -80 29 25 -5 43 88 0 -63 -106 46 61 -22 18 53 85 59 26 21 -22
4651 -22 19 54 105 -64 21 -101 17 -109 43 -76 80 -14 -94 -5 -8 47 -6 79 -140 0 111 -23 68 38 -115
4676a15J04J9J7k6n8R7l6M6k1n2N7M5n5j00J46l8M8j24O1J9o6m1J39J9j10lO4
4703C6j0O3p8M1q9p3J01N8j52K1K07j27J05j35L1J1M3P0j80l3P1jJ0J1N8j00n6
4730i7J45j09J60j46J04j98J25l4l0P2J0N1r1k2P0j8O1k0l9j32L0J09o0J14m9
4755Fj27R6N2l3OM4m8j34K03n8Q5j38M4L5K00k23j29O3J42j22L5R8J0k2j5l1j10
4782g1PJ09rrl0qO3p9j9o0K17n9K1j50J54l9l4M9J0p9m5L0Q9J5j42Q5m4k4L6L0
4812A4m6NR5q6j6K5n2K8QRN3m3N1j11J32n6K5k2p7J34j56J2L1LL7k0p9J37m5j4
4842b4K6R5p8k4p3J50j45L8j05J65J7j02Q4O7m6p2j18J06o5J34j04N3Q6r2l9Q7
4868B1J7J5J10k36J18l5q7P2L8p4l1Q2q2RJ33p2K4J58j99j3J7K5n4J33j59J23
$$ plain form
4676 -115 -11 8 25 -1 -59 38 2 48 27 -25 32 77 22 -78 68 30 78 -46 15 34 -32 -73 66 85 -25 -28 36
4703 36 26 89 11 52 -37 -110 -9 49 -103 -82 125 -2 103 -32 -1 10 53 123 -57 -90 -19 -20 -10 1 59 -41 -97
4730 -97 48 -61 99 -47 57 -141 -16 -50 -80 -8 2 53 -38 -60 10 -8 53 33 -6 -138 -108 1 -59 55 6
4755 6 -121 -25 27 -6 0 44 -4 -138 65 7 92 -46 -2 33 233 10 -119 -56 86 -36 -1 97 107 85 70 39 -71
4782 -71 -64 45 36 27 -3 -11 52 -27 -46 -106 111 52 73 -77 77 38 4 53 63 -16 -61 -31 58 73 -69 16 -28 -52 -16 14
4812 14 -32 -27 68 -18 -34 -9 -61 -33 -25 -16 37 -6 45 -66 66 10 35 13 -64 70 -86 -74 -43 -40 -3 -23 -102 35 -10 -24
4842 -24 2 97 19 -5 -78 72 -73 -35 -140 25 42 -60 24 91 45 -27 -145 -39 -104 30 -74 -21 65 -27 -66 21
4868 21 38 53 163 -73 45 10 -77 -5 33 -41 -72 10 -72 -63 70 -2 22 180 -19 -32 -15 10 -44 89 -70 53
4894E3q2L6J8K4m1j34K11m2k6o1l4J16j6l5n6R5q0P6O7p2oNlP0j42n2J05j9J44
4923A19p7ql7J2O3m8o2L7r4J94j23k4nM0N0R1j76L5q9J81j50Q7Q7j36N9QMr5J28
4952G1j29N2r5l9J15O1l7O8q3p2K8p9O6J88j80R4k6K7j05Q0L0m8K8n6J27j28m2
4979h4K1J45j58J52K6j00L1J0k0Np3L0j06O1q0Q0J60k03J53q6n8K6N0k3O3J9o7
5006b6L8Qm4K1J6n9K8J07j43O9J2l0n6J21k1m8pR7j86J66q5j31J64n7J66j89J76
5033A07j95Q5j0M6q1mn1J60q7O2J0L7k05J89m0j11Q5q4P2o0J08K1p2K5j4M2Qk1
5061B2J3J5j03M9k7l4K9LL8J32n8j46R2J12j32j2k2M5J2Pr5J39l3o0n7pJ12j1
5089B3o0J16j63P4n9p0J96n2j2J9lj0NoP1j27M3M4pj29K08j3q7j38K20l7j25K38
$$ plain form
4894 53 -29 7 25 49 8 -126 85 43 17 -44 -78 38 22 -13 -69 26 -54 22 89 17 11 16 13 83 -59 -111 -6 -25 119
4923 119 42 34 -3 9 72 24 -38 -1 -95 99 -24 -48 -53 -13 37 128 -48 -13 -102 79 -71 16 103 -33 26 34 38 -57 71
4952 71 -58 -6 -101 -140 -25 36 -1 67 -16 -88 -60 -139 -73 115 -65 29 3 30 -75 5 35 -13 15 -41 86 -42 -84
4979 -84 -63 82 -76 76 102 2 33 43 23 28 -45 -15 -121 -60 -140 -60 100 -103 50 -36 -94 -68 -18 -41 22 41 -26
5006 -26 12 20 -24 -3 13 -46 -18 89 -54 15 27 -3 -59 62 41 -7 -14 83 -103 63 -22 -153 11 -46 120 -69 107
5033 107 -88 -3 -13 33 -48 -52 -103 57 -30 32 42 79 -126 63 23 -88 -3 -87 -15 -75 33 54 -18 7 -7 35 43 22
5061 22 35 50 -53 -4 -31 -65 -36 -33 5 137 79 -67 25 137 5 -7 -29 16 28 35 -60 79 46 -14 -71 -78 34 23
5089 23 -37 79 -84 -10 -69 -139 57 5 -7 12 9 -1 4 -2 69 -58 -15 29 22 -107 101 88 1 -137 83 46 -79 159
5117A59j80o9P5M7N2j13n6O8m7N1L5o9J2L0k5P4M1K0j35qM3J9m6J4j25J69m6K0
5145A0M1L8j27J01m8n7R7j28O2N6k1l9RMj0l0j6M0K4O4q5N8p8l6K0Q9n7j13Q3
5174d9N8k8k7L4M6Nln5o4K35k08J30n4m7m0M2N5N1n0j36J59r6P9%q7J61j14q7
5202i0J29K7j52N5OP3p9k7j0M3l8N1J3qR9j01j16J21o3O8k9J14o8r7J35j51O2
5229c3R2L9n5l5o5N1p0P5%l6Q7k4m4rn0k9%O8M4o8P6l3J0j1lJ10j64N2l8M7R4
5260G8m7r1L9J10k4l2M6j00j6J09j33M2K7p4N2o5R4Q2j18L8K8J11j42r2O6l1J8
5287b5o1J03jp5O5j87J72j39K10j40OR2N6j08k5L6MrP0on7J43o6J8p5j7j32M8
5315a00J33J06r4n5L3p7k6J23n0k5P7j2Qj6p8on0J33p0k8O6r3J82j56J15j43J11
$$ plain form
5117 159 -21 -90 -15 32 84 -29 -85 -17 -64 -13 22 -47 -35 -5 -30 44 85 105 -30 -38 5 24 -22 -8 -133 36 -10 10
5145 10 51 89 -38 63 15 -42 55 -73 -11 45 24 -15 -6 -2 -12 -42 -58 -18 6 70 -15 43 -35 -71 -51 38 -19 -132 -49
5174 -49 9 -19 -46 -12 34 39 36 -19 -83 152 -56 74 20 -27 -67 -25 30 81 31 -105 54 -42 37 37 -50 111 -3 -90
5202 -90 39 66 -86 -31 -25 48 -31 -58 -68 -25 -63 -12 1 -7 92 -9 -125 -4 -67 1 -28 86 18 -79 56 -95 -33
5229 -33 59 98 43 8 -57 -6 -76 -1 -1 -37 50 26 -18 -27 -77 -106 -106 -38 6 -62 14 -19 -9 -20 -23 87 -77 -25 -63 -16 78
5260 78 31 -60 -21 89 65 33 79 -21 -37 72 -61 -19 8 -66 -14 -79 15 97 -21 17 45 156 14 -78 -12 -43 -25
5287 -25 -86 17 16 -59 6 -181 -9 -148 62 -78 -72 20 76 -32 -57 -21 -17 -26 44 38 -19 124 58 76 1 -16 -148 -100
5315 -100 33 139 45 -10 23 -54 -80 43 -7 -32 45 33 41 25 -53 -59 -109 24 -46 -74 -8 -101 81 -75 40 -103 8
5342Hj24Q4M1PL3l9J4M6l6j6o0Q4q5J6M0O9r8N1l6q3o6J42n2N3nL0j16J13Qj07
5372h4l8O4M0m3J8J20K6j35j7L8j3L5N0r8O4M6p1J1J11k32J36R3j69j7J84j47
5398b8P6r4P6l7J34p5j9pN1K1m2j65J61j05p9J71k1q5N1L8P8r6n1R5K5j00m1J08
5426D0k7m8Q5j30J27j4q2k4M5n6M0O8n2%J7M6N2o8J6k0j29J58j66K20j45M2J00
5453I5k4n6j95L5J10O6n8j20J35O7q0LL8L6q8ol1O3K2l0J2L6J4L0l3M3m6K8N7
5482A23j04q7Q9m7O9mj4j0j8L4o7L1r4J14q0n2K04p8o6J05m7r6LJ46o9l3O0n5
5510d3N9q4J53p7L1j13J39k3l3P6o9m0%n9K14j23j3O0n2Qk1M9j01k2J39l1M6r8
5538b8p8N3O7o0PO5J8j23M4R1j75J89m6j93J75P7nQ2j39J34j84N5o2K3J36q1m
$$ plain form
5342 8 -116 -32 9 16 49 10 24 70 34 18 -42 42 -43 -27 13 82 -16 35 -1 -84 -150 -8 -60 -7 -12 18 -98 15 23 -84
5372 -84 -122 -58 -18 -61 -43 77 103 -32 -49 -11 -24 11 61 -37 27 73 2 13 124 -108 28 121 -48 -65 119 -28
5398 -28 48 -46 30 -7 127 52 33 26 77 98 56 -109 52 -53 -132 39 18 -67 -16 22 100 4 -47 48 73 -27 -68 40
5426 40 13 -35 50 -80 47 33 -49 -73 -28 -84 -44 24 -28 -28 -11 35 87 19 35 15 -114 44 -122 98 -47 -5 95
5453 95 71 15 -180 -145 -35 31 -27 -147 -12 55 -25 -22 16 52 -36 -42 -73 -10 12 -18 -6 30 44 74 41 84 38 66 123
5482 123 19 -68 21 -26 43 39 25 15 -3 31 -36 -5 -99 15 -65 -117 87 9 -57 48 1 -95 -92 54 -15 -48 12 -43
5510 -43 16 -68 85 8 39 -74 65 42 9 85 16 -24 -24 -83 131 8 -5 55 3 11 -10 39 -62 -84 55 24 70 -28
5538 -28 -106 -53 14 -46 -39 26 44 -79 -35 56 -119 70 24 -169 6 83 78 160 21 155 -29 26 -36 -13 123 42 38
5565C8j28jJ71p2K1n0J8m0o4J21L1OP2k07j9O7L2n6Q9Q2j10p3P0K1l8k6M5q9M1
5594d8J04j7J1o8R3l5lj1Q4j67P8j2K4Pp0N3M0m8jR5n4qK6L7k16M4O5m4J05j42
5624g8J00k7Q5L0j55J46Kk03N8J9L6j13K91o9j13j32K43j94M5m9Q6JJ7K5l5k6
5650a0N7o8l3K2KP8j4q3M9N2j10N1L5Mj29R0K5L4j23P0Q6O1j54r8O5J53j81M3
5678b6m1M3PJ7Ln0M0O5j99J11R2l9l3j1J04o1P0q2P4p0m3J62p2j12L3j7ql5r9
5707a77K60m5o8r5M3L0j6J69k7j13J4P7p7P6J07q4j19J12j02J38K8j58RJ0k1J17
5733H8n0J4q7qJ27q1J5lJ18n2k8k2K1q5L0n9O0q6J2J6J50m4o2J48o5p6q4K54j62
5762aM5M5j01k4J07j35J7J79j85J47M5j47K8o5L9j6n8J23q7J34k0k03J20o2J61
$$ plain form
5565 38 -90 -91 80 8 29 -21 -3 -43 -107 14 45 51 123 -84 -103 -36 -4 -60 29 111 1 -72 -2 19 -19 -45 0 -89 -48
5594 -48 56 39 50 -18 75 40 37 26 110 -57 21 9 33 40 -30 23 63 15 14 109 55 47 73 110 -106 -62 3 -41 64 -78
5624 -78 22 -5 80 110 -45 101 103 -100 -42 -23 13 -100 191 122 9 -123 120 -74 -29 -78 8 9 26 51 16 -10
5650 -10 47 -21 -54 -32 -30 48 34 -49 0 52 -58 -7 28 32 -97 -7 18 52 -71 -1 85 146 -8 -106 -41 112 -69 -26
5678 -26 -67 -24 -17 0 3 -47 -7 58 -141 -30 62 23 -10 -21 83 22 92 10 84 14 -29 133 61 -51 -18 -35 -43 -78 -177
5707 -177 83 38 -30 -125 -82 -52 -68 101 74 -39 -25 52 -25 51 158 74 -45 67 -35 103 131 -27 -18 -8 -29 88
5733 88 38 52 -35 -43 84 3 18 15 133 81 53 31 52 -33 -3 -62 -2 -88 -76 -60 90 46 -16 132 67 -9 -93 161 -1
5762 -1 44 89 -12 -36 71 -64 -47 132 -53 94 139 -8 20 -45 -6 -22 -80 43 -44 90 70 -133 -13 -75 86
5787H6p8P4o3o7MJ14M5p9l8M2m7k5n7J04j2NL9Q7m6l1N9j54M9k3m6J02j1k9n9
5816e5J36q0K7j09R0J00j17M3Q4j16M3nn1m4qK9l0R6n0j2n1N9M0m8L0O3l7N4p8
5845Co2J16p8j8K1P4k3K4K8n2N0k5j09k3J74l4Nj57Q9J06j6j06M1Kj7n3N9J8J8
5874E5m8r7L0J4J10j22M8m7L0q9J26k9j07J57k8l6M5j04L8J32j0j43K8M6r1R6
5900Do1O0M3Q4j60M2n2q0K12j00k2RK6L7p2L6m2J15j48J00L1p9p0O6k0K7n9P7
5928DJJ3P1mp4j23K35j98J87j96J24OJ3j29P2L5K4q2J72k29Mj8J34k6lmO9j35
5956e7l7K9J08O1j00J7p3K6n6M1M2o3N8J15k00R3j08O6L8omj24J62R5j20MN4n6
5984Ek5j16J45K2q7J29q1N1k5J5j88J74o2L7k5O9r5J57k39J21RR7o7J4j70J12
$$ plain form
5787 86 8 82 19 -48 -44 70 115 36 -2 40 -7 -32 -89 15 3 8 47 134 88 57 116 -38 11 -12 -58 44 33 4 -55
5816 -55 81 1 28 -81 9 109 -8 35 119 3 46 41 -10 -54 -62 -33 -63 33 -17 -29 -80 -21 19 -29 1 64 27 81 3
5845 3 -59 57 -21 -39 -18 56 33 57 85 33 83 58 -51 -74 100 66 71 -86 3 109 93 -13 28 30 13 -40 19 37 55
5874 55 7 -90 -60 -46 64 -58 -10 -57 -27 -116 10 -19 -126 31 3 -33 12 -92 -54 78 68 -75 -47 -1 -92 4
5900 4 -57 3 46 130 -30 12 -40 -120 92 -8 -30 -21 5 42 -30 6 -36 79 -69 31 62 -17 -87 -21 -41 -14 -73 4
5928 4 5 18 89 85 11 -112 123 -75 112 -84 40 46 59 -70 2 37 61 -21 151 -78 -74 -92 42 16 13 9 78 -57
5956 -57 -94 -65 43 104 4 21 -52 -26 -82 -41 1 -62 -4 111 -89 4 -104 -38 0 -6 -10 -134 28 123 3 7 61 5
5984 5 -20 -136 9 31 -56 73 -8 43 18 33 -155 19 -43 -6 -31 38 -57 100 -139 -18 -9 88 21 35 -135 -23
6010b3m3J19j25L1K0J26j84L9J3J3J8j32J72k2P2j41O6L9k13J30R1j61J79p6m3
6035c5j4J2J0M9nO2j10N1o8k2K06j73J6M2J0k7L1j06P5m8K4K3N9j19O2L7n9Q3
6063F6p1M2j06J35o7k3n3N1j2P0j11J95j39J3J13j66J16r0o0J1J39k7Qj25Q9j1
6089a3M0q4M5N8j15K2l4M9O6j07J83p6k0q5P0n0Q1Oj9m5J03m9k4J50p8J2p4Q4
6117I6j36l7M0k2Q5j03J39Jk2O6j3o3Pk8p0N8k1Q8j20J25j29Q4m5j5J31j30J02
6144F8j38O2j63J28R9L2j32QrJ37n9l3q0O6J07j57rK3J00n7J1N3j28K7M7Q1k3
6171F1q4J1n5OL6m8L4NN0k00J20Q5N0nj11M4q6M5R1oj31M7J45j48J6O8LM0n8J9
6201D4q4R9lj60Q3kJ8K7j20J33Q9j23p3J40O5j97J10q7j44J12P9L5p9P3nRr7K1
$$ plain form
6010 -23 -66 53 -72 -41 -21 105 -79 -40 -27 -14 4 -128 44 22 94 -47 19 58 -155 -25 66 -95 84 8 -35
6035 -35 -49 -37 -27 22 17 79 -31 20 -48 -70 136 -37 -21 21 31 4 35 -71 4 -44 -20 3 62 -57 5 42 -17 66
6063 66 -5 37 -69 66 -1 -24 -77 -26 -38 32 -79 116 -23 -10 103 -63 53 -37 -97 -86 53 26 34 -91 -2 -13
6089 -13 27 -57 -12 46 -69 -47 -81 -32 34 -73 110 34 14 -71 -1 -51 30 36 17 -28 75 26 2 152 74 86 12 96
6117 96 -40 -77 -37 -59 26 -77 62 63 41 107 94 31 38 10 -60 -2 -23 65 -55 70 -59 25 -20 -35 96 -34 68
6144 68 -70 -8 -171 -43 56 88 -44 -36 -45 92 33 0 -80 -14 93 -64 -73 -50 50 -7 4 57 -71 -44 3 84 61
6171 61 -23 -12 -67 -61 -25 -73 -39 -34 16 -184 -64 21 71 66 -45 -1 -87 -42 49 43 -88 -41 104 -44 -28 40 43 83 25 44
6201 44 -40 59 56 -104 -21 -23 -5 22 -98 35 124 1 -72 68 133 -64 46 -41 -185 -73 6 41 -38 35 30 39 -58 -37
6229c7J09n2L3j17o8J35l1M3q2J16q5J29j29Q7Kj06J54q4N2m1o2N1o7J20j31N7
6255dM3n7n6L2K5p2O6J5oL4j32K14N1j39o6O8j58J70J7j42J08QP3j05rkKN6L7
6284G1n4roQ4j42K5K2jq7N8Q5J1q9Q2j77R0Q3k3Mo6j6lJ2P9Q9j67J6MQP4l8J07
6316A26l4j20M9q1R8n8k4OJ17j49J32J2k3N9n0j22L7P0k0L1j61N4J19j27J07j18
6342g0J50j04K7pq9J47J3p7qo5O6J24j21l3K7mnJ34Lj55o8J86k2n0o1R0o8J19
6370G9q9m8j07J60RK2rn9k5L3J08K8m6j6k7p8M4J5On7N2pl0mO6m6knO5Pk9q5J33
6403E8p0J5K2P4j88P3j3J35j07p0pJ86j58L1Q4m4O5r7L3j4q4j5J23j00M9M8q1
6430e2J1K7K4j8K0j4j9J9o7J68p8l3%M7jM8j9j23J50j71J21o1P9%J0q5J1J0k5
$$ plain form
6229 -37 72 20 53 -64 -132 3 -28 15 -67 49 -36 93 -36 51 53 -53 101 17 69 28 -34 17 -50 70 -61 -4
6255 -4 39 -18 -74 -42 -17 -89 -23 -8 -14 20 -112 102 153 14 -52 16 -142 28 45 -97 11 19 92 -13 -22 -24 -22 34 71
6284 71 17 8 2 86 -56 -31 -9 -10 -97 -39 46 57 -32 50 -127 -37 46 23 27 -39 -55 -58 -46 33 122 -45 -29 -25 -17 57 19 126
6316 126 92 -28 21 -60 38 -20 -44 -38 79 -70 62 74 51 110 60 -62 -25 45 25 56 -105 -51 68 -59 48 -70
6342 -70 80 -24 3 -4 -93 54 67 -10 -18 -83 -17 107 -14 -47 -20 -24 -29 105 108 -47 -115 71 49 -1 -62 28 -40 79
6370 79 -10 -58 -165 -5 4 26 17 -42 -67 -34 74 102 56 40 13 -65 -21 -6 0 -57 -5 -12 -42 -46 20 -26 -28 -33 32 39 10 -75 58
6403 58 -12 3 25 99 -89 -16 -29 106 -1 -71 -78 108 -50 -19 65 21 86 -11 22 8 -76 -91 32 -68 -19 29 -52
6430 -52 -41 -14 10 -8 12 -2 -21 -2 -69 99 21 -12 -12 35 34 82 63 -60 90 -81 40 -21 58 58 68 -17 -6 4 -21
6459b1n9K4P1k5k9p3J85k9j63J62j40J52r6m4m1R6J6%j93J60P1j5Oj7R0j46m5
6486a03J0J43p3K1o4J08l7M9j41J24r6Q2J2Q4J5j84J38j23n8J49q8l9Q4Mj2o4
6512e9M6M3J4j57J52l1j43J01O1j03Q1j35R6M0nN2k9K7j08JJ7K5n4R9k3J2j5N4
6540E9p8J12j16K8J05r7l0J04p2j79K11oj03J16m6n7J60j90N8omq5N8P2l5J0R5
6567H4m2n7JP9p5m1O6m8j2N0m3k1J32o4Kr5M3p3R3p3J79j25J45q8k4P5k0o2n6
6596g0L0M9j40M9O2l8l9O2K1m9J37p5j01J44m2K3n9JR9j34R6Jn0k6j6P8r9L3J26
6625G3r0L6m3M4k9K1j22J09o2P3K6p1Q5m3J05j94J18K2j00n2J19M2r8M9j3p8N0
6652b3J7l0m9N1O2l0nR7q5JJ3MK1p2M8p6J19j5j1r8N7o5J13j01J4k9J31n3L8m5
$$ plain form
6459 -21 -80 -56 15 -10 -39 -112 73 44 -119 43 -97 55 -41 -85 -126 -30 -14 -14 -207 -47 24 9 15 -2 88 -58 -103
6486 -103 -93 50 -23 -2 -66 42 5 54 -87 37 -59 23 35 119 134 -50 88 -35 -93 56 -32 -71 13 17 5 -59
6512 -59 -13 30 44 -113 39 8 -135 -34 27 -76 5 -130 -34 6 1 53 24 51 -57 -56 -39 -14 -68 31 8 20 5 59
6540 59 -19 93 -23 5 110 13 -17 87 15 -164 47 41 -62 54 8 -49 111 -79 -21 -27 -31 -116 -58 14 -21 -11 84
6567 84 42 -15 -14 65 -10 -51 15 -33 -45 5 -38 -59 73 9 11 -84 -41 -114 -21 -94 85 -40 105 17 -7 68 48 -14 -70
6596 -70 -40 9 -131 -82 -20 -58 -97 -35 -14 -63 74 -1 -102 42 0 23 -36 -35 64 -70 26 27 -23 -49 -65 13 -86 -53 73
6625 73 -17 19 -24 20 -9 12 -110 -1 -63 10 36 -35 50 7 112 -82 36 58 -42 -94 25 67 -31 18 5 -73 -23
6652 -23 -6 -36 -85 -34 28 -2 -7 90 5 6 19 23 44 -28 20 -56 63 48 37 -61 -4 -69 44 -57 -43 -72 59 6 44 -1
6682aJ00o2k2o3O1P0j30q1R7O7k6j1L6K7j00j24K00lm9M8M3j53J64l6l2N9j11
6709c2KO8p0MJ1n4R1p0J33j32J3j0P0%k6j26J67p2j5K30j39K4r1k8J15o5Q1q6
6737gJ7k4o4nKk8J09K6l3M7j32J08l3n6M9J2M3m6jj6r5J26p5O9o2O6J4Qn7R1K0
6768G3j12q5P1PQ8ol0ML7j16K1R6q6n6P0K3Rl1J10j74N9J44o9j12o3J94l9o4J7
6797b0J14j13Pj13J50pK1m0j5p2O1J9L5j12R0P5j42N6J3L8l5j4M1k3Mo9J4K7R1
6826H1q9p1R0J13j68L0%p0O5pN3m9J5l7l7P0O0j23M8j0P8nL8p9L3j02J20l9p9
6855g1J67j62J59j32j52J08O6J04J4j50R1K3j23M0L4M3p3m0M4Q2o6P0j09K2N7
6880D6q4N1k0O8n8p9J23k9l2p7Q0j03R1N9k7rk7o4J64j02P4J09j87R8j28R6k2
$$ plain form
6682 -1 99 37 15 -48 13 83 -47 -128 -31 36 10 -1 35 62 -38 -162 38 35 -14 34 77 -76 88 52 20 79 -32
6709 -32 -30 38 -32 -28 -17 -71 20 -50 83 -49 -36 -46 24 24 -2 -128 39 -33 -48 182 43 67 -24 -52 63 -2 79 -7
6737 -7 10 -14 -78 -83 -81 -109 0 26 -7 40 -92 16 -17 -73 -24 -12 31 -15 -16 -32 -127 -1 -76 -7 -69 -3 11 19 -38 53 73
6768 73 -39 -124 -53 -46 42 36 6 10 47 -69 -48 48 -38 -94 -24 -1 8 -23 87 -87 -28 116 47 -65 -128 66 27 -37 -20
6797 -20 94 -19 -12 -125 25 18 39 -1 -16 -88 -27 -8 27 -85 5 80 -62 -6 7 45 10 -4 37 14 18 -51 -37 -10 81
6826 81 -8 -79 11 124 -44 -14 -14 -84 -19 -26 27 -22 -7 -44 -81 -11 49 -74 -26 -36 42 37 75 -4 29 -73 47 8 -71
6855 -71 96 -66 93 -39 -191 -83 -17 87 101 -49 42 65 -58 -18 16 59 -14 -54 -10 72 6 76 -33 -11 46
6880 46 -38 13 -7 61 3 -76 47 18 -14 -91 -11 -114 -23 36 9 0 -27 -91 73 -29 45 154 -33 65 -63 33 11
6907A1Kj18J18k3L3j48J49n1%l7J05%j34K30j26K3N4J2q3nL7q9O2kN3jqn3%n7
6937d6Q5p4J25l2JMr1l9J69n6j32L5J16r3P7k9P3K7j49L7L2m1N6j12Q8l4nK2J3
6966B7q7J19k6J4q3O2o8J03j3O5j33rL6j2N5j06P9j08J14m6O5p9m1LR8j9P9j36
6994d7j7JN9p5KP3m7K9j4M8m8R7O5j94O1J3J2L4n7k6Q0j81L8J01m3k2J11r7J56
7023A12j30M1r5J91l0j64O6k8J8L0j6p5O2N8o7kN2o2RP0J3o2k9J25Jl3rp4p3Q0
7053b1Q1j03J32o1q1M2P9m8j4Q8j37J06rMj15J33l3j7l3m3J07k0q8k4K8ok9PR9
7082B4K1j3o3K8O4j69J59r8Q3pj5Q1o9j3n8P8n2L0m7%M7l6k0J09j59J15J4m4J12
7111A02l6q0mR2J2p0M6j00L7O2pj24M1m4J39r9O9m8J7j08N8pJ23n3j7l0J11p8
$$ plain form
6907 11 13 -105 13 -10 23 -125 24 -27 -27 -64 41 41 -93 137 11 34 88 100 17 12 49 -40 22 20 73 72 64 11 11 -46
6937 -46 39 -35 90 58 59 63 -28 -67 102 46 -86 -51 65 -28 49 20 93 120 -29 8 40 -1 55 -57 31 -3 -8 14 27
6966 27 -60 59 33 47 -36 26 -42 61 48 113 -20 -29 7 -5 50 -56 23 -85 29 -17 48 -31 -72 -69 29 10 89 -47
6994 -47 -64 -63 -4 -79 -77 -4 -51 -22 -36 12 -36 61 126 -68 -7 6 18 52 -5 -31 49 -132 -94 7 -36 -58 53 -44 112
7023 112 -18 23 -72 119 89 -75 -9 -37 -19 11 -5 -80 -18 40 -27 -29 23 -39 -30 40 53 -9 -38 87 88 55 46 -28 -101 -21
7053 -21 60 -43 89 28 -53 -11 68 20 6 94 -43 63 54 58 -57 76 43 26 -7 -50 57 37 -51 -75 -47 -53 -82 -75 24
7082 24 45 32 -31 -3 61 -108 51 -47 36 29 14 95 26 13 -45 33 -19 11 -36 -36 11 -25 -45 64 -95 20 34 -10 102
7111 102 66 -14 -18 74 86 16 62 -38 -1 61 54 -70 -29 -73 66 -33 36 -12 5 -103 -45 -52 71 18 1 -29 82 4
7139DJ01j51Q7k4qQ8k05R6N3o7n9N9m1k0J75j02j19K09r9k0J49k10J09Jl8L6n2
7166d8Ll3K63j66nJ25k01J39m9n4J40p0P5q8p6J85q2p3Q1n3J2L8p5L8Ol8O7o8
7194gJ95j91J06q8L1J3J5k3j87K80q6n4mm8M6M9j75J32k4M3r5P4m6P3l2p7M5Q3
7222D8L6j93K18%j54rmOQ6o6j5n0J00j4NK8l1k1K4J02j59Q6o5J29j67N1R9j98
7250a28J45l2n6lJ48J7P6j25n8j55K66j18l9K0R6p4n4nO5j2n7J6PM0j18J06nR1
$$ plain form
7139 4 105 -46 41 17 9 97 -108 -12 41 -26 -85 -26 -67 -87 88 -14 -133 76 -23 -43 106 -104 5 6 -32 4 -48
7166 -48 -45 -78 185 19 14 139 -62 77 28 -26 114 44 119 31 -45 140 58 -15 66 13 25 63 -12 26 32 -6 61 -7
7194 -7 188 -3 103 15 46 59 74 51 -136 144 58 4 0 -48 -2 47 -128 4 -20 23 -72 2 -44 29 -3 -80 -35 48
7222 48 84 -109 109 109 -45 -54 -58 -52 34 -32 -47 -97 3 -11 -6 22 -9 -30 -6 96 -63 23 -42 87 -80 -29 70 -128
7250 -128 17 -15 -71 -74 74 91 167 42 -16 -171 95 -23 -62 -42 54 -20 -74 -79 -14 -26 -83 -67 -60 -20 -138 -32 -37 54
$$ [...]
8191A7
##END NTUPLES=NMR FID
##END=
