##TITLE=1H_DE-80H_X3
 200.13MHz, d2o
 8 sc
 
 19ns.26.2.2025
##JCAMPDX= 6.0         $$ Bruker NMR JCAMP-DX V2.0
##DATA TYPE= NMR FID
##DATA CLASS= NTUPLES
##ORIGIN= UXNMR, Bruker Analytische Messtechnik GmbH
##OWNER= pz
$$ XWIN-NMR		Version 3.5
$$ Tue Mar 18 15:22:44 2025 Russian Standard Time (UT+4h)  Yarkov@DPX200
##.OBSERVE FREQUENCY= 200.1313
##.OBSERVE NUCLEUS= ^1H
##.DELAY= (6, 6)
##.ACQUISITION MODE= SIMULTANEOUS
##.ACQUISITION SCHEME= undefined
##.AVERAGES= 8
##.DIGITISER RES= 18
##SPECTROMETER/DATA SYSTEM= spect
##.PULSE SEQUENCE= zg30
##.SOLVENT NAME= D2O
##.SHIFT REFERENCE= (INTERNAL, D2O, 0, 14.3821)
##AUDIT TRAIL= $$ (NUMBER, WHEN, WHO, WHERE, WHAT)
$$ ##TITLE= Audit trail, XWIN-NMR		Version 3.5
$$ ##JCAMPDX= 5.01
$$ ##ORIGIN= Bruker BioSpin GmbH
$$ ##OWNER= Yarkov
$$ C:/Bruker/XWIN-NMR/data/yarkov2/nmr/H-C/1/audita.txt
$$ ##AUDIT TRAIL=  $$ (NUMBER, WHEN, WHO, WHERE, WHAT)
(   1,<2025-03-18 15:20:14.32 +0400>,<Yarkov>,<DPX200>,
      <created by zg, POWCHK disabled, PULCHK disabled
       configuration hash MD5:
       00 E9 B6 7A A2 85 ED C7 34 08 36 98 17 FE 4E 26
       data hash MD5: 16K
       E3 DD 92 DF CF 09 AF 40 8D F0 29 4D 3F 83 EA 7D>)
$$ ##END=
$$ 
$$ hash MD5
$$ A6 4D 2C 9A 82 C1 A0 38 A0 6F 90 DC 68 86 18 FE
##$RELAX= 
##$RELAX= 
##$RELAX= 
##$RELAX= 
##$RELAX= 
##$RELAX= 
$$ Bruker specific parameters
$$ --------------------------
##$DU= <C:/Bruker/XWIN-NMR>
##$EXPNO= 1
##$NAME= <H-C>
##$PROCNO= 1
##$TYPE= <nmr>
##$USER= <yarkov2>
##$AMP= (0..31)
100 100 100 100 100 100 100 100 100 100 100 100 100 100 100 100 100 100 
100 100 100 100 100 100 100 100 100 100 100 100 100 100 
##$AQSEQ= 0
##$AQ_mod= 1
##$AUNM= <au_zg>
##$AUTOPOS= <>
##$BF1= 200.13
##$BF2= 200.13
##$BF3= 200.13
##$BF4= 200.13
##$BF5= 200.13
##$BF6= 200.13
##$BF7= 200.13
##$BF8= 200.13
##$BYTORDA= 1
##$CFDGTYP= 0
##$CFRGTYP= 5
##$CHEMSTR= <none>
##$CNST= (0..31)
1 1 145 1 1 1 1 1 1 1 1 1 1 1 1 1 1 1 1 1 1 1 1 1 1 1 1 1 1 1 1 1 
##$CPDPRG= <>
##$CPDPRG1= <>
##$CPDPRG2= <>
##$CPDPRG3= <>
##$CPDPRG4= <mlev>
##$CPDPRG5= <mlev>
##$CPDPRG6= <mlev>
##$CPDPRG7= <mlev>
##$CPDPRG8= <mlev>
##$CPDPRGB= <>
##$CPDPRGT= <>
##$D= (0..31)
0 0.7 0 0 0 0 0 0 0 0 0 0.03 0 0 0 0 0 0 0 0 0 0 0 0 0 0 0 0 0 0 0 0 
##$DATE= 1742296813
##$DBL= (0..7)
120 120 120 120 120 120 120 120 
##$DBP= (0..7)
150 150 150 150 150 150 150 150 
##$DBP07= 0
##$DBPNAM0= <>
##$DBPNAM1= <>
##$DBPNAM2= <>
##$DBPNAM3= <>
##$DBPNAM4= <>
##$DBPNAM5= <>
##$DBPNAM6= <>
##$DBPNAM7= <>
##$DBPOAL= (0..7)
0.5 0.5 0.5 0.5 0.5 0.5 0.5 0.5 
##$DBPOFFS= (0..7)
0 0 0 0 0 0 0 0 
##$DE= 6
##$DECBNUC= <off>
##$DECIM= 32
##$DECNUC= <off>
##$DECSTAT= 4
##$DIGMOD= 1
##$DIGTYP= 9
##$DL= (0..7)
0 120 120 120 120 120 120 120 
##$DP= (0..7)
150 150 150 150 150 150 150 150 
##$DP07= 0
##$DPNAME0= <>
##$DPNAME1= <>
##$DPNAME2= <>
##$DPNAME3= <>
##$DPNAME4= <>
##$DPNAME5= <>
##$DPNAME6= <>
##$DPNAME7= <>
##$DPOAL= (0..7)
0.5 0.5 0.5 0.5 0.5 0.5 0.5 0.5 
##$DPOFFS= (0..7)
0 0 0 0 0 0 0 0 
##$DQDMODE= 0
##$DR= 18
##$DS= 0
$$ [...]
##$SUBNAM0= <"">
##$SUBNAM1= <"">
##$SUBNAM2= <"">
##$SUBNAM3= <"">
##$SUBNAM4= <"">
##$SUBNAM5= <"">
##$SUBNAM6= <"">
##$SUBNAM7= <"">
##$SUBNAM8= <"">
##$SUBNAM9= <"">
##$SW= 18.0517328524113
##$SWIBOX= (0..15)
0 0 2 0 0 0 0 0 0 0 0 0 0 0 0 0 
##$SW_h= 3612.71676300578
##$TD= 16384
##$TD0= 1
##$TE= 0
##$TE2= 300
##$TE3= 300
##$TEG= 300
##$TL= (0..7)
0 120 120 120 120 120 120 120 
##$TP= (0..7)
150 150 150 150 150 150 150 150 
##$TP07= 0
##$TPNAME0= <>
##$TPNAME1= <>
##$TPNAME2= <>
##$TPNAME3= <>
##$TPNAME4= <>
##$TPNAME5= <>
##$TPNAME6= <>
##$TPNAME7= <>
##$TPOAL= (0..7)
0.5 0.5 0.5 0.5 0.5 0.5 0.5 0.5 
##$TPOFFS= (0..7)
0 0 0 0 0 0 0 0 
##$TUNHIN= 0
##$TUNHOUT= 0
##$TUNXOUT= 0
##$USERA1= <user>
##$USERA2= <user>
##$USERA3= <user>
##$USERA4= <user>
##$USERA5= <user>
##$V9= 5
##$VALIST= <valist>
##$VCLIST= <CCCCCCCCCCCCCCC>
##$VD= 0
##$VDLIST= <DDDDDDDDDDDDDDD>
##$VPLIST= <PPPPPPPPPPPPPPP>
##$VTLIST= <TTTTTTTTTTTTTTT>
##$WBST= 1024
##$WBSW= 4
##$XGAIN= (0..3)
0 0 0 0 
##$XL= 0
##$YL= 0
##$YMAX_a= 140794
##$YMIN_a= -194140
##$ZGOPTNS= <>
##$ZL1= 120
##$ZL2= 120
##$ZL3= 120
##$ZL4= 120
##$ABSF1= 10
##$ABSF2= 0
##$ABSG= 5
##$ABSL= 3
##$ALPHA= 0
##$AQORDER= 0
##$ASSFAC= 0
##$ASSFACI= 0
##$ASSFACX= 0
##$ASSWID= 0
##$AUNMP= <proc_1d>
##$AZFE= 0.1
##$AZFW= 0.1
##$BCFW= 1
##$BC_mod= 2
##$BYTORDP= 1
##$COROFFS= 0
##$CY= -3
##$DATMOD= 1
##$DC= 2
##$DFILT= <>
##$DTYPP= 0
##$F1P= 0
##$F2P= 0
##$FCOR= 0.5
##$FTSIZE= 0
##$FT_mod= 4
##$GAMMA= 1
##$GB= 0.15
##$INTBC= 1
##$INTSCL= 1
##$ISEN= 128
##$LB= 0.25
##$LEV0= 0
##$LPBIN= 0
##$MAXI= 10000
##$MC2= 0
##$MEAN= 0
##$ME_mod= 0
##$MI= 1.114404
##$NCOEF= 0
##$NC_proc= 0
##$NLEV= 6
##$NOISF1= 3.799351
##$NOISF2= 2.8
##$NSP= 1
##$NTH_PI= 0
##$NZP= 0
##$OFFSET= 14.38212
##$PC= 1
##$PHC0= -1193.951
##$PHC1= 20.19223
##$PH_mod= 1
##$PKNL= yes
##$PPARMOD= 0
##$PSCAL= 0
##$PSIGN= 0
##$REVERSE= no
##$SF= 200.129724274929
##$SI= 16384
##$SIGF1= 3
##$SIGF2= 2
##$SINO= 400
##$SIOLD= 16384
##$SREGLST= <1H.CDCl3>
##$SSB= 0
##$STSI= 0
##$STSR= 0
##$SW_p= 3205.1282051282
##$SYMM= 0
##$S_DEV= 0
##$TDeff= 0
##$TDoff= 0
##$TI= <>
##$TILT= no
##$TM1= 0
##$TM2= 0
##$TOPLEV= 0
##$USERP1= <user>
##$USERP2= <user>
##$USERP3= <user>
##$USERP4= <user>
##$USERP5= <user>
##$WDW= 1
##$XDIM= 8192
##$YMAX_p= 0
##$YMIN_p= 0
$$ End of Bruker specific parameters
$$ ---------------------------------
##NTUPLES= NMR FID
##VAR_NAME=  TIME,          FID/REAL,        FID/IMAG
##SYMBOL=    X,             R,               I
##VAR_TYPE=  INDEPENDENT,   DEPENDENT,       DEPENDENT
##VAR_FORM=  AFFN,          ASDF,            ASDF
##VAR_DIM=   8192,          8192,            8192
##UNITS=     SECONDS,       ARBITRARY UNITS, ARBITRARY UNITS
##FACTOR=    0.0002768,     1,               1
##FIRST=     0,             0,               0
##LAST=      2.2672688,     0,               0
##MIN=       0,             -194140,         0
##MAX=       2.2672688,     140794,          0
$$ Real data points
##PAGE= N=1
##DATA TABLE= (X++(R..R)), XYDATA
$$ [...]
1578A38q0P9k32J93j39n5O6J21K4k94J94P6J17k31j9j13J26kn6j4J60r6p6J40
1602B7L6o2l2J66j09P6J39l43K11m31M01k85J67J45k51K34j41j22K46L9k87J43
1624c3J38%J38j85q1K27j47k9j82L93j42Kj5m0m2K50k43lq7R3L6r3J9j06J86R4
1650A48j31j48J8J82J40l35M6L48o5k61J88J87k66j36K01m9P8j80K34n1J3l9j27
1673erO9r3j24L25l53J50K69k69l6j9L07p4r2q9M9Qm2L9n5j2K9l1M6j24L89m4
1700B09Oj94Nj5j07J75j08J1n2L45k93j17j28K48Q8j0pk53K55J48q4j43m7P7q6
1725g7N3J47m3n4j21L7l2K4J48m6j00J47j2Qj85K81jj37j33p8J23J12P9O4n1m2
1751A11p1j22K79l49K06O5j71Oo0R6j66K56kJ16k59j28K48P4J9j01l1j12J62k28
$$ plain form
1578 138 58 137 -95 98 -41 -96 -30 91 115 -179 15 91 208 -23 -42 -155 -29 -31 -87 -101 59 -37 -113 27
1602 27 63 1 -31 135 26 102 241 -102 109 -322 79 -206 -39 106 -145 89 -52 -174 72 111 -176 -33
1624 -33 105 105 243 58 -23 204 57 28 -154 239 97 99 84 44 2 252 9 6 -81 12 48 -45 -26 -132 54 148
1650 148 17 -131 -113 69 209 -126 -80 268 203 -58 130 317 51 -85 116 67 145 -35 199 148 161 122 -5
1673 -5 -14 55 -38 -162 163 -190 -40 229 -40 -76 -95 212 138 46 -43 6 14 -28 11 -44 -56 -27 -58 -12 -136 253 209
1700 209 215 21 26 11 -96 79 -29 -18 -70 275 -18 -135 -263 -15 73 63 56 -197 58 206 122 -21 -68 9 -77
1725 -77 -24 123 80 26 -95 -58 -90 -66 82 36 -64 83 71 79 -106 175 174 37 -96 -174 -51 61 140 204 153 111
1751 111 40 -82 197 -152 54 119 -52 -46 -106 -10 -176 80 78 194 -65 -193 55 129 148 47 16 -96 66 -162
1775a62Q4J04j61K61m0r0J68l81M12j20N7j84on7K81j62M1Q4j83m3J08KPPJ14
1800A41r5K84m87P6L7%J08M5j54M9q8M9J63j94j0kQ3p1K13l33J45j62M05m46K96
1825E2m6r4j8O3j02K25O4j34O3r7J90r1j54J72j07L8k03J70n0m7N4P7k24M7K38
1850H6J1P2j41J9l2j08N1n0K30Pj50j3j7M3Np8K4N8k19N2Q9p7LR5m8K41k31P3
1878emk2K7K04l59J17k09J51J35j21J87Pk4n6Q0j22j14j3lO3K46j31p7p4M6J28
1904E7j0R3j32j52K07k5O0J5j25k6K2J21n4K65l07o0O6L8Q6j50j17j00J97%k6
1929e7L9OJ48Mj48Q3j95P1K8K37j60K01j19m9k75L48k47K86Qm51J72l3K70j79
1953a2J76j36K6n6N1k50J73J81q0P1j94N9j87O4L54j64J10j48P2j40J39o8q2J37
$$ plain form
1775 -162 -78 26 -135 126 86 -4 164 -217 195 75 132 -52 -58 -115 166 4 45 129 -54 -97 11 13 20 27 141
1800 141 46 330 -157 -81 -44 -44 64 109 -45 4 -84 -35 128 -66 -76 -78 5 -66 147 -186 -41 -203 202 -244 52
1825 52 6 -88 -106 -43 -145 80 144 10 73 -24 166 75 -79 93 -14 24 -179 -9 -59 -106 -52 25 -199 -152 86
1850 86 97 169 28 47 15 -93 -42 -92 138 145 -5 -18 -35 8 13 -65 -41 17 -202 -150 -61 -138 -135 -40 -88 153 -78 -5
1878 -5 -9 -31 -4 200 -159 -42 -251 -100 35 -86 101 108 84 28 108 -14 -128 -141 -144 -81 165 34 -43 -117 -71 57
1904 57 47 140 8 -144 63 38 98 113 -12 -38 -16 105 51 316 9 -51 15 53 139 -11 -128 -228 -31 -31 -57
1929 -57 -18 -12 136 140 -8 75 -120 -49 -21 216 56 257 138 89 -186 162 -85 201 209 -242 -70 -103 167 -12
1953 -12 164 28 54 -2 49 -201 -28 153 73 144 -50 9 -178 -114 240 76 186 38 110 -30 109 41 -41 96
1977I6j61R7j41J20j10K11j1J9j04r3R7N0kk32J94L3L1j83j3pO8J58j1NJ69l87
2003a07K18J53k32J62j48l4j2N4q1J33J58k36n0J06j68J00Q6p8P0l1j74J27r9
2026h3k25L26l8j5mJ17L0j23R9O2l90N2K12J11r5J7j28m7J52o6J62j33O5j38K36
2051A56o8k54J65N4N8j00j07O4J4j53N6J01Rlo2M44k37q4m6l8N7J93r1j92K39
2076A75j62l6J0n2m9N8M9L0q3q6P5k2J1J01J16r2Rj67J89j14q2N6k6P5K40k65
2102d2kJ27jJ27l15L32j20k37K41J79j96r4P0o5J14j95Q1K67k06n1j9j16K33k19
2126a07J68J5q2K05k61K0Q2j5J64k63J44j20N7J14j17K08q2j43L5kK8o0J11k38
2150a39K27J45k25Q7o9P5j94J87j28P6j0Q9j22J6j03J37n7J64j18O4j52J35j2
$$ plain form
1977 96 -65 32 -109 11 -99 112 101 120 16 -77 20 70 68 -164 30 63 94 -89 -102 -109 -41 117 106 111 280 -107
2003 -107 111 264 32 194 46 12 0 54 -27 106 264 28 -22 84 -84 16 102 24 94 63 -111 16 -83
2026 -83 -308 18 -20 -35 -39 78 108 -15 84 146 -244 -192 20 131 36 53 -75 -122 30 -36 126 -7 58 -80 156
2051 156 88 -166 -1 53 111 11 -96 -32 -18 -171 -115 -14 -5 -8 -70 374 137 53 7 -31 26 219 128 -64 175
2076 175 13 -23 -13 -65 -114 -56 -7 23 -60 -146 -71 -93 -82 19 135 43 52 -115 74 -40 -122 -66 -92 -17 223 -42
2102 -42 -44 83 82 209 -106 226 106 -131 110 289 93 -1 69 4 118 -77 4 271 65 14 -5 -121 112 -107
2126 -107 61 76 -6 199 -62 -42 40 25 189 -74 70 -50 7 121 4 212 130 -13 22 20 48 -12 99 -139
2150 -139 88 233 8 95 26 101 -93 94 -34 42 32 121 -1 15 -88 49 -8 156 38 102 -50 85 73
2173G3p8o0J46n1p2P0p5j12k1J5Q8K14m8j37j22K29j41Q0j11K80j25n7j1M11j36
2198B49l56O3l6J28q7Q9K9j24Q2R8k2k44J66m2j69J79J24O0j26K4j57K76k20R5
2222G9k50J95k0J6jr6J57l35J62K47k53J27j63J22L2p3l7J28lq4J05n4K13j45
2246F9J2L4r4j09J15N2l6j83J48l5j0M1J52n7l31P4K47J9j4o2N3k20p5j18K86
2271d2P3Ll4j35J93O0o7L1k16J59q8R6q8r1M09l17N2k8L1j07l1L6J21j67L8J70
2297F1k9J02j93LO5J09k6j50R9n0k43K72jk7o3j42P2J26k1K81k29M6m9J86Ol81
2323a76J11M5j01m8L34k6M6k21l69L58j04K65l00QJ13L9n8j1n3j76M59k25Q0N8
2347D8m5J97j93j14k6n9P2J32l0j56K91j55Q7l6J20l27m8L69n8l2M1l3R0k08K20
$$ plain form
2173 73 -5 -65 81 30 -42 28 -47 -159 -180 -165 -77 137 89 -48 -170 59 -82 -2 -113 167 42 -15 -26 385 249
2198 249 -107 -44 -80 48 -39 50 79 -45 37 135 113 -131 35 -7 -176 3 127 187 61 85 -72 204 -16 79
2222 79 -171 24 4 20 19 -77 80 -255 -93 154 -99 28 -135 -13 19 -54 -91 37 34 -50 55 1 214 69
2246 69 81 115 21 -88 27 79 43 -140 8 -27 -37 4 156 99 -232 -158 89 108 94 32 85 -135 -210 -328 -42
2271 -42 31 34 0 -135 58 118 51 82 -134 25 -63 33 -55 -146 263 -54 -2 -30 1 -106 -137 -101 20 -147 -109 61
2297 61 32 134 -59 -56 9 118 92 -58 41 -9 -252 20 19 -8 -71 -213 -141 -15 -36 245 16 62 13 199 205 -176
2323 -176 -65 -20 -121 -169 165 139 185 -36 -405 -47 -151 114 -186 -178 -65 -26 -84 -95 -148 -324 135 -90 -10 48
2347 48 3 200 7 -107 -133 -192 -120 12 -18 -174 117 -38 49 13 133 -194 -242 127 69 37 78 45 135 -73 147
2372A47PL0k6k75K54p8Q9k59J70K23m19J53K7j05j07J07r9K65k05N8j9j3J46M
2396G5j64R4k1J75k34K03l29K71m9o4Q2J69k6k33J09k4k8m7O2k22N2K10k76L85
2420A70j75%k6J35j88m0K70j98%K3j45K11m6j20J92r8pL91k93k5m3pj59K51j35
2445f2J68m8j25J88L8k64J97J3k80K44j2K4k73J41O0J14j61J23j44K16j80K11
2467A88q5k09p4K21q7M42j78l80J55l0q0l6J89M5n3j96K22k25J64q4J43j40J35
2490D7k49L16k5O1p0l58L26k31K36N1j12m0J22j07j7J59K19k93n5K1M4JnP8Q2
2515B01k28J0N2L6K7j56J41R5j76j66J8K67j13J68n3J9p3L0o7o4K3J45k16J76
2539I6j57J3k2J46j61j32P7J38l9n8J59j87J01q5K01n2n8n1K51j31j48J0%k1j43
$$ plain form
2372 147 154 184 158 -117 137 59 148 -111 59 282 -137 16 43 -62 -169 -62 -161 104 -101 -43 -62 -75 71 75
2396 75 -89 5 -16 159 -75 128 -201 70 21 -43 39 208 182 -51 58 34 6 -41 21 -201 -149 61 -215 170
2420 170 -5 -5 -31 104 -84 -124 146 -52 -52 -29 -174 37 -9 -129 63 -35 -42 349 56 31 -12 -19 -178 73 -62
2445 -62 106 58 -67 121 159 -105 92 105 -175 69 57 81 -192 -51 9 123 -38 85 -59 157 -23 188
2467 188 103 -106 -180 41 -46 396 218 -162 -7 -37 -117 -153 36 81 28 -168 54 -171 -7 -91 52 -88 47
2490 47 -202 114 89 150 80 -278 48 -183 53 104 -8 -48 74 -33 -50 109 328 35 -20 1 45 46 41 119 201
2515 201 -27 -17 35 71 98 -58 83 178 2 -164 -146 121 8 176 123 142 69 99 32 -32 -9 136 -80 96
2539 96 -61 -48 -70 76 -85 -217 -140 -2 -41 -99 60 -127 -26 -111 90 38 -20 -71 180 49 -99 -89 -89 -110 -253
2564b53K04J52j98O4n3M6K9j04J28j89J06M5K6J2R1j94J66P7pl11K34j52J3J83
2588A15k96J58j6N3L2nN1K06k90j6j09j4J92j44N9K85j22Q8l03p4J54J95j42n9
2612br1j8J48P1j66n9R4J30L7j85Q1l4R7j51J60k45L07l14J75J70Rj11l0q9o0
2637g6p3kL13j30r0L35l72K07j01K2n8J07m1m2Q6O1k74o6q0K23J77k27J04J02
2661A05k03n6J70K0q7Q2q3P0O7r3r9p0J75o4L00m98M12Nn4j38m2p7K3K25M1j54
2687b3J06n8k28J32K7L9L9O8j67K33k08O0k40L21j44Q9KP3p3q2R7L5j09p0j51
2712b32K80n1q3J00P6M6j30J95j52O5l71J61K42j35K8J28k08O7Q9j65O3l7J8k33
2736b39M86k29j50K71k93K58r6J27m2l1j04j05K89j70j72J93j21J54N2j39L6J62
$$ plain form
2564 -253 -49 103 -95 -31 -84 -38 -9 -113 15 -174 -68 -23 3 15 106 -88 78 155 148 -163 71 -81 -68 115
2588 115 -181 -23 -39 14 46 41 92 298 8 -8 -117 -131 61 -83 -24 261 139 227 -76 -150 4 199 57 -2
2612 -2 -93 -111 37 108 -58 -117 -23 107 144 -41 40 6 103 -48 112 -133 174 -140 35 205 214 103 73 -16 -76
2637 -76 -149 -151 162 32 -58 277 -95 112 11 33 -25 82 41 -1 85 146 -128 -194 -274 -51 126 -101 3 105
2661 105 -98 -154 16 36 -51 31 -52 18 85 -8 -107 -177 -2 -66 234 -264 148 153 99 -39 -81 -158 -135 90 131 -23
2687 -23 83 25 -203 -71 -44 -5 34 102 -65 168 -40 20 -220 101 -43 46 48 121 48 -34 63 98 -11 -81 -232
2712 -232 48 -3 -86 14 90 136 6 201 49 114 -257 -96 146 11 39 167 -41 26 115 -50 13 -24 -6 -239
2736 -239 247 18 -132 139 -154 104 8 135 93 62 -42 -147 142 -28 -200 -7 -128 26 78 -61 -25 137
2758A37p4j34J01L7N9qQ4j40j43Q7O9qj74J01jj92K16J27j52j3L1M3j68K57J1
2783A53p1j03k05J92m7J45j67J9p9K73J69k75O5L6r7L2k64K44RJ30k24J50K9j02
2807A2J42M5k84J06p0j51L08N4l6n4p5j07r0J59l5j7L4J29j08K0J6j57N4J47J99
2832B41o8k36K35k02J51j73RQ0n1m11L72K05j1j43M6J61l0m65J47K54N5k26J52
2855I2J22l32R0q9J54j3J2J18m03M05j46j59J62J41k93R2L6j28Q7K92k50L6M7
2878G3K2j86K42k98R0J2J04n6o3K3K06j68k82M50m15J13J30p3L0PJ20l4J21j81
2902a3R5r4M8K6qJ83o1k17k07K97P3j66N1j00J59L4j20l7r6J55p9O2l4j0kJ27
2928F6m4j07J4J42j24k20J99m4M3J67j87J79j48j30O8J89k8pR8l44N7J63N2k69
$$ plain form
2758 137 63 -71 30 67 126 118 202 62 -81 6 75 67 -107 -6 -7 -199 17 144 -8 -21 10 53 -115 142 153
2783 153 82 -21 -226 -34 -81 64 -103 -84 -163 110 279 4 69 105 8 40 -224 20 29 159 -65 85 114 12
2807 12 154 199 -85 21 -49 -200 108 162 126 72 -3 -110 -200 -41 -76 -93 -59 70 -38 -18 -2 -159 -105 42 241
2832 241 173 -63 172 -30 121 -52 -43 37 -14 -425 -53 152 141 -2 44 205 175 -290 -143 111 166 -60 92
2855 92 214 -118 -28 -117 37 24 36 154 -249 156 10 -149 13 154 -139 -47 -11 -139 -52 240 -10 26 73
2878 73 95 -91 151 -147 -57 -45 59 3 -60 -37 169 1 -281 169 -246 -133 -3 -76 -46 -39 81 47 168 -13
2902 -13 82 -12 36 62 54 237 176 -41 -248 49 122 -44 7 -93 66 100 -20 -57 -153 2 -77 -15 -49 -59 -61 66
2928 66 22 -85 -71 71 -53 -273 -74 -118 -75 92 -95 84 -64 -194 -126 63 35 28 126 -218 -161 2 54 -215
2952b15L83j49M1n4N2k45K85m9j58J22j82J10R0rJ40j86l4K6L90k70l4l6r3O4
2976a1J15j66K4Lk51K75J04j25J43m6l10J60J56n2j6p6L9K30l35N6J85q2J27n7
3000I0j27J76o4O6m0k82J77K3l3N3m9L7l7K34k42K30k57J51j47n0j39j12N45j47
3024E6r4r5K79j33J13k48J23J00j81j7J01P6j29r2R4Q7K0J78k55J19k35N6RP1
3048C%KN6r8L0j16O1N9q1J94j06L4n6LJ15j73J01J43k57q3L39j32M1r8q7J59K80
3075C33k47j18N7P5j2j72K44o9p4j8j23J14qn4o7J63j58L0l7K08j27J68q2J6q3
3100d1j1j44J5K05j91M4OR1J65j54J19j72j21K39j40R9k43Q3K07j91K05k2J05
3123A53j79M1L3l1K20k45l23M15q3%Q9k97L22j83J2l1J78j19Q2O8j28jJ9j37J07
$$ plain form
2952 -215 168 19 60 6 58 -187 98 49 -109 13 -169 -59 31 22 162 -24 -58 -32 358 88 54 18 -75 -11
2976 -11 104 -62 -38 -35 -286 -11 93 -32 111 65 -245 -85 71 19 3 -73 -34 196 -139 -83 102 20 147 90
3000 90 -37 139 75 141 101 -181 -4 19 -14 39 -10 27 -10 224 -18 212 -45 106 -41 -91 -230 -342 203 56
3024 56 -38 -133 146 13 126 -122 1 101 -80 -97 4 80 -49 -141 -47 40 60 238 -17 102 -133 -77 -68 3
3048 3 3 5 61 -37 -7 -123 -62 -3 -84 110 4 38 -18 -15 100 -73 28 171 -86 -169 170 38 79 -19 -106 53 333
3075 333 86 -32 25 100 88 -84 160 91 17 -1 -124 -10 -18 -72 -139 24 -134 -104 -141 67 -60 108 26 42 -41
3100 -41 -52 -196 -181 24 -167 -123 -117 -26 139 -15 104 -68 -189 50 -90 9 -234 -151 56 -135 70 48 153
3123 153 -26 15 48 17 237 -8 -331 84 1 1 90 -207 115 -68 -56 -87 91 -28 54 122 -6 -7 12 -125 -18
3148a8N4r9J14j68J9J00jp3m8j4J36M4k12J89J2J1Nlq2J17k37L57j67m3J52j66
3174b1J78j86LJ99q7k15m7J77k34J80R1j13P5K5O9j20O1k49K86j58K49k44J44
3197F3Qj72J34l4J63j9j80Q8J4j28Q7q1rJk15J52L91r0k55r9RM34l00j13K12k15
3223a54J82j31J10j26Q7P5r2j63K04oj70L0K62j77L7L4J11j08j7p5J45j06J84
3246A36l83L07J08j29l0L6lj5k8R5j41l8R2k08K02J02j18Kj9L3l9K5K0k44K11
3271b6k8k3pJ61P8l0j23m5J3j24m5K03j12J67J1j48N3J03m6M5j52Q1J28m7j5m2
3297C0Ok01M47J00k67j44L58l89O6m5K82l07J44j67K05N0k58J77k29J82n5M8m1
3320hM9N7n8o2J36Nj78L7jK6K2n7j8R1K0KL9j50j40L44j39j2P2Or5O5k9l5NJ08
$$ plain form
3148 -18 36 -63 51 -117 -98 2 1 -72 -120 -134 2 46 -166 23 35 46 51 48 -34 83 -154 203 36 -7 145 -21
3174 -21 157 -29 -26 173 86 -129 -176 1 -233 -53 38 -75 0 25 94 -26 35 -214 72 -86 163 -81 63
3197 63 71 -101 33 -1 162 143 -37 51 65 -63 24 -57 -66 -65 -280 -128 263 173 -82 -181 -172 262 -38 -151 61 -154
3223 -154 28 -103 7 -119 -32 43 -49 -212 -8 -14 -184 -154 108 -69 -32 2 113 5 -12 -87 58 -48 136
3246 136 -247 60 168 39 9 45 42 27 -1 94 -47 -85 7 -201 1 103 -15 -13 -32 1 -38 -13 7 -237 -26
3271 -26 -54 -77 -84 77 155 125 2 -43 -30 -154 -199 4 -108 59 70 -78 -25 78 32 77 -75 6 134 87 72 30
3297 30 36 -165 282 382 115 -29 329 -60 6 -39 243 -64 80 -87 118 168 -90 87 -142 40 -15 33 -8
3320 -8 41 98 40 -22 114 119 -59 -22 -23 3 25 -32 -50 41 61 63 102 -48 -188 156 17 5 77 83 -12 53 24 -11 -6 102
3350A02l00L6K48MN7j56j35K50M5o5K0P8j71m1M2Q6P4j59N4j19J14j12R5j09O4
3375Bn9j09O4K36p4k32K06r6J00j29Q9L3j0Q3k12j9J78Mp2r3j0L16k21K57j33
3400I9J00k93P8R9k68j2l9J1J32J6o8J25J03j84J11N4k41L3K19j80K17j84R1j8
3424Aj18J33M8j4k34J09J06j55J59p2q9J58M1jk4j62q4L03j45j49K67k47J72j03
3448a00j03K11rm3j13K48j4k69K67j72P5P3j42r8J75K8or5%O1N3j2N3k95K90J11
3474A74O6l54Q7k0l11K66L36j77j19Q7j08J12j78LN0k09M23j38j53J23n9J34j9
3497A6N6m1m6j3l3l1J47k00Q1q7R7K60l3j27j54J36m7J7K03j21L7k44j36L35j45
3522g3K03l08L66n09M51M6rm20J27O9K32l03K4K45q2k14M5j9K81l15J00L02j80
$$ plain form
3350 102 -198 -162 86 90 147 -9 -144 106 151 86 106 184 13 -28 14 100 174 15 69 -50 64 -48 47 -62 2
3375 2 -57 -166 -102 134 60 -172 34 -62 38 -91 -2 31 21 104 -108 -127 51 55 -17 -110 -120 196 -25 232 99
3400 99 199 -94 -16 83 -185 -197 -236 -225 -93 -77 -145 -20 83 -101 10 64 -177 -144 75 -105 112 -72 19 1
3424 1 -117 16 64 50 -184 -75 31 -124 35 -37 -126 32 73 72 48 -114 -198 105 -40 -189 78 -169 3 -100
3448 -100 -203 8 -1 -44 -157 91 77 -192 75 -97 -22 51 -91 -189 -14 14 8 -87 -87 -26 27 15 68 -227 63 174
3474 174 240 -114 -27 -47 -358 -92 244 67 -52 35 -73 39 -139 -136 -86 -295 128 -10 -163 -40 -99 35 16
3497 16 72 31 -15 -28 -61 -92 55 -145 -64 -151 -54 206 173 46 -108 28 -19 -2 201 80 117 -127 -263 72 -73
3522 -73 130 -178 188 -321 130 176 167 -253 -126 -57 175 -128 -104 141 59 -155 -110 -129 152 -163 -63 239 59
3545E9r9q6J28J01j79P7O5p7K48m00J55M7K3r8K7k73Q6O7L6J4rj28J40QJ97NO6
3572B00k34r3L0K29k81j9J14J3o9M1NK32k33J39J4j35R5o9Mj22J93J24j76J31
3596A33l55P9J9J24P6j69J0j27K5L01j15j55J93J37p7M3j79N9K5m0L3m1k17L39
3620A21k47j75L79m9Q4j05j62J55j27J16m2J56j67J49k81J07L12j69j13M1J27
3641A10q6J52m01L5O9J44J07q2o8M6k03L41j42q6L0j33O4M65k76q7rp1J58r3N
3666a1k2r0J72J5j24K02k5k34P5K54j83n2l8P5J46r8rj2J28k95K40k66K32rp9
3691ho4K5J30k55L15J4j88J62m6p3j4j43J30k33O5J60o1K9j9L0J09p2k3KK51k19
3717Dj75Q8Q3p7M1o0pj78K40j45N1RJ41R8j11r4J28QJ01Kk55O7K2K64k42r6k0
$$ plain form
3545 59 -40 -126 2 103 -76 1 66 -11 237 -163 -8 39 62 -36 -9 -282 -196 -129 -93 -79 -88 -216 -76 -68 129 134 200
3572 200 -34 -127 -97 132 -149 -168 -54 -41 -110 -69 -64 168 -65 74 88 -47 48 -21 -17 -139 54 178 2 133
3596 133 -222 -143 -124 0 76 -93 -83 -210 -185 116 1 -154 39 176 99 142 -37 22 47 7 40 -1 -218 121
3620 121 -126 -301 78 29 113 8 -154 1 -126 -10 -52 104 -63 86 -195 -88 224 55 -58 -17 110
3641 110 24 176 -225 -190 -121 23 130 48 -20 26 -177 164 22 -64 -34 -167 -103 362 86 -1 -10 -81 77 -16 -11
3666 -11 -33 -123 49 64 -60 142 117 -117 -42 212 29 -23 -61 14 160 62 53 41 169 -126 114 -152 80 71 -8
3691 -8 -72 -47 83 -172 143 157 -31 131 85 12 -2 -145 -15 -248 -183 -23 -84 -55 -74 -44 65 -7 -30 -28 223 4
3717 4 -171 -83 0 -77 -36 -96 -103 -281 -41 -186 -135 -126 15 113 2 -92 36 44 145 147 -108 -41 -19 245 3 -93 -113
3744a13K35j65J29O6K3o3q8J32k06lJ31k19J9L5K3J83j08J21j37JQ4kk11J23J83
3769A73k33q0J58N4j01m4rL11l5l10J52Jr9o5J76L0j69J16j38K5K4p1J72j76J39
3794Am4K33k60q3K49k13J91L8l6j28k3l4k9K2K45k03J56m6O0o8K36l23n0OR6Q4
3820G7j62M9N4k94K86K2j69K42k79J25P6K7j09J22P4j8M0l6o8J54j62r2K56j50
3844F5L9k62J87J93k55J4J60k67J88K5j67J92l19L03J15l62J93q0K10nj52O6j42
3867f1p0K05m9J02N8j06J2j67Q0J01k13p7O5J49j36J20L02m10o4K36j9O0j04K9
3891D3L5J3j40j9O8J09j36j69J74P2jq3j59KM33k61K07q6p8L69k38j50j06Q2m7
3916f6m5J28n1J00k09J68R6M8j49j6j78J81J05j47K63k99J3m6J2J22j38J55q6
$$ plain form
3744 -113 122 -43 86 152 175 112 24 156 -50 -53 78 -141 -122 -87 -64 119 11 132 -5 -4 80 78 -133 -10 173
3769 173 -60 -140 18 72 -29 -73 -82 229 194 -116 36 37 -62 -127 49 79 -90 26 -112 -87 -63 -134 38 -138 1
3794 1 -43 190 -70 -153 96 -117 74 112 76 -52 -75 -109 -138 -116 129 -74 82 36 96 28 264 -59 -109 -103 -7 77
3820 77 -85 -36 18 -276 10 32 -137 105 -174 -49 27 54 -55 67 141 123 163 127 59 213 51 -41 215 65
3844 65 104 -158 29 222 -33 -19 141 -126 62 87 -80 112 -207 96 211 -151 42 -38 172 167 15 81 -61
3867 -61 -131 74 25 127 185 79 91 -76 4 105 -108 -185 -120 29 -107 13 315 -95 -159 77 58 118 14 43
3891 43 78 91 -49 -68 0 109 -27 -196 -22 50 49 -34 -193 -191 242 -19 188 102 24 393 155 5 -101 -19 -66
3916 -66 -111 17 -34 66 -143 25 121 169 20 4 -174 7 112 -35 228 -71 -58 -104 -92 30 -108 47 -39
3939c9%K2m3J83km9K0r4J09q1J85j56j52K20r9p5K0M2O7j06O0k4J76r6o3j03O5
3966a3Q8L5o1k09J12n7M1Q1J35l5j77K03j38N7k24K51j78N8J65j40j3J04m2j33
3990i0k1J67j83J41q5j10Q2P8J42k16J45j11Q4k1o5M71k69k45K08q0j76K35j35
4013e4JM8K05j23Q2j09j11j99L31n4J63k04J3L4r7J99j60N8J13j05j10L41k36
4036B6k49Q6K47k53J68L9J3j9j56K80rm4l44m0L20J6r2j6J96M4j54mj00J1K09
4061A75J09m86K16j73J24K5M9k89K70q0J1j04J66O2m4k9n8Q3Pp8q4K07j43J47
4085H3lq3n9J02J15k14J31J3K6j86P9k0m9K6j61K14m2J6J79j86q4J05J83O1k09
4110C7Qj07k7J98j18J20k53J48%n2P7j67K6J98j1q0%n4J51l0m6j88J89J29j79
$$ plain form
3939 -39 -39 -17 -60 123 121 72 92 -2 107 26 211 55 -97 123 24 -51 -31 11 78 -28 32 8 184 88 25 -78 -13
3966 -13 75 110 49 -160 -48 -105 -64 17 152 117 -60 143 5 62 -162 89 -89 -31 134 -6 -19 85 43 -90
3990 -90 -111 56 -127 14 -71 -181 -99 -21 121 -95 50 -61 23 2 -63 408 139 -106 102 22 -154 81 -54
4013 -54 -53 -5 200 77 159 50 -61 -260 71 17 180 -24 -11 23 -74 125 -35 23 136 31 -79 262 26
4036 26 -223 -137 110 -143 25 64 77 58 -98 182 173 129 -215 -255 65 81 -11 -27 169 213 59 55 -45 -34 175
4061 175 284 -202 14 -159 -35 -10 39 -250 20 -60 -49 -153 13 75 31 2 -56 27 34 -44 -128 79 -64 83
4085 83 80 -3 -62 40 155 -59 72 85 111 -75 4 -16 -65 -39 -200 14 -28 -12 167 -19 -103 2 185 246 37
4110 37 45 -62 -89 109 -9 111 -142 6 6 -46 31 -136 -110 88 77 -3 -3 -57 94 64 18 -170 19 148 -31
4135c1p1n9NJ60J9m3j84k4K10J5J22k5j88J89n1j85J81OJ4o6K71n23k1M34j08
4160D7k30R9K07j49J54j16K3n4Q3m6N9n4J5p3J67k46K36j10j4J25j21R0j97L35
4184B30l54l1N4J86j73j7J2k9K75p2q5O2nj06MJ19O6j16r5J16Q5p5r5n3p5J09
4210f3J33k78L02j78O4o3r1R5J05j16o4L40j21n8j63K8N8K10n2o9J34l75M10q5
4234A03q7L9O5j10L8j60J4K22k72K27n9J27J4p4Jj71p9J01j11K39o2k03J98K3
4258B3j11n2K7J14K17m31K54m8%l0L9lJ13k08j00L66l6k67K40k00M5n6K39k21
4282h6J03j03n1K46j8j16L6mN7r3j0J70k48L9K58j08n9K16k05J61l68L0J89M5
4306H1r1L2P2n6r8JJ24q1J2p5P7K9M5J04l41j27O5L99j38Q8n2l1L4j23J3p6L9
$$ plain form
4135 -31 -102 -161 -156 4 23 -20 -204 -228 -18 -3 119 94 -94 95 44 -141 40 46 60 -6 265 -258 -279 155 47
4160 47 -183 -84 123 -26 128 12 35 -19 64 18 77 23 38 -35 132 -114 122 12 -2 123 2 92 -105 230
4184 230 -124 -155 -101 85 -88 -105 -93 -122 153 81 -4 58 53 -53 -49 70 136 20 -75 41 126 51 -44 -97 -172 -63
4210 -63 70 -208 94 -84 -20 -83 -174 -79 26 -90 -154 186 65 7 -156 -128 -70 140 88 19 153 -222 188 103
4234 103 16 55 120 10 48 -112 -98 124 -148 79 20 147 161 87 88 -83 -162 -61 -172 67 5 -198 0 23
4258 23 -88 -140 -113 1 218 -213 41 -7 -7 -37 2 -1 112 -96 -196 170 134 -133 107 -93 -48 -104 135 -86
4282 -86 17 -86 -137 109 91 -25 11 7 64 -29 -39 131 -117 -78 180 72 13 229 24 185 -183 -153 36 81
4306 81 -10 22 94 38 -60 -59 65 -16 -4 -79 -2 27 72 176 -165 -292 -227 172 34 122 70 39 73 -50 -37 -113 -74
4333g4r4j32L69n8J46j03q2K2p0L1j38K72k20J25N6pj10J79l13K11k08K90J61
4356B53k90K22j39N5j64j0K24l43K91n5Jp9J45j13p3P3%K6k23K15P5r6J48j40
4380CJ88r7l7j25J81k75J15j20K15k6R0j74P7p0q6J61n7nN1O7n7O5q7m1lJ29l30
4407b48K28o8K08l9p9j47N8J03J06K3j98q5K54l30J28J51r0%K86k19k3o5J48j79
4431g7M9J24j53j25K35K6p6J40L8M7k60K17k25J62K3r8k06L40j21rK9p5J70k03
4455b8R2K4m3k9n8q5m3M9L2J66j7j47J62j72P5J9m2K08k3j42M0O0j63J75j62J36
4481H4j1j13J52j91k06K48k9J2K3j80J41P6L2k44M0M21k16j3j09K43l88M66l67
4504a29J08J90k44j03K61L2k13J71O1j47o0J39j45J27rJ38k3j9L9j36N3l1RJ6
$$ plain form
4333 -74 -168 -300 69 11 157 54 -28 -6 -76 -45 -183 89 -131 -6 50 43 -67 112 -201 10 -198 92 253
4356 253 -37 185 46 101 -63 -73 151 -192 99 44 45 -34 111 -2 -75 -2 -2 24 -199 16 91 -5 143 3
4380 3 191 94 57 -68 113 -162 -47 -167 48 22 112 -62 15 -55 -141 20 -37 -42 9 76 19 84 -3 -44 -47 82 -248
4407 -248 -20 -88 120 81 2 -145 -87 16 122 145 -53 -138 116 -214 -86 65 -25 -25 261 42 19 -46 102 -77
4431 -77 -28 96 -57 -182 53 79 3 143 181 228 -32 185 -40 122 145 47 -159 181 60 51 80 5 175 -28
4455 -28 64 88 45 16 -42 -127 -170 -121 -89 77 60 -87 75 -97 -22 -3 -45 163 140 -2 38 98 -65 110 -52 84
4481 84 73 -40 112 -79 -285 -37 -66 -54 -31 -211 -70 6 38 -206 -166 255 39 26 -83 160 -228 238 -129
4504 -129 -21 169 -75 -178 83 115 -98 73 134 -13 -73 66 -79 48 39 177 154 135 174 38 91 60 69 85
4528H5k75K26j41O9l5j72L20k12l1L98l57K3N9j36K39Q5k59J98j62J14lJ22k08
4551e3Q7k43L59o0k3j71k3M3j6L5K7R8l18M48j35j75K46l0k03J31P4j76j7J82
4575H7j62k3R6pl5R4J3j6j58n3N2K27j70K2K68m08K6J69n0j53K40l91L33j28K14
4600H7M2r3j44K7Ql5K23l24K39N7j16J50k13J81j62M2J18j98K28p8n7Oj16o4J17
4625g5J78mnj22Ol6l3J74o5j28L0O5P6r6o1j39M21j24k55K98r0p3o2K21j83J90
4651A08q6j39lL9J29j01r5O0J11K15m24M9j96K33o5K79n0R3k51P9j63L91m46J61
4675g2J13M6k52K51k07J27LL1l7r0J18L5j20R0M7l2J57j43R7q4L8n9j11L0r1J72
4701E7o4J0J28k1j1k43J39k3n4j03L24J2L3j05l0j43R0J13q2Q6LK5k81R0R9k52
$$ plain form
4528 85 -190 36 -105 -36 -71 -243 77 -135 -166 232 -125 -102 -43 -179 60 145 -114 84 -78 36 33 155 -53
4551 -53 34 -209 150 90 67 -104 -127 -84 -100 -65 -38 60 -258 190 55 -120 126 96 -107 24 98 -78 -95 87
4575 87 -75 -98 -2 -9 -44 50 63 47 -111 -164 -112 115 -55 -33 235 -173 -147 22 -28 -181 59 -332 1 -127 87
4600 87 129 36 -108 -81 -73 -108 115 -209 30 87 -29 121 -92 89 -73 -31 87 -111 117 39 -18 -12 -128 -192 -75
4625 -75 103 99 94 -28 -22 -58 -91 83 18 -110 -80 -15 61 -35 -96 -235 186 62 -193 105 15 -58 -120 101 -82 108
4651 108 22 -117 -120 -81 48 -53 -148 -88 23 238 -186 -137 -333 -100 -165 114 64 157 -94 -15 -178 213 -233 -72
4675 -72 41 87 -165 86 -121 6 9 40 3 -87 31 66 -54 36 83 51 208 65 162 78 116 57 -54 -24 -115 57
4701 57 -7 3 131 110 99 -144 -5 -28 -82 -185 139 151 184 79 49 -94 -4 109 27 113 116 141 -140 -50 49 -203
4727b03J83j31K02l4j59K60j65J3J27r2j74n7L22J00j80q5P4j97k8K1K19J99k22
4750gnO6j23O4N2k33L77k69J38q5J58j13L7j38K9r0P1P0J82p7l6j06M0L0Q0r8
4776A4m7J29l8k3Qnj25k8J54k4n6J69K0j69k9N4J56n0j12M2j10R3J65j28p7J3
4802dNKP3j39J0l8J94N7q1R5n7j21M9q2M7K5Kr0p7P8P6jn0K4j05K82k15j40L12
4831A31j1j81K38n1j33P3m7J0k58O4L12o4k29k0pO4Q0l1N1o4J3K21l70L21j77
4856f5p7K45k00J02n6L6o2O3j05J00J03p6nJ4p6nQ8l5j6O%Q1k97L25q0jJ13n1
4884F9Q5l03Q2O7L7j82K19m1P0k8N2p6J62j79k14J65%k8P4m1J54l53K58Po9l6
4910d9P4J21j27k3o8k1L45j48j26Q3o4N9O4k85K4R6j79M76l04P1j43K14k73K62
$$ plain form
4727 -203 -20 -151 51 17 -142 118 -47 -34 93 1 -173 -230 92 192 12 -73 1 -196 -224 -203 16 215 -7
4750 -7 -12 54 -69 -5 47 -186 191 -78 60 -25 133 20 57 -81 -52 -142 -71 -1 181 104 68 -38 2 32 112 14
4776 14 -33 96 58 35 43 38 -87 -115 39 15 -41 128 148 -21 -50 4 160 110 -2 40 -70 23 188 60 -17 -4
4802 -4 1 3 76 -63 -53 -91 103 160 79 174 117 -4 45 -37 10 35 37 -53 -130 -52 24 23 -27 -3 -108 174 -41 -181 131
4831 131 120 -61 177 126 -7 66 19 29 -229 -165 147 83 -146 -166 -173 -109 -29 -60 -9 -73 -60 161 -209 112 -65
4856 -65 -142 103 -97 5 -51 -15 -77 -14 -119 -19 84 8 3 17 -59 -64 24 -11 -27 -21 -21 60 -237 88 8 7 120 69
4884 69 154 -149 -67 0 37 -145 74 33 103 75 127 51 213 34 -180 -15 -15 -43 31 -10 144 -209 49 56 -13 -49
4910 -49 25 146 19 -4 -72 -93 252 104 -22 61 -3 56 120 -165 -141 -45 -224 252 -52 19 -124 90 -183 79
4934G9j69K05m2k15N53n62J02J03j42P9Q8p0J5r7K04N3j44k10N0J57j42M4J01
4957D0Q7j37Q3j89K45j46o0J78k65L02k12j1J66k00M0J44j27O6N7k89P9K27k12
4980a34K0K29l20M04j02j44J21J63j33k26J52m2J14j61Q9P1n9L0j18J32j68L69
5002B87k56K2j77O6j7K63j78O1r1R0K5Jl8j66K62Lj53J41r7j93M8J3L3j29J4K05
5028C9k13K07k76L65j23j12m4P1om5J36R7j75K10j2j25J52o7j49J11J0J90l28
5051h7J9K27k65J8L94l40R6J6l61L18p1O2J12k87J51K17k41j13J06N2lj66k1J62
5075ej23K79l55K29R0j65l7l0J00J71j30J10j45j19n0K17J60k44om7J01N6j6l9
5099Bm9J16j45R4K93l68J89k04J8J73o4R7l98L29j63P2k9l1J46j31r5K14k39K13
$$ plain form
4934 79 -90 115 73 -142 411 -151 -49 54 -88 -9 79 9 24 -73 131 184 40 -170 -120 37 -105 -61 40
4957 40 127 -10 73 -116 129 -17 -77 101 -164 138 -74 -85 81 -119 -79 65 -62 4 61 -228 -149 78 -134
4980 -134 -114 115 -205 199 97 -47 74 237 104 -122 30 -12 102 -59 30 101 42 72 -46 86 -82 287
5002 287 31 53 -124 -58 -75 188 10 71 -20 70 95 96 58 -108 154 157 4 145 48 -145 -97 -84 -51 -180 -166 39
5028 39 -174 33 -243 122 -1 -113 -157 -86 -92 -137 -1 96 -79 131 119 -6 146 79 -70 41 51 241 -87
5051 -87 -68 159 -106 -88 306 -34 62 78 -283 35 -36 26 138 -149 2 219 -22 -135 -29 23 20 -146 -167 -5
5075 -5 -128 151 -204 25 115 -50 -87 -117 -17 154 24 134 -11 -130 -180 37 197 -47 -53 -100 1 57 41 2
5099 2 -47 69 -76 18 311 -57 132 -72 -54 119 55 152 -246 83 -80 -8 -37 -68 78 -53 -148 66 -173 40
5123D0k15K46j24L98r9k08jK18k8l30N9K66k80M5K8k1O3Q6j09m7k7o2Q3M3N4K35
5149C13n00J65p8K20j44j69J04N3K73k63J20j21p6p6J55J63k10O2l5m3P0N5k02
5172a64L11L8j61P1j2n6j88Q8J03J01l61Q5k8J05k7K36j23q1K14o0R0o8n5p8j2
5197c2l2J86k50K00j27M9%L0k85P7J21j27L30l4j79J89p1J11l89J84J8J76j55
5220a0K1m5k35J56J90j31Q2K04l05j83L09j33J12k9l3j36K9L59k36j5p4J18j95
5243a80L48k19N3j05j9OJ55L2j44J19j12rQ1j7j49J38J51j20L2l5JJ1L5j33M5
5268c5K39j91M9l1j02K35K2j74p1j4J17k6Q8k30K42j30R8n26M79l02J28J49j44
5291a30O7J67p7R8j90K84k95k0J34J3J34j46N4n9j27l6P4N0q9O7R5k7r8J08l6
$$ plain form
5123 40 -175 71 -53 345 246 38 37 255 227 -103 -44 222 -58 -13 15 -6 57 143 34 -13 -40 -102 -19 24 78 313
5149 313 -187 -22 -100 120 -24 -193 -89 -36 237 -26 94 -27 -103 -179 -24 139 -71 -9 -44 -87 -17 38 -164
5172 -164 147 185 24 95 83 27 -161 -73 30 131 -230 -145 -173 -68 -95 141 18 -63 151 91 181 113 58 -20 -32
5197 -32 -64 122 -128 72 -55 -6 -6 24 -261 -184 -63 -190 140 106 -73 116 45 156 -233 -49 -31 145 -10
5220 -10 11 -34 -269 -113 77 -54 28 232 -73 -256 53 -80 32 3 -30 -166 -137 222 -14 -29 -103 15 -180
5243 -180 168 -51 2 -103 -122 -116 39 71 -73 46 -66 -75 6 -11 -160 -22 129 9 41 6 7 18 53 -80 -35
5268 -35 204 13 62 31 -71 164 186 12 -59 -73 44 18 106 -124 118 -12 86 -440 39 -263 -135 14 -130
5291 -130 -63 104 27 125 -65 219 -76 -96 38 51 185 39 93 34 -93 -129 -55 -5 -94 -27 68 41 -57 51 15
5316A5k48J53Q4L0k55K44j03J91q3j27k8J66J17j65l7P7n1j08M4O6K23k77j11
5339a83K92k12K81j15j8K1k10l3L0O1J47j1p9n4j02J06O5J53k88J47j10R2q8J08
5363@J67j36M7k89N3PJ32J07j7j16O4o3N3L7L3j63O6o1n7K00l57K25k5n6J60N7
5389F8j90J43p2J01J06l89K14l7N8r9P1Q7k4m1q6j34J28K14j08n9J87k17Q2M8
5413E1j37K57k63j2j06J75M0p2q8J21K0j23J8J54n5J49j36n1K92k48J9n2k9J5
5437f1K73k17J09l1k32M9J13nj2m7j80L87l70K27m6j09k4L15j27N9o2M3N8k39
5461a29O3m2L49l7O0j11j86N1r7J51k89K85M9p5J09k12L94n26J96j25j7K7N8k55
5485c09K88m5j9p4K43k9Jr2J62j49L33l93J4K54r6J38k83K45j75R9M2m2j99rJ27
$$ plain form
5316 15 -233 -80 4 34 -221 23 -80 111 28 -99 -127 39 156 -9 -46 31 -20 -128 -84 -18 205 -72 -183
5339 -183 109 -103 178 63 45 66 -144 -177 -147 -86 61 50 -29 -83 -185 -79 -14 139 -149 -2 -112 -20 -108 0
5363 0 167 31 78 -211 -158 -151 -19 88 71 -45 19 -44 9 46 79 -84 -18 -79 -136 64 -293 -68 -93 -149 11 68
5389 68 -122 21 -51 50 156 -233 -19 -56 2 -97 -26 61 37 -4 -90 -224 -96 118 10 -49 138 -79 3 51
5413 51 -86 171 -92 -104 -210 -35 5 -67 -155 -34 -14 -137 -119 35 -20 129 -7 -58 234 -14 5 -47 -76 -61
5437 -61 212 -5 104 73 -159 -110 3 -2 -14 -61 -241 146 -224 3 -43 -152 -176 139 12 71 9 52 110 -129
5461 -129 -66 -108 241 204 264 153 -33 18 -79 72 -217 68 117 42 151 -61 333 -193 3 -122 -139 -112 -54 -309
5485 -309 -21 -66 -85 -159 84 55 56 -36 126 -23 310 -83 -69 185 89 227 -56 189 14 113 155 113 -86 -95 32
5510C2j14o2L14k40M5o2pj21R3J41oQ7j83J0M1P3k1J46r1j60J75o6K11k13p1J54
5536A05k9j23J26M3k39R3j18L2L92j61k02L0j16K34Nn0Q3k7m5r9J10r6kl5K9J91
5562A31o1j00r4j06j0J83j66J26O1q3J98l22K40pN0O3j84J24OMj80K52j35k3j32
5587a65J45j22K67q7M5m2J42j82j30J28r9K06r5M3j21N8j2j13K44r0K32m4k32
5610b4o6j01K97j20p3K43m2k67J46Qk40N3K09j14J36q6m7K10j18K13k57K44j13
5633I1J23k29R0q4J43k93J76p5j6J23j53J56j8J26k38J66j89P8J33r0k25K38j26
5656i3K27m6k37J99j44J02j11Q6Qr6K13J11j53m6N4k27L05q8m6n8l6L50l27K7
5680b6lM4J7P7k17J26k05M75l74J70J34j06j10k84L40L1j84K59k73J57l5K9Q7
$$ plain form
5510 32 -82 -144 170 -70 -25 -87 -94 -215 -122 19 13 100 -83 -73 -32 41 20 166 75 -85 90 24 235 22 -49 105
5536 105 76 -47 79 122 -117 -24 -142 -110 282 121 -81 -51 -167 67 72 22 105 78 33 -66 44 -52 -54 -89 -60 131
5562 131 70 -30 -124 -230 -240 -57 -223 -97 -36 -119 79 -243 -3 -10 40 103 -81 43 49 53 -127 125 -10 -33 -165
5587 -165 -20 -142 125 38 83 41 183 1 -129 -1 -100 106 11 54 -67 -9 -21 -134 110 20 252 208 -24
5610 -24 -90 -191 106 -14 -87 156 114 -153 -7 1 -239 -186 23 -91 45 -41 -88 122 4 217 -40 204 91
5633 91 214 -15 75 -9 134 -159 17 -58 -74 49 -104 52 34 160 -78 88 -101 -23 110 20 -205 33 -93
5656 -93 134 88 -149 50 -94 8 -103 -17 -9 -105 108 219 66 20 74 -153 152 64 18 -40 -76 274 -53 -26
5680 -26 -29 15 32 109 -108 18 -187 288 -86 84 218 112 2 -282 58 89 -95 164 -109 48 13 42 129
5703A29j00O0o0L21l04p9Q2j25j3K54j63p0r3J38O9p1J6r7J6L2K84k85J11J15
5727A67l3J02l87q9L34j7kJ9r2J39j33q3J86j19o0l1k37M81j13j88l6M0R0K2P8
5752C8k67N17k76Q9j42kK9%J43r9j46J05R1j56K14l2n8Nk36K87j02l3P5q1J4J96
5778A73k27J49k81K90j26N7k9k6n6K33j15n3q0J01P1J7K2j57J04m9L9K8j29p1
5802a15J48K25m17J99J06j45o1j39M92k80q2K34j84j89K38j0q9J26j57K48l48
5823b00J33J5r1n1j90L60O9j60JQ6L8j31K07j74R8j61J36j41N8R8q9Q1j41J17
5847c2K22k06J71j79K1q7J00jK9r5M0K0p6LK9Q9o3M6%j21j7J79p8j13Or1J48k4
5875h0M1M4J00q7j52L10j59j5j82K31l1j70K71j48R8q8K62j99j08J55j02l6O8
$$ plain form
5703 129 29 89 29 350 46 -33 49 -76 -89 165 2 -68 -161 -23 46 -25 -9 -106 -90 -58 226 -59 52 167
5727 167 134 236 -151 -240 94 77 75 94 2 141 8 -75 111 -8 -68 -99 -336 145 32 -156 -192 -152 -62 -40 38
5752 38 -229 288 12 101 -41 -43 -14 -14 129 30 -116 -11 80 -76 138 106 48 53 -183 104 2 -31 44 -37 -23 173
5778 173 -54 95 -186 104 -22 35 6 -20 -76 157 42 -11 -91 10 81 98 120 -37 67 18 57 85 -44 -115
5802 -115 33 258 -159 40 146 1 -60 -199 293 13 -69 165 -19 -208 30 20 -69 57 -100 148 -200
5823 -200 -67 -52 -143 -194 -384 -24 45 -115 -114 -28 10 -121 86 -88 10 -151 -15 -156 -98 0 -89 -8 -149 -32
5847 -32 190 -16 155 -24 -3 -90 10 9 38 -57 -17 3 -73 -70 -41 48 -15 31 31 -90 -107 72 -6 -119 -113 -204 -56 -80
5875 -80 -39 5 105 18 -134 176 17 2 -180 51 20 -150 121 -27 71 -17 245 46 -62 93 -9 -45 23
5898B3K2k2Q4j16q5J6K62m6p3n2J26l39Q4J86L2Oj6j95M3j2J74k25Q1m2J9K11
5924A46m7J61m26J56L7j24PK08j03j35J97N2q6Q9j16j51J21Q7R7j76M5J00k29
5947i0K71k7p5k6O5j93P1J22j42R2m2J05K5l05M8L40k66N4J12O9l09P6l3r8J50
5972fk17MK96R0J99q7l92J14q5N1mN5k6J14O4q7k10k0N4L3K26j03j76jP8L03k89
5999b2J26k37J50q6J08J4r7N7mJ18k13M9L01l57J70k44J90M5r0k0J31j34Q4o6
6023b7OJ24j08O4j0n5k68L43L7Q1q6P9k68J67m6Jm2p8J04J7J21j50O3k09M0J05
6049EN2M7l6k98K26O1j3r3j25M47k24n4K80k50J38k14R4P4Kq0J16j65k38R5J18
6074c5J02n4R7k00J39J03j36j7j18K26k68K88j63j57J5K49j84L53m6j50L7K7l8
$$ plain form
5898 23 45 23 107 -9 -94 -78 184 138 65 13 139 -200 -116 70 102 108 92 -103 -60 -72 102 -123 -42 -84 -65 146
5924 146 99 260 -166 -10 27 -97 -90 118 15 -120 77 129 43 132 16 -135 -14 73 170 -6 39 139 -90
5947 -90 181 154 79 53 118 -75 -4 118 -24 68 26 131 156 -149 -101 239 -27 27 139 208 -101 -25 -58 -156 -6
5972 -6 -223 -219 77 167 366 279 -113 1 -84 -33 -37 18 -8 106 170 83 -127 -147 -93 -60 166 63 -113 -114 -36 267 -22
5999 -22 104 -133 17 -69 39 53 -44 13 9 127 -86 -37 264 -93 77 -167 23 68 -22 -42 89 -45 39 -27
6023 -27 -21 103 -5 59 49 -6 -274 69 106 187 101 180 -88 79 33 34 -8 -86 18 35 156 6 69 -140 -100 5
6049 5 57 104 68 -230 -4 57 44 -49 -174 273 49 -5 275 25 163 -51 43 117 119 39 155 -10 -248 -153 -35
6074 -35 67 13 110 -90 49 152 16 -1 -119 107 -161 127 -36 -193 -178 71 -113 240 194 44 81 108 70
6097G0j02O4j02J00j9K8R1%p2q7Q8J56k04J36p6j06K2n5O5J5k56J18L63j65j82
6122a10J10r2P7k2K06k35oQ5j7l8j43K80k31J1J86r3RO1n1J23l01N9J47J36j68
6147a7J30r8RP0q2nJ3j48L18k73J62q9m1r5K66j00j08J71k0M5K5m4k78R0K01k04
6173a02J84j5Q9n1k33J96O2m6p4j7r2k2K22q3kK13q0k26rJ17M6K7J1j48j5L5K37
6200B24k83J96J0rK7k16O9p1K89j87j9m6k04J88N1j20L1J54j1J35l64L25j10n6
6224Ckl2N5k32k8J26L20M1k40JO0k3P2k89K84M7q7j09J20j06P6j85m3J64k54J41
6250a20K17k45L5J71p7pj15J49P9J24k93J35j20J07l70K81K05m34J23j6K59j90
6272a02L60k48k66L47j11q3K32m1J7L6j71J15M9l16rL43j25j93J44J9%O3k5r3
$$ plain form
6097 70 -32 32 -70 30 11 39 130 130 58 -29 59 215 11 147 71 -35 -13 -68 -3 12 -244 -126 237 72 -110
6122 -110 0 -92 -15 -37 169 -66 -72 13 -4 -42 -185 95 -136 -125 61 -32 -23 38 -13 110 -191 -132 15 151 -17
6147 -17 113 15 24 94 12 7 20 -128 190 -83 79 -10 -51 -146 120 20 -88 83 63 108 133 89 -189 -99 102 -102
6173 -102 82 67 156 105 -128 68 130 84 10 -7 -99 -121 101 18 16 229 149 -77 -86 31 77 104 115 -33 -48 -13 224
6200 224 -59 137 147 138 165 -51 18 -53 236 49 30 -16 -220 -32 19 -101 -70 84 73 208 -156 169 59 3
6224 3 1 -31 24 -208 -236 -110 210 251 11 12 72 49 121 -168 116 163 76 -33 87 -19 57 -128 -171 -7 -261 -120
6250 -120 97 -148 -113 58 -19 -26 -141 8 87 211 -82 53 -67 40 -330 -49 156 -278 -155 -171 88 -102
6272 -102 258 10 -256 91 -20 -103 129 88 105 141 -30 85 134 -182 -191 152 27 -166 -22 -3 -3 60 35 -58
6296e8K05j60K4k69L16L2J24j00p9j27J79K6j00n7Q6Kr7J81j00Q8k46L01r1m6
6320C4p9j22J05j16L16j48J19l90K84n2L6N7j15J08j9Q4j70J57j4j89K45j81%
6343e0M9m3j4N2J69r3k10J13lq8Q3L5o3k21L13l7J57j42j16K60p3l8J7j42J33
6368D8j19N6j54P6K74Q4k74k03R2N5J38p8J6o4k5R0j15J53p2J02p4j25l9J21Q
6393b9n6K46j95J39j10pJ56j46k5J10l2j5o7Pj0k2Qo2j40L39k20r4K28j7j29O0
6419h3L3n2j03M6K41l41M65j00k23K80j29r1R2Nj64J23J2k3j63K87j31pj56K79
6443I7k6n1L2q9L00j42O2K7m46O7J11J3l3N1J79j42j31K56j02K4j72J71L4L4j23
6468Al65M00r8K19j09k0J7j59P8O6j81J41o9J10j07R9j63J19k3K2R8k77L63j95
$$ plain form
6296 -58 147 -13 11 -258 58 90 214 114 35 -92 87 113 13 -44 42 44 -53 128 28 116 -130 171 80 34
6320 34 -45 -167 -62 -178 138 -10 109 -281 3 -49 -13 44 -71 37 18 102 -68 89 75 -114 131 -50 -50
6343 -50 -1 -44 -58 -6 163 70 -140 -27 -30 -118 -35 0 -63 -284 29 -8 149 7 -109 151 78 40 57 -85 48
6368 48 -71 -15 -169 -93 181 265 -9 -212 -120 -65 73 -5 11 -53 -78 12 -103 50 -22 80 6 -119 -158 -37 -29
6393 -29 -85 161 -34 105 -5 -12 144 -2 -27 83 51 36 -31 -24 -34 -56 -48 -110 -250 89 -131 -225 3 -14 -143 -83
6419 -83 -50 -102 -205 -159 82 -259 206 106 -117 163 34 -57 35 40 -124 -1 11 -12 -175 112 -19 -26 -182 97
6443 97 71 20 52 -37 263 121 183 210 -236 -169 -58 -45 -78 -27 152 10 -121 135 33 57 -115 56 90 124 1
6468 1 -364 36 -62 157 48 28 45 -114 -36 30 -151 -10 -79 31 -76 23 -140 -21 -44 -22 76 -201 162 -33
6492c3R6j60K09l17K70j82R6J45q4Nj6J46j69J25k75J31Q5j56K2J29j13J21j59
6515h4O5q1K63r0j36O2J01k66J77J38J3j75N9j92M1J10k09J32m2J55k9j35m6J98
6539B9J23L5j77j92J29J99k07m1J78q6J3J60o2rj99J42k4M7j36J77j36J97j73
6562a3L4p6L3J02j6K3o0J95m17L13j82K6J66j69OJ36j18P1l5o7O3O6k75O0M1J18
6588B5j61J56q5J88j88J34j82L8O1K6j79R6O9k06L32L1k74J24J45r6j1J78j69
6611E2Kn5j2j7J56k15oJ58j44J01j97Q1J62j50J46J93k85L1L2j94J18l7qM0j00
6636a48JK81K8j77j2n1M2Q7L5l5J4j25P7J13m0q7J19k30N9j01J90R2j29o0J89
6661A32j05r6PJ83j9j1j55J16j78o6J46K4R5r7J13k36J22N5O7j85K53j96pj35
$$ plain form
6492 -33 63 -97 112 -205 65 -117 -21 124 40 45 29 175 6 131 -144 -13 72 -84 -62 67 -46 75 -84
6515 -84 -19 -100 163 73 -63 -1 100 -166 11 149 162 -13 46 -146 -105 5 -204 -72 -114 41 12 -123 -169 29
6539 29 152 187 10 -182 -53 146 -61 -102 76 -10 3 163 101 92 -107 35 11 58 -78 99 -37 160 -13
6562 -13 21 -55 -22 80 64 87 27 222 -195 118 -64 -38 128 -41 -35 101 -17 54 19 -48 15 81 -194 -134 -93 25
6588 25 -136 20 -65 123 -65 69 -113 -75 -14 12 -167 -71 -2 -208 124 155 -119 5 150 54 43 221 52
6611 52 54 -1 -13 -30 126 -89 -95 63 -81 20 -177 -96 66 -84 62 255 -30 1 33 -161 -43 -80 -88 -48 -148
6636 -148 -147 134 162 -15 -27 -78 -36 51 86 51 65 -60 17 130 90 3 122 -108 -49 -150 40 132 3 -57 132
6661 132 27 -69 -62 121 102 91 -64 52 -126 -192 -46 -22 73 -24 89 -147 -25 30 97 -88 165 -31 -38 -173
6685a73K23j92J17L8R2J10l45K14k68J24K02o1j69J41k6k5l8J9L11m00l1J13m
6708b8K16k74k5R5K3m8N0Q0JQ3j43k24K91j48M2o6j06K77r5k0P4p7J31q6k52M26
6734A97l05r8J31Q0R0q9mj55K13k07J19M1k5J99j04J5o4j48Q3K3L5k3J47k18K04
6759A37k5K5j30O3R6L1j95lj9k07K70j07P4k57K06J5K35k12J88l5k01K38k14L80
6783C53m41N1J03j86K80k42m7K60r8k13J09K6n7o8p3K16L6n0J33j40j5J60j62
6806f5L4p4J4j12J42M6J3q8J81r0L4j33N2J22J28k83K24K2l09K03J07n1k24J80
6830G3j34J60R2j31j30M0J31J2j50r2K05k28L19n0j33R3j17q4J95q5K8m8P4P3
6854A13j84N6L2J59j02j10J2O9k2q1k2L8J71k50J65o3k4K44k65P8N8O8l2k28p7
$$ plain form
6685 -173 50 -142 -25 13 105 215 -130 84 -184 -60 142 81 -88 53 27 2 -36 -17 294 -106 -137 -24 -28
6708 -28 188 -86 -111 -16 7 -41 9 89 90 173 30 -194 97 -51 -9 -75 -181 96 1 -19 55 -22 109 23 -229 197
6734 197 -108 -206 -75 5 95 6 2 -153 60 -147 -28 13 -12 187 83 98 34 -114 -31 -8 27 4 151 -67 137
6759 137 112 137 7 70 166 197 2 -1 -20 -227 43 -64 10 -247 -41 -26 209 -3 185 150 -51 187 -27 353
6783 353 -88 -37 66 -120 160 -82 -129 131 33 -180 -71 -45 -102 -170 -243 -27 9 -41 92 -48 -63 97 -65
6806 -65 -31 -105 -91 -203 -61 -15 -2 -90 91 1 35 -98 -46 76 204 -79 145 167 -142 61 168 117 -107 73
6830 73 -61 99 191 60 -70 -30 101 113 -37 -129 76 -152 167 117 -16 77 -40 -124 71 -14 14 -34 40 113
6854 113 -71 -15 17 176 74 -36 -24 45 23 -58 -80 -42 129 -121 44 -19 -43 201 -64 14 72 140 108 -120 -197
6879a97K23K4M5q2R0l46K53Q1n6J05l30O3L51k32L2J9j85P3j88l1L55l2k12K48
6903G1N1J45j05l0k35J79m6K04l29m3J11n7R9k4J2o1M8J5L14k57k4k21jL1J54
6928Apk8L7k31K19r6K10j66K8q1J13j82Q7K24R0k81Q7q9J36j51J14J22j22pJJ85
6954B13l06K43k23L08l52jO6N4M6J1p5m4J87q2j4k9JNJ21k25K25k10N9j8lj5K92
6981B34k05p0J12p6L9J3L7n5Qr7Q7J5k02J90j92M1L11j4k16L6P7k60R5L5P4q7
7007g0Q8J6j79j7J39Q6J97m17R3Q1l9j3JJ42%j08rp6j27M16j39K40k69k31M35
7032B40j69l3j22o7L96n8j91p8J10PJ55j91J81o0l29K32r7lJ37J14j64m8J23k12
7056a27N9J41J25j73O3j5l5N6j10j1k1j94K39n2j28N6j26J91l9J96j49J38J01
$$ plain form
6879 -197 26 50 95 13 103 -243 10 91 35 140 -190 -127 224 -8 24 43 -142 -69 -257 -288 67 35 -177 71
6903 71 122 267 162 132 -103 76 30 234 -95 -138 -27 -84 15 -9 3 -58 -10 5 319 62 38 -183 -184 -153 1
6928 1 -6 -34 3 -228 -9 -105 105 -61 -33 -114 -1 -183 -96 128 218 -63 24 -65 71 -80 34 156 34 27 28 213
6954 213 -93 150 -73 235 -117 -118 -52 2 48 59 -16 -60 127 45 31 2 3 8 129 -96 129 -81 -22 -40 -43 -58 234
6981 234 29 -41 71 -5 34 47 84 29 37 -60 27 42 -160 30 -162 -121 190 176 -40 -4 73 -187 -92 -57 17 -70
7007 -70 18 34 -145 -162 -23 63 260 -157 -64 17 -22 -35 -34 108 108 0 -9 -85 -212 204 65 305 36 -195 240
7032 240 71 38 -84 -151 245 187 -4 -82 28 35 190 -1 180 120 -209 23 -74 -77 60 174 10 -38 85 -127
7056 -127 -68 73 198 25 88 73 38 94 -16 -27 -48 -242 -3 -55 -183 -127 -253 -62 -101 95 -54 84 185
7079A85P4k88Q1J08k60K35j98N4J25p0N4J12j16M7q1n5o8QP1O4r9oO0K3K4k37
7105a53R1J2M4P5j19r0K0J62oM6j5L4q2M0r4J34l90J95J26l27L46j58J84M2k80
7130a63lL84j61j92j03J54O6P3Q6J01k78j60K20m6M5M9m3k20J58L85l17l00K24
7153d1R5l6k97K35K19k20K5K69l34k9Q5J71N9k25K01k27O8M8j41J24j16K02l27
7176a92K66k12J59j7Jj4J02K0J03o4k69M8J17%n3p3J48j39M1J97K3j80m4J59o7
7201F0k00J13L8J43K5k37n8j07J79J7MJ06j26l0K06j4l02L19lj41q4nK06n6j08
7226e5o1L81k04j32J30P9l09K29K25L6k40r6M7j63J6k3M7J1R4j47j5K29q9N2j
7251D1JK3n5K4J83k58p9n7J33kl5r7J59m5L59k31K3j84K10L2k80J00o2RJ73j86
$$ plain form
7079 185 259 -29 52 160 -100 135 -63 -9 116 46 100 212 96 143 62 7 -61 -53 18 82 -17 -23 37 60 84 -153
7105 -153 -62 -50 -6 69 -50 -140 -120 42 36 82 67 101 19 59 -35 99 -291 -96 30 -297 49 -109 75 117 -163
7130 -163 -166 218 57 -135 -238 -84 -18 55 141 242 -36 -196 24 -22 23 72 29 -191 -33 352 35 -265 -41
7153 -41 54 18 -279 -44 175 -45 -20 249 -85 -114 -29 142 201 -24 177 -50 18 66 -75 49 -67 135 -192
7176 -192 74 -138 21 4 5 -9 93 113 216 152 -117 -69 48 48 -5 -78 70 -69 -28 169 192 12 -32 127 60
7201 60 -140 -27 11 154 179 -58 -116 -223 -44 -27 -23 83 -43 -73 133 119 -183 136 133 -8 -92 -97 109 53 -55
7226 -55 -116 265 61 -71 59 138 -171 58 283 319 79 -17 30 -133 -117 -140 -93 -82 12 -135 -150 79 -10 42 41
7251 41 42 65 10 34 217 -41 -120 -177 -44 -46 -81 -178 -19 -64 295 64 87 -97 113 145 -135 -35 -97 -88 85 -101
7277a01N7n5J55L1k17Q5J1j98J44J13k05J2n1K35n5P9Nj84J70k72J62l7J63l35
7301b88M97j89j10Qr2J08K1L7j15J79O9m6m3j15J2k16L91j96J60M6L6k19p3n6
7325a94K66K2j1k53K0J31L6M6r7J97o0l29J46P0j53N9J07j80J21O6j89K08j45
7348a16J54k08J46qQ3l7J8k7NM5n2m2m8M5L0O3R5K2j49P3j19K0k6k4J6J50j98
7375h9O9J90k63N3m8O4N9J00p0J9P9k7k5n4n4J57j12m1p3rK29l14M06k98k9K16
7401A35j24J60o6j77J14o5j15K54K1j19k48J57N0J9Rk26Q6J70j25J38j42J61q4
7424a7K5j7l8N7M0n0k9n5R7j3Jk6L0j84K38l45K80M3l0p0L0j01J65N4o9J2n5M4
7452A7j63J23o1M6o6ml7J10J4J99j67mL4P3o5L7J09k24J1j11J59N6q6p7J34L5
$$ plain form
7277 -101 -44 -99 56 87 -130 -45 -34 -232 -88 25 -180 -168 -219 16 -39 40 45 -139 31 -241 -79 -116 47 -288
7301 -288 209 20 -90 -82 -174 -66 -45 -8 -123 56 125 79 36 -79 -67 -283 108 -88 72 118 154 -65 -138 -194
7325 -194 72 94 83 -170 -150 -19 17 63 -34 163 103 -226 -80 -10 -163 -104 3 -177 -56 10 -179 29 -116
7348 -116 38 -170 -24 -32 51 14 32 5 10 55 3 -39 -87 -42 -12 51 146 168 19 92 -27 -7 -33 -57 -41 109 -89
7375 -89 -20 170 -93 -40 -88 -24 35 135 65 84 163 136 111 57 3 160 48 7 -66 -75 154 -160 246 -52 -81 135
7401 135 11 171 105 -72 42 -23 -138 116 137 18 -230 -73 -23 -4 5 -221 -135 35 -90 48 -94 67 -17
7424 -17 8 -9 -47 10 50 0 -29 -84 13 0 1 -25 5 -179 59 -286 -6 37 7 -63 -33 -134 31 85 16 28 -27 17
7452 17 -146 -23 -84 -38 -104 -108 -145 -35 -21 178 11 7 41 114 49 86 195 -29 -18 -129 30 86 0 -77 57 92
7478I2j89J9J65o0j1n1J40k05J14J3OOJ90j69l9L2J20j72j49O5K08j97J30k6l7
7503el8J48j97P8J0p1m8J33N7p9p4J10m2q7k1J18n2m3J01j76J19k6M9j55N3j08
7529b46L08J07k0l16L16l7n3l1j88K75L8j16N6j01k22L16j51J64k44J66p8RP8
7552C0L2k59K82L9P2j89l0K7j12J10J13l7q0J74r9m4J59k78rQ4O7n1m2K03jp2
7578H9r5J8J7Rk37N8m4J34J20j09J13O1k40Q7j46Q0K3K28l26K00j4q3K15l82J70
7603e4K43n40M31Q0k19R4J14j39J4j03J18m4N4O9j15j24J75j71K12r9L1n1J22
7626I8j30p7J6R8j52N3O6J35q7k3r6O4r3R6m3L8J24j91R0J5k36j4K29O5j54M2
7652f7l0K3O6j18L85k17p2J28J5J05k76P0J1L28l27P4k36J90q3M4J6n3l1p1J41
$$ plain form
7478 92 -97 -78 87 27 16 -35 105 -100 14 27 33 39 229 60 21 53 173 1 -148 -83 125 -72 58 32 -5
7503 -5 -43 105 -92 -14 -4 -75 -123 10 67 -12 -86 24 -18 -105 -126 -8 -60 -103 -2 -178 -59 -85 -36 -191 -138 -246
7529 -246 62 169 149 -167 149 112 59 28 -160 115 153 37 93 -8 -230 86 -65 99 -145 21 -57 -48 30
7552 30 62 -197 85 124 196 7 -23 4 -108 2 115 78 -2 172 73 29 188 -90 -99 -15 52 1 -41 162 161 89
7578 89 -6 12 29 38 -199 -141 -185 -51 69 -40 73 134 -106 -19 -165 -85 -62 166 -160 40 26 -57 158 -224 -54
7603 -54 189 -351 80 160 -59 35 149 10 24 -79 39 -5 49 118 3 -121 54 -117 95 -4 27 -24 98
7626 98 -32 -109 -93 5 -147 -94 -28 107 20 -3 -99 -35 -128 -32 -75 -37 87 -104 -14 1 -235 -249 -20 45 -109 -67
7652 -67 -97 -74 -8 -126 259 42 -30 98 113 218 -58 12 23 351 24 98 -138 52 -31 13 29 -24 -55 -126 15
7677A5j53O8K9K68j94j17P8Mj08R4K19j44j75J94P7k11J40m4J47o4k94J53r1J43
7701C4r7k1J98j18n1n9J60j9o7NJ42p0j83Q8K67k45K17l01J69k08J46r3J12p9
7725g3K18j72k1J75k40J68P1j80P9l5Oj1PQ4l7n0j61J84j87K43r5J2M0k7k2q3
7751a07R7p3K45k11K2K22l95K20O9k22K09P3j1j82O4mm6P2j28R7q7J6j3k49K36
7776h6l3O3j04K05j30P9K7j84oN3m1q6K55q9r1K79m9oM9j20K20j61mo5k37M16
7802A54k83K04N1j90J10K00k41J99k94j96K03k34K69J28M1j88J96r3L9j0k74K30
7824B1nJ22k51J40J59j33M2K42l88P9J34k78o6J68qj43J85l09O3L38j83J84q0
7847C3O5k29J08J84j70O8k8k06K27k92J74J83k56K47j4j70J04O2j28r2J89n8k1
$$ plain form
7677 15 -138 -70 -41 227 33 -84 -6 -2 -110 -16 203 59 -116 78 155 -56 84 40 187 123 -171 -18 -109 34
7701 34 -63 -84 114 -4 -55 -114 46 27 -40 -35 107 37 -146 -58 209 -36 181 -120 49 -159 -13 -106 6 -73
7725 -73 145 -27 -48 127 -113 55 126 -54 25 -10 -4 -15 -8 76 39 -11 -172 12 -175 68 -27 -15 25 -2 -24 -107
7751 -107 -10 -83 162 -49 -27 195 -200 20 89 -133 76 149 138 -44 20 16 -30 42 -86 11 -76 -60 -73 -322 -86
7776 -86 -119 -56 -160 45 -85 -6 21 -163 -169 -116 -157 -243 12 -77 -168 111 62 56 105 -15 205 44 40 -25 -262 154
7802 154 -129 75 126 -64 46 246 5 204 -90 -286 -83 -317 -48 80 121 -67 129 36 75 65 -209 21
7824 21 16 138 -113 27 186 53 95 337 -51 28 162 -116 -182 -14 -22 -165 20 -289 -226 112 -71 113 33
7847 33 98 -131 -23 161 -9 59 31 -175 52 -240 -66 117 -139 108 94 -76 28 90 -38 -130 59 1 -20
7870b0l8K66j92P0J4l24K57j66K9J32J04k16N5K2j45J12k9J05n3n0j3J38J30k05
7894a7j44J76r6J07N4j12k0j08R4p2K11p7O2o7n8P0L5q2M1k4j38J57K7K8k6n9
7920c8%L8J31l58K25l5J17j46J42j02j52L57r9j3j17J28j07k22K99Jr5K41k11
7943a6J2j20L22l4l02K08R5j03k21L02j91J39k0j3O0j48K13j70K25m50L81j32
7965C7O3m3k22l1j2J73L7N1J1q8LK50j94L1j39L09j38m5J03k11M2Q0Ok09KK34
7991A00k1nj06M0R7r9K8J57j27k00K05j59R6J07k06J50j95K80k19R8j50L8k0L36
8015B25j82j52J61j07K01k10M39j78k04M7j66J71l5j90O8Q7R3m1o8J25o4K9j68
8038a19J94j48J72L1P3j57nk51K73j86L0O9O1np2n3Q2Q1j32K66r6l3n4j58J57
$$ plain form
7870 -20 -58 208 16 86 100 -224 33 -133 -104 28 132 -84 -29 -7 -152 -40 -69 36 -17 -67 -80 58 188 -17
7894 -17 -161 15 -81 26 80 -32 -52 -160 -66 -138 73 -4 58 -9 -67 3 38 -44 -3 -27 -165 -8 19 47 21 -38
7920 -38 -38 0 131 -227 -2 -37 80 -66 76 -26 -178 179 80 67 -50 78 -29 -251 48 49 -46 195 -16
7943 -16 -4 -124 198 164 -138 70 165 62 -159 143 -48 91 71 58 118 -30 183 13 238 -212 169 37
7965 37 100 57 -165 -196 -208 -35 2 53 64 -24 -21 229 35 66 -73 236 98 53 156 -55 -13 67 73 -136 -134 100
7991 100 79 74 -32 8 105 6 34 191 64 -136 69 -90 6 113 -93 57 -138 142 -77 21 -129 -91 -111 225
8015 225 43 -109 52 -55 146 -64 375 197 -7 40 -126 45 10 -180 -112 -25 68 27 -41 84 20 49 -119
8038 -119 75 -73 99 130 203 46 41 -210 63 -123 -93 -24 37 32 -40 -93 -11 70 -62 204 108 75 21 -137 20
8063B0m7M5m7O5j7k03K11j48K98j97K09j14j45J21j40N2j39M13q4j46Q1j03p4
8086h9J52j10n7J67k20J21p1J60j38R5q8K8J96m2Lk33J46J02j38M2N5K12l58m1
8110a06J88j04P6l9k49J65K74m9k2j56J53k55N4K1M3J19k70J40J70j19l4q6J26
8133D0n7N8p9J87j65o2P2j9J90O9j06j69J80q1j76J96j30k2o3J62P0P4k02J65
8157A32j16n3J73q9o2J88l8l38K78p7j87K06j12J12N3j93J92j63K4J12o2P9l1
8180B8J73j32j20J96j15n6J38j16k7J57k38
$$ plain form
8063 20 -27 18 -29 36 19 -184 27 -121 177 -20 189 75 -70 51 -89 -37 -176 237 153 7 88 -15 -89
8086 -89 63 -47 -104 63 -157 -36 -107 53 -85 10 -78 -50 146 104 107 -126 20 122 -16 26 81 293 -65 -106
8110 -106 82 -22 54 15 -234 -69 205 156 134 -22 131 -124 -70 -49 -6 113 -157 -17 153 34 0 -86 40
8133 40 -17 41 -38 149 -16 -78 -6 -25 165 234 128 -41 139 58 -118 78 -52 -74 -137 25 95 169 -33 132
8157 132 16 -37 136 47 -15 173 135 -203 75 -2 -189 17 -95 17 70 -123 69 -94 -70 42 -20 59 28
8180 28 201 69 -51 145 30 -26 112 -4 -31 126 -112
8191a12
$$ Imaginary data points
##PAGE= N=2
##DATA TABLE= (X++(I..I)), XYDATA
0@%%%%%%%%%%%lJ1j6J6j6K4l2L2m0M8n6P2q8J04j20J36j52J76k08K38k70L07l47
34a84L92m43M98n57O25o98P77q65R60j064J176j299J435j584J748j925K118k334
52a224K573k839L135l467L843m272M771n353O044o885P927r264J1052j3576J7433
67I898k4133L9056j35755M8859J73508j48387M7079J30669n2495j12497L2100
78G902n0780o5519O4293O1567k8164O1382M9200o6116k7148J9490j06031n2767
90a32691J17415L6685p4098P6083J05897p0650o8856L3241m8283o4848N9868L3594
102C357m1970O1208Q0215o1207n6804K9427l7678o1912M3116L4951k2654N3977
114B4026O7606m6429m2042K3370l5306n5829K8237J9455j6268N5703N1768n2268
$$ plain form
0 0 0 0 0 0 0 0 0 0 0 0 0 -3 8 -8 8 -8 16 -16 16 -24 24 -32 40 -48 56 -64 72 -80 96 -112 126 -144 163 -184
34 -184 208 -235 263 -294 331 -367 410 -455 505 -559 617 -682 753 -831 917 -1008 1110 -1224
52 -1224 1349 -1490 1645 -1822 2021 -2251 2520 -2833 3211 -3674 4253 -5011 6041 -7535 9898
67 9898 -14235 24821 -110934 -62075 111433 -36954 10125 140794 88299 -24198 7902
78 7902 -42878 -108397 -44104 17463 -10701 50681 99881 33765 6617 26107 -79924 -132691
90 -132691 -15276 21409 -52689 23394 129291 58641 -10215 23026 -25257 -90105 -30237 3357
102 3357 -38613 22595 102810 41603 -15201 14226 -23452 -85364 -42248 -7297 -29951 24026
114 24026 91632 45203 3161 26531 -8775 -64604 -36367 -16912 -33180 22523 74291 22023
126B2023k7236L8591l9987o9560L3847M0146k1364L1149N9110k6084l2277K1871
138C0229k6172n8537J2768K8121r330K6189M1326j9177j4798J8458l3960m9991
150e4874K4287K5935k0368K3411N0839j3640k2650J6447k3288m9758J0625K2181
162a0853j6082J6957M3988n923j7763J3068j8979l9873J0163J7378j6326J6910
174g335M3235n691j7568J3681j5928m0991L642J4545j5039J3381L8683k325j3275
187I015J4364j0855l5461K396J2072j3763J1103L5266j048j1778J2562j0381l3600
200b0108j717R026j1957Q525L0793K142o893J2922p656k8018j718O520j2117O640
214a3616K7593K066o551J1427o215k6947l816N205j1249M647K4976N108l967J1501
$$ plain form
126 22023 -5213 33378 -6609 -76169 -42322 -2176 -23540 7609 66719 40635 8358 30229
138 30229 4057 -54480 -41712 -13591 -22921 3268 44594 25417 10619 29077 -4883 -54874
150 -54874 -30587 -4652 -25020 -1609 49230 35590 12940 29387 6099 -43659 -33034 -10853
162 -10853 -26935 -9978 34010 28087 10324 23392 4413 -35460 -25297 -7919 -24245 -7335
174 -7335 35900 30209 12641 26322 10394 -30597 -26955 -12410 -27449 -14068 24615 22290 9015
187 9015 23379 12524 -22937 -20541 -8469 -22232 -11129 24137 23089 11311 23873 13492 -20108
200 -20108 -21825 -12799 -24756 -16231 14562 16704 9811 22733 15077 -12941 -14659 -8139 -20256 -13616
214 -13616 13977 16043 9492 20919 14704 -12243 -16059 -10854 -22103 -17456 7520 12628 8661 20162
228B0162k729k2057n276K847j0163K696J9848N174j820Q660l988j8260m783n5
242i744j0282M365J8300L980L55J2132j409j8323n085J330j0279j794J5982P572
256G100j266O560J640j1884q608k488n746Q52J0155O080N396Q403j622j0695m036
271a59l550j0206o09J1316M612J077Q664K760r879o998j817o167l106P554P854
286A346M102N817K472n564o615n299o518j953M474M675N351P221J241m595m146
301B009m471p154k354N272M746M073P025L850m115n983m344n392m407J337N468
316d440N461M545L042P6l864o015n441k189R36L152N674N781L447j172l919m928
332A46n080m181r29L417O027M403L358J805k498n836m580k861j562K615N401M550
$$ plain form
228 20162 17433 -4624 -9900 -7053 -17216 -14520 5328 10502 8682 17342 13354 -4906 -9689 -9744
242 -9744 -20026 -15661 2639 6619 6974 19106 17697 -626 -5711 -4381 -14660 -16454 -472 7100
256 7100 5834 12394 14034 2150 -6458 -8946 -14692 -13840 -3685 2395 7791 16194 14572 3877 -159
271 -159 -3709 -13915 -14524 -3208 1404 2481 11145 13905 4026 -2972 -4789 -10956 -14062 -6508 1346
286 1346 5448 11265 13737 8173 1558 -3741 -10259 -12212 -7738 -3063 2288 9509 10750 6155 2009
301 2009 -2462 -9616 -11970 -6698 -1952 2121 9146 12996 8881 2898 -1446 -6838 -11245 -9908 -4440
316 -4440 1021 5566 8608 8684 4820 -1195 -6636 -8825 -7889 -4737 937 6718 10165 8993 5074 146
332 146 -4934 -9115 -10044 -6627 -600 3803 7161 8966 6468 632 -3948 -6809 -8371 -5756 -355 4195
348D195L440J581k981n258m274l282l405K590N927L442L277L469j102n851l587
363a819k448l512R02N184L439K983L629j573n037l119l176m410J266N180K972
378D61K552N159k19n429k733k139m639l03M762K704K592M247J66m790k344k637
394b590n136j66M878K314K352N464P62m829j787k067n402j111M539J837J596N290
410E944J204m446j840j754n342j051M235J615J592N724J512m003j328j428n548
425d914j707L472J161J014N526J912l685j114q46n379j978L431J214N67N456K623
441F753l251j076q19n122k224K721K17O36N570K244l276j93K22n649k664L542
457b369K15l34N275L296l100q87N58m654l529K263Q06l18M578K763k094K38K31
$$ plain form
348 4195 7635 9216 6235 977 -3297 -6579 -9984 -7394 -1467 1975 5252 8721 7619 1768 -1819
363 -1819 -4267 -7779 -6877 -1693 1746 4729 8358 6785 1748 -1371 -4547 -8957 -7691 -2511 461
378 461 3013 8172 7953 2524 -209 -2348 -6987 -7290 -2528 176 2768 7015 7181 2391 47 -2590
394 -2590 -7726 -7892 -3014 -700 1652 7116 7878 3049 1262 -805 -6207 -7318 -2779 -942 654 5944
410 5944 7148 2702 862 -892 -6234 -7285 -3050 -1435 157 5881 7393 3390 2062 634 -4914
425 -4914 -6621 -3149 -1988 -974 4552 6464 2779 1665 819 -4560 -6538 -3107 -1893 -1326 4130 6753
441 6753 3502 2426 1607 -3515 -5739 -3018 -2801 -2165 3405 5649 2373 2180 2402 -3247 -5911 -2369
457 -2369 -2154 -2488 2787 6083 2983 2096 2654 -2000 -5529 -3266 -2460 -2778 1800 4563 2469 2707 2938
474B938n009k659K982q38r29N450L248k736j86J510m906l969K467L49j303M365
490G74K995j542K37Q18l824l169J733m16r86M062L392k209M24J454l989l218J421
507b043m10j287L901K915k075J599J533m127l235K331o23k490L677L518j688j4
523A482K323k922l593Q65j82j089K043K900m08J097Q73l233j877J466j530k590
539d375L601L105j532J43K975k699l379J027j48k110J439L334J50N4J253j526
555A312j981M86j715j586K386K573j285N41K855k147k370N99p38k170J717K759
571A236j065N84K566j291k676L10p67k108J593K466j152O64K795j098k739L26
587c56j34k165J002J888l80J009J984r45k400O08m00k217N70K060o15P81K530
$$ plain form
474 2938 -2071 -4730 -1748 -2586 -3515 1935 5183 2447 2261 3771 -1135 -5104 -2637 -2288 -3591 774
490 774 3769 2227 2464 3282 -542 -3711 -1978 -2394 -3380 682 4074 1865 2289 3743 -246 -3464 -2043
507 -2043 -2453 -3740 161 3076 1001 2600 4133 6 -3229 -898 -1521 -4011 -334 3184 1496 1482
523 1482 3805 883 -2710 -1845 -2027 -3116 -1073 1827 1419 2516 3389 156 -1721 -255 -1785 -4375
539 -4375 -774 2331 799 942 3917 1218 -2161 -1134 -1282 -3392 -1953 1381 1531 1585 2838 1312
555 1312 -669 -183 -1898 -3484 -1098 1475 190 731 3586 1439 -931 -332 -1070 -3240 -1523 1236
571 1236 171 755 3321 2030 -646 -336 -1103 -3211 -1618 848 -304 360 3155 2057 -682 -356
587 -356 -490 -2655 -1653 235 -145 864 2848 1903 -497 111 -289 -2506 -1936 124 -491 290 2820
604B820r79k285O73j39k206j56K077LL94K002n51j723Q28m50k561J11J945k22
622d19K32K250l66j491N46n10k494L44J972o02M75J879m0j330M49m29k413J84
640a763J328k64R3J985M48j209J19k83j974q5J154n79L46K145L12j318L77o05
658B27j626j81R83l40PK234J57q39K40k16j672m23O18j65K15J797M10o89L19j13
678I43j798l38O14k28M6J239O44n49N01j11j281j003Q45m74J26J243P08o00M43
697I70L16j761o72L83j46K5J151O89k97M37p7j177q09M17m26l6J263L78k38N14
717I04O6j093m42J60o04K7R97N99n0K87K63j040r72P2j74R0N85Q73k75O38q6n11
739C14p03j23m60J84M75N41J52M86J70p12o64o1l63j84P69L39J11K76P02n83p43
$$ plain form
604 2820 1841 -444 229 90 -2116 -2272 -195 -192 202 2204 1653 -70 758 308 -2253 -2142 -197 -419
622 -419 -187 2063 1697 206 752 242 -2252 -1908 64 -538 -63 1816 1776 446 895 466 -1947 -1763
640 -1763 -435 -699 -606 1379 1827 618 737 454 -1520 -1605 -451 -1030 -684 1461 1773 455 832 227
658 227 -1399 -1580 -597 -937 -930 1304 1461 622 862 646 -1026 -1449 -831 -996 -781 1016 1426 737 1056 943
678 943 -855 -1193 -579 -807 -761 478 1122 573 1074 963 -318 -1321 -476 -950 -824 419 1127 527 970
697 970 1286 -475 -1147 -764 -910 -885 266 955 658 1095 1018 -159 -968 -551 -977 -1013 250 628 390 904
717 904 970 -123 -565 -405 -1009 -982 15 614 564 851 1114 74 -898 -826 -1000 -910 -325 548 273 911 825 314
739 314 -389 -512 -972 -788 -313 228 380 866 1036 324 -340 -401 -764 -948 -179 160 271 547 1249 666 -77
760g7n23o3m27P46M85R6N02J28n51k34l86m92j26N26L47J91L56M00m51k91j71
781a5o27j84K42N90K01J91L82j78k77l59p58J4K14N45L26J20J40j01l10k63n05
802f12P6K26J86K11J37K42J0l09j65k43k26k3K16M12J30K17J76l80k78k18l34
823e49p4J92K40L65K92J57l65l05o3m09k5Q1M35J55KL12P3k45k11m10j59J4J77
846c20L41L33L5L9l26k22k27k61K25M17oP7L70ql45l74K3j25p8K87J17R5J94J67
870D28r2l57k81N3l46K65M09K62j55K44m9m62Qk1m56L03J39J9L38K89o0n00j23
893a45ok47J14J71j07K40N77l51j63o7k24j07J10Q9q3O01J69j13l78R8m34k52
915e08K14Q4J79L0M19m9k34K9l55l47J11J73J49J44J35J33J30j43j24n72j03L85
$$ plain form
760 -77 -600 -663 -1090 -344 141 237 739 867 316 82 -304 -796 -922 -396 -49 142 498 898 447 156 -15
781 -15 -642 -826 -584 6 207 398 780 602 325 -34 -792 -778 -564 -19 307 427 567 466 156 -107 -612
802 -612 -536 -310 -124 87 224 466 476 167 2 -241 -467 -490 -274 138 268 485 661 281 3 -215 -549
823 -549 -623 -431 -191 174 466 623 258 -47 -110 -519 -544 -463 -28 127 129 441 514 269 58 -352 -511 -497 -320
846 -320 21 354 389 428 102 -120 -347 -608 -383 34 28 105 475 467 122 -252 -229 -354 -432 -145 -28 67 261 428
870 428 336 -21 -302 -249 -595 -330 79 341 186 430 381 -81 -73 -94 -550 -247 -108 -89 249 538 478 -22 -145
893 -145 -151 -398 -284 -113 -220 20 597 246 83 16 -208 -315 -205 -116 -199 402 571 458 80 178 -256 -508
915 -508 -294 -210 -31 -1 418 369 135 164 -191 -538 -427 -254 -105 39 174 307 437 294 170 -402 -505 -120
937a20nJ30K38Q0j58n4l6m87K65j09j51J92M88l8q9R4k99l59J56O8o8K64J06J30
961B38m9K05m60l54R7mJ6L05K31L5o0J44l70l49L11j83J63j36M07j9J85r9l84
984a30j66O7J83o7J11O8k3J59n0N3m67K10r3n9K14J01Rj12K97k19O7l08o3o4J43
1009a39L35M4k92M41j41k43L5j5l42J10J31m3J41R6J01o4r8j91l6j92M03j6K07
1032B32j08O6k17m7J09l92M10J51j10j48K31j81p2K1J5k29j21L73m1O7J36J82
1054C27l88M3m3N1n06O80k17R2K07m9J62n52L51l16j84J30J91J80L4K5r2j37j58
1077a69J44p9Q6m6O8k20L90q9l6n9j36J5k29L00K46j13L15n01J85j71o3j03k2
1100b87L09r0K93M3j79p5kPj04k4J94p5J18l9j32J41K08n57Q5Q7O7p8J18K7L8
$$ plain form
937 -120 -125 5 243 323 165 111 75 -412 -147 -256 -407 -215 273 235 146 240 -59 -418 -262 -194 -262 2 108 238
961 238 189 394 -66 -420 -323 -327 -311 -6 225 260 200 344 -26 -375 -64 -247 -84 -220 187 168 353 254 -130
984 -130 -296 -229 -46 -113 -2 66 43 202 152 205 -262 -52 -145 -204 10 111 120 8 305 86 153 -155 -218 -282 -139
1009 -139 196 240 -52 389 248 5 40 25 -317 -207 -76 -119 22 118 219 155 57 -134 -170 -362 41 25 232
1032 232 124 190 -27 -74 35 -357 53 204 94 -54 177 -4 -76 -55 -40 -269 -390 -17 -58 9 145 327
1054 327 -61 -18 -61 -10 -516 164 -53 39 246 197 359 -193 158 -158 -342 -212 -21 159 193 218 126 -11 -169
1077 -169 -25 -104 -18 -64 4 -216 174 85 49 -10 -146 -131 -360 -60 186 73 388 -113 72 -99 -162 -265 -287
1100 -287 22 -68 225 268 89 14 12 19 -85 -109 85 10 128 89 -43 98 306 -251 -166 -79 -12 -90 28 55 93
1125I3J57n75N37j98J93l26j5J09K48P3l16J78j37j22o6L56l04N5J70L2j64%q7
1148a09J15oJ2j68K13O2m5J28l46K07k16k03K80j3o7M4J35k8O2o7L4k37K95mj94
1173a16K19j07K70k01j5m6o3L10m47P4Q5R5m1J48M0k19n5o6k7lL97l42L62k86
1197c4k28J97K37k02j51L17n5P2j75J17k02J00J6m4k6l6J77k38n6L9Q3mR6n2j97
1222b49M27l18J75qJ28J03k89R5j22j27Q5j8J71K6O2k8p3p6No1J32P6j11oj46
1247a47K84j02m6p7k4K29j55K06l66M33j06j32o3K12j63O7l6k2P4K14k15m9oM2
1271E2k18R2J11N0k08J20K39l38K5J32jq3J17j71R8J7k99K52J02K0J00l98P2J09
1295hj6K8K8O3J25j88j0j3n4j57J10M0J59j33O1Q5k35J69k35Q1l5L5K30m3m3l55
$$ plain form
1125 93 250 -325 212 14 207 -119 -134 -25 223 296 -20 158 21 -101 -167 189 -115 -60 110 142 -22 -22 -109
1148 -109 6 0 12 -156 57 119 74 202 -144 63 -153 -356 -76 -89 -156 -112 23 -5 57 -10 24 -213 82 78 -116
1173 -116 103 -4 266 65 50 4 -59 251 -196 -122 -37 58 17 165 205 -14 -69 -135 -162 -165 232 -110 252 -34
1197 -34 -262 -65 172 -30 -181 136 81 153 -22 95 -107 -7 9 -35 -61 -97 80 -158 -214 -175 -92 -96 0 -52 -249
1222 -249 178 -140 35 27 155 258 -31 64 -58 -185 -100 -118 53 79 141 113 40 -36 -31 -92 40 116 5 -1 -147
1247 -147 137 35 -11 -88 -112 117 -38 168 -198 235 129 -3 -66 146 -17 50 14 -8 66 280 65 16 10 52
1271 52 -166 -74 37 87 -121 -1 238 -100 -75 57 56 -27 90 -81 17 34 -265 -13 89 109 209 -189 -117 -8
1295 -8 -24 4 32 95 220 32 22 9 -45 -202 -92 -52 107 -26 35 120 -115 54 -181 -100 -135 -100 130 87 44 -311
1321c11L77j31j69L09J48k41K5KR6l57L36k33OJ07L8p0J03ml48M53j68j52J83
1344aJ32j76J42p5j6j51J35k7Q3j1j71rP1j22K96q0L5J1j93JJ54q3J47Q1l22K70
1370A21j02J7R5j06K61n02N7J53LL7L22l88L8K9o2J72k56N0OJ33KQ9k94J50P1
1395I6r4j17J21k05K72N7k44K37j53J46k47j20L04N4q4Q1Kj97N5M9n8Q8j9L2j47
1420i1k4K03J68k05m1P5l4o9J86o3m4j8p6K06j09j67j32L49Q1j45J43k06j2n3
1444g8R6j5j26p1K33j86L01p7j72n4L32l57L7L7m4P1L1K30k20N3K4k15N7M9K6
1469c8J02j91J75jk08L75j99j22o1J69J13q1j26J4J35p2j20J04o9k1M8K12j27
1492A1r3N8M4n7J0m8n8R1N7r5O0J39n9j95J70j41R9j51M0J92N8J94k89j18k5J03
$$ plain form
1321 -311 66 -65 -234 75 223 -18 7 9 105 -252 84 -149 -143 -36 2 -68 35 31 -317 136 -32 -184 -1
1344 -1 131 -45 97 22 6 -145 -10 -37 46 35 -136 -145 -74 -196 100 20 55 66 -127 -126 28 -55 92 173 -149 121
1370 121 19 36 131 25 286 -216 -159 -6 -3 34 356 -32 6 35 -27 145 -111 -61 -55 78 80 169 -125 25 96
1395 96 2 -115 6 -199 73 130 -114 123 -30 116 -131 -251 53 107 23 104 106 -91 -36 13 -45 43 24 56 -91
1420 -91 -115 88 256 51 10 85 51 -18 168 105 61 43 -33 173 64 -103 -235 114 195 50 193 -13 -25 -78
1444 -78 18 3 -123 -194 39 -147 154 77 -95 -149 183 -174 -137 -100 -144 -73 -42 188 -32 21 45 -170 -113 -64 -38
1469 -38 64 -127 48 47 -161 214 15 -107 -168 1 114 33 -93 -79 56 -16 -136 -32 -101 -122 -74 138 11
1492 11 -82 -24 20 -37 -27 -75 -133 -42 15 -80 -20 119 60 -135 35 -106 -7 -158 -118 74 132 326 37 -81 -106 -3
1518ck4O8j14j59K56k7j21j25J31m9j09J64K09j42P1j80J64L4q2m0K52j71NmJ11
1543A15j28r1J34L80m62k21L52L6k43K13Qj42J15k2p9q8N0J85o5j02J28O6k9k75
1567a65K0L08j04k45J96j07K10j24R6j68L61o11K87M5J10M4j18N9k73J11P4l8
1589c2Q3j60n5L01M5o5l19K78j29L1q1P4J33j93L1J53J21j20j10J26o4q1p1K1
1613h3Q2J27j93O6p3j1N7R7j90J00J07l8j83N6J39l7J5P2j36j9N8K4p6K8P7OJ72
1640B44l56K47j17p0K74j95L4k8R2j44oj09P0J66j06k22K43k4k21J50J17J10j6
1663A33l68K40J43k27J10m3l2M1ML1j00J57o0r5L5m5K21k52P2R1j42m6J45%j38
1688a25R9J48R3l46k0K66p5j26J13l14K41j26M1J89j99O3PK76j27K0l62K97o2
$$ plain form
1518 -3 -27 41 -73 -232 24 -3 -124 -249 -118 -167 -276 -112 97 -45 26 -154 10 44 -38 -78 174 3 8 4 115
1543 115 -13 -104 30 410 -52 -273 79 115 -128 85 93 -49 66 44 -35 -123 -73 112 47 -55 73 139 110 -165
1567 -165 -145 163 59 -186 10 -97 113 -11 85 -83 278 -333 -46 -1 109 153 35 94 -179 -68 6 -32
1589 -32 51 -109 -164 137 182 117 -202 76 -53 -22 -103 -29 104 -89 -58 95 216 96 -14 112 48 -33 -104 -83
1613 -83 -1 126 -67 -1 -74 -85 -28 69 -121 -21 86 48 -135 -79 60 23 38 110 -26 -45 13 37 -39 -11 66 72 244
1640 244 -112 135 18 -52 222 27 61 33 125 -19 -25 -134 -64 102 -4 -226 17 -7 -228 -78 39 149 133
1663 133 -235 5 148 -79 31 -12 -44 -3 1 32 -68 89 29 -66 -31 -76 145 -107 -35 56 -86 -132 13 13 -125
1688 -125 -26 122 215 -131 -151 115 40 -86 27 -287 -46 -172 -131 58 -141 -78 -71 205 78 98 -264 33 -29
1711b9L0k65L96R8m59K63J98j89k8k37K25k4l5N0L0M3j73OJ45P8j35J20Oj13m3
1736d2k09M56l02j5J52J4J21L2j56m7K27j93O9j63o3J39l3l1J44J25l00j0N8J5
1760a2R8M1j35j9J98k5l10J26j27K00J07k27On9K22k0m2R8mj47J09nk79P2J98
1785F4m6l6J83j34j01J90j01j21M8L9l2RJ6Rn1K7r4J60n7p7K61j27n6J77l0o3
1811E7kP0k53K05o4J41J07k56p1M6j2N0n5J04j24j27K63j65L86j19j87j29N8O4
1835a3M9J9l5LJ52J6J6k98k2m8J19J85l6qj25n7j6N3j04P5J85J85j79j29P9J68
1861B34j59k9n4O7R7k49J36j40P9j31R6J98k40J94o7j92J21J26r7R7j37j24M17
1884B43l22o5K74L4N1k11r3J22j99M3J53r9J43m5j96J21k7q4J08J62k25J95j27
$$ plain form
1711 -29 1 -264 132 230 -229 34 232 43 15 -222 3 -21 -56 -6 24 67 -106 -100 45 123 -12 108 114 1 -42
1736 -42 -251 205 -97 -112 40 54 175 207 51 4 231 38 107 -56 -119 20 -13 -44 100 225 -75 -85 -27 -12
1760 -12 86 127 -8 -27 171 146 -164 -38 -165 35 142 -85 -79 -138 84 64 22 120 116 -31 78 73 -206 -134 64
1785 64 18 -18 165 31 -70 120 19 -102 -54 -15 -47 -38 -22 -13 -64 -37 -131 29 -28 -105 156 29 -27 150 120 57
1811 57 55 125 -128 77 13 154 261 5 -66 -20 -32 18 -37 67 -57 -184 79 -86 300 181 -6 -135 -77 -13
1835 -13 36 55 20 23 175 191 207 -91 -113 -161 -42 143 107 99 -26 -83 -99 -46 -150 -75 110 295 116 -13 66 234
1861 234 75 46 -8 59 156 -93 43 -97 -18 -149 -53 145 -95 99 32 -160 -39 87 -10 87 -50 -174 243
1884 243 -79 -144 130 164 215 4 -89 33 -166 -123 30 -69 74 29 -167 -46 -73 -157 -49 113 -112 83 -44
1907d4K5J52j34j1Pj26K92r6j71J93K6l4n1j17J06Nl8N4j73J34m4K88l23K76k49
1932e3k2r2J62j63J52K9R6j98L7o2n6J33J2J8Kq7J68QJ09k22n0K95k97J50j76
1957a07kP0J3k0J10o7j03J2J81k56K44p7O8o1n4J82j16n0K31k10L1M0q6j24K03
1982E2l8M7q1J84j11j77j65M96l2l31K40J0j18P5L2j38NO1j9p3O1Q1M0k62L27
2007A66O4k05k0n0J15mm9J19r1j52L33l47K01J76k66O7J18j68j15J5L15j21pj11
2031a7k11K32%j70Q2K4J05Qj7mk4M1p5n4M5r8K19j4p3j9N9j30o5J46J3n9r3J18
2059c1R7j27N5l07J16K68m0j03Q8l9L9m9J39j18Q3L3j27kJ94j24q6r2J93j42k0
2084a02P1O5k31K08P8j2J34j80j38J24J16q4j19l0L8J19J9k13J96J01j20k08J51
$$ plain form
1907 -44 -19 133 -1 -12 -5 -131 161 65 -106 87 113 79 28 -89 17 22 -16 38 -135 -1 -45 243 -80 196 -53
1932 -53 -75 -167 -5 -168 -16 13 109 -89 -52 -114 -170 -37 -25 -7 -5 -92 76 84 193 -29 -79 216 -81 69 -107
1957 -107 -109 -39 -26 -46 64 -3 -106 -94 87 -169 75 -2 66 5 -49 133 17 -33 198 -12 19 59 -27 -151 52
1982 52 14 61 -20 164 53 -124 -289 207 175 -156 84 94 -24 51 83 -55 -50 11 -8 -81 -20 61 101 -161 166
2007 166 230 25 5 -45 70 66 17 136 45 -107 226 -121 80 256 -10 57 175 7 -108 -93 222 101 94 -17
2031 -17 -228 4 4 -166 -84 -60 45 53 36 32 8 49 -26 -80 -35 -133 86 72 -1 -20 39 -91 -156 -10 3 -56 -149 -31
2059 -31 66 -61 -6 -313 -197 71 31 -72 16 -23 16 -33 106 -12 71 104 -23 -25 169 45 -41 -133 60 -82 -102
2084 -102 -31 34 -197 11 89 77 211 31 -107 17 133 49 -70 -100 -62 57 76 -137 59 160 40 -168 -17
2107a7O1P3l43K54Q7j33j0J11O4k61J09j5o2J93k35P5J9Q5m8j1L8j58L85k43N6
2132G4l5K6n8q2K82l98J18K4N4j12J01J49j64J14k12N4L7P6J0l5L1j9k76J87j42
2157a96Q4K2M8P3J55j68p5k5J38k76P4K08oJ2J9J08k49L4J48j6k05J07O2q8m6
2182e8J54rk9J9p7J87l57k7K21k0RJ2J90l12NR4m6j9J36l3l3j54L04j32r2Q4j16
2209i9J74j56J89k65J97q8J22m3q1k11J86JL66m10J43J01L3k79R3L6k4J6K9j74
2233a44J55N9J48m4k83J50j39Ok03K79p9K40K0N5j19o0j32j9j9K92j75N2r5L5
2257b0O3J36k13o9J07O5j67J18L0L7n0r2J10JJ60j68K15k49j23L12J49l97Q6m8
2281gj4M5K8p7j19j41L43j32J77J0J30r2n2J26m94L09q0k5J19j32P0K57N8m39
$$ plain form
2107 -17 44 117 -226 28 115 -18 -28 83 147 -114 -5 -20 -82 111 -124 -49 -30 55 7 -4 34 -124 261 18 74
2132 74 39 65 7 -75 207 -191 -73 -49 5 -107 -6 143 -21 93 -119 -65 -28 48 58 23 54 35 -241 -54 -196
2157 -196 -112 -90 -42 31 186 18 -57 -82 56 -220 -146 62 56 68 87 195 -54 -20 128 112 -93 14 76 -12 -58
2182 -58 96 87 58 77 0 187 -170 -197 24 4 13 25 215 -97 -92 2 -44 -63 73 40 7 -147 157 25 -67 17 -99
2209 -99 75 -81 108 -157 40 -48 74 31 -50 -261 -75 -74 292 -118 25 126 159 -120 -27 9 -15 1 30 -144
2233 -144 11 70 218 174 -109 41 -98 -92 -295 -16 -95 145 165 220 101 41 -91 -110 -129 163 -12 40 -55 -20
2257 -20 43 179 -34 -103 4 69 -98 20 50 87 37 -55 55 56 216 48 263 14 -109 203 352 -45 41 -7
2281 -7 -21 24 52 -25 -144 -285 58 -74 103 113 243 151 99 225 -269 40 -40 -65 54 -78 -8 249 307 -132
2305a32pJ68Kj61qJ49n0J05r3j32P5k30M39j42q3K2P5N2p4o4j92K46k28J43K24
2330A04j94o5r7K74J59j72j51J2N3QO7j11J51Op0J97j20l9j2j46J89l13K75l5
2354c0J39j43J07j07m1O5nr1L8O8N7P6nj72N6n7k3N5K50j87N9J44j98N8k23K68
2380A58k24j9J3Oj14M18j37k23%K90k32K6M7L3k14K74k3N6k25J23p7o8R5j63K29
2405D9Q4j23J7k17O3M2j66O8O1J14J21r2P3j9o4N5J0j93O5K10o5o7J14j46j47
2430a53n0K35j41L1J79k19L57k11L7k68K36m6O3J10k47J09m4O5J15N1l11k6J98
2453G0o8j18J0K78k61J85M1j51j82J47j02L3K28p2m4O1K87n53l3J07j47L76J16
2476B08q1O5j35M4j53P6j25J88m8o1j23K80k15P7O4j0J25n0j72J28q8j16Q6j08
$$ plain form
2305 -132 -139 29 31 -130 -138 11 -39 66 -27 -159 -84 -314 125 -17 -100 -78 -3 49 -25 -89 -281 -35 -263 -120 104
2330 104 -90 -155 -252 22 181 9 -142 -130 -77 -69 -2 -113 38 44 -26 171 51 12 0 -146 43 -270 5 -30
2354 -30 109 -34 73 -34 -75 -10 -15 -106 -68 0 57 133 128 -44 12 -45 -68 -13 237 50 109 253 55 113 -110 158
2380 158 -66 -85 -72 -66 -180 238 101 -122 -122 168 -64 -38 9 42 -172 102 79 135 -90 33 -44 -112 -17 -180 49
2405 49 133 10 27 -190 -127 -85 -251 -183 -122 -8 113 21 94 75 11 66 76 -117 -52 158 93 26 140 -6 -153
2430 -153 -203 32 -109 -78 101 -118 239 28 65 -203 33 -13 50 160 -87 22 -22 43 158 209 -102 -128 70
2453 70 2 -116 -106 172 -89 96 137 -14 -196 -49 -151 -118 110 38 -6 55 342 -211 -244 -137 -284 92 208
2476 208 127 192 57 101 -52 24 -101 87 39 -22 -145 135 -80 -3 61 51 176 126 -46 82 -6 -122 -36 -144
2500a44J69j1l28K95o1j50K90%j30N5J0l1J47j31j1J31j80J84J29j80l37J66o0
2523a78K5P5J01o5P2J92l99J82J78k21J85r7j54K81q2j43K07j59J06j27PJ12k79
2546a81J90mk2J40r8K2o6j61N8K28J51m16J47pj73J99r9M2M2QJ20R0o4k82l1J20
2572d7j15K38k8r8J73j54O3p7nK99j74k36K79m0j0k1n0J63k62r2J06O2J27Q5q3
2597A03j1k16J10P1j67L5L46l90K39j27k04K12N2Q4q4P1j22K47j34j68j6L1m8
2620h6O5j64P6K05k35J58k98K58K53m50K66L0K05k06k34J88j24L3j21J03l6J44
2642C0p2K31j21o6J18j65j64J87Q4j25J28L1J9j09K2QP4k07l4O7J40j16j53%L3
2667a60Q0J92j7j20J20j44K55j85o6J06p6J82l48J62j50J96L7Qj96Q7R2j93N0
$$ plain form
2500 -144 25 14 -314 -19 -80 -230 60 60 -70 -15 -5 -36 111 -20 -31 100 -80 104 233 53 -284 -118 -178
2523 -178 -153 -78 23 -42 30 222 -177 5 183 -38 147 50 -104 177 95 -48 159 0 106 -21 -14 98 -181
2546 -181 9 5 -17 123 25 47 -19 -180 -122 106 257 -159 -12 -19 -192 7 -92 -50 -8 0 120 210 146 -136 -167 -47
2572 -47 -162 76 48 -50 123 -31 32 -45 -50 249 75 -161 118 78 68 47 -3 160 -102 -194 -88 -26 101 186 103
2597 103 92 -124 -14 57 -110 -75 271 -119 120 -7 -211 1 53 137 53 124 2 249 115 -53 -69 -38 -86
2620 -86 -21 -185 -109 96 -139 19 -279 -21 232 -218 48 78 283 77 -157 31 -93 -60 -181 -78 -114 30
2642 30 -42 189 68 2 120 -45 -209 -22 62 -63 65 96 115 6 28 36 110 -97 -131 -64 76 -40 -193 -193 -160
2667 -160 -80 112 95 -25 95 -49 206 21 -45 61 -15 167 -181 -19 -169 27 64 72 -124 -37 55 -138 -88
2690h8M0m8K19j48p4J46n0p0P3m6n4L4M2M2j28R1j59K78Rj4j75k5J76l1J55l60
2716a65N28l74k27K36j28J19j06qJ80j65P4N9j50j12J75N2n1J41L7k23J35j25
2738i8m0j1L18J67k25r2j33L4k8J26P4j12m5K2m0q7J40N8J5L5j23L0J31j35J20
2763A01j00O5Oj41J18j53R6m9Q1kM0k64J08m9O8o2K71k31J79j58L34l74M1J31
2787E6J65k21J27j71n5L04J82m57L5P0q7J50k7r7J35j75K18k54J23n4L4J13j10
2810Dj21J20K8q1P0R8k24k0K23j66k6P6j47Q2j4P1K72k41J40k54j13O8J67j58
2834a46J37j3J50k72J32R9j66J62%p6p0K65l88L62q3j06J14j36J3J08k64O2J57
2857D1MN8r3j42L7O2J52k56J81j62J09j6J7mj2J11n6J43l2j48M5o9nj42J52J16
$$ plain form
2690 -88 -48 -96 123 -25 -99 47 -3 -73 0 -46 -100 -66 -24 18 -110 -19 -178 100 109 95 -80 -105 71 40 195 -165
2716 -165 363 -11 -238 -2 -130 -11 -117 -125 55 -110 -36 23 -127 -239 -64 -12 -63 78 115 -108 27 -98
2738 -98 -138 -149 169 336 111 19 -114 -80 -108 18 92 -20 -65 -43 -83 -170 -30 28 43 78 -45 -15 116 -19 101
2763 101 1 66 72 -69 49 -104 -8 -57 24 22 62 -202 -94 -143 -75 -137 134 -97 82 -76 258 -116 -75 56
2787 56 221 0 127 -44 -99 205 387 -70 -35 35 -52 98 71 -26 109 -66 152 -102 21 -33 1 114 4
2810 4 -117 3 31 -50 20 118 -106 -126 97 -69 -95 -19 -166 -84 -98 -27 245 4 144 -110 -223 -155 12 -146
2834 -146 -9 -22 128 -144 -12 87 -79 83 83 7 -63 202 -186 176 93 -13 101 -35 -22 86 -178 -116 41
2857 41 45 103 10 -132 -95 -33 119 -137 44 -118 -9 -25 -8 -12 -24 87 31 174 142 -6 39 -30 -35 -177 -25 91
2883I1kj43j48p4K86J7j55J62j16K35K8m16K47J69Jj78RJ1n3J84j15Mj47K38r8
2908C7j9l01L11l9r3J27j38J83n5r6L5M5n0J21J11k55o6J23J35o6l1R6p3j9K6
2933D9M4n6K52k45J85k85r9J30l7J11J7j54r9J27J0n4O6K4j37P8j36K79P3p4l2
2958C7j33O0k4K4J11j06J56P6l28L9L7K6J9m6r8J16O1m3Q4Q3j60j22J66o6K06
2983A75l11K50j11j56K68k6j34o8P8m4J82l22M34r8k38J62J50k19j1j26J10k42
3005b97L29r7J2Q4oj25k16L58k30K34k5p9m4J95o7R8j47Q2l5J4j86O2j31L01K
3030H6N4k73J29N2j67rk9K65m47M21j14J85Pj58j41N1J21k20J22K0J78qj29N1
3054D7l17L28j72L35j92n4J93j96J6j36j15K73L9P3k50J09J58J4k87K44NL2k77
$$ plain form
2883 91 89 -54 -202 -276 10 27 -128 34 -82 153 181 -235 12 181 182 4 13 24 -29 155 40 44 -103 135 37
2908 37 18 -283 28 -11 -104 23 -115 68 13 -83 -48 -3 -53 68 179 -76 -142 -19 116 50 19 115 42 23 49
2933 49 93 37 289 44 229 -56 -155 -25 -62 49 66 -88 -187 -60 -50 -104 -38 -14 -151 -73 -209 70 143 69 37
2958 37 -96 -36 -60 -36 75 -31 125 201 -127 -88 -51 -25 -6 -52 -150 -34 27 -16 68 151 -9 -131 35 -31 175
2983 175 -136 114 3 -153 115 89 -45 -113 -35 -79 103 -219 215 117 -121 41 191 -28 -39 -165 -55 -297
3005 -297 32 -65 -53 31 25 -100 -316 42 -188 46 21 -58 -102 93 26 124 -23 59 24 38 -148 -86 -217 84 86
3030 86 140 -133 -4 48 -119 -128 -157 108 -339 82 -32 153 160 2 -139 -88 33 -187 -65 -45 133 125 -4 47
3054 47 -270 58 -114 221 29 -25 168 -28 -12 -148 -263 10 49 122 -128 -19 139 153 -134 110 115 147 -130
3077a30J32j55J71j44J14K4J48q3j43N8pN3K22l91L54j33m9P0L2n9j19k6K80q7
3101A32l76K23J16j37j11J14P6J2j33JJ07J26k02O5P6P2q5j51J72o2J8J57k36
3124b6J4P8l04J67k9J57N9l9o7j41L3p1K82k37O3J59Q2k71J23pN9k47M70k96m9
3149c8j29J50J13j16N2o9j5O5r0J26K80l92J95j45P9j97K33l7k52K92j41R2k01
3172a45K11j8k63J39K60l49K7J98ok74M33l25lL3P2j04L10k81J20n1j33Q4J79
3195A14o7k08K89q5j50m9K03K1j60j07K85nN7j09J5j02O9j15J39J20j18L9j93
3218a17J25O1m0j81J34l7J45m5r7J01j12R1J38j49J1J3j01J22p6j42P6m3R5o0
3242h8Q0q5L9J98j02P7j70k3J08j38J61j00K59j05J5oj81L2J69m9K7l89M15R9
$$ plain form
3077 -130 2 -153 18 -126 -12 12 160 77 -66 -8 -15 38 260 -131 223 90 41 111 143 84 -35 -61 219 132
3101 132 -244 -21 95 -42 -153 -39 37 49 -84 -83 24 150 -52 13 89 161 76 -75 97 35 53 210 -26
3124 -26 -12 66 -238 -71 -100 57 116 77 10 -131 -98 -169 113 -124 -61 98 180 -91 32 25 84 -163 307 11 -38
3149 -38 -167 -17 96 -20 32 -37 -52 13 -77 49 329 -63 132 -13 66 -131 102 65 -187 105 -36 56 -145
3172 -145 66 48 -215 -76 184 -165 -138 60 54 -220 213 -112 -115 -82 -10 -114 196 -85 35 -16 -149 -65 114
3195 114 47 -161 128 43 -107 -156 47 68 -92 -199 86 81 138 29 44 -58 11 -104 35 155 37 76 -117
3218 -117 8 69 29 -152 -18 -55 90 45 -52 49 -63 28 166 17 28 41 -60 62 -14 -156 -80 -123 -28 -88
3242 -88 -8 -93 -54 144 42 119 -51 -74 34 -104 57 -43 216 111 126 120 -61 -29 140 91 118 -271 144 243
3266B43n0j81k51J41N4J16o6OJ57k43K43j41j68J92Qj16K8L9kJ12L9j7l42J51
3290d8P5j13l9j02K76j2j53O9J0J29q6n9L2m6Pj09J42J46k10L26l02K2L7m4M1
3315a1l2J93j82r2J11p4K79k20l9n6Q6M7J01k81J58q0J40j83J01m1O1K78l19L4
3339b1K22n07K62L7P9j33lPJ22k73J28N8n3K19k97J82j55L29m46L0M6J16L75j94
3363A30j74M9M7O4k48J89N2n5nj07K00k18J75j12J04p2R7j95K55j39m1o8J13j25
3387h4K76j21Q3j73Q4k17J40L5q9j75K46J74j21j49qJ00j11J9K74j51j80J01p2
3410a19J14j02J19j43J56R7j43J02J00k37K22j88J25J07k02k7j22J95j45N5k0
3431e6r0N5J98J11r2r3j75K28k06J9q7J20O2j06J82k16JJ57p2J35m2n6J23kj03
$$ plain form
3266 243 193 12 -239 -98 -44 72 6 12 169 -74 169 28 -140 52 60 -56 -28 11 9 121 160 143 -199 -48
3290 -48 27 -86 -125 -227 49 37 -116 -47 -37 92 6 -53 -21 -67 -60 -169 -27 119 -91 235 -67 -45 -8 -52 -11
3315 -11 -43 150 -32 -124 -13 -87 192 -28 -67 -123 -37 10 111 -170 -12 -92 48 -135 -34 -75 -14 264 -55 -21
3339 -21 201 -306 -44 -7 72 -61 -64 -57 65 -208 -80 -22 -75 144 -153 29 -126 203 -243 -213 -167 -51 324 130
3363 130 -44 5 52 116 -132 57 109 54 49 -58 142 -76 99 -13 91 19 116 -79 176 37 -4 -72 41 -84
3387 -84 192 71 154 -19 65 -152 -12 23 -66 -241 5 179 58 -91 -99 1 -110 -91 183 32 -148 -47 -119
3410 -119 -5 -107 12 -131 25 122 -21 81 181 -56 166 -22 103 210 8 -19 -141 54 -91 -36 -56
3431 -56 -146 -91 107 218 126 33 -142 86 -120 -101 -188 -68 -6 -112 70 -146 -145 12 -60 75 33 -23 100 98 -5
3456el7J84k36J18j61Qk0j2J48J12J95m88O5J29j67R9Q4j70J95j05j81M35l73
3479a83K06J02r9P5j55L44j49p1K2j29j0J05K04l24nJ25j68J35K09j22k58K29
3501H3j24J08j00O2Q5k75K43o6J23ol56o1K56J05m9k0J19o3p0k6J52J80j36k7
3525A37k6p0L6k36R7o2Q4j40K41J2O3k73rK10qj50K09j62q6Q0P5l0p8K99k81J53
3551H5k13J56L9k48J4J47J00r9J16P1j04k22J90Mp0j18K63kj94J48r3R5M3j85
3575g7J25o1j59N7J21kj27K58P2l85q8J85L2m1J28p4J8K05k38Q0K43k65l48N3
3599b88L38n4L5n1L7j52J74j40K02j61N2n2PO8J8j50j21K52j26J17N4Opl9k61
3624b42J1K48j6K8K24l20J0j15L33k04k3J8q0K09j25K8PJ86k58m0J99K02k83q2
$$ plain form
3456 -5 -42 142 -94 24 -137 -129 -149 -161 -13 99 294 -194 -129 0 -167 -68 16 -154 41 -64 -245 190 -183
3479 -183 23 125 26 101 -54 290 141 70 92 -37 -47 58 262 -62 -67 58 -110 25 234 112 -146 83
3501 83 -41 67 -33 29 114 -161 82 16 139 133 -223 -284 -28 77 28 8 127 64 -6 -32 120 300 164 137
3525 137 111 41 77 -159 -62 -124 -40 -180 61 73 136 -137 -146 64 56 -94 115 -47 -133 -53 22 -8 -86 213 -68 85
3551 85 -128 28 67 -181 -167 -20 80 -19 97 168 64 -158 32 36 -34 -152 111 109 -85 63 -30 65 108 -77
3575 -77 48 -13 -172 -115 6 4 -123 135 207 -178 -266 -81 -49 -90 38 -36 -18 187 -51 29 272 7 -341 -288
3599 -288 50 -4 31 -20 17 -135 39 -101 101 -60 -8 -60 -53 15 33 -117 -238 14 -112 5 59 65 58 19 -242
3624 -242 -231 17 1 29 253 -67 -57 -172 161 -43 -66 -48 -128 81 -44 -16 -9 177 -81 -121 78 280 -3 -85
3648h5j36J41O1k8j42K80R9r7j82R5p0NK16l12J39L3M1Q7k68J41p2K37k24p6J12
3673eo8L5kJ01j6K26j90p9o3K48j31n9q7J30k04K52Ok60J25n9N8L9o8l8K34M9
3699A74k71j36L20rK05k96p8mQ6J75k30K2J00m7Q4j57J10j07J05J72l66N0K35
3722A37j39j25K81j95j9o5L22Pj2k03o2L2m7K1k0J83j16N4l2o1K5K14m4k38J05
3747CR2j38m3jo0K23q8J27j07L2J46k68qJ41j66L8L47k42m3l1K18q9pj34p0K8
3773a00K12j04k07L11k23o8J71p6K9KM7PJ38j60qR8j05o5M4J55k82K18o9Q3J24
3798A72j19qM9Qn2k8j12j01J74Q8n5P3J0l3n2j92Q6K25j44l5J20n4J41l29L57
3823A89j34l1j10O0k7l0q2J57j06mL44k17j4J6N1K1o0q2Q3J47j36k07O7j6M1j
$$ plain form
3648 -85 -221 -80 -19 -47 -189 91 190 93 -89 6 -64 -59 157 -155 -16 17 58 145 -123 18 -54 183 -41 -117 -5
3673 -5 -73 -38 -40 61 45 271 81 2 -61 187 56 -3 -90 40 -164 88 94 -166 -41 -100 -42 -3 -71 -109 125 174
3699 174 -97 -233 87 78 283 -13 -91 -95 -9 166 -64 -42 58 11 95 -62 48 -59 46 218 -148 -98 137
3722 137 -2 -127 154 -41 -60 -125 197 204 192 -11 -73 -41 -88 -67 -87 96 -20 34 2 -59 -34 180 136 -102 3
3747 3 95 -43 -86 -87 -147 76 -12 115 8 40 186 -82 -90 51 -115 -77 270 28 -15 -46 172 83 76 -58 -128 -100
3773 -100 112 8 -199 112 -111 -179 -8 -84 -55 -53 -6 1 139 -21 -29 69 -36 -101 -57 98 -184 34 -35 48 172
3798 172 53 45 94 102 50 22 -90 -191 -17 71 16 89 99 66 14 -178 -92 133 -11 -46 74 20 161 -168 189
3823 189 55 24 -86 -26 -53 -83 -165 -8 -114 -118 226 9 -5 11 62 83 23 -59 24 171 35 -172 -105 -121 -80 -81
3849h1J84k77J28J4R1j37R5j09R9k42J30M4J82Kj67L2Q0j77J64K17k76K32l41
3872a13O2J24P6j48J7R6j76L5j89L22q9Q2j39k40J08K30R9k06J7J10Lj5k19K19
3896F6k1k16K87k99K12J8Ko6J54k01N6O7l13J14%K8L16k80k10J48J46j5R3N1l16
3921a79K22j60Pn8J18J91p7q7r5J77k72J84o5J18R7l36K0Q8R7k21L30j6k82K19
3945B0j2m1k01k2K33P8l8n8l9J76k67J07R7k78J54J56r9K81k98r6J18J82j38R2
3969A07Q6k66L0J67n8j79K69j59j27K02j95Q4R3m7j92R8J27O5j81K65j63j41n3
3992a68J35p7j7O9J17k43J18m6L76k90J41k72K31p1j10L36o5p5p6k29J46J3J45
4015H8o6K2Q8r9l9K0Q9n6j05j74K12j59K83l05J44P2J65j15j68j09J60J97l00
$$ plain form
3849 -81 103 -174 -46 -32 59 -78 17 -92 7 -235 -105 -61 121 123 -44 -12 68 -109 55 272 -4 228 -113
3872 -113 -51 73 149 1 18 114 -62 -27 -216 106 17 99 -40 -280 -172 58 157 -49 -32 78 81 66 -153 66
3896 66 45 -171 116 -183 29 47 49 -17 137 -64 -8 59 -254 -140 -140 -112 204 -76 -286 -138 8 -7 86 137 -179
3921 -179 43 -117 -110 -168 -50 141 64 -23 -118 59 -213 -29 -94 24 121 -215 -195 -107 -10 -231 99 83 -199 20
3945 20 8 -33 -234 -256 -23 55 17 -41 -80 96 -171 -64 33 -245 -91 65 -34 247 -51 -147 -29 153 15 107
3969 107 193 -73 -43 124 66 -113 156 -3 -130 72 -123 -39 54 7 -185 -87 40 105 -76 189 26 -115 -168
3992 -168 -33 -110 -127 -58 59 -184 -66 -112 264 -26 115 -157 74 3 -107 229 164 89 13 -216 -70 -57 88
4015 88 22 44 132 33 -6 14 103 47 -58 -232 -20 -179 104 -201 -57 15 180 65 -103 -212 -52 145 -155
4038a55K59l40J71K39l4j03p8K0l5L50m44K91l6j45J88k26jO5P2J11j14j96K28
4061H7j92n1K48j30L2J88k72J54o2j35K14m2j33O2jm0J6J54l7p9M7Nmol8J16j10
4088ij49K70K8k03NJ59j4j49j6o5rLK11l03K81R4k14J33j3N0j32J8N7j6M0j24
4114f7l0K81j90J99l29R5J77r1ON1p2J17pk75K23O5Kk06K65m14j1J8L41j23k65
4139b40L38j37L13k71R4j12j88L06m0m2K10k18J78j35M3j84O3J48l24J01l5P4
4161e8j23K31k14K94p7r1L38j55k80K6K41q2j45K28k28L1j7J86K2l0o2K4Kp5J15
4186A01p9k1qR4j59j99K00MK81j90J19j35k6N2k3QR0j7j76J45j04k5O6K6J96l7
4212A83j01j06M3P8j15Q7n6J72k49J74K8q7q9J4N0m3k8j19O0J01l9R8r6j12q3
$$ plain form
4038 -155 104 -236 -65 174 140 37 -41 -21 -56 294 -150 141 105 -40 148 -78 -79 -14 58 169 55 -141 87
4061 87 -105 -156 92 -38 -6 182 -90 64 2 -133 81 39 -94 -32 -33 -73 -57 97 60 -19 28 33 29 23 -15 101 -9
4088 -9 -158 112 140 -63 -58 101 87 -62 -78 -143 -152 -149 62 -241 40 134 -80 53 40 90 -42 -24 33 17 57 -67
4114 -67 -97 184 -6 193 -136 -41 136 45 51 102 30 147 140 -135 88 153 155 -51 214 -200 -211 -193 148 25 -240
4139 -240 98 -39 274 3 97 -15 -203 103 63 21 231 13 191 56 99 -85 -22 126 -198 -97 -132 -58
4161 -58 -181 50 -164 130 53 -38 300 145 -135 -109 132 50 -95 133 -95 -64 -81 105 127 97 35 59 61 -14 101
4186 101 22 1 -7 87 -72 -271 -71 -67 214 24 143 8 -18 34 11 19 109 92 -84 61 -43 -68 -2 24 220 183
4212 183 82 -24 19 97 -18 69 13 185 -64 110 138 51 -38 -24 26 -17 -45 -164 -104 -3 -42 56 -40 -152 -235
4237b35K33P5j30J53k08L42m06K48q3J57o1n4j2J73k60J6j56L88l26K78q7n5p5
4260h5P9N5M4j67N0J25j4k15J48l6j29J95n1J07j77OJ41q3J6n7P0j9M4lk7Q6M5
4287A48j61J76q3k28J60J60K5n39L55n0j34J4J05L9K12k53K45l71oK23m8j20o7
4310a98M4J76L0j86J7J31j07Q0j17K73k5j94J44k0k3J66j19k16O7m4k3n4K8K07
4334C7n4r0M4q4J87k37L18q2m30N16m1j00o4m9J89O9j38J03j51P3j07J29o8L1
4358Aj33J46lq6L5M9N5j22j43K43j15J39j74K58m9%k70J85J12m5qL8J07l55L5
4383a00K70k27k8K50k6p6J5K8j01N8j98K66Q7j6k51K3p9K38j69K0J21N2k95J38
4407@O6j12j77J78Q3O1L5l3j09M4o1J2l0J76k96K97k7q6m4n2q4K21m6r8L15m18
$$ plain form
4237 -235 -2 73 -57 96 -112 230 -176 72 -11 146 85 31 19 192 -68 -52 -208 180 -146 132 45 -10 -85
4260 -85 -6 49 93 -74 -24 101 87 -128 20 -16 -145 50 -1 106 -71 -65 76 -7 9 -48 22 3 47 44 17 103 148
4287 148 -13 163 80 -148 12 172 197 -342 13 -37 -171 -157 -52 -13 199 -54 191 -180 -186 37 -11 -131 -198
4310 -198 -154 22 52 -134 -117 14 -93 -13 -130 143 118 -76 68 48 25 191 72 -144 -77 -121 -144 -198 -170 37
4334 37 -17 -107 -63 -147 40 -197 121 39 -391 125 84 -16 -80 -129 60 129 -9 94 -57 16 -91 38 -30 1
4358 1 -132 14 11 -75 -40 9 64 -58 -201 42 -73 66 -108 150 101 101 -169 16 128 83 75 113 220 -135 -100
4383 -100 170 -57 -85 165 139 63 78 106 5 63 -135 131 218 202 -49 -26 -105 133 -36 -16 105 157 -138 0
4407 0 66 -46 -223 -45 38 99 134 101 -8 36 -25 -13 -43 133 -163 134 107 21 -23 -75 -159 62 16 -82 233 -185
4433a85L57J43l50k0M6q7k6L04o2j92Q7k37m0M03j46Q7q3R2j77J85L2n03K38L22
4457A88m7j91O5j24J19J33j89j22J64j08J02P7r2O2O2j20M5L8rKJ77l58K02n7
4481A9j46R0J53j78J15r0l2J54j66m9K46r5k1L4j64L98k78k11K47K2K02j58l2
4504F0K3j95J53j41jk9mJ36J30j57J01j16K6J57j68L4P5o0O4J1J22m32J85m0l7
4529a03M2J42k15Q3Q3l2N0j74J96j12K6kJ90j67j36M4L13k33M1j10K86k74j07
4552a69J17k0O8J48j62M0M2m6J55p3k4J01n2k19N7K9j23J31J43m8P3l50J56J24
4576I8o6o6J5M7O4qj75J38k04L26k08K72P6n32J30J56j17J21q2M5K32k80K30j21
4600I1k32J50R5l20K50J69j00j31L2jL2n7K03n0k45o7J64J00J1O1n0p8J51m0q5
$$ plain form
4433 -185 172 315 -35 -55 -9 -96 -122 182 120 -72 15 -222 -262 141 -5 82 -1 91 -86 99 131 -372 -134 188
4457 188 141 -50 15 -109 10 143 -46 -168 -4 -112 -10 67 -25 37 99 -21 24 62 53 55 232 -126 76 19
4481 19 -127 -37 116 -62 53 -37 -69 85 -81 -130 116 21 0 34 -130 268 -10 -221 26 48 250 92 60
4504 60 83 -112 41 -100 -101 -130 -134 2 132 -25 76 -40 -14 143 -25 9 84 24 88 99 221 -211 -26 -66 -103
4529 -103 -61 81 -134 -51 32 0 50 -124 72 -40 -14 -16 174 7 -129 -85 228 -5 36 -74 212 -62 -169
4552 -169 -52 -72 -4 144 -18 22 64 18 173 100 76 177 125 -94 -37 -8 -131 0 143 95 168 -182 -26 98
4576 98 32 -34 -19 28 92 84 -91 47 -157 169 -39 233 309 -223 -93 63 -54 67 -15 30 262 -18 212 91
4600 91 -141 9 104 -216 34 203 103 -28 4 3 35 -22 181 131 -114 -181 -17 83 94 155 105 27 178 138 53
4625E3j52K0K34k92R3m2Q3k6N3p8j61J20J56k02K14kk87J6P4P3J83P4o9o5J7j26
4651c9J76l59J04O5Ppj27K33r8Q1J6lr3J21j32J17j9M6j66N7j05J88P3m1L2jJ8
4678A44R8k22m6K46k63R5n9Q0k89J41j59L16l4l2pO4J10j27O5j72K17k18j7k9
4702i8J47j69jK71k52J19k02K92j55M7k32K19j07J29R3j00L7m4P2j49K21l4R4
4725A98j8k78J19k00R1l4j4M0K65n9n5p6p5J94plj28L09j58q5m1P7q1J7m1J30
4751H7j95N1L07k29p9J07K7j76M5M4k7J96j88O3j69N9K0J15l6j59R2j67K35n3
4775c0K80j76L6%k15n7M2Q0J87k58R3%J52l69Q1K56j41Q4mJ09k43P8L0L7k43K72
4801H1j81O0M6l1J8J20o9j16J01m6j63J38R1k95K01M3K1j0m7J97o8J40k70j94
$$ plain form
4625 53 -99 -79 155 -137 -44 -86 -3 -29 24 -54 -215 -95 61 -141 73 71 -216 -200 -126 -53 130 204 135 70 87 -39
4651 -39 137 -222 -118 -53 -46 -53 -180 53 -45 36 52 49 -44 77 -55 62 43 89 -77 -20 -125 63 136 95 127 126 144
4678 144 242 20 -26 220 -43 52 -7 73 -216 -75 -234 82 48 16 9 73 183 56 121 -51 166 -52 -69 -98
4702 -98 49 -120 -121 150 -102 17 -185 107 -48 -1 -233 -14 -121 8 101 1 38 -6 66 -83 138 104 198
4725 198 180 -98 21 -179 -88 -122 -136 -96 169 110 55 -21 -96 98 91 88 -40 269 111 26 -15 62 -19 -2 -43 87
4751 87 -108 -57 250 21 -58 49 76 -100 -55 -11 -38 158 -30 33 -136 -77 -57 58 22 -137 -45 -212 23 -30
4775 -30 250 74 110 110 -105 -162 -120 -40 147 -111 -18 -18 134 -235 -154 102 -39 45 41 150 -93 -15 15 52 -191 81
4801 81 -100 -40 6 -25 -7 113 44 -72 29 -17 -180 -42 49 -246 -45 -2 19 9 -38 159 91 231 -39 -233
4825b33K57K8n2k03M27n0k54L94l49J37j0n3q8K4R8j4j32J89j28L5J36L2j26L2
4849I7k82M7J55Q1m1q7k02M11J3k15K57j97j08K8K22j22j14J9r5K13k78J40J07
4872D9l02J16N9N0J07j39J75R9l51J55q5j36K24%j71R7RM2J72k97j8K1o4J41J40
4897I3J57l39K62k67L4r4J25j91P9L98l41j0K12L1j25j15J22n7R3O7p6j98K52
4920A12k26J37n9J48q2m9N2j67K77k18j18M95j69n6j46J29mo3q9Q3J38q6q5R2
4944D6R0k31J09j21J07R4M0j93k5pJ47k60M4K83k69K82j24j7m3J16j07L1J54r6
4968E0j79M21k00q4j57L01j04q1J04P2j54Q2j25N6j33K64l7L5j88J96o8J5j11
4991b5j26J34m8j22R1Q7Jj70K08k28L06j52o9j0J81N0rj5j88K08j69J34k24R6
$$ plain form
4825 -233 24 52 0 -203 224 174 -80 314 -35 102 92 39 -49 -25 73 59 -73 116 -12 23 159 191 65 97
4849 97 -185 -138 17 98 57 -30 -232 179 192 -23 234 37 -71 -43 179 57 -57 -38 -133 80 -198 -58 49
4872 49 -253 -137 -78 -28 79 -60 115 214 -137 18 -67 -203 21 21 -150 -53 -44 -2 170 -127 -145 -124 -188 -47 93
4897 93 250 -89 173 -94 -60 -154 -29 -220 -141 257 -84 -94 118 149 24 -91 31 -26 67 134 58 -140 112
4920 112 -114 23 -36 112 30 -19 33 -134 143 -75 -193 302 133 77 -69 60 56 -7 -96 -13 125 39 -46 46
4944 46 136 -95 14 -107 0 94 134 -59 -84 -91 56 -204 -160 123 -146 136 12 -5 -48 68 -39 -8 146 50
4968 50 -129 292 92 8 -149 152 48 -33 71 143 -11 71 -54 2 -131 133 96 131 -57 139 71 86 -25
4991 -25 -151 -17 -65 -187 -96 -9 -8 -178 30 -198 108 -44 -113 -123 58 108 99 84 -104 104 -65 69 -155 -59
5015e9j2M2j09J51K5r9P3k1J08j29K8O8k90L75r7l23M16j9k14J06j6J20p1l7k5
5040iJ0k0q4K90j89J15j73J30k2k44L27j57j20J00O9mJ33j31jj07L2OL5%r8J22
5066A0j14J78j96k2J61m1j21L40K30l53o3O4mm6j25P5K04j84K4r6J49j55J87k06
5090a04K4l9RJ15j64O0K70o4r7K19l64K62r3m4J88k29J78k28J88m3K4kk25N6J22
5115A9r7M5Q4r1N1j95K33k2R6k07J39Nj2J4n0K0K2j70K00j84J38j60K11j39J41
5140I1k58K87lj93L32k95J30k59J62j68L29l68K38l3Q0j11J44j85j4PM8K8r6M4
5164f3J64p4K0J0n4R9j78K82p7o9k48K19J64k53L3R6q6j15J51R4m9o1K81k90P0
5189F6k07J94k18J12K11m3q5Rp2j40K67j2R4l55L03q3O4r7K5J09m23O3J05N5J17
$$ plain form
5015 -59 -71 -29 -138 13 38 -61 12 -9 99 -30 -2 66 -224 151 54 -269 147 128 -86 20 4 124 53 16 -9
5040 -9 1 -19 -103 187 -2 113 -60 70 48 -196 131 -26 -146 -46 23 19 152 21 20 -87 -55 -49 -14 -14 -112 10
5066 10 -104 74 -122 -144 17 -24 -145 195 425 72 9 73 69 23 -102 -27 177 -7 17 -79 70 -85 102 -104
5090 -104 -80 -119 -110 5 -159 -99 171 107 10 229 -135 127 34 -10 178 -51 127 -101 87 44 68 66 -159 -103 19
5115 19 -78 -33 51 -40 11 -184 49 27 123 -84 55 60 48 62 12 32 54 -116 84 -100 38 -122 89 -50 91
5140 91 -167 120 117 -76 256 -39 91 -168 -6 -174 155 -213 25 -8 72 -39 105 -80 -94 -87 -39 -11 -107 -63
5164 -63 101 27 47 57 3 102 -76 206 129 60 -188 31 195 -58 -25 71 -15 -130 21 115 66 5 286 -4 66
5189 66 -141 53 -165 -53 158 115 30 39 -33 -173 94 82 176 -179 124 41 105 8 33 142 -281 -218 -113 -58 59
5214E9m1k37J14K18m6k51L47L1l43K42l6O9o8j45J75k87J00R7J70k79J70k15K22
5237F6l1J22l76J35K2PL4j07O1MQ3J21j54j48J75r3L2RJ72m2j95J49K3m5m3Q7
5263F8R2q7rnPn3l9l3N2j20K40p9q0KN9mK09k24Q0j0j91K05r6m7P6J95j31k03
5291a26k60L85p3J90j15j90J75Q3k41K25Q6k85J3K13J12K8r0o2K27l05p8m4R5
5314c7M8k0k06K72l06K29O1j09N5p9n2L17l08L73l8k62J2J91j96K93q2n3Qj70
5338e9P7M3r9J23q3J99j92N8j32j1K42l17m4J28R5N2k76J98Pn2r3l4J35K21k37
5363e1j05J47j83Q1KL4j41K51nJ06m12K27j98M90n7m98N62l93L27j52j20K47K
5386A61k72J81L3r1p0R6P6r0j18JJ33j53K69k50J01q0J43q0l7K39l00L43k17M
$$ plain form
5214 59 18 -219 -105 113 67 -184 163 194 -149 93 57 126 58 -87 88 -199 -99 -2 168 -111 59 -156 66
5237 66 35 157 -219 -84 -62 -55 -21 -128 -67 -63 20 141 -13 -161 14 -79 -47 -38 134 92 -103 46 69 24 -19 68
5263 68 160 73 64 59 66 13 -26 -59 -7 -127 113 34 -46 -44 15 11 220 -4 76 66 -125 80 -16 -63 13 208 77 -126
5291 -126 -386 -1 -74 116 1 -189 -14 69 -172 53 139 -146 -133 80 192 220 130 68 295 -10 -88 -132 -37
5314 -37 11 -9 -215 57 -249 -20 41 -68 -13 -92 -144 173 -135 238 200 -62 -50 141 -55 238 156 103 111 -59
5338 -59 18 61 -38 85 2 201 9 67 -65 -76 166 -151 -195 -67 28 80 -196 2 9 -43 -136 -170 -35 186 -51
5363 -51 -156 -9 -192 -111 -109 -75 -216 35 30 136 -276 -49 -247 243 186 -312 250 -143 184 32 -88 159 161
5386 161 -111 70 103 12 -58 38 114 24 -94 -93 40 -113 156 -94 7 -73 70 -10 -47 192 -108 235 18 22
5410B2k53K50k65J24K52j45o4J2L7K3J9j76O3j1J64j36J39R4J7k16J12L9J67k31
5434C7j28M4K38J0L0l62m5L74j55q8J6Q9q9p3J14K5o6Pm2o1L05k34J9O8k44J19
5460i2l2Q5J03J4M6o7p7n8K10m1p5J75j27J02j83L9j43J37J23k4K3J16J6j5l21
5485f6Q4k77L99k60N7N9r3P0j31K19l6o5J6o6J30J0j31J04o1p9m9L54l00j65L82
5510A05k41K25Q8k29j46K31o3N3O5j84lK3RJ01K22l20R3m9N5j27M5J96j6j73j06
5535a46K00j93K22r3k4R4J23P6j52k38R2K9J67j15R4j48j24L08j87qN0J13p3k36
5559a69O2K02k15r8J42p8K19O7q5j46n0J55j8j07N4J89K12n56K57o3K21Q1l56
5582h0L5l2L6p1R5k39K93l5k3k2j67J99P2o4k36L65m33J62p3K11j32L8l1P5j07
$$ plain form
5410 22 -231 19 -246 -122 130 -15 -79 -67 -30 -7 12 -164 -101 -112 52 -84 55 149 166 -50 62 101 268 37
5434 37 -91 -47 191 201 231 -131 -176 198 43 -45 -29 60 -29 -102 12 37 -29 -22 -64 -125 180 -54 -35 33 -211 -92
5460 -92 -124 -39 64 78 124 57 -20 -78 132 91 16 191 64 166 -17 22 -121 16 139 115 138 254 270 255 -66
5485 -66 18 -259 140 -120 -63 -4 -97 -27 -158 61 25 -40 -24 -90 40 50 -81 23 -38 -117 -166 188 -112 -277 105
5510 105 -136 89 177 -52 -198 33 -30 23 88 -96 -99 -76 -67 34 256 -64 29 -20 35 -92 -47 149 133 -40 -146
5535 -146 54 -139 83 -10 -34 60 183 259 107 -131 -39 -10 157 42 136 -12 -136 172 -15 -23 27 140 67 -169
5559 -169 -107 95 -120 -218 -76 -154 65 132 47 -99 -149 6 -12 -119 -65 124 336 -220 37 -26 195 276 -80
5582 -80 -45 -77 -41 -112 -17 -256 37 2 -21 -43 -210 -11 61 -3 -239 126 -307 -145 -218 -7 -139 -101 -132 -57 -164
5607a64J65k7R2k5j80M5K10J30o3k96P2K19k04L1K7k07J45k2L2M8l02J18J72J46
5631A62p5jj88P5k2O5K0j53J45o2k14J99J51J03p9k01lK5P8l29K64J7o9K0J05
5656C3m6l4L4o4K92k34J10j82l6R8O9j42J0J53k9j7L0j08n9L16k47L22k17K30
5680B82l62k5k4M0L79p4J2k15j41J86j40P3M0r2P4J42j68L0K22j03k30K41l77
5703b30J47K14r5P4m9K0J3j16Q6p3J65j69J70J30m33J17O0J4j9q1r3j4K50L5m9
5728G4r8J26p9j46m8J36MP7m3J09j83Q5j8Q3j35J74q4O6j90jRQj49J17J59M0j27
5755c4R6K42q4k58L7j7O7j97L24k21K0N6J04m7k62M47l44O5p4J54pkq3J51j0j08
5781A5k29J95J96m04K77L0k09K16j05j19L75j61j8k8k64M7J73k73M89l74J73k10
$$ plain form
5607 -164 1 -26 66 41 -139 -94 116 246 183 -113 -41 178 -26 5 32 -175 -30 -52 -20 28 -274 -156 16 162
5631 162 87 86 -102 -27 -49 16 36 -117 28 -34 -248 -49 102 205 126 -75 -78 -53 25 -304 -40 -23 -92 -72 33
5656 33 -13 -47 -13 -77 215 -19 91 -91 -127 -29 40 -102 -92 61 32 15 45 -63 -122 194 -53 269 52 282
5680 282 -80 -105 -129 -89 290 216 228 13 -128 58 -82 -9 31 -61 13 155 -13 17 239 136 -94 147 -230
5703 -230 -83 131 36 110 61 81 94 -22 64 -9 156 -13 157 287 -146 -29 31 45 26 -55 -148 -162 88 123 74
5728 74 -24 102 23 -123 -171 -35 -31 46 3 112 -71 14 -4 79 -56 118 34 100 -90 -91 -82 -74 -223 -106 53 93 -34
5755 -34 62 304 220 -38 -1 -18 49 -148 176 -45 -25 31 135 88 -174 273 -71 -6 -80 74 67 65 -18 133 123 15
5781 15 -214 -19 177 -227 50 80 -129 87 -18 -137 238 77 59 31 -233 -186 -13 -286 203 -171 2 -208
5803b08M0K02j10L13n06J97P0q3K3J02o1Lm5O6P5l3j02K34j29k82L80o9m1j70
5827a34J25K4j16L6K08k26J40N6q6Pl0N3R0k68J22q5K8j8nj0No4J69J61o5j40
5853b3Q2l6j29R7o7K76j15m0J13N1l11j0k09L69j18PJ34n8j3l5J4J52Ol58K18
5878cj66L07j23l64K36K05l80M09%l5j5nj69l9J82j04P9r5J04o3J9l8M5P6k46
5903a83K29k10Mo5J91P2J7j57p2J15M9k9L6k56J79m8N2M9o2K8K97k76J57M6j61
5928Bk03K58m4j85J97l2j16J26kJ95j23l4N4o4j17QR5j72K87k85J99r6Q6j01O
5953f1P9p9l6J24J72m28J88J50j96J94j19k01L58J05l76P7j89Q2P0J65k97K32
5975A4N1N6r9p8Q9K9n5p5j2K57k13O1q3O7R5p1R6l6J6j55k3J33J8j04J25j13j67
$$ plain form
5803 -208 -168 34 -76 237 -269 -72 -2 -85 -62 40 -21 -18 -63 3 78 45 -57 177 48 -234 146 77 36 -134
5827 -134 -9 15 -101 -65 143 -83 57 113 27 34 4 57 147 -121 1 -84 -56 -74 -79 -89 -84 -148 21 182 117 -23
5853 -23 59 23 -106 -9 -76 200 85 45 158 209 -102 -112 -321 48 -70 -63 71 13 0 -35 -21 131 137 -221 -3
5878 -3 -169 138 15 -349 -113 92 -288 121 121 86 71 66 -103 -142 40 -64 15 -80 24 -39 -20 -58 -13 63 -183
5903 -183 46 -164 -160 -225 -34 38 55 -102 -174 -59 -10 -39 -3 -259 -80 -128 -76 -27 -89 -61 236 -40 117 163 2
5928 2 -201 57 13 -172 25 -7 -123 3 1 196 73 39 93 29 -88 -80 15 -157 130 -155 44 -52 34 -67 -61
5953 -61 18 -61 -97 27 199 -229 -41 109 -87 107 -12 -213 145 250 -126 -49 -238 -156 -86 79 -218 14
5975 14 65 121 22 -56 33 62 7 -68 -80 177 -36 25 -58 9 104 33 129 93 109 -46 -69 64 82 -22 103 -10 -177
6002a77L33n0j11j16k6K69j08q7n9J57j98J68K06l07j00K60j66J92m43K60J92
6023H9r1k05PK91Mk20K8K09k05Q4mj22J08k08J74m8J15nJ59o4P8P6k73j54K46
6048F9n8Q0m8N0O7j25q1m7J73j86K95q5j11Q4r2L7o4J21m0j06j97J91J33J61k45
6073b4Q6n6j39J25j28m7J34o8K29r8n7k1J79j34j58K15r5j46o6J71J30j04K90
6096B18k76J39o7k55K42k8k4J2K31m31J12J13M1lr3n7jK42j43P2k9K20k06o6J3
6121b4j8j44L25j07J55p1j34J05k49K65k0j05j3J34j76O4n1J76j16o1NJ24n2J65
6145A77j87o2j03L4K80j74j00K00P3j19n4k3J42j22k6j85R8J0J39m5J22j31J25
6168F9J13k16K6J1J12r7oJ22k21Q4r4o1k0J04J95O9k51k6O4J7J6R5k20J1J39N
$$ plain form
6002 -177 156 106 -5 -121 -147 122 14 -73 -132 25 -173 -5 201 -106 -206 54 -112 80 -363 -103 89
6023 89 -2 -207 -200 91 95 -125 -97 112 -93 -9 -13 -135 -27 -235 -61 -109 6 1 160 96 174 250 -23 -177 69
6048 69 11 91 43 93 160 35 -46 -93 80 -106 189 104 -7 77 -15 22 -42 79 39 -67 -264 -73 60 221 -24
6073 -24 62 6 -133 -8 -136 -183 -49 -117 112 14 -43 -64 115 -19 -177 38 -57 -203 -269 -98 32 -72 218
6096 218 -58 81 14 -241 1 -27 -51 -39 192 -239 -127 -14 27 24 -69 -126 -127 115 -28 44 15 235 29 -37 -24
6121 -24 -42 -186 139 32 187 116 -18 87 -162 103 83 -22 -35 99 -77 -13 -64 112 -4 -65 -60 64 12 177
6145 177 -10 -72 -175 -141 139 -35 -135 65 138 19 -35 -58 84 -38 -64 -249 -151 -141 -2 -47 75 -56 69
6168 69 182 -34 -8 3 115 18 12 134 -87 -3 -97 -158 -178 -74 121 190 -61 -87 -23 -6 10 105 -115 -104 35 40
6194D0j27r4K34p0o7J26J5k13o6K09J7L5k67J76Ll4J9J75Q6j81k5P6j2oj72J54
6220C1o8J49j81K24j10j9QPl5j25K42j45O4R7k19K05p8n6k0L1O2J2l18K76m9n4
6246f9J36k75K97j16k95J53J97p7J38j26k9J79o3l06M24j67R0j71rL7j21J80k8
6269b1K42j89K2J19k09J72Ok03j62K88k01R5N2j8O1j60J09n4J55k42M34k12l8
6292D6o9M8J2L5J45k96M6j79L55j96r2K67j1j58J90o7N8o8Q6l20j41J64J41R8
6316I4j78J19j65K54j76j6Nl4j8P0Rm4Q9l5k7J30j0k8R2l01K24K0n0N7j95J7R0
6343gk56K16K8N3k11J61j8L4j41Q6P0J71k50J88n2j93j8J77q0j1J44k56L8J88
6367F1p2O3j10J69r7O3mPJ25k36j01p6K80K9L5j94j23K83j30J17l4p2N5q7K08
$$ plain form
6194 40 -87 -181 53 -17 -84 42 57 -156 -222 -13 4 39 -228 -52 -49 -83 -64 111 197 16 -9 67 55 49 -123 31
6220 31 -37 112 -69 155 45 26 34 41 6 -119 123 -22 42 139 -80 125 47 -9 -29 2 64 76 -242 34 -15 -69
6246 -69 67 -208 89 -27 -322 -169 28 -49 89 -37 -66 113 50 -256 168 1 91 -80 -89 -52 -173 7 -21
6269 -21 221 32 54 173 -36 136 142 -61 -223 65 -136 -41 11 -7 54 -106 3 -51 104 -138 296 84 46
6292 46 -23 25 37 72 217 -79 -33 -212 143 -53 -145 122 111 -47 143 76 134 66 152 -168 -309 -145 -4 94
6316 94 -84 35 -130 124 -52 -68 -63 -97 -115 -45 -36 -80 9 -26 -53 77 67 39 131 -170 54 74 24 81 -114 -97 -7
6343 -7 -263 -47 -19 34 -177 -16 -34 0 -141 -55 15 186 -64 124 72 -121 -139 38 -42 -53 91 -165 -127 61
6367 61 -11 52 -58 111 14 77 73 80 205 -31 -132 -208 72 101 136 -58 -181 102 -28 89 55 -17 38 -49 159
6392A59qj15o1N9l7j5N3j58K20R9j84j54J43o8J29q3j84K24J07j23k1P7J3k61
6416a89K29L8j80K12k14p4J74Q6k11Q4J07l8j94K32lj69J66j10J3O9j35K31k45
6439a21L22j54n9k4J54j45Q1K1p0p9j31J86r8K0K39j86n7J36qo3J19j12k29L47
6463H9j37Q5j67J04n7j07K42m9j23J91j8p9j9J33K6j07Q3k12J05N6n0%m1Q5J48
6488A81j22K2j69R3N8j6J3j23OJ3o0l8P1J5rlk8n0K79j11J65l71J44j09L99k91
6514d1J70j08L8M4k49K29q8K2j56J00R1Q2o3j21n7P9J0k1J5p1K36j89M9l7N9n0
$$ plain form
6392 159 151 36 -25 34 -3 -18 35 -123 97 196 12 -142 1 -67 62 -21 -205 19 126 3 -18 59 72 -189
6416 -189 40 78 -102 110 -104 -178 -4 82 -129 -45 62 24 -170 62 59 -110 56 -54 -41 28 -107 124 -121
6439 -121 201 47 -12 -36 118 -27 54 75 5 -74 -205 -19 -117 -97 142 -44 -101 35 27 -36 83 -29 -258 89
6463 89 -48 37 -130 -26 -83 -190 52 3 -120 71 53 -26 -45 88 114 7 90 -122 -17 39 -11 -11 -52 33 181
6488 181 59 81 -88 5 63 47 60 -63 -57 -44 -104 -142 -71 -56 -65 -68 -96 -146 133 22 187 -184 -40 -149 250 -41
6514 -41 129 21 59 103 -146 83 -5 17 -139 -39 52 134 71 -50 -107 -28 -18 -39 -24 -95 141 -48 1 -36 23 -27
$$ [...]
8191I8
##END NTUPLES=NMR FID
##END=
