##TITLE=1H_DE-80H_X3
 200.13MHz, d2o
 8 sc
 
 19ns.26.2.2025
##JCAMPDX= 6.0         $$ Bruker NMR JCAMP-DX V2.0
##DATA TYPE= NMR FID
##DATA CLASS= NTUPLES
##ORIGIN= UXNMR, Bruker Analytische Messtechnik GmbH
##OWNER= pz
$$ XWIN-NMR		Version 3.5
$$ Tue Mar 18 15:38:25 2025 Russian Standard Time (UT+4h)  Yarkov@DPX200
##.OBSERVE FREQUENCY= 200.1313
##.OBSERVE NUCLEUS= ^1H
##.DELAY= (6, 6)
##.ACQUISITION MODE= SIMULTANEOUS
##.ACQUISITION SCHEME= undefined
##.AVERAGES= 8
##.DIGITISER RES= 18
##SPECTROMETER/DATA SYSTEM= spect
##.PULSE SEQUENCE= zg30
##.SOLVENT NAME= D2O
##.SHIFT REFERENCE= (INTERNAL, D2O, 0, 14.3821)
##AUDIT TRAIL= $$ (NUMBER, WHEN, WHO, WHERE, WHAT)
$$ ##TITLE= Audit trail, XWIN-NMR		Version 3.5
$$ ##JCAMPDX= 5.01
$$ ##ORIGIN= Bruker BioSpin GmbH
$$ ##OWNER= Yarkov
$$ C:/Bruker/XWIN-NMR/data/yarkov2/nmr/H-C/1/audita.txt
$$ ##AUDIT TRAIL=  $$ (NUMBER, WHEN, WHO, WHERE, WHAT)
(   1,<2025-03-18 15:36:56.23 +0400>,<Yarkov>,<DPX200>,
      <created by zg, POWCHK disabled, PULCHK disabled
       configuration hash MD5:
       00 E9 B6 7A A2 85 ED C7 34 08 36 98 17 FE 4E 26
       data hash MD5: 16K
       81 6B C8 65 7A 94 71 5E DC BF B5 FD 32 CA AC 12>)
$$ ##END=
$$ 
$$ hash MD5
$$ 02 94 99 51 3B 01 77 9B A3 85 AE D1 D5 A6 90 B1
##$RELAX= 
##$RELAX= 
##$RELAX= 
##$RELAX= 
##$RELAX= 
##$RELAX= 
$$ Bruker specific parameters
$$ --------------------------
##$DU= <C:/Bruker/XWIN-NMR>
##$EXPNO= 1
##$NAME= <H-C>
##$PROCNO= 1
##$TYPE= <nmr>
##$USER= <yarkov2>
##$AMP= (0..31)
100 100 100 100 100 100 100 100 100 100 100 100 100 100 100 100 100 100 
100 100 100 100 100 100 100 100 100 100 100 100 100 100 
##$AQSEQ= 0
##$AQ_mod= 1
##$AUNM= <au_zg>
##$AUTOPOS= <>
##$BF1= 200.13
##$BF2= 200.13
##$BF3= 200.13
##$BF4= 200.13
##$BF5= 200.13
##$BF6= 200.13
##$BF7= 200.13
##$BF8= 200.13
##$BYTORDA= 1
##$CFDGTYP= 0
##$CFRGTYP= 5
##$CHEMSTR= <none>
##$CNST= (0..31)
1 1 145 1 1 1 1 1 1 1 1 1 1 1 1 1 1 1 1 1 1 1 1 1 1 1 1 1 1 1 1 1 
##$CPDPRG= <>
##$CPDPRG1= <>
##$CPDPRG2= <>
##$CPDPRG3= <>
##$CPDPRG4= <mlev>
##$CPDPRG5= <mlev>
##$CPDPRG6= <mlev>
##$CPDPRG7= <mlev>
##$CPDPRG8= <mlev>
##$CPDPRGB= <>
##$CPDPRGT= <>
##$D= (0..31)
0 0.7 0 0 0 0 0 0 0 0 0 0.03 0 0 0 0 0 0 0 0 0 0 0 0 0 0 0 0 0 0 0 0 
##$DATE= 1742297815
##$DBL= (0..7)
120 120 120 120 120 120 120 120 
##$DBP= (0..7)
150 150 150 150 150 150 150 150 
##$DBP07= 0
##$DBPNAM0= <>
##$DBPNAM1= <>
##$DBPNAM2= <>
##$DBPNAM3= <>
##$DBPNAM4= <>
##$DBPNAM5= <>
##$DBPNAM6= <>
##$DBPNAM7= <>
##$DBPOAL= (0..7)
0.5 0.5 0.5 0.5 0.5 0.5 0.5 0.5 
##$DBPOFFS= (0..7)
0 0 0 0 0 0 0 0 
##$DE= 6
##$DECBNUC= <off>
##$DECIM= 32
##$DECNUC= <off>
##$DECSTAT= 4
##$DIGMOD= 1
##$DIGTYP= 9
##$DL= (0..7)
0 120 120 120 120 120 120 120 
##$DP= (0..7)
150 150 150 150 150 150 150 150 
##$DP07= 0
##$DPNAME0= <>
##$DPNAME1= <>
##$DPNAME2= <>
##$DPNAME3= <>
##$DPNAME4= <>
##$DPNAME5= <>
##$DPNAME6= <>
##$DPNAME7= <>
##$DPOAL= (0..7)
0.5 0.5 0.5 0.5 0.5 0.5 0.5 0.5 
##$DPOFFS= (0..7)
0 0 0 0 0 0 0 0 
##$DQDMODE= 0
##$DR= 18
##$DS= 0
$$ [...]
##$SUBNAM0= <"">
##$SUBNAM1= <"">
##$SUBNAM2= <"">
##$SUBNAM3= <"">
##$SUBNAM4= <"">
##$SUBNAM5= <"">
##$SUBNAM6= <"">
##$SUBNAM7= <"">
##$SUBNAM8= <"">
##$SUBNAM9= <"">
##$SW= 18.0517328524113
##$SWIBOX= (0..15)
0 0 2 0 0 0 0 0 0 0 0 0 0 0 0 0 
##$SW_h= 3612.71676300578
##$TD= 16384
##$TD0= 1
##$TE= 0
##$TE2= 300
##$TE3= 300
##$TEG= 300
##$TL= (0..7)
0 120 120 120 120 120 120 120 
##$TP= (0..7)
150 150 150 150 150 150 150 150 
##$TP07= 0
##$TPNAME0= <>
##$TPNAME1= <>
##$TPNAME2= <>
##$TPNAME3= <>
##$TPNAME4= <>
##$TPNAME5= <>
##$TPNAME6= <>
##$TPNAME7= <>
##$TPOAL= (0..7)
0.5 0.5 0.5 0.5 0.5 0.5 0.5 0.5 
##$TPOFFS= (0..7)
0 0 0 0 0 0 0 0 
##$TUNHIN= 0
##$TUNHOUT= 0
##$TUNXOUT= 0
##$USERA1= <user>
##$USERA2= <user>
##$USERA3= <user>
##$USERA4= <user>
##$USERA5= <user>
##$V9= 5
##$VALIST= <valist>
##$VCLIST= <CCCCCCCCCCCCCCC>
##$VD= 0
##$VDLIST= <DDDDDDDDDDDDDDD>
##$VPLIST= <PPPPPPPPPPPPPPP>
##$VTLIST= <TTTTTTTTTTTTTTT>
##$WBST= 1024
##$WBSW= 4
##$XGAIN= (0..3)
0 0 0 0 
##$XL= 0
##$YL= 0
##$YMAX_a= 173512
##$YMIN_a= -201604
##$ZGOPTNS= <>
##$ZL1= 120
##$ZL2= 120
##$ZL3= 120
##$ZL4= 120
##$ABSF1= 10
##$ABSF2= 0
##$ABSG= 5
##$ABSL= 3
##$ALPHA= 0
##$AQORDER= 0
##$ASSFAC= 0
##$ASSFACI= 0
##$ASSFACX= 0
##$ASSWID= 0
##$AUNMP= <proc_1d>
##$AZFE= 0.1
##$AZFW= 0.1
##$BCFW= 1
##$BC_mod= 2
##$BYTORDP= 1
##$COROFFS= 0
##$CY= -3
##$DATMOD= 1
##$DC= 2
##$DFILT= <>
##$DTYPP= 0
##$F1P= 0
##$F2P= 0
##$FCOR= 0.5
##$FTSIZE= 0
##$FT_mod= 4
##$GAMMA= 1
##$GB= 0.15
##$INTBC= 1
##$INTSCL= 1
##$ISEN= 128
##$LB= 0.25
##$LEV0= 0
##$LPBIN= 0
##$MAXI= 10000
##$MC2= 0
##$MEAN= 0
##$ME_mod= 0
##$MI= 1.114404
##$NCOEF= 0
##$NC_proc= 0
##$NLEV= 6
##$NOISF1= 3.799351
##$NOISF2= 2.8
##$NSP= 1
##$NTH_PI= 0
##$NZP= 0
##$OFFSET= 14.38212
##$PC= 1
##$PHC0= -1198.557
##$PHC1= 21.59223
##$PH_mod= 1
##$PKNL= yes
##$PPARMOD= 0
##$PSCAL= 0
##$PSIGN= 0
##$REVERSE= no
##$SF= 200.129724274929
##$SI= 16384
##$SIGF1= 3
##$SIGF2= 2
##$SINO= 400
##$SIOLD= 16384
##$SREGLST= <1H.CDCl3>
##$SSB= 0
##$STSI= 0
##$STSR= 0
##$SW_p= 3205.1282051282
##$SYMM= 0
##$S_DEV= 0
##$TDeff= 0
##$TDoff= 0
##$TI= <>
##$TILT= no
##$TM1= 0
##$TM2= 0
##$TOPLEV= 0
##$USERP1= <user>
##$USERP2= <user>
##$USERP3= <user>
##$USERP4= <user>
##$USERP5= <user>
##$WDW= 1
##$XDIM= 8192
##$YMAX_p= 0
##$YMIN_p= 0
$$ End of Bruker specific parameters
$$ ---------------------------------
##NTUPLES= NMR FID
##VAR_NAME=  TIME,          FID/REAL,        FID/IMAG
##SYMBOL=    X,             R,               I
##VAR_TYPE=  INDEPENDENT,   DEPENDENT,       DEPENDENT
##VAR_FORM=  AFFN,          ASDF,            ASDF
##VAR_DIM=   8192,          8192,            8192
##UNITS=     SECONDS,       ARBITRARY UNITS, ARBITRARY UNITS
##FACTOR=    0.0002768,     1,               1
##FIRST=     0,             0,               0
##LAST=      2.2672688,     0,               0
##MIN=       0,             -201604,         0
##MAX=       2.2672688,     173512,          0
$$ Real data points
##PAGE= N=1
##DATA TABLE= (X++(R..R)), XYDATA
$$ [...]
$$ plain form
1787 141 617 841 849 578 -126 -256 -675 -832 -378 31 428 615 574 346 163 -360 -685 -494 -462 -112 108
1808 108 745 682 566 -67 -59 -475 -796 -560 -261 93 444 721 544 343 -144 -571 -672 -465 -202 269 568
1829 568 614 632 333 106 -513 -560 -604 -442 -137 523 764 578 382 -197 -123 -663 -658 -400 -4 354 506 567 546
1852 546 164 -501 -642 -582 -543 -180 134 661 697 514 24 -120 -484 -859 -443 -96 20 400 687 650 23
1873 23 -196 -304 -698 -778 -357 89 578 713 524 578 -89 -351 -664 -443 -335 20 619 745 730 352 -80
1894 -80 -235 -519 -458 -459 -186 312 618 597 279 254 -285 -477 -556 -479 -94 330 428 517 540 329 -168 -749 -690 -731
1918 -731 -196 38 668 788 496 179 -114 -473 -773 -598 -294 -55 360 698 510 219 -314 -504 -726 -717 -347
1939 -347 190 401 761 733 418 -88 -114 -682 -832 -410 -203 211 732 712 348 -253 -348 -714 -700 -561 3 122
$$ packed form
1787A41M76K24Qk71p04j30m19j57M54M09L97J87m1k28j83n23l25J91L2L50K20
1808A08O37o3j16o33Qm16l21K36K99L54L51K77j77k01m87m27j01K07K63M71K99
1829E68M6J8k99k27o19m7m4J62L05O60K41j86j96n79P4n40NK58L96L58J52O1k1
1852E46l82o65j41O0L9L63L14N27L6j83m90j44l64l75M16L47J16L80K87l7o27
1873B3k19j08l94q0M21M46M89J35j89N4o67k62l13K21J08L55N99J26j5l78m32
1894h0j55k84O1jK73M98L06k1l18k5n39j92p9P7L85M24R8Q9K3k11m97n81N9m1
1918g31N35K34O30J20k92l17k93l59l00J75L04K39M15L38j88k91n33j90k22RL70
1939c47N37K11L60k8l15n06k6n68j50M22K07M14N21k0l64o01r5l66J4J39N64J19
$$ plain form
1961 122 611 544 416 346 -226 -659 -706 -368 -64 407 426 598 525 -40 -177 -346 -697 -619 -157 68 524 652
1983 652 716 300 -82 -494 -767 -495 -261 88 288 555 786 244 -219 -182 -417 -476 -448 -175 567 635 593 427
2005 427 39 -370 -608 -593 -439 -43 296 615 594 433 82 -253 -444 -846 -358 -85 399 498 504 340 117 -115
2027 -115 -568 -513 -507 -203 31 230 717 416 125 -61 -572 -481 -331 -305 -44 377 626 567 307 -55 -227 -618
2049 -618 -498 -396 60 207 350 451 512 -8 -264 -408 -595 -384 -73 282 781 597 596 249 -440 -563 -422
2070 -422 -171 -191 46 587 397 332 222 -335 -693 -629 -411 -53 132 575 549 331 102 -91 -534 -463 -514 -404
2092 -404 134 600 750 358 215 5 -637 -575 -261 -184 -106 572 635 573 427 -171 -342 -582 -486 -434 -172 474
2114 474 552 476 322 0 -315 -603 -542 -541 36 227 486 572 639 45 -293 -420 -543 -383 -181 199 179 551 365
$$ packed form
1961A22M89o7j28p0n72m33m7L38L04M71J9J72p3n65j37j69l51P8M62K25M56J28
1983F52O4m16l82m12k73K72K34L49K00K67K31n42m63L7k35n9K8K73P42O8m2j66
2005D27l88m09k38J5J54L96L39L19k1j61l51l35j91m02M88K73M84R9Oj64k23k32
2027a15m53N5OL04K34J99M87l01k91j86n11R1J50K6K61M21K49n9k60l62j72l91
2049f18J20J02M56J47J43J01O1n20k56j44j87K11L11L55M99j84jl47o89j23J41
2070d22K51k0K37N41j90o5j10n57l58O4K18L58J85M43k6k18k29j93m43P1n1J10
2092d04N38M66J50l92j43k10o42O2L14P7P8O78O3o2j46n98j71k40R6N2K62O46
2114D74P8p6j54l22l15k88O1JN77J91K59Q6O7n94l38j27j23J60K02L80k0L72j86
$$ plain form
2137 365 293 -204 -421 -626 -547 -130 304 424 591 702 325 7 -497 -388 -626 -379 26 203 710 587 324
2158 324 -197 -390 -386 -730 -345 -58 60 556 554 424 -68 -419 -343 -471 -441 37 348 402 492 570 -59 -124 -335
2181 -335 -773 -597 -306 -24 449 781 487 79 -108 -386 -545 -719 -123 141 467 544 636 164 -55 -428 -402
2202 -402 -544 -170 -80 222 518 669 140 -150 -141 -450 -720 -399 -95 225 618 711 333 -50 -388 -588 -756
2223 -756 -354 31 73 426 668 325 -91 -163 -249 -637 -579 -22 287 205 803 490 57 -258 -448 -493 -557 58
2245 58 58 447 487 300 69 -94 -313 -461 -462 -235 143 255 548 494 307 -78 -294 -623 -542 -315 -88 355 466
2268 466 380 462 64 -227 -645 -391 -244 -88 151 508 707 627 195 -159 -360 -840 -359 -282 85 395 612
2289 612 528 517 -216 -523 -466 -425 -192 -98 476 537 480 322 -113 -476 -594 -631 -319 77 275 402 665 319 23
$$ packed form
2137C65p2m97k17k05P9M17M34J20J67J11l77l18n04J09k38K47M05J77N07j23k63
2158C24n21j93Ml44L85K87J18M96kj30m92l51P6j28L0M78L11N4R0P8o29o5k11
2181c35m38J76K91K82M73L32k94m08j87k78j59j74N96K64L26P7R2m72k19l73K6
2202d02j42L74R0L02K96J51n29k90Rl09k70L21L04L20L93R3l78l83l38k00j68
2223g56M02L85M2L53K42l43m16p2q6l88N8N57L09q2N98l13m33l15j90m5o4O15
2245E8%L89M0j87k31j63k19j48jK27L78J12K93n4j87l85k16l29Q1K27K27M43J11
2268D66q6Q2l98k91m18K54J47J56K39L57J99q0m32l54k01m80M81P7L67L10K17
2289F12q4j1p33l07N7M1K33R4N74O1n7j58m35l63j18l7L12L96J98J27K63l46k96
$$ plain form
2312 23 -419 -647 -583 -307 3 173 453 563 151 -46 -315 -467 -596 -297 -145 362 402 388 521 383 -171
2333 -171 -202 -339 -504 -145 161 586 634 318 283 -27 -422 -320 -365 -206 79 537 745 514 268 -126 -289
2354 -289 -389 -521 -213 -81 423 468 502 345 -176 -216 -431 -625 -315 -71 349 248 155 392 64 19 -653 -618
2376 -618 -235 134 140 289 356 215 98 -101 -119 -387 -350 -237 119 558 517 436 218 -98 -369 -387 -527 -40 -124
2399 -124 243 358 549 392 -2 -363 -520 -553 -222 5 190 472 394 294 45 -135 -429 -328 -310 -67 323
2420 323 429 493 233 -39 -196 -185 -456 -479 -310 187 528 484 197 211 -3 -718 -419 -320 -157 144 514 539
2442 539 569 199 -142 -425 -465 -321 -390 71 252 535 249 162 111 -432 -267 -521 -328 -110 214 308 480 502
2464 502 98 -328 -379 -157 -376 -126 518 245 367 599 212 -141 -354 -423 -471 -103 75 508 284 499 288
$$ packed form
2312B3m42k28O4K76L10J70K80J10m12j97k69j52j29K99J52N07M0j4J33j38n54
2333a71l1j37j65L59L06M25M8l16l5l10l95J02m5J59K85M58K08k31k46l94j63
2354b89j00j32L08J32N04M5L4j57n21m0k15j94L10K44M20j01r3K37l28m5o72L5
2376f18L83L69OJ49O7j41j17j99j8k68L7J13L56M39m1q1k18l16k71j8j40M87q4
2399a24L67J15J91j57l94l61j57l3L31K27J85K82p8j00k49j80k94J01J8K43L90
2420C23J06O4k60k72j57J1k71k3J69M97L41m4k87J4k14p15K99R9J63L01L70K5
2442E39L0l70l41k83m0J44o9M61J81K83k86q7n1n43J65k54J93K18L24R4J72K2
2464E02m04m26n1K22k19K50O44k73J22K32l87l53k13o9m8L68J78M33k24K15k11
$$ plain form
2485 288 -273 -219 -232 -341 -155 285 434 384 648 277 -183 -401 -462 -565 -18 41 319 305 381 180 -277 -268 -350
2508 -350 -445 -527 227 432 194 461 190 -271 8 -298 -598 -187 21 196 362 362 233 212 -43 -313 -410 -286
2530 -286 7 222 171 586 389 123 -224 -318 -424 -259 -97 171 193 394 317 134 -226 -32 -351 -473 -96
2551 -96 71 311 389 449 -53 104 -103 -331 -502 -101 77 104 407 498 28 -329 -201 -468 -513 -164 -159 66 447
2574 447 373 225 32 -170 -622 -586 -219 -49 105 394 476 46 184 110 -258 -477 -268 -65 132 377 598
2595 598 434 244 55 -356 -579 -391 -152 120 195 574 229 120 171 -76 -583 -423 -46 -2 187 564 385
2616 385 200 300 -281 -446 -469 78 114 226 625 339 101 233 -142 -309 -320 -264 -39 239 464 539 351 235
2638 235 -196 -410 -296 -227 -188 24 393 447 65 187 80 -468 -468 -217 -214 -38 548 428 340 196 69 -264 -311
$$ packed form
2485B88n61N4j3j09J86M40J49n0K64l71m60k18o1j03N47N9K78j4P6k01m57Rq2
2508c50r5q2P54K05k38K67k71m61K79l06l00M11K08J75J66%j29k1k55k70r7J24
2530b86K93K15n1M15j97k66l47r4j06J65J62K68K2K01p7j83l60J94l19j22L77
2551i6J67K40P8O0n02J57k07k28j71M01J78K7L03R1m70l57J28k67m5L49NK25L81
2574D47p4j48j93k02m52L6L67J70J54K89Q2m30J38p4l68k19K09K03J97K45K21
2595E98j64j90j89m11k23J88K39K72P5L79l45j09N1k47n07J60L77M4J89L77j79
2616C85j85J00n81j65k3N47L6J12L99k86k38J32l75j67j1N6K25K78K25P5j88j16
2638B35m31k14J14O9L9K12L69N4l82J22j07n48%K51LJ76N86j20q8j44j27l33m7
$$ plain form
2661 -311 -50 -198 71 304 432 278 223 138 -64 -390 -356 -315 83 355 367 184 158 127 -198 -258 -59 -357 -139
2684 -139 358 407 236 251 121 -291 -143 -564 -391 -113 147 291 472 359 205 -226 -148 -306 -384 -467 -195 196
2706 196 221 213 459 107 -200 -215 -255 -327 386 278 158 433 341 64 -361 -356 -344 -215 144 337 206 289 189 -59
2730 -59 -595 -418 -150 -381 -10 249 215 279 200 -98 -126 -131 -169 -442 -107 10 173 293 336 243 -129 -48 -321 -424
2754 -424 -188 94 326 317 285 122 -140 -308 -302 -320 17 -33 86 161 284 341 143 -166 -326 -441 -347 -47 129
2777 129 185 158 184 -115 -12 -270 -228 -168 310 377 34 414 299 4 -201 -60 -250 -138 -132 206 148 82 429
2800 429 147 -91 -379 -215 -72 70 -17 411 436 400 -14 -55 -228 -296 -248 -90 284 260 505 372 50 -266
2822 -266 -45 -212 -393 -163 79 314 141 365 194 -31 -26 -316 -373 -308 -124 106 267 389 129 40 -174 -166
$$ packed form
2661c11K61j48K69K33J28j54n5q5k02l26L4M1L98K72J2j83k6l1l25o0J99k98K18
2684a39M97M9j71J5j30m12J48m21J73K78K60J44J81j13j54m31P8j58p8q3K72L91
2706A96K5qK46l52l07j5m0p2P13j08j20K75r2k77m25NJ2J29L59J93j31Q3j00k48
2730e9n36J77K68k31L71K59l4O4p9k98k8nl8k73L35J17J63J20M3r3l72Q1k73j03
2754d24K36K82K32rl2j63k62j68Oj8L37n0J19P5J23N7j98l09j60j15R4L00J76
2777A29N6k7K6k99J03k58M2O0M78O7l43L80j15k95k05J41j90J12OL38n8o6L47
2800D29k82k38k88J64J43J42q7M28K5l6m14m1j73o8M8J58L74k4K45j33l22l16
2822b66K21j67j81K30K42K35j73K24j71k25Nk90n7O5J84K30J61J22k60q9k14Q
$$ plain form
2844 -166 -622 -144 -142 138 418 27 202 -153 -27 -156 -190 -8 78 72 118 297 293 265 -112 -232 -358 -337 -142 151
2868 151 236 556 272 17 -158 -209 -451 -239 -77 343 186 375 315 -45 -188 -430 -126 -46 -177 55 193
2889 193 242 31 34 -25 -50 -96 -265 -112 -72 125 341 315 80 272 -109 -194 -295 -237 151 -24 128 142 201 263
2913 263 -12 -188 -332 -216 -52 37 62 397 -46 200 -127 -166 -300 -126 -251 134 120 385 386 142 39 95
2935 95 -63 -303 -172 -16 138 14 -41 71 42 -148 -358 -166 -239 -167 130 278 214 -115 -68 -105 -78 -240 110
2958 110 -57 -67 218 330 20 152 -90 -118 -198 -110 56 224 378 279 89 21 -59 -254 -395 56 21 -59 48
2981 48 155 218 -15 111 -217 -272 -34 -110 -113 -28 222 283 159 2 -168 -115 -227 -47 189 316 245 -25 93
3004 93 135 -87 -408 -140 -73 -100 248 305 0 114 111 76 -319 -160 214 129 37 116 168 209 0 -111 -258 -286 -328
$$ packed form
2844a66m56M78KK80K80l91J75l55J26j29l4J82Q6oM6J79mk8l77j20j26K1J95K93
2868A51Q5L20k84k55j75n1k42K12J62M20j57J89o0l60j43k42L04Q0j31K32J38
2889A93M9k11Ln9k5m6j69J53M0J97K16k6k35J92l81q5j01N8L88j75J52J4N9O2
2913B63k75j76j44J16J64Q9K5L35m43K46l27l9j34J74j25L85j4K65Jk44j03N6
2935I5j58k40J31J56J54j24n5J12k9j90k10J92p3P2K97J48o4l29M7l7K7j62L50
2958A10j67j0K85J12l10J32k42k8q0Q8J66J68J54r9j90o8q0j95j41M51l5q0J07
2981D8J07O3k33J26l28n5K38p6lQ5K50O1j24j57j70N3j12J80K36J27p1k70J18
3004I3M2k22l21K68O7k7L48N7l05J14ll5l95J59L74q5r2P9N2M1k09j11j47k8m2
$$ plain form
3029 -328 -210 -12 246 206 147 225 142 -102 -240 -91 -155 213 25 184 139 -96 -125 -237 -186 -93 -33 39 260 38
3053 38 156 158 -31 -86 -229 -111 -215 58 233 323 246 232 253 -125 -203 -124 -109 -143 175 293 -48 91 -55 -193
3077 -193 -307 -97 -124 114 249 125 187 205 46 -98 107 -2 -46 -280 63 198 81 178 40 -204 -366 -343
3099 -343 -54 -75 129 134 45 70 358 -64 -138 67 -225 -98 -53 -107 5 123 245 -163 49 61 -45 -209 251
3122 251 189 31 34 169 76 -180 -146 -242 -157 -158 -38 156 79 54 108 -313 -37 -142 -222 0 147 75 160 116 -103
3147 -103 -1 -57 -303 -257 -151 208 184 451 274 26 -94 200 -276 -63 46 -7 36 146 431 39 156 -159
3169 -159 118 -238 -66 24 82 0 97 130 37 -235 -13 -149 -245 36 -51 93 72 -10 167 -64 -171 -305 9
3192 9 -98 -78 85 -62 244 -49 169 -67 -117 -26 53 138 128 173 164 70 40 -92 -481 -165 152 25 -54 186 235
$$ packed form
3029c28J18J98K58m0n9P8q3k44j38J49o4L68j88J59m5k35k9j12N1R3O0P2K21k22
3053C8J18Kj89n5j43J18j04K73J75R0p7j4K1l78p8P9J5l4L18J18l41J39j46j38
3077a93j14K10k7K38J35j24O2J8j59j44K05j09m4k34L43J35j17R7j38k44j62K3
3099c43K89k1K04Nq9K5K88m22p4K05k92J27M5n4J12J18J22m08K12J2j06j64M60
3122B51o2j58LJ35r3k56L4r6Q5jJ20J94p7k5N4m21K76j05q0K22J47p2Q5m4k19
3147a03J02n6k46M6J06L59k4K67j77k48j20K94m76K13J09n3M3J10K85l92J17l15
3169a59K77l56J72R0N8q2R7L3r3k72K22j36r6K81q7J44k1q2J77k31j07j34L14
3192Ij07K0J63j47L06k93K18k36n0R1P9Q5j0M5rr4l0j32l89L16L17j27p9K40M9
$$ plain form
3217 235 -95 -129 216 -216 -134 -6 -13 -268 -8 236 -65 7 26 -225 -179 -24 -42 67 45 144 -17 -89 -112 -208
3241 -208 -207 -175 180 95 -15 -20 10 22 6 22 5 -66 -116 291 157 78 160 71 1 13 -52 -71 113 134 105 -31 -3 232
3269 232 -24 -85 -34 26 -198 -117 246 205 288 5 210 -140 -216 -38 -148 -18 270 -1 144 192 -25 -99 -34
3292 -34 -151 -16 23 -25 139 11 60 303 -226 -36 -108 -112 -30 -7 249 81 39 99 -173 -90 -67 166 12 -146
3316 -146 -37 57 -9 -37 120 -166 -99 -190 -32 136 93 -4 -108 137 7 -321 11 -129 -4 -14 308 106 -80
3339 -80 70 -20 -150 -231 -11 -225 180 154 364 251 -40 -36 39 -150 -140 -118 144 94 192 210 -13 9 -170 -63
3363 -63 -261 64 -67 -124 1 -61 -20 15 -150 -22 -53 -4 118 -19 129 -49 -55 26 55 -214 -47 22 -54 48
3387 48 16 271 157 -5 -167 -12 55 -89 -141 -151 50 -15 17 68 15 -5 -323 -211 -8 27 -8 -16 9 91 -49
$$ packed form
3217B35l30l4L45m32Q2J28pk55K60K44l01P2J9k51M6J55j8J09k2R9j61p2k3r6
3241b08JL2L55q5j10nL0J2j6J6j7p1n0M07j34p9Q2q9p0J2o5j9J84K1k9j36K8K35
3269B32k56o1N1O0k24Q1L63m1Q3k83K05l50p6J78j10J30K88k71J45M8k17p4O5
3292c4j17J35L9m8J64j28M9K43n29J90p2mQ2K3K56j68m2O0k72Q3K3K33j54j58
3316a46J09R4o6k8J57k86O7r1J58J68m3r7j04K45j30l28L32j40J25j0L22k02j86
3339h0J50r0j30q1K20k14M05k6K10j13k91MP5j89J0K2K62n0R8J8k23K2j79J07
3363f3j98L25j31n7J25o2M1L5j65J28l1M9J22j37J48j78oQ1K9k69J67O9p6J02
3387D8l2K55j14j62j62J55O7j44n2j0K01o5L2N1n3k0l18J12K03L5l5qK5Q2j40
$$ plain form
3412 -49 -150 -169 60 -22 60 -138 124 -40 -94 -26 -67 -29 107 -100 1 -159 163 38 104 -4 2 149 59 15
3436 15 36 194 84 -207 154 -62 5 -46 -53 272 131 -23 199 46 66 -57 -175 46 14 -397 -40 11 153
3459 153 -89 79 53 -33 -347 -163 78 -115 -179 25 185 102 4 24 -42 -30 -33 96 80 203 142 91 -57 0 48
3484 48 -115 -176 -26 33 165 103 -47 -71 -26 -6 -121 -58 31 -170 167 276 214 -2 -63 -102 -192 -123 47 21 108
3509 108 -18 191 296 -79 -195 -8 -132 61 29 233 18 -5 -83 -18 -20 -173 -4 -41 72 -92 -175 46 261
3532 261 83 -316 34 94 110 184 24 123 334 77 59 -63 -31 -41 -76 83 -31 25 107 70 253 -25 -59 83
3556 83 -153 -108 245 165 132 108 17 -12 -40 127 -84 -272 112 478 131 -21 -187 31 -33 -23 -307 -64 -102 95
3580 95 293 187 89 -116 -100 -146 -35 -43 -63 170 116 61 139 -113 -220 -52 -17 111 -43 -107 138 137 70 -59 5
$$ packed form
3412d9j01j9K29q2Q2j98K62j64n4O8m1L8J36k07J01j60L22j25O6j08OJ47r0m4
3436A5K1J58j10k91L61k16O7n1pL25j41j54K22j53K0j23j18K21l2m11L57N1J42
3459A53k42J68k6q6l14J84K41j93o4K04J60q3r8K0o6J2lJ29j6J23o1n1j48N7M8
3484D8j63o1J50N9J32o2j50k4M5K0j15O3Q9k01L37J09o2k16o1l9r0O9J70k6Q7
3509A08j26K09J05l75j16J87j24J93l2K04k15k3p8O5kj53J69l7J13j64q3K21K15
3532B61j78l99L50O0J6P4j60R9K11k57j8j22L2j0l5J59j14N6Q2l7J83k78l4J42
3556H3k36M5L53q0l3k4r1k9k8J67k11j88L84L66l47j52j66K18o4J0k84K43l8J97
3580I5J98j06r8k05J6m6J11qk0K33n4n5P8k52j07J68L5J28j54o4K45jo7j29O4
$$ plain form
3605 5 -143 155 33 34 -72 -48 157 163 -108 10 -105 -51 -69 184 -34 -91 227 17 -197 -158 -124 172 81 38 23
3630 23 67 247 8 12 41 -33 -21 -83 -39 -83 -41 55 66 -78 123 100 169 61 -202 250 -150 68 100 11 187 -232
3656 -232 93 -79 -24 41 178 0 145 52 -91 121 -113 -163 -404 -152 -3 83 195 105 -25 61 -149 -48
3678 -48 14 79 76 95 27 18 -30 42 153 -16 -188 128 -119 105 136 45 -22 133 -86 -57 11 -151 5 73 165 148
3704 148 -36 9 -34 -68 -227 4 45 -55 45 -48 -13 137 64 -145 -213 104 -171 -11 -29 183 -8 96 58
3727 58 -164 -26 -114 45 81 77 -37 -32 82 -175 -90 -52 -19 -227 33 28 259 113 -10 287 -234 -18 35 -93
3751 -93 124 54 117 244 76 -82 -188 -224 187 -181 -102 49 43 36 184 133 152 -169 -41 -148 8 -41 28 130
3775 130 232 -2 -118 83 30 16 -95 136 -78 -189 20 204 3 -97 -201 -56 -211 -88 63 -39 98
$$ packed form
3605Ej48K98j22Jj06K4K05Ok71J18j15N4j8K53k18n7L18k10k14L9L4K96r1m3j5
3630B3M4J80k39MK9p4J2o2M4m4M2R6J1j44K01k3O9j08k63M52m00K18L2q9J76m19
3656b32L25j72N5O5J37j78J45r3j43K12k34n0k41K52J49Q6J12r0j30Q6k10J01
3678d8O2O5lJ9o8rm8P2J11j69j72L16k47K24L1r1o7J55k19K9O8j62J56O8R2j7
3704A48j84M5m3l4j59K31M1j00J00r3L5J50p3k09o8L17k75J60j8K12j91J04l8
3727E8k22J38q8J59L6mj14NJ14k57Q5L8L3k08K60nK31j46j23K97n21K16N3j28
3751i3K17p0O3J27j68j58j06l6M11l68P9J51opJ48n1J9l21J28j07J56m9O9J02
3775A30J02k34j16K01n3j4j11K31k14j11K09J84k01j00j04J45j55J23J51j02J37
$$ plain form
3796 98 32 43 87 -31 -156 -200 125 134 109 -3 403 40 -59 -157 -103 -27 13 91 -76 253 72 204 7 -49 -88
3821 -88 36 80 -69 214 69 32 -61 -117 -8 -38 -192 -199 102 181 306 240 173 131 -69 -134 6 -44 -128 -104 119
3846 119 61 -125 124 3 -328 -193 -99 4 7 156 -72 -18 106 -41 -207 -261 -144 37 84 26 5 48 252
3869 252 37 -160 -195 9 -375 220 41 -125 91 22 19 -244 -147 -24 -268 -126 97 75 73 44 -214 -78 -104
3892 -104 -79 88 41 73 87 49 43 162 130 60 -29 -210 81 224 -99 -62 125 5 -125 -130 -100 -60 -265 97 -112
3917 -112 -44 104 108 -33 168 -67 -145 168 70 79 343 237 281 55 -196 -40 -134 -122 -2 227 147 91 101 -36
3941 -36 -79 -32 -171 -98 37 -282 214 176 52 -354 -72 5 -168 -130 74 -28 -5 42 214 73 -41 -46 -203 -205
3965 -205 -1 29 -149 111 255 -74 -194 78 -210 -74 -93 45 69 87 139 103 9 -5 -154 -26 57 -74 -87
$$ packed form
3796I8o6J1M4j18j25m4L25Rk5j12M06l63r9r8N4P6M0P8j67L29j81J32j97n6l9
3821h8J24M4j49K83j45l7r3n6J09l0j54pL01P9J25o6o7m2k00o5J40n0q4K4K23
3846A19n8j86K49j21l31J35R4J03LJ49k28N4J24j47j66n4J17J81M7n8k1M3K04
3869B52k15j97l5K04l84N95j79j66K16o9lk63R7J23k44J42K23k2kk9k58J36k6
3892a04K5J67m7L2J4l8oJ19l2p0q9j81K91J43l23L7J87j20j30nL0M0k05L62k09
3917a12O8J48Mj41K01k35p8L13r8RK64j06M4k26k51J56r4J2J20K29q0n6J0j37
3941c6m3M7j39P3J35l19M96l8j24m06K82P7j73L8K04j02K3M7J72j41j14nj57k
3965b05K04L0j78K60J44l29j20K72k88J36j9J38K4J8N2l6r4j4j49J28Q3j31j3
$$ plain form
3988 -87 181 179 74 -179 -212 -285 -15 -252 -140 97 160 113 243 186 77 -198 93 -34 21 -27 -73 149 -115 115
4012 115 60 -92 -194 -101 182 119 54 115 152 -5 -56 -141 -87 103 -92 58 255 147 77 87 166 -19 12 34 18
4037 18 61 284 158 -116 83 78 3 -30 -107 -211 22 223 43 114 149 111 -79 -121 111 -89 170 189 294 16
4061 16 86 100 52 -182 -15 10 -49 43 49 291 43 42 -5 -194 -23 -305 -43 -141 17 2 217 70 -35 37 -112
4086 -112 -132 83 -213 239 121 56 276 105 -119 -232 35 -71 1 -38 246 64 147 -46 -49 88 29 153 184
4109 184 155 248 45 54 111 -169 -194 74 -27 68 49 -91 -66 90 -87 -54 -64 54 -28 -22 -227 -145 180 156 -59
4134 -59 22 -281 117 -123 -290 18 119 36 117 317 45 -178 -204 68 95 -40 98 -58 -23 2 117 -53 -222
4157 -222 36 -157 -132 120 -100 187 168 88 -47 -193 -238 -26 228 4 -25 -78 -23 -164 -1 1 -121 -151 -198 80
$$ packed form
3988h7K68kj05k53l3p3K70k37J12K37O3m7J30n7j09k75K91j27N5m8m6K22k64K30
4012A15n5j52j02R3K83o3o5O1L7j57n1q5N4J90j95J50J97j08p0J0P9j85L1K2j6
4037A8M3K23j26k74J99np5l3p7j04K33K01j80P1L5l8j90m2K32k00K59J9J05k78
4061A6P0J4m8k34J67K5n9R2OK42k48jm7j89J71k82K62r8J58j5K15j47j05P2j49
4086a12k0K15k96M52j18o5K20j71k24j13K67j06P2l9K84j82Q3j93lJ37n9J24L1
4109A84k9R3k03RN7k80k5K68j01R5j9j40K5J56j77L3j0J18q2Ok05Q2L25k4k15
4134e9Q1l03L98k40j67L08J01q3Q1K00k72k23k6K72K7j35J38j56L5K5J15j70j69
4157b22K58j93K5K52k20K87j9q0j35j46m5K12K54k24k9n3N5j41J63Kj22l0m7K78
$$ plain form
4181 80 -46 185 108 -22 -72 -177 54 60 39 44 -129 108 328 -175 -219 -19 -75 -52 -117 -50 107 67 116 50 319
4206 319 -7 75 -113 -102 -200 -34 54 125 25 222 180 -352 -316 25 148 168 -15 184 55 155 107 34 10 -148
4230 -148 71 -52 -4 118 -76 -76 52 -60 -194 -217 -76 -40 276 103 -110 41 17 51 -199 -14 -25 -129 -42
4253 -42 -73 175 258 -137 90 -4 -18 -240 60 36 161 189 34 95 17 53 -61 -4 -222 88 194 155 -246 60
4277 60 141 -92 -214 -178 119 54 -19 -50 40 107 -132 -356 205 48 -154 -17 103 149 30 47 -269 -137 -83 80
4301 80 -78 -99 308 -184 -43 18 -111 33 -103 -174 3 -136 -66 225 -173 70 184 53 -138 -87 -29 -153
4323 -153 82 196 60 44 -101 21 -91 -23 -281 -227 -79 -156 -15 15 107 -178 -244 -308 -52 62 35 94 88 8
4347 8 -120 -71 65 106 -243 -107 -133 -3 37 160 85 -107 13 -147 -176 -246 -56 -116 -13 69 41 -73 11 -150
$$ packed form
4181H0j26K31p7j30n0j05K31Ok1Nj73K37K20n03m4K00n6K3o5O7J57m0M9o6K69
4206C19l26Q2j88J1r8J66Q8P1j00J97m2n32L6L41J23K0j83J99j29J00m8p3k4j58
4230a48K19j23M8J22j94%J28j12j34k3J41L6L16j73k13J51k4L4k50J85j1j04Q7
4253d2l1K48Q3l95K27r4j4k22L00k4J25K8j55O1p8L6j14N7k18L10J06l9m01L06
4277F0Q1k33j22L6K97o5p3l1R0O7k39k24N61j57k02J37J20M6j19J7l16J32N4J63
4301H0j58k1M07m92J41O1j29J44j36p1J77j39P0K91l98K43J14j31j91N1N8j24
4323a53K35J14j36j6j45J22j12O8k58N4J48p7J41L0R2k85o6o4K56J14k7N9oq0
4347Hj28M9J36M1l49J36k6J30M0J23p5j92J20j60k9p0J90o0J03Q2k8j14Q4j61
$$ plain form
4371 -150 -30 226 25 8 97 -10 41 34 -44 -56 84 -144 -86 -27 124 218 142 -18 79 77 10 -156 13 113 -66
4396 -66 -55 -61 71 -129 111 70 -36 -43 -108 -59 209 166 -25 117 -229 -152 -298 165 -59 -107 247 96 130 84 102
4421 102 -219 -126 44 -150 -33 -175 61 30 201 -74 285 98 25 -258 -102 217 95 147 104 163 -206 -132
4443 -132 -350 -252 -106 37 -76 -194 33 -86 54 -196 -1 -21 -151 127 16 85 109 -154 30 -85 -137 -76
4465 -76 -107 79 267 -161 127 59 118 -61 4 -125 -279 -28 179 169 261 -201 233 -83 9 94 -29 -173 87
4488 87 106 96 101 -49 -45 -75 114 -340 19 65 27 28 250 -51 -152 -58 52 -4 32 98 30 22 228 60 -4 -100 -89
4515 -89 -219 -101 17 61 64 129 -103 -38 -134 -157 15 114 6 12 48 149 71 -33 -215 78 -20 95 -123 0 387
4540 387 116 6 294 24 -79 97 -4 27 101 90 -69 18 -110 -122 -19 -147 -98 36 -51 70 -170 -72 59
$$ packed form
4371a50J20K56k01j7Q9j07N1pp8j2J40k28N8N9J51R4p6j60R7ko7j66J69J00j79
4396f6J1oJ32k00K40m1j06po5M9K68m3j91J42l46P7j46M63k24m8L54j51L4m6J8
4421A02l21R3J70j94J17j42K36l1J71k75L59j87p3k83J56L19j22N2m3N9l69P4
4443a32k18R8J46J43j13j18K27j19J40k50J95k0j30K78j11O9K4k63J84j15n2O1
4465g6l1J86J88m28K88o8N9j79O5j29j54K51K07j0R2m62M34l16R2Q5j23j44K60
4488H7J9j0Nj50Ml0J89m54L59M6l8JK22l01j01R4J10n6L6O6o8qK06j68o4r6J1
4515h9j30J18J18M4LO5k32O5r6k3J72R9j08OL6J01p8j04j82K93r8J15k18J23L87
4540C87k71j10K88k70j03J76j01L1P4j1j59Q7j28j2J03j28M9J34q7J21k40R8J31
$$ plain form
4563 59 36 -226 -128 -160 11 0 -157 47 -51 -31 -78 32 29 -163 67 -312 -78 287 249 219 -1 -84 63 68 -14
4588 -14 51 98 155 100 27 49 -79 -18 -35 -50 -218 257 112 174 115 4 -19 -46 -37 14 54 -40 -185 31 223 -16
4614 -16 101 4 -258 15 31 -64 135 -119 126 185 -24 10 -100 79 53 -12 53 -134 -167 -30 104 161 -138 6
4638 6 -150 -125 203 -27 161 -120 -154 22 72 -114 -166 41 -98 157 171 117 -159 67 -59 32 -302 -57 138
4661 138 101 328 21 201 -144 -82 48 10 -101 -45 -12 119 -48 -133 -163 -44 17 -177 99 -136 49 94 136
4684 136 71 198 18 20 -27 39 -169 79 -30 190 276 -225 -178 -77 -184 -206 -113 61 160 97 -28 -8 85 -23
4708 -23 -37 -91 1 -52 80 157 131 120 74 -22 52 -188 -113 -31 91 -24 29 201 -111 38 -32 -20 -61 -71 22 140
4734 140 73 -18 39 6 -168 -183 -80 -128 -156 181 -160 60 -22 149 -99 -238 -31 -197 -175 16 -87 161 0
$$ packed form
4563E9k3k62R8l2J71j1j57K04r8K0m7J10lj92K30l79K34L65l8l0k20q3J47Nq2
4588a4O5M7N7n5p3K2j28O1j7j5j68M75j45O2n9j11k3k7RN1M0r4j45K16J92k39
4614a6J17r7k62K73J6r5J99k54K45N9k09L4j10J79k6o5O5j87l3J37J34N7k99J44
4638Fj56K5L28k30J88k81l4J76N0j86n2K07j39K55J4n4k76K26j26R1l34K45J95
4661A38l7K27l07J80l45O2J30l8j11N6L3J31j67q5l0J19O1j94K76k35J85M5M2
4684A36o5J27j80Km7O6k08K48j09K20Q6n01M7J01j07k2R3J74R9o3j25K0R3j08
4708b3j4n4R2n3J32P7k6j1m6r6P4k40P5Q2J22j15N3J72l12J49p0J2m1j0R3J18
4734A40o7r1N7l3j74j5J03m8k8L37l41K20q2J71k48j39K07j66K2J91j03K48j61
$$ plain form
4757 0 96 -107 -117 10 113 -45 68 128 159 126 -29 -42 19 -44 203 10 154 28 231 107 33 -105 -199 -170
4781 -170 -93 -50 265 39 -15 -174 -110 50 -39 22 90 37 -8 94 -17 -255 -92 -38 57 -271 6 -96 -206 86
4805 86 126 207 -80 34 89 -141 5 -85 -7 162 -68 172 -88 2 11 -8 -208 -76 -35 114 139 -14 205 83
4829 83 -14 212 -146 -111 57 -100 -204 -95 188 141 17 -82 78 -202 87 60 238 54 63 101 27 46 -74 28
4853 28 55 37 85 -49 -61 115 -80 77 72 41 105 34 -55 -44 253 -36 77 -85 -28 -8 -247 144 84 42 126 -113
4879 -113 -77 153 -56 -32 22 150 68 90 86 50 67 99 12 -50 -80 -159 140 8 133 46 -131 -84 78 -48 -64 111
4905 111 95 183 78 1 86 -153 59 -114 -198 -214 -149 -90 -32 192 35 6 108 -5 -269 -67 93 205 245 -203
4929 -203 155 39 47 -36 14 -78 58 85 -137 129 -56 47 -80 169 -120 -58 -58 9 -58 165 -14 -31 24 -21 -56
$$ packed form
4757@R6k03j0J27J03j58J13O0L1l3j55j3O1o3K47j93J44j26K03j24p4j38r4K9
4781a70P7M3L15k26n4j59O4J60q9O1O8n3m5J02j11k38J63N4R5l28K77j02j10K92
4805H6M0Q1k87J14N5k30J46r0P8J69k30K40k60R0Rj9k00J32M1J49K5j53K19j22
4829H3r7K26l58L5J68j57j04J09K83m7j24r9J60k80K89k7J78j84RL8p4J9j20J02
4853B8K7j8M8j34j2J76j95J57nl1O4p1q9J1K97k89J13j62N7K0k39L91o0m2Q4k39
4879a13L6K30k09K4N4J28q2K2ml6J7L2q7o2l0p9K99j32J25q7j77M7J62j26j6J75
4905A11j6Q8j05p7Q5k39K12j73q4j6O5N9N8K24j57k9J02j13k64K02J60J12M0m48
4929b03L58j16Qq3N0r2J36K7k22K66j85J03j27K49k89O2%O7o7K23j79j7N5m5l5
$$ plain form
4954 -56 74 -127 52 49 -192 80 -6 -141 94 -185 -70 55 39 45 -46 173 -35 61 -212 268 -1 -75 -92 113
4978 113 -62 3 154 -65 220 -134 29 95 -18 283 32 2 58 77 -114 80 65 -20 2 115 14 134 206
5001 206 -180 107 -75 30 -98 47 108 198 56 -118 -74 49 -82 -93 -147 -41 -90 152 -94 37 80 -103
5023 -103 -94 56 -111 193 -31 159 36 7 175 -63 -54 75 24 -136 222 186 86 -63 -41 86 49 -79 -194
5046 -194 -252 -47 -64 -75 -30 114 208 124 32 -47 -174 164 56 85 41 7 66 -116 138 41 -19 -5 66 111 17 -110
5072 -110 -36 -173 -62 -15 -54 164 -62 131 196 -25 35 -121 -192 82 -137 30 -88 -190 -19 146 215 27
5094 27 -38 58 18 -61 111 -150 127 58 56 -7 -78 6 -94 -94 -118 131 148 16 148 16 163 94 128 147 -44 54
5120 54 -2 -11 22 -59 271 128 57 -81 -19 -226 -11 -69 187 -141 -63 -142 -50 -134 -231 88 -44 54 109 57 -46 103
$$ packed form
4954e6J30k01J79lk41K72q6j35K35k79J15J25j6Or1K19k08R6k73M80k69p4j7K05
4978A13j75O5J51k19K85l54J63O6j13L01k51l0N6J9j91J94j5q5K2J13j01J20P2
5001B06l86K87j82J05j28J45O1R0j42j74M4J23j31j1n4J06m9K42k46J31M3j83
5023a03RJ50j67L04k24J90j23k9J68k38RJ29n1j60L58l6j00j49K2J27l7j28j15
5046a94n8K05j7j1M5J44R4q4r2p9j27L38j08K9m4l4N9j82K54r7o0J4P1M5r4j27
5072a10P4j37J11M7l9K18k26J93O5k21O0j56p1K74k19J67j18j02J71J65O9j88
5094B7o5R6m0p9J72k61K77o9ko3p1Q4j00%k4K49J7j32J32j32J47o9L4J9j91R8
5120E4n6rL3q1L30j43p1j38O2k07K15n8K56l28P8p9R2q4r7L19j32R8N5n2j03J49
$$ plain form
5146 103 -220 68 -188 -159 60 25 -98 -82 -58 21 -122 4 166 -24 73 51 148 39 179 124 48 -132 -74 -166
5170 -166 -25 92 157 106 222 -6 -7 -98 -122 22 -136 97 247 16 119 48 -50 -66 -27 -195 82 -186 -227 53
5194 53 -194 90 -130 -230 -168 -151 187 -75 262 78 -74 166 38 -167 -147 -61 12 18 29 156 -62 18 -184
5217 -184 -37 -240 -25 8 82 54 144 148 -13 216 -141 12 -108 51 -36 78 -28 14 -39 2 -195 -132 -272 -172
5241 -172 -48 212 69 -13 -43 100 -35 -109 -88 -41 19 -46 -10 -96 156 72 -156 -57 -86 -39 -9 -146 166 -18 -62
5266 -62 -192 -231 32 -68 138 -46 -50 239 174 48 185 42 -42 -88 -227 -16 108 6 212 -75 -157 23 -118
5289 -118 -239 -257 22 -41 16 309 -55 -9 55 23 -66 -29 -174 -96 -45 -8 110 65 137 -85 64 -175 89 155 66
5314 66 -72 -64 107 55 -21 65 91 -43 -230 -74 2 -64 -29 -116 -14 -16 14 -5 -21 10 261 -32 -78 -30 -95 -116 -192
$$ packed form
5146A03l23K88k56K9K19l5j23J6K4P9j43J26J62j90R7k2R7j09J40n5p6j80N8r2
5170a66J41J17O5n1J16k28jr1k4J44j58K33J50k31J03p1r8j6L9j68K77k68m1K80
5194E3k47K84k20j00O2J7L38k62L37j84j52K40j28k05K0Q6P3OJ1J27k18Q0k02
5217a84J47k03K15L3P4k8R0Mj61K29l57J53j20J59q7J14j06M2n3M1j97O3j40J00
5241a72J24K60j43q2l0J43j35p4K1M7O0o5L6q6K52q4k28R9k9M7L0j37L12j84m4
5266f2j30l9K63j00K06j84mK89o5j26J37j43q4m6j39K11J24j02K06k87q2J80j41
5289a18j21j8K79o3N7K93l64M6O4l2q9L7j45P8N1L7J18m5P2k22J49k39K64O6q9
5314F6j38QJ71n2p6Q6K6j34j87J56P6o6L5q7J02kL0j9j6L1K51k93m6M8o5k1p6
$$ plain form
5341 -192 -73 60 -74 64 -36 43 102 -45 166 -32 -92 145 118 112 129 259 -45 -200 71 171 -283 -80
5363 -80 3 143 -144 203 59 65 191 -84 -189 7 -298 188 -33 -99 -40 -326 -106 107 -13 81 -56 38 52
5386 52 169 184 251 -9 -17 79 11 76 187 -57 -268 91 4 99 -5 93 -197 203 0 22 231 163 -92 33
5410 33 10 -157 13 68 91 37 -75 91 -64 15 -181 -33 -81 27 67 243 97 84 66 228 9 -6 -88 -8
5434 -8 50 75 227 -3 49 49 -12 84 3 38 190 -64 103 223 73 -9 137 -85 -19 -33 36 71 241 89 53 -73
5460 -73 -155 -28 133 -26 -22 35 12 107 -360 90 21 -69 -174 -76 65 59 -276 -32 -111 -173 -196 -74 -45 -197 39
5485 39 172 69 -98 -90 -129 29 64 -229 96 -215 -194 13 -108 -72 -212 41 -40 -10 -285 -68 -11 -218 107
5508 107 -167 -17 -13 10 -126 -11 148 -135 -64 28 133 21 2 -45 -43 90 79 -127 -57 85 -77 63 282 188
$$ packed form
5341a92J19J33j34J38j00P9N9j47K11j98o0K37k7oJ7J30l04j55K71J00m54K03
5363h0Q3J40k87L47j44OJ26k75j05J96l05M86k21o6N9k86K20K13j20R4j37R4J4
5386E2J17J5O7k60qR6o8O5J11k44k11L59q7R5j04R8k90M00k03K2K09o8k55J25
5410C3k3j67J70N5K3n4j12J66j55P9j96J48m8J08M0J76j46j3j8J62k19j5q2Q0
5434hN8K5J52k30N2%o1R6q1L5J52k54J67J20j50q2J46k22O6j4O9L5J70j52l6j26
5460g3q2J27J61j59MN7k3R5m67M50o9r0j05R8J41ol35K44p9o2k3J22K9j52K36
5485C9J33j03j67Ql9J58L5k93L25l11K1K07j21L6j40K53q1L0k75K17N7k07L25
5508A07k74J50MK3j36J15J59k83P1R2J05j12j9m7KJ33j1k06P0J42j62J40K19r4
$$ plain form
5532 188 -199 -217 -67 96 -61 -130 165 -127 -80 2 122 -1 -189 40 -43 66 -213 -68 213 42 -72 -144
5554 -144 -140 -167 -15 -135 151 -24 139 54 52 -168 -85 -55 7 44 215 83 -249 44 45 48 -151 -64 -143 31 125 213
5580 213 139 -34 -64 36 -151 -146 -130 156 16 -82 -18 -65 -183 -120 16 -53 147 -1 6 -8 7 88 109 124 68 -44
5606 -44 -182 -106 -48 68 65 -153 22 -137 5 6 78 -43 -40 -42 -115 -171 102 -67 198 144 -162 -61 109 -1 -20
5631 -20 6 18 -197 -30 -158 28 174 -62 -236 36 -164 193 98 56 65 -10 111 13 -18 -48 101 -66 -22 -52
5655 -52 -187 -8 69 -187 212 171 31 34 126 -116 21 -47 48 8 154 143 182 -116 52 311 104 269 -4 -2
5679 -2 5 17 2 91 12 -106 67 17 -173 9 -175 170 19 -72 -157 119 104 -6 141 -208 -27 63 -16 66 -131
5704 -131 221 106 68 -167 113 -97 47 123 238 -39 5 -133 30 -172 -38 129 37 33 -189 137 27 145
$$ packed form
5532A88l87j8J50J63j57o9K95k92M7Q2J20j23j88K29q3J09k79J45K81j71j14p2
5554a44Mk7J52j20K86j75J63q5kk20Q3L0O2L7J71j32l32K93JLj99Q7p9J74R4Q8
5580B13p4j73l0J00j87NJ6K86j40r8O4m7j18O3J36o9K00j48Pj4J5Q1K1J5n6j12
5606d4j38P6N8J16lk18J75j59J42JP2j21Lkp3n6K73j69K65n4l06J01J70j10j9
5631b0K6J2k15J67j28J86J46k36j74K72k00L57r5m2Rp5J21r8l1l0J49j67M4l0
5655e2j35J79P7k56L99m1j40LR2k42J37o8R5m0J46j1L9k98J68K59k07J65k73K
5679bPJ2j5Q9p9j18J73n0j90J82j84L45j51r1q5K76j5j10J47l49J81R0p9Q2j97
5704a31L52j15l8k35K80k10J44P6J15k77M4j38J63k02J34J67r2mk22L26j10J18
$$ plain form
5726 145 -87 5 -87 98 44 114 -2 153 106 179 140 -75 179 154 39 -191 44 -43 -10 97 34 -250 57 -189
5750 -189 11 55 -121 31 -65 -116 53 133 22 -11 32 -148 96 242 117 112 -12 14 -144 -6 -50 140 30
5773 30 -91 -90 -103 202 77 -74 -18 -57 171 110 110 -149 96 -232 -44 -112 -244 -201 34 30 -116 182 207 142 -235
5798 -235 26 9 -53 -97 -12 51 -21 -35 -177 63 -138 -44 -66 -16 -67 -47 76 -72 200 -3 -46 -102 97 -211 205
5823 205 176 224 -54 -207 -154 5 -26 12 -19 118 -4 50 102 -160 -15 -123 -6 -138 161 1 163 -170 178
5846 178 54 27 -188 103 43 -88 78 138 171 132 23 46 -12 -27 -61 -86 96 42 -151 -129 64 -140 -68 17 -9
5871 -9 -52 59 155 -159 -26 19 44 -217 -70 -11 13 12 -107 54 -28 61 70 44 -128 -83 -114 -5 41 117 56 48 205
5898 205 37 -63 -213 -160 115 79 128 -33 -54 239 2 86 152 44 -182 64 93 44 -151 -5 -116 9 -79
$$ packed form
5726A45k32R2r2J85n4P0j16J55m7P3l9k15K54k5j15k30K35q7L3J07o3k84L07k46
5750a89K00M4j76J52r6n1J69Q0j11l3M3j80K44J46j25nj24K6j58J38m4J90j10
5773C0j21Jj3L05j25j51N6l9K28o1%k59K45l28J88o8j32M3K35mj46K98K5o5l77
5798b35K61j7o2m4Q5O3p2j4j42K40k01R4k2N0n1K0J23j48K72k03m3n6J99l08M16
5823B05k9M8k78j53N3J59l1L8l1J37j22N4N2k62J45j08J17j32K99j60J62l33L48
5846A78j24k7k15K91o0j31J66O0L3l9j09K3n8j5l4k5J82n4j93K2J93k04P2Q5k6
5871im3J11R6l14J33M5K5k61J47N9K4jj19J61q2Q9Rk6j72M5l1J09M6P6o1qJ57
5898B05j68j00j50N3K75l6M9j61k1K93k37Q4O6j08k26K46K9m9j95J46j11J25q8
$$ plain form
5921 -79 -87 188 -186 148 30 -70 2 67 -43 115 -57 -235 -10 -27 132 42 49 -22 -123 236 129 46 -115 -59
5945 -59 -5 147 10 1 -93 -67 -260 -58 -73 -159 -81 94 50 -67 60 -55 -37 11 56 -222 31 -85 -80 78 6
5970 6 -14 -157 101 -172 177 -22 -65 -33 79 -58 44 -155 -101 -2 106 319 -56 -93 102 132 -34 -127 143
5993 143 84 169 47 -39 41 -47 -110 37 4 -146 -28 138 -133 121 -277 -172 222 19 -181 92 53 -138 158
6016 158 -67 -51 -57 238 -140 84 76 -286 69 129 137 212 -153 73 74 20 -251 -186 -72 33 13 -141 -143 -41 53 -72
6042 -72 39 -12 29 -151 200 -48 170 157 -126 -90 -13 -102 2 -159 191 92 -23 17 -272 6 65 -31 -116 70
6066 70 -55 -49 -22 -61 -51 -216 17 93 143 -315 17 215 -49 -134 -235 -3 -162 -108 107 -113 -90 -47 37 43 -60
6091 -60 -289 97 -152 31 10 -1 -124 96 -22 -46 -170 97 19 -127 267 70 -84 122 -34 -33 89 -25
$$ packed form
5921g9qK75l74L34j18j00P2O5j10J58j72j78K25j7J59r0Pp1j01L59j07q3j61N6
5945e9N4J52j37rr4K6j93K02j5q6P8J75m4j17J27j15J8M8M5k78K53j16NJ58p2
5970Fk0j43K58k73L49j99m3L2J12j37J02j99N4R9J08K13l75l7J95L0j66r3K70
5993A43n9Q5j22q6Q0q8o3J47l3j50J18J66k71K54l98J05L94k03k00K73l9j91K96
6016A58k25J6oK95l78K24ql62L55O0QP5l65K26Jn4k71O5J14J05k0j54kJ02R4j25
6042g2J11n1M1j80L51k48K18j3k83L6P7q9J04j61L50r9j15M0k89K78N9r6q5J86
6066G0j25OK7l9J0j65K33P6N0m58L32J98k64q5j01K32j59N4K15k20K3M3Q4Oj03
6091f0k29L86k49J83k1j1j23K20j18k4j24K67p8j46L94j97j54K06j56JJ22j14
$$ plain form
6113 -25 -65 -36 49 67 -118 -65 66 71 -74 -42 109 28 -57 -42 114 -67 -95 -103 -48 -204 33 -103 -146 -1 -52 17
6139 17 174 145 397 150 17 24 -10 117 -92 -122 231 8 -16 -106 24 261 -8 32 -90 -182 122 -46 -111 -8
6163 -8 82 90 -127 -204 -211 67 55 -57 -145 -126 -8 -76 -15 123 9 223 50 6 122 -126 -271 38 50 60 91 156
6189 156 -61 35 -138 64 276 4 58 -188 6 131 -55 26 164 70 -92 -66 -134 -113 141 -57 192 -13
6211 -13 -61 104 17 8 -42 121 141 -53 -2 139 0 169 5 98 31 80 157 -165 242 187 76 -58 69 398
6235 398 -1 74 102 -48 -16 19 88 80 324 52 -231 -130 -158 19 -23 -153 165 74 -14 24 -168 -4 -139 -137 -29
6260 -29 -134 -6 57 74 135 107 -40 -70 23 -63 115 18 -69 59 134 11 -165 -81 35 48 -50 152 -126 184 41
6285 41 -79 -73 -80 -89 -149 -83 -76 -104 238 93 53 -87 -155 118 115 -84 76 112 -66 107 -61 -211 -180 242 174 -105
$$ packed form
6113b5m0K9Q5J8j85N3J31Nj45L2J51q1q5J5J56j81k8qN5j56K37j36m3J45n1O9
6139A7J57k9K52k47j33Pl4J27k09l0L53k23k4r0J30K37k69M0j22r2L04j68o5J03
6163hR0Qk17p7pK78j2j12q8J9J18o8O1J38j14K14j73m4J16k48j45L09J2J0L1O5
6189A56k17R6j73K02K12k72N4k46J94J25j86Q1J38r4j62K6o8K1K54j98K49k05
6211a3m8J65q7rn0J63K0j94N1J41j39J69j64R3o7M9P7l22M07n5j11j34J27L29
6235C98l99P5K8j50L2L5O9qK44k72k83J01k8J77m2j30L18r1q8L8j92J64j35KJ08
6260b9j05J28O3J7O1k8j47l0R3q6J78r7q7J28P5j23j76Q4J16J3r8K02k78L10j43
6285D1j20Opro0O6Pk8L42j45m0j40o8K73lj99J60L6j78J73j68j50L1M22o8k79
$$ plain form
6311 -105 -42 -33 -93 134 -105 5 47 96 23 -19 -98 80 142 128 27 -28 -43 41 -50 3 51 -103 70 -79 -118 -55
6337 -55 -245 117 -142 255 20 -114 65 -190 -52 16 -128 97 -118 216 332 -37 103 -26 11 -191 -31
6358 -31 -134 101 -79 34 -7 -9 -156 10 92 -18 163 -124 -129 -219 -27 141 266 167 -125 -37 4 -154 11 -33
6382 -33 136 73 67 34 -20 -227 -83 116 197 159 -238 -61 75 -47 2 40 43 -62 -36 84 99 -58 77 201 59
6407 59 23 -8 -149 -44 48 -61 -225 -136 24 73 -37 162 14 -278 -145 -29 -131 -150 21 -10 113 19 -87
6430 -87 26 116 -86 -213 135 28 -208 -64 -122 37 -20 -75 60 165 277 41 -4 58 -7 -122 165 57 -19
6453 -19 74 107 -82 -9 301 -79 -27 -41 54 45 69 -128 -50 7 -61 3 89 106 111 105 116 208 -16 -21 162 111 -226 55
6481 55 35 102 42 -58 171 -33 186 0 -1 -2 -68 -47 13 262 -22 170 147 -2 -146 29 -168 -10 104 99 -79
$$ packed form
6311a05O3Ro0K27k39J10M2M9p3m2p9J78O2j4j01n5j5Q4r1N3M8j54J73j49l9O3
6337e5j90L62k59L97k35j34J79k55J38O8j44K25k15L34J16l69J40j29L7k02J60
6358c1j03K35j80J13m1kj47J66Q2j10J81k87nr0J92J68J25r9k92Q8M1j58J65m4
6382c3J69o3ol3n4k07J44J99Q1l8l97J77J36j22M9L8Lj05K6J20J5j57J35J24j42
6407E9l6l1j41J05R2j09j64Q9J60M9j10J99j48k92J33J16j02j9J71l1J23r4j06
6430h7J13R0k02j27L48j07k36J44n8J59n7n5J35J05J12k36m5O2o5j15K87j08p6
6453a9R3L3j89P3L10l80N2j4R5rK4j97P8N7o8O4Q6J7NoJ1R2k24nJ83n1l37K81
6481E5k0O7o0j00K29k04K19j86jjo6K1O0K49k84J92k3j49j44J75j97J58J14nj78
$$ plain form
6506 -79 115 267 -95 63 -150 51 -142 -80 -63 42 112 -100 49 -142 -10 85 50 59 -73 -242 -10 133 -77
6529 -77 64 172 -77 -81 -35 -54 -42 -233 -46 -58 99 92 25 29 167 -157 37 -110 32 119 -148 58 -142 -147 -230
6554 -230 101 -83 42 -34 176 52 34 -2 -319 107 122 -95 -41 -56 126 221 250 -8 156 -171 7 162 92
6577 92 120 153 -58 79 154 46 -6 157 -66 -2 -90 -13 -214 -123 65 -232 -104 7 4 -41 193 181 139 -63 12
6602 12 33 29 -32 -153 105 -29 58 -34 -21 93 -183 58 197 40 103 67 -36 54 -255 -16 77 -85 71 61
6626 61 -188 -247 156 -90 -227 -139 -207 -192 7 -141 186 22 64 60 0 15 -297 37 -35 -23 42 -210 -62 127
6650 127 96 10 -9 90 -14 -176 -53 -117 -28 159 100 32 166 50 -136 -1 -82 49 -142 -23 -6 -110 -195 -47
6674 -47 -23 -70 -205 -21 -94 -166 73 -18 34 -209 9 -216 9 -92 121 -73 93 214 -136 -16 -10 47 -9 98
$$ packed form
6506g9J94J52l62J58k13K01j93O2J7J05P0k12J49j91J32R5l5Rj32j69K32J43k10
6529g7J41J08k49mM6j9J2j91J87j2J57po7MJ38l24J94j47J42Q7k67K06k00nq3
6554b30L31j84J25p6K10j24j8l6l17M26J5k17N4j5J82R5K9k58J64l27J78J55p0
6577I2K8L3k11J37P5j08n2J63k23O4q8P7k01R1J88k97J28J11lm5K34j2m2k02P5
6602A2K1mo1j21K58j34Q7r2J3J14k76K41J39j57O3l6j03R0l09K39R3j62J56j0
6626F1k49n9M03k46j37Q8o8J5J99j48L27j64M2mo0J5l12L34p2J2O5k52J48J89
6650A27l1q6j9R9j04j62J23o4Q9J87n9o8J34j16j86J35q1J31j91J19J7j04q5J48
6674d7K4m7j35J84p3p2K39r1N2k43K18k25K25j01K13j94J66J21l50J20ON7n6J07
$$ plain form
6698 98 -149 125 230 55 -136 -27 57 -120 -4 -91 -71 59 -14 -240 74 179 -131 -24 30 -78 98 4
6720 4 -130 -314 -82 -151 196 71 66 31 99 -9 -80 100 12 -77 -72 193 -241 49 45 27 -63 163 187 83 -36 111
6746 111 73 -84 23 264 -21 167 -41 -89 -179 -61 -95 -66 -68 -33 -172 34 27 -59 143 -23 -45 -264 96 53
6770 53 -124 -7 165 304 81 -175 27 -131 -125 127 115 -19 16 -37 103 21 200 -208 -52 38 -47 64 -72
6793 -72 -128 -56 -116 -16 -129 -84 -110 60 -136 -6 193 72 44 57 -157 -134 282 -1 -30 22 -9 -92 -88 -33 3 26
6819 26 16 17 39 48 193 142 23 -85 -118 -125 108 78 -52 -99 18 -2 30 -166 -39 4 78 -72 -25 -17 -109 -79 223
6846 223 56 156 113 140 -84 -60 4 -59 66 222 50 76 -30 401 -53 147 68 -151 53 45 93 -173 -81 -126
6870 -126 114 -11 78 157 -193 -121 3 -109 -128 59 -94 72 -38 -41 -70 26 29 -170 22 79 -42 23 -22 38 -152
$$ packed form
6698I8k47K74J05j75j91J09Q4j77J16q7K0J30p3k26L14J05l10J07N4j08J76r4
6720Dj34j84K32o9L47j25nl5O8j08p1J80q8q9NK65m34K90mj8r0K26K4j04j19J47
6746A11l8j57J07K41k85J88k08m8r0J18l4K9kL5j39K06pq6K02j66k2k19L60m3
6770E3j77J17J72J39k23k56K02j58OK52j2j34L5n3J40q2J79m08J56R0q5J11j36
6793g2n6P2o0J00j13M5k6J70j96J30J99j21k8J3k14K3M16k83k9N2l1q3MN5L6K3
6819B6j0JK2RJ45n1j19j08l3pK33l0j30m7J17k0L2j96J27M3P4j50M7Qr2L0L02
6846B23j67J00m3K7k24K4O4o3J25J56j72K6j06M31m54K00p9k19K04qM8k66R2m5
6870a26K40j25Q9P9l50P2J24j12j9J87j53J66j10lk9R6Lj99J92N7j21O5m5O0j90
$$ plain form
6895 -152 93 -34 -45 -78 47 113 -18 183 -123 -232 138 11 6 25 5 111 114 127 52 -147 -35 30 -23 -106 -120
6920 -120 -115 88 -74 61 -111 -127 -141 30 -172 7 -97 -129 -69 149 -85 82 -84 67 -123 -12 -65 -156 -123
6943 -123 -1 102 89 -30 -191 -163 -25 -121 -94 -130 121 -76 -65 21 -141 162 18 127 52 -66 -36 -3 -82 25
6967 25 -121 5 64 -57 69 17 -17 28 72 162 66 65 126 148 76 -112 11 -147 -15 -56 71 144 -72 -14 -108 174
6993 174 116 -121 -132 -21 83 -138 -60 1 128 -56 62 -40 77 37 -220 -59 80 -79 18 -114 -119 76 46
7016 46 247 57 -183 -8 -117 -17 -19 -72 -73 -115 184 59 173 -26 41 16 158 91 142 -270 -136 190 -88 -327
7040 -327 -167 244 -217 14 43 -98 -194 127 20 -17 197 -196 -8 -65 74 -199 48 17 20 -2 67 -63 141
7063 141 17 -40 81 83 -129 -29 28 36 194 55 -28 -54 164 -112 135 211 -22 -190 -202 -63 93 109 -152 17
$$ packed form
6895a52K45j27j1l3J25O6j31K01l06j09L70j27nJ9k0J06LJ3p5j99J12O5n3q3j4
6920a20NK03j62J35j72j6j4J71k02J79j04l2O0K18k34J67j66J51j90J11n3r1L3
6943a23J22J03j3j19j61K8J38r6K7l6K51j97J1Q6j62L03j44J09p5j18L0L3p9J07
6967B5j46J26N9j21J26n2l4M5M4R0r6jO1K2p2j88J23j58J32m1J27P3k16N8r4K82
6993A74n8k37j1J11J04k21P8O1J27j84J18j02J17m0k57J61J39j59R7j32nJ95l0
7016D6K01j90k40J75j09J00kn3jm2K99j25J14j99O7k5J42o7N1m12J34L26k78k39
7040c27J60M11m61K31K9j41r6L21j07l7K14l93J88n7J39k73K47l1Lk2O9j30K04
7063A41j24n7J21Kk12J00N7QJ58j39q3k6K18k76K47P6k33j68j2J39J56J6k61J69
$$ plain form
7087 17 127 209 15 90 38 -18 -182 -99 11 -130 11 -150 -79 125 8 89 -125 -100 230 212 76 267 76
7110 76 -36 41 225 271 -144 19 143 131 -9 -135 63 51 -1 -38 -93 -101 158 182 -108 -91 -19 234 -168 -32
7134 -32 -42 -75 9 -44 -5 67 -13 -166 -193 29 106 71 -87 -12 -124 160 101 -52 -8 -55 4 61 148 -164 209 -237
7160 -237 91 129 0 -38 18 -106 33 -153 5 143 -120 68 -72 71 74 -192 -54 -49 101 150 -162 -75 156
7183 156 133 43 -129 27 58 174 110 -61 -12 -158 258 52 58 12 -45 13 82 46 -15 44 162 -126 226 56 126
7208 126 177 -7 159 -167 73 28 49 51 -63 64 -59 -26 -54 140 -20 78 7 18 152 60 -146 -12 244 -83
7232 -83 -39 38 -90 -284 -46 212 64 64 29 -119 -45 -160 116 183 64 -242 -121 -210 -12 -45 23 -54 53 12
7256 12 115 125 141 -142 -37 -80 140 -155 12 45 -50 5 -251 -123 146 -47 -4 -7 -182 10 -155 -53 28 -157
$$ packed form
7087A7J10Q2j94P5n2n6j64Q3J10j41J41j61P1K04j17Q1k14K5L30j8j36J91j91
7110G6j12P7J84M6m15J63J24j2j40j26J98j2n2l7n5qK59K4k90J7P2K53m02J36
7134c2j0l3Q4n3L9P2q0j53k7K22P7l5j58P5j12K84n9j53M4m7N9N7Q7l12L73m46
7160b37L28L8j29l8N6j24J39j86J58J38k63J88j40J43Lk66J38NJ50M9l12Q7K31
7183A56k3r0j72J56L1J16o4j71M9j46M16k06Om6n7N8O9l6o1N9J18k88L52j70P0
7208A26N1j84J66l26K40m5K1Kj14J27j23L3k8J94j60R8p1J1J34r2k06J34K56l27
7232h3M4P7j28j94K38K58j48%l5j48P4j15K76O7j19l06J21q9J98l3O8p7J07m1
7256A2J03J0J6k83J05m3K20k95J67L3r5N5k56J28K69j93M3lj75J92j65J02Q1j85
$$ plain form
7280 -157 -76 -67 -38 82 -56 -116 23 21 36 -121 122 -48 -106 -174 12 101 -86 -116 -58 171 -207 -192 5 3 121
7305 121 96 85 19 2 57 -159 37 -25 164 243 27 -103 -107 -28 83 67 -50 -101 103 -35 81 92 80 -68 -103
7330 -103 27 -82 24 195 -152 -46 -23 -88 -25 97 6 -102 90 -74 -168 -259 90 84 246 26 -34 212 -117
7353 -117 112 88 84 -56 85 54 -36 -81 -73 -85 105 44 59 -56 -47 152 27 -38 255 198 91 51 9 128 -5 -221
7379 -221 -239 23 -102 69 28 106 -30 1 -77 -68 53 28 116 -204 -281 -66 67 13 127 -14 -13 34 -220 -4 -1
7404 -1 -109 72 -233 28 12 -17 -188 23 14 16 244 -10 7 -282 -12 82 75 68 -197 -87 112 -338 -158 31 24
7429 24 -183 -175 66 -172 -58 14 -50 364 57 13 55 -138 159 12 134 68 32 108 139 136 13 24 34 -132 384
7454 384 175 -15 -160 56 -78 -14 21 -59 4 -25 -7 -89 190 -23 118 -33 -27 -105 114 69 86 97 -105 47
$$ packed form
7280a57Q1RK9J20j38o0J39kJ5j57K43j70n8o8J86Q9j87l0N8K29l78J5J97kJ18
7305A21k5j1o6j7N5k16J96o2J89P9k16j30mP9J11j6j17n1K04j38J16J1j2j48l5
7330a03J30j09J06J71l47J06K3o5O3J22r1j08J92j64r4r1L49oJ62k20o0K46l29
7353a17K29k4mj40J41l1r0m5Qj2J90o1J5j15RJ99j25o5K93n7j07m0m2J19j33k16
7379b21j8K62j25J71m1P8j36L1p8RJ21k5Q8l20p7K15J33n4J14j41JM7k54K16L
7404aj08J81l05K61j6k9j71K11rKK28k54J7k89K70R4ppk65J10J99m50J80J89p
7429B4k07QK41k38J14P2o4M14l07m4M2j93K97j47J22o6l6P6L1lj23J1J0j66N16
7454C84k09j90j45K16j34O4L5q0O3k9J8q2K79k13J41j51Op8K19m5J7J1k02J52
$$ plain form
7478 47 -198 208 -69 -156 -57 -18 241 -42 146 -77 -23 -9 42 173 -323 -103 8 -256 -134 -29 -50 92 -75
7501 -75 288 -130 -35 33 -20 25 136 188 24 -4 -40 300 178 100 -189 30 -140 -12 -10 -10 271 -213 128 -204
7525 -204 -125 -27 -48 56 -56 39 42 -104 74 -367 -129 76 -69 -117 16 92 -40 -273 -47 -144 169 -43 41
7548 41 26 194 125 -30 -82 -17 146 -7 -2 237 46 14 42 -86 -53 -35 -157 -162 -54 141 181 78 -26 44 73
7573 73 312 -157 30 68 -147 -139 -61 115 71 84 -142 -99 -103 0 92 -3 -67 -22 -135 96 -126 -83 180 6 -24
7598 -24 -180 114 113 193 15 -5 148 123 116 -19 -43 12 10 26 71 2 255 -120 134 48 -27 -142 12 -107 93 6
7624 6 124 4 16 -84 57 58 -102 -52 103 -172 -88 -257 -179 -128 51 6 -143 70 -24 66 45 107 0 -125 85
7649 85 -23 -49 -23 5 3 205 3 -44 -181 96 -168 -128 245 -185 7 149 285 -67 -9 20 25 -275 -165 30
$$ packed form
7478D7k45M06k77q7R9L9K59k83J88k23N4J4N1J31m96K20J11k64J22J05k1J42j67
7501g5L63m18R5O8n3M5J11N2j64k8l6L40j22p8k89K19j70J28K%K81m84L41l32
7525b04P9R8k1J04j12R5Lj46J78m41K38K05j45m8J33P6j32k33K26r7L13k12Q4
7548D1j5J68o9j55n2O5J63j53NK39j91l2K8j28L3J8j22nJ08J95M0j03j04P0K9
7573G3K39m69J87L8k15QP8J76m4J3k26M3mJ03R2r5o4M5j13K31k22M3K63j74l0
7598b4j56K94jQ0j78k0J53k5pj35k4N5kJ6M5o9K53l75K54q6p5j15J54j19K00q7
7624FJ18j20J2j00J41Jj60N0J55k75Q4j69P8N1J79m5j49K13r4R0k1O2j07j25K10
7649H5j08k6K6K8kK02k02m7j37K77k64M0L73m30J92J42J36l52N8K9Nl00J10J95
$$ plain form
7673 30 174 -98 -162 203 -5 103 -58 6 182 -185 -32 146 -65 129 -26 -220 125 -40 -101 36 -22 38
7695 38 8 -163 101 -130 -16 102 217 167 -108 -53 -220 58 -131 6 -107 -46 62 -78 -184 133 -182 -160
7717 -160 157 6 -98 55 -79 110 -235 -14 -34 -125 102 8 153 94 -7 -131 195 34 -18 -44 62 245
7739 245 -56 152 105 -182 -54 49 -10 -37 228 -282 -105 77 8 71 -35 187 -20 41 -16 122 -152 -276
7761 -276 94 -237 39 154 -19 17 -33 -93 83 -129 -100 -4 -43 124 7 18 51 -9 -114 -119 36 161 45 -39
7785 -39 -161 -206 -147 -84 -149 -197 -102 -250 90 187 -95 -7 270 296 117 206 -90 185 -111 34 -241 25 14 94
7809 94 -159 -377 167 285 55 -93 261 -16 -94 -87 -16 -212 29 -28 -67 -39 -65 97 83 233 256 -91 34 -23
7833 -23 -45 -222 -106 -55 -3 -78 -88 191 -296 -80 213 74 -50 -80 -139 -41 33 135 154 -58 -108 -23 100 279
$$ packed form
7673C0J44k72o4L65k08J08j61O4J76l67J53J78k11J94j55j94L45j65o1J37n8O0
7695C8l0j71K64k31J14J18J15n0k75N5j67K78j89J37j13O1J08j40j06L17l15K2
7717a60L17j51j04J53j34J89l45K21k0r1K27r4J45n9j01j24L26j61n2k6J06J83
7739B45l01K08m7k87J28J03n9k7K65n10J77J82o9O3j06K22k07O1n7J38k74j24
7761b76L70l31K76J15j73L6n0o0J76k12K9R6l9J67j17J1L3o0j05nJ55J25j16q4
7785c9j22m5N9O3o5m8R5j48L40R7k82Q8K77K6j79Q9k96K75k96J45k75K66j1Q0
7809I4k53k18N44J18k30j48L54k77p8PP1j96K41n7l9K8k6J62j4J50K3l47J25n7
7833b3k2j77J16N1N2p5j0K79m87K16K93j39j24l0n9R8P4J02J9k12n0Q5J23J79
$$ plain form
7857 279 -183 103 170 147 115 21 194 106 200 -38 -47 207 -118 -104 107 -142 -45 -96 -56 -8 -61 89 -105 106 -4
7882 -4 24 -77 -139 -94 -45 -233 184 91 -73 134 161 -122 -160 84 14 69 -123 -173 -17 -105 1 -44 -56 9 -30 -7
7908 -7 215 130 -105 92 18 13 79 96 -49 -53 78 -95 82 193 -215 17 223 -134 4 113 -45 -90 -5 -164
7932 -164 -125 -49 -111 285 63 -102 38 28 -55 -152 -7 -98 46 186 46 139 100 -186 80 -59 27 96 114 47
7956 47 24 -150 110 -2 -76 123 215 123 18 8 -64 65 -250 49 -171 -38 -101 -63 -22 -64 122 228 -87 2
7980 2 -96 -33 112 144 -22 32 -25 -20 54 -205 45 44 32 -96 -187 94 64 296 -34 -82 172 -25 75 -123 109
8005 109 101 -92 286 170 -41 29 -81 58 49 -47 -218 72 -7 -66 -74 223 -54 43 6 46 -148 223 -54 -195
8029 -195 168 -46 -265 56 261 82 155 -34 119 48 -278 109 270 267 -31 -137 -87 -196 295 -4 70 -20
$$ packed form
7857B79m62K86O7k3l2r4J73q8R4k38rK54l25J4K11k49R7n1M0M8n3J50j94K11j10
7882dK8j01o2M5M9j88M17r3j64K07K7k83l8K44p0N5j92n0J56q8J06m5j2O5l9K3
7908gK22q5k35J97p4nO6J7j45mJ31j73J77J11m08K32K06l57J38J09j58m5Q5j59
7932a64L9P6o2L96k22j65J40j0q3r7J45r1J44J40j40R3l9k86K66j39Q6O9J8o7
7956D7k3j74K60j12p4J99R2r2j05j0p2J29l15K99k20J33o3L8M1m2J86J06l15Q9
7980Br8O3J45L2j66N4n7NP4k59K50jj2j28r1K81l0K32l30m8K54j97J00j98K32
8005A09qj93L78j16k11P0j10J39rr6j71K90p9n9qK97k77R7l7M0j94L71k77j41
8029a95L63k14k19L21K05j79P3j89J53p1l26L87J61lk98j06N0j09M91k99P4r0
$$ plain form
8051 -20 146 -9 -94 -123 -39 -1 -74 87 -194 -4 210 30 -78 17 -204 -140 91 -62 -16 92 -32 129 87
8074 87 260 -73 -72 65 -180 -83 12 -214 -23 -23 -206 -35 -11 -150 -11 -7 -44 -143 95 109 34 -17 60 -30 -26 69 -3
8101 -3 -137 -14 -169 -182 9 -124 95 69 169 8 -53 38 187 -50 -15 -118 -148 -50 -116 65 -100 -26 143 -23
8125 -23 -205 223 -263 308 31 61 2 60 107 294 42 -19 -61 -31 57 -194 29 -69 92 178 8 31 179 -65
8149 -65 -16 -183 -5 107 -114 98 13 28 -170 11 220 22 -7 226 192 -32 57 -127 94 130 -165 173 -48
8172 -48 176 -162 87 152 -101 13 -56 144 78 -291 -1 5 12 75 -45 -361 122 42 8
$$ packed form
8051b0J66j55q5k9Q4L8p3J61k81J90K14j80j08R5k21O4K31j53M6J08j24J61m2
8074H7J73l33JJ37k45R7R5k26J91%j83J71K4j39J39Ml7r9K38J4p5n1P7r0MR5p2
8101cj34J23j55j3J91j33K19k6J00j61o1R1J49k37L5j03l0R8o6J81j65P4J69j66
8125b3j82M28m86N71k77L0n9N8M7J87k52o1m2L0Q8k51K23r8J61Q6j70K3J48k44
8149f5M9j67J78J12k21K12q5J5j98J81K09j98k9K33l4k24Q9j84K21L6k95L38k21
8172d8K24l38K49O5k53J14o9K00o6l69K90OPO3j20l16M83q0l4
8191H
$$ Imaginary data points
##PAGE= N=2
##DATA TABLE= (X++(I..I)), XYDATA
$$ plain form
0 0 0 0 0 0 0 0 0 0 0 0 0 -8 8 -8 8 -8 16 -16 16 -24 24 -32 40 -48 56 -64 72 -85 96 -112 128 -145 165 -187
34 -187 211 -237 267 -300 334 -373 414 -462 512 -568 627 -691 765 -842 928 -1023 1127 -1243
52 -1243 1371 -1510 1671 -1848 2052 -2284 2556 -2874 3256 -3727 4317 -5085 6130 -7646 10048
67 10048 -14453 25202 -111557 -63011 115256 -38222 12707 155771 98292 -27711 5356
78 5356 -50178 -128161 -52158 26903 -4696 59106 119887 44037 4245 25557 -99657 -170315
90 -170315 -23398 34918 -63646 23792 173512 86510 -21880 21919 -27476 -124452 -49090
101 -49090 16191 -43430 21828 147268 71610 -30252 9531 -26105 -126989 -74042 -1659
112 -1659 -37248 21053 139176 84874 -3604 28138 -2665 -97904 -65974 -15492 -44553 23389
$$ packed form
0@%%%%%%%%%%%qJ6j6J6j6K4l2L2m0M8n6P2q8J04j20J36j57J81k08K40k73L10l52
34a87L98m48N04n67O34p07P87q76R74j080J195j318J456j607J770j951K150k370
52a243K614k881L181l519L900m336M840n430O130o983Q044r402J1215j3776J7694
67A0048k4501L9655j36759M8546J78267j53478N0929J43064n7479j26003L3067
78E356n5534p7983P6003P9061l1599O3802O0781p5850l9792K1312j25214p0658
90a70315J46917N8316r8564Q7438J49720q7002j08390M3799m9395r6976P5362
101d9090O5281n9621O5258J25440p5658j01862L9783l5636j00884N2947P2383
112a659l5589N8301J18123n4302q8478L1742l0803r5239L1930N0482k9061O7942
$$ plain form
124 23389 124847 50789 -23420 41328 6286 -125417 -90436 3052 -28818 -4404 110469
135 110469 87615 5510 38054 24760 -85773 -86504 -15909 -27177 -6163 76937 59801 7716
147 7716 40331 9082 -97757 -78307 -3943 -32722 -21069 83518 83952 18953 43417 32726
159 32726 -70851 -78290 -12875 -34270 -35860 54724 69321 14256 30595 24586 -62714 -70951 -13830
172 -13830 -33929 -33435 58268 78774 24534 40029 41977 -44397 -68378 -20880 -39296 -47277 34212
185 34212 61153 15707 29924 40286 -34465 -61901 -18972 -31627 -41494 33700 66537 26697
197 26697 37329 49921 -20077 -58197 -26372 -37383 -52296 10478 47512 19639 30917 46715
209 46715 -11759 -47106 -19968 -29847 -45944 11751 50579 25931 35422 52987 -1448 -44773
$$ packed form
124B3389J01458p4058p4209O4748l5042j31703L4981R3488l1870K4414J14873
135A10469k2854q2105L2544j3294j10533p31P0595j1268K1014Q3100j7136n2085
147G716L2615l1249j06839J9450P4364k8779J1653J04587M34o4999K4464j0691
159C2726j03577p439O5415k1395j590R0584J4597n5065J6339o009q7300q237N7121
172a3830k0099M94R1703K0506n4240J5495J948q6374k3981M7498j8416p981Q1489
185C4212K6941m5446J4217J0362p4751k7436M2929j2655r867P5194L2837l9840
197B6697J0632J2592o9998l8120L1825j1011j4913O2774L7034k7873J1278J5798
209D6715n8474l5347K7138r879j6097N7695L8828k4648R491J7565n4435m3325
$$ plain form
221 -44773 -25402 -35128 -56574 -8970 34579 19114 27835 50446 9781 -32050 -19917 -25879 -45841
234 -45841 -8755 32978 26021 32605 48901 13590 -25273 -23714 -36404 -54418 -19105 17510 13207
247 13207 28498 53866 21192 -18941 -12270 -20077 -47715 -24039 20588 22344 23655 44879 30110
260 30110 -9932 -24221 -31688 -45428 -31381 -2055 12202 29967 46079 27775 1468 -4593
272 -4593 -22024 -45291 -27199 5113 9751 20272 45108 34154 -1486 -14403 -22931 -43965 -40779
285 -40779 -9984 9609 21088 39172 38645 15621 -3504 -18772 -34560 -32444 -14087 3416 20785
298 20785 36558 32054 13525 -1997 -21509 -40995 -37982 -17952 -2171 15240 37482 40817 22240
311 22240 3579 -11159 -28445 -36348 -23768 -2411 15018 26954 32244 24681 4353 -18408 -32004
$$ packed form
221d4773J9371r726k1446M7604M3549j5465Q721K2611m0665m1831J2133n962j9962
234d5841L7086M1733o957O584J6296l5311l8863J559j2690j8014L5313L6615m303
247A3207J5291K5368l2674m0133O671p807k7638K3676M4627J756J311K1224j4769
260C0110m0042j4289p467j3740J4047K9326J4257J7765J6112j8304k6307o061
272d593j7431k3267J8092L2312M638J0521K4836j0954l5640j2917q528k1034L186
285d0779L0795J9593J1479J8084n27k3024j9125j5268j5788K116J8357J7503J7369
298B0785J5773m504j8529j5522j9512j9486L013K0030J5781J7411K2242L335j8577
311B2240j8661j4738j7286p903J2580K1357J7429J1936N290p563k0328k2761j3596
$$ plain form
324 -32004 -34490 -27131 -10107 12736 31287 36912 29686 12466 -7348 -23475 -32764 -30095 -11691
337 -11691 9446 21306 28416 29371 12467 -12076 -25309 -29830 -30664 -16366 7983 24095 32197
350 32197 33597 18580 -3394 -17142 -27750 -34319 -19440 4985 14897 22085 31607 20127 -6845
363 -6845 -18564 -23217 -31740 -22288 3575 18106 25154 34252 24675 765 -11622 -21105 -34135 -25168
377 -25168 -331 9834 15553 31021 25382 -1252 -12369 -16019 -30352 -26897 -946 12259 17328
390 17328 32102 29270 4327 -7720 -13598 -31336 -30024 -5142 5116 8867 27665 28937 3562
403 3562 -6984 -8495 -26605 -29797 -4147 7607 9420 27223 32003 8001 -4344 -6563 -26221
416 -26221 -32803 -9674 1850 2824 22283 30679 8666 -2407 -1955 -21379 -30397 -8023 3686
$$ packed form
324c2004k486P359J7024K2843J8551N625p226j7220j9814j6127r289K669J8404
337a1691K1137J1860P110R55j6904k4543j3233m521q34J4298K4349J6112Q102
350C2197J400j5017k1974j3748j0608o569J4879K4425R912P188R522j1480k6972
363f845j1719m653q523R452K5863J4531P048R098r577k3910j2387r483j3030Q967
377b5168K4837J0165N719J5468n639k6634j1117l650j4333L455K5951J3205N069
390A7328J4774k832k4943j2047n878j7738J312K4882J0258L751J8798J272k5375
403C562j0546j511j8110l192K5650J1754J813J7803M780k4002j2345k219j9658
416b6221o582K3129J1524R74J9459Q396k2013j1073M52j9424r018K2374J1709
$$ plain form
429 3686 1962 21605 32698 11095 -1545 -362 -19984 -32957 -12796 -727 -3636 15922 31345
442 31345 12921 182 3295 -13747 -29218 -12253 -310 -3232 15008 30868 13052 1563
454 1563 5928 -13592 -31786 -14454 -2844 -9679 9253 31447 14658 996 9573 -5053 -28295
467 -28295 -16231 -1391 -6526 6396 26582 16301 4319 8622 -6951 -27527 -15839 -5715
479 -5715 -13014 3868 27744 15293 3423 14447 987 -26275 -16693 -1973 -11266 -1457 24191
492 24191 17953 4123 11391 992 -23696 -17985 -5783 -14478 -3558 23034 17784 4520 14725
505 14725 7477 -19523 -17805 -5124 -12698 -5556 17868 15589 5871 15482 5598 -20636 -15977 -4606
519 -4606 -17597 -9908 20575 17720 2257 16496 15962 -16253 -21272 -3953 -9898 -13017 9008 17257
$$ packed form
429C686j724J9643J1093k1603j2640J183j9622j2973K0161J2069k909J9558J5423
442C1345j8424j2739L113j7042j5471J6965J1943k922J8240J5860j7816j1489
454A563M365j9520j8194J7332J1610o835J8932K2194j6789j3662Q577j4626k3242
467b8295J2064J4840n135J2922K0186j0281j1982M303j5573k0576J1688J0124
479e715p299J6882K3876j2451j1870J1024j3460k7262R582J4720r293R809K5648
492B4191o238j3830P268j0399k4688N711J2202q695J0920K6592n250j3264J0205
505A4725p248k7000J718J2681p574P142K3424k279r718R611r884k6234M659J1371
519d606j2991P689L0483k855j5463J4239n34l2215n019J7319n945l119K2025Q249
$$ plain form
533 17257 9271 13882 7939 -12976 -13199 -6672 -17923 -12386 14312 14480 4003 18594 17355 -13185
547 -13185 -17260 -1194 -12483 -20240 5952 18443 7267 10650 13245 -5768 -12530 -6349 -16017
560 -16017 -16995 7424 15154 5215 14054 18139 -4262 -12586 -3946 -14728 -20394 3586 14600 4088
574 4088 10088 17816 -410 -11049 -5886 -15014 -18428 4034 12857 1829 11280 22509 2346 -12920
588 -12920 -5698 -11278 -18588 -2036 9468 2597 10015 20413 3830 -10433 -5610 -10398 -17129 -2470
602 -2470 7195 1751 11840 22651 3951 -11049 -3055 -7472 -19488 -7641 6215 3011 9560
615 9560 20103 5744 -8123 -2036 -6380 -19029 -8670 5660 3586 9477 19407 6627 -6070
628 -6070 -267 -6207 -20349 -10597 4738 2518 6243 17571 9016 -3385 105 -5198 -18814 -10623
$$ packed form
533A7257p986M611n943k0915k23O527j1251N537K6698J68j0477J4591j239l0540
547a3185m075J6066j1289p757K6192J2491j1176L383K595j9013o762O181r668
560a6017r78K4419P730r939Q839M085k2401q324Q640j0782n666K3980J1014j0512
574D088O000P728j8226j0639N163r128l414K2462Q823j1028R451J1229k0163j5266
588a2920P222n580p310J6552J1504o871P418J0398j6583j4263M823m788o731J4659
602b470R665n444J0089J0811j8700j5000P994m417j2016J1847J3856l204O549
615I560J0543j4359j3867O087m344j2649J0359J4330k074N891R930j2780j2697
628f070N803n940j4142R752J5335k220L725J1328q555j2401L490n303j3616Q191
$$ plain form
642 -10623 4357 1896 4779 16769 10755 -1666 -97 -5171 -18231 -11561 2310 297 2705 15730
656 15730 12257 137 42 -3808 -15871 -11066 704 -698 2001 15259 12857 769 517 -2858
670 -2858 -14801 -12286 -1026 -1800 832 14245 13495 1757 932 -835 -12426 -12114 -2415 -2018 622
685 622 12725 12631 2698 2248 -308 -11475 -12675 -3739 -3096 -610 11430 12698 3619 3101 1842 -10238
701 -10238 -12913 -4253 -2551 -1629 9343 12323 4776 3207 1797 -8215 -12501 -5817 -3831 -1766 7582
716 7582 11383 6017 4635 2738 -7497 -10888 -5467 -4651 -3507 6739 10945 5563 4346 3999 -5728
731 -5728 -11576 -6527 -4245 -4269 4391 10710 7056 4786 4038 -3727 -9466 -7111 -5538 -3996 3462 8907
747 8907 6739 5731 4801 -3111 -8988 -6787 -5882 -5227 2285 8529 6958 5817 5817 -1410 -8150 -6958 -5717
$$ packed form
642a0623J4980k461K883J1990o014j2421J569n074j3060O670J3871k013K408J3025
656A5730l473j2120r5l850j2063M805J1770j402K699J3258k402j2088k52l375
670b858j1943K515J1260p74K632J3413p50j1738q25j767j1591L12R699L97K640
685F22J2103r4r933m50k556j1167j200Q936O43K486J2040J268r079n18j259j2080
701a0238k675Q660J702R22J0972K980p547j569j410j0012m286O684J986K065R348
716G582L801n366j382j897j0235l391N421Q16J144J0246M206n382j217l47r727
731e728n848N049K282k4Q660O319l654k270p48p765n739K355J573J542P458N445
747H907k168j008r30p912n877K201R05O55P512O244j571j141%p227o740J192J241
$$ plain form
764 -5717 -5694 366 7289 7294 5967 5390 152 -6395 -7075 -6428 -5447 25 5959 6798 6860 6052 298 -5406
782 -5406 -6491 -6600 -6578 -1214 5046 6410 6363 6333 1913 -4329 -6485 -6482 -6312 -2099 3469 6076 6929 6450
800 6450 2296 -2898 -5525 -6432 -6699 -3098 2303 5250 6518 6217 3339 -1762 -5311 -6540 -6243 -3356
816 -3356 1089 4806 6598 6629 3615 -872 -4203 -6698 -6663 -4099 338 4052 6212 6370 4331 549
832 549 -3833 -6442 -6000 -3974 -1047 3275 6078 6281 4358 1290 -2821 -5882 -6253 -4701 -1697 2529
848 2529 5492 6064 4940 2330 -2116 -5716 -5841 -4765 -2670 1740 5432 6122 4728 3036 -938 -5139
864 -5139 -6019 -4731 -3419 613 5059 5807 4954 3417 -457 -4808 -5552 -4872 -3933 -99 4466 5169 4733
881 4733 4175 435 -4143 -5393 -4703 -4367 -877 3822 4915 4623 4372 1363 -3608 -4795 -4581 -4790 -1811
$$ packed form
764e717K3O060O923Nj327n77n238o547o80O47R81N472N934Q39O2q08n754n704
782e406j085j09K2N364O260J364m7l0m420o242k156LJ70M213N568K607Q53m79
800F450m154n194k627r07k67L601N401K947J268l01k878n101l549j229K97K887
816c356M445L717J792L1l014m487l331k495L5K564M437L714K160J58k039l782
832E49m382k609M42K026K927M322K803K03j923l068m111l061l71J552L004M226
848B529K963N72j124k610m446l600j25J076K095M410L692O90j394j692l974m201
864e139q80J288J312M032M446P48q53j537l874m351p44O80R39L834M565P03m36
881D733n58l740m578j250O90L36L490M699J093k92k51l009m971j187K14k09K979
$$ plain form
898 -1811 3161 4849 4185 4793 2132 -3015 -4367 -3980 -4928 -2326 2927 4164 4162 5261 2856 -2559 -4082
915 -4082 -3993 -4992 -3253 2124 3885 3606 4988 3537 -1746 -3859 -3682 -5025 -3729 1464 3417 3145 5221
932 5221 3916 -1309 -3374 -3208 -5144 -4307 820 3030 2880 5019 4316 -572 -2829 -2990 -4848 -4543 57
949 57 2592 2577 4766 5104 16 -2447 -2357 -4857 -5069 -234 2357 2198 4544 4957 535 -1994 -1846 -4228
967 -4228 -5166 -1006 1942 1889 4397 5140 1141 -1562 -1426 -4214 -5416 -1178 1528 1519 3745 5169 1646
984 1646 -1281 -821 -3622 -5496 -1824 1127 920 3232 5338 2097 -923 -670 -3157 -5481 -1917 664
1000 664 242 2855 5089 2412 -512 -403 -2887 -5293 -2521 198 -24 2528 5274 2535 -158 -144
1016 -144 -2297 -5049 -2638 -330 -309 2224 4896 2972 -26 285 -1477 -4994 -3137 -389 -326 1709
$$ packed form
898a811M972J688o64O08k661n147j352L87r48K602N253J237kJ099k405n415j523
915d082Q9r99J739N377J761k79J382j451n283k113J77j343J296N193J953k72K076
932E221j305n225k065J66j936Q37N127K210j50K139p03m888k257j61j858L05M600
949E7K535j5K189L38n088k463R0k500k12M835K591j59K346M13m422k529J48k382
967d228r38M160K948n3K508P43l999k703J36k788j202M238K706rK226J424l523
984A646k927M60k801j874L672K951k07K312K106l241l020K53k487k324L564K581
1000F64m22K613K234k677k924J09k484k406K772K719k22K552K746k739k693J4
1016a44k153k752K411K308K1K533K672j924k998L11j762l517J857K748O3K035
$$ plain form
1032 1709 4746 3318 493 783 -1274 -4973 -3281 -540 -787 1358 4640 3236 578 742 -727 -4432
1048 -4432 -3307 -810 -921 541 3861 3202 1131 1200 -348 -3973 -3382 -1067 -991 366 3845 3140 1300
1065 1300 1244 -18 -3756 -3319 -1140 -1268 119 3537 3324 1045 1552 185 -3076 -3494 -1515 -1785 -454
1082 -454 3082 3283 1361 1750 736 -2658 -3314 -1434 -1405 -872 2573 3220 1358 1729 1078 -2417 -3268 -1546
1100 -1546 -1871 -1264 1923 3007 1747 2051 1101 -1958 -3040 -1541 -1810 -1673 1647 2760 1870 1864 1528 -1680
1118 -1680 -2716 -1532 -1913 -1948 1129 2685 1722 2051 1601 -1095 -2508 -1810 -1940 -1943 1114 2582 1784 1733
1136 1733 2011 -594 -2225 -1490 -1820 -2010 417 2308 1770 1897 2109 -195 -1863 -1764 -1928 -1983 318 1968
1154 1968 1791 1812 2208 -279 -1995 -1474 -1867 -1963 85 1650 1338 1776 2280 169 -1830 -1590 -1780 -1991
$$ packed form
1032A709L037j428k825K90k057l699J692K741k47K145L282j404k658J64j469l705
1048d432J125K497j11J462L320o59k071O9j548l625N91K315P6J357L479p05j840
1065A300n6j262l738M37K179j28J387L418k13k279N07j367l261m18J979k70J331
1082d54L536K01j922L89j014l394o56J880K9N33L445O47j862L71o51l495q51J722
1100a546l25O07L187J084j260L04r50l059j082J499k69J37L320J113q90ol36l208
1118a680j036J184l81l5L077J556r63L29m50k696j413O98j30lL057J468p98n1
1136A733K78k605j631P35l30j90K427J891n38J27K12k304j668R9j64n5K301J650
1154A968j77K1L96k487j716N21l93r6K048J565l12M38N04k111j999K40j90k11
$$ plain form
1172 -1991 -353 1318 1511 1682 1995 443 -1165 -1491 -1772 -1915 -638 1279 1379 2078 2251 682 -1091
1189 -1091 -1169 -1740 -2223 -793 1132 1267 1363 2289 1169 -798 -1265 -1543 -2092 -1095 648 1190 1642 2207 1172
1208 1172 -501 -1007 -1825 -2054 -1081 413 877 1638 2539 1174 -415 -641 -1235 -2139 -1094 718 747 1290
1226 1290 2395 1441 -191 -807 -1109 -2055 -1527 -20 792 1250 2082 1322 11 -517 -1298 -2093 -1482 -97
1244 -97 137 1271 1867 1132 246 -292 -1157 -2107 -1805 -469 606 678 1796 1883 565 -405 -995 -1661 -1496
1263 -1496 -399 389 997 1577 1442 516 -40 -866 -1603 -1653 -790 -98 934 1635 1602 786 105 -675 -1705
1282 -1705 -1526 -805 -133 580 1505 1569 756 231 -751 -1292 -1612 -992 -221 524 1311 1657 1091 405 -596 -1352
1302 -1352 -1626 -950 -529 306 1092 1465 1109 371 -359 -1165 -1621 -970 -458 281 1001 1570 1247 538 -196 -1065
$$ packed form
1172a991J638J671J93J71L13j552j608l26k81j43J277J917J00O99J73j569j773
1189a091p8n71m83J430J925J35R6R26j120j967m67k78n49R97J743N42M52N65j035
1208A172j673n06q18k29R73J494M64P61R01j365j589k26n94r04J045J812K9N43
1226A290J105r54j632o16l02r46N28J507Q12M58Q32p60j311n28p81p95O11J385
1244i7K34J134N96p35q86n38q65r50L02J336J075P2J118Q7j318r70n90o66J65
1263a496J097P88O08N80j35r26n56q26p37n0Q63O92J032P01l3q16o81p80j030
1282a705J79P21O72P13R25O4q13n25r82n41l20O20P71P45P87L46n66o86j001p56
1302a352k74O76M21Q35P86L73l56p38p30q06m56O51N12P39P20N69l23p09p34q69
$$ plain form
1322 -1065 -1314 -1214 -496 102 1029 1363 1268 656 -129 -965 -1578 -1302 -689 84 822 1253 1175 826 47 -753
1342 -753 -1144 -1169 -745 -32 739 863 1175 842 73 -676 -937 -1443 -1015 -184 537 929 1386 1076 219 -569
1362 -569 -1019 -1436 -1200 -356 254 792 1306 1098 319 -196 -773 -1139 -857 -460 333 796 1292 1057 291 -146
1382 -146 -797 -1387 -1017 -350 94 783 1152 1270 499 -116 -668 -1061 -1093 -589 361 647 1223 1203 678 159 -630
1403 -630 -945 -1213 -776 26 485 885 1202 697 226 -304 -1169 -1128 -608 -146 157 946 1112 858 133 -252
1423 -252 -810 -1311 -778 -250 269 712 1332 946 437 -158 -1019 -1126 -905 -370 127 864 1297 557 669 157
1443 157 -884 -1528 -950 -451 -180 556 1269 850 389 35 -303 -982 -958 -560 -199 723 1094 895 653 379
1463 379 -452 -1111 -1059 -453 -263 371 1179 1108 838 475 -281 -915 -869 -940 -332 311 956 945 708 636 -94 -1088
$$ packed form
1322a065k49J00P18N98R27L34r5o12p85q36o13K76O13P73P38M31p8l49p79q00
1342g53l91k5M24P13P71J24L12l33p69p49k61n06M28Q31P21L92M57l10q57p88
1362e69m50m17K36Q44O10N38N14k08p79n15n77l66K82L97P93M63M96k35p66m37
1382a46o51n90L70O67M44O89L69J18p71o15n52l93l2N04R50K86N76k0n25n19p89
1403f30l15k68M37Q02M59M00L17n05m71n30q65M1N20M62L03P89J66k54p25l85
1423b52n58n01N33N28N19M43O20l86n09n95q61j07K21N35M97P37M33p40J12n12
1443A57j041o44N78M99K71P36P13m19m61l54l38o79K4L98L61R22L71j99k42k74
1463C79q31o59N2O06J90O34Q08p1k70l63p56o34M6p1O08O43O45j1k37p2p30r94
$$ plain form
1485 -1088 -1050 -660 -581 84 988 1068 858 907 -91 -783 -1036 -980 -490 100 806 818 896 750 -149 -801 -1100 -679
1507 -679 -865 -378 751 910 875 632 347 -843 -842 -839 -777 -150 612 924 866 751 225 -665 -702 -713 -914 -389
1529 -389 587 1066 816 834 541 -376 -878 -868 -883 -535 269 731 1020 995 453 -517 -831 -655 -1175 -527 349
1550 349 848 717 919 681 -315 -867 -892 -1000 -718 -48 588 591 989 812 -7 -547 -712 -964 -833 126 802
1571 802 794 859 846 249 -568 -952 -1105 -1058 -223 251 720 921 909 261 -432 -559 -1125 -919 -103 497 679 894
1593 894 986 325 -286 -623 -838 -958 -489 310 620 1012 888 394 -145 -585 -1189 -986 -416 344 427 876 1025
1614 1025 336 -229 -462 -799 -1096 -545 7 399 538 1026 607 102 -463 -632 -946 -755 -186 365 919 1020
1634 1020 447 125 -314 -740 -1138 -574 -234 197 579 1035 1115 214 -113 -457 -793 -842 -31 183 526 887
$$ packed form
1485a088L8L90P9O65R04Q0k10M9r98o92k53N6M90N90P06J2P8j46q99o52k99M21
1507f79j86M87J129J59l5k43k85j190JLO2O27P62L12n8j15n26q90l7j1k01N25
1529c89R76M79k50J8k93r17n02J0j5L48Q04M62K89k5n42r70l14J76n20O48Q76
1550C49M99j31K02k38r96n52k5j08K82O70O36LL98j77q19n40j65k52J31R59O76
1571H02qO5j3n97q17l84j53M7Q35M74M69K01j2o48o93j27n66K06Q16O00J82K15
1593H94R2o61o11l37k15j20M69P99L10L92j24m94n39m40o04K03N70P60Q3M49J49
1614A025o89n65k33l37k97N51N52L92J39M88m19n05n65j69l14J91N69N51N54J01
1634A020n73l22m39m26l98N64L40M31L82M56Q0r01l27l44l36m9Q11K14L43L61
$$ plain form
1654 887 657 428 -82 -419 -837 -868 -409 -74 537 802 559 218 240 -517 -893 -824 -460 -68 181 888 657
1675 657 348 62 -331 -750 -934 -684 -177 365 708 890 494 311 -136 -633 -705 -614 -411 292 672 707 368
1696 368 195 -190 -884 -866 -465 -401 -90 679 966 627 425 155 -286 -860 -785 -333 173 366 542 675 464
1717 464 73 -634 -679 -590 -598 -147 557 805 788 530 318 -313 -787 -804 -498 -403 138 576 769 570 323 -276
1739 -276 -693 -748 -668 -435 242 671 888 723 652 59 -620 -935 -824 -569 -116 295 657 612 479 -132 -272
1760 -272 -713 -673 -545 1 359 685 616 782 183 -604 -790 -874 -752 -142 523 526 653 562 -151 -393 -645 -858
1782 -858 -580 -79 283 516 784 693 157 -158 -562 -913 -706 -386 109 420 820 635 503 50 -467 -659
1802 -659 -883 -555 124 487 827 561 322 33 -287 -797 -671 -604 7 412 491 748 372 201 -373 -1019 -692
$$ packed form
1654H87k30k29n10l37m18l1M59L35O11K65k43l41K2p57l76O9L64L92K49P07k31
1675F57l09k86l93m19j84K50N07N42L43J82l96j83m47m97p2R1K03P03L80L5l39
1696C68j73l85o94J8M01O4L11P69K87l39k02k70m41n74P5M52N06J93J76J33k11
1717D64l91p07m5Q9qM51P04K48j7k58k12o31m74j7L06R5N41M38J93j99k47n99
1739b76m17n5Q0K33O77M29K17j65p1n93o79l15J11K55M53M11L62m5j33o11j40
1760b72m41M0J28N46L58L26o9J66n99p87j86q4J22O10O65LJ27r1p13k42k52k13
1782h58K78N01L62K33K68r1n36l15m04l51K07L20M95L11M00j85j32m53n17j92
1802f59k24L28O79L63L40k66k39k89l20n10J26O7O11M05P9K57l76j71n74o46L27
$$ plain form
1823 -692 -777 -76 284 672 784 403 55 -277 -798 -827 -401 -379 354 507 745 768 552 73 -605 -617 -757 -357
1845 -357 147 497 788 710 418 -185 -433 -814 -627 -364 109 337 588 754 378 47 -331 -640 -700 -500 120
1866 120 618 649 505 437 273 -242 -947 -783 -506 -55 312 628 860 376 111 -161 -545 -546 -448 -188 269 671
1888 671 560 687 16 -419 -754 -651 -628 -194 317 610 805 647 431 -251 -514 -678 -462 -216 -245 609 819
1909 819 584 421 -28 -488 -747 -679 -173 157 458 842 392 523 6 -412 -641 -702 -440 218 317 590 356
1930 356 258 248 -231 -610 -769 -410 39 352 740 801 397 162 -353 -461 -584 -409 -21 45 662 424 424 145
1952 145 -169 -497 -636 -516 -72 74 511 708 657 235 -193 -338 -571 -893 -360 -87 521 561 545 342 128
1973 128 -373 -565 -418 -342 -45 319 625 608 308 -105 -236 -687 -516 -629 -34 66 307 538 474 243 -459
$$ packed form
1823f92q5P01L60L88J12l81l48l32n21k9M26K2P33J53K38K3k16m79o78j2j40M00
1845c57N04L50K91p8k92o03k48l81J87K63M73K28K51J66l76l31l78l09o0K00O20
1866A20M98L1j44o8j64n15p05J64K77M51L67L16K32m84k65k72l84jR8K60M57M02
1888F71j11J27o71m35l35J03K3M34N11K93J95j58k16o82k63j64K16K46k9Q54K10
1909H19k35j63m49m60k59O8N06L30L01L84m50J31n17m18k29o1K62O58R9K73k34
1930C56r8j0m79l79j59L59M49L13L88O1m04k35n15j08j23J75L88O6O17k38%k79
1952A45l14l28j39J20M44J46M37J97n1m22m28j45k33l22N33K73O08M0j6k03k14
1973A28n01j92J47P6K97L64L06j7l00m13j31m51J71j13N95J00K41K31o4k31p02
$$ plain form
1994 -459 -380 -325 -487 -249 274 532 732 256 112 -407 -369 -533 -556 -220 94 584 603 640 216 -93 -581 -654
2016 -654 -479 -219 391 433 440 490 338 -84 -466 -292 -722 -478 127 474 566 431 277 -9 -233 -419 -463 -563
2038 -563 -158 198 405 664 641 237 -419 -491 -548 -388 -6 205 517 782 520 376 -24 -314 -538 -525 -146
2059 -146 131 532 537 713 65 46 -462 -416 -487 -130 1 300 542 630 258 -251 -368 -528 -618 -406 -34 198
2081 198 609 491 219 -190 -383 -395 -590 -440 -250 415 514 861 263 35 -266 -511 -500 -549 32 213 374
2102 374 747 322 52 -370 -434 -754 -356 -161 280 448 677 779 76 -126 -406 -288 -607 -44 125 304
2122 304 825 589 436 46 -413 -612 -607 -107 -95 489 630 528 309 293 -112 -502 -577 -241 49 142 635 684
2144 684 192 -46 -457 -592 -628 -499 -58 509 688 589 536 147 -125 -617 -703 -437 -232 97 459 709 533
$$ packed form
1994d59P9N5j62K38N23K58K00m76j44n19L8j64k3L36L14M90J9L7m24l09m88p3
2016f54J75K60O10M2PN0j52m22l82J74m30K44O05L47R2j35j54k86k24j86m4j00
2038e63M05L56K07K59k3m04o56p2n7J60L82K11L12K65k62j44m00k90k24J3L79
2059a46K77M01NJ76o48j9n08M6p1L57J31K99K42Q8l72n09j17j60r0K12L72K32
2081A98M11j18k72m09j93j2j95J50J90O65R9L47n98k28l01k45J1m9N81J81J61
2102C74L73m25k70m22o4l20L98J95M41J68K29J02p03k02k80J18l19N63J69J79
2122C04N21k36j53l90m59j99NN00J2N84J41j02k19j6m05l90p5L36K90R3M93M9
2144F84m92k38m11j35l6J29M41N67J79r9n3l89k72m92q6K66K05L29L62K50j76
$$ plain form
2165 533 157 -47 -560 -746 -279 -198 353 299 657 666 221 -160 -352 -666 -447 -152 9 223 410 327 437 -7
2187 -7 -549 -569 -568 -397 -241 234 576 373 162 99 -309 -409 -540 -281 -283 231 639 368 423 137 -219 -568 -592
2210 -592 -441 -252 226 600 566 498 104 -136 -474 -360 -388 -143 247 396 375 516 299 -186 -229 -461 -337 -328
2232 -328 -52 451 512 465 459 138 -422 -593 -388 -321 -126 558 583 493 318 34 -247 -636 -336 -408 -44 261 342
2255 342 508 518 221 -572 -250 -537 -452 -223 127 317 449 431 315 -128 -604 -565 -442 -210 153 387 421 520
2277 520 224 -346 -441 -647 -538 -102 35 278 497 435 256 -110 -156 -494 -447 -41 -51 386 369 583 286 78
2299 78 -9 -351 -587 -393 -254 399 417 573 316 182 -151 -304 -620 -489 -103 173 331 608 581 264 -111
2320 -111 -271 -419 -521 -108 -41 446 702 367 271 -76 -355 -685 -517 -168 -86 356 360 469 239 130 -617 -372
$$ packed form
2165E33l76k04n13j86M67Q1N51n4L58Rm45l81j92l14K19K95J61K14J87q3J10m44
2187gn42k0JJ71J56M75L42k03k11o3m08j00j31K59kN14M08k71N5k86l56l49k4
2210e92J51J89M78L74l4o8l94k40l38J14k8K45L90J49k1J41k17m85m3k32J24R
2232c28K76N03O1m7ol21n60j71K05O7J95O84K5r0j75k84k81l89L00p2L64L05Q1
2255C42J66J0k97p93L22k87Q5K29L50J90J32j8j16m43m76L9J23K32L63K34L4R9
2277E20k96n70r5k06J09M36J37K43K19o2j79l66m6l38M7M06j0M37j7K14k97k08
2299G8q7l42k36J94J39O53J8J56k57j34l33j53l16J31L86K76J58K77k7l17l75
2320a11j60j48j02M13O7M87K56l35r6l47k79l30J68L49Q2M42MJ09k30j09p47K45
$$ plain form
2342 -372 -434 -594 -56 237 366 676 442 108 -90 -379 -577 -275 -331 226 648 418 476 -17 14 -468 -620
2363 -620 -637 53 272 248 634 403 201 57 -424 -515 -384 -111 114 174 572 563 221 -5 -161 -459 -397 -380 187
2386 187 344 344 492 535 110 -486 -364 -499 -393 -114 201 403 437 660 10 -287 -611 -740 -522 -192 356
2407 356 580 521 421 286 -133 -266 -463 -442 -40 231 162 542 469 254 -125 -238 -743 -506 -179 -55 465
2428 465 423 478 265 57 -160 -529 -311 -363 31 153 441 685 140 -31 -111 -653 -564 -306 -6 56 506 612
2450 612 548 -25 -135 -224 -467 -111 -75 193 378 454 556 -25 -29 -94 -501 -167 -399 -114 583 594 472 234 108
2473 108 -504 -623 -457 -69 116 211 473 239 363 -173 -171 -659 -464 -318 4 362 328 810 214 317 -98
2494 -98 -540 -784 -181 -107 163 400 671 406 263 30 -653 -501 -492 -88 14 618 346 405 356 24 -472 -426
$$ packed form
2342c72o2j60N38K93J29L10k34l34j98k89j98L02n6N57M22k30N8m93L1m82j52
2363f20j7O90K19k4L86k31k02j44m81r1J31K73K25O0L98rl42k26j56k98O2J7N67
2386A87J57%J48M3m25n96J22j35J06K79L15K02L4K23o50k97l24j29K18L30N48
2407C56K24n9j00j35m19j33j97K1M02K71o9L80p3k15l79j13n05K37L27J24N20
2428D65m2N5k13k08k17l69K18n2L94J22K88K44n45j71q0n42Q9K58L00O2M50J06
2450F12o4n73j10q9k43L56L6K68J85P6J02n81mo5m07L34k32K85O97J1j22k38j26
2473A08o12j19J66L88J85R5K62k34J24n36Km88J95J46L22L58l4M82n96J03m15
2494i8m42k44O03P4K70K37K71k65j43k33o83J52RM04J02O04k72N9m9l32m96M6
$$ plain form
2516 -426 -182 -321 280 405 652 513 390 39 -533 -669 -265 -173 -3 367 446 334 93 205 -363 -603 -152
2537 -152 -206 -133 429 315 414 294 28 -301 -328 -429 -348 -173 262 376 252 134 278 -21 -454 -549 -307 -28
2559 -28 153 348 556 446 59 -250 -420 -536 -356 -427 122 351 245 367 285 14 -386 -384 -258 -255 181 371
2581 371 430 442 229 -30 -308 -383 -332 -262 75 262 387 275 309 126 -237 -422 -180 -320 6 260 570 500
2603 500 238 -28 -317 -291 -412 -312 20 62 363 508 450 36 -129 -396 -294 -676 217 113 280 486 481 159
2625 159 -42 -15 -279 -324 -304 146 343 462 394 344 -192 -229 -247 -379 -281 66 50 475 552 215 4 -181 -237 -425
2649 -425 -91 209 25 388 50 300 -102 -242 -51 -364 -205 38 84 200 394 260 -143 -124 -177 -432 -586
2670 -586 -93 103 250 496 356 -191 -130 -248 -411 -464 11 18 56 489 330 34 98 -231 -353 -327 -253 38 333
$$ packed form
2516d26K44j39O01J25K47j39j23l51n72j36M04R2J70L70P9j12k41J12n68k40M51
2537a52n4P3N62j14R9j20k66l29k7j01Q1J75M35J14j24j18J44k99m33r5K42K79
2559b8J81J95K08j10l87l09j70j16J80p1N49K29j06J22q2k71m00KJ26LM36J90
2581C71N9J2k13k59k78p5N1P0L37J87J25j12L4j83l63j85K42j40L26K54L10p0
2603E00k62k66k89K6j21J00L32M2L01J45n8m14j65k67J02l82Q93j04J67K06nl22
2625A59k01K7k64m5K0M50J97J19o8n0n36l7j8j32R8L47j6M25P7l37k11j85n6j88
2649d25L34L00j84L63l38K50m02j40J91l13J59K43M6J16J94j34m03J9n3k55j54
2670e86M93J96J47K46j40n47O1j18j63n3M75PL8M33j59k96O4l29j22K6P4K91K95
$$ plain form
2693 333 212 230 43 -106 -115 -430 -375 -139 112 139 404 456 260 95 10 -454 -328 21 -44 159 230 317 170
2716 170 52 -65 -211 -320 -143 -149 92 314 346 5 269 92 -270 -408 -174 -87 -47 288 463 239 195 15
2738 15 -235 -189 -278 -384 32 155 389 380 212 6 -224 -231 -292 -188 276 30 179 255 204 164 -68 -205 -353 -306
2762 -306 -148 215 488 101 171 204 -231 -316 -292 -79 -148 120 387 547 243 114 -157 -257 -464 -56 -144 -92
2784 -92 169 396 433 75 -44 -391 -136 -252 -48 38 165 482 213 34 -157 -197 -443 -194 -352 -48 136
2805 136 179 5 268 87 -245 -414 -382 -212 82 202 167 253 141 46 -318 -338 -310 -448 153 -13 246 277 58
2828 58 -60 -95 -188 -109 -219 118 32 291 147 178 212 -122 -381 -266 -60 -122 138 107 193 61 61 21 -294 -275 -238
2853 -238 101 -108 367 135 257 257 102 -12 -224 -181 -160 -121 383 467 322 136 139 -95 -293 -266 -217 79 277
$$ packed form
2693C33j21J8j87j49rl15N5K36K51K7K65N2j96j65q5m64J26L49o5K03P1Q7j47
2716A70j18j17j46j09J77oK41K22L2l41K64j77l62j38K34Q7M0L35J75k24m4j80
2738A5k50M6q9j06M16J23K34rj68k06k30po1J04M64k46J49P6n1m0k32j37j48M7
2762c06J58L63K73l87P0L3m35q5K4K13o9K68K67J60l04j29k71j00k07M08q8N2
2784i2K61K27L7l58j19l47K55j16K04Q6J27L17k69j79j91m0k46K49j58L04J84
2805A36M3j74K63j81l32j69L2J70K94J20l5Q6j12r5l64k0K8j38O01j66K59L1k19
2828E8j18l5r3P9j10L37q6K59j44L1L4l34k59J15K06o2K60l1Q6j32%m0l15J9L7
2853b38L39k09M75k32J22%j55j14k12M3K1L9N04Q4j45j86Lk34j98K7M9K96J98
$$ plain form
2876 277 106 104 167 320 -102 -304 -368 -226 -134 52 222 116 203 82 -211 -288 -224 -223 -315 109 363 238 84 69
2900 69 -57 -143 -52 -170 -263 98 71 112 55 168 -90 -54 -254 -252 -287 -263 300 411 190 90 -198 -227 -250 -454 -250
2925 -250 -97 239 69 168 -151 152 -52 -152 -321 -326 -143 255 313 217 332 55 83 -98 -74 -153 162 -50 97
2948 97 231 116 36 -454 43 -237 -356 -285 46 3 -61 0 299 -15 -110 -199 -362 -101 93 158 256 323 277 -210
2972 -210 -119 -131 -206 -140 35 332 198 359 298 -25 26 -192 -286 -335 -64 130 33 320 192 -10 -113 -22 7 1
2996 1 -68 311 208 296 200 -29 -188 -218 -117 -73 -13 92 -136 225 117 49 104 -160 -216 -110 -43 194 88 254
3020 254 168 -66 51 29 -173 -160 -120 -40 100 8 23 -36 -63 59 -29 -301 -71 -5 -8 191 310 3 -168 -195 -103
3045 -103 -66 34 -47 90 -117 228 144 264 -218 -77 -31 -150 47 79 42 197 -9 -292 -24 -162 -497 -60
$$ packed form
2876B77j71kO3J53m22k02o4J42R2J86J70j06Q7j21k93p7O4Jr2M24K54j25j54j5
2900F9j26q6R1j18r3L61k7M1n7J13k58L6k00Kl5K4N63J11k21j00k88k9k3k04K04
2925b50J53L36j70R9l19L03k04j00j69nJ83L98N8r6J15k77K8j81K4p9L15k12J47
2948I7J34j15q0m90M97k80j19P1L31m3o4O1K99l14r5q9j63K61J94O5R8O7m6m87
2972b10R1j2p5O6J75K97j34J61o1l23N1k18r4m9K71J94r7K87j28k02j03R1K9o
2996Ao9L79j03Q8r6k29j59l0J01M4O0J05k28L61j08o8N5k64n6J06O7K37j06J66
3020B54q6k34J17k2k02J3M0Q0J40r2J5n9k7J22q8k72K30O6lJ99J19l07j71k7R2
3045a03L7J00q1J37k07L45q4J20m82J41M6j19J97L2l7J55k06k83K68j38l35M37
$$ plain form
3067 -60 141 132 266 125 183 116 80 -236 -78 -176 59 40 -16 329 341 -123 -64 134 108 -194 -281 -139 -116 71 185
3092 185 51 65 10 -201 -113 -32 -140 -36 349 226 -53 229 -170 -4 -266 0 -131 -87 60 341 247 -129
3114 -129 102 -314 -178 -117 -21 -184 171 53 72 127 132 -177 -192 -224 -283 24 119 240 88 -12 7 -156 -269 -180
3138 -180 -39 14 232 242 -91 130 42 -159 -30 -80 -46 -48 -73 190 88 263 -171 -110 -353 -114 -195 -105 226 106
3162 106 101 -6 44 -64 -90 -250 56 -82 49 -18 -75 292 -114 -53 -155 -273 -278 -83 -51 100 12 -56 246 79
3186 79 -158 -129 -95 -132 139 71 200 141 194 114 36 -125 -210 -263 137 -4 163 34 121 85 -66 192 -107 -26 144
3211 144 87 366 85 241 -45 -170 -19 -215 -9 -89 216 233 -160 101 183 -48 -132 -83 -127 -150 38 172 113
3234 113 61 -31 -198 -239 -115 -133 -205 89 0 -16 47 31 -19 -46 -28 -72 -51 84 77 133 77 111 110 149 -142 41 -153
$$ packed form
3067f0K01rJ34j41N8o7l6l16J58r8K35j9n6L45J2m64N9J98k6l02q7J42K3J87J14
3092A85j34J4n5k11Q8Q1j08J04L85j23k79K82l99J66k62K66j31M4J47K81r4l76
3114a29K31m16J36O1R6j63L55j18J9N5Nl09j5l2n9L07R5J21j52j00J9j63j13Q9
3138a80J41N3K18J0l33K21q8k01J29n0L4kk5K63j02J75m34O1k43K39q1R0L31j20
3162A06nj07N0j08k6j60L06j38J31o7n7L67m06O1j02j18nJ95L2J51q8o8L02j67
3186G9k37K9L4l7K71o8J29n9N3q0p8j61q5n3M00j41J67j29Q7l6j51K58k99Q1J70
3211A44n7K79k81J56k86j25J51j96K06q0L05J7l93K61Q2k31q4M9m4k3J88J34n9
3234A13n2r2j67m1J24j8p2K94q9j6O3j6n0k7J8m4K1J35pN6n6L4jL9k91J83j94
$$ plain form
3261 -153 -184 88 197 183 103 14 -187 -45 -33 -125 -50 217 -16 288 56 124 5 64 -214 -44 -137 -83 6 70
3285 70 67 -123 -81 -79 -147 -316 20 241 266 9 164 80 -97 100 26 -92 55 13 45 287 197 83 165 105 181
3310 181 -91 -190 -6 161 -2 136 160 -223 -228 -224 -45 -157 -33 57 -63 125 -102 -27 -258 -105 -257 42 -50
3333 -50 283 57 48 246 139 161 -140 -159 -37 -28 172 20 190 -21 -45 76 -142 -25 -85 41 55 67 236 -77
3357 -77 86 98 -101 83 -30 -142 -17 31 4 203 -5 -142 -146 -141 -282 2 -67 143 -79 28 -115 -24 -98 -194
3381 -194 -72 106 9 109 -194 177 83 -52 -49 -98 18 82 -62 216 12 86 215 -54 -61 -25 -68 -74 125 207 -19
3406 -19 59 115 -15 -60 -56 -51 -213 93 -23 181 151 79 46 -59 -102 50 68 -11 164 92 -38 189 84 -30 87
3431 87 -247 10 34 166 12 175 8 99 -129 -63 -120 162 -36 73 114 -34 192 23 -27 -76 -113 -107 151 78
$$ packed form
3261a53l1K72J09j4q0q9k01J42J2r2P5K67k33L04k32O8j19N9k78J70r3N4Q9O4
3285G0lj90M2Ko8j69L36K21K5k57J55q4j77J97p4j18J47m2L2K42r0j14Q2o0P6
3310A81k72r9J84J67j63J38K4l83nMJ79j12J24R0j20J88k27P5k31J53j52K99r2
3333e0L33k26rJ98j07K2l01j9J22RK00j52J70k11k4J21k18J17o0J26J4J2J69l13
3357g7J63J2j99J84j13j12J25M8k7J99k08j37mNj41K84o9K10k22J07j43R1p4r6
3381a94J22J78r7J00l03L71r4j35Lm9J16O4j44K78k04P4J29k69pL6m3oJ99Q2k26
3406a9P8N6j30m5MNj62L06j16K04l0p2l3j05m3J52J8p9J75p2j30K27j05j14J17
3431H7l34K57K4J32j54J63j67R1k28O6n7K82j98J09M1j48K26j69n0m9l7OK58p3
$$ plain form
3455 78 -17 119 137 11 32 -27 -186 -209 232 67 90 201 -3 37 90 -118 -150 -92 -43 -87 152 264 300 -83 185
3480 185 96 -172 -56 164 -21 29 20 267 -68 46 -49 -107 -65 44 46 -14 -127 -14 -34 36 46 113 -70 -85 -10
3505 -10 42 150 -52 81 128 29 -33 57 -53 -125 121 -90 -13 -89 -135 104 123 -213 66 191 10 55 242 -14
3529 -14 64 120 -84 -16 -144 97 62 45 -101 146 53 -137 53 -75 32 -80 163 -52 263 254 -182 2 -117
3552 -117 -231 -231 80 160 -45 154 -51 56 -103 11 -143 -89 239 -50 147 88 36 214 -76 112 -67 -159
3574 -159 -49 -19 64 140 -31 173 66 226 106 -140 -35 -174 46 -13 189 69 235 -349 -101 4 -119
3595 -119 -31 -58 57 186 236 20 -57 -172 -176 -54 55 -83 258 14 69 160 102 -272 83 -137 -98 18 -29 267
3619 267 175 -13 -125 -92 -163 -33 -185 -193 -75 -123 -80 251 38 -35 -97 -272 -45 -50 26 184 101 202 57 -20 -13
$$ packed form
3455G8r5J36J8j26K1n9j59k3M41j65K3J11k04M0N3k08l2N8M9m4K39J12L6l83K68
3480A85q9k68J16K20j85N0rK47l35J14r5n8M2J09Ko0j13J13k0P0J0O7j83j5P5
3505a0N2J08k02J33M7r9o2R0j10p2K46k11P7p6m6K39J9l36K79J25j81M5J87k56
3529a4P8N6k04O8j28K41l5j7j46K47r3j90J90j28J07j12K43k15L15rm36J84j19
3552a17j14%L11Q0k05J99k05J07j59J14j54N4L28k89J97n9n2J78k90J88j79r2
3574a59J10L0Q3P6j71K04j07J60j20k46J05j39K20n9K02j20J66n84K48J05j23
3595a19Q8k7J15J29N0k16p7j15mJ22J09j38L41k44N5R1n8l74L55k20L9J16m7K96
3619B67r2j88j12L3p1J30j52qJ18m8M3L31k13p3o2j75K27nP6J58q3J01j45p7P
$$ plain form
3644 -13 -137 -94 -72 -6 -19 238 149 -84 -90 -60 32 -48 -205 -71 -18 239 164 15 33 -191 -203 32 -108 123 19
3669 19 97 240 144 33 -43 39 -97 -205 76 185 -70 -157 280 -258 -215 71 -260 -11 -242 14 -14 -37 81
3692 81 121 -80 -152 0 -153 -62 77 -7 -9 99 245 -41 -64 17 -199 -307 60 81 192 257 -85 48 53 -148
3716 -148 -165 22 -124 107 130 34 257 -151 -107 -249 -129 64 102 0 192 57 325 116 60 64 -97 -164 -157 63
3740 63 -109 132 -72 -136 -96 -97 26 -82 -154 -77 56 -34 -4 1 30 -153 -97 -225 41 -48 -77 -28 170 133 125 79 10
3767 10 -91 10 332 109 120 101 66 -180 -10 -65 -129 -116 101 -20 97 154 -41 102 -314 -129 -158 -131 -70 45
3791 45 155 -25 101 245 -89 -237 -156 -257 88 14 104 147 133 216 -117 -93 -155 -261 -107 9 3 340 83 98
3815 98 -102 -56 -64 -89 -127 105 109 -45 20 -86 -16 -221 -51 56 -237 191 140 135 280 135 98 71 177 -138 -58
$$ packed form
3644a3j24M3K2O6j3K57q9k33oL0R2q0j57J34N3K57p5j49J8k24j2K35j40K31j04
3669A9P8J43r6j11p6Q2j36j08K81J09k55q7M37n38M3K86l31K49k31K56k8k3J18
3692H1M0k01p2J52j53R1J39q4kJ08J46k86k3Q1k16j08L67K1J11O5l42J33Nk01
3716a48j7J87j46K31K3r6K23m08M4j42J20J93L8j02J92j35K68k09n6Mj61o7PK20
3740F3j72K41k04o4M0jJ23j08p2P7J33r0L0NK9j83N6j28K66q9k9M9J98l7qm6o9
3767A0j01J01L22k23J1j9l5k46J70n5o4J3K17j21J17N7j95J43m16J85k9K7O1J15
3791D5J10j80J26J44l34j48Q1j01L45p4R0M3j4Q3l33K4o2j06J54J16oL37k57J5
3815I8k00M6qk5l8K32Mj54O5j06P0k05J70J07k93M28n1nJ45j45l7k7J06l15Q0
$$ plain form
3840 -58 -36 115 93 -31 53 19 -108 -55 -74 -8 -248 188 -150 247 48 232 70 36 68 -35 -21 -163 -72 3
3864 3 303 -90 -19 -27 -147 -110 -42 -122 107 86 157 139 57 39 107 -67 -247 -22 -163 34 178 184 138 -131 -34 -362
3890 -362 -33 234 12 175 12 -7 13 -134 -268 63 -206 -29 54 78 121 184 -139 -65 137 -224 -28 -166
3912 -166 -42 202 -12 116 -5 -112 -114 -189 -136 181 2 141 -145 158 52 -125 3 -179 175 -96 28
3933 28 103 -2 151 222 126 -127 -147 -46 -93 86 218 -31 159 -4 -51 118 28 54 -120 -80 -17 126 21 246
3957 246 236 80 -266 -15 -155 -45 -107 58 159 204 232 -105 -82 -151 -37 -412 -159 -88 117 291 71 -110
3979 -110 -160 -334 -92 -25 -226 106 302 -83 63 168 -219 -28 -215 68 -74 148 356 -42 -113 134 22
4000 22 -97 -148 -23 67 231 -8 -119 174 77 112 -179 -58 41 31 76 293 203 106 -74 -17 -146 -247 -95 -17
$$ packed form
3840e8K2J51k2j24Q4l4j27N3j9O6k40M36l38L97j99J84j62l4L2j03J4j42R1P5
3864CL00l93P1qj20L7O8q0K29k1P1j8q2j8O8j74j80K25j41J97J44Om6k69R7l28
3890c62L29K67k22J63j63j9K0j47j34L31k69J77Q3K4M3O3l23P4K02l61J96j38
3912a66J24K44k14J28j21j07kp5N3L17j79J39k86L03j06j77J28j82L54k71J24
3933B8P5j05J53P1r6k53k0J01m7J79J32k49J90j63m7J69r0K6j74M0O3J43j05K25
3957B46j0j56l46K51j40J10o2J65J01M5K8l37K3o9J14l75K53P1K05J74k20j81
3979a10n0j74K42O7k01L32J96l85J46J05l87J91j87K83j42K22K08l98p1K47j12
4000B2j19n1J25R0J64k39j11K93r7L5k91J21R9j0M5K17r0r7j80N7j29j01J52P8
$$ plain form
4024 -17 -26 30 4 69 65 33 -99 -75 -192 -253 217 -10 -1 172 108 123 -187 -164 43 -175 -56 15 144 24 -102 -50
4050 -50 -266 -198 -152 -52 -56 101 201 -63 88 -43 133 5 -53 -27 -7 -62 86 57 186 -60 -108 -261 -5 -214
4074 -214 -238 -43 -221 126 83 42 -116 -126 -222 -61 -98 105 82 2 -139 57 -18 -97 97 31 -219 260 -6 -79
4098 -79 322 183 -11 -65 -169 8 -19 -22 157 -96 445 168 -42 136 20 -199 106 159 66 -60 -106 319 -42
4121 -42 232 -139 -36 -91 60 22 207 199 -11 -17 135 -33 17 -86 -193 -25 110 233 59 32 -20 58 -107 -409
4145 -409 118 73 -16 105 320 110 -156 9 -102 -104 16 87 -192 110 12 65 -67 165 -207 -111 -120 -174 72 140
4169 140 272 5 -22 38 -22 -190 -14 -1 -227 -207 -76 111 -27 -104 -130 -170 -185 10 4 84 -145 -59 27 150 42
4194 42 -7 146 -7 -104 61 39 115 181 137 -70 -241 -24 34 -112 -86 -44 206 243 130 132 13 121 101 -129 221
$$ packed form
4024a7rN6k6O5ml2j32K4j17o1M70k27RJ73o4J5l10K3K07k18J19P1J29j20j26N2
4050e0k16O8M6J00mJ57J00k64J51j31J76j28n8K6K0n5J48k9J29k46m8j53K56k09
4074b14k4J95j78L47m3m1j58j0r6J61l7K03k3q0j41J96p5p9J94o6k50M79k66p3
4098g9M01j39j94n4j04J77k7lJ79k53N41k77k10J78j16k19L05N3r3j26m6M25l61
4121d2K74l71J03n5J51l8J85qk10oJ52j68N0j03j07J68J35J23j74k7n2P8j65l02
4145d09N27m5q9J21K15k10k66J65j11kJ20P1k79L02r8N3j32K32l72R6rn4K46O8
4169A40J32k67k7O0o0j68J76J3k26K0J31J87j38p7k6m0j5J95oQ0k29Q6Q6J23j08
4194D2m9J53j53r7J65k2P6O6m4k07j71K17N8j46K6M2K50L7j13Kj19J08k0k30L50
$$ plain form
4219 221 -135 52 9 115 -74 75 19 -89 -147 -108 45 10 192 -7 0 -129 -224 55 -163 -28 0 145 48
4242 48 39 61 -66 -68 -69 74 -51 91 223 75 109 164 -126 96 -179 -118 -17 152 -19 73 180 -51 -169 -96
4266 -96 -146 119 -24 6 43 -124 -29 233 -80 14 -227 -16 -19 -66 9 64 8 68 -94 -216 41 -271 -130 112
4290 112 92 44 237 -61 -81 166 9 -56 -136 39 -148 -35 21 -58 61 -108 37 -71 -240 -55 -120 -89 54
4313 54 -95 8 -190 82 -66 -183 -48 55 54 87 68 260 -1 -51 -77 -313 164 149 -64 90 -41 -62 -12
4336 -12 -109 -32 -76 -80 -8 228 281 123 -23 78 -27 35 -92 79 26 -1 -18 119 89 166 136 -128 -215 -176 22 -19
4362 -19 -122 370 165 354 -36 -201 -178 -114 38 -33 27 48 261 49 90 91 -72 -47 152 38 44 272 -74 -5
4386 -5 56 -69 -140 -45 -212 196 -169 277 134 72 165 1 -79 34 -137 -121 -40 -40 50 182 70 21 -30 -126 -221 -141
$$ packed form
4219B21l56J87m3J06j89J49n6j08n8L9J53l5J82j99Pj29r5K79k18J35K8J45r7
4242D8rK2j27kjJ43j25J42J32j48L4N5k90K22k75O1J01J69j71R2J07k31j18P3
4266i6n0K65j43L0L7j67R5K62l13R4k41K11lm7P5N5n6O0j62j22K57l12J41K42
4290A12k0m8J93k98k0K47j57o5q0J75j87J13N6p9J19j69J45j08j69J85o5L1J43
4313E4j49J03j98K72j48j17J35J03jL3j9J92k61n0k6k36M77j5k13J54j31k1N0
4336a2r7P7m4mP2K36N3j58j46J01j05O2j27J71n3k7j7J37l0P7l0k64q7L9J98m1
4362a9j03M92k05J89l90j65K3O4J52p1O0K1K13k12M1Jj63K5J99j14OK28l46O9
4386eO1j25p1R5j67M08l65M46j43o2R3j64q0J13j71J6Q1%R0J32j12m9n1r6r5Q0
$$ plain form
4412 -141 -29 66 259 103 114 12 88 -127 35 -43 6 -154 207 73 213 150 -21 -112 119 3 64 -152 -66
4435 -66 176 12 -25 -87 84 -270 -53 50 -40 48 32 63 90 -10 1 -148 97 80 -2 32 23 181 164 -99 -55
4460 -55 21 -151 -24 1 77 -20 290 44 -27 -7 -7 29 -69 -50 66 -15 -135 32 32 42 -4 -218 73 -20 30 40 78
4487 78 175 43 131 -48 -111 -137 -169 -35 156 17 12 -31 -98 -149 -97 59 -176 -29 43 108 -111 290 -42 110 -198
4512 -198 45 -172 -64 -34 68 26 -38 -51 63 26 76 -28 50 151 -84 243 29 -14 19 -99 83 -59 9
4535 9 -93 39 77 36 90 44 -130 -115 78 -188 -35 -78 -32 162 107 36 -134 29 -126 -205 -34 -143 66 -82
4559 -82 267 -75 -36 213 0 -151 67 -33 14 136 48 -25 -16 -65 -257 -160 -185 236 311 129 38 104 68 -270 -178
4584 -178 -16 -99 -80 110 180 -21 42 -68 -249 122 176 -91 -7 -18 133 140 -58 -90 -130 -31 -83 221 242 -107 -23
$$ packed form
4412a41J12R5J93j56J1j02P6k15J62p8M9j60L61j34J40o3j71r1K31j16O1k16Q6
4435f6K42j64l7o2J71l54K17J03r0Q8j6L1K7j00J1j49K45j7q2L4rJ58j7k63M4
4460e5P6j72J27K5P6r7L10k46p1K0%L6r8J9J16q1j20J67%J0m6k14K91r3N0J0L8
4487G8R7j32Q8j79o3k6l2J34J91j39nm3o7n1N2J56k35J47P2O5k19M01l32J52l08
4512a98K43k17J08L0J02m2o4j3J14l7N0j04P8J01k35L27k14m3L3j18J82j42O8
4535Ij02J32L8m1N4m6j74J5J93k66J53m3M6J94n5p1j70J63j55p9J71j09K09j48
4559h2L49l42L9K49k13j51K18j00M7J22q8p3Rm9j92R7k5M21P5j82r1O6l6l38R2
4584a78J62q3J9J90P0k01O3j10j81L71N4k67Q4j1J51Pj98l2m0R9n2L04K1l49Q4
$$ plain form
4609 -23 322 -44 162 10 -50 -138 -54 38 -13 -6 44 227 242 198 34 -237 23 -45 -170 251 55 350 227 18
4633 18 -84 -296 -113 -70 22 95 24 -102 -36 -50 -214 -234 -114 -6 -60 39 -151 48 19 120 -122 -128 -318 -70
4657 -70 6 85 -34 63 267 34 223 -27 -189 -241 -153 -86 190 103 -53 55 -151 -95 72 -59 -152 164 -56
4680 -56 111 90 167 -78 24 -6 -393 -223 91 41 -103 47 61 -21 77 -56 -1 -13 -72 118 -6 -84 111 -52
4704 -52 -71 33 -11 -123 -160 -103 191 111 213 17 93 29 -91 -117 -222 -4 175 196 -140 -26 -132 -271 -80
4727 -80 -53 -105 -14 40 220 -77 -39 -111 -96 -229 -73 100 140 -47 72 -63 -14 88 -11 -91 -30 -152 29 58 -192
4752 -192 108 324 -191 -63 -53 -203 64 32 -117 196 166 160 70 56 52 149 -199 88 76 69 -78 -149 -149 -27 122
4777 122 -94 -256 -190 -43 113 3 115 121 35 -77 -97 -141 -60 234 -49 208 148 95 106 1 39 15 -51 0 113
$$ packed form
4609b3L45l66K06j52o0q8Q4R2n1PN0J83J5m4j64k71K60o8j25M21j96K95j23k09
4633A8j02k12J83M3R2P3p1j26O6j4j64k0J20J08n4R9j90J99k9J01k42oj90K48
4657g0P6P9j19R7K04k33J89k50j62n2Q8O7K76q7j56J08k06N6J67j31r3L16k20
4680e6J67k1P7k45J02l0l87J70L14n0j44J50J4q2R8j33N5j2n9J90j24p8J95j63
4704e2j9J04m4j12l7N7K94q0J02j96P6o4j20k6j05K18J79K1l36J14j06j39J91
4727h0K7n2R1N4J80k97L8p2J5j33J56J73M0j87J19j35M9J02r9q0O1j22J81K9k50
4752a92L00K16n15J28J0j50K67l2j49L13l0or0j4mR7l48K87j2pj47p1%J22J49
4777A22k16j62O6J47J56j10J12Oq6j12k0m4Q1K94k83K57o0n3J1j05L8k4o6N1J13
$$ plain form
4802 113 45 340 -154 -21 74 -281 30 -212 -49 4 257 215 119 36 45 22 -80 84 -138 105 65 45 53 -153
4826 -153 6 60 -20 -161 -33 150 82 -35 -69 57 69 -151 -219 -67 -60 -205 252 168 139 -76 247 49 -181
4849 -181 -39 -60 -77 82 -2 -1 74 1 -104 69 22 -138 96 -79 38 37 -108 -58 -61 -73 23 -155 -195 -59 239
4874 239 36 -57 191 -40 -49 -26 -101 -69 20 61 279 270 29 99 -68 -268 137 -63 97 105 100 229 78 -89 -157
4899 -157 26 -65 186 -3 30 268 127 -21 -239 -200 2 -302 -20 -122 -82 95 125 -10 77 -41 -123 -21
4921 -21 -146 -10 287 8 69 136 33 40 -13 1 -204 141 -33 85 -110 169 -135 116 -52 37 -14 18 106 -123
4945 -123 64 56 152 202 -226 -24 -323 158 73 -267 9 64 125 -142 123 -68 45 -62 63 -9 59 45 -6 -204
4969 -204 -48 -93 -42 24 -125 6 22 4 -104 -131 -60 -52 84 -56 5 35 134 -81 59 80 136 96 109 -14 -140
$$ packed form
4802A13o8K95m94J33R5l55L11k42J63N3K53m2r6q3Rk3j02J64k22K43m0k0Qk06
4826a53J59N4q0j41J28J83o8j17l4J26J2k20o8J52Pj45M57q4k9k15L23j98k30
4849a81J42k1j7J59q4JP5p3j05J73m7j60K34j75J17jj45N0lj2R6j78m0J36K98
4874B39k03r3K48k31rK3p5L2Q9M1K18rk41P0j67k00M05k00J60QnJ29j51j67o8
4899a57J83r1K51j89L3K38j41j48k18L9K02l04K82j02M0J77L0j35Q7j18q2J02
4921b1j25J36K97k79O1O7j03Pn3J4k05L45j74J18j95K79l04K51j68Q9n1L2Q8k29
4945a23J87qR6N0m28K02k99M81q5l40K76N5O1k67K65j91J13j07J25p2O8j4n1j98
4969b04J56m5N1O6j49J31J6j8j08k7P1QJ36j40O1L0R9k15J40K1N6m0J3j23j26
$$ plain form
4994 -140 100 116 119 12 37 30 -45 8 -235 4 -106 -9 -2 -29 -8 116 -43 160 -58 47 -11 125 -66 -8 -78
5019 -78 153 32 -208 -9 -247 -67 -56 6 -5 -1 93 -74 -16 124 -107 -29 -69 139 132 56 -16 -122 -73 -88 -12 -174
5045 -174 -93 60 161 -47 137 -7 -186 108 -155 76 137 175 20 39 113 -94 31 -94 -10 -48 -107 -49 -89
5068 -89 2 78 99 -23 -210 -51 70 -34 -165 67 125 -10 -184 -164 146 40 -49 -72 -140 126 -136 4 59
5091 59 135 -58 -242 -55 -92 34 -76 13 -86 129 -78 -148 174 -106 98 -67 47 56 -52 -122 66 21 -46 -208
5115 -208 114 -59 -8 4 -47 104 10 -159 -142 131 -27 -34 96 -59 40 -129 -83 -151 -29 3 -129 79 -119 168
5139 168 207 145 138 -20 -81 -107 -17 -126 -38 89 124 17 189 13 63 -159 -143 -55 132 -129 -101 167 159 214 2
5164 2 15 -113 -127 20 123 33 45 48 -7 -52 2 -42 57 150 96 104 81 90 128 -50 124 2 -193 231 59 21 -4 -127
$$ packed form
4994a40K40J6Lj07K5pp5N3k43K39j10R7Pk7K1J24j59K03k18J05n8J36j91N8p0
5019g8K31j21k40J99k38J80J1O2j1MR4j67N8J40k31P8m0K08pp6p2j06M9j5P6j62
5045a74Q1J53J01k08J84j44j79K94k63K31O1L8j55J9P4k07J25j25Q4l8n9N8m0
5068h9R1P6K1j22j87J59J21j04j31K32N8j35j74K0L10j06q9k3o8K66k62J40N5
5091E9P6j93j84J87l7J26j10Q9r9K15k07p0L22k80K04j65J14Rj08p0J88m5o7j62
5115b08L22j73N1J2n1J51r4j69J7K73j58pJ30j55R9j69M6o8J22L2j32K08j98K87
5139A68L9o2pj58o1k6R0j09Q8J27L5j07J72j76N0k22J6Q8J87k61K8K68qN5k12
5164BJ3j28j4J47J03r0J2Ln5m5N4m4R9R3n4Qk3RL8j78J74j22j95M24j72l8k5j23
$$ plain form
5192 -127 -102 188 -6 39 -332 76 127 218 -87 105 -13 78 77 -248 -103 -164 38 -1 -39 -8 95 32 -343 -54
5216 -54 -127 -152 -106 162 129 -73 83 -97 -147 -186 4 237 -149 152 -79 102 -97 80 55 -97 -93 -37 170 7
5240 7 -95 210 -141 42 49 -34 -55 58 -129 131 -6 7 256 -104 -15 -65 22 -94 72 -55 45 -77 -47 71
5264 71 -86 -79 -59 -238 -263 -47 -71 1 57 -239 -94 -79 -97 -171 -77 -48 -150 188 81 -107 -118 75 -101 -157 -137
5289 -137 -105 5 -35 -13 -9 165 -236 142 72 54 -24 40 64 286 17 2 11 -43 -98 -225 143 67 70 65 -100 184 51
5316 51 -94 -9 -57 -28 203 10 154 -104 -9 -54 -64 79 -41 -32 -45 167 86 156 112 -104 -25 27 -73 -91 146
5341 146 -101 -29 -24 109 -59 -62 -47 -119 21 -39 26 -276 47 191 46 -34 31 27 -180 -178 171 25 111 -95 255
5366 255 56 82 146 -88 -121 0 -50 -107 49 68 -9 -189 -15 -44 -33 -69 299 -51 -94 -302 -35 -1 -260 -367
$$ packed form
5192a27K5K90j94M5l71M08N1R1l05J92j18R1jl25J45o1K02l9l8L1J03o3l75K89
5216e4p3k5M6K68l3k02J56j80n0l9J90K33l86L01k31J81j99J77k5j52MN6K07j63
5240Gj02L05l51J83Pq3k1J13j87K60j37J3K49l60Q9n0Q7j16J66j27J00j22L0J18
5264G1j57PK0j79k5K16k4P2N6k96J45J5j8p4R4K9j02L38j07j88j1J93j76n6K0
5289a37L2J10m0K2MJ74m01L78p0j8p8O4K4K22k69j5Rn4n5j27L68p6Lnj65K84j33
5316E1j45Q5m8K9K31j93J44k58R5m5j0J43j20Rj3K12q1P0m4k16P9N2j00j8K37
5341A46k47P2NJ33j68lJ5p2J40o0O5l02L23J44j45q0O5mk07KL49j46Q6k06L50
5366B55j99K6O4k34l3J21n0n7J56J9p7j80J74k9J1l6L68l50m3k08K67L4k59j07
$$ plain form
5390 -367 -148 -185 -118 -147 10 -86 112 68 -134 62 59 -135 41 222 -112 -216 106 118 -212 -183 -324 -88 31
5413 31 204 -16 80 -42 -117 -152 125 -221 -87 -123 -39 -55 77 153 206 37 15 -50 -83 -67 37 88 160 -116 -93
5438 -93 -22 -71 -88 57 98 82 -101 -7 210 -81 -36 55 -181 -185 168 -11 -59 -26 121 -67 215 -112 52 88 -75
5463 -75 7 63 -76 -19 -24 -59 -101 -68 208 48 160 -133 118 248 -47 -189 -80 137 95 -108 176 -52 -44 -126
5487 -126 27 -200 90 74 0 -184 -20 115 -24 177 51 146 -15 -124 -53 5 11 23 -97 -40 -21 65 -49 93
5511 93 50 -107 -59 -52 125 40 -111 11 -184 30 -11 -111 0 -2 121 133 111 -107 -40 -22 127 150 -101 29 -218
5536 -218 -84 38 -95 -8 89 26 63 -9 -86 260 -28 -9 15 -36 135 99 20 -117 42 152 87 -108 20 43
5560 43 37 -149 157 111 -11 -57 134 -57 10 -53 -91 -80 55 -184 19 -27 82 -44 -116 -216 -103 265 -107 84
$$ packed form
5390c67K19l7O7k9J57r6J98m4k02J96lj94J76J81l34j04L22J2l30K9j41K36J19
5413C1J73k20R6j22p5l5K77l46J34l6Q4j6J32P6N3j69k2o5l3J6J04N1P2k76K3
5438i3P1m9j7J45M1j6j83R4K17k91M5R1k36mL53j79m8L3J47j88K82l27J64L6j63
5463g5Q2N6j39N7nl5m2L3K76j60J12k93K51J30k95j42J09K17m2k03K84k28Qq2
5487a26J53k27K90j6p4j84J64J35j39K01j26R5j61j09P1N8OJ2j20N7J9Q6j14J42
5511I3m3j57M8PJ77q5j51J22j95K14m1j00J11kJ23J2k2k18O7J8J49K3k51J30k47
5536b18J34J22j33Q7R7o3L7p2p7L46k88J9K4n1J71l6p9j37J59J10o5j95J28K3
5560D3oj86L06m6j22m6J91j91O7o3l8J1J35k39K03m6J09j26p2j00J13L68l72J91
$$ plain form
5584 84 85 142 -32 31 -25 -11 130 33 125 32 -71 -51 92 152 43 11 8 -53 -114 -82 119 145 59 86 -54 36 -159
5611 -159 59 238 20 50 68 117 135 -44 90 -51 -155 33 87 -93 -4 -28 -51 210 -127 -216 -138 23 74 32
5635 32 96 -154 55 7 31 46 -73 46 -33 -57 -144 55 -61 34 143 -148 -114 -37 -166 75 34 178 115 49 25
5660 25 70 -288 -142 -364 -169 -67 -104 13 -15 76 -38 20 -243 -61 -106 177 133 -185 88 -90 -11 144 -7
5683 -7 67 -61 86 42 -35 177 212 119 126 -133 113 191 14 -96 3 217 54 6 -180 20 -16 -20 -51 188 284 -17
5709 -17 -69 158 -49 -1 -42 -98 1 -113 -65 -82 -124 -77 -169 72 81 10 -143 -34 -1 -148 13 -50 -29 105 25 -10
5735 -10 -104 145 261 14 15 286 -74 -187 -130 181 -2 99 111 -162 -128 233 165 -9 -69 110 -78 96 80
5758 80 280 -11 161 -42 -158 -37 -60 -91 -8 158 16 209 -143 54 -153 122 34 23 177 120 -204 -43
$$ packed form
5584H4JN7j74O3n6J4J41r7R2r3j03K0J43O0j09l2lo1o1L2K01K6q6K7j40R0j95
5611a59K18J79k18L0J8M9J8j79J34j41j04J88N4j80Q9k4k3K61l37q9P8J61N1m2
5635C2O4k50K09m8K4J5j19J19p9k4q7J99j16R5J09k91L4P7j29K41m1J44o3o6k4
5660B5M5l58J46k22J95J02l7J17k8R1j14N8k63J82m5K83m4l18K73j78P9J55j51
5683gP4j28J47m4p7K12L5r3Pk59K46P8j77j10R9K14j63m8j86K00l6ml1K39R6l01
5709a7n2K27k07M8m1n6R9j14M8j7m2M7r2K41Rp1j53J09L3j47J61o3K1J34q0l5
5735a0r4K49J16k47JK71l60j13N7L11j83J01J2k73L4L61o8j74o0J79j88J74j6
5758H0K00k91J72k03j16J21k3l1Q3J66j42J93l52J97k07K75q8j1J54n7l24J61
$$ plain form
5780 -43 149 -49 60 -65 -13 101 -5 -121 -34 -41 86 81 -102 131 77 185 -33 274 131 -162 140 70 -29
5803 -29 -10 197 112 -172 38 58 314 -105 -35 -41 57 19 68 51 -115 -237 80 -10 106 -54 -186 36 -94 -92 -9
5828 -9 69 101 36 -68 19 137 -146 111 -81 -49 274 144 196 25 -89 53 -222 -235 22 -144 91 -12 -13 -79
5852 -79 -23 -201 196 -235 28 -101 64 -22 -101 193 109 -53 -32 143 38 129 -258 -13 3 76 -91 -38 -223
5875 -223 42 -34 -154 96 -36 215 65 60 -187 45 4 20 -24 14 6 112 68 168 67 28 -172 -43 -17 -37
$$ packed form
5780d3J92j98J09j25N2J14j06j16Q7pJ27nj83K33n4J08k18L07j43k93L02p0r9
5803b9J9K07q5k84K10K0K56m19P0oR8l8M9j7j66j22L17r0J16j60j32K22j30KQ3
5828iP8L2o5j04Q7J18k83K57j92L2L23j30N2j71j14J42k75j3K57j66K35j03jo6
5852g9N6j78L97m31K63j29J65q6p9K94q4j62K1J75j05R1l87K45J6P3j67N3j85
5875b23K65p6j20K50j32K51j50nk47K32m1J6m4L8qJ06m4J00j01l9k00J29K6k0
$$ [...]
8191A13
##END NTUPLES=NMR FID
##END=
