##TITLE=1H_DE-80H_X3
 200.13MHz, d2o
 8 sc
 
 19ns.26.2.2025
##JCAMPDX= 6.0         $$ Bruker NMR JCAMP-DX V2.0
##DATA TYPE= NMR FID
##DATA CLASS= NTUPLES
##ORIGIN= UXNMR, Bruker Analytische Messtechnik GmbH
##OWNER= pz
$$ XWIN-NMR		Version 3.5
$$ Mon Jul 14 16:01:11 2025 Russian Standard Time (UT+4h)  Yarkov@DPX200
##.OBSERVE FREQUENCY= 200.1313
##.OBSERVE NUCLEUS= ^1H
##.DELAY= (6, 6)
##.ACQUISITION MODE= SIMULTANEOUS
##.ACQUISITION SCHEME= undefined
##.AVERAGES= 8
##.DIGITISER RES= 18
##SPECTROMETER/DATA SYSTEM= spect
##.PULSE SEQUENCE= zg30
##.SOLVENT NAME= CDCl3
##.SHIFT REFERENCE= (INTERNAL, CDCl3, 0, 14.3821)
##AUDIT TRAIL= $$ (NUMBER, WHEN, WHO, WHERE, WHAT)
$$ ##TITLE= Audit trail, XWIN-NMR		Version 3.5
$$ ##JCAMPDX= 5.01
$$ ##ORIGIN= Bruker BioSpin GmbH
$$ ##OWNER= Yarkov
$$ C:/Bruker/XWIN-NMR/data/yarkov2/nmr/H-C/1/audita.txt
$$ ##AUDIT TRAIL=  $$ (NUMBER, WHEN, WHO, WHERE, WHAT)
(   1,<2025-07-14 16:00:19.67 +0400>,<Yarkov>,<DPX200>,
      <created by zg, POWCHK disabled, PULCHK disabled
       configuration hash MD5:
       00 E9 B6 7A A2 85 ED C7 34 08 36 98 17 FE 4E 26
       data hash MD5: 16K
       F0 A0 24 24 F0 99 57 1C CE 57 37 4E 1F 8F 5B C1>)
$$ ##END=
$$ 
$$ hash MD5
$$ 2A 22 72 49 7A A5 CA E6 DF 4C CC F8 BC 6D AD 3F
##$RELAX= 
##$RELAX= 
##$RELAX= 
##$RELAX= 
##$RELAX= 
##$RELAX= 
$$ Bruker specific parameters
$$ --------------------------
##$DU= <C:/Bruker/XWIN-NMR>
##$EXPNO= 1
##$NAME= <H-C>
##$PROCNO= 1
##$TYPE= <nmr>
##$USER= <yarkov2>
##$AMP= (0..31)
100 100 100 100 100 100 100 100 100 100 100 100 100 100 100 100 100 100 
100 100 100 100 100 100 100 100 100 100 100 100 100 100 
##$AQSEQ= 0
##$AQ_mod= 1
##$AUNM= <au_zg>
##$AUTOPOS= <>
##$BF1= 200.13
##$BF2= 200.13
##$BF3= 200.13
##$BF4= 200.13
##$BF5= 200.13
##$BF6= 200.13
##$BF7= 200.13
##$BF8= 200.13
##$BYTORDA= 1
##$CFDGTYP= 0
##$CFRGTYP= 5
##$CHEMSTR= <none>
##$CNST= (0..31)
1 1 145 1 1 1 1 1 1 1 1 1 1 1 1 1 1 1 1 1 1 1 1 1 1 1 1 1 1 1 1 1 
##$CPDPRG= <>
##$CPDPRG1= <>
##$CPDPRG2= <>
##$CPDPRG3= <>
##$CPDPRG4= <mlev>
##$CPDPRG5= <mlev>
##$CPDPRG6= <mlev>
##$CPDPRG7= <mlev>
##$CPDPRG8= <mlev>
##$CPDPRGB= <>
##$CPDPRGT= <>
##$D= (0..31)
0 0.7 0 0 0 0 0 0 0 0 0 0.03 0 0 0 0 0 0 0 0 0 0 0 0 0 0 0 0 0 0 0 0 
##$DATE= 1752494419
##$DBL= (0..7)
120 120 120 120 120 120 120 120 
##$DBP= (0..7)
150 150 150 150 150 150 150 150 
##$DBP07= 0
##$DBPNAM0= <>
##$DBPNAM1= <>
##$DBPNAM2= <>
##$DBPNAM3= <>
##$DBPNAM4= <>
##$DBPNAM5= <>
##$DBPNAM6= <>
##$DBPNAM7= <>
##$DBPOAL= (0..7)
0.5 0.5 0.5 0.5 0.5 0.5 0.5 0.5 
##$DBPOFFS= (0..7)
0 0 0 0 0 0 0 0 
##$DE= 6
##$DECBNUC= <off>
##$DECIM= 32
##$DECNUC= <off>
##$DECSTAT= 4
##$DIGMOD= 1
##$DIGTYP= 9
##$DL= (0..7)
0 120 120 120 120 120 120 120 
##$DP= (0..7)
150 150 150 150 150 150 150 150 
##$DP07= 0
##$DPNAME0= <>
##$DPNAME1= <>
##$DPNAME2= <>
##$DPNAME3= <>
##$DPNAME4= <>
##$DPNAME5= <>
##$DPNAME6= <>
##$DPNAME7= <>
##$DPOAL= (0..7)
0.5 0.5 0.5 0.5 0.5 0.5 0.5 0.5 
##$DPOFFS= (0..7)
0 0 0 0 0 0 0 0 
##$DQDMODE= 0
##$DR= 18
##$DS= 0
$$ [...]
##$SUBNAM2= <"">
##$SUBNAM3= <"">
##$SUBNAM4= <"">
##$SUBNAM5= <"">
##$SUBNAM6= <"">
##$SUBNAM7= <"">
##$SUBNAM8= <"">
##$SUBNAM9= <"">
##$SW= 18.0517328524113
##$SWIBOX= (0..15)
0 0 2 0 0 0 0 0 0 0 0 0 0 0 0 0 
##$SW_h= 3612.71676300578
##$TD= 16384
##$TD0= 1
##$TE= 0
##$TE2= 300
##$TE3= 300
##$TEG= 300
##$TL= (0..7)
0 120 120 120 120 120 120 120 
##$TP= (0..7)
150 150 150 150 150 150 150 150 
##$TP07= 0
##$TPNAME0= <>
##$TPNAME1= <>
##$TPNAME2= <>
##$TPNAME3= <>
##$TPNAME4= <>
##$TPNAME5= <>
##$TPNAME6= <>
##$TPNAME7= <>
##$TPOAL= (0..7)
0.5 0.5 0.5 0.5 0.5 0.5 0.5 0.5 
##$TPOFFS= (0..7)
0 0 0 0 0 0 0 0 
##$TUNHIN= 0
##$TUNHOUT= 0
##$TUNXOUT= 0
##$USERA1= <user>
##$USERA2= <user>
##$USERA3= <user>
##$USERA4= <user>
##$USERA5= <user>
##$V9= 5
##$VALIST= <valist>
##$VCLIST= <CCCCCCCCCCCCCCC>
##$VD= 0
##$VDLIST= <DDDDDDDDDDDDDDD>
##$VPLIST= <PPPPPPPPPPPPPPP>
##$VTLIST= <TTTTTTTTTTTTTTT>
##$WBST= 1024
##$WBSW= 4
##$XGAIN= (0..3)
0 0 0 0 
##$XL= 0
##$YL= 0
##$YMAX_a= 58689
##$YMIN_a= -49605
##$ZGOPTNS= <>
##$ZL1= 120
##$ZL2= 120
##$ZL3= 120
##$ZL4= 120
##$ABSF1= 10
##$ABSF2= 0
##$ABSG= 5
##$ABSL= 3
##$ALPHA= 0
##$AQORDER= 0
##$ASSFAC= 0
##$ASSFACI= 0
##$ASSFACX= 0
##$ASSWID= 0
##$AUNMP= <proc_1d>
##$AZFE= 0.1
##$AZFW= 0.1
##$BCFW= 1
##$BC_mod= 2
##$BYTORDP= 1
##$COROFFS= 0
##$CY= 83.5205535888672
##$DATMOD= 1
##$DC= 2
##$DFILT= <>
##$DTYPP= 0
##$F1P= 10.8118882576601
##$F2P= -7.23987719738617
##$FCOR= 0.5
##$FTSIZE= 0
##$FT_mod= 4
##$GAMMA= 1
##$GB= 0.15
##$INTBC= 1
##$INTSCL= 1
##$ISEN= 128
##$LB= 0.25
##$LEV0= 0
##$LPBIN= 0
##$MAXI= 10000
##$MC2= 0
##$MEAN= 0
##$ME_mod= 0
##$MI= 1.114404
##$NCOEF= 0
##$NC_proc= 0
##$NLEV= 6
##$NOISF1= 3.799351
##$NOISF2= 2.8
##$NSP= 1
##$NTH_PI= 0
##$NZP= 0
##$OFFSET= 14.38212
##$PC= 1
##$PHC0= -1358.325
##$PHC1= 12.79091
##$PH_mod= 1
##$PKNL= yes
##$PPARMOD= 0
##$PSCAL= 0
##$PSIGN= 0
##$REVERSE= no
##$SF= 200.129724274929
##$SI= 16384
##$SIGF1= 3
##$SIGF2= 2
##$SINO= 400
##$SIOLD= 16384
##$SREGLST= <1H.CDCl3>
##$SSB= 0
##$STSI= 0
##$STSR= 0
##$SW_p= 3205.1282051282
##$SYMM= 0
##$S_DEV= 0
##$TDeff= 0
##$TDoff= 0
##$TI= <>
##$TILT= no
##$TM1= 0
##$TM2= 0
##$TOPLEV= 0
##$USERP1= <user>
##$USERP2= <user>
##$USERP3= <user>
##$USERP4= <user>
##$USERP5= <user>
##$WDW= 1
##$XDIM= 8192
##$YMAX_p= 0
##$YMIN_p= 0
$$ End of Bruker specific parameters
$$ ---------------------------------
##NTUPLES= NMR FID
##VAR_NAME=  TIME,          FID/REAL,        FID/IMAG
##SYMBOL=    X,             R,               I
##VAR_TYPE=  INDEPENDENT,   DEPENDENT,       DEPENDENT
##VAR_FORM=  AFFN,          ASDF,            ASDF
##VAR_DIM=   8192,          8192,            8192
##UNITS=     SECONDS,       ARBITRARY UNITS, ARBITRARY UNITS
##FACTOR=    0.0002768,     1,               1
##FIRST=     0,             0,               0
##LAST=      2.2672688,     0,               0
##MIN=       0,             -49605,          0
##MAX=       2.2672688,     58689,           0
$$ Real data points
##PAGE= N=1
##DATA TABLE= (X++(R..R)), XYDATA
$$ [...]
$$ plain form
741 62 1 -134 11 -29 -157 -171 -27 -41 -39 7 47 1 -46 48 143 70 131 61 -16 -6 -33 -91 -190 -114 -84 23 -79 -137
769 -137 -11 -15 42 144 115 27 26 -59 -55 82 32 -21 52 89 79 -32 16 24 -32 -38 28 -20 -161 8 -89 44 106 11 -1
798 -1 104 45 13 103 -62 16 -75 14 -38 13 12 -99 -106 -11 134 78 132 47 103 -125 5 22 -37 17 -25 -56 -54 45 9 -30
828 -30 12 -7 -42 -22 -62 -22 40 -5 -34 89 143 76 50 -44 44 -53 -64 -59 -156 -56 -70 -96 -25 63 -34 -67 114 6 57
857 57 -88 45 -7 -94 -101 85 -36 -60 -66 108 2 -107 34 72 -75 70 65 32 28 58 40 -42 -136 22 38 -27 -15
884 -15 7 -96 -38 -133 -69 33 -38 -85 -82 -61 -40 -46 64 152 -77 51 -24 -20 2 -38 -90 -48 -15 14 -55 60 -95 26
912 26 -43 -8 0 -7 -82 52 -31 115 -42 -3 -148 44 71 -83 -58 29 -76 -33 -56 -28 26 -102 71 -25 40 21 -40
939 -40 -86 10 -28 -72 -34 -168 110 -47 -11 -9 -73 8 33 -83 -87 99 -61 -24 -3 134 4 71 70 117 -42 -62 -57 56
$$ packed form
741F2o1j35J45m0j28j4J44j4KM6M0m6m7R4R5p3O1p0p7J0k7n8r9P6L0J07j02n8
769a37J26mN7J02k9q8jq5MJ37n0n3P3L7j0j11M8Qn6oO6m8j41J69r7J33O2r5j2
798aJ05n9l2R0j65P8r1Q9n2N1jj11pR5J45n6N4q5N6k28J30J7n9N4m2l1KR9l6l9
828c0M2j9l5K0m0M0O2m5k9J23N4o7k6r4Q8r7j1Nr7J00j4k6P1Q8r7l3J81j08N1
857E7j45J33n2q7pJ86j21k4oJ74j06j09J41L8j47J45nl3mL0j8q2r4J58J6o5J2
884a5K2j03N8r5O4J02p1m7LK1K1oJ10Q8k29J28p5MK2m0n2M2L3K9o9J15j55J21
912B6o9L5Qpp5J34q3J46j57L9j45J92K7j54K5Q7j05M3k3K8N4j28J73r6O5j9o1
939d0m6R6l8m4L8j34K78j57L6Ko4Q1K5j16mJ86j60L7K1J37j30O7jM7j59k0NJ13
$$ plain form
967 56 18 7 88 -59 -32 -101 76 11 -40 101 143 25 82 50 49 29 -5 21 -42 -15 13 -101 -77 -8 28 -157 -99 -25
995 -25 -122 -17 12 3 68 78 20 99 120 47 43 -11 -60 -9 -99 -79 49 -23 47 -66 -70 49 34 72 43 29 -64 22 24 26 63
1026 63 -4 89 -43 -47 25 1 -14 -45 -42 -27 82 -10 14 -53 15 -9 -45 10 60 62 20 99 -20 11 -52 -11 33 -53 92 58
1056 58 10 -38 19 13 27 5 -29 -11 123 8 99 -23 -95 -139 -20 -27 2 -8 59 68 5 -58 -61 -57 40 72 -161 -21 61 18
1086 18 -86 8 84 -53 19 28 15 -32 -147 -4 45 77 51 144 29 -13 -94 53 53 99 48 26 113 -63 45 5 6 8
1114 8 29 92 -1 64 -92 53 -67 -125 6 -2 47 -107 0 -37 -66 11 -17 78 -28 38 -34 -26 -40 4 34 -13 55 27
1142 27 53 78 38 -28 26 -69 -84 21 81 -43 22 -4 -118 24 -56 10 110 30 -74 -72 33 -55 -93 53 73 -32
1168 -32 -111 15 -119 -46 7 -6 -57 -81 -24 19 32 111 59 62 -74 -57 -45 -11 44 65 23 -4 -48 -106 -58 75 49 40 -67
$$ packed form
967E6l8j1Q1j47K7o9J77o5n1J41M2j18N7l2jk0l4K6o3K7K8j14K4O9L6j85N8P4
995b5r7J05K9rO5J0n8P9K1p3mn4m9N1r0K0J28p2P0j13mJ19j5L8k9j4r3Q6KKL7
1026F3o7R3j32mP2k4j5l1LJ5J09r2K4o7O8k4l6N5N0Km2P9j19L1o3M1M4q6J45l4
1056E8m8m8N7oJ4k2l4J8J34j15R1j22p2m4J19pK9j0O7Ro3o3lMR7L2k33J40Q2m3
1086A8j04R4P6j37P2Rj3m7j15J43M9L2k6R3j15m2q1J47%M6n1k2Q7j76J08m0JK
1114HK1O3r3O5j56J45j20n8J31qM9j54J07l7k9P7k8R5j06O6p2Qj4M4L0m7O8k8
1142B7K6K5m0o6N4r5j5J05O0j24O5k6j14J42q0O6J00q0j04KJ05q8l8J46K0j05
1168c2p9J26j34P3N3j3n1k4N7M3J3P9n2Lj36J7J2L4N5K1m2k7m4n8M8J33k6rj07
$$ plain form
1197 -67 -2 -29 26 -117 -27 11 4 2 -2 -52 -42 74 -150 21 -70 -32 21 62 -3 -27 42 13 36 141 90 6 -101 -5 94
1226 94 -57 -64 -36 -9 4 -39 64 35 -31 -21 -13 -15 -28 -32 22 0 43 61 33 -21 117 -25 -30 29 73 40 -112 -90 25 41
1256 41 -33 -33 -80 119 32 34 -67 99 -37 25 -28 -18 4 -44 37 56 63 -62 59 -34 -26 -13 -14 -19 38 -10 0 -62 -39 -22
1286 -22 19 -3 114 -9 16 34 57 -63 -137 59 -15 -46 -4 -110 41 -35 10 -15 -10 138 -91 -59 -29 77 -73 -148
1312 -148 43 -75 -8 36 14 11 62 6 -64 54 62 8 -9 -63 -85 -35 32 61 -42 1 -21 17 33 -10 7 59 -17 -63 53
1341 53 9 -103 41 39 -93 114 -18 -37 55 117 112 7 100 90 -52 104 52 26 20 14 -95 -115 17 -27 18 -67 -72 -138
1369 -138 81 -29 -4 78 21 95 86 71 -36 -55 -2 -65 65 -35 58 -23 35 -26 -44 139 -75 57 33 -59 13 30
1395 30 3 23 28 89 157 7 -6 50 -31 -53 -62 100 -92 -27 83 -22 -13 -31 -32 73 1 -27 -61 -5 -59 35 -73 -84 -44
$$ packed form
1197f7O5k7N5j43R0L8pkmn0J0J16k24J71r1L8N3M1o5k4O9k9K3J05n1q4j07R6R9
1226I4j51pK8K7J3m3J03k9o6J0Qkj3mN4k2M3J8k8n4J38j42nN9M4l3j52K2J15J6
1256D1p4%m7J99q7Kj01J66j36O2n3J0K2m8Q1J9Pj25J21r3QJ3jnN7m8J0o2K3J7
1286b2M1k2J17j23K5J8K3j20p4J96p4l1M2j06J51p6M5k5NJ48k29L2L0J06j50p5
1312a48J91j18O7M4k2lN1n6p0J18Qn4j7n4k2N0O7K9j03M3k2L8J6m3J7N2p6m6J16
1341E3m4j12J44kj32K07j32j9R2O2nj05R3j0j42J56n2k6ooj09k0J32m4M5q5no6
1369a38K19j10K5Q2n7P4rj5j07j9N3o3J30j00R3q1N8o1j8J83k14J32k4r2P2J7
1395C0k7K0NO1O8j50j3N6q1k2rJ62j92O5J10j05Rj8jJ05p2k8l4N6n4R4j08j1M0
$$ plain form
1424 -44 -153 -22 16 100 -51 60 114 92 6 -75 -80 -74 25 -153 -27 89 -6 -7 -4 -31 -36 108 18 -34 44 -70 -13 -76
1452 -76 78 -62 10 23 16 -81 59 -55 -84 121 -37 76 -7 -27 39 17 -27 -30 -76 31 -47 -10 134 15 -23 -10
1478 -10 84 -143 -65 -1 -128 59 2 41 39 56 -67 -15 20 1 -25 -7 -49 -10 65 -5 63 35 -19 -85 39 121 -50 -76
1506 -76 38 -21 -31 0 1 49 41 -2 15 -21 -74 -35 26 -24 10 -105 -5 58 -43 -81 74 -11 10 -19 51 -26 43 -98
1534 -98 -56 -32 -78 -4 -116 41 10 6 -85 80 -31 -13 88 -19 29 -66 -57 11 -24 34 -28 19 67 59 88 58 58 0 -39
1563 -39 118 -78 -11 58 -10 -18 20 -35 -30 16 99 -38 0 -57 76 121 -89 -55 -91 29 64 43 -19 -142 -16 84 90
1590 90 -32 9 -33 -21 -26 -25 -4 80 19 -19 79 -105 -33 -61 -59 -24 -76 72 -60 -9 84 -17 6 -72 97 0 75 -43
1618 -43 89 -36 -2 -58 -90 -4 -106 21 55 -33 61 100 34 83 65 -57 39 24 -70 4 81 12 -84 -39 13 91 -17
$$ packed form
1424d4j09J31L8Q4j51J11N4k2q6q1nOR9j78J26J16r5jLk7nJ44r0n2P8j14N7o3
1452g6J54j40P2J3pr7J40j14k9K05j58J13q3k0O6k2m4lm6J07p8L7J44j19l8J3
1478a0R4k27P8O4j27J87n7L9kJ7j23N2L5j9k6J8m2L9P5p0O8k8n4o6J24Q2j71k6
1506g6J14n9j0L1JM8qm3J7l6n3L9O1n0L4j15J00O3j01l8J55q5K1k9P0p7O9j41
1534i8M2K4m6P4j12J57l1mr1J65j11J8J01j07M8r5RO8l5N8o2M7M8qK9l0%n8l9
1563c9J57j96O7O9o8qL8n5NM6Q3j37L8n7J33M5k10L4l6J20L5k1o2j23J26J00O
1590I0j22M1m2J2nJK1Q4o1l8R8j84P2k8KL5n2J48j32N1R3j01K3p8J69r7P5j18
1618d3J32j25L4n6l2Q6j02J27L4q8R4L9o6M9j8j22R6j5r4P4P7o9r6M5N2P8j08
$$ plain form
1645 -17 -11 -38 129 3 -27 64 123 -15 -31 60 -28 61 20 21 29 26 -11 -28 117 -26 -7 -15 -83 12 -124 19 -18 -65 71
1674 71 69 -55 69 9 -3 31 -10 -24 -40 -36 55 43 41 79 -47 46 64 60 55 124 -94 48 -82 118 39 14 32 82 9
1703 9 -69 45 11 26 23 -41 -87 49 83 12 -62 86 35 -69 32 65 29 37 10 76 -3 -78 36 52 39 15 -45 -70 -38
1732 -38 10 49 -51 19 22 45 -50 -15 -21 27 -24 -70 16 -8 -65 -42 -37 -52 94 -3 71 -23 -50 25 -81 -36 -18 -33 20 77
1762 77 -164 -13 43 7 63 -30 108 -10 -19 -31 72 -26 121 -32 -16 118 -30 -22 -76 23 -15 -94 -53 -70 -36 -5 25
1789 25 -103 -15 -18 0 -34 61 63 -56 31 -10 83 14 -36 -13 100 -14 36 -34 63 72 43 64 91 -68 23 29 -30 34 -9 -97
1819 -97 -34 -40 7 -71 13 31 -20 -56 17 -46 -21 21 28 17 -2 23 -4 122 73 42 59 -70 40 -29 23 -7 90 -88 -40
1848 -40 -5 16 46 3 -15 -53 52 2 -49 3 22 20 90 -12 17 -43 0 69 -85 -22 -63 -105 -76 -19 -77 41 -41 81
$$ packed form
1645a7Ok7J67j26l0R1N9j38j6R1q8Q9m1JQll7j7J45j43J9qo8R5j36J43l7m7J36
1674G1kj24J24o0j2L4m1j4j6MR1j2kL8j26R3J8mnO9k18J42j30K00p9k5J8N0p3
1703Ip8J14l4J5lo4m6J36L4p1p4J48n1j04J01L3l6Qk7O6p9p5J14J6j3k4o0k5L2
1732c8M8L9j00P0LK3r5L5oM8n1m6Q6k4n7K3Nj5J46r7P4r4k7P5j06M5J8j5N3N7
1762G7k41J51N6l6N6r3J38j18rj2J03r8J47j53J6J34j48Qn4R9l8p9M1j7L4L1L0
1789B5j28Q8lJ8l4R5Kj19Q7m1R3o9n0K3J13j14N0p0R7Rk9K1K7j59R1On9O4m3q8
1819i7O3oM7p8Q4J8n1l6P3o3K5M2Pj1j9K5k7J26m9l1J7j29J10o9N2l0R7j78M8
1848d0L5K1L0m3j8l8J05n0n1N2J9kP0j02K9o0M3O9j54O3m1m2K9N7n8J18q2J22
$$ plain form
1876 81 -119 87 42 41 23 1 -89 17 -5 -111 66 20 0 -67 10 -42 54 -144 -48 -25 112 83 -20 44 -18 -50 126
1903 126 55 31 -41 -62 -5 -61 20 15 8 2 -31 29 18 -16 21 -17 -4 63 87 93 -14 -30 10 39 91 -24 -9 70 -60 121
1933 121 -8 4 -51 -3 -38 -5 -61 101 -30 -18 25 -11 -31 -17 30 91 -33 -99 -18 -35 47 -103 -77 0 -10 32 -65
1960 -65 -84 79 35 61 -61 27 -17 -2 -75 25 -37 -49 -53 -1 9 103 -46 3 -43 -48 57 -19 -102 37 5 38 -25 38
1988 38 96 -33 64 17 -97 -86 56 22 44 52 -70 10 -58 -174 -45 66 16 -34 -21 -21 53 -13 -121 -33 -9 -13 19 -132
2016 -132 -101 32 -50 149 -5 -5 -20 -26 45 83 68 -5 19 49 -131 43 -10 -32 114 7 11 -41 -87 -37 -68 54 -28
2043 -28 31 -109 -81 33 -39 39 31 -90 49 92 4 11 -38 21 9 115 -13 49 182 87 -44 25 -115 -26 102 -24
2069 -24 8 8 -2 -103 -76 -64 11 -30 -115 -30 -16 -8 5 33 3 -26 -56 -42 -27 -98 17 -21 -8 12 28 6 -146 10 53
$$ packed form
1876H1k00K06m5jj8k2r0J06k2j06J77m6k0o7P7n2R6j98R6K3J37k9j03O4o2l2J76
1903A26p1k4p2k1N7n6Q1npol3O0j1l4L7l8J3O7K4Oj07j6M0K9N2j15J5P9j30J81
1933A21j29J2n5M8l5L3n6J62j31J2M3l6k0J4M7O1j24o6Q1j7Q2j50K6P7j0M2r7
1960f5j9J63m4K6j22Q8m4J5p3J00o2j2mN2J0R4j49M9m6nJ05p6q3J39l2L3o3O3
1988C8N8j29R7m7j14J1J42l4K2Qj22Q0o8j16J29J11n0n0J3%P4o6j08Q8K4mL2j51
2016a32L1J33q2J99j54%j5oP1L8j5p3K4L0j80J74n3k2J46j07Mn2m6N0l1J22q2
2043b8N9j40K8J14p2P8qj21J39M3q8Pm9N9j2J06j28O2J33r5j31O9j40Q9J28j26
2069b4L2%j0j01K7J2P5m1q5Q5J4QJ3K8l0k9l0J4J5p1J15l8J3K0J6k2j52J56M3
$$ plain form
2098 53 -82 8 29 14 15 70 30 3 0 51 37 48 -31 51 -48 63 4 -75 110 -70 -19 15 47 -158 99 -50 69
2125 69 -50 -7 -16 -56 -75 -53 -9 31 -92 25 43 20 4 18 -82 -96 -81 -13 -136 -78 -101 13 -18 -48 20 28 -80 9
2153 9 -31 -99 -16 16 1 -35 27 -16 43 -4 -107 55 32 -112 -58 -55 -91 72 87 44 -39 45 -38 -36 -58 34 20 5 48 -78
2183 -78 44 86 1 -123 113 -82 40 47 -38 3 -63 -11 -22 69 -27 -71 -61 25 13 -44 26 53 -29 62 27 -80 -30 104
2211 104 -27 79 0 -30 -9 -4 -20 -106 33 -85 -7 22 78 13 -39 -36 -2 68 -4 10 -23 16 43 -57 1 -2 171 102
2239 102 1 -65 4 32 68 -102 26 -48 -3 -61 -16 4 -47 -87 38 17 -73 90 74 38 -77 6 141 -44 -49 73
2265 73 -38 31 40 -19 -53 69 34 -15 -8 0 40 57 62 2 86 -38 54 -90 -31 19 3 -69 -21 134 1 61 48 -46 -85
2294 -85 -119 -177 80 -61 -96 19 -68 -79 93 -11 -133 -1 82 29 58 50 49 -38 -9 -4 40 8 -34 -30 -48 78 -81 3
$$ packed form
2098E3j35R0K1j5JN5m0k7lN1j4J1p9Q2r9J11n9p9J85j80N1L4L2k05K57j49J19
2125F9j19M3rm0j9K2M4M0j23J17J8k3j6J4j00j4J5O8j23N8k3J14l1l0O8Qj08Q9
2153Im0o8Q3L2j5l6O2m3N9m7j03J62k3j44N4Ll6J63J5m3q3Q4q3Kk2R2j4j5M3j26
2183g8J22M2q5j24K36j95J22Pq5M1o6N2j1R1r6m4J0Q6j2n7P0K7q2R1l5j07N0J34
2211A04j31J06p9l0K1Nj6q6J39j18P8K9N6o5n2LL4P0p2J4l3L9K7j00N8lJ73o9
2239A02j01o6O9K8L6j70J28p4M5n8M5K0n1m0J25k1r0J63j6l6j15Q3J35j85nJ22
2265G3j11O9Rn9l4J22l5m9PQM0J7No0Q4j24R2j44N9N0j6p2M8J55j33O0j3r4l9
2294h5l4n8K57j41l5J15q7j1J72j04j22J32Q3n3K9qjq7K9NM4l2m2Mj8J26j59Q4
$$ plain form
2322 3 51 27 43 -12 -23 63 -66 -31 63 95 7 27 65 33 43 -79 98 1 50 -53 65 -161 -71 -47 74 61 -61
2349 -61 -42 58 73 -36 5 37 16 17 35 40 -74 -86 -103 -109 -83 -31 -63 33 -30 34 109 31 -15 -44 -7 -88 35 -27 42 -6
2379 -6 -69 -59 22 4 -70 66 -58 72 -39 59 -47 67 30 21 -50 69 -22 -101 20 36 -12 45 -66 0 83 -23
2405 -23 89 17 71 5 109 4 -27 -58 80 56 65 45 32 -8 -94 62 -19 23 29 -112 4 47 118 -21 82 -24
2431 -24 -69 62 -7 -30 47 9 0 -1 12 111 61 47 51 -68 -68 61 2 11 35 -40 -25 65 11 -53 -36 125 -5 75 6 49
2461 49 -86 106 15 53 -17 -113 44 -70 96 -56 10 30 -67 27 61 62 231 -14 -1 49 41 -73 -46 -30 -28 84 -15
2488 -15 39 -116 -20 -15 14 -21 22 -38 -30 44 -61 -54 21 14 21 -27 39 -95 -76 -34 52 -75 -48 -9 51 73 -77 -63 -59 -12 -29
2519 -29 85 11 61 -9 -66 15 59 -6 35 -43 45 11 39 -1 20 -26 15 51 44 -57 -22 88 16 -49 -19 13 -3 4 -22 -76
$$ packed form
2322CM8k4J6n5j1Q6j29L5R4L2q8K0L8l2J0j22J77r7M9j03J18k26R0K4J21j3j22
2349f1J9J00J5j09M1L2k1JJ8Nj14j2j7oK6N2l2R6o3O4P5p8m6k9L7q1J23o2O9m8
2379fo3J0Q1j8p4J36j24J30j11R8j06J14l7rp1J19r1p9J21J6m8N7j11O6Q3j06
2405b3J12p2N4o6J04j05l1l1J38k4Rk0j3m0q6J56q1M2Oj41J16M3P1j39J03j06
2431b4m5J31o9k3P7l8rjJ3R9n0j4Mj19%J29n9RK4p5J5R0n4o4J7J61j30Q0o9M3
2461D9j35J92r1L8p0r6J57j14J66j52O6K0r7R4L4JJ69k45J3N0qj14K7J6KJ12r9
2488a5N4j55R6NK9l5M3o0QP4j05PP5pPm8O6j34J9M2Q6j27K7L9O0K2j50J4MM7j7
2519b9J14p4N0p0n7Q1M4o5M1p8Q8l4K8m0K1m6M1L6pj01L5J10p2o5L0L2j6Pk6n4
$$ plain form
2549 -76 40 -25 -74 -20 171 9 129 -111 21 15 -93 88 22 -48 118 75 -28 -5 10 61 40 27 91 58 -29 34
2575 34 -70 46 -51 21 57 11 75 -34 -51 61 -95 -26 25 25 -53 104 142 55 27 -71 8 -91 32 -57 147 131 -90
2602 -90 51 32 116 21 -58 -56 -72 65 -22 18 28 -143 -67 -11 37 28 87 12 74 -36 -1 26 -83 -50 -32 -74 24 -154
2630 -154 78 54 -74 59 6 50 66 -10 30 -1 -25 8 -32 53 71 24 34 14 33 -14 16 -88 23 115 -49 26 21
2657 21 20 -21 -13 47 -65 30 84 -87 40 16 52 -5 12 -12 -117 -27 21 87 -63 62 -35 -120 102 -29 74 -8 -98
2684 -98 5 -125 21 -30 149 86 -31 88 41 24 81 84 41 23 -21 -55 28 -30 -26 -46 -64 -33 -20 -128 147 114 -67
2711 -67 -32 -5 -4 104 66 -4 -122 68 23 -7 46 -107 11 83 77 70 39 32 21 -30 -91 98 171 67 -58 74 83 121
2739 121 -101 -21 8 -33 72 38 22 -35 -53 -97 49 127 68 79 -33 69 -128 54 -3 -36 -78 12 78 36 76 -24
$$ packed form
2549g6J16o5m9N4J91j62J20k40J32oj08J81o6p0J66m3j03K3J5N1k1j3O4l3q7O3
2575C4j04J16r7P2L6m6O4j09j7J12j56O9N1%p8J57L8q7k8r8P9r9J23q9K04j6k21
2602i0J41j9Q4r5p9Kj6J37q7M0J0j71P6N6M8rN9p5O2j10L5K7j09L3J8m2R8j78
2630a54K32k4j28J33n3M4J6p6M0l1k4L3m0Q5J8m7J0k0J9m7L0j04J11R2j64P5n
2657B1jm1QO0j12R5N4j71J27k4L6n7J7k4j05R0M8O6j50J25r7q5K22j31J03q2r0
2684i8J03j30J46n1J79o3j17J19m7j7N7Lm3j8m4l4Q3n8Mk0j8L1J3j08K75l3j81
2711f7L5K7JJ08l8p0j18J90m5l0N3j53J18P2opl1pj1n1o1J89P3j04j25J32RL8
2739A21k22Q0K9m1J05l4j6n7j8m4J46P8n9J1j12J02j97J82n7l3m2R0O6m2M0j00
$$ plain form
2765 -24 11 -68 57 -201 36 -71 -49 25 -2 -60 38 3 -50 -2 14 40 98 -60 -61 81 -37 19 -8 35 -48 31 -14
2792 -14 2 98 -21 -21 114 -31 -65 -118 -80 32 -4 4 12 24 54 -63 39 2 -114 -45 37 28 3 -5 2 -5 37 89 -6 28
2822 28 88 51 103 114 91 -26 114 17 140 -20 -16 -19 21 -35 13 60 6 70 -116 -19 40 21 -102 39 8 -29 -97 -159
2850 -159 -59 -109 28 55 88 75 6 86 -112 -33 -45 2 50 117 87 -18 69 -17 68 -105 -24 -34 -65 116 -23 -70
2876 -70 31 44 55 -22 48 -1 83 -38 -80 -116 21 16 -31 -91 33 -81 101 -156 -64 -59 31 -98 -53 12 41 49 -31 91
2904 91 27 29 -107 -11 -123 -11 5 -5 6 25 16 21 28 -56 -101 19 -33 -124 13 -15 3 -54 -142 -71 -41 -38 -83 -68 69 -43
2934 -43 55 -32 62 59 -112 -7 -13 -81 -7 -3 100 42 11 -59 -143 9 -65 64 44 70 -27 51 -3 65 24 14 -12 -46 85
2963 85 -15 3 -89 -17 -19 23 -1 -68 34 35 -10 36 24 -22 -16 87 -103 -128 -21 -32 4 13 -31 67 -41 159 82 38 32
$$ packed form
2765b4L5p9J25k58K37j07K2P4k7n8R8l5n3M8J6K6N8j58jJ42j18N6k7M3q3P9m5
2792a4J6R6j19%J35j45l4n3L8J12l6QQJ2L0j17J02l7j16O9Q2rk5qPpM2N2r5L4
2822B8O0l7N2J1k3j17J40r7J23j60MlM0n6M8M7n4O4j86R7N9j9j23J41l1l7o8o2
2850a59J00n0J37K7L3j3o9Q0j98P9j2M7M8O7l0j05Q7q6Q5j73Q1j0l1J81j39m7
2876g0J01J3J1p7P0m9Q4j21m2l6J37nm7o0J24j14J82k57R2NR0j29M5O5K9Qq0J22
2904I1o4Kj36R6j12J12J6j0J1J9rNPq4m5J20n2r1J37k8J8n7q8P1L0Lm5J5J37j12
2934d3R8q7R4lj71J05oo8P4MJ03n8l1p0q4J52p4J29k0K6r7P8n4O8m1j0k6l4J31
2963H5j00J8r2P2kM2k4o7J02Jm5M6j2m6OJ03j90k5J07j1L6Rm4R8j08K00p7m4o
$$ plain form
2992 32 30 -101 -52 76 51 58 -18 3 27 101 82 -10 49 -110 113 27 -98 -20 32 59 7 58 -50 -20 -25 -41 -17 14 -6
3021 -6 14 -23 -80 -10 -33 13 32 -31 -103 -68 45 58 104 72 31 108 25 23 -46 -76 -79 1 -43 -77 5 27 -49 -10 8 32 47
3052 47 9 -23 -26 -12 125 18 -10 111 -79 -32 14 61 -20 -98 20 48 12 -5 40 39 -7 129 -100 48 -98 -39 42
3079 42 31 52 112 -77 -31 4 60 -11 -20 52 99 -50 -4 83 -29 -43 29 85 9 -19 44 -29 -44 38 -55 -57 -60 -49 0 -33
3109 -33 142 -49 -30 25 -44 -10 2 -17 -10 -44 66 10 10 102 -14 7 59 10 84 45 -45 16 -8 -31 -108 36 80 -5 15
3138 15 34 -1 8 -58 55 -37 -29 -12 90 -129 3 96 -33 -45 -44 21 -68 -7 -1 25 -23 48 0 35 -56 -34 -9 -44 90
3167 90 43 10 172 19 50 -5 -39 23 -90 58 14 -96 -19 -32 -44 -71 6 71 -25 15 11 30 -77 47 -34 -65 7
3194 7 -5 83 -15 133 100 81 -15 24 -58 -136 -74 1 -127 64 -20 37 -69 0 33 -29 88 -189 50 38 115 17 14 -79
$$ packed form
2992C2kj31M9J28k5Pp6K1K4P4j9r2N9j59K23q6j25P8N2K7n2N1j08L0nj6K4L1k0
3021fK0l7n7P0k3M6J9o3p2L5J13J3M6l2m1P7q3ko9l0lQ0m4l4Q2K2p6L9J8K4J5
3052D7l8l2lJ4J37j07k8J21j90M7M6M7q1p8J18K8l6j7M5jm6J36k29J48j46N9Q1
3079D2j1K1O0j89M6L5N6p1rP2M7j49M6Q7j12j4P2N6p6k8O3p3j5Q2r3klJ1M9l3
3109c3J75j91J9N5o9L4J2j9Pl4J10n6%R2j16K1N2m9P4l9r0O1k4k3p7J44M4q5K0
3138A5J9l5Ro6J13r2QJ7J02k19J32R3j29j2JO5q9O1OK6m8P1m8L5r1K2K5l5J34
3167I0m7l3J62j53L1n5l4O2j13J48m4j10P7j3j2k7P7O5r6M0mJ9j07J24q1l1P2
3194Gj2Q8r8J48l3j9r6L9q2p8O2P5j28J91q4N7j06O9L3o2J17k77K39j2P7r8lr3
$$ plain form
3222 -79 -20 73 30 75 -21 -26 -30 -20 -66 -42 -20 76 -108 -117 -22 18 -8 100 38 -55 10 29 -13 73 -68 2 83 78 117 -58
3252 -58 -64 -137 41 -4 28 29 -31 -145 14 -120 -5 -57 1 80 -41 -61 -37 93 2 12 0 -92 -15 19 -15 -36 44 -18
3280 -18 67 92 -39 -4 -27 7 90 85 -7 67 20 -13 83 -4 -149 65 -40 -35 -31 93 -44 -18 41 -83 -83 -9 -74 63
3308 63 51 6 -58 -24 -18 -62 31 -38 82 -175 -64 -85 -4 -61 70 -11 -127 -40 29 -57 -2 151 3 125 -21 45
3334 45 67 97 21 -63 26 -12 -44 43 -51 48 63 170 -79 -1 -32 -19 -79 -53 -178 -122 55 85 26 16 -29 31 -18 -59
3362 -59 93 -16 15 30 46 -71 -65 104 12 51 -57 -109 -47 -91 -47 12 0 3 44 -16 91 71 4 -147 111 20 9
3389 9 30 -36 -144 -42 125 -29 -18 26 -84 -7 90 -7 -62 -102 52 111 7 35 65 -78 43 -17 -20 -29 58 29 116
3416 116 -74 -78 -6 -19 -9 88 30 63 -31 16 -82 14 -76 -53 -54 -75 135 -4 -33 -57 6 5 53 119 -18 -4 35 -53 75
$$ packed form
3222g9N9R3m3M5r6nmJ0m6K4K2R6j84rR5M0k6J08o2r3O5J9m2Q6j41P0Q1nL9j75
3252e8op3J78m5L2Jo0j14J59j34J15n2N8P9j21k0K4J30r1J0j2r2P7L4l4k1Q0o2
3280a8Q5K5j31L5k3L4Q3nr2P4m7l3R6q7j45K14j05NMJ24j37K6N9j24%P4o5J37
3308F3j2m5o4L4Om4R3o9J20k57J11k1Q1n7J31q1j16Q7O9q6N5J53j48J22j46O6
3334D5K2L0p6q4Q9l8l2Q7r4R9J5J07k49P8l1J3o0K6j25N6J77L0n9j0m5O0m9m1
3362e9J52j09L1J5J6j17OJ69r2L9j08n2O2m4M4N9j2LM1o0J07k0o7j51K58r1j1
3389IK1o6j08J02J67j54J1M4j10P7R7r7n5m0J54N9j04K8L0j43J21o0lrQ7k9Q7
3416A16j90mP2j3J0R7n8L3r4M7r8R6r0K3jk1K10j39k9k4O3jM8O6j37J4L9q8J28
$$ plain form
3445 75 -94 36 -28 32 -21 67 55 58 168 35 -172 -3 103 94 -24 -12 -68 -24 -96 -13 72 -19 24 15 -28 -17 -39 52
3473 52 40 -14 18 29 -19 -43 4 -102 -52 -64 28 8 -126 109 -104 -24 38 50 57 27 58 79 -8 -20 64 74 48 -18 -60
3502 -60 -28 -26 -46 -120 5 22 37 6 22 -57 38 29 -112 32 47 9 -19 52 -48 -51 -9 33 -50 -107 -54 -29 8 29 50 6
3532 6 -52 11 127 -17 -35 79 -49 163 -64 -31 -17 -6 17 134 -30 -35 -10 -11 64 53 90 -12 -17 -14 24 -77 -11 7
3560 7 80 -17 10 -24 -36 -9 91 -44 -45 -32 57 58 22 125 -44 43 10 -17 -80 -33 129 -18 68 9 74 52 34 -70
3588 -70 -30 -93 -63 -40 78 -9 97 97 -28 19 13 127 -21 68 -47 -41 -103 22 46 78 129 -55 -8 -63 -101 -102 58 82
3616 82 -8 85 -12 -130 55 43 -34 9 23 62 -51 11 78 24 -56 -23 -7 -31 126 20 39 156 118 36 1 -25 -3
3643 -3 44 -118 -169 20 7 19 11 -25 -67 26 -13 -80 102 28 81 -32 14 -83 -4 -56 14 -121 69 93 16 -108 -9 39
$$ packed form
3445G5j69J30o4O0n3Q8j2LJ10j33k07J69J06rj18J2n6M4p2Q3Q5r1M3rm3J1k2R1
3473E2j2n4L2J1m8k4M7j06N0j2R2k0j34K35k13Q0O2J2Pl0L1K1q7j2Q4J0k6o6m2
3502f0L2Kk0p4J25J7J5l1J6p9R5rj41J44J5l8k8P1j00lM2M2q3n7N3K5L7K1K1m4
3532Fn8O3J16j44j8J14j28K12k27L3J4J1K3J17j64nK5jP5j1L7j02nLL8j01O6J8
3560GP3r7K7l4j2K7J00j35jJ3Q9Jl6J03j69Q7l3k7o3M7J62j47Q6n9O5k2j8j04
3588g0M0o3L0K3J18q7J06%j25M7oJ14j48Q9j15Oo2J25K4L2N1j84M7n5l8jJ60K4
3616H2r0R3r7j18J85j2p7M3J4L9j13O2O7n4q0L3J6k4J57j06J9J17l8q2l5k6K2
3643cM7j62n1J89j3J2ql6m2R3l9o7J82p4N3j13M6r7P9n2P0j35J90K4p7j24R9M8
$$ plain form
3671 39 -53 18 4 36 16 0 35 17 -79 -121 0 40 -19 -50 -46 137 -56 56 -25 -49 -24 -84 124 -21 16 -75 70
3698 70 79 -34 -120 -28 60 20 -13 5 63 30 99 -25 112 -25 -22 -15 65 47 58 44 -78 -58 0 -24 57 9 70 8 -12
3727 -12 -60 4 -11 -110 3 103 -58 -31 17 60 -40 -142 14 -42 -102 48 20 -26 51 2 51 13 86 51 82 -46
3753 -46 -96 59 -12 56 -103 -142 21 7 36 -21 65 -77 23 -65 17 -22 -151 26 -17 -149 -168 10 81 -63 -36
3778 -36 107 -171 -117 -39 -36 -130 -82 68 38 -44 10 30 74 34 -10 31 39 -37 93 -33 -48 11 -19 80 6 -27 56 53 16
3807 16 -104 80 10 -99 73 -65 6 13 121 23 -48 -76 4 -36 27 10 -27 -31 66 -17 -33 26 -35 -21 -6 66 0 -36
3835 -36 -55 94 91 -83 59 7 32 41 -33 69 -42 43 -41 -30 43 -95 55 -31 -48 16 -59 -63 -20 13 -15 96 60 38
3863 38 -15 7 44 38 0 -70 -15 -23 -41 -77 32 48 -10 -22 -45 72 -100 -46 1 10 -6 -33 -59 3 10 -33 9 46 -20 -63 115
$$ packed form
3671C9r2P1j4L2k0j6L5j8r6m2J21M0n9l1MJ83j93J12q1k4K5o0K08j45L7r1J45
3698G0Rj13q6R2Q8m0l3J8N8l3O9j24J37j37LPQ0j8J1j4j22K0N8k4Q1m8O1o2k0
3727a2m8O4j5r9J13J00j61K7M8M3j00j02J56n6o0J50k8m6P7m9M9l8P3l5L1j28
3753d6n0J55p1O8j59l9J63j4K9n7Q6j42J00q8Q2l9j29J77m3j32j9J78P1j44K7
3778c6J43k78N4P8Lr4M8J50l0q2N4K0M4m0m4M1Qp6J30j26j5N9l0R9p4l3Q3ll7
3807A6j20J84p0j09J72j38P1PJ08r8p1k8Q0m0O3j7l7mR7q3j6N9o1J4J5P2o6l6
3835c6j9J49lj74J42n2K5Rp4J02j11Q5q4J1P3j38J50q6j7O4p5mM3L3k8J11l6k2
3863C8n3K2L7ol8p0N5qj8l6J09J6n8j2k3J17j72N4M7Rj6k7k6O2Pm3M2L7o6m3J78
$$ plain form
3894 115 -34 18 -37 3 70 -25 -86 -74 142 -14 -48 17 -40 -38 -43 61 -4 87 47 60 123 -49 -28 39 -14 36 28 66 55
3923 55 -45 -36 -71 62 -1 50 -46 158 39 46 15 76 -32 90 13 -112 102 92 39 12 126 30 -132 -33 55 -102
3949 -102 57 -10 -32 -4 57 -46 -42 -53 38 -56 -20 19 -41 89 -45 -19 -13 42 75 125 61 104 -64 -12 63 -18 62 -133
3977 -133 27 10 135 85 -59 -31 -5 -20 -7 -50 -35 -26 20 -44 50 -10 -77 0 108 34 12 25 -3 -35 -1 -96 -9 75
4005 75 -43 -43 -108 -80 -127 48 -125 -96 62 -72 -69 73 85 -34 -31 40 -58 -73 -125 -43 -27 61 -32 93 -77 -10 -53
4032 -53 25 22 -41 -155 -6 -7 -99 -84 -86 17 -42 7 -29 -21 59 -31 65 -32 -72 76 172 -176 -45 -47 -78 -100 -15 -36 -53 -131
4062 -131 -111 71 -62 122 -35 18 -47 -20 142 19 20 9 -110 -20 6 -6 -2 -100 -51 26 3 -20 57 -45 42 -115
4088 -115 -139 103 26 -40 -74 21 -7 128 97 51 10 -7 -69 38 1 0 -120 6 -12 -37 27 -39 -91 -21 -61 136 -45
$$ packed form
3894A15j49N2n5M0O7r5o1J2K16j56l4O5n7KnJ04o5R1m0J3O3j72K1O7n3N0qL8j1
3923E5j00Rl5J33o3N1r6K04j19Pl1O1j08J22p7j25K14j0n3k7J14r6j62R9Q8j57
3949a02J59o7k2K8O1j03Mj1R1r4L6L9o0J30j34K6ON5L3N0o4M3j68N2P5q1Q0j95
3977a33J60j7J25n0j44K8K6j5J3m3J5RM6o4R4o0o7P7J08p4k2J3k8l2L4r5Q7Q4
4005G5j18%o5K8m7J75j73K9J58j34LJ42J2j19LP1r8j5n2Q2J6Q8r3J25j70O7m3
4032e3P8lo3j14J49jr2J5kJ03n9M9l6QQ0r0R6r7m0J48R6l48J31kl1k2Q5k1j7p8
4062a31K0J82j33J84j57N3o5K7J62j23Jj1j19R0K6j2Mr8M9P7k3k3P7j02Q7j57
4088a15k4K42p7o6l4R5k8J35l1m6m1j7o2J07l7jj20J26j8k5O4o6n2P0m0J97j81
$$ plain form
4115 -45 10 119 -18 -14 83 -46 -21 56 49 29 77 -90 -158 -156 33 26 35 -110 -67 -17 -67 -27 -3 -5 -3 80 -67 -61 -92 65
4145 65 -14 -114 43 -133 48 17 -5 -62 55 1 68 -7 56 2 3 -43 -142 125 30 -21 -72 115 50 17 7 59 65 83
4173 83 -17 -26 78 33 -20 -36 -70 28 -2 78 36 1 -60 -74 75 -48 74 -18 3 -110 20 -12 99 -39 -35 55 -24
4200 -24 63 -95 57 82 -10 9 -69 81 -17 3 -126 -3 102 51 68 90 101 -32 -19 -158 17 -11 95 28 -54
4225 -54 8 -32 36 13 -46 -55 32 -38 27 57 -97 69 41 -5 -8 92 38 -56 41 -4 37 -97 -90 -26 96 -32 -8 -11 15
4254 15 19 52 23 -37 -28 36 20 25 44 30 -41 66 -129 -121 17 22 134 18 54 -192 -30 70 -33 -123 -24 -88 -19 -31
4282 -31 -160 -32 -56 -28 26 -84 17 61 21 -42 9 -97 -37 84 -84 30 -52 59 30 -98 11 78 19 71 -24
4307 -24 -45 94 1 27 190 -15 7 -11 -23 31 -9 19 35 36 129 -16 -86 14 -80 53 23 -127 -35 -65 8 9 94 60
$$ packed form
4115d5N5J09j37MR7j29K5P7pk0M8j67o8KJ89pRj45M3N0n0M0K4kKQ3j47Ol1J57
4145F5p9j00J57j76J81l1k2n7J17n4O7p5O3n4Jm6r9K67r5n1n1J87o5l3j0N2OJ8
4173H3j00rJ04m5n3j6l4R8l0Q0m2l5o1j4J49j23J22r2K1j13J30l2J11j38MR0p9
4200b4Q7j58J52K5r2J9p8J50r8K0j29J23J05n1J7K2J1j33J3j39J75k8J06o7q2
4225e4O2m0O8k3n9rQ7p0O5L0j54J66k8m6lJ00n4r4R7m5M1j34PO4J22j28K4lK6
4254A5ML3k9o0RO4j6NJ9j4p1J07j95QJ38NJ12j16L6k46J62J00j03r0R9o4O9j2
4282c1j29J28k4K8N4j10J01M4m0o3N1j06O0J21j68J14q2J11k9j28J09O7n9N2r5
4307b4k1J39r3K6J63k05K2j8j2N4m0K8J6JR3j45p0J00r4J33l0j50R2l0P3JQ5l4
$$ plain form
4335 60 55 51 -59 -24 15 -79 -13 69 -28 -96 8 95 -36 -61 15 86 60 -1 -47 -19 -88 -9 64 -9 53 102 47 36 13 -3
4365 -3 56 -193 -29 74 -47 50 21 -20 85 -83 -82 -2 -8 172 39 95 2 -43 120 1 -9 13 35 -35 32 -36 22
4392 22 18 -34 -3 97 -66 -39 -19 -57 44 -17 -49 -22 -18 -63 59 -40 128 87 -80 14 -63 -48 44 23 10 60 -44 22
4420 22 44 -14 145 -2 39 -84 7 38 -133 23 30 28 -12 74 54 9 20 6 21 -45 -1 -141 13 24 54 -13 55 -11
4448 -11 27 -56 -18 -58 40 13 15 72 133 -27 6 -21 -22 -43 102 -22 67 92 -21 -30 110 -77 -78 97 31 28 8 31 -31
4477 -31 -114 -7 -49 29 9 -102 -117 64 -53 3 45 -6 -53 -95 -64 48 66 130 39 66 10 -21 68 16 113 -3 90
4504 90 60 -71 26 -50 -68 -22 -47 -38 -19 -59 -43 75 -40 0 35 -155 -40 -57 -8 -65 -32 -4 10 -85 -121 -93 34 -10
4532 -10 4 -65 4 1 -25 -79 94 35 79 -10 135 43 -21 110 -16 -17 37 -25 69 -4 46 13 -31 31 2 -66 -54 52 -48
$$ packed form
4335F0nmj10L5L9r4O6Q2r7o8J04Q7j31k5P6P1k6o1m6K8o9P9P3p3O2M9n5j1k3j6
4365cN9k49J64J03j21R7k9m1J05j68JQ0oJ80j33N6r3m5J63j19j0K2K2p0O7o8N8
4392B2mn2L1J00j63K7K0l8J01o1l2K7Mm5J22r9J68m1j67R4p7J5R2k1j3N0j04O6
4420B2K2n8J59j47M1j23R1L1j71J56Pkm0Q6k0m5J1j4J5o6M4j40J54J1L0o7O8o6
4448a1L8q3L8m0R8k7KN7O1j60L3k7jk1J45j24Q9K5j13rJ40j87jJ75o6lk0K3o2
4477c1q3J07m2P8k0j11j5J81j17N6M2n1m7m2L1J12J8O4r1K7n6l1Q9n2R7j16R3
4504I0l0j31R7p6j8M6k5RJ9m0J6J18j15M0L5j90J15j7M9n7L3K8J4r5l6K8J27m4
4532a0J4o9O9lk6n4J73n9M4q9J45r2o4J31j26jN4o2R4p3N0l3m4O2k9o8J2J06j00
$$ plain form
4561 -48 19 -25 -20 -27 21 -36 43 -36 -36 52 -52 -42 4 -39 21 139 -36 10 91 72 25 -10 -44 26 76 -7 53 31 -19 22
4591 22 47 28 1 -34 86 14 131 -11 -4 -16 25 13 -1 43 -78 -139 29 -14 -22 25 -38 27 18 54 84 -4 42 -36 -83
4620 -83 79 -88 -19 -84 91 -81 -77 8 55 58 -55 76 28 49 103 -55 97 55 122 -52 54 -20 -2 -1 -18 26 -83
4647 -83 7 72 122 102 -31 -26 71 -43 -71 -64 -70 46 15 -23 -85 8 -92 -17 -20 -45 38 23 -17 -12 -73 19 -69 -27 159 28
4677 28 -41 61 140 -29 -54 -32 -25 -8 1 31 52 -24 26 -30 -78 46 -74 61 -139 -13 95 -64 -19 -27 28 -60 -196
4704 -196 -42 -13 -45 -112 48 96 -10 -31 72 -92 -76 82 24 -46 28 115 4 -3 -40 59 -37 -17 -81 62 -38 -37
4730 -37 22 -16 -9 -3 96 -59 49 -56 12 -18 -159 -70 -32 44 96 18 -147 24 79 -43 63 116 1 46 -57 14
4756 14 23 3 22 46 58 3 -137 -7 -21 -32 25 15 14 33 -19 -55 -6 21 69 -105 17 -101 -28 -37 -52 -27 63 31 2
$$ packed form
4561d8O7m4NpM8n7P9p9%Q8j04J0M6m3O0J18j75M6Q1j9m7l5l4P0N0q3O0k2n0M1
4591B2K5j9k7l5J20p2J17j42Pj2M1j2j4M4j21o1J68m3qM7o3O5rL6L0q8M6p8m7
4620h3J62j67O9o5J75j72MQ5M7Lj13J31m8K1N4j58J52m2O7j74J06p4J8Jj7M4j09
4647h3R0O5N0k0j33NR7j14k8PoJ16l1l8o2R3j00P5lk5Q3j5m0No1R2q8M2J86j31
4677B8o9J02P9j69k5K2PJ7RL0K1p6N0n6m8J24j20J35k00J26J08j59M5qN5q8j36
4704a96J54K9l2o7J60M8j06k1J03j64J6J58n8p0P4Q7j11pl7R9r6K0o4J43j00J
4730c7N9l8POR9j55J08j05O8l0j41Q9L8P6N2p8j65J71N5j22J06N3j15M5j03P1
4756A4Rk0J9K4J2n5j40J30j4j1N7j0jJ9n2l6M9K7M8j74J22j18P3rj5K5R0l2k9
$$ plain form
4785 2 10 -73 111 7 -12 41 -19 -126 36 -8 75 24 -91 95 -42 -110 -29 6 23 -136 10 53 3 52 93 43 -3
4812 -3 56 -13 29 48 -35 -4 -55 29 14 -5 -40 -182 36 -15 156 -13 96 32 -46 14 124 -48 136 -2 89 -29
4838 -29 -19 21 37 105 35 15 71 -72 80 -52 32 40 -68 -143 -45 32 -83 -165 20 -6 57 -2 47 27 -110 50 -60
4865 -60 122 29 38 -73 47 16 -54 -18 -57 86 -25 13 -28 69 -124 11 -21 5 44 51 -47 9 144 8 24 90 19
4892 19 -37 5 118 -213 29 42 53 -24 -80 -1 -48 49 24 -53 -73 -5 17 66 43 -96 -66 110 -109 -16 32 33 79 26
4920 26 42 -64 75 32 69 -2 -53 8 -48 -13 80 6 -40 -34 51 18 26 -18 -82 -33 43 -17 -8 -24 -73 -22 90 5 117 -39
4950 -39 -44 -74 -76 1 67 -5 -42 -29 -14 81 -58 44 140 27 -31 46 41 30 65 14 74 29 -73 86 -25 -56 -4 -26 -26
4979 -26 -52 -143 47 -19 101 -10 -3 2 95 -45 -46 -42 35 9 100 29 -31 13 -35 -34 19 4 -34 19 56 40 30 79 -10 -34 -13
$$ packed form
4785BQq3J84j04j9N3o0j07J62m4Q3n1j15J86j37o8Q1L5J7j59J46M3n0M9M1n0m6
4812cN9o9M2J9q3L1n1Q4j5j9l5j42K18n1J71j69J09o4p8O0J10j72J84j38R1j18
4838b9J0M0J6O8p0k0N6j43J52j32Q4Qj08p5R8P7j15q2J85k6O3n9M9k0j37J60j10
4865f0J82r3Rj11J20l1p0L6l9J43j11L8m1R7j93J35l2K6L9Pr8N6J35j36J6O6p1
4892A9n6M2J13l31K42J3J1p7n6P9m7R7k5p7k0O8K2M9k3j39L0J76k19R3M8JM6n3
4920B6J6j06J39m3L7p1n1O1n6L5R3p4m6OQ5l3Qm4o4M9P6o0Rj6m9N1J12q5J12j56
4950c9nl0kP7O6p2l7J3J5R5j39J02R6j13n8P7nj1L5n1O0m5j02J59j11l1N2k2%
4979b6k6r1J90o6J20j11PNR3j40jMP7k6R1p1o0M4m8JN3j5l8N3L7j6j0M9q9k4K1
$$ plain form
5010 -13 -152 -56 50 -36 -50 16 119 26 -23 27 -8 11 100 99 -91 109 134 -48 -78 -20 -35 40 -56 5 17 -104 -5
5037 -5 -15 -104 -142 -11 -15 -72 34 28 49 -20 -62 -19 15 26 -96 3 11 -25 123 -93 -26 -38 111 -8 -22 80 25 -26
5065 -26 91 -15 19 -34 -33 21 -42 15 11 73 24 76 15 90 -54 11 -3 56 -70 -66 -3 47 -11 -5 -7 110 11 -62 92 103
5095 103 -49 8 44 46 -4 101 53 -6 82 -21 33 -3 -31 56 4 -114 -3 37 -15 -28 92 62 12 -1 -8 40 46 29
5123 29 -67 102 -4 104 -7 101 -77 14 87 92 14 39 -139 -30 16 -61 75 128 -68 -38 12 -1 22 25 18 31 -33
5150 -33 47 69 -93 91 13 -98 -37 -33 -4 -86 47 -43 -70 -50 -16 -66 48 25 -76 10 19 10 -13 -49 -112 -33 11 -118
5178 -118 74 -88 -27 -82 45 122 -21 37 47 -1 32 25 -20 -103 -55 4 -46 16 20 39 4 -36 -7 -99 24 26 -17 0 31
5207 31 155 1 14 -8 -89 75 -56 14 70 12 92 33 -5 79 36 19 123 31 60 71 137 -143 4 106 64 24
$$ packed form
5010a3j39R6J06q6j4O6J03r3m9N0l5J9Q9jj90K00K5j82l0N8j5P5r6O1J2j21R9
5037ej0q9l8J31mn7J06oK1o9m2M3L4J1j22R9Ql6J48k16O7j2J49j19j4J02n5n1
5065b6J17j06L4n3JN4o3N7mO2m9N2o1P5j44O5j4N9j26MO3N0n8OkJ17r9p3J54J1
5095A03j52N7L6Kn0J05m8n9Q8j03N4l6k8Q7n2j18J11M0n2j3J20l0n0j3pM8Oj7
5123B9r6J69j06J08j11J08j78R1P3Np8K5j78J09M6p7J36N3j96L0N0j3K3LpJ3o4
5150c3Q0K2j62J84p8j11O1MK9q2J33r0k7K0L4n0J14k3j01Q6Rrk3l6o3P9M4j29
5178a18J92j62O1n5J27P7j43N8J0m8L3pm5q3M8N9n0O2MJ9l5m0K9r2J23Km3J7L1
5207C1J24j54J3k2q1J64j31P0N6n8Q0n9l8Q4m3j7J04r2K9J1O6k80J47J02m2m0
$$ plain form
5233 24 -6 -45 7 -38 -60 56 -5 -3 -62 107 -115 -13 57 120 -9 -85 30 -75 27 -58 -19 -10 -46 8 -113 -53 79
5260 79 -11 -27 62 109 23 -2 -50 85 -17 78 54 91 -85 9 2 -90 75 -9 74 37 -117 84 -20 -48 -10 -46 -16
5287 -16 121 -107 -59 -10 -39 70 8 13 122 32 -5 -129 103 -70 -19 -15 61 81 15 -34 -38 39 -87 -10 176 44 23
5314 23 59 140 42 -28 14 -57 131 -82 -50 -62 -31 51 -5 -181 -14 53 -13 -16 -67 -52 59 87 -89 -86 81 46 2 121
5342 121 24 4 5 -20 -5 57 10 -9 -1 3 -21 87 -81 0 61 134 23 -53 -14 27 -71 35 -48 32 49 52 -38 -23 -49 -13
5372 -13 22 -78 -30 -48 124 -24 41 69 24 82 -93 -79 -95 -17 -34 11 -7 -68 5 13 28 7 7 88 138 -21 -32 -51 0
5401 0 75 15 69 -46 -3 -56 5 -120 -66 -26 -67 -47 -1 -94 1 148 -66 -102 -6 42 7 -60 -39 69 -34 2 -34 52
5429 52 32 62 -38 43 56 13 -42 -24 70 122 8 -10 -117 8 0 -23 -91 96 -6 -8 -61 -35 -5 11 -22 -2 -15 24
$$ packed form
5233B4l0l9N2m5k2J16o1Kn9J69k22J02P0O3j29p6J15j05J02q5L9Rl6N4j21O0J32
5260G9r0j6Q9M7q6k5m8J35j02R5k4L7j76R4pr2J65q4Q3l7j54K01j04k8L8l6L0
5287a6J37k28M8M9k9J09o2NJ09r0l7j24K32j73N1MP6K0o6m9mP7j26P7J86j32k1
5314B3L6Q1r8p0M2p1J88k13L2j2L1Q2n6j76J67O7o6ln1J5J11K8j76LJ67l5m4J19
5342A21r7k0Jk5J5O2m7j9QMk4J08j68Q1O1P3j11p6L9M1r8J06q3Q0J7Lr0J5k6L6
5372a3L5j00M8j8J72j48O5K8m5N8j75J4j6P8j7M5j8o1P3QJ5k1%Q1N0j59j1j9N1
5401@P5o0N4j15M3n3O1j25N4M0m1K0M6r3R5J47k14l6R6M8l5o7K1J08j03L6l6Q6
5429E2k0L0j00Q1J3m3n5J8R4N2j14j8j07J25qk3o8J87j02kn3K6L0J6l3K0j3L9
$$ plain form
5457 24 -78 -17 35 35 4 6 29 -11 11 40 42 78 63 51 87 84 35 -110 -28 -9 -67 121 141 7 -40 71 6 108 26
5486 26 -9 11 29 53 44 -71 -73 -29 -39 17 -34 56 -57 51 -83 83 6 -47 10 39 19 -87 53 5 -61 -80 -27 32
5514 32 69 -20 -55 -32 25 -11 -29 -44 -29 -72 -82 22 -14 72 89 36 -93 16 20 -41 -77 -8 -24 67 -43 77 46 -81
5542 -81 -94 8 -38 42 -11 -57 -22 -25 41 1 56 91 26 11 65 23 69 -17 -52 -37 -71 -49 -68 3 142 -21 -99 73 -32
5571 -32 -35 17 58 45 -124 -68 -21 5 -69 -20 63 -35 -34 -52 19 110 -24 -18 38 44 38 -13 26 51 62 -1 -33 76 38 64 167
5602 167 -44 -17 98 -75 77 -5 54 49 -59 26 5 -57 -122 -7 1 -49 -22 -24 -72 -77 -15 -7 19 -35 0 -14 -69 48 -108
5631 -108 -57 -66 96 -48 22 4 -10 -5 -63 -23 -42 65 93 23 86 -21 -53 -2 90 -61 38 -52 -79 -87 -7 40 -5 113
5659 113 -58 32 -42 -9 24 -11 -77 71 57 -45 -36 24 34 -20 -85 -9 -54 -94 50 108 -56 64 19 75 42 157 66
$$ packed form
5457B4j02O1N2%l1KK3m0K2K9KL6j5j2L6lm9j45Q2J9n8J88K0j34m7J11o5J02q2
5486B6l5K0J8K4rj15kM4j0N6n1R0j13J08j34J66p7n3N7K9k0j06J40m8o6j9N3N9
5514C2L7q9l5K3N7l6j8j5J5m3j0J04l6Q6J7n3j29J09Mo1l6O9j6R1j10J20l1j27
5542h1j3J02m6Q0n3m6L5lO6m0N5L5o5j5N4m2M6q6l5J5l4K2j9P1J39j63p8J72j05
5571c2lN2M1j3j69N6M7K6p4M9Q3r8Jj8P1R1j34ON6Oon1L9K5J1o3l2J09l8K6J03
5602A67k11K7J15j73J52q2N9nj08Q5k1o2o5J15Qn0K7km8nO2QK6n4L5j4n5J17j56
5631a08N1rJ62j44P0j8j4Nn8M0j9J07K8p0O3j07l2N1R2j51R9r0k7qQ0M7m5J18
5659A13j71R0p4L3L3l5o6J48j4j02RO0J0n4o5P6m5m0J44N8j64J20m5N6l3J15r1
$$ plain form
5686 66 41 -115 19 35 42 26 12 -18 2 -11 51 42 -91 4 -28 42 70 -166 37 55 -49 -149 -45 -13 112 -70
5712 -70 -23 18 -17 19 -81 8 -1 -24 -153 7 -110 -19 97 73 -12 48 107 54 2 64 -72 -42 11 -51 -56 160 39
5739 39 -16 -34 -75 36 52 33 75 41 -45 -97 4 -45 112 -56 19 -5 -43 82 14 -38 102 105 -121 0 0 18 4
5766 4 -61 -32 34 -81 -43 -4 -14 3 35 -41 5 -18 -20 57 32 -32 3 38 -71 -66 -56 -12 -85 94 12 43 -50 -40 14 16 61
5797 61 -28 -10 5 -13 19 -136 -18 92 -60 106 -25 19 28 11 42 -4 147 98 -65 8 48 71 -174 -77 -32 34
5823 34 -27 27 42 -27 4 60 3 -50 77 43 -35 -98 12 34 77 -106 -1 81 -74 -83 11 10 -30 -27 -8 65 80 -84 60
5852 60 76 34 27 10 -15 56 82 88 -79 -25 -116 26 76 50 38 5 -30 65 -44 -38 -71 -121 -86 87 -5 -74 80 27 -18
5881 -18 69 45 20 111 -106 4 79 -43 121 -46 17 28 19 -37 94 8 -92 77 -8 59 14 72 -12 -3 45 27 -59
$$ packed form
5686F6k5j56J34J6Pj6j4l0K0j3O2rj33R5l2P0K8k36K03J8j04j00J04L2J25j82
5712g0M7M1l5L6j00Q9rk3j29J60j17R1J16k4q5O0N9n3n2O2j36L0N3o2nK16j21
5739C9n5j8m1J11J6j9M2l4q6n2J01m9J57j68P5k4l8J25o8n2J40Lk26J21%J8j4
5766Do5K9O6j15L8L9j0J7L2p6M6k3kP7k5o4L5L5j09NJ0M4p3J79q2L1r3J0N4KM5
5797F1q9J8J5j8L2j55J18J10j52J66j31M4Rj7L1m6J51m9j63P3M0K3k45R7M5O6
5823C4o1N4J5o9L1N6n7n3J27l4p8o3J10K2M3j83J05Q2j55rR4jm0LJ9P3J5j64J44
5852F0J6m2pj7k5P1K6Oj67N4r1J42N0k6j2l3l5R5j09Ol3n0L5J73r2o9J54n3m5
5881a8Q7k4k5R1k17J10P5j22J64j67O3J1rn6J31q6j00J69q5O7m5N8q4RM8j8q6
$$ plain form
5908 -59 -103 85 26 -27 8 -6 -2 81 -77 -120 -11 -30 -55 14 81 -74 132 13 27 77 -54 -33 -67 -17 -20 13 -6 -67
5936 -67 96 38 9 -40 47 46 28 54 48 47 103 23 -37 68 -64 -61 -13 7 85 -50 -55 5 46 -124 -8 -48 22 44 12 4
5966 4 -33 -21 -120 -76 50 33 21 -37 4 -10 92 -7 45 47 44 66 -100 -18 3 -110 -30 45 47 22 -7 75 -62 0 -70 -71
5996 -71 60 -99 -23 37 72 51 18 11 -37 -33 144 31 -49 19 -1 17 -24 -100 33 113 55 -26 10 95 0 -54 67 108
6024 108 54 108 70 -12 1 -83 -4 -5 9 105 -46 -8 -5 26 76 6 -2 -126 -66 38 102 49 55 72 167 61 31 -55 -5 67
6054 67 31 -6 -48 8 61 2 83 -35 48 10 -16 -33 -68 -65 73 -14 83 55 -20 -14 -98 69 -65 37 -16 -25 -19 -3 -75 -93
6084 -93 35 -2 -28 23 16 -41 -62 -25 9 69 34 -20 59 -30 3 23 104 21 40 -16 113 65 0 -92 44 -4 81 45 -82
6113 -82 71 10 -9 -46 -115 -47 0 19 116 -53 -84 27 105 -12 8 105 -66 -64 -84 19 34 -66 -105 -73 7 9 -7 -97
$$ packed form
5908e9m4J88n9n3L5j4MQ3j58m3J09j9k5O9O7j55K06j19J4N0j31K1l4N0lL3j9o1
5936f7J63n8k9m9Q7jj8K6ojN6q0o0J05j32LM8K0P8j35nO0M1j70J16m0P0K2l2q
5966Dl7J2r9M4J26j7j2n8M1j4J02r9N2KlK2j66Q2K1j13Q0P5Kk5k9Q2j37O2p0j
5996g1J31j59P6O0L5k1l3pm8MJ77j13q0O8k0J8m1p6J33Q0n8q1L6Q5r5n4J21M1
6024A08n4N4l8q2J3q4P9jJ4R6j51L8LL1N0p0qj24O0J04O4n3OJ7R5j06l0q6N0P2
6054F7l6l7m2N6N3n9Q1j18Q3l8k6j7l5LJ38q7R7k8p5Oq4J67j34J02n3rOJ6p2j8
6084i3J28l7k6N1pn7k1L7L4O0l5n4P9q9L3K0Q1q3J9n6J29m8o5r2J36m8Q5l6j27
6113h2J53o1j9l7o9O8M7J9R7j69l1J11P8j17K0R7j71Kk0J03J5j00l9L2Q0Kj6r0
$$ plain form
6141 -97 45 42 94 58 21 -157 -28 -166 34 -14 -47 -94 -12 -2 49 76 -28 -20 -61 -10 61 23 24 27 34 -29 53 -72 8
6170 8 59 -66 15 -81 -35 87 72 33 47 42 -23 18 -48 -2 -37 116 80 -24 195 34 -42 6 -12 -6 -56 22 -53 2 -6
6199 -6 -49 -8 -44 -10 45 37 9 -127 -10 -46 -25 -46 -4 129 -19 -20 -110 -86 -90 21 0 -26 25 63 -43 -19 31 -6 27
6228 27 14 -93 102 91 -43 13 -19 -11 104 43 -25 20 91 -41 63 24 68 -60 77 -86 -26 -68 -19 -21 45 -27 -101
6255 -101 60 17 -59 -41 -35 6 111 -4 67 -56 -71 16 56 -42 29 36 1 65 13 5 -16 35 -59 -53 -6 -2 -61 82 15 -59
6285 -59 -24 -52 17 106 -50 31 40 35 8 -14 -88 -14 -30 38 -100 -5 -31 3 -90 -84 -19 83 36 -68 79 -112 -20 113
6313 113 -70 -47 -10 48 89 -97 11 84 -25 -87 65 -21 3 53 28 -28 -80 -62 98 -62 62 70 1 8 74 99 30
6340 30 -49 -55 35 -50 -34 31 97 22 83 -47 -7 -26 71 28 86 66 85 -4 88 -72 -109 30 -18 -100 16 -31 -55 38 63
$$ packed form
6141i7J42lN2l6l7j78J29j38K00m8l3m7Q2J0N1K7j04Qm1N1P1l8JLPo3Q2j25Q0
6170HN1j25Q1r6M6J22j5l9J4no5M1o6M6l5J53l6j04K19j61p6M8j8On0P8p5N5q
6199fm3M1l6L4N5qk8j36J17l6K1k1M2J33j48jr0K4mJ11k1k6N1L8j06K4N0l7L3
6228B7j3j07J95j1j34N6l2QJ15o1o8M5P1j32J04l9M4j28J37j63O0m2M9kO6p2p4
6255a01J61m3p6J8OM1J05j15P1j23j5Q7M0r8P1Pl5O4n2qk1N1r4OM7Mn9J43o7p4
6285e9L5k8O9Q9j56Q1Rnk7k2p4P4j6O8j38R5k6L4r3OO5J02m7j04J47j91R2J33
6313A13j83K3L7N8M1j86J08P3j09o2J52q6K4N0k5n6n2J8J60j60J24Qo9PO6K5o9
6340C0p9oR0q5J6O5O6p5O1j30M0j9R7m3N8k0J9q9R2j60l7J39m8q2J16m7k4R3K5
$$ plain form
6369 63 59 75 84 0 -28 -82 -2 -33 23 -31 37 15 -85 -54 42 81 69 -24 -41 50 72 135 56 6 -103 -18 0 -27 39 27
6399 27 -37 68 -1 57 66 16 94 -23 -39 71 136 10 -64 -32 -37 -9 -61 -139 -74 -7 7 -19 68 -82 71 -54 32 -80
6427 -80 -40 -72 5 2 -54 14 -108 91 82 100 14 -4 76 -16 55 6 -70 -6 -26 42 23 -4 -47 -1 -68 40 78 -37 -26
6456 -26 67 83 41 -23 -86 -12 -35 35 80 -70 -50 17 17 50 37 23 46 27 16 -116 -66 15 87 85 41 27 -105 -39 82
6485 82 50 59 1 -71 9 2 -44 -91 -58 -33 56 -2 26 -70 18 -30 1 54 -170 92 56 -65 -23 -31 37 -18 -76 79 105 31
6515 31 -42 -99 4 12 5 -24 -29 -22 23 31 43 92 13 -28 38 25 -74 -41 52 78 -66 -9 70 21 -80 -58 -4 -182 -48 -18
6545 -18 -21 -10 -66 -87 -50 -71 56 -13 -121 29 5 -79 -85 -24 9 79 56 -24 37 19 -55 86 -10 -115 -49 81 -98 28
6573 28 -12 -94 18 -28 -45 -88 -17 -24 -64 -29 -85 -13 160 -8 -119 -20 63 -72 11 17 76 -59 63 15 -40 -99 -47 40
$$ packed form
6369F3mJ6Rq4k8n4Q0l1N6n4O8k2j00L1R6L9j2r3j7R1K2O3p9n0j09Q5J8k7O6j2
6399B7o4J05o9N8Rn0P8j17j6J10O5j26p4L2nK8n2p8O5O7J4k6Q7j50J53j25Q6j12
6427h0M0l2P7ln6O8j22J99rJ8q6j8Q0r2P1m9p6O4k0O8j9k7m3M6o7J08L8j15J1
6456b6R3J6m2o4o3P4k3P0M5j50K0O7%L3j3j4K3j9j1j32N0Q1P2km4j4j32O6J21
6485H2l2Rn8p2Q0pm6m7L3K5Q9n8K8r6Q8m8L1N3k24K62l6j21M2qO8n5n8J55K6p4
6515C1p3n7J03Qpk9nPM5QJ2M9p9m1O6j3r9L3R3K6j44N7P9m9j01K2N4j78J34L0
6545a8lJ1n6k1L7k1J27o9j08J50k4q4oO1L3P0k3q0O1j8p4J41r6j05O6J30j79J26
6573B8m0q2J12m6j7m3P1pm0L5n6P2J73j68j11R9Q3j35Q3ON9j35J22m8n5n9N2Q7
$$ plain form
6601 40 56 1 -9 1 -98 -81 67 29 -9 42 28 11 -22 63 25 14 -21 39 -50 20 32 -7 -59 -6 32 106 -8 17 40
6630 40 68 29 41 50 39 -16 -3 35 -20 -72 74 -67 142 -104 47 18 -12 87 -58 61 8 -22 -58 67 -106 4
6656 4 0 -73 -64 11 35 76 -9 106 0 -49 -57 -8 -25 118 143 -87 -15 84 -10 -36 50 -127 -26 -36 13 -8 -27 99 79
6685 79 2 137 -124 -2 -23 17 -129 38 64 -64 41 43 -34 48 99 62 17 31 47 60 -37 -17 5 48 -40 94 -67
6712 -67 -80 30 48 66 -28 18 -84 -140 -22 -17 -34 -62 -41 149 -159 33 1 -7 -23 47 4 14 -35 0 -21 93 3 65
6740 65 -22 -27 -39 2 -99 35 5 -97 54 -92 28 -51 -22 38 38 -7 9 -20 59 50 -12 -17 -99 -48 -9 76 23 41 -92
6769 -92 -20 55 14 -45 104 33 0 49 5 -11 -55 25 30 144 -53 8 23 43 -108 23 36 5 9 4 -75 -76 -54 -69 25 -1
6799 -1 39 1 40 62 43 8 6 -41 -95 19 32 -29 25 -10 -26 4 -1 -81 -43 72 -25 77 -40 104 46 38 -25 37 -114
$$ packed form
6601D0J6n5j0J0r9J7J48l8l8N1j4j7l3Q5l8j1l5O0q9P0J2l9n2N3L8P4j14K5K3
6630D0K8l9J2Rj1n5J3L8n5n2J46j41K09k46J51k9l0R9j45J19n3l0l6J25j73J10
6656Dmp3RP5K4M1q5J15j06m9qM9j7J43K5k30P2R9r4k6Q6j77J01j0M9k1j9J26k0
6685G9p7J35k61J22k1M0j46J67K6j28J05Kp7Q2N1l7m5J4J6J3r7K0K2M3q8J34j61
6712f7j3J10J8J8r4M6j02n6J18Nj7k8K1J90l08J92l2qj6P0m3J0m9L5k1J14r0O2
6740F5q7nj2M1j01J34l0j02J51j46J20p9K9O0%m5J6k9P9ro2nq2N1L9Q5n3J8j33
6769i2P2P5m1n9J49p1l3M9m4j6m4Q0NJ14j97O1J5K0j51J31J3l1Mnp9jK2j5R4k6
6799aM0l8L9K2j9l5km7n4J14J3o1N4l5j6L0nq0L8J15r7J02j17J44n8qo3O2j51
$$ plain form
6828 -114 -82 26 -30 -21 8 20 61 6 -121 43 60 -27 -89 50 -32 -50 84 -60 -58 20 15 -72 -37 -44 -38 64 43 -72
6856 -72 -35 -54 17 13 63 -30 21 51 49 17 13 5 -45 -22 -90 -46 24 67 -37 -116 -2 8 68 -34 -136 -12 11 77 -42
6885 -42 -63 -83 -45 -51 -55 22 -70 -8 56 26 40 -28 -204 23 -16 -86 59 -43 -37 -8 55 31 64 99 -116 -69 39 -16 40
6914 40 39 -37 -41 -104 -33 14 -33 -74 -29 -19 63 71 -93 -21 50 -7 46 10 -19 12 -90 49 -158 35 -69 -35 -57 -79 -30
6943 -30 77 -31 -40 4 -58 108 78 -137 -1 3 -155 -41 -39 -57 -80 -72 5 -5 -89 24 -86 100 -37 42 -45 16 -160
6970 -160 -58 -17 -42 -13 -57 85 -97 28 18 -4 -47 48 -22 79 14 -136 125 122 -27 -18 -10 129 40 -91 22 -15
6996 -15 74 111 -34 75 -65 -68 -133 -64 -126 65 40 18 -41 -98 13 -6 -122 -25 -52 56 13 -24 -122 -32 -90 -108 25
7023 25 -13 2 -37 38 73 23 -52 -47 39 -114 -43 -26 14 95 65 65 21 82 -26 -37 91 11 2 -75 -26 -26 -64 -22 -7 12 8
$$ packed form
6828a14L2J08n6RK9J2M1n5j27J64J7q7o2J39q2j8J34j44KP8nq7L5pOJ02k1j15
6856g2L7j9P1mN0r3N1L0kl2mqn0K3o8M4P0M3j04p9J14J0O0j02j02J24K3O6j19
6885d2k1k0L8omP7r2O2O4l0J4o8j76K27l9p0J45j02OK9O3k4L3L5k15M7J08n5N6
6914D0jp6mo3P1M7m7m1M5J0Q2Qj64P2P1n7N3l6k9L1j02J39k07J93j04L4k2k2M9
6943c0J07j08rM4o2J66l0k15J36Mj58J14Kj8k3QP7j0q4J13j10J86j37P9q7O1j76
6970a60J02M1k5K9m4J42j82J25j0k2m3R5p0J01o5j50K61lj49RQJ39q9j31J13l7
6996a5Q9L7j45J09j40lo5O9o2J91k5k2n9n7J11j9j16R7k7J08m3l7r8R0n8j8J33
7023B5l8J5l9P5L5n0p5NQ6j53P1J7M0Q1l0%m4O1j08j1J28q0rp7M9%l8M2J5J9m
$$ plain form
7054 8 -101 -50 -74 62 -30 33 -83 72 -45 -91 25 23 -32 -35 -115 67 46 12 2 53 -2 -82 -8 13 -27 52 -20 -112
7082 -112 90 3 -89 -10 2 12 109 2 27 -55 70 -23 -25 -29 -40 -43 39 56 -17 74 -51 -25 28 68 -58 -132 18 131
7110 131 -40 -25 0 49 90 -70 -74 50 112 35 30 59 67 -3 -12 121 56 -1 14 82 -51 -35 29 -16 92 5 37 49 48
7139 48 -25 -53 -69 -38 19 -35 -31 -32 -52 7 113 16 -35 -52 -25 -78 -34 -69 -24 -34 -4 30 -23 -56 8 -18 -106 -30 11 -4 -47
7170 -47 -33 -50 -14 -60 -21 -43 -54 -7 -4 -33 -35 18 -91 29 26 -70 -150 42 -29 -23 -9 10 27 40 -61 42 -93 -30 69
7199 69 120 19 -93 16 -26 -89 63 72 14 -72 -14 -77 -20 11 -71 -11 -18 -46 2 128 10 -31 70 -24 -58 60 -30
7226 -30 34 -31 -79 74 34 -17 -50 2 46 59 -43 28 -46 -8 -38 -3 5 142 -18 -68 29 -24 -33 21 -22 -60 4 28 78
7255 78 -2 -14 -33 -30 -54 -102 -9 -25 9 -9 56 142 -21 0 113 -10 -3 -143 -13 -22 0 55 -81 45 58 -44 -37 -10
$$ packed form
7054Hj09N1k4J36r2O3j16J55j17m6J16kn5lq0J82k1l4j0N1n5q0P4K1m0P9p2r2
7082a12K02q7r2P9J2J0R7j07K5q2J25r3kmj1lQ2J7p3R1j25K6N3M0j26p4J50J13
7110A31j71J5K5M9M1j60mJ24O2p7nK9Qp0rJ33o5n7J5O8j33J6O4m5J08q7L2J2j
7139D8p3k8j6L1N7n4Mjk0N9J06r7n1j7K7n3M4l5M5j0L0L4n3l3O4k6q8P6M1j5m3
7170d7J4j7L6m6L9k2j1M7Lk9kN3j09J20lr6q0J92p1OJ4J9J7J3j01J03j35O3R9
7199F9N1j01j12J09m2o3J52Rn8q6N8o3N7L1q2O0pk8M8J26j18m1J01r4l4J18r0
7226c0O4o5m8J53m0n1l3N2M4J3j02P1p4L8l0L5QJ37j60n0R7n3rN4m3l8O4K4N0
7255G8q0j2j9Lk4m8R3j6L4j8O5Q6j63K1J13j23Pj40J30rK2N5j36J26J3j02PK7
$$ plain form
7283 -10 18 -40 -66 40 -69 0 75 -34 -2 -23 79 32 17 49 -27 0 128 -80 23 39 -42 81 -108 -93 64
7308 64 19 58 1 11 -142 -52 21 -2 66 84 25 -77 -2 -61 -62 -19 -30 -21 25 61 50 14 -63 -156 2 78 16 -55 -50 23
7338 23 -50 -78 -11 14 72 59 13 41 12 -44 13 -69 1 -31 -6 -107 -34 -30 -75 30 5 48 70 67 68 65 -29 -57 -5 -7 -38 47
7370 47 -21 11 24 19 51 84 -17 54 53 21 51 -61 -50 53 6 -26 25 66 -71 99 46 34 51 62 -60 -30 -18 -17 57
7399 57 -41 -47 -30 42 15 44 34 -29 92 -19 19 57 -12 -22 -70 40 -17 107 -70 -53 -26 -44 31 7 -79 71 22 79
7427 79 69 -2 52 39 -21 -34 -49 -94 -52 46 -72 -62 -70 38 66 10 27 -55 -42 83 -59 27 6 57 -20 -26 -10 -10 39 35
7457 35 123 -32 15 -16 16 -42 -47 46 -44 11 -10 -45 132 78 106 -18 -44 106 -68 36 12 -43 -90 -30 -61 17 41 104
7485 104 -34 13 47 108 -51 -23 14 -19 28 -59 75 -34 60 16 -13 -13 -8 106 -52 53 34 -18 -46 -30 -53 74 2
$$ packed form
7283a0K8n8k6J06j09O9P5j09L2k1J02m7j5L2p6K7J28k08J03J6q1J23j89J5J57
7308F4m5L9n7J0j53R0P3k3O8J8n9j02P5n9jM3j1RM6L6j1l6p7r3J58P6o2p1NP3
7338B3p3k8O7K5N8j3m6K8k9n6N7q2P0l2K5j01P3Mm5J05k5M3K2lJlr4k8N2kl1Q5
7370D7o8L2J3nL2L3j01P1jl2L0j12J1J03m7l2N1M1j37J70n3j2J7J1j22L0J2JP4
7399E7r8oJ7P2k7K9j0o3J21j11L8L8o9j0m8J10n7J24j77J7K7j8P5k4q6J50m9N7
7427G9j0p1N4j3o0j3j5m5M2R8j18J0qJ08K8n6J7q2J3J25j42Q6k1N1p7oJ6%M9m
7457C5Q8j55M7l1L2n8nR3r0N5k1l5J77n4K8j24k6J50j74J04k4n5m7O0l1P8K4O3
7485A04j38M7L4O1j59K8L7l3M7q7J34j09R4m4k9%NJ14j58J05j9n2k8J6k3J27p2
$$ plain form
7512 2 28 -109 -30 -95 14 106 -40 -103 -88 -69 2 -41 -39 -72 27 98 105 27 -19 29 0 5 126 81 76 28 -13 20 -110 106
7542 106 65 55 9 139 56 -24 57 12 -10 -23 -1 -148 -131 68 96 105 7 -63 -60 -38 56 46 -18 -74 21 4 -24 32 52
7571 52 -42 -53 58 53 109 56 -57 -8 -36 -49 -47 82 124 44 119 -23 0 52 122 -30 -141 28 103 -6 -3 24 41 104
7599 104 15 -119 -90 -28 -25 -17 17 40 -70 -156 -37 -43 -34 85 -78 -113 -48 70 -19 -28 0 -9 -59 38 108 -6 -130 87
7627 87 -8 30 -104 23 75 74 50 86 62 -18 -8 93 65 -16 24 -110 -43 -60 -79 -100 -136 -35 38 66 26 -5 -21 -120
7655 -120 -22 69 22 -52 -30 106 -25 -11 88 125 47 135 -29 -2 1 18 -1 3 -62 3 141 86 -5 42 -107 -75 9 8 69
7684 69 -49 35 30 52 -28 -125 -4 51 -8 25 -18 -108 -94 27 118 35 39 20 -30 42 16 5 -86 84 -14 153 -16 28
7712 28 50 -55 19 17 15 -76 69 -4 -177 32 142 -89 118 -119 -20 -17 -54 -13 -29 4 38 34 -52 32 -185 117 -16
$$ packed form
7512BK6j37P9o5J09R2j46o3J5J9P1m3Kl3R9P1Pp8m6M8k9NJ21m5nm8m1L3j30K16
7542A06m1j0m6J30q3q0Q1m5k2j3K2j47J7J99K8Rr8p0LK2R4j0o4n6R5j7k8N6K0
7571E2r4j1J11nN6n3j13M9k8j3KJ29M2q0P5j42K3N2P0j52j11J69P5j09LK7J7O3
7599A04q9j34K9O2LQL4K3j10q6J19oRJ19j63l5O5J18q9rK8rn0R7P0j14j24K17
7627H7r5L8j34J27N2jk4L6k4q0J0J01k8q1M0j34O7j7j9k1l6J01P3K8m0l1j6r9
7655a20R8R1m7p4K2J36j31J4R9L7p8Q8j64K7LJ7j9Mo5O5J38n5r1M7j49L2Q4jO1
7684F9j18Q4nK2q0r7J21N5n9L3m3r0J4J21R1q3Mj9n0P2k6j1r1J70r8J67j69M4
7712B8K2j05P4kkr1J45p3j73K09J10k31K07k37R9Ll7M1j6L3L4mq6Q4k17L02j33
$$ plain form
7739 -16 -21 -16 89 34 55 41 -26 55 -48 -34 -40 106 75 21 -80 40 -57 21 42 -50 -55 143 43 52 -67 -1 71 70 62 -62
7769 -62 23 -14 151 15 2 -76 -29 15 -24 -34 -158 44 -19 -53 31 -26 -15 -104 39 -71 18 -13 64 38 -30 35 -32
7796 -32 32 7 -33 -8 -16 -20 -29 -63 77 -16 -37 -50 -15 -8 103 109 26 -10 -112 -53 -33 -19 -69 12 -99 -23 66 13 113 -46
7826 -46 9 -40 -15 -18 4 -50 -16 16 -24 64 63 20 22 -1 24 -51 -33 -23 17 -37 -28 55 -56 49 25 65 99 16 -119 102
7856 102 -40 -116 -69 -118 -150 -74 124 79 -69 5 -86 -60 43 -91 -41 1 44 -38 27 121 -65 -46 29 -41 -76 8 -73
7883 -73 44 82 -70 -10 85 18 -44 -29 -29 38 -40 22 16 -37 7 47 45 22 -71 -82 111 11 -11 -78 -1 92 114 109 41 -58
7913 -58 -16 -52 23 125 98 -84 16 -77 31 -66 32 101 66 193 14 139 104 63 92 65 -16 -57 -18 142 45 -24
7939 -24 -12 28 27 15 26 -3 38 -50 108 -7 -17 86 111 13 -3 27 2 -27 100 58 58 18 12 8 -68 34 -5 27 -6 -42
$$ packed form
7739a6nNJ05n5K1j4o7Q1j03J4oJ46l1n4j01J20r7P8K1r2nJ98j00Rj19O6P2jqj24
7769f2Q5l7J65j36j3p8M7M4l9j0j24K02o3l4Q4n7J1q9J43j10Q9l1P7k6o8O5o7
7796c2O4k5m0K5qmrl4J40r3k1j3L5PJ11Oq3l6j02N9K0J4n0Q1j11P6Q9n3J00j59
7826d6N5m9K5lK2n4L4L2m0Q8jm3Kk3K5p5J8J0M0n4RQ3j11J05k4M0L4q3j35K21
7856A02j42p6M7m9l2P6J98m5j48P4r1K6J03j34N0M2M3q2O5R4j86J9P5p0l5Q4q1
7883g3J17L8j52O0R5o7o2J5%O7p8O2on3M4M0kk3r3j1J93j00k2o7P7R3K2no8r9
7913e8M2l6P5J02k7j82J00r3J08r7R8O9l5J27j79J25l5m1K9k7q1m1L9J60r7o9
7939b4J2M0jj2J1k9M1q8J58j15j0J03K5r8j6L0k5k9J27m2%m0omp6J02l9L2l3l6
$$ plain form
7969 -42 -31 -22 4 -56 -87 28 -50 13 57 -155 -58 -73 -62 -87 109 -28 -15 -6 38 33 -76 11 -47 1 -55 -24 -63 79 84
7998 84 -22 -63 -9 -10 -101 29 51 70 79 -12 29 40 13 54 32 95 53 0 -69 -31 66 -16 15 25 -57 28 53 14 -40 -47 -18
8029 -18 -33 0 -37 61 -60 -50 -102 -56 156 45 45 -65 -73 25 3 10 -87 54 -57 5 3 -36 -23 -9 1 -62 -12 -13 14 -25
8059 -25 54 11 24 -36 10 -74 -70 81 -89 51 -27 25 65 -103 -42 68 45 1 -84 -31 60 102 69 -54 93 -6 -65
8086 -65 14 -51 -15 8 17 41 76 -16 -57 -97 -10 -11 -100 2 2 -44 51 83 76 -32 -106 13 -16 37 19 -2 42 -30 -83 43
8116 43 56 64 -102 66 28 39 -6 -20 -38 -18 59 -111 39 -57 5 -78 25 62 -37 0 -39 -18 -8 -62 0 -15 18 -66
8144 -66 -109 52 16 -58 -37 29 -25 11 20 -13 10 -57 -65 0 -33 9 44 -80 52 71 -60 -26 -10 56 -56 -52 54 88 -53
8173 -53 -36 -109 49 -45 -7 86 42 -58 -32 6 16 85 85 74 95 39 45 -4
$$ packed form
7969d2J1RK6o0l1J15p8O3M4k12R7j5J1k5J96j37J3RM4nj09Q7n8M8n6L1l9J42N
7998H4j06m1N4jr1J30K2J9Rr1M1J1k7M1k2O3m2n3o9L8R7q2L1J0q2Q5K5l9n4pK9
8029a8j5L3l7R8j21J0n2M6K12j11%j10qR8k2Pr7J41j11O2kl9J3J4J0o3N0jK7l9
8059b5P9m3J3o0M6q4MJ51j70J40p8N2M0j68O1J10k3m4q5N3R1M2l3j23J47r9n9
8086f5P9o5L6K3RK4L5r2m1m0Q7jq9J02%m6R5L2pj08p4J19k9N3j8k1M4p2n3J26
8116D3J3Qj66J68l8J1m5j4j8K0P7j70J50r6O2q3J03L7r9L7l9K1J0n4O2j5L3q4
8144f6m3J61l6p4K1O6n4L6Rl3K3o7qO5l3M2L5j24J32J9j31L4J6O6j12MJ06L4j41
8173e3J7p3J58r4L8R3m4j00K6L8J0O9%j1K1n6Om9
8191d
$$ Imaginary data points
##PAGE= N=2
##DATA TABLE= (X++(I..I)), XYDATA
$$ plain form
0 0 0 0 0 0 0 0 0 0 0 0 0 0 0 0 0 8 -8 8 -8 8 -14 16 -16 22 -24 24 -32 40 -40 48 -56 64 -72 80 -94 104 -119
37 -119 131 -147 165 -183 203 -225 249 -275 304 -335 370 -407 450 -495 545 -602 665 -734 813
56 813 -904 1006 -1126 1264 -1437 1645 -1908 2251 -2721 3407 -4506 6554 -11686 54784 58689
71 58689 -36564 2242 25126 18285 6610 -11671 -48831 -24456 9071 -10314 -38318 -17166
83 -17166 -3681 3617 21041 9891 -20670 5911 42195 25316 -2138 1057 11027 22604 20350
96 20350 -5861 -21429 -4391 4620 -7186 -13020 -15203 -24708 -12861 10178 5528 -5550 4521
109 4521 11733 14348 20938 11655 -1043 8569 13425 -5599 -16327 -6308 -4124 -11518 -8023 -6121
123 -6121 -13938 -6351 10257 7908 -2168 -2361 1946 7748 11432 6336 -1988 -3352 3202 5452 -1646
$$ packed form
0@%%%%%%%%%%%%%%%Qj6J6j6J6k2L0l2L8m6M8n6P2q0Q8j04J20j36J52j74J98k23
37a19K50k78L12l48L86m28M74n24N79o39P05p77Q57r45J040j147J267j399J547
56H13j717J910k132K390k701L082l553M159m972O128p913J1060j8240O6470L905
71E8689r5253L8806K2884o841j1675j8281l7160K4375L3527j9385k8004K1152
83a7166J3485P298J7424j1150l0561K6581L6284j6879k7454L195R970J1577k254
96B0350k6211j5568J7038R011j1806n834k183r505J1847K3039m650j1078J0071
109D521P212K615O590r283j2698R612M856j9024j0728J0019K184p394L495J902
123f121p817P587J6608k349j0076j93M307N802L684n096q324j364O554K250p098
$$ plain form
138 -1646 -5698 -3227 -4084 -6174 -4867 -4777 -5753 -3302 1296 2279 612 4767 9172 6949 5791 4828 -578
155 -578 -338 2497 -3323 -9346 -8512 -8123 -7968 -3836 -1388 -3342 -2796 2800 5354 5616 7491 4962 2359
172 2359 6536 6149 741 1479 1442 -3176 -3023 -1619 -5572 -6604 -2803 -3467 -6970 -4197 171 -437 2589
189 2589 6459 1880 1293 8854 7989 2453 3159 1663 -2729 -1210 208 -4719 -6630 -2389 -1672 -3751
205 -3751 -716 956 -1589 1738 4957 759 -49 3981 2743 716 1895 574 -1044 1108 1719 -2081
221 -2081 -3662 -1133 -1100 -2012 -183 -1211 -2923 1157 3523 1180 1610 2998 1765 1668 2036 -522 -2322
238 -2322 -1145 -833 -3367 -3661 -1413 -1275 -603 1695 682 195 3209 3419 1595 1393 1180 234 201 73
256 73 -963 -2010 -1234 -498 -1613 -1795 -1019 -1756 -1214 -79 -945 -446 1184 1479 1626 2191 2328 2415 2005
$$ packed form
138a646m052K471q57k090J307R0r76K451M598R83j667M155M405k223j158r63n406
155e78K40K835n820o023Q34L89J55M132K448j954N46N596K554K62J875k529k603
172B359M177l87n408P38l7m618J53J404l953j032L801o64l503K773M368o08L026
189B589L870m579n87P561q65n536P06j496m392J519J418m927j911M241P17k079
205c751L035J672k545L327L219m198q08M030j238k027J179j321j618K152O11l800
221b081j581K529L3r12J829j028j712M080K366k343M30J388j233r7L68k558j800
238b322J177L12k534k94K248J38O72K298j013m87L014K10j824k02k13r46l3j28
256G3j036j047P76P36j115j82P76p37N42J135q66M99J630K95J47N65J37Q7m10
$$ plain form
275 2005 1537 609 -726 -1249 -1931 -3021 -2812 -2566 -2863 -1697 -398 36 1175 1948 2247 2542 2282 1971
293 1971 1380 605 326 -113 -1019 -774 -1146 -1604 -1007 -954 -1350 -1011 -771 -697 -402 -230 290 766 1063 1774 1709
314 1709 1478 1872 1383 583 267 -668 -1362 -1667 -2099 -1978 -1897 -1665 -497 -21 430 1285 1530 1628 1905 1344
334 1344 854 710 124 -264 -459 -962 -848 -828 -878 -520 -664 -544 -276 -339 -165 165 -44 407 755 676 1016
355 1016 870 787 887 473 -25 -142 -700 -1054 -1000 -1217 -1058 -825 -506 176 444 610 1061 985 883 1037 460
376 460 5 15 -318 -621 -677 -769 -559 -486 -410 -317 -35 195 342 202 223 454 213 340 455 153 328 220 -22
399 -22 47 -302 -781 -709 -665 -718 -689 -498 15 82 309 837 712 555 1160 958 412 503 178 -337 -378 -684 -958
422 -958 -990 -622 -585 -755 -555 34 -36 253 757 409 514 997 691 420 625 482 311 14 -286 -569 -796
$$ packed form
275B005m68r28j335n23o82j090K09K46k97J166J299M34J139P73K99K95k60l11
293A971n91p75k79m39r06K45l72m58N97N3l96L39K40P4K95J72N20M76K97P11o5
314A709k31L94m89q00l16r35o94l05m32J21Q1K32J168M76M51Q55K45R8K77n61
334A344m90j44n86l88j95n03J14K0n0L58j44J20K68o3J74L30k09M51L48p9L40
355A016j46q3J00m14m98j17n58l54N4k17J59K33L19O82K68J66M51p6j02J54n77
376D60m55J0l33l03n6r2K10P3P6R3K82K30J47j40K1K31k41J27J15l02J75j08k42
399b2O9l49m79P2M4n3K9J91N13O7K27N28j25j57O05k02n46R1l25n15m1l06k74
422i58l2L68L7j70K00N89p0K89N04l48J05M83l06k71K05j43j71k97l00k83k27
$$ plain form
443 -796 -788 -796 -1062 -779 -574 -440 6 231 315 821 1006 719 780 633 422 435 369 -224 -434 -441 -133 -610 -765 -193
467 -193 -544 -506 11 -195 -320 428 467 206 443 543 390 512 554 210 -202 -70 -102 -791 -669 -426 -683 -501
489 -501 -58 -144 5 461 526 437 441 356 190 174 245 -140 -243 -44 -210 -501 -225 -214 -168 123 -12 -215 86 201
513 201 66 233 408 7 221 554 469 -24 102 194 -198 -343 -175 -674 -484 -72 -360 -422 128 133 325 621
535 621 506 421 496 617 118 -145 -63 -158 -270 -108 -188 -468 -296 43 -286 -115 -154 -18 174 23 65 193 420
558 420 351 261 301 239 239 194 209 -216 -490 -213 -499 -516 -257 -469 -397 10 -4 56 175 429 369 190 274 49 81
583 81 175 25 -193 -154 -57 -126 123 -264 -271 22 41 -282 -11 -158 -176 -30 259 -7 -50 359 112 6 114 274
607 274 -136 -158 -33 -293 -242 174 105 -295 36 149 -90 71 139 90 -86 101 -51 -231 -175 -89 -80 96 84 -98
$$ packed form
443g96Qqk66K83K05J34M46K25Q4N06J85k87O1j47k11J3o6n93k10pL08m77j55N72
467a93l51L8N17k06j25P48L9k61K37J00j53J22M2l44m12J32l2o89J22K43k57J82
489e01M43q6J49M56O5q9Mq5j66j6P1l85j03J99j66k91K76J1M6K91j35k03L01J15
513B01j35J67J75m01K14L33q5m93J26R2l92j45J68m99J90M12k88o2N50NJ92K96
535F21j15q5P5J21m99k63Q2r5j12J62q0k80J72L39l29J71l9J36J92j51M2J28K27
558D20o9r0M0o2%m5J5m25k74K77k86j7K59k12P2M07j4O0J19K54o0j79Q4k25L2
583H1R4j50k18L9R7o9K49l87pK93J9l23K71j47j8J46K89k66m3M09k47j06J08J60
607B74m10k2J25k60N1M16o9m00L31J13k39J61O8m9j76J87j52j80N6Q6RJ76j2j82
$$ plain form
631 -98 69 139 108 45 40 -149 -69 108 -23 -141 -12 142 -57 -13 163 -155 -128 192 -65 -217 89 25 -106 69
655 69 278 31 45 162 129 -53 106 126 -217 -115 -60 -256 -230 30 -68 -38 179 67 -21 89 25 87 -33 131
679 131 -64 20 67 -1 35 132 10 -149 -36 -73 -190 -164 -30 -204 -49 90 -1 80 45 111 78 60 42 -94 -137
704 -137 -27 -102 -124 -173 -90 -97 -48 32 104 28 121 -11 21 -45 118 -108 -97 112 145 61 88 18 -48 -36 -46 -10 -59 -103
732 -103 -87 -77 -109 28 19 -39 153 120 67 -29 7 192 -84 -55 -45 -79 -157 -135 -26 -27 42 -35 74 124 -27 -20 24 113
760 113 -7 -76 46 22 34 75 -58 -82 55 38 -65 -67 -163 -63 -45 59 -47 -82 -49 114 141 43 210 2 -41
785 -41 45 51 -64 -109 -99 -23 85 -10 -4 47 95 4 96 123 27 -70 57 41 -55 104 -16 -28 -3 46 45 81 38 -17 -45 -17
815 -17 5 -60 -3 36 91 4 -38 58 64 102 23 -58 -60 -65 2 86 -81 -90 26 -23 54 48 -39 62 -16 7 -24 -42 -78 1 74 -28
$$ packed form
631i8J67P0l1o3nj89Q0J77j31j18J29J54j99M4J76l18K7L20k57j52L06o4j31J75
655F9K09k47J4J17l3j82J59K0l43J02N5j96K6K60r8L0K17j12q8J10o4O2j20J64
679A31j95Q4M7o8L6R7j22j59J13l7j17K6J34j74J55J39r1Q1l5O6l3j8j8j36m3
704a37J10p5k2m9Q3pM9Q0P2p6R3j32L2o6J63k26J1K09L3q4K7p0o6J2j0L6m9m4
732a03J6J0l2J37rn8J92l3n3r6L6J85k76K9J0l4p8K2J09jO9p7J09N0j51PM4Q9
760A13j20o9J22k4J2M1j33k4J37j7j03kr6J00J8J04j06l5L3J63K7r8J67k08m3
785d1Q6Oj15m5J0P6J08r5ON1M8r1R2K7r6r7J27j6r6J59j20j2K5M9jL6m3n5k8K8
815a7K2o5N7L9N5q7m2R6OL8p9q1knO7Q4j67rJ16m9P7oq7J01p8K3l1j8l6P9P3j02
$$ plain form
847 -28 -34 -4 62 9 -89 -36 -69 -20 76 -26 -83 -22 4 -33 19 19 -29 17 69 -101 -67 -102 39 -92 102 -30 -29 -34 69
876 69 -67 110 68 89 84 18 19 9 -34 -46 -25 -42 26 -44 12 35 11 -39 -130 -78 53 -13 119 82 -11 -72 31 8 -46
905 -46 52 -51 -93 12 -89 -14 103 -26 -142 -68 -30 34 -29 29 -30 -32 23 32 70 2 -7 -83 24 -17 -1 -16 92 96 -25
934 -25 -45 -86 11 13 43 74 9 57 -44 50 165 43 34 -3 60 -43 -63 71 -52 164 15 36 17 -28 -95 -47 34 -65
962 -65 50 186 -12 -103 42 60 -137 -69 -35 36 -111 -58 -80 -100 -85 -42 15 44 67 -12 -51 18 -9 -29 168 37 98
989 98 -21 -22 64 16 85 -83 -34 79 -10 16 -20 -28 -50 13 27 19 13 -23 0 -3 67 82 54 -9 -78 5 -10 93 -15 -2 8
1020 8 33 -124 90 141 -69 82 110 92 19 56 -27 -15 -89 -60 117 -36 67 76 37 10 -100 -89 99 75 53 -71
1046 -71 -1 7 31 7 -62 33 30 -27 18 -13 58 33 34 74 51 -15 -5 -72 -23 132 -1 32 34 88 5 -4 3 7 57 -28 48 -45 8
$$ packed form
847b8oL0O6n3r8N3l3M9R6j02n7O1K6l7N2%m8M6N2j70L4l5J41j31J94j32JnJ03
876F9j36J77m2K1no6Jj0m3j2K1j7O8p0N6K3k4n0r1N2J31o6J32l7r3o1J03k3n4
905d6R8j03m2J05j01P5J17j29j16P4L8O4o3N8n9kN5RL8o8rp6J07m1J6j5J08Mj21
934b5k0m1R7KL0L1o5M8j01R4J15j22rl7O3j03k0J34j23K16j49K1j9m5o7M8Q1r9
962f5J15J36j98r1J45J8j97O8L4P1j47N3k2k0J5M3N7K9K3p9l9O9k7k0J97j31O1
989I8j19jQ6m8O9j68M9J13q9K6l6qk2O3J4qol6K3lP0J5k8o3o9Q3j5J03j08J3J0
1020HK5j57K14N1k10J51K8j8p3L7q3J2p4K9J77j53J03Rl9k7j10J1J88k4k2j24
1046g1P0QK4k4o9R5ln7M5l1P1k5JM0k3o6J0o7M9J55j33L3KN4q3rPMN0q5P6r3N3
$$ plain form
1079 8 -21 54 -48 -55 35 31 -52 -124 -12 -12 -29 -63 -25 68 -20 26 12 71 -36 -4 -7 -89 -10 -49 -17 -37 79 -40 -90 -15
1109 -15 -17 -34 -92 -60 -31 29 26 -11 -39 -26 -3 -65 -67 11 -20 56 -49 -2 -87 -55 124 159 22 50 59 -93 -7 -2 -62 142
1139 142 24 33 -29 42 91 -5 -39 -212 -80 -6 38 -16 -23 65 -39 131 -26 0 64 -12 52 75 119 -8 81 -88 -42
1166 -42 -91 51 15 -151 50 -57 34 44 27 23 18 -43 115 25 -138 56 18 58 15 -44 85 -67 21 40 -46 -27 10
1193 10 -10 10 -75 2 -110 -20 22 109 131 62 -5 -73 76 9 -177 -45 69 -38 -59 -131 23 7 -54 17 -153 29
1219 29 -78 -8 91 -10 -53 -57 -19 -43 32 39 -98 35 41 9 30 -5 110 125 27 30 -105 57 4 -129 -35 -10 -1 100
1247 100 69 -17 -66 -25 -116 36 61 39 38 53 49 19 58 -13 -10 40 -26 -45 -52 16 -46 31 -87 7 -8 -137 -24 -13 3 -88
1277 -88 -16 40 -43 111 10 -95 90 -30 -103 -30 8 -30 96 -85 62 123 -115 -63 -27 39 40 -22 8 -43 24 50
$$ packed form
1079Hk9P5j02pR0mq3p2J12%j7l4L8R3q8M6j4N9j07L2lq2P9l9L2k0J16j19n0P5
1109a5kj7n8L2K9O0ll7k8J3K3o2kP8l1P6j05M7q5L2J79L5j37K8Rj52Q6No0K04
1139A42j18Ro2P1M9r6l4j73J32P4M4n4pQ8j04J70j57K6O4p6O4K3M4j27Q9j69M6
1166d2m9J42l6j66K01j07R1J0j7mno1J58r0j63J94l8M0m3n9J29j52Q8J9q6J9L7
1193A0k0K0q5P7j12R0M2Q7K2o9o7o8J49o7j86J32J14j07k1p2J54j6o1P1j70J82
1219B9j07P0R9j01m3mL8k4P5Pj37J33Ol2K1l5J15J5r8Lj35J62n3j33R4K5RJ01
1247A00l1q6m9M1r1J52K5k2jJ5ml0L9p1LN0o6j9pO8o2P7j18R4j5j29J13J1J6r1
1277h8P2N6q3J54j01j05J85j20p3P3L8l8J26j81J47O1k38N2L6O6Jo2L0n1O7K6
$$ plain form
1303 50 28 48 -41 -20 81 30 75 6 -26 -17 -83 9 34 -47 41 -34 36 19 -24 -6 -4 -1 66 -10 -39 -63 -94 3 -50 -43 83
1334 83 -2 78 107 -40 -31 -55 25 -24 -63 28 2 -92 28 12 56 -53 40 84 -4 -32 -55 93 -51 -6 51 18 -51 10
1362 10 -18 -38 -20 -23 -90 -2 91 51 14 -46 -136 -10 7 -41 -52 67 49 -17 -40 -24 4 -27 5 137 -19 51 105 -101
1390 -101 75 47 -84 -19 0 2 115 99 -73 19 30 7 29 13 -108 -71 37 10 -2 -35 16 71 52 -72 -31 -85 -1
1417 -1 83 2 -53 43 133 21 79 -84 -37 5 10 63 17 80 -47 68 40 8 -32 -112 -51 -19 14 60 -61 -54 14 -46 -95
1446 -95 -51 20 -46 -20 -21 56 44 26 35 114 13 -38 -74 28 -6 58 65 62 28 12 -16 53 24 -7 48 32 139 -54 43 -47
1476 -47 86 42 -14 54 38 9 -32 -76 -27 13 61 60 -68 40 44 -66 -8 -21 41 22 -20 111 -89 -63 -22 -53 -6 185
1504 185 -29 58 -26 133 -74 68 5 38 11 -24 -11 22 -106 52 -54 94 3 33 -2 -20 -69 -78 -139 -10 12 46
$$ packed form
1303E0k2K0q9K1J01n1M5o9l2Ro6R2K5q1Q8p5P0j7m3J8KLO7p6k9k4l1R7n3PJ26
1334H3q5Q0K9j47Rk4Q0m9l9R1k6r4J20j6M4j09R3M4q8k8k3J48j44M5N7l3o9O1
1362A0k8k0J8lo7Q8R3m0l7o0r0J26J7m8j1J19j8o6k3J6K8l1L2J32j56P0N4k06
1390a01J76k8j31O5J9KJ13j6j72R2J1k3K2j6j21L7J08k7j2l3N1N5j9j24M1n4Q4
1417aQ4q1n5R6R0j12N8j63M7M2NN3m6O3j27J15k8l2m0q0O1L2L3M6j21PO8o0m9
1446i5M4P1o6K6jP7j2j8RP9j01n1l6J02l4O4Pll4j6k8O9k9l1N5j6J07j93R7r0
1476d7J33m4n6O8j6k9m1m4M9M0M8jj28J08Mj10N8j3O2j9m2J31k00K6M1l1M7J91
1504A85k14Q7q4J59k07J42o3L3k7l5J3L3j28J58j06J48r1L0l5j8m9ro1J29K2L4
$$ plain form
1530 46 86 -45 -35 -34 -2 -51 -51 78 -77 -43 102 1 -41 69 -35 10 60 -6 -23 -18 56 -30 54 63 18 -54 47 8
1558 8 -5 -70 10 28 -5 0 -76 50 -62 -74 23 19 -37 62 49 -23 22 -34 55 -18 26 46 95 -31 89 -37 65 115 -55
1587 -55 41 -73 122 -16 -11 19 49 16 12 13 48 11 6 -35 -3 -56 17 -45 112 94 -81 -102 3 -39 -57 -14 -50 -22 -78
1616 -78 -4 63 -7 32 31 -38 38 81 -32 45 -104 -98 38 -67 -63 -43 -76 154 -3 -66 3 119 77 111 -30 30 -50 -82
1644 -82 17 -16 18 -50 82 29 -34 -64 -79 -78 -28 -24 69 15 35 145 -22 -58 -31 16 5 -67 -50 -30 32 39 60 39 -61 -13
1674 -13 -22 15 -102 93 38 72 -62 35 -82 -21 -19 21 142 121 -34 61 -38 -52 -13 110 -56 24 62 85 44 35 6 14
1702 14 6 -137 -13 -59 61 -81 -168 56 36 -144 21 -5 -38 89 11 122 54 -21 56 -44 76 -44 2 70 25
1727 25 17 -54 -59 -9 -139 25 49 -44 -16 18 49 82 88 -48 59 -1 74 -116 -84 -41 -112 40 -24 40 -41 8 29 -37 -59
$$ packed form
1530D6M0j31J0JL2m9%J29j55L4J45j01m2J10j04M5N0o6j7NP4q6Q4Rm5p2J01l9
1558Hj3o5Q0J8l3Np6J26j12j2R7mn6R9j3p2M5n6Q9p3M4K0M9j26J20j26J02N0j70
1587e5R6j14J95j38NL0L0l3mJL5l7nm1L2n3P3o2J57j8j75k1J05m2j8M3l6K8n6
1616g8P4O7p0L9jo9P6M3j13P7j49OJ36j05MK0l3K30j57o3O9J16m2L4j41O0q0l2
1644h2R9l3L4o8J32n3o3l0j5JN0MR3n4K0J10j67l6K7M7j1p2J7K0O2PK1k1j00M8
1674a3rL7j17J95n5L4j34R7j17O1KM0J21k1j55R5r9j4L9J23j66Q0L8K3m1rk9Q
1702A4qj43J24m6J20j42q7K24k0j80J65k6l3J27p8J11o8p5P7j00J20j20M6O8m5
1727B5qp1nN0j30J64K4r3K8L4L1L3Oj36J07o0P5j90L2M3p1J52o4O4q1M9K1o6k2
$$ plain form
1756 -59 -89 21 4 -73 94 50 66 10 -41 117 -5 -7 -35 67 -18 141 15 36 -40 102 40 32 22 30 -64 -19 -15 -66
1784 -66 -84 -8 10 91 68 -161 -2 141 -40 16 31 58 -14 -61 15 -38 -107 134 67 -86 -85 107 -11 -3 44 22 -8
1811 -8 52 95 41 -32 75 -49 -32 -40 64 36 -19 33 -26 37 -34 50 -8 -49 -6 43 56 -7 13 71 -4 34 -12 47 -9 -85
1841 -85 27 -4 72 -34 61 37 34 -36 -48 26 61 69 -29 -30 23 -39 -14 7 5 -10 -38 14 -121 25 -52 49 -135 19 70
1870 70 2 -50 5 -99 -187 25 -25 83 -54 -49 53 48 31 -97 -9 -37 12 -29 13 -7 -84 86 -7 85 78 -30 -65 16
1898 16 -40 10 -3 71 82 -1 51 93 80 91 40 78 43 -70 32 -27 -84 -49 -15 -13 63 8 -42 19 -1 -63 8 51 -85
1927 -85 -33 -101 -45 51 12 65 23 -8 -53 -74 46 77 45 114 70 21 19 67 -1 -7 -1 74 17 -51 63 91 -122 -14 -8 10
1957 10 -12 -49 -21 23 -180 -29 -72 -50 -26 -56 23 -12 133 -118 54 58 87 7 -9 -45 -78 -70 -10 46 35 -15 5 -90 41
$$ packed form
1756e9l0J10j7p7J67m4J6n6n1J58j22kk8J02q5J59j26K1p6J42o2qj0Qr4M5Mn1
1784f6j8P6J8Q1k3k29J59J43j81N6J5K7p2m7P6n3o9K41o7j53JJ92j18QM7k2l0
1811hO0M3n4p3J07j24J7qJ04k8n5N2n9O3p1Q4n8m1M3M9J3o3K0N8p5L8m6N9n6p6
1841h5J12l1P6j06R5k4lp0j2P4L5Qr8jN3o2K5K1kj5k8N2j35J46p7J01j84J54N1
1870G0o8n2N5j04q8K12n0J08j37NJ02nj7j28Q8k8M9m1M2k0p7J70r3R2pj08l5Q1
1898A6n6N0j3P4J1q3N2M2j3J1n1L8l5j13J02n9n7L5L4KP6n5n0O1k0o2P1M3j36
1927h5N2o8N6R6l9N3m2l1m5k1J20L1l2O9m4m9kM8o8oOP5n7o8J14K8k13J08OJ8
1957A0k2l7K8M4k03J51m3K2K4l0P9l5J45k51J72MK9q0j6l6l3QO0N6j1n0K0r5J31
$$ plain form
1986 41 0 76 36 51 60 12 21 -52 6 11 -25 56 88 92 -77 29 -12 -106 70 -122 75 -55 14 57 -19 16 -96 -27 -86
2015 -86 -16 75 93 22 154 101 -24 -11 135 84 -65 -37 -43 -87 -58 38 70 -43 -27 31 -1 56 146 -54 -20 -74 29
2042 29 -10 -79 -99 25 -25 10 51 95 -187 -5 82 -62 127 24 11 -56 -30 56 -14 -30 114 47 -34 -39 0 -137 -1
2069 -1 59 -69 71 -75 -56 -174 -1 -37 -65 -100 -53 -69 92 -45 -15 -70 77 69 5 29 -59 -38 -83 -100 -85 60 35
2096 35 17 161 21 0 80 16 85 -2 -54 123 35 -21 -125 -8 -87 26 -21 5 -131 34 55 -67 17 -72 11 104
2122 104 -21 -17 82 80 -57 8 44 -110 -54 43 62 -53 9 12 -81 -23 66 68 39 -15 108 21 -76 116 15 41 17 -15
2150 -15 19 -52 -71 30 64 45 -35 0 31 -47 55 -44 19 12 78 -38 -46 52 -47 49 -107 -77 17 66 -9 20 -12 76 3
2179 3 -12 55 -18 75 53 70 49 -86 -60 -62 60 55 29 -68 -58 -36 68 48 32 66 3 -15 51 57 84 50 -140 55 -31 -101
$$ packed form
1986D1m1P6m0J5Rm8Rp3N8Nl6Q1L2Mj69J06m1r4J76j92J97j30O9M3p6L5j12O9n9
2015h6P0R1J8p1J32n3j25J3J46n1j49K8om4K9R6L2j13J6N8l2N7R0k00L4n4J03
2042B9l9o9k0J24n0L5M1M4k82J82Q7j44J89j03j3o7K6Q6p0j6J44o7q1nL9j37J36
2069aO0j28J40j46J9j18J73l6k8l5M7j6J61j37L0n5J47qo4K4q8K1m5j7J5J45k5
2096C5j8J44j40k1Q0o4O9q7n2J77q8n6j04J17p9J13m7K6j36J65K1j22Q4q9Q3R3
2122A04j25MR9kj37O5L6j54N6R7J9j15O2Lr3N8Q9Kk9n4J23q7r7J92j01K6k4l2
2150a5L4p1j9J01L4j9q0L5L1p8J02r9O3pO6j16qR8r9R6j56L0R4M9p5K9l2Q8p3
2179Cj5O7p3R3k2J7k1j35K6kJ22nk6r7J0K2J04k0j6L4o3j8O6OK7l4j90J95q6p0
$$ plain form
2209 -101 -67 -159 -30 -16 50 -32 52 70 7 -47 24 -39 -11 39 111 3 83 -65 74 84 13 -48 -64 57 99 -43 33
2236 33 92 77 82 4 120 -53 62 -41 -89 -63 57 77 -29 -71 -4 45 -56 -12 -72 59 -50 -37 -54 27 -41 -1
2262 -1 71 -88 -10 21 -56 6 -79 32 29 -40 34 12 26 20 -6 24 5 26 91 -66 54 -2 -4 66 -71 -35 -6 -90 -27 27
2292 27 -8 -29 132 -77 53 -10 -62 -13 30 69 80 -26 64 -25 -84 7 -18 74 -78 -1 67 -9 -14 -26 -64 -14 -16 -34 -12
2321 -12 44 -16 38 -63 2 -24 14 -20 -81 -108 35 40 -30 -50 83 22 -13 73 74 -59 44 -49 -50 5 29 -27 94 50 29
2350 29 32 -89 -39 -16 -27 32 -23 26 78 31 -14 -20 27 22 104 49 42 56 -3 9 4 16 -32 -8 -40 82 -13 -97 55 -7 4
2381 4 20 -15 -3 -36 120 -28 36 42 17 52 0 -26 46 36 13 -93 -27 -39 -30 -19 -39 18 29 11 -67 15 -33 -99 -137 -95
2411 -95 26 0 -40 78 7 -8 95 -31 -82 -95 -20 71 -29 -70 -46 61 -54 13 0 17 -2 -110 12 -8 -47 70
$$ packed form
2209a01L4r2J29J4O6q2Q4J8o3n4P1o3K8N0P2j08Q0j48J39J0p1o1j6J21M2j42P6
2236C3N9j5Np8J16j73J15j03m8K6J20K0j06m2O7M9j01M4o0J31j09J3j7Q1o8M0
2262aP2j59P8L1p7O2q5J11lo9P4k2J4ok6L0j9K1O5j57J20n6kP0j37L6K9q4O3N4
2292B7l5k1J61k09J30o3n2M9M3L9J1j06R0q9n9R1k5R2j52P7O8p6nj2l8N0kj8K2
2321a2N6o0N4j01O5k6L8l4o1k7J43Np0k0J33o1l5Q6Jj33J03r3jN5K4n6J21m4k1
2350B9Lj21N0K3j1N9n5M9N2m7m5oM7nQ2n5pJ4n9J2nJ2m8K4l2J22r5q4J52o2J1
2381DJ6l5J2l3J56j48O4Ok5L5n2k6P2j0k3j06O6j2RJ1k0N7J1j8p8Q2m8o6l8M2
2411i5J21k6m0J18p1j5J03j26n1j3P5R1j00m1K4J07j15O7j3J7j9j08J22k0l9J17
$$ plain form
2437 70 24 -96 140 -67 65 96 -5 -66 9 41 -89 45 4 39 -1 -52 -87 14 64 -89 17 101 -132 -30
2461 -30 70 -60 35 26 2 46 -21 -9 4 87 -127 -2 140 10 -3 27 32 47 5 -89 86 57 -17 51 50 -143 40
2488 40 104 -73 -42 16 -14 -22 28 37 -49 -12 -151 -54 19 24 -6 -83 2 -16 30 -60 -104 -59 19 18 40 -46 -82 32 -20 -45 5
2519 5 -69 48 14 45 43 -51 -9 59 -108 -71 72 -17 21 65 42 33 102 -44 -17 -53 -55 110 40 -81 -7 -33 -29 55 20 24
2549 24 59 7 -11 95 -22 -104 4 -29 15 -11 -65 -73 -69 -81 -66 -70 -18 82 8 75 -44 23 -38 31 5 -12 -4 32 0 44
2579 44 -5 34 -2 -80 10 -36 -41 -26 -64 -37 17 -67 -22 -70 -65 -54 18 56 -25 16 26 -17 62 17 56 -84 0 41 -40 -73 71
2610 71 37 31 -46 3 77 -90 37 13 87 -38 -138 -8 78 88 58 -7 69 52 -34 11 -29 -87 -38 67 -42 -17 -51
2637 -51 18 57 85 -10 20 44 45 -7 -14 -47 27 -43 -110 -57 38 -73 12 -26 3 -23 -42 66 21 13 51 12 -14 8 -2 -8 -103
$$ packed form
2437G0m6j20K36k07J32L1j01o1P5L2j30J34m1L5m0n1l5J01N0j53J06Q4k33J02
2461c0J00j30R5rk4M4o7J2J3Q3k14J25J42j30j3L0NJ5m2r4J75k9p4O8jj93J83
2488D0O4j77L1N8l0qN0Rq6L7j39R7P3Nl0p7Q5j8M6r0m4M5P8jK2q6l6J14n2k5N0
2519Ep4J17l4L1kr4M2O8j67L7J43q9L8M4k3rO9j46K7l6kJ65p0j21P4k6MQ4l5M
2549B4L5n2j8J06j17q2J08l3M4k6n4qMj2J5mN2J00p4O7j19O7o1O9k6j7QL6l2M4
2579D4m9L9l6p8R0m6nJ5l8K7N4q4M5m8NJ1P2L8q1M1J0m3P9m5L9j40Q4M1q1l3J44
2610G1l4op7M9P4j67J27k4P4j25j00J30Q6J0l0o5P6j7q6M5m0n8M9J05j09K5l4
2637e1O9L9K8r5L0K4Jn2pl3P4p0o7N3R5j11Q5l8K9k6j9J08m5qL8l9k6K2j0or5
$$ plain form
2668 -103 -27 -31 -67 20 -108 45 45 -49 -34 -9 17 32 61 30 19 -57 10 -37 -27 64 15 13 4 20 43 87 7 -19 -19 65 43
2699 43 -14 30 -13 -56 -10 -74 -77 -67 -46 -32 -94 -6 -2 34 42 -20 -2 44 59 10 123 -115 -126 31 -69 59 104 -39 3
2728 3 -76 37 65 72 20 22 35 -30 60 -85 -17 -65 143 -25 -75 111 91 41 -46 -68 116 38 4 3 -2 -120 -5 -58 -27
2757 -27 -25 -12 -23 85 28 -53 -27 -22 21 38 -10 -49 22 -22 87 -43 53 -9 4 126 -4 96 15 132 -2 32 0
2784 0 -1 69 22 42 36 -53 15 37 71 -2 58 18 -38 -37 78 40 -58 -29 -48 21 -14 76 -139 42 -23 -41 -16 23 -136 25
2814 25 -59 16 39 -79 -20 -56 -35 -21 -4 28 -26 25 -32 -41 79 48 -47 -22 -82 -33 -39 -6 52 21 2 -63 53 -86 -31
2843 -31 15 -9 -43 20 35 -26 -5 -54 21 40 8 32 -15 -97 -55 42 -60 -77 82 -17 -44 104 2 -6 46 -117 0 4
2871 4 47 -18 87 4 86 -47 9 -83 -42 38 61 12 -58 30 13 24 -65 -107 -56 47 -35 32 35 28 -20 95 49 -40 -122 -31
$$ packed form
2668a03P6ml6Q7j28J53%r4J5K5K6J5K9l1j1p6O7m7J0R1m9krJ6K3M4q0k6%Q4k2
2699D3n7M4m3m3M6o4lJ0K1J4o2Q8ML6Qo2J8M6J5m9J13k38j1J57j00J28M5j43M2
2728Cp9J13K8Pn2KJ3o5R0j45O8m8K08j68n0J86k0n0q7k2J84p8l4jnj18J15n3L1
2757b7KJ3j1J08n7q1K6NM3J7m8l9P1m4J09j30R6o2J3J22j30J00q1J17j34L4l2
2784@jP0m7K0oq9O8K2L4p3O0m0n6JJ15l8r8K9j9O9l5R0k15J81o5j8K5L9j59J61
2814B5q4P5K3j18N9l6K1J4J7L2n4N1n7rJ20l1r5K5o0M9oL3N8l1j9o5J16j39N5
2843c1M6k4l4O3J5o1K1m9P5J9l2K4m7q2M2R7j02j7J59r9k7J48j02qN2j63J17M
2871DM3o5J05q3Q2j33N6r2M1Q0K3m9p0Q8j7J1q9m2N1J03q2O7Lpm8J15m6q9q2R1
$$ plain form
2901 -31 45 23 -36 51 10 36 -31 118 -24 74 42 -94 -90 -18 -32 -24 78 56 29 -33 25 33 -5 -61 18 35 -31 10 64 -73
2931 -73 5 66 -52 -119 -133 -18 -114 -44 -33 34 -27 -8 148 8 49 15 52 54 92 -74 -48 1 67 100 58 -64 23 70
2959 70 71 95 -9 -32 0 0 27 63 61 56 32 52 16 65 -48 86 -18 -63 66 17 42 40 45 -47 7 -29 10 -19 0 20 -42
2990 -42 -35 10 -17 105 -11 -57 86 40 -18 -43 125 102 32 50 -45 -73 -63 -31 -97 46 -40 -10 -95 -76 -193 -35 42
3017 42 16 55 30 -47 -12 50 -26 12 -37 -8 90 118 68 15 -61 86 -52 110 -16 -86 51 13 54 1 30 -24 -46 77
3045 77 120 -89 37 17 -59 -65 -16 -70 -125 8 -65 -17 117 -101 -10 -7 79 -57 26 -56 -46 -43 15 -23 121 21 -100
3072 -100 -13 24 46 52 -60 -65 -83 -74 -57 -64 34 93 67 -35 12 -56 -9 -43 -22 34 -66 17 -49 139 -47 -74 -58 -44 -102
3101 -102 -36 -120 -27 -39 44 50 74 -24 21 32 49 -7 -13 43 -25 27 95 40 -14 84 79 147 30 -52 -22 19 -81 53 -44 -32
$$ packed form
2901c1P6k2n9Q7m1K6o7J49j42R8l2j36MP2j4QJ02k2k7o2N8Ql8n6P9J7o6M1N4j37
2931g3P8O1j18o7j4J15r6P0J1O7o1J9J56j40M1l4L7KL8j66K6M9O6L3m2j22Q7M7
2959G0JK4j04k3L2%K7L6knk4K0l6M9j13J34j04m5J29m9K5kNr2N4l6L9k9J9K0o2
2990d2PM5k7J22j16m6J43m6n8k5J68k3p0J8r5k8J0L2o6J43q6L0q5J9j17J58P7
3017D2k6L9k5p7L5O2p6L8m9K9R8K8n0n3p6J47j38J62j26p0J37l8M1n3K9n4k2J23
3045G7M3k09J26k0p6oM9n4n5J33p3M8J34k18R1LQ6j36Q3q2J0LN8l8J44j00j21
3072a00Q7L7K2Oj12nj8RJ7pR8N9k6j02M7o8M7l4K1N6j00Q3o6J88j86k7J6J4n8
3101a02O6q4R3j2Q3OK4r8M5J1J7n6oN6o8N2O8n5n4R8nO8j17q2L0M1j00J34r7J2
$$ plain form
3131 -32 126 -75 -8 79 -60 26 -67 31 0 30 -68 6 -67 86 -107 -41 -82 -22 -133 -56 -139 -29 -51 33 -35 52 16
3158 16 40 -32 63 132 -14 13 -105 -45 -24 -53 -16 -25 -40 -10 -34 -58 -47 -20 -48 -25 2 34 14 -42 93 189 60 0 37
3187 37 99 27 -138 -10 -20 -158 -42 122 49 -44 48 -6 -1 2 57 20 54 72 12 63 23 51 30 0 -10 -49 18 -78 -34
3216 -34 -20 85 2 89 24 73 33 9 10 -38 -77 19 42 -78 76 62 29 28 0 -76 -64 -8 21 5 39 2 -60 57 54 17
3246 17 14 27 61 -37 -49 -105 74 42 -58 -19 8 53 55 -2 43 32 -50 -49 19 -23 -146 -129 28 -48 35 -39 -17 6 56 20
3276 20 71 -18 126 8 2 46 10 28 2 -81 -69 -9 72 57 94 -38 -106 7 56 -46 49 -11 -37 26 -64 -2 16 -88
3304 -88 15 -24 -34 -83 -84 129 8 33 -49 -58 110 34 -93 -26 39 65 95 2 -183 -74 52 -64 -78 86 10 47
3330 47 -41 -115 -35 -24 -21 1 -3 3 -42 32 -74 32 61 -50 40 -97 12 -30 -49 80 36 -12 121 -22 -51 17 -34 108
$$ packed form
3131c2J58k01O7Q7j39Q6r3R8l1L0r8P4p3J53j93O6m1O0j11P7q3J10k2Q4o8Q7l6
3158A6K4p2R5O9j46K7j18O0K1k9L7rj5L0k4k4J1K7k8K3K7L2k0n6J35R6j29o0L7
3187C7O2p2j65J28j0j38J16J64p3r3R2n4NLN5l7L4J8o0N1m0K8k1l0j0l9O7r6M4
3216c4J4J05q3Q7o5M9m0k4Jm8l9R6K3j20J54j4l3jk8p6J2N6K9j6L4l7o2J17ll7
3246A7lJ3L4r8j2n6J79l2j00L9K7M5Kn7M5j1q2JO8m2j23J7J57p6Q3p4K2K3N0l6
3276B0N1q9J44j18oM4l6J8k6q3J2O0Q1j5L7j32o8J13M9j02R5o0k6O3r0O2J8j04
3304h8J03l9j0m9jK13j21K5q2rJ68p6j27O7O5K6L0r3j85J09J26j16j4J64p6L7
3330D7q8p4Q0J1LK2mOm5P4j06J06K9j11R0j37J09m2j9J29m4m8J33j43k9O8n1J42
$$ plain form
3358 108 -9 -8 3 -11 11 -71 43 138 -37 -66 -101 -34 -21 -1 -51 -54 27 -4 -42 61 -34 71 -85 -3 49 -23 128
3385 128 36 -90 58 -39 11 18 -26 -1 -51 -52 27 -7 -109 38 5 -45 -108 -33 -16 -45 -22 -129 -62 35 71 47 39 -55 -30
3414 -30 120 -56 24 -81 -126 72 -31 90 3 -143 -49 -185 64 -21 -73 -117 -49 29 40 15 43 115 -11 57 25
3439 25 -33 -2 -59 -34 -14 54 -3 -2 116 -52 11 25 119 -115 14 140 159 -42 59 17 -75 -79 -96 -96 -29 22 -40 97
3467 97 -1 68 21 -52 -47 -54 50 -31 25 -76 -19 56 -14 109 18 36 30 59 -31 -3 122 172 13 -14 24 8 -18 -8 -95
3496 -95 -2 -71 32 5 -96 141 -12 115 -6 30 -55 -55 -5 14 -4 48 -22 -64 -23 -16 -21 -8 -69 -14 -109 -138 29 -73
3524 -73 20 -17 -17 -90 -18 26 -45 -76 41 -96 131 -31 85 81 99 115 -30 87 46 -51 -20 34 -8 44 118 37 10 58
3552 58 93 -13 -23 -61 -59 52 -1 -44 32 69 0 29 56 7 -18 61 58 26 97 51 -68 3 15 15 51 50 -19 -87 46 37 -13
$$ packed form
3358A08j17JJ1j4K2q2J14R5j75k9l5O7J3K0n0lQ1l1l8J03r5J05j56Q2N2p2J51
3385A28r2j26J48r7N0Pm4K5n0jP9l4j02J47l3n0o3P5J7k9K3j07O7R7L6k4qr4K5
3414c0J50j76Q0j05m5J98j03J21q7j46R4j36K49q5n2m4O8P8J1k5K8P2j26O8l2
3439B5n8L1n7K5K0O8n7JJ18j68O3J4R4k34J29J26J9k01J01m2r2mj7%O7N1o2J37
3467I7r8O9m7p3NpJ04q1N6j01N7P5p0J23r1J8oK9r0K8J25N0j59k7L8j6k6J0q7
3496i5R3o9J03k7j01K37j53J27j21L6q5%N0J9j8N2p0m2M1PnJ3o1N5r5k9J67j02
3524g3R3l7%p3P2M4p1l1J17j37K27j62J16mJ8J6j45J17m1r7L1N4m2N2P4q1k7M8
3552E8L5j06j0l8KJ11n3m3P6L7o9K9K7m9k5P9ll2P1m6j19P1J2%L6jo9o8J33rn0
$$ plain form
3583 -13 2 -103 -90 31 16 -32 -62 -101 25 27 -61 -7 28 -1 8 -29 122 -119 19 131 -3 -88 -50 -70 77 -8 10
3610 10 29 41 12 42 -19 -15 72 50 -56 13 44 -24 -2 39 -23 66 13 -14 -141 -64 12 -23 57 -119 2 -34 14 -31 9
3639 9 -9 -89 31 42 -110 -67 64 -15 41 -5 7 48 -94 -51 -38 121 120 26 50 -24 32 -74 -4 31 -39 -15 29 46
3667 46 62 87 5 39 -37 -12 -11 -36 61 83 5 106 -62 -99 40 77 42 52 -95 -6 -66 -21 -37 57 -45 28 38 -119
3695 -119 28 -29 -15 15 -9 -51 62 38 -125 -35 -109 -54 -70 77 -56 -101 34 -91 2 29 -56 4 -42 43 11 99
3721 99 27 -4 -24 66 9 40 103 -103 14 -8 -6 -48 -108 -59 6 6 43 86 -107 92 35 72 -84 26 -23 48 -73 -18
3749 -18 -107 -23 110 73 34 89 147 8 -36 17 -9 -33 61 147 -13 -7 -83 -6 -104 13 113 82 -160 -9 -13 -46 80
3776 80 -54 -48 -89 63 34 -59 55 94 57 -20 27 9 6 -28 -24 -57 -46 56 33 -27 -18 36 -17 -50 16 -40 73 44 10 -36
$$ packed form
3583a3J5j05J3J21j5m8l0l9J26Kq8N4L5k9Rl7J51k41J38J12j34q5L8k0J47q5J8
3610A0J9J2k9L0o1MQ7k2j06O9L1o8K2M1o2Q9n3k7j27P7P6l5Q0j76J21l6M8m5M0
3639Ij8q0J20J1j52M3J31p9N6m6J2M1j42M3J3J59jr4K4p4N6j06P0L5p0K4M4J7
3667D6J6K5q2L4p6K5Jk5R7K2p8J01j68l7J39L7l5J0j47Q9o0M5j6R4j02P3J0j57
3695a19J47n7J4L0k4m2J13k4j63R0p4N5j6J47j33m5J35j25R3K7q5O0m6Q5l2Q8
3721I9p2l1k0R0n7L1O3k06J17k2Km2o0M9O5%L7M3j93J99n7L7j56J10m9P1j21N5
3749a8q9Q4J33l7l9N5N8j39m4N3k6k4R4Q6j60Op6P7r8J17J00l1k42J51ml3J26
3776H0j34Om1J52k9r3J14L9l7p7M7j8ll4Ml3J1J02k3o0RN4n3l3O6n6J13k9l4m6
$$ plain form
3806 -36 -8 111 4 -26 -49 46 12 -18 -72 8 16 -23 11 -1 69 -93 -24 -36 -10 -20 43 27 12 -18 10 21 75 -49 -32
3835 -32 71 -18 -74 28 -102 -52 -60 32 -26 46 39 -65 41 -49 -34 -45 -40 38 59 -6 16 -52 -116 -14 74 -10 -30 -78 30
3864 30 -26 39 -5 7 -75 31 25 85 14 89 -32 -27 -43 15 138 38 -27 -1 18 32 51 -66 64 -62 -69 16 -37 -12
3892 -12 52 66 -40 -10 20 -89 -14 -19 26 -12 -6 72 18 53 20 -83 41 -57 -71 36 -105 -79 99 -52 17 -65 18
3919 18 40 -61 0 -43 -41 16 -90 26 40 -74 1 15 -40 -7 47 -149 108 -20 6 -10 18 -13 7 7 77 68 -81 117
3947 117 54 -53 7 71 -13 -45 -105 -52 52 -27 117 -86 48 -18 -46 143 -76 16 -33 -6 47 -50 -24 -17 -55 35 67
3974 67 -26 -33 26 91 52 -125 0 105 -69 -52 78 6 97 -14 -145 89 -77 -53 -24 -23 14 20 21 66 -15 -55 5 -12
4002 -12 -13 64 19 32 -29 37 -38 -6 -6 70 -61 89 64 -36 6 -150 -21 -15 119 -6 41 33 -96 52 -25 0 -68 -32
$$ packed form
3806c6K8J19j07l0k3R5l4l0n4Q0Ql9L4j2P0j62O9j2K6j0O3j6j5l0K8J1N4j24J7
3835c2J03q9n6J02j30N0qR2n8P2pj04J06r0J5j1NP8K1o5K2o8o4J02Q8q4k0m8J08
3864C0n6O5m4J2q2J06oO0p1P5j21Nj6N8J23j00o5K6J9J4J9j17J30j26pQ5n3K5
3892a2O4J4j06L0L0j09P5nM5l8OP8n4L5l3j03J24r8j4J07j41K6J78j51O9q2Q3
3919A8K2j01O1m3KN7j06J16J4j14P5J4n5L3N4j96K57j28K6j6K8l1K0%P0rj49J98
3947A17o3j07O0O4q4l2o0N3J04p9J44k03J34o6k8J89k19R2m9K7N3r7K6Pl8R0L2
3974F7r3pN9O5l9j77J25J05j74J7J30p2R1j11j31K34j66K4K9JL7OJM5q1m0O0j7
4002a2jP7m5J3o1O6p5L2%P6j31J50k5j00M2j56J29OJ34j25M7qj29J48p7K5o8L6
$$ plain form
4030 -32 -27 -14 115 109 61 41 23 43 -12 -39 -5 81 -4 66 -161 102 88 10 -11 -17 -29 54 -9 0 17 -19 129 19 27 -42
4060 -42 11 11 51 -14 26 -16 20 -27 123 -52 34 -11 6 -30 -52 -77 103 88 20 32 9 106 -27 25 -9 87 -13 67
4088 67 26 -42 -98 -71 16 -54 133 -30 32 155 34 39 -17 56 -30 -1 76 -54 51 -54 -162 -93 16 55 -7 71
4114 71 65 -98 75 -50 14 -3 -11 -10 -36 13 82 -78 -42 41 0 41 -83 33 2 -16 75 -87 -24 -65 16 -2 28 55
4142 55 -111 -37 -42 -2 14 -86 -35 -63 -29 57 13 -31 118 -112 -55 -1 -36 -2 69 42 30 16 -17 13 -33 -36 -37 82 -10
4171 -10 -119 99 -29 69 64 -44 62 -34 65 -59 84 7 49 -91 -12 35 25 13 -24 11 -35 -26 8 57 -113 -23 37
4198 37 -41 -108 -96 194 14 -7 -71 -9 -29 18 -38 -68 36 22 7 2 -75 -32 -101 41 -42 -18 -120 61 37 43 24 6
4226 6 -92 -17 31 -14 50 1 14 -66 -72 -31 -54 8 -86 43 -50 -60 -89 -67 78 -43 4 -91 12 -26 23 99 59 -65 -6
$$ packed form
4030c2NJ3J29om8k0j8K0n5k7L4Q6q5P0k27K63j4p8k1oj2Q3o3RJ7l6J48j10Qo9
4060d2N3%M0o5M0m2L6m7J50j75Q6m5J7l6k2k5J80j5o8J2k3R7j33N2l4R6j00Q0
4088F7m1o8n6K7Q7p0J87j63O2J23j21Nn6P3q6K9P7j30J05j05j08O9J09L9o2P8
4114G1oj63J73j25O4j7qJk6M9O9j60L6Q3m1M1j24J16l1j8R1j62O3m1Q1j8L0K7
4142E5j66P4nM0J6j00N1k8L4Q6m4m4J49k30N7N4l5L4P1k7j2j4l3L0m6ljJ19r2
4171a0j09K18j28R8nj08J06r6R9j24J43p7M2j40P9M7j0j2l7L5m6RL4M9j70R0O0
4198C7p8o7J2K90j80k1o4O2k0M7n6l0J04j4j5np7M3o9J42q3K4j02J81k4Oj9j8
4226Fr8P5M8m5O4m9J3q0oM1k3O2r4J29r3j0k9K2J45j21M7r5J03l8M9P6m0j24N9
$$ plain form
4255 -6 32 -43 47 -46 106 -33 41 -39 47 19 36 32 31 -16 -39 117 56 84 158 -142 73 51 -43 -7 -13 30 -112 -39 -28
4284 -28 11 8 37 98 -24 58 13 -1 73 67 5 83 -4 -105 -12 51 86 10 -17 -25 -61 -104 79 -43 -38 47 63 68 113 -115
4314 -115 -79 29 -25 -119 4 51 -37 12 -65 29 -26 -38 -3 -15 22 11 -5 -18 -47 70 20 -30 95 -7 -42 53 23
4341 23 -62 -84 -8 -90 81 3 42 -7 -35 46 -2 15 -69 -130 -184 -143 -35 -142 76 1 50 22 -106 40 -57 30 66
4368 66 16 -16 -79 -13 -7 -36 15 -113 -99 134 -124 36 24 31 -86 -64 -60 36 8 7 81 2 68 14 -52 42 -22 -64 48
4397 48 -21 -23 -31 95 -30 -26 -19 101 -3 -18 -39 -22 -16 35 -30 -44 105 -82 -60 -114 -28 -59 -3 34 1 -49 -59 46 -70
4426 -70 49 -172 -52 -19 22 -47 65 9 -38 -44 -15 10 -39 64 -106 -2 109 57 -52 -67 -35 -60 -4 -16 -78 108
4452 108 -40 -23 48 7 83 -29 -29 12 48 -33 22 -88 136 -18 -3 -156 -197 -18 13 -9 75 65 4 -21 39 -21 57
$$ packed form
4255fL8p5R0r3J52j39P4q0Q6k8J7mjm7k3J56o1K8P4l00K15k2r4L6oM3j42P3J1
4284b8L9lK9O1j22Q2m5j4P4oo2P8q7j01R3O3L5p6k7ql6m3J83j22NQ5J6NM5k28
4314a15L6J08n4r4J23M7q8M9p7R4n5j2L5j2L7j1j6j3k9J17n0n0J25j02l5R5l0
4341B3q5k2P6q2J71p8L9m9k8Q1m8J7q4o1n4M1J08j07K18p5M9k8j28J46r7Q7L6
4368F6n0l2o3O6Ok9N1j28J4K33k58J60j2Pj17K2MR6k8jP4p9O6n4o6R4o4m2J12
4397D8o9kqJ26j25MPJ20j04j5k1J7ON1o5j4J49j87K2n4Q6l1N6L7l3n0j0J05j16
4426g0J19k21J20L3M1o9J12n6m7oK9K5m9J03j70J04J11n2j09j5L2k5N6j2o2J86
4452A08j48J7P1m1P6j12%M1L6q1N5j10K24j54J5j53m1J79L1k2Q4j0o1k5O0o0P8
$$ plain form
4479 57 -138 55 -57 -36 -102 0 39 -73 24 62 -27 178 54 26 -68 -14 -55 -41 1 -44 -159 60 -45 -62 65
4504 65 -46 6 -117 -73 -138 57 -36 -2 -61 8 -38 15 -24 -48 8 -32 -70 -74 75 -53 -61 43 -62 76 47 -76 -67
4531 -67 -35 42 -10 -35 -60 35 30 15 57 26 -13 -28 -53 23 72 -35 -70 26 84 -89 -62 68 -41 5 -1 -98 72 -30
4559 -30 -28 32 -67 -63 -110 -38 17 -94 90 -48 22 6 -8 47 -30 -15 -8 -117 8 -29 -67 115 -9 -101 116 78 110 -58
4587 -58 48 26 -10 -1 63 -34 -24 62 19 34 -17 22 20 53 -10 23 11 82 -79 -46 30 -143 -5 46 -59 -14 -108 15
4615 15 31 2 -55 21 -10 -44 -35 -24 -5 11 -42 -62 -36 116 24 41 -166 43 36 50 86 -3 -62 6 27 -55 -94 -75 14 -49
4645 -49 -49 -74 -81 -78 -42 78 -41 -46 7 113 14 31 -1 -66 98 14 118 -46 13 8 60 -13 -18 -17 -46 64 -8 -45 -24 -99
4675 -99 60 26 78 58 85 119 16 13 18 58 25 65 123 18 26 -69 -35 -49 68 50 20 58 -65 -88 22 9 -104 33
$$ packed form
4479E7j95J93j12K1o6J02L9j12R7L8q9K05j24k8r4N4m1J4M2m5j15K19j05j7J27
4504F5j11N2j23M4o5J95r3L4n9O9m6N3l9k4N6m0l8mJ49j28qJ04j05J38k9j23R
4531f7L2P7n2k5k5R5nj5M2l1l9j5k5P6M9j07l5R6N8j73K7J30j09M6or7J70j02
4559c0KO0r9Mm7P2N5j11J84j38P0j6j4N5p7J5Pj09J25l7l8J82j24r2K17l8L2j68
4587e8J06k2l6RO4r7J0Q6m3J5n1L9kL3o3L3j2P1j61L3P6j73J38N1j05M5r4J23
4615A5J6k9n7P6l1l4RJ1J9J6n3k0K6J52r2J7k07K09pJ4L6q9n9O8K1q2l9J9Q9o3
4645d9%k5pLL6J20j19nN3J06r9J7l2o5J64q4J04j64N9nN2p3nJk9J10p2l7K1p5
4675i9J59l4N2k0K7L4j03lNM0l3M0N8j05Qr5L4j4J17j8l0L8j23k3J10j3j13J37
$$ plain form
4703 33 29 -113 -131 26 45 110 99 -30 26 10 -29 -57 18 78 -95 -25 -42 96 -4 20 -19 34 49 -17 -85 -32 -15 43
4731 43 -88 26 46 14 109 -144 -37 29 -70 -47 24 -3 43 154 -88 114 59 -21 -56 -12 62 89 -61 65 -46
4756 -46 -73 1 69 -50 -3 -30 -15 -31 13 41 -48 -11 68 111 -25 29 26 24 21 106 -49 -16 -52 13 -74 -35 -4 -27 -47 36
4786 36 -94 41 -5 -63 129 59 -23 29 75 74 -73 -20 6 42 69 -176 -51 71 27 -13 77 -39 83 -68 43
4811 43 -33 -18 123 21 17 -50 -8 -29 -14 -93 -12 82 54 -14 15 80 24 -96 163 -38 86 14 109 -96 -27 46 61
4838 61 96 101 -18 111 5 -106 108 15 26 24 25 105 -71 5 -45 71 -100 57 24 -2 62 -1 10 -88 42 -101
4864 -101 34 -133 22 -26 47 -136 43 18 52 -84 -19 41 82 -12 -39 87 -22 32 98 78 64 -123 14 -37 99
4889 99 31 -88 -43 -45 -127 -71 -51 26 67 42 -48 41 141 116 -124 -33 23 -50 -38 -182 -81 36 -14 4 12 111 28 35 65
$$ packed form
4703C3mj42j8J57J9O5j1j29N6j6l9k8P5O0j73P0j7J38j00K4l9N3J5o6o8N3J7N8
4731D3j31J14K0l2R5k53J07O6r9K3P1k7M6J11k42K02n5q0l5M4P4K7j50J26j11
4756d6k7P4O8j19M7k7J5j6M4K8q9L7P9M3j36N4lklQ5j55L3l6O5q7L9L1k3k0Q3
4786C6j30J35m6n8J92p0q2N2M6jj47N3K6L6K7k45J25J22m4m0R0j16J22j51J11
4811D3p6J5J41j02mo7M2k1J5p9Q1R4k8o8K9O5n6j20K59k01J24p2R5k05O9P3J5
4838F1L5Nj19J29j06j11K14r3J1kJQ0j76P6n0J16j71J57l3k6O4o3J1r8J30j43
4864a01J35j67J55m8P3j83J79k5L4j36O5O0M1r4k7J26j09N4O6k0j4j87J37n1J36
4889I9o8j19M5kq2N6K0P7M1k5r0Q9J00k5k40R1N6p3J2j44J01J17n0J8QR9q3PL0
$$ plain form
4918 65 42 -13 -84 57 -43 -25 24 70 125 -69 91 56 -121 -10 -28 40 40 122 4 -72 71 98 102 -13 23 9 -100
4945 -100 -5 -51 9 -112 -49 -17 23 69 -23 -14 -22 -41 20 -107 154 61 60 -9 34 8 33 35 -106 132 -37 -111 -30 163
4973 163 -73 29 104 -51 11 44 -47 51 -65 38 51 21 -125 10 89 -9 0 13 -9 -61 -118 -83 -68 -3 72 -7 -101
5000 -101 82 -33 116 -8 -86 23 54 -105 -41 -67 213 -1 -47 -40 75 101 -22 -106 -19 70 85 -173 -74 -80 -33
5025 -33 -70 -18 65 3 12 -107 48 -24 33 -104 -70 94 35 7 -51 39 4 -62 71 6 13 -73 -34 9 14 22 53 -1 124
5054 124 79 88 97 -43 -38 -169 -16 -77 -39 57 -35 -86 193 66 -35 58 79 -92 -101 -21 68 -11 -17 -107 -7 98 -6
5081 -6 -76 38 -34 29 -69 -31 40 -4 60 -46 -81 -32 -11 -63 97 20 59 13 -19 66 -32 -87 75 -65 19 -97 -32 -45
5109 -45 -6 109 -58 37 -51 -28 -13 23 22 -110 23 -42 -41 22 -54 -13 -48 82 89 -51 10 24 0 -17 103 -41 28 94
$$ packed form
4918F5k3n5p1J41j00J8M9M6N5j94J60l5j77J11j8O8%Q2j18p6J43K7Mj15L6j4j09
4945a00R5m6O0j21O3L2M0M6r2Rqj9O1j27K61r3jo9M3k6K5Kj41K38j69p4Q1J93
4973A63k36J02P5j55O2L3r1R8j16J03J3l0j46J35P9r8RJ3k2n2n7L5J5O5P5p9r4
5000a01J83j15J49j24p8J09L1j59O4k6K80k14m6PJ15K6j23q4Q7Q9J5k58R9oM7
5025c3l7N2Q3o2Rj19J55p2N7j37L4J64n9k8n8R0l5o6J33o5Pq6L9M3NQL1n4J25
5054A24m5RRj40Nj31J53o1L8R6r2n1K79j27j01R3K1j71rQ0Q9p9or0J00J05j04
5081fp0J14p2O3r8L8P1m4O4j06l5M9K1n2J60p7L9m6l2Q5r8n5J62j40Q4j16O5j3
5109d5L9J15j67R5q8K3J5L6jj32J33o5JO3p6M1l5J30Pj40O1J4k4j7J20j44O9O6
$$ plain form
5137 94 -35 -46 102 53 -58 111 6 86 -9 -6 25 -62 -113 -94 7 63 128 -61 23 -121 -88 -153 -31 48 -39 -2
5163 -2 -50 9 -112 -2 80 45 -37 -59 53 33 -4 5 28 16 14 -38 112 19 -89 10 34 -52 9 -51 11 -80 -17 -38 16
5192 16 5 36 43 -54 19 -31 20 -55 -54 -4 71 -91 -12 -10 -131 117 -43 8 -3 28 8 -44 92 110 5 28 -16 81 87
5221 87 -12 44 5 128 -85 101 -33 26 19 -3 176 -96 44 -31 -36 34 48 -68 -31 -15 -62 -104 26 -130 65 -62
5247 -62 -50 80 -70 92 -132 -34 93 59 79 70 27 113 -48 -25 -41 34 69 84 29 62 11 95 -17 57 158 16
5273 16 21 -32 40 68 77 6 28 13 48 8 101 33 90 36 -18 49 -49 -39 -15 3 -24 96 -122 18 -8 -69 20 -20 -27 11
5303 11 -14 -43 -71 63 50 99 11 2 69 51 -95 -55 48 -49 -50 -46 -81 -78 75 7 -26 -105 74 -41 13 15 117 64 -37
5332 -37 163 -5 8 61 45 71 -119 119 -76 15 71 95 -40 37 14 72 73 10 -27 -30 100 -41 38 11 32 24 41 -8
$$ packed form
5137I4j29j1J48m9j11J69j05Q0r5LL1q7n1J9J01N6O5j89Q4j44L3o5J22P9q7L7
5163bm8N9j21J10Q2l5q2k2J12k0l7RK3j2kn2J50r3j08R9K4q6O1o0O2r1O3k1N4
5192A6j1L1Pr7P3n0N1p5JN0P5j62P9Kj21K48j60N1j1L1k0n2J36J8j05K3m4R7O
5221H7r9N6l9J23k13J86j34N9pk2J79k72J40p5nP0J4j16L7J6m7m2J30j56J95j27
5247f2J2J30j50J62k24R8J27l4K0rm3Q6j61K3j6P5L5J5n5L3n1Q4j12P4J01j42
5273A6Nn3P2K8Rp1K2j5L5m0R3o8N7n4n4O7r8J0K4J8k7J20k18J40k6o1Q9m0pL8
5303A1k5k9k8J34j3M9q8rO7j8j46M0J03r7jMl5LJ53o8l3p9J79j15N4KJ02n3j01
5332c7K00j68J3N3j6K6j90K38j95R1N6K4j35P7k3N8Jo3l7lJ30j41P9k7K1qJ7m9
$$ plain form
5360 -8 77 -16 3 26 13 2 13 -58 -126 20 67 83 93 -3 -17 41 -47 103 -17 26 -1 50 -97 -35 -13 16 16 101 -49
5389 -49 41 -70 -25 38 -102 58 -1 -32 13 -113 -95 79 123 -7 -30 13 34 -38 -16 -2 -32 97 -77 -93 64 49
5415 49 -59 -20 -35 -44 -43 -101 -32 112 49 51 -93 -296 -22 93 8 7 -40 -88 72 54 15 -8 13 33 -86 -17 24 -32
5443 -32 56 -57 -46 20 -62 10 -58 97 65 2 19 -57 -34 3 -28 -24 -40 -69 64 6 -44 53 15 12 20 13 -45 58 14 28
5473 28 30 -13 -6 -62 -2 -39 22 4 75 -17 15 -147 78 -87 -14 -59 66 -4 -97 53 -143 -18 -2 19 -5 57 51 19
5501 19 -74 -77 -48 44 18 -107 103 54 -41 -7 46 11 77 25 -24 -33 51 5 1 168 0 -29 27 31 -3 23 45 -28 -10 -17 10
5532 10 6 -109 -5 42 -28 -13 -33 -113 -40 1 -16 -115 -53 17 16 23 42 42 5 3 10 16 -52 -63 41 23 -44 -73 5 52 -123 6
5564 6 64 -13 -11 67 27 33 63 -54 -69 13 -52 -15 37 -115 63 -83 -127 -110 24 25 -18 -35 -14 22 -35 21 -67 -2 -115
$$ packed form
5360hQ5r3J9K3j3j1J1p1o8J46M7J6J0r6j4N8q8J50j20M3k7N1j47O2K2K9%Q5j50
5389d9R0j11M5O3j40J60n9l1M5j26J8J74M4j30k3M3K1p2K2J4l0J29j74j6J57j5
5415D9j08L9j5rJn8O9J44o3Kj44k03K74J15q5jm7m8J60j8l9k3K1K0j19O9M1n6
5443c2Q8j13J1O6q2P2o8J55l2o3J7p6K3L7l1Mj6k9J33n8n0R7l8lQpn8J03m4J4
5473B8Km3Pn6O0l7O1j8P1r2L2j62K25j65P3m5J25p0r3J50j96J25J6K1k4O2ol2
5501A9r3lK9R2k6j25K10m9r5L4N3l5O6n2m9rQ4m6mJ67j68k9N6Ml4K6K2p3J8pK7
5532A0mj15J04M7p0J5k0q0P3M1j7r9O2P0jPJ9%l7kPOo8j1J04j8o7k9P8M7j75J29
5564FN8p7KP8m0OL0j17j5Q2o5L7N2j52J78j46m4J7J34Jm3j7K1L6n7N6q8O5j13
$$ plain form
5593 -115 42 102 154 -1 -80 -12 21 53 70 -4 -9 -58 -1 -141 -17 -8 -25 125 -15 46 -53 -59 60 -34 -52 -68 -17 -18
5621 -18 57 58 -30 -23 7 5 -52 -3 100 4 43 124 -7 -1 37 11 86 -70 -17 -6 -28 98 -111 -30 133 124 109 -14 55
5650 55 14 -26 74 43 -62 63 115 55 -57 114 19 17 -22 83 -42 -144 -40 -9 -11 -40 44 -50 72 -38 -37 2
5676 2 -12 96 86 52 62 23 -48 -10 99 -12 28 19 -179 -11 -16 -105 -45 60 41 44 -38 86 102 19 -38 41 6 26 6
5705 6 6 -38 116 27 -67 22 -100 -8 -11 116 17 -1 1 51 80 -28 117 -35 63 70 -40 10 21 -78 57 70 -16 -24 24
5734 24 -24 13 40 -33 -10 -11 22 -16 -5 132 -44 47 -54 -38 20 -88 57 -53 -85 66 -57 -49 20 79 105 21 -24
5761 -24 60 66 -31 -26 -12 -63 15 -7 -53 -55 1 -14 -71 58 18 -33 -121 -50 115 43 -70 -36 -76 -14 71 -68 -20 49 -3 13
5791 13 -37 -96 -37 41 -27 33 -59 48 -68 -60 30 11 1 72 45 -55 -65 -59 75 -84 26 -12 61 -37 11 82 25 -39
$$ packed form
5593a15J57O0N2j55p9O8L3L2J7p4nm9N7j40J24Rj7J50j40O1r9oJ19r4j8j6N1j
5621a8P5Jq8PL0kn7M9J03r6L9Q1j31OL8k6P5j56N3J1k2J26k09Q1J63rj5j23O9
5650E5m1m0J00l1j05J25N2o0j12J71r5kl9J05j25j02J04L1kk9Q4r4J22j10JL9
5676Bj4J08j0l4J0l9p1L8J09j11M0rj98J68nq9O0J05j9Lq2J24J6q3n7P9l5K0k0
5705F%m4J54q9r4Q9j22R2lJ27r9j8KN0K9j08J45j52R8Pj10N0J1r9J35J3q6qM8
5734B4m8L7K7p3K3jL3l8J1J37j76R1j01J6N8j08J45j10l2J51j23QO9N9K6q4m5
5761b4Q4Or7NJ4n1P8k2m6kN6j5n7J29m0n1q8P1J65p2j13L4m0O2Q5j39M8O9n2J6
5791A3n0n9N9P8o8O0r2J07j16QR0j9j0P1k7j00j0OJ34j59J10l8P3r8M8P1n7o4
$$ plain form
5819 -39 53 -27 -8 54 -44 -20 -72 69 46 -73 12 -51 -20 -48 -127 7 -26 -40 -12 75 -15 -69 49 -62 -1 153 27
5846 27 90 38 46 10 -2 24 8 -71 -79 -42 21 40 63 -45 -34 56 135 38 -72 -97 14 -29 -29 72 8 38 -38 -8 -71 49
5876 49 89 34 -65 7 -55 -43 -18 -120 -35 -10 22 -41 98 -24 59 3 -25 183 65 -26 -104 -20 33 -68 64 51 -51
5903 -51 -50 15 -16 9 1 -10 -69 -61 25 13 19 49 -30 66 -31 -7 83 -54 -45 -22 9 -4 -64 39 14 103 104 -2 -24 33 39 13
5935 13 -24 -16 32 -59 195 -39 83 78 105 -28 1 -52 -58 -17 33 85 7 -128 -40 -34 83 20 56 -166 -21 -120 15 81
5963 81 -21 46 48 72 -93 -9 74 -1 78 -71 -37 -34 39 -107 44 47 -72 4 -19 9 -98 49 -41 134 48 40 5 6
5991 6 81 46 182 28 28 23 -59 33 26 -56 48 -30 47 -47 46 -74 -14 13 29 25 13 -6 -46 -31 -81 73 1 -58 -81 9
6021 9 37 -52 31 -21 39 -41 60 73 66 -143 -70 -61 -38 -23 13 32 20 -93 -12 -37 17 -5 0 -67 -30 -66 -91 11 -26 55
$$ packed form
5819c9R2q0J9O2r8K4n2J41k3j19Q5o3L1k8p9J34l3j4K8Q7r0n4J18j11O1J54j26
5846B7O3n2Ql6j2K6j6p9qL7O3J9K3j08J1R0P9r7j10k5J11m3%J01o4L0p6L0o3J20
5876D9M0n5r9P2o2J2K5j02Q5K5L2o3J39j22Q3n6k8K08j18r1p8Q4N3j01J32j3j02
5903e1JO5l1K5qj1n9QQ6j2OL0p9R6r7K4R0j37RK3L1j3o0J03k5Q9Jj06k2N7Ok6
5935A3l7QM8r1K54k34J22nK7j33K9n3oM1N0N2p8j35Q8OJ17o3L6k22J45r9J35O6
5963H1j02O7KK4j65Q4Q3p5P9j49L4LP3j46J51Lj19P6k3K8j07J47r0J75q6ql5J
5991FP5l5J36j54%nq2R2pq2J04p8P7r4R3j20O0K7J6mj2j9m0J5n0J54p2n9k3R0
6021IK8q9Q3n2O0q0J01J3pk09P3RK3J5L6J9j2j13Q1k5N4k2No7L7l6k5J02l7Q1
$$ plain form
6051 55 -33 78 9 56 -3 64 -24 -53 -58 -50 105 105 57 103 34 -19 -27 -46 -122 1 47 14 33 -36 8 117 61 -56 -29 -100
6081 -100 9 -46 38 -10 -57 -44 -27 14 -11 26 -6 0 65 -115 23 -86 -13 80 -4 31 -42 14 -56 43 100 80 55 36
6109 36 -17 -51 -86 53 -13 -87 -32 -30 10 -10 -30 67 22 49 -57 -87 -48 -88 -89 55 -15 -83 41 65 -17 -36 30 -65 -80
6138 -80 7 71 -63 2 -1 -44 -70 -6 93 -75 -27 29 -74 -42 48 65 -127 -9 -59 -36 76 -35 -23 62 93 25 -38
6165 -38 31 -45 -12 15 44 -61 16 -50 32 -107 -1 -20 37 96 -9 29 -12 -1 -15 -47 44 56 35 -40 -137 -27 33 -10
6193 -10 -20 -58 38 38 -133 29 -54 -5 -20 -36 -38 56 -9 63 50 -25 -99 -4 32 21 70 -7 -38 -105 36 36 -49 -19 -79 101
6223 101 2 -114 -36 -64 -34 70 39 -87 -45 22 16 -42 38 -65 31 2 -114 -18 -85 -141 39 48 63 -12 -94 6 34
6250 34 -10 -50 62 4 -40 27 64 -12 139 -15 9 -29 -87 -15 -10 10 -38 -64 -98 99 118 -69 107 72 63 20 0 23
$$ packed form
6051E5q8J11o9M7n9O7q8k9nQJ55%m8M6o9n3qj9p6J23M6l3J9o9M4J09n6j17K7p1
6081a00J09n5Q4m8m7J3J7M1k5L7l2OO5j80J38j09P3R3q4L5p3N6p0R9N7k0k5j9
6109C6n3l4l5J39o6p4N5KM0k0k0R7m5K7j06l0L9m0jJ44p0o8J24K4q2j9O6r5j5
6138h0Q7O4j34O5lm3k6O4R9j68M8N6j03L2R0J7j92J18n0K3J12j11J2Q5L1o8o3
6165c8O9p6L3K7K9j05P7o6Q2j39J06j9N7N9j05L8m1J1j4l2R1J2k1p5r7J10O0m3
6193a0j0l8R6%j71J62q3M9j5j6kR4o5P2j3p5p4R5L6j1M9p7l1o7J41%q5L0o0J80
6223A01r9j16P8k8L0J04l1j26M2O7on8Q0j03R6k9j16R6o7n6J80RJ5p5q2J00K8
6250C4m4m0J12n8m4O7L7p6J51j54K4l8n8P2NK0m8k6l4J97J9j87J76l5rm3k0K3
$$ plain form
6278 23 -75 -39 -123 -41 16 -31 -61 90 36 -35 -37 4 -36 -31 -48 90 -89 -82 -44 98 133 54 26 90 -68 -2 -160 -39
6306 -39 114 -9 30 58 37 -9 74 -9 70 -22 41 -13 -18 65 72 -21 -52 34 -40 36 84 53 -58 31 24 97 41 -56 -29 0
6336 0 -50 -17 170 1 -66 -52 -75 -24 -83 -15 89 -147 -99 39 -28 -8 -46 -45 24 -95 58 -46 -17 76 -69 62
6362 62 -153 -55 -12 80 89 44 -8 -153 -34 -18 159 -92 -51 -134 66 69 75 -156 -42 -89 -32 -111 42 26 -79 -108 -89
6389 -89 76 29 -7 -63 49 52 29 224 31 1 25 146 1 -27 9 -8 23 -12 -76 -2 -46 -17 1 34 -35 -22 3 -15
6417 -15 -55 60 25 -24 -31 55 -10 -102 123 49 -57 -36 3 106 23 40 30 12 -18 -47 -52 -90 51 -93 -24 23 34 1
6445 1 -58 -14 -74 -104 34 -75 -14 57 -38 -50 8 130 20 45 -77 -77 57 -136 42 -39 -34 -58 -10 33 32 49 81 54
6473 54 90 -21 35 -26 9 40 -26 102 13 -30 29 -144 -39 83 64 138 44 -3 -55 33 8 -10 -53 -74 25 14 28 -54
$$ packed form
6278B3r8L6q4Q2N7m7l0J51n4p1kM1m0Nj7J38j79PL8J42L5p9k8O4j58O6j58J21
6306c9J53j23L9K8k1m6Q3q3P9r2O3n4nQ3Pr3l1Q6p4P6M8l1j11Q9pP3n6r7K7K9
6336@n0L3J87j69o7J4k3N1n9O8J04k36M8J38o7K0l8JO9j19J53j04K9R3j45J31
6362F2k15R8M3R2Rm5n2j45J19J6J77k51M1q3K00LOk31J14m7N7p9J53j6j05k9J9
6389h9J65m7l6n6J12Lk3J95j93l0K4J21j45k8L6j7L1l5o4P4m4K9J8L3o9J3K5j8
6417a5m0J15l5m9pQ6o5r2K25p4j06K1L9J03q3J7j0j8l0k9nl8J41j44O9M7J1l3
6445An9M4o0l0J38j09O1P1r5j2N8J22j10K5j22%J34j93J78q1Nk4M8M3jJ7L2k7
6473E4L6j11N6o1L5L1o6J28q9m3N9j73J05J22j9P4r4m7n2Q8k5j8m3k1R9j1J4q2
$$ plain form
6501 -54 -39 -14 -57 -103 -3 -46 4 73 -11 -24 -12 65 -53 27 -64 43 -15 -21 -24 64 -23 -29 92 18 -21 -26 -7 45 51 51 116
6532 116 -43 -14 -16 42 80 -113 0 -77 29 66 3 68 -104 -1 59 92 35 58 37 -23 1 11 -64 69 -114 -8
6558 -8 -16 -54 -8 2 -86 -21 139 38 -15 -96 -34 -1 29 -43 -50 -36 -51 71 55 17 16 12 49 33 -15 -36 27 -61 -6 -30 62
6589 62 50 15 -53 29 102 15 22 -34 -11 106 19 -71 -1 -95 -68 0 -66 -51 37 -1 61 38 -5 32 -63 3 14 9 -20 136
6619 136 7 38 -37 -23 -83 -79 59 -59 -9 -1 -43 58 -38 -40 125 39 64 34 77 -6 61 -61 -52 -3 -88 80 80 -52
6647 -52 110 37 -12 -27 -32 36 55 91 75 -80 -41 38 -78 -19 21 6 65 41 -33 -119 -104 63 -31 -1 -34 86 -45 -15
6675 -15 22 108 -101 -85 39 44 80 63 -56 77 63 -31 -22 17 48 47 -36 -18 -6 8 10 35 -5 -12 49 -15 67 16 20 -19 -40
6706 -40 4 49 27 -6 -19 -135 32 -9 16 -43 68 81 -54 20 12 95 -71 5 -31 -32 73 -20 48 54 40 -21 -28 102 15
$$ packed form
6501e4J5K5m3m6J00m3N0O9q4j3J2P7j18Q0r1J07n8olQ8q7oJ21p4l9nJ9N2O%O5
6532A16j59K9kN8L8j93J13p7J06L7o3O5j72J03O0L3n7K3k1o0K4J0p5J33j83J06
6558hql8M6J0q8O5J60j01n3q1O2L3L0p2pJ4j5J22j6l8jmL7j6m8k1O3q8N5k4R2
6589F2j2l5o8Q2P3q7Pn6K3J17q7r0P0r4K7O8o6J5Q8l8O2k3m3L7r5O6J1nk9J56
6619A36j29L1p5J4o0MJ38j18N0Qm2J01r6kJ65q6K5l0M3q3O7j22RM9q5J68%j32
6647e2J62p3m9j5nO8J9L6j6j55L9P9j16N9M0j5N9k4p4q6J5J67r4L0l3J20j31L0
6675a5L7Q6k09J6J24NL6j7j19J33j4r4RL9L1jq3J8J2J4KK5m0pO1o4Q2n1Ml9k1
6706d0M4M5k2l3j3j16J67m1K5n9J11J3j35P4qQ3j66P6l6jJ05r3O8Oj4o1pJ30q7
$$ plain form
6735 15 -89 40 -66 32 -8 61 -60 159 64 -133 41 -112 4 -42 45 34 -11 -31 9 -34 37 23 -35 8 84 -3
6761 -3 20 58 97 23 -29 -29 63 -49 -77 62 60 49 -84 26 -146 -107 30 -59 63 22 -21 -125 59 -107 -64 25 -9
6788 -9 -73 4 45 110 -21 10 -95 53 -6 -28 21 8 -118 -48 94 12 28 -110 -49 14 -8 125 4 30 -13 21 103
6815 103 -52 -93 32 -15 -81 -62 59 4 -49 122 -82 -22 111 17 42 -8 -21 -86 45 38 62 -10 -111 -84 -39 3
6841 3 -6 20 17 23 18 -12 -56 -17 -4 49 48 5 16 1 -17 17 191 -63 -32 -31 -24 -37 -2 10 -44 -133 4 36 -63 -26 -53 -50 7
6874 7 110 17 72 -158 101 42 -108 -6 -21 -71 49 -16 -38 -115 12 -97 30 150 -96 31 0 92 86 -19 83
6899 83 -16 55 84 -56 -67 -51 -17 56 94 -9 48 104 -86 8 2 66 -33 96 -1 3 -5 5 -46 44 -85 26 -6 1 -77
6928 -77 -148 -7 -40 44 41 60 -8 23 -29 38 76 16 86 73 166 12 -119 -12 81 -66 66 -38 -8 76 18 -48 91
$$ packed form
6735A5j04J29j06R8m0O9j21K19r5j97J74j53J16m6Q7j1m5k0M0m3P1j4n8M3P6q7
6761cK3L8L9p4n2%R2j12k8J39kj1j33J10j72L9J37q9J22m1m3j04J84j66M3Q9l4
6788io4P7M1O5j31L1j05J48n9k2M9j3j26P0J42q2J6j38O1O3k2J33j21K6m3L4Q2
6815A03j55m1J25m7o6J9J21n5n3J71k04O0J33r4K5n0j3o5J31pK4p2j01K7M5M2
6841CrK6lOnl0m4L9J3N3jm3J1j5j8L4J74k54L1JPj3L5J2n4q9J37L2r9L7k7LN7
6874GJ03r3N5k30K59n9j50J02j5n0J20o5k2p7J27j09J27J20k46J27l1R2oj05J02
6899H3r9P1K9j40j1J6L4P3L8j03N7N6j90R4oO4r9J29r7MqJ0n1R0j29J11l2Pp8
6928g7p1J41l3Q4lJ9o8L1n2O7L8o0P0j3R3j54j31J07R3j47J32j04L0Q4n8o6J39
$$ plain form
6955 91 -25 8 50 -29 -13 50 109 53 -40 35 -5 -40 -29 76 1 130 -19 71 -47 -72 -97 -42 85 62 -105 4
6981 4 -8 -17 7 42 22 -28 -36 -67 32 44 28 0 -56 83 16 -46 13 -139 -106 -35 -11 98 -41 65 -47 -57 -85 -93 -35
7010 -35 -79 -42 21 142 6 53 -27 78 51 33 47 30 63 41 88 -48 21 1 39 62 -11 62 -75 70 25 54 22
7037 22 8 46 96 101 45 -46 -56 11 -14 110 -27 64 -32 55 113 50 -61 49 -46 -33 31 -5 20 -5 -41 83 -17 47
7065 47 -36 45 41 -48 88 3 7 52 20 39 79 130 28 16 167 -93 -7 39 -17 107 9 -168 -20 32 63 -73 -63
7092 -63 -132 35 130 -31 31 133 -32 31 4 0 -17 -24 58 -80 32 74 -70 3 103 85 -12 61 38 102 56 -55 3
7119 3 -3 -22 -16 -8 -52 59 -14 -29 -83 -32 19 -34 27 36 -33 28 44 -16 -85 -66 -36 -106 -16 4 -81 84 -120 5 32 -32 81
7150 81 28 90 -23 -66 71 -1 -30 0 86 21 64 42 -41 -32 -5 -55 -19 1 23 -41 -24 64 -13 61 33 -19 17 -8 0 -3 0
$$ packed form
6955I1j16L3M2p9J6O3N9n6r3P5m0l5J1J05p5J29j49R0j18k5k5N5J27k3j67J09
6981Dj2rK4L5k0n0ql1R9J2j6k8n6J39o7o2N9j52L3P1K4J09j39J06j12j0k8qN8
7010c5m4L7O3J21j36M7q0J05k7j8J4j7L3k2M7j36O9k0L8K3p3P3j37J45m5K9l2
7037B2j4L8N0Nn6r1j0O7k5J24j37R1r6Q7N8o3j11J10r5J3O4l6K5k5l6J24j00O4
7065D7q3Q1mq9J36q5MM5l2J9M0N1j02j2J51k60Q6M6n6J24r8j77J48N2L1j36J0
7092f3o9J67R5j61O2J02j65O3k7mj7pQ2j38J12M2j44P3J00j8r7P3k3O4m6j11N8
7119Coj9OQm4J11p3j5n4N1N1n3O1Ro9O1J6o0o9J9L0p0R0K0q5J65k04J25K7o4J13
7150H1n3O2j13m3J37p2k9L0Q6o5M3k2q3RK7n0L6K0K2o4J7Q8p7P4k8n2L6k5QlL
$$ plain form
7181 0 98 37 47 -58 36 -83 -2 -20 -13 73 -33 46 -8 -91 51 6 30 -62 -51 -77 15 66 3 104 127 -62 26 18 -97
7210 -97 -31 170 50 -75 56 -135 69 37 -17 -21 15 -60 -24 40 -113 -58 -49 31 141 139 -15 -116 15 -82 74 -83
7236 -83 54 14 -38 101 -44 -26 53 -39 19 29 103 57 0 -54 -11 -11 -25 -34 15 -104 -21 -96 12 66 -57 2 96 -17
7264 -17 -36 -10 66 105 -12 -61 132 118 -56 115 -10 -11 -128 4 -51 75 34 35 86 23 -71 17 -37 -52 81 20 -37
7291 -37 43 -51 57 -7 -57 -190 -92 -78 41 49 76 -51 1 159 -4 83 63 40 45 7 70 55 -15 76 49 24 31 134
7319 134 -45 -19 28 66 -1 30 -85 15 22 -3 -32 93 99 -16 29 -26 -50 -86 -23 38 168 -92 -33 -30 -27 65 -82 112
7347 112 57 -99 14 -99 -25 -24 -55 49 40 45 27 -80 29 -48 119 -17 52 59 -56 22 -12 -94 112 94 -40 71
7373 71 7 -29 -35 153 -54 54 84 -39 95 29 -52 46 99 -77 26 -68 -73 -38 -95 -21 -26 -47 48 10 -45 60 -42
$$ packed form
7181@R8o1J0j05R4j19Q1j8PQ6j06P9n4q3J42m5K4r2J1k6R2N1o3J01K3j89Q8qj15
7210i7O6K01j20j25J31j91K04l2n4mL6p5L6O4j53N5RQ0J10kj54j01J31r7J56j57
7236h3J37m0n2J39j45J8P9r2N8J0P4m6n7n4M3%j4rM9j19Q3p5J08N4j23N9R4j13
7264a7j9K6P6L9j17m9J93j4j74J71j25jj17J32n5J26m1JN1o3r4Q8n4j5J33o1n7
7291c7Q0r4J08o4n0j33R8J4J19QK7j27N2J58j63Q7k0k3Nl8O3j5p0R1k7k5PJ03
7319A34j79K6M7L8o7L1j15J00Pk5k9J25Oj15M5n5k4l6O3O1J30k60N9LLR2j47J94
7347A12n5j56J13j13P4Jl1J04rNj8j07J09p7J67j36O9Pj15P8l4q2K06j8j34J11
7373G1o4l6oJ88k07J08L0j23J34o6q1R8N3j76J03r4nL5n7P4nk1R5l8n5J05j02
$$ plain form
7400 -42 -14 -9 30 106 105 68 38 -11 -185 64 12 -41 65 -24 9 19 56 -40 0 54 -47 -82 12 49 -56 -40 32 -117
7428 -117 -29 56 65 32 -88 -115 142 -34 -17 -105 -72 113 -111 -30 -35 39 11 84 4 -38 42 34 0 -105 -47 130 -106
7455 -106 42 19 42 -108 108 -13 38 46 -131 69 -38 -54 -38 -58 37 48 -62 31 94 9 -34 12 -84 -7 -5 -47 50
7482 50 -69 -11 -22 -138 -34 -27 62 88 -138 28 51 -44 18 -22 -57 60 2 -57 3 22 83 28 -9 64 86 10 -17 -10
$$ packed form
7400d2K8NL9P6jl7l0m9j74K49n2n3J06q9L3J0L7r6M0N4j01l5R4L7j05J6P2j49
7428a17Q8Q5Rl3j20k7K57j76J7q8L3J85k24Q1nP4k8P3q0m2Q0ql4j05N8J77k36
7455a06J48k3K3j50K16j21N1Qj77K00j07j6J6k0R5J1j10R3O3q5m3M6r6P7Km2R7
7482E0j19N8j1j16J04PQ9K6k26J66K3r5O2m0l5J17n8n9O0J9O1n5l7P3K2p6k7P
$$ [...]
8191I4
##END NTUPLES=NMR FID
##END=
