##TITLE=1H_DE-80H_X3
 200.13MHz, d2o
 8 sc
 
 19ns.26.2.2025
##JCAMPDX= 6.0         $$ Bruker NMR JCAMP-DX V2.0
##DATA TYPE= NMR FID
##DATA CLASS= NTUPLES
##ORIGIN= UXNMR, Bruker Analytische Messtechnik GmbH
##OWNER= pz
$$ XWIN-NMR		Version 3.5
$$ Wed Jul 23 15:13:06 2025 Russian Standard Time (UT+4h)  Yarkov@DPX200
##.OBSERVE FREQUENCY= 200.1313
##.OBSERVE NUCLEUS= ^1H
##.DELAY= (6, 6)
##.ACQUISITION MODE= SIMULTANEOUS
##.ACQUISITION SCHEME= undefined
##.AVERAGES= 8
##.DIGITISER RES= 18
##SPECTROMETER/DATA SYSTEM= spect
##.PULSE SEQUENCE= zg30
##.SOLVENT NAME= CDCl3
##.SHIFT REFERENCE= (INTERNAL, CDCl3, 0, 14.3821)
##AUDIT TRAIL= $$ (NUMBER, WHEN, WHO, WHERE, WHAT)
$$ ##TITLE= Audit trail, XWIN-NMR		Version 3.5
$$ ##JCAMPDX= 5.01
$$ ##ORIGIN= Bruker BioSpin GmbH
$$ ##OWNER= Yarkov
$$ C:/Bruker/XWIN-NMR/data/yarkov2/nmr/H-C/1/audita.txt
$$ ##AUDIT TRAIL=  $$ (NUMBER, WHEN, WHO, WHERE, WHAT)
(   1,<2025-07-23 15:12:13.37 +0400>,<Yarkov>,<DPX200>,
      <created by zg, POWCHK disabled, PULCHK disabled
       configuration hash MD5:
       00 E9 B6 7A A2 85 ED C7 34 08 36 98 17 FE 4E 26
       data hash MD5: 16K
       FA 4E 25 ED BB E7 B9 DC 1A 32 EA E7 68 D0 84 C7>)
$$ ##END=
$$ 
$$ hash MD5
$$ FE 6A 41 92 E6 DC CD E3 90 9C 6A F1 60 5E 3D B3
##$RELAX= 
##$RELAX= 
##$RELAX= 
##$RELAX= 
##$RELAX= 
##$RELAX= 
$$ Bruker specific parameters
$$ --------------------------
##$DU= <C:/Bruker/XWIN-NMR>
##$EXPNO= 1
##$NAME= <H-C>
##$PROCNO= 1
##$TYPE= <nmr>
##$USER= <yarkov2>
##$AMP= (0..31)
100 100 100 100 100 100 100 100 100 100 100 100 100 100 100 100 100 100 
100 100 100 100 100 100 100 100 100 100 100 100 100 100 
##$AQSEQ= 0
##$AQ_mod= 1
##$AUNM= <au_zg>
##$AUTOPOS= <>
##$BF1= 200.13
##$BF2= 200.13
##$BF3= 200.13
##$BF4= 200.13
##$BF5= 200.13
##$BF6= 200.13
##$BF7= 200.13
##$BF8= 200.13
##$BYTORDA= 1
##$CFDGTYP= 0
##$CFRGTYP= 5
##$CHEMSTR= <none>
##$CNST= (0..31)
1 1 145 1 1 1 1 1 1 1 1 1 1 1 1 1 1 1 1 1 1 1 1 1 1 1 1 1 1 1 1 1 
##$CPDPRG= <>
##$CPDPRG1= <>
##$CPDPRG2= <>
##$CPDPRG3= <>
##$CPDPRG4= <mlev>
##$CPDPRG5= <mlev>
##$CPDPRG6= <mlev>
##$CPDPRG7= <mlev>
##$CPDPRG8= <mlev>
##$CPDPRGB= <>
##$CPDPRGT= <>
##$D= (0..31)
0 0.7 0 0 0 0 0 0 0 0 0 0.03 0 0 0 0 0 0 0 0 0 0 0 0 0 0 0 0 0 0 0 0 
##$DATE= 1753269132
##$DBL= (0..7)
120 120 120 120 120 120 120 120 
##$DBP= (0..7)
150 150 150 150 150 150 150 150 
##$DBP07= 0
##$DBPNAM0= <>
##$DBPNAM1= <>
##$DBPNAM2= <>
##$DBPNAM3= <>
##$DBPNAM4= <>
##$DBPNAM5= <>
##$DBPNAM6= <>
##$DBPNAM7= <>
##$DBPOAL= (0..7)
0.5 0.5 0.5 0.5 0.5 0.5 0.5 0.5 
##$DBPOFFS= (0..7)
0 0 0 0 0 0 0 0 
##$DE= 6
##$DECBNUC= <off>
##$DECIM= 32
##$DECNUC= <off>
##$DECSTAT= 4
##$DIGMOD= 1
##$DIGTYP= 9
##$DL= (0..7)
0 120 120 120 120 120 120 120 
##$DP= (0..7)
150 150 150 150 150 150 150 150 
##$DP07= 0
##$DPNAME0= <>
##$DPNAME1= <>
##$DPNAME2= <>
##$DPNAME3= <>
##$DPNAME4= <>
##$DPNAME5= <>
##$DPNAME6= <>
##$DPNAME7= <>
##$DPOAL= (0..7)
0.5 0.5 0.5 0.5 0.5 0.5 0.5 0.5 
##$DPOFFS= (0..7)
0 0 0 0 0 0 0 0 
##$DQDMODE= 0
##$DR= 18
##$DS= 0
$$ [...]
##$SUBNAM2= <"">
##$SUBNAM3= <"">
##$SUBNAM4= <"">
##$SUBNAM5= <"">
##$SUBNAM6= <"">
##$SUBNAM7= <"">
##$SUBNAM8= <"">
##$SUBNAM9= <"">
##$SW= 18.0517328524113
##$SWIBOX= (0..15)
0 0 2 0 0 0 0 0 0 0 0 0 0 0 0 0 
##$SW_h= 3612.71676300578
##$TD= 16384
##$TD0= 1
##$TE= 0
##$TE2= 300
##$TE3= 300
##$TEG= 300
##$TL= (0..7)
0 120 120 120 120 120 120 120 
##$TP= (0..7)
150 150 150 150 150 150 150 150 
##$TP07= 0
##$TPNAME0= <>
##$TPNAME1= <>
##$TPNAME2= <>
##$TPNAME3= <>
##$TPNAME4= <>
##$TPNAME5= <>
##$TPNAME6= <>
##$TPNAME7= <>
##$TPOAL= (0..7)
0.5 0.5 0.5 0.5 0.5 0.5 0.5 0.5 
##$TPOFFS= (0..7)
0 0 0 0 0 0 0 0 
##$TUNHIN= 0
##$TUNHOUT= 0
##$TUNXOUT= 0
##$USERA1= <user>
##$USERA2= <user>
##$USERA3= <user>
##$USERA4= <user>
##$USERA5= <user>
##$V9= 5
##$VALIST= <valist>
##$VCLIST= <CCCCCCCCCCCCCCC>
##$VD= 0
##$VDLIST= <DDDDDDDDDDDDDDD>
##$VPLIST= <PPPPPPPPPPPPPPP>
##$VTLIST= <TTTTTTTTTTTTTTT>
##$WBST= 1024
##$WBSW= 4
##$XGAIN= (0..3)
0 0 0 0 
##$XL= 0
##$YL= 0
##$YMAX_a= 61098
##$YMIN_a= -51053
##$ZGOPTNS= <>
##$ZL1= 120
##$ZL2= 120
##$ZL3= 120
##$ZL4= 120
##$ABSF1= 10
##$ABSF2= 0
##$ABSG= 5
##$ABSL= 3
##$ALPHA= 0
##$AQORDER= 0
##$ASSFAC= 0
##$ASSFACI= 0
##$ASSFACX= 0
##$ASSWID= 0
##$AUNMP= <proc_1d>
##$AZFE= 0.1
##$AZFW= 0.1
##$BCFW= 1
##$BC_mod= 2
##$BYTORDP= 1
##$COROFFS= 0
##$CY= 83.5205535888672
##$DATMOD= 1
##$DC= 2
##$DFILT= <>
##$DTYPP= 0
##$F1P= 10.8118882576601
##$F2P= -7.23987719738617
##$FCOR= 0.5
##$FTSIZE= 0
##$FT_mod= 4
##$GAMMA= 1
##$GB= 0.15
##$INTBC= 1
##$INTSCL= 1
##$ISEN= 128
##$LB= 0.25
##$LEV0= 0
##$LPBIN= 0
##$MAXI= 10000
##$MC2= 0
##$MEAN= 0
##$ME_mod= 0
##$MI= 1.114404
##$NCOEF= 0
##$NC_proc= 0
##$NLEV= 6
##$NOISF1= 3.799351
##$NOISF2= 2.8
##$NSP= 1
##$NTH_PI= 0
##$NZP= 0
##$OFFSET= 14.38212
##$PC= 1
##$PHC0= -1356.223
##$PHC1= 9.99091
##$PH_mod= 1
##$PKNL= yes
##$PPARMOD= 0
##$PSCAL= 0
##$PSIGN= 0
##$REVERSE= no
##$SF= 200.129724274929
##$SI= 16384
##$SIGF1= 3
##$SIGF2= 2
##$SINO= 400
##$SIOLD= 16384
##$SREGLST= <1H.CDCl3>
##$SSB= 0
##$STSI= 0
##$STSR= 0
##$SW_p= 3205.1282051282
##$SYMM= 0
##$S_DEV= 0
##$TDeff= 0
##$TDoff= 0
##$TI= <>
##$TILT= no
##$TM1= 0
##$TM2= 0
##$TOPLEV= 0
##$USERP1= <user>
##$USERP2= <user>
##$USERP3= <user>
##$USERP4= <user>
##$USERP5= <user>
##$WDW= 1
##$XDIM= 8192
##$YMAX_p= 0
##$YMIN_p= 0
$$ End of Bruker specific parameters
$$ ---------------------------------
##NTUPLES= NMR FID
##VAR_NAME=  TIME,          FID/REAL,        FID/IMAG
##SYMBOL=    X,             R,               I
##VAR_TYPE=  INDEPENDENT,   DEPENDENT,       DEPENDENT
##VAR_FORM=  AFFN,          ASDF,            ASDF
##VAR_DIM=   8192,          8192,            8192
##UNITS=     SECONDS,       ARBITRARY UNITS, ARBITRARY UNITS
##FACTOR=    0.0002768,     1,               1
##FIRST=     0,             0,               0
##LAST=      2.2672688,     0,               0
##MIN=       0,             -51053,          0
##MAX=       2.2672688,     61098,           0
$$ Real data points
##PAGE= N=1
##DATA TABLE= (X++(R..R)), XYDATA
0 0 0 0 0 0 0 0 0 0 0 0 0 0 0 0 0 0 0 0 0 0 0 0 0 0 0 0 0 0 0 0 0 0 2 -3 6 -7 7 -7 8 -8 9 -10 11 -14 14 -16 17 -18 23 -23
50 -23 26 -27 31 -35 38 -41 46 -50 56 -59 66 -73 82 -90 97 -101 95 -52 -158 1965 16847 -21264
72 -21264 -31953 7720 -9209 -46875 -30468 -7522 -6988 5551 2323 -22557 -1992 44354 35603
85 35603 10877 18049 13280 4298 25388 19727 -25335 -38221 -16671 -6575 -8373 -20889 -38540
98 -38540 -25290 10571 12649 -8748 -2604 14174 11927 12810 14124 -10 696 16662 11196 -3390
112 -3390 -6550 -10155 -7264 6038 242 -23752 -24571 -1962 4440 -4621 -4819 -3294 -2615 10521 19330
127 19330 9557 453 858 3282 4435 -128 -9193 -13080 -9969 -4745 -5448 -9710 -4926 4294 6166
142 6166 4128 4379 6809 9219 9430 6933 785 -3352 635 2555 -2497 -5006 -7608 -10394 -4674 -778
158 -778 -5479 -5963 -1716 -1387 -562 5344 8447 6388 6672 8675 6073 6017 7807 481 -5146 -2029 -4579
175 -4579 -9423 -5941 -5802 -9500 -4566 1129 -829 42 6600 6881 3418 5972 6721 2447 5370 7365
191 7365 -1802 -4651 1052 -975 -3996 -1964 -4950 -8445 -3627 174 -3049 -3565 1010 1566 1721 6621
207 6621 5527 1173 5352 6795 626 -451 879 -2625 -3532 -1828 -4629 -6114 -1758 936 -1238
222 -1238 -614 2243 1041 1677 5195 1724 -1967 1328 1636 -1340 -424 -331 -2579 -1438 361 -1219 -2748
239 -2748 -482 309 -1629 -674 1557 344 1446 3871 1818 990 3203 1930 -13 -415 -1841 -3468
255 -3468 -3696 -3347 -3741 -3956 -1796 -188 -221 1955 3616 3109 3978 4115 2157 1889 1720 -206 -1491 -2034
273 -2034 -2203 -2386 -2627 -2140 -2098 -2135 -686 -741 -1064 397 677 599 2060 2345 2238 2975 3043 2718 1797 613
293 613 32 -1389 -2532 -2984 -4025 -4226 -2871 -2661 -1795 66 1309 2282 3232 3414 3599 2807 1875 1541
311 1541 154 -765 -1141 -1949 -2270 -1506 -1909 -1731 -916 -833 -350 -208 21 585 628 855 1641 1453 1757 2109
331 2109 1458 1279 1091 -121 -789 -1323 -2314 -2337 -2738 -2535 -1704 -1353 -410 920 1349 2135 2647 2334 2314 1837
351 1837 690 345 -531 -1224 -1187 -1735 -1759 -1016 -1177 -738 -118 -158 331 384 362 767 488 605 1050 784 766 960
373 960 277 300 134 -686 -998 -1200 -1450 -1391 -1238 -1093 -278 334 811 1270 1356 1752 1731 996 830 312 -609 -638
395 -638 -979 -1717 -1436 -1231 -1037 -433 -202 111 488 770 1066 972 791 1211 880 574 839 116 -136 215 -563
416 -563 -1119 -1036 -1462 -1497 -1212 -1181 -829 -559 552 1027 824 1667 2069 1619 1873 1373 210 175 24 -941 -1540
437 -1540 -1510 -1655 -1572 -1265 -937 -975 -440 467 448 389 1160 1203 1028 1698 1250 590 988 820 29 -395 -812 -1127
459 -1127 -1223 -1462 -1662 -1740 -1096 -139 -141 306 937 961 1462 1911 1159 844 1169 433 -122 -250 -701 -872 -863 -673
481 -673 -1057 -1075 -201 -153 -418 229 28 -173 798 1019 171 404 993 591 445 539 11 -528 -434 -425 -1099 -1204
503 -1204 -565 -704 -470 219 160 556 1545 1213 689 966 796 239 284 -376 -912 -857 -517 -908 -998 -477 -255
524 -255 -410 268 303 -267 537 952 240 367 848 421 646 840 218 -442 -19 215 -743 -1074 -861 -1218 -1021
545 -1021 -347 -616 -662 452 816 672 1053 1183 1021 1151 582 151 -28 -217 -437 -759 -796 -915 -943 -304 -152
566 -152 -730 -307 143 -132 239 449 -35 408 839 503 394 636 583 411 223 46 -549 -601 -252 -733 -1165
587 -1165 -517 -425 -301 389 31 -56 495 702 384 405 174 69 205 157 -267 -428 72 -91 -211 73 127 -291
609 -291 210 231 -478 -248 318 -181 -250 152 -71 -89 377 464 -160 -121 239 -115 -197 199 -142 -289 255 102
631 102 -236 341 405 88 201 228 -143 -98 111 -313 -621 -319 -113 -220 164 241 -99 214 622 196 220 450
653 450 139 -63 188 34 -157 55 150 -167 -394 81 -102 -337 -27 -37 -380 19 264 -14 120 352 286
674 286 358 311 277 67 34 94 -261 -400 -159 -211 -346 -20 -150 -219 221 165 41 182 214 40 141 112 180 35
698 35 152 190 -64 -103 25 -283 -284 -119 -214 -271 -108 -99 6 18 278 346 181 228 274 85 161 42 -135 -238 -154
723 -154 -245 -195 -190 -65 24 18 120 202 20 237 222 12 80 24 0 28 45 50 -31 -82 24 -112 -198 -159 -84 -315 -75
750 -75 -42 -10 227 211 94 303 324 282 231 91 -57 -52 -185 -136 -207 -186 -35 -206 -78 75 222 72 319 73
774 73 -31 43 148 -7 -43 79 126 17 -85 144 -83 -89 -90 -231 -123 -72 -239 -214 -75 -27 18 41 162 159 105 9
800 9 119 156 30 -45 -175 -94 -40 -151 -36 27 -25 69 50 132 190 49 124 66 -149 47 -161 -202 25 -23 -122 188
826 188 10 -81 53 -37 -62 -62 -75 77 141 -56 110 138 82 34 65 82 -42 18 -139 69 -124 -2 -73 -11 -77 14
852 14 177 146 104 99 85 65 -41 -49 84 0 -30 -61 4 -181 -23 76 27 -48 -22 -30 -22 116 -94 -82 28 18 119 -13
880 -13 79 56 16 -58 -15 -117 -131 -48 -230 -20 17 44 -1 102 194 224 119 96 87 119 8 -1 -89 5 -64 -158 50 -67
908 -67 -185 -44 39 22 66 -62 45 44 -23 136 182 86 186 -23 -22 -186 -71 -101 -239 -192 -63 -161 -263 -7 81
933 81 -32 106 35 67 86 150 89 4 84 -8 -23 -40 -24 -82 -56 49 -70 -35 -148 -138 37 36 -86 13 69 72 84 252
961 252 132 141 85 -23 -71 -50 -48 -206 -179 14 -117 -15 34 45 -26 -40 23 122 40 118 124 3 67 69 -113 14 49 -114
989 -114 -26 12 -14 -107 -105 -65 -162 20 10 54 -8 81 144 -21 101 101 -1 74 79 -93 -123 24 -48 -110 -5 -140 -90 71
1017 71 6 -53 48 0 -22 -61 97 74 -67 11 105 28 11 -39 -78 53 163 -88 7 -54 -95 -55 13 118 78 21 72
1044 72 1 30 21 -32 34 61 -83 -137 -86 63 -112 17 -15 110 159 39 44 -110 -32 -18 -36 2 90 -18 -33 18 33
1071 33 78 131 12 -14 -45 35 -88 -67 -48 -114 -69 -60 50 -77 -28 -74 -130 16 11 -157 92 -20 96 229 -129 -214
1097 -214 28 34 6 -12 75 25 51 25 34 -49 -21 27 -211 25 -62 -45 73 15 -38 -57 3 13 -92 52 -62 -107 -8
1124 -8 -46 -65 65 106 9 19 -48 -96 -39 15 -19 -6 98 -43 137 -32 128 -90 36 -27 36 20 -83 31 -92
1149 -92 -37 -103 -134 -36 -17 22 11 145 13 -21 10 -51 29 -7 105 -41 33 74 -121 19 30 -72 43 -86 -13 -20
1175 -20 -35 -91 -41 13 57 25 129 57 4 -37 -40 12 14 65 -56 31 -17 45 32 -6 -3 45 62 96 6 1 126 9 1 7 32
1206 32 39 150 133 -67 21 -74 -74 2 -57 -87 -112 71 8 -71 30 18 62 73 52 120 -3 -87 104 -90 3 -49 -164
1233 -164 -106 -27 120 -18 94 17 4 -212 -49 -152 -77 74 25 -99 45 24 -9 -42 91 22 1 -16 -58 14 -94
1258 -94 -89 -32 94 79 76 48 70 54 22 40 86 24 -21 -111 40 42 98 6 -25 158 58 139 -42 38 -41 -93 -73 -15 64
1287 64 59 -41 -88 -7 68 16 -60 -19 7 -84 10 18 3 72 -25 -126 -38 101 28 49 -5 -81 43 5 136 -38 -35 16 68
1316 68 46 68 59 -33 83 42 33 44 46 -43 -12 16 -40 124 -155 23 -109 137 44 28 -50 -42 9 25 -2 -37 109 108 -48
1345 -48 186 4 18 -59 -125 2 32 -1 13 61 -105 -13 -13 -6 44 -6 -18 6 6 49 57 -30 -10 -2 40 0 52 -197 -33 -8
1375 -8 -59 -64 -95 87 -36 -70 -30 93 48 88 -57 -6 10 -6 -64 52 -62 135 68 -45 -50 -1 -51 3 -56 -63 19 57
1403 57 -2 -67 -77 -9 -12 7 87 21 21 -80 39 -100 112 -83 1 -2 121 56 81 -113 25 13 -101 25 -11 -2 -17
1430 -17 15 71 62 -21 -14 48 -120 -66 36 8 -40 -62 -37 45 2 -38 31 168 -44 45 -23 -10 -9 40 53 -18 -73 81 -64
1459 -64 -16 -67 -28 28 -15 18 -11 -20 -73 -91 -83 -8 54 101 -39 -38 47 -113 -9 -70 -49 121 84 63 23 64 91 -87 106
1488 106 25 -1 79 30 34 -60 47 -31 -29 12 -95 80 -25 -31 99 -70 29 -42 39 -53 54 -20 -23 -99 -126 -76 122 -98
1516 -98 97 -40 -72 99 -38 24 -75 -27 -128 25 -10 55 -30 -12 -22 6 27 -28 -153 -57 58 0 75 2 56 -119
1542 -119 -62 13 38 37 60 79 -1 7 -38 27 -1 -24 30 52 -87 -61 30 41 95 68 -85 -29 7 -29 37 15 -61 48 6
1571 6 -88 17 22 -38 11 27 35 -44 -19 -8 2 -26 -5 -93 20 -19 57 61 -50 -63 -37 53 4 -68 -40 -110 59 0 15 14 -48
1602 -48 90 4 31 -32 -36 -21 -21 25 66 6 -8 46 -16 8 20 26 48 -24 -77 -74 -57 105 -126 24 22 7 15 -47 12 -19 14
1633 14 -2 6 -64 -7 5 -61 68 -43 36 -12 -106 -40 90 -10 -80 -17 -11 -121 55 70 -71 -24 30 11 -47 -131 64
1660 64 30 -133 83 57 77 79 62 75 39 -81 69 -14 60 -27 -8 20 34 120 152 -39 -7 -5 13 4 -101 65 19 48
1688 48 75 40 -55 52 8 -23 71 53 -9 43 39 37 9 29 66 -24 78 -23 -161 59 84 -5 -77 75 -108 -26 121
1715 121 11 34 -66 6 28 -36 -37 -22 -26 19 81 44 80 -4 51 68 -46 45 58 -41 -27 -80 62 -28 112 -92 -46 -52
1743 -52 32 -5 22 60 -9 59 46 -101 -53 -9 5 85 86 2 -5 -13 25 61 -60 -15 -21 -139 69 10 70 38 -53 106 31 -10
1773 -10 -41 101 -72 -27 -76 -15 -83 85 7 71 -5 -35 -1 92 -2 -52 122 -24 -30 -30 6 -114 36 47 25 -90 67
1800 67 63 95 70 -23 -17 -162 57 18 58 -72 100 -26 20 -71 43 -92 -17 62 -76 -36 72 9 -126 3 -34 -9
1826 -9 34 -48 -15 67 -53 -108 -16 -22 -6 85 12 -66 -136 -80 134 -22 -30 29 37 -24 73 9 -21 48 72 -44 43 76 137 -78
1856 -78 67 65 50 -27 -106 46 -10 3 -14 28 1 -17 -74 50 -36 -22 26 118 -63 -51 -10 148 49 -81 79 -68 -6
1883 -6 -26 4 52 -33 -43 -25 -137 23 -53 -100 -74 20 27 53 -21 4 -83 -74 29 34 7 3 102 -104 -104 19 106 67 -21 42 70
1914 70 -12 -38 33 -38 41 58 -69 -29 131 -100 -77 124 51 12 -40 -6 97 27 -140 67 -78 -27 35 -27 2 90
1940 90 -25 -62 145 -21 -8 -95 62 -39 121 42 43 106 -48 28 5 60 3 -55 71 61 19 -8 -9 -49 18 32 -11
1967 -11 -58 58 -82 79 5 73 30 22 11 -53 -41 70 73 -34 17 -2 -27 17 -48 17 -12 -13 -2 17 -14 25 32 70 29 3
1997 3 -94 92 -136 -57 82 -45 -154 -99 53 59 47 -53 -38 73 12 -133 85 -33 -25 -50 14 -52 19 -4 80 -51
2023 -51 -17 24 -92 -33 -58 42 33 128 59 -3 -11 1 20 65 -33 53 71 5 125 10 -17 -29 -28 -69 -11 -79 -6 -22 31 -43
2053 -43 -46 78 -92 -4 8 -72 -126 75 46 6 93 -12 -62 -74 88 2 -45 14 79 -66 -62 48 25 -12 -30 -12 60 16
2081 16 -29 -41 -137 -41 64 28 14 68 113 25 -47 -18 -32 -32 69 95 38 97 -128 59 -46 10 3 -54 -39 45 -58 -3
2109 -3 25 100 -10 -84 16 -59 -74 2 -80 -50 -35 -74 25 -10 -24 22 -115 -55 -87 -67 30 27 13 -36 108 -25 23 -6 -65
2138 -65 22 -39 8 -9 52 31 -4 -23 86 12 76 -96 -3 67 -17 41 -6 15 -125 8 25 95 -35 24 -12 41 36 -21
2166 -21 119 -4 -89 -49 26 9 -54 17 -69 101 -12 64 -133 -5 53 1 143 -46 28 -92 64 68 -48 -53 76
2191 76 -30 -22 12 49 19 -44 -92 -40 63 0 -30 46 -84 -41 -66 -36 -24 2 -8 112 0 -6 -57 22 -1 -69 54 -18
2219 -18 123 -82 42 -7 24 -54 45 -13 -15 4 9 -85 -112 101 52 49 21 147 54 40 51 -64 -27 -50 -11 -4 -20 20 11 44
2249 44 25 13 -65 30 -87 -32 85 -64 -44 32 -59 25 -53 21 -27 39 36 94 3 22 -2 8 -58 27 -31 1 -181 74
2277 74 74 6 -100 -4 53 76 36 -36 33 -31 6 37 -48 -58 -17 -118 21 -53 -34 29 -16 -43 113 -1 21 35 8 -51
2305 -51 -54 31 -93 81 -30 -49 -44 -10 27 5 5 -62 -58 37 -91 78 40 -110 111 -108 75 -74 -14 -31 14 -69 112
2332 112 199 46 71 -93 28 -89 233 -56 20 26 -38 -14 112 1 131 -54 31 -11 -11 60 54 77 -6 30 0 -25
2358 -25 30 -9 22 114 19 -6 -198 -110 28 174 -32 12 -53 87 -66 25 85 -25 109 -103 -22 38 40 17 88 -99
2384 -99 57 25 -34 48 42 -65 96 -7 71 54 -79 19 -38 -110 -7 73 -60 -144 27 -42 16 175 35 68 8 -78
2410 -78 89 -49 3 34 -4 -27 54 -24 48 8 -24 20 86 49 -19 147 -21 -113 70 40 91 -106 -2 51 -117 -33
2436 -33 -72 -28 29 -72 88 36 66 60 54 -25 -96 -68 -42 97 24 100 -79 26 98 0 -7 -65 -94 -168 54 -11 -29 -34 -69
2465 -69 44 39 -71 151 -6 26 -57 78 -67 126 15 25 -46 45 74 -5 53 102 -43 -32 -20 -16 2 -42 -27 -137
2491 -137 8 -14 -91 -18 -59 -92 8 -80 -63 26 -6 41 -91 71 50 -14 12 82 12 -89 92 6 83 6 -3 -69 -27
2518 -27 -118 -20 -63 -34 -78 -70 55 12 10 -39 -96 19 -120 35 -110 31 63 57 -54 -57 -25 45 -7 -24 17 80 -32 36
2546 36 18 2 10 -35 46 -69 -66 4 40 -31 -17 51 -32 49 -20 4 -59 39 21 -77 -159 59 157 62 81 47 -141 104 32
2575 32 -43 -24 -73 47 49 8 8 47 70 -181 110 -66 -23 122 -13 49 -33 2 3 35 -51 -34 35 79 19 -52 39 48 -47
2604 -47 -90 76 30 -35 -98 0 -17 30 39 -73 95 2 37 70 -23 -1 -43 87 -22 21 -2 27 65 -41 65 75 -102
2631 -102 10 -86 9 -8 29 -33 6 66 -22 6 -20 -10 23 20 -62 52 83 3 0 2 -23 51 -68 -98 -21 38 34 -11 0 15
2661 15 19 63 -22 -51 14 20 87 52 50 -42 -21 -36 -11 -13 75 13 -35 58 49 -77 3 47 15 -52 -121 111 -56 20 -51 85 52
2692 52 257 53 98 -7 13 2 -73 51 13 -37 12 79 1 -51 24 112 -130 -77 -102 -63 42 -28 -89 -54 13 67 121
2719 121 72 -5 -25 73 10 11 9 159 60 -35 71 -52 115 60 92 -39 126 60 -105 -86 -3 101 97 -83 -97 6
2745 6 -33 -20 76 77 85 46 -33 -97 2 -130 41 -59 25 -60 56 -114 -23 -46 67 26 -32 -62 97 -16 96 31 4
2772 4 32 63 16 40 39 -86 75 74 8 62 13 116 22 137 -29 -140 53 31 28 -63 -89 -19 -79 -88 -37 -37 16 94 47 -70
2802 -70 -6 9 41 131 -6 4 -64 18 -33 1 8 -49 -20 36 -11 -156 73 50 -30 98 -9 -68 56 26 -7 -89 -89 -1
2830 -1 68 12 63 -62 -9 -10 40 -46 35 91 -82 -8 -96 20 6 5 -34 -63 59 -13 -39 -48 27 11 23 12 2 57 -22 29
2860 29 36 -12 85 -13 -27 7 -1 -19 65 34 -18 -12 73 -75 -1 14 145 -25 -38 -26 6 45 -64 -35 -18 -30 51 110 0
2889 0 140 -125 -63 45 26 77 85 -24 189 -9 38 -5 117 -53 14 -65 61 7 -12 17 -57 1 -22 -129 -57 7
2915 7 -11 -53 -95 133 -109 22 -28 -23 27 -7 -21 -25 12 -8 -63 -6 -64 49 -146 32 91 -9 -35 50 17 -44 -49 -71 -19
2944 -19 0 -14 -58 77 -113 6 11 6 -16 -38 -70 -24 -13 54 -39 23 58 23 -65 57 -22 18 -66 19 93 -69 -19 -30 62
2973 62 -49 -42 -75 56 -61 34 110 -33 -44 -41 97 -35 17 -15 -174 46 -18 77 -88 36 10 -59 98 53 -4 13
2999 13 -59 -137 17 36 33 2 1 -57 -30 129 -24 73 -25 -56 10 -24 33 -10 -16 -34 82 70 26 -7 51 -20 132 -42 38
3028 38 -2 -88 28 12 9 -38 -24 -4 44 -44 81 10 -38 -31 -43 57 34 -72 -17 158 45 41 86 41 -76 -61 55 -29
3056 -29 -94 -39 -9 19 -3 27 -117 32 51 42 46 -24 -42 -40 31 8 35 6 -25 -12 -117 42 -14 -1 20 -21 6 60 69 -57
3086 -57 -5 41 8 -36 57 -37 -29 51 36 -65 68 -24 -30 -25 -14 177 16 -89 -146 68 -71 -34 -1 -96 -28 -47 27 -12
3114 -12 -19 -109 58 -16 -13 -145 22 59 -3 -83 -90 -92 -11 114 56 43 7 -94 -59 61 -62 -72 -20 -51 -78 -75 -31 28 111
3143 111 -58 39 -77 -136 -29 -16 30 -67 57 -6 -21 29 -85 33 -31 -38 41 -67 -50 12 -46 -103 33 -18 28 -68
3169 -68 41 -113 60 13 74 56 -22 20 -50 28 22 37 -75 20 2 45 75 68 -13 35 -61 51 54 21 -24 -3 -11 35 -17 -10
3199 -10 18 -22 2 -88 -106 52 -53 -9 25 68 29 -28 42 51 13 8 72 -29 -25 -59 52 -66 -45 16 23 -41 56 16 3 53
3229 53 6 -21 96 -88 -36 1 34 -19 -59 -27 107 20 -91 47 4 -22 -76 -26 26 97 -69 18 -62 21 -39 -72 -71 -44
3257 -44 51 24 -51 24 53 22 -7 -50 -31 15 56 50 29 -20 -27 -18 130 -39 -6 -21 -120 52 85 -111 -20 -3 -23 97 12
3286 12 0 -74 93 -44 -23 -17 17 13 -51 -10 -150 -35 -84 42 -36 -6 -76 41 38 45 114 1 -23 -28 28 40 -26 67 3
3315 3 -41 -58 -58 24 -37 -7 -90 -103 -43 -61 -18 -47 26 -5 89 -116 -24 -15 51 -34 -51 20 65 -86 62 -84 -38 -21 16 -37
3345 -37 -74 68 119 -46 -35 40 -7 33 70 96 49 -30 -1 8 73 -53 -29 29 -62 -14 -17 -24 -86 -19 24 14 -41 -44 157 -148
3375 -148 -11 64 -101 -9 -1 -2 -41 61 24 -48 -80 -39 61 -130 -78 54 -12 103 -93 78 -2 -69 -9 -40 -7 -22
3401 -22 69 137 142 41 44 -60 30 -19 14 -12 32 -12 -47 -41 78 -20 34 -51 -129 11 -2 8 -37 -72 35 -26 12 -99 -109
3430 -109 3 36 -84 -80 72 64 103 68 4 58 -19 -81 23 -39 -46 53 -14 -113 1 20 -103 -33 -94 8 -11 17 25 0
3458 0 14 26 -55 82 20 -108 10 28 -65 -24 -9 -56 38 -11 92 32 -45 -47 84 69 -87 -57 -16 -4 8 -62 -56 -40 62
3487 62 23 -1 4 18 72 -33 36 39 -46 -2 -36 -31 -23 -61 -63 -40 -73 -22 -19 -18 -31 22 67 -4 4 23 -23 45 150 7 10 24 -16
3520 -16 -5 86 -56 -25 -75 25 -61 -63 15 -68 -39 -22 58 -89 -134 67 14 40 -37 -7 -29 44 63 -25 19 -65 32 -29 -4
3549 -4 59 10 53 -2 151 3 -46 10 -10 -78 24 -9 16 -12 14 62 -142 137 -78 86 60 17 -86 -9 -94 24
3575 24 -131 -115 35 -71 64 -37 104 67 -3 15 34 42 0 -87 29 -5 -12 85 -70 8 -86 85 -15 -2 -46 71
3601 71 -62 22 -14 51 -1 3 18 60 80 49 9 6 26 -71 -63 40 -60 -20 -17 -165 94 -88 -8 -21 35 25 -82 70
3629 70 -22 -10 54 48 -19 2 -12 -73 -1 -21 -73 -6 -118 86 -27 -9 -45 -80 180 -63 70 0 -9 -23 -56 -7 19 -24
3657 -24 -18 -12 0 22 -12 9 -69 -98 -10 -49 -53 71 -29 -22 -48 -90 110 10 -99 0 -116 -74 -99 -52 20 -54 -23 -58 101
3686 101 52 -72 15 82 -4 -55 -47 43 39 68 28 -43 -85 58 -38 60 -24 -13 -17 -100 94 30 109 -45 37 -59 46 28 114
3715 114 25 -17 55 -50 -49 26 39 22 86 26 94 77 -33 -25 14 -41 101 21 21 70 -26 -21 59 71 -48 19 7 17 79 -6
3745 -6 -1 -15 23 -6 -6 -13 -29 -14 68 6 -55 32 -106 15 -87 129 -4 -82 69 23 -68 -43 30 20 66 70 -17 -10 148 130
3775 130 101 -49 83 -57 13 -59 118 -108 15 -65 -13 27 -1 117 -66 -7 -132 122 -73 26 -57 -67 -70 60
3799 60 75 74 44 -33 32 -51 54 53 -28 78 4 36 -139 -20 32 120 5 -56 -27 -34 -70 -14 25 -29 85 4 34 -4 -82
3828 -82 -102 0 40 60 20 -14 -33 -42 3 1 91 41 89 -71 -12 12 -57 -32 -157 -25 -2 -17 -9 58 -115 -27 45 52 -31 22
3858 22 73 17 35 -44 37 6 2 -131 85 51 -43 28 -5 -83 6 -8 0 17 15 -55 21 -43 -46 -35 9 -41 -33 15 -29 -44 105
3889 105 -4 82 -32 64 40 98 94 -41 89 74 -88 62 40 123 25 -22 26 -73 -4 76 30 79 16 54 3 82 49
3916 49 91 -31 -75 -26 18 -36 65 1 93 40 -79 -21 -152 -21 97 32 -27 -30 -14 -2 -4 46 -23 -89 31 -18 -28 -86
3944 -86 31 33 13 109 109 -60 59 -96 -38 -31 -24 31 55 -106 -92 -42 -49 -53 -51 -35 24 36 -3 36 65 -17 -73 -148 -19 52 131
3975 131 70 -46 104 -20 -132 167 -45 -16 42 17 -103 -22 34 -52 1 -45 23 -15 33 -10 18 3 -46 55 51 68
4001 68 -59 123 52 -67 16 -69 -63 92 -29 -64 -80 -27 -14 62 -21 -57 131 -51 -21 35 -7 171 -15 69 6 -16
4027 -16 -55 30 73 46 118 64 86 -7 -2 9 -63 -28 9 -44 31 -25 -96 -8 97 29 -3 -184 1 -35 -50 -97 27 -26 22
4056 22 -127 -27 -21 -139 57 18 4 95 -22 33 39 56 -41 70 -51 39 -73 48 -54 -54 14 -83 104 -32 28 -70
4082 -70 56 -88 131 39 -8 54 11 3 -103 104 -31 -21 -50 32 2 132 32 -66 46 74 77 82 -16 -4 45 -18 81
4109 81 21 39 63 116 -21 -31 28 -7 66 -33 35 -39 77 61 -94 -64 34 5 -12 6 30 33 -4 23 99 -6 -32 28 60
4138 60 20 -29 -96 35 25 -30 51 -22 33 87 -110 -14 -70 1 -32 -37 -8 30 -57 15 118 33 64 -77 -68 77 40 -60
4166 -60 -33 -6 -75 1 57 71 -67 -74 -38 -86 80 -20 76 120 -39 -46 -78 -66 64 -5 -10 68 -28 130 -34 -10 -101 -15
4194 -15 -39 64 94 13 -88 -14 -94 -93 -24 22 196 17 55 -26 -125 -75 -62 -21 45 -46 33 145 2 -46 -129 -46 -16 38
4222 38 7 -95 -18 -22 90 -63 -38 161 23 5 -20 -5 65 46 30 47 45 -40 -48 -31 49 -37 -37 48 -162 -15 -101 -41 -17
4251 -17 8 -19 -147 -50 47 47 -55 169 45 -75 36 -59 45 12 -2 -41 63 43 41 -25 89 120 49 5 2 -50 74
4278 74 56 24 23 -52 -109 82 5 -72 -32 -24 37 60 36 21 -18 78 -35 98 -9 -20 -53 25 3 18 49 123 -3 59 -71
4307 -71 -78 -24 -38 -108 44 -105 60 29 35 -30 -89 97 -18 -45 -3 44 14 48 -76 -47 74 -45 -41 -36 48 59 -111 -67
4335 -67 -43 -141 -131 -15 -124 95 27 -41 -19 -75 -2 -34 -28 15 -25 58 1 -35 81 -53 -23 -9 15 -24 29 -60 0 4 88
4364 88 48 28 -2 43 -84 31 -87 41 -41 -114 -136 82 -60 39 11 -84 60 88 -29 20 89 -37 -88 -21 -21 -7
4390 -7 -31 5 -114 -3 -38 6 -14 -129 -39 9 55 -61 20 -14 -12 -10 -32 -76 45 -63 -16 9 99 28 38 -79 -205 -110
4418 -110 8 -52 -24 73 -38 -55 40 44 15 31 67 -6 64 -110 58 -28 57 -34 14 94 15 -6 -12 110 -25 33 53 8
4446 8 85 86 59 41 94 122 23 43 63 28 29 33 0 49 65 68 -22 -82 88 21 -44 50 183 28 -5 -55 -52 -41 39 -21 43 -51
4478 -51 -99 27 15 93 -23 -81 -59 4 -55 -51 19 -14 -32 28 -67 62 59 17 46 39 78 9 -20 -13 14 27 25 -36 -4 39 36 43
4510 43 -13 44 -109 -36 25 8 -123 38 59 -42 -38 -28 -35 -6 0 -22 -51 94 11 18 44 -43 76 -19 84 -60 -1 8 -45
4539 -45 -24 54 -95 -89 -38 48 7 33 -59 -3 85 -6 65 52 -57 23 -30 72 40 -40 -17 40 -38 33 -122 -13 -45 60
4567 60 -74 -84 -47 -90 11 -143 -123 20 53 -93 31 50 -7 53 16 27 -69 96 98 -10 -52 -25 -123 74 49 -50
4593 -50 17 13 -69 13 29 -139 33 -89 50 22 -83 -69 39 55 21 20 -9 25 6 5 32 -25 40 14 -10 35 100 -88
4621 -88 13 94 -28 -82 19 11 5 6 -41 104 -33 -67 -38 -86 99 74 -107 24 -8 12 -3 5 4 -38 15 36 -44 -10 34
4650 34 6 59 -76 -20 39 -63 34 -54 2 58 54 -7 43 68 41 26 3 -51 47 -58 141 -92 57 -62 29 33 41 -87
4678 -87 -26 33 -55 60 -36 5 -53 29 -17 27 35 -126 -16 -162 43 17 196 50 -28 39 -31 -59 -92 4 3 8 -65 -57 -135
4707 -135 -114 103 9 -70 18 -97 -27 -10 -2 -55 -2 134 -72 -32 -17 59 -8 -56 8 78 57 -110 -62 6 112 -12 57
4734 57 39 15 -35 31 12 16 22 39 157 -23 40 58 -11 0 -53 34 101 -52 111 52 52 -63 20 -98 47 31 15 -50
4762 -50 -40 -10 13 36 -2 -23 105 5 1 63 -33 122 -28 -74 -39 77 -3 25 9 -15 7 7 20 15 3 -57 92 -37
4790 -37 -2 -35 -57 -56 14 -25 -134 57 -24 23 -73 156 -5 -17 -15 -5 0 128 -65 -132 -7 14 35 -28 35 19 23 -47 -73
4819 -73 80 -64 24 -19 13 17 60 -9 77 59 -40 -58 9 21 -10 -92 -3 11 43 28 -43 -18 -19 123 57 -22 7 -23 -50 82
4849 82 -9 80 -49 -3 35 -5 -12 -25 -69 -6 -1 -128 -6 20 71 72 8 54 101 32 -28 81 -50 -8 -36 45 67 -27 -4
4878 -4 -32 -49 12 -54 -4 96 -72 33 12 46 -1 8 -61 4 121 73 -30 -11 17 149 27 154 -20 -80 -2 101
4904 101 -32 61 17 60 47 18 98 -20 -50 14 -7 -64 118 89 59 -15 16 143 -14 139 73 -78 74 -53 87
4929 87 60 -13 20 31 10 50 -4 44 -51 13 -55 -36 -8 59 61 -34 -15 -103 -31 3 -8 -48 -35 11 105 -46 -12 -123 105
4958 105 11 -81 22 27 76 6 13 -107 -44 -20 -3 1 -126 43 -37 43 68 64 78 -45 1 -72 64 -2 1 -11 39 -15 43
4987 43 -22 96 28 30 65 49 9 84 -33 52 91 115 21 -22 60 -3 -38 54 -5 -33 88 -31 2 -49 49 -5 44 -20 76
5016 76 -13 20 40 -18 26 -27 32 30 47 -30 34 86 25 -39 -105 128 -8 -59 -5 -63 -11 -49 -19 -6 -33 -36 -82 57 5 -45
5046 -45 17 -55 101 118 -40 -49 88 -88 -82 40 3 41 -15 -68 -37 13 -47 -17 95 -85 38 -24 -43 7 -50 72 -25
5073 -25 57 32 0 -61 93 -66 -140 61 -17 -83 -53 68 55 14 -32 76 -41 3 -67 -54 36 -113 3 -28 35 -91
5099 -91 55 -57 43 -135 24 21 21 -34 -62 -19 -27 -74 -27 -115 -20 75 -118 -104 -9 -9 13 64 -69 113 -14 -91 -38 -59
5127 -59 41 80 -40 103 -29 60 56 9 -92 26 50 -15 -16 48 49 -64 -26 -100 31 50 9 -77 -29 -84 43 77 59
5154 59 -155 -115 19 -77 58 5 23 -24 10 110 -20 48 -85 -43 -66 -86 -109 -183 2 5 19 20 -158 20 -12 -78 25
5181 25 6 17 69 141 19 -49 -73 -13 18 91 -16 45 -110 -37 38 -142 106 -89 -31 -63 -21 38 -74 26 -54 -61 47
5208 47 -17 -96 53 -40 -52 71 8 28 1 45 -5 8 25 88 9 56 -76 161 -57 28 -16 149 3 -26 -102 9
5234 9 54 -2 -147 7 -43 7 59 -67 74 -17 14 -38 17 14 -84 67 27 120 148 26 -85 -17 45 -49 29 -59 -6 31
5262 31 47 -109 -37 -39 115 -1 72 77 -67 -9 -3 -9 34 32 11 23 -23 -11 4 22 4 -107 -59 14 30 74 22 135 81 -65
5292 -65 -97 131 42 -34 47 61 23 -47 99 -101 0 -55 -96 77 -36 -8 58 92 6 -42 109 37 -3 58 -14 10 128
5319 128 65 68 -20 -66 31 34 60 -12 43 -48 117 35 75 40 -114 85 -61 76 -47 1 -52 -22 -16 -20 60 23 36 63 15
5348 15 102 40 16 10 -15 -142 -6 24 -10 -21 20 -62 -25 1 50 63 8 113 23 -11 28 -54 60 -23 8 30 -1 -1 -8 71
5378 71 45 32 -1 46 20 56 57 24 -17 -38 59 3 36 9 -94 -75 -164 -48 63 -32 40 -11 132 52 65 -19 -34 -67 -2
5407 -2 70 -100 117 -82 -47 -1 -39 62 44 -18 -4 -106 10 -92 7 32 -90 33 -22 21 68 -7 -35 -48 -25 72
5433 72 9 -84 -39 88 51 -47 16 51 -21 98 35 142 14 -122 39 -16 -93 21 8 -14 96 83 112 22 -22 -2
5459 -2 -56 27 -81 41 54 63 -4 -27 -44 -98 70 90 -53 33 7 70 31 -79 -50 101 42 -3 -46 45 -12 -12 -53 42 118
5488 118 9 -108 18 -43 -7 -74 60 -55 65 -63 33 113 32 -16 65 -146 199 23 70 10 -6 17 3 75 -27
5513 -27 -30 -48 60 76 -52 18 -24 37 52 84 -10 -21 92 4 105 25 104 -30 44 -46 -26 -86 27 76 -14 40 -1 114
5541 114 33 129 -55 42 42 115 -65 -183 -12 14 -75 81 12 -25 79 -47 6 -115 -64 -16 -22 32 -49 -63 -59 -9 29
5568 29 -22 -90 17 46 54 88 -102 30 9 -14 33 -2 -28 -58 -54 20 31 -7 7 -13 42 45 14 19 28 29 -44 -1 14 119 61
5599 61 14 30 -72 -22 6 -19 22 0 -35 -54 -33 20 8 62 -7 155 -28 19 20 -39 -54 -26 25 -22 -36 53 54 23 24 -62
5629 -62 -5 30 35 -6 -14 -13 -73 -75 -39 57 85 47 -90 -72 79 -1 66 -90 26 17 45 52 -23 77 -111 52 -28 122 -136
5658 -136 -67 -6 66 104 -4 -36 48 32 -10 -33 -72 -4 51 55 19 72 22 -46 -22 40 29 -62 -135 131 -89 36 11 3 -35
5687 -35 18 -38 15 78 -15 -21 15 -104 9 143 32 -39 -20 -13 -9 27 -93 -42 -129 101 21 54 -21 -10 -35 -23 89 -48
5715 -48 28 64 -2 6 -90 -54 -11 -79 -13 -35 22 -3 43 11 -87 -90 -11 -5 -21 -33 53 -119 45 124 38 -19 63 32 31 91 -25
5746 -25 25 -32 62 60 -64 -75 -6 -87 -94 -37 95 18 -30 58 52 3 -47 77 25 -43 -83 -17 33 -32 98 61 -23 153 -2
5775 -2 75 -30 -40 81 1 51 97 -25 51 79 11 160 68 -15 -9 -45 -59 50 33 -23 -17 1 32 -40 51 5 16 -60 22
5804 22 -8 -11 9 -39 -13 -25 -16 63 -35 -35 -20 -13 -3 58 -15 -24 -69 39 22 -41 33 -7 45 -36 51 12 -9 40 -69 92 8
5835 8 29 -29 -15 77 5 -41 -156 -36 107 -41 45 78 23 24 -52 22 -82 90 23 -19 -50 -114 16 45 -63 -54 16 -28
5863 -28 -28 17 21 9 -20 27 -52 -48 -11 -29 -95 81 0 25 -45 -51 -35 103 2 -41 -113 -73 101 -24 11 122 -28 -75 43
5892 43 -15 103 -32 -21 8 -27 -19 49 -55 -44 7 -29 83 59 -42 -37 -4 27 47 -10 16 -63 62 26 -103 106 -43
5919 -43 -119 12 127 -46 -58 -16 54 -56 76 24 172 63 103 -21 41 4 -38 -10 36 15 13 -18 -5 62 -13 -16 62
5946 62 -5 -66 128 -107 -16 67 20 -82 -19 -164 80 31 70 61 13 62 27 -39 -21 2 -59 98 -17 62 80 -70 51
5973 51 -5 -52 -1 -96 50 -60 15 0 -12 -70 -68 -161 79 101 45 16 -59 18 5 -25 -7 -1 -17 -6 158 -72 29 -6
6001 -6 42 19 -8 31 -83 55 13 51 -8 22 -28 -59 109 -68 -55 36 -80 79 -38 -24 -75 33 -22 -39 -45 111 -140
6028 -140 -17 1 28 31 41 50 32 -26 -1 4 28 47 30 29 83 75 95 131 -3 -15 24 -77 -27 86 43 -24 -48 -96 26 -74
6058 -74 -36 -70 9 -35 23 -28 -46 -25 53 -26 -83 -36 60 23 40 -35 2 31 27 -133 39 32 -69 13 0 -33 74 -84 46
6087 46 -37 -110 18 -49 8 55 46 19 7 -5 -16 -3 -24 -38 -46 -61 -27 -22 33 -20 -20 29 58 105 -65 7 30 -24 -13 3 63
6118 63 -20 -45 -69 -71 -15 -40 -63 -104 82 -65 2 -37 -24 -43 -94 22 2 -116 78 -5 -59 -71 27 5 31 40 -168 37
6146 37 -21 142 -24 -158 -12 -24 73 -34 5 18 -10 38 1 -68 -92 10 -14 -26 41 -108 -62 -29 -40 42 96 -84
6172 -84 95 36 18 88 81 -40 122 -71 9 -5 -58 -37 -3 99 66 134 -10 54 -93 71 -46 45 -91 -4 -50 -70
6198 -70 -24 50 40 -83 -27 -32 53 -3 -9 -27 126 127 65 32 26 12 31 82 -57 38 52 -62 -8 46 36 -25 -39 -64 -4 -21
6228 -21 -77 40 75 -32 64 -21 34 8 -33 -3 63 65 7 106 23 -1 48 -59 -51 -12 36 -99 -45 -37 15 18 32 47 -128 99
6258 99 2 65 -66 -18 51 -9 10 -9 -62 127 42 -152 -41 -14 2 -32 -49 7 -26 130 -54 4 11 15 85 -147 -103 -1
6286 -1 20 19 4 -26 -105 60 -134 8 31 -96 49 -35 67 32 -18 46 -43 -54 41 61 -40 -61 -41 75 26 -33 121
6313 121 -70 -117 -31 59 -25 58 79 -87 49 64 -24 68 -6 -1 15 82 -30 16 11 -39 27 35 -16 -86 -63 -16 -6 0 64 -57
6343 -57 68 -135 4 -46 35 -42 23 -14 15 -2 -11 -75 -64 58 60 -4 110 40 72 9 -147 -4 -40 51 -30 -31 17 -7
6371 -7 -132 -26 -90 41 -48 -2 9 63 2 -40 17 -86 -35 64 19 13 -55 -59 -75 -15 7 -16 -135 37 -19 -48 46 31 -21
6400 -21 18 52 76 77 15 -43 42 12 -27 -57 -11 -87 -133 8 -16 22 18 8 -58 -39 -20 51 50 21 -101 47 28 -99 37
6429 37 -49 31 -7 -111 117 -3 -42 -21 49 90 -49 34 113 10 -51 -12 8 82 -96 -65 40 54 -19 2 21 -22 -54
6456 -54 29 -122 93 -68 98 -45 -19 -46 -42 -37 -38 -46 14 -3 51 48 -38 91 -48 52 64 14 39 62 46 77 -70 -35
6484 -35 48 25 23 -17 -9 -53 41 38 -22 -96 -83 -47 41 -19 -56 11 36 -73 -137 -88 -26 -10 -35 -24 -8 21 -62 39 58 34 16
6515 16 -32 -56 14 0 -13 28 20 13 -31 50 1 -16 42 -60 -69 -93 -82 -71 -77 -18 61 -5 23 14 12 -44 120 -47 -22 -1 -21 161
6547 161 46 -9 45 15 -59 -42 -159 -15 25 -4 -74 -14 16 -25 130 -38 5 29 84 35 -47 28 -74 51 78 24
6573 24 -2 33 61 -30 -18 115 74 15 -10 80 -66 24 -24 42 -20 -133 -22 -90 -125 -45 57 -1 138 -70 -40 16 -51
6600 -51 -73 23 -64 -61 -63 43 24 -42 -43 41 13 133 -65 117 113 75 41 -96 -40 48 -5 94 -137 39 1 60 72 52 55
6629 55 47 -96 -66 -9 -20 111 51 21 -58 11 -109 -48 91 -84 -152 37 -86 95 25 3 20 33 24 -16 11 -22 -74
6656 -74 8 -69 5 8 -106 13 24 -8 17 54 -25 1 141 -9 -3 -35 167 -9 28 -12 23 110 47 -30 -5 -66 10 -70
6684 -70 -42 -38 1 124 -18 -37 39 83 41 9 -91 -10 -1 19 63 -12 -20 18 37 -81 25 64 28 8 -8 -105 -35 -30 60 33
6714 33 39 76 -104 132 -3 67 63 1 -40 -9 36 96 -120 -4 43 -12 20 52 -33 -41 57 -59 43 24 64 15 -12 10
6742 10 81 -22 -8 75 -10 59 4 1 -47 -163 -77 6 95 -15 -15 27 0 -24 -123 -5 105 11 69 -49 -37 -27 -40 17
6770 17 -19 29 -43 -41 24 46 -79 91 44 48 113 8 87 -76 35 42 -31 17 -20 -84 -52 -16 -66 -12 4 37 -22 66 25
6799 25 -19 -47 -110 -171 7 -26 -1 59 16 -29 -62 18 -112 -45 -139 -88 106 -30 -12 80 6 -8 42 38 -66 39 43 -15
6827 -15 -72 36 -27 81 -16 -1 66 -17 -2 45 101 -15 19 44 -49 -52 -102 7 -78 23 -2 15 24 -66 41 -122 28
6854 28 97 -84 -64 65 -73 102 38 13 -46 19 -40 111 -79 -62 30 -31 -9 23 30 71 -10 129 81 100 6 -8 39
6881 39 -1 49 -4 50 71 6 -67 102 44 -27 48 -24 26 -84 76 6 -5 -55 61 -36 54 74 46 -36 -15 -1 -58 -34
6909 -34 96 -72 36 -18 -107 -3 65 -49 -45 -113 -53 29 -94 57 -74 -84 -42 -23 27 42 -67 143 59 -76 -86
6934 -86 -29 40 -5 7 28 -19 80 19 -49 -47 -68 -10 2 1 -13 37 79 73 -156 99 -92 -92 -24 -77 122 -96 65 -87 -1
6963 -1 -45 -20 34 46 12 -142 -140 -61 65 62 -55 -43 45 -61 34 -63 -24 -20 -8 8 -8 47 85 -26 -71 -85 -35 6 81 5
6993 5 -31 -69 18 -9 -96 -12 -27 -72 92 -2 68 21 -98 -33 -38 14 28 -16 15 -8 54 6 128 20 -24 -51 -74 -34 34
7022 34 -1 58 -73 48 28 9 -9 -16 -19 33 44 5 -32 -59 -18 -29 83 -34 24 -83 54 -32 11 50 -29 -116 24 -106
7050 -106 68 31 -8 9 -13 -26 -63 -18 25 108 -51 17 12 -45 65 -40 -38 5 -93 -46 8 -33 -30 21 -33 -35 -64 51 46 -80
7080 -80 93 78 -180 82 12 11 -56 61 8 42 61 -55 8 96 123 -6 11 -56 77 -23 -50 31 -15 22 2 -88 -26
7107 -26 11 -131 6 65 22 -55 -28 52 0 78 51 3 -47 -44 11 26 63 -99 -77 52 -29 65 35 15 -136 -32 -7 -8
7135 -8 -76 -18 -70 119 -27 -104 1 55 31 15 36 26 33 12 6 58 -32 -21 113 -22 -3 5 -75 -29 62 80 -74 1 -4 63
7165 63 -79 75 15 -62 48 -29 16 -10 92 164 60 62 -43 30 62 14 21 62 -13 57 4 69 -8 -6 -21 -47 7 -94
7193 -94 -6 -92 12 -52 -63 -81 20 53 -22 44 -31 15 -2 55 9 50 31 13 3 -27 -40 -127 85 -7 -90 181 -14 35
7221 35 13 -64 74 11 3 9 53 4 -5 79 -52 58 22 72 -98 -99 -83 -91 19 -2 62 -15 35 66 44 33 -2 -31 91 -39
7251 -39 -67 112 -24 37 114 105 -44 52 -82 17 37 -1 -4 -19 -119 -53 147 -6 135 14 22 33 97 -63 -41 93
7277 93 52 -2 -39 -54 46 67 64 51 64 37 -3 85 -18 20 -110 57 40 29 41 -5 -55 6 -31 28 4 -58 -85 -48 -23
7306 -23 -9 49 -114 -38 80 111 44 -41 -112 -23 -144 78 30 -32 3 -73 -113 -18 65 -44 -3 -47 -135 50 -44 51 -14
7333 -14 -3 -112 -70 -30 35 24 -50 2 -82 -91 29 95 -21 54 31 65 20 30 4 5 32 -26 -68 -12 -79 60 -28 -74 12
7362 12 40 2 122 84 -52 -23 -52 21 27 -57 81 53 -49 64 6 -18 65 -13 -127 -74 10 -23 40 63 58 18 72 -44
7390 -44 105 -119 -52 10 136 44 -47 121 51 0 -10 3 -18 62 -21 17 -8 19 -21 -34 16 74 -23 63 28 0 -7 -137
7418 -137 9 29 14 3 -39 78 -32 50 15 9 9 28 -26 -82 -77 -168 -11 -35 -5 75 75 60 -51 1 107 -130 66 -36
7446 -36 31 25 48 80 0 16 -27 -23 -88 14 -101 -56 -17 18 16 59 14 98 51 76 -30 -97 -46 58 -97 22 0 35 27
7475 27 4 -93 86 57 -139 45 -16 -2 -39 -16 -93 33 0 -58 -10 21 23 104 -64 -91 -46 -61 43 -72 -34 -34 -57 -91
7503 -91 -28 39 56 84 118 5 -44 -40 -95 -101 87 74 14 12 1 -37 28 158 38 -23 -5 -66 29 57 -93 -32 -10 -80 -45
7532 -45 20 19 81 -49 41 -80 -26 41 6 -19 -34 -53 0 -131 99 -72 4 -46 -25 -5 57 143 -64 64 8 -55 -49 127
7560 127 -9 3 -12 59 42 0 -27 -98 9 42 -16 22 -13 58 37 -21 64 -1 42 -91 -13 25 -5 37 -31 75 2 131
7588 131 84 32 20 73 -5 -44 20 -154 69 -9 -39 74 39 -13 -84 93 37 26 -25 -11 -22 -44 120 -38 -78 15 33
7615 33 -90 75 32 47 43 -31 -50 -43 -8 -18 -62 90 59 -100 -24 2 11 -3 22 101 -117 -35 155 -71 43 -151 43
7642 43 20 51 -10 -60 -46 -65 -38 42 -81 -6 -28 44 6 24 -95 73 60 -95 -121 -20 -107 -12 16 39 -8 -38 -41 26
7670 26 -6 31 -27 46 -35 52 -23 11 10 24 35 53 -40 20 -7 35 -73 46 -109 -36 51 52 -1 85 -115 49 51 -75 26
7699 26 -35 14 75 98 -38 110 -47 -38 -93 34 -97 44 -32 -14 -18 15 -30 -19 -23 -3 46 50 -98 26 -63 -1 -7 -35 32
7728 32 14 74 1 48 -6 -167 -21 -26 31 47 -13 -19 14 -33 -6 86 -23 29 -55 4 -51 -115 79 -49 77 -27 -25 -12
7756 -12 -23 2 -33 -12 82 -81 -95 10 25 77 141 99 -16 15 53 51 -55 -64 52 -31 12 3 96 5 18 153 -109 138
7784 138 -85 -29 0 124 -113 44 70 44 -50 80 115 -6 10 78 92 -11 30 82 122 -77 -82 -32 4 35 87 -47
7810 -47 39 -6 30 -1 -3 74 -76 24 0 59 -44 66 117 114 -73 -133 -119 -57 -40 60 121 113 60 68 -20 8 31 47 -41
7839 -41 -32 11 5 2 50 -20 7 -5 21 -4 39 122 52 -138 58 29 92 31 -72 105 -18 32 78 -5 -33 -12 34 131 66
7868 66 42 -34 7 10 -39 36 -78 22 -23 -46 36 1 -11 -16 -12 79 11 89 54 -68 -53 90 23 15 87 -17 88 -46 62
7897 62 40 -24 -26 40 -53 1 9 -33 40 1 -82 15 29 130 65 -33 -9 17 42 -35 -65 73 58 -78 -7 14 -84 -114 52
7926 52 -15 41 -96 49 30 -43 -5 33 -86 5 1 -46 -13 -28 47 14 1 82 -10 70 141 39 -105 122 -48 67 35
7953 35 -14 -14 78 23 -64 62 -83 -54 -7 -46 -33 -45 84 93 101 -43 71 -61 -16 76 -22 0 -3 25 -141 48 -115 -18
7981 -18 6 73 -90 30 -45 -8 27 9 -34 109 122 -14 -128 42 -74 -34 -71 7 22 -75 -50 -24 -16 -80 -114 46 105
8008 105 0 42 -20 36 4 27 -127 -3 42 -3 84 -10 23 151 -122 -56 36 -14 -48 -69 -81 47 100 -78 57 -6
8034 -6 0 -54 -24 -3 -35 -82 -114 -17 72 124 33 34 -56 7 -164 120 -54 -28 55 -13 153 103 -25 31 133 48 83 -136
8062 -136 14 51 -21 28 22 -3 -28 33 43 -33 -59 -137 -85 -70 54 48 -9 41 -37 -63 35 45 -112 -1 16 79 -13 85 -86
8091 -86 2 25 -21 -30 53 -56 -50 122 106 -53 112 96 -63 -42 -48 -103 80 -58 -149 82 -83 37 -49 45 -129 -1
8117 -1 -57 -59 57 68 42 -24 -80 23 -18 -44 60 -38 -30 133 9 51 -56 32 -94 -78 63 11 -47 127 70 16 -34
8144 -34 71 31 -2 -9 -18 -28 -6 -13 -6 10 -31 -27 29 -26 2 -38 58 -19 19 68 28 73 -49 -59 -96 88 42 -64 -40 -6 89
8175 89 -14 54 -35 -20 -22 -29 51 -103 59 7 -116 27 35 50 23 70
8191G0
$$ Imaginary data points
##PAGE= N=2
##DATA TABLE= (X++(I..I)), XYDATA
0 0 0 0 0 0 0 0 0 0 0 0 0 0 0 0 0 8 -8 8 -8 8 -14 16 -16 24 -24 25 -32 40 -40 48 -56 64 -72 80 -95 104 -120
37 -120 131 -147 163 -184 203 -226 251 -275 307 -338 371 -411 451 -497 548 -603 666 -736 814
56 814 -905 1007 -1126 1269 -1440 1649 -1912 2256 -2730 3417 -4520 6576 -11736 55313 61098
71 61098 -33307 2953 23824 18667 8985 -10678 -51053 -29060 4809 -9890 -32881 -16207 -11916
84 -11916 -3335 24332 16865 -18065 3431 37437 24633 5689 9712 9242 15484 20975 2218 -16508
98 -16508 -7541 -3318 -11972 -7940 -7045 -27246 -24989 3534 11147 3765 6638 5565 8092 23402 22116
113 22116 5323 3585 5228 -4950 -7476 -1113 -8968 -20440 -10603 -199 -7385 -8657 942 3311
127 3311 3478 5088 2255 2027 7564 9432 5759 331 -1720 -92 907 1789 -1041 -10023 -13518 -6069
143 -6069 292 -1851 -7118 -6504 -171 6185 10806 9150 2655 3971 8727 4947 953 -1684 -7578
158 -7578 -7582 -4036 -8635 -13629 -7948 -512 -113 -1390 -212 939 5720 12554 8262 645 4297 7124
174 7124 4073 4885 1854 -6538 -4755 959 -3345 -8826 -7011 -6301 -7654 -3202 291 -3098 292 7815
190 7815 4736 2884 9065 8173 3600 5819 3479 -3396 -2680 182 -3868 -6240 -3759 -4002 -5037 -200
206 -200 1747 -2471 484 4447 1037 1298 5273 2451 381 3116 1978 -429 1431 1691 -2543 -3419
222 -3419 -753 -2176 -3824 -565 -1071 -3298 1095 3729 998 2479 4705 2497 1824 2435 17 -2281
238 -2281 -1227 -1422 -4608 -4458 -1258 -1418 -1285 1460 880 582 4029 3934 1613 1846 1821 680 542 324
256 324 -944 -1986 -1177 -654 -2402 -2493 -1456 -2256 -1903 -805 -1606 -717 1559 1971 2325 3266 3808 3771 3173
275 3173 2319 971 -964 -1634 -2669 -4315 -4176 -3797 -4042 -2355 -621 -274 1209 2388 2858 3304 2916
292 2916 2703 2023 1015 762 -20 -1149 -833 -1158 -1952 -1481 -1590 -2075 -1746 -1607 -1337 -1049 -703 505 1247
311 1247 1583 2737 2889 2697 3198 2117 961 416 -925 -2129 -2706 -3334 -3130 -2897 -2443 -1174 -224 578
329 578 1793 2165 2267 2725 2028 1530 1090 138 -223 -561 -1128 -853 -1140 -1290 -768 -982 -1008 -657 -822 -463
349 -463 -11 -10 601 1201 1304 1783 1850 1444 1488 876 -31 -379 -1294 -1793 -2091 -2203 -1758 -1411 -918 -13 670 1168
371 1168 1738 1698 1622 1618 763 205 190 -547 -891 -989 -1160 -843 -752 -807 -298 -381 1 296 178 457 771 446 840
394 840 1023 502 652 609 99 41 -567 -951 -1094 -1418 -1377 -1338 -1230 -360 127 332 1309 1342 1300 2021 1573 672
416 672 714 245 -432 -683 -1184 -1512 -1571 -1199 -1011 -1341 -839 14 -69 329 930 636 1091 1844 1363 1089 1292
437 1292 988 594 275 -299 -953 -1471 -1222 -1586 -2239 -1449 -1121 -1055 -135 446 437 1362 1992 1402 1485 1314 944
458 944 735 262 -135 -643 -835 -520 -1062 -1393 -818 -916 -805 -221 -429 -495 488 665 587 1026 1209 1027 1165
479 1165 1035 197 -63 -87 -207 -1336 -1278 -1038 -1533 -687 -221 -785 -114 1016 908 715 1154 787 415 600
499 600 547 -273 -611 -108 -362 -939 -322 -475 -772 69 -126 -689 -110 337 197 566 645 417 658 1275 787
520 787 236 223 107 -439 -699 -561 -1570 -1215 -469 -1013 -728 346 428 677 1201 1073 629 1164 1292 460
540 460 -185 -28 -179 -731 -312 -785 -1183 -474 -210 -664 -453 -246 -372 25 205 161 378 845 874 835 736 684
562 684 525 592 239 -675 -829 -503 -1032 -1104 -670 -988 -626 234 284 75 696 831 544 552 531 254 150 439
584 439 34 -446 -139 -27 -251 -3 -139 -710 -253 -107 -342 -358 -250 -262 82 313 198 240 575 550 215 267
606 267 245 -229 -70 55 -649 -562 262 -221 -349 136 19 30 468 446 -150 -335 203 -56 -410 -55 -75 -452
628 -452 214 344 -274 234 457 67 130 276 -63 -7 242 29 -218 24 190 -70 -142 25 -336 -271 193 -289
650 -289 -541 27 -16 -188 313 230 242 374 643 267 141 277 203 -298 -224 -62 -494 -302 94 -333 -214 14
672 14 3 40 206 169 14 94 279 141 -62 225 140 -3 100 83 -307 -9 -115 -408 -432 -221 -184 -97 -53 91
696 91 155 164 437 169 116 214 137 -14 19 -144 -236 -107 -171 -281 -128 -93 57 -21 12 101 140 -17 232 47 64 236
722 236 104 90 169 -16 22 -16 -103 -291 -190 -299 -215 -128 -66 126 176 180 272 290 227 198 156 165 -180 -164 -183 -257 -301 -158
750 -158 -240 42 1 -79 105 52 -191 143 131 -47 19 -5 172 202 200 190 109 38 74 -61 -221 -95 -235 -360 -105
775 -105 -155 -176 79 167 161 219 245 221 27 -36 98 -41 -208 23 -157 -178 104 -12 1 96 38 41 -6 28 36 -14 3
802 3 65 144 37 69 -42 49 189 -40 49 -35 -218 -146 -138 -155 -48 -104 32 -2 140 228 121 119 184 17 -72 -64 -78 -69
830 -69 -99 -232 -26 -113 -47 165 120 11 207 130 43 34 -9 116 -3 -89 -56 104 -122 -4 87 90 85 -64 -195 -48
856 -48 -156 -145 -22 53 17 55 132 132 109 -59 4 -54 -109 -102 -178 -151 -104 -28 -11 96 -22 137 222 106 19 137 12
883 12 -55 -145 99 72 -68 -70 28 -114 2 -85 -19 6 -68 -90 70 60 -4 13 10 116 72 136 66 16 -83 -29 -190 -243
911 -243 -76 -144 -160 -117 41 -59 -19 209 236 154 33 225 76 4 65 91 -8 13 -47 -221 5 -54 10 -91 -65
936 -65 -94 -30 -127 -44 128 73 67 17 292 59 66 131 94 -81 12 -99 -288 -65 -123 -174 -83 -93 104 74 49 107 -23
963 -23 42 144 18 151 102 162 131 -14 -90 -13 -20 -41 -173 -182 -128 -57 -76 -98 -119 67 90 73 45 129 163 -37 107 128
991 128 -241 -27 -39 -124 -21 -62 -86 28 -98 42 -126 17 45 -15 57 75 68 101 112 -27 -14 142 18 -33 8
1016 8 10 -108 -185 -52 -93 -84 90 -13 -137 0 165 86 46 102 -68 -83 62 -101 -100 86 -79 -26 7 -48 -31 65
1042 65 143 -13 -135 33 -15 -14 33 29 -30 10 84 26 123 97 -13 -33 7 51 -132 -19 -28 -117 15 58 0 43 152 -42
1070 -42 51 137 36 -38 -55 1 -40 -11 0 -33 53 51 79 35 47 -39 107 88 22 5 -81 -143 28 145 -18 23 87 43
1098 43 8 -13 15 30 -104 -92 -104 -75 35 13 -111 32 26 87 38 37 -62 -55 49 -77 -72 -42 -23 29 51 99 48 -25 160
1127 160 149 -90 3 -12 -31 -81 -64 -59 88 16 -33 -64 64 91 -63 -85 71 4 -19 105 15 42 11 -31 7 46 -95
1154 -95 -10 -36 -123 60 -170 -26 -15 -42 69 19 -24 -33 74 72 -10 5 -34 -45 6 -39 49 29 45 5 -48 25 -36 -78 24
1183 24 -67 -53 -40 12 -86 22 10 5 41 26 -88 -20 -80 -81 -110 -120 -90 -136 -63 -19 19 16 61 -127 1 -31 40 -53 -40 2
1213 2 49 75 -30 35 -16 -17 25 -22 40 21 -48 6 -5 94 -44 39 -32 39 131 123 54 -20 140 -34 -15 44 -62 -39 -93
1242 -93 -83 150 -73 -135 97 -28 38 38 -27 -33 98 47 99 117 -6 80 15 50 59 14 -55 18 -61 -67 -5 -201 -141 -20
1270 -20 -62 -47 -12 8 -52 13 -42 -112 -3 5 26 -16 36 -32 -64 -43 -28 -88 -19 -13 -28 -56 -45 -6 11 41 40 -20 -95 63 47
1301 47 29 37 -6 -156 -34 47 35 -45 12 -117 47 -10 -87 19 -13 49 28 10 20 -95 23 -46 89 11 -56 -54 33
1328 33 -4 19 96 -49 29 -21 2 -72 -4 -57 22 -58 39 32 48 5 -9 -23 56 26 -11 -1 65 -131 -124 72 36 -3 24 -101
1358 -101 18 -44 -112 64 -68 -19 -16 49 -7 1 -58 15 1 13 -43 -11 -37 -13 -32 -40 25 99 -30 -78 136 98 30 100 -3
1387 -3 -35 62 -6 49 138 24 -34 42 32 -4 39 112 -158 -99 -81 -45 73 -95 -8 -12 -66 -91 -18 -28 -76 -80 29 -31 31
1416 31 -26 49 2 5 -15 -16 15 29 -16 39 69 -14 102 -3 -16 65 25 -71 62 -66 36 -42 -39 -6 74 33 25 57 -64
1445 -64 34 2 11 -86 -2 -120 97 -57 -28 54 86 251 13 60 32 -48 -63 135 13 92 35 -13 79 17 -40 -6 135
1472 135 0 26 -91 7 168 -4 19 -60 -90 43 20 -55 0 -47 -46 -42 -122 -39 49 -30 10 -51 11 19 124 -49 -5 7
1500 7 -107 19 4 33 -46 -8 224 -73 -58 -50 -17 84 -23 103 -30 98 174 -16 64 56 2 34 43 15 -20 -35 28
1527 28 -50 61 -17 108 -26 4 7 -78 -28 7 21 43 92 116 -43 -50 81 54 -8 33 100 -55 24 -10 -59 41 32 124
1555 124 -80 -89 55 115 66 -6 -8 45 41 -104 23 -66 -26 -30 -132 -74 -43 -77 -86 12 29 -18 2 -7 113 36 -15 16 -46 -137
1585 -137 -42 1 -18 -38 -9 82 -4 -102 -66 -21 77 27 -23 -35 -21 -31 -26 7 -17 3 -134 -41 53 -53 29 82 26 -71 -7
1614 -7 12 36 -51 -31 4 -6 -10 16 150 43 -26 36 -7 105 -24 115 13 85 12 -71 -14 140 -44 22 -102 -100 10
1641 10 -29 12 -20 -7 71 -81 11 8 -19 8 26 -32 -63 -16 52 -54 -80 52 -11 46 57 40 -13 59 -5 -37 7 106 -1
1670 -1 63 95 -75 -6 -4 32 -55 -21 130 56 9 -41 37 -11 -5 48 35 -20 -40 4 48 -55 -10 -60 9 -78 14 14 46 69 14
1701 14 -60 24 17 -53 -10 80 53 -52 -85 72 15 -5 10 15 48 -90 29 73 62 144 -69 44 37 45 -105 -103 -31 16 93
1730 93 61 22 13 -35 94 41 -82 -18 -26 6 -47 -50 -100 -4 44 -36 -246 -37 -61 46 -55 -110 36 -44 120 9 3 -42
1758 -42 -76 26 -33 141 -117 30 -13 9 -83 12 33 -29 1 14 -7 57 8 93 -26 -52 44 -80 28 7 -8 24 -96
1785 -96 -118 74 22 6 16 -9 61 31 40 64 64 70 -41 96 73 1 -22 -39 72 121 34 -30 -49 98 -112 43 -37 -89
1813 -89 -112 -1 88 -130 -53 82 -3 73 -19 -17 -27 6 97 -14 21 -11 -40 -90 84 1 19 7 103 84 -42 -74 -24 48
1841 48 -27 10 114 -11 34 119 -68 29 36 25 21 -99 -29 77 2 50 61 -83 -40 -110 34 -4 48 16 -79 -3 68 -3
1869 -3 -12 72 -22 7 122 -6 -46 22 -31 -33 40 -2 8 129 102 -33 -31 -65 204 -101 4 73 -1 -103 -3 -23 -63 73
1897 73 -28 -197 -65 16 -68 95 29 -59 -133 84 2 34 -21 -132 -31 -55 -47 12 -117 -4 41 -33 84 53 72 161
1923 161 65 75 -46 -13 4 -77 15 -71 -25 -30 64 24 -15 -4 79 -4 60 16 -9 -34 -12 -21 29 31 108 -7 -110 -66 42
1952 42 26 50 -137 -2 17 -113 -39 -90 66 81 -28 -43 115 69 58 -110 76 -14 143 48 10 55 35 31 -43 18
1978 18 -10 52 -59 -26 -30 97 33 -27 2 23 -136 119 33 18 -14 -13 -26 76 34 10 -70 51 8 37 108 112 -10 -10 -80
2007 -80 60 39 -10 59 8 34 -69 -4 3 120 -28 35 30 -101 -83 -36 -33 102 -48 -67 -88 -87 5 66 109 3 105 -92
2035 -92 -67 47 -23 66 18 10 -41 90 -8 -27 -77 14 30 -106 9 1 37 -23 -71 -146 -81 75 3 36 48 16 -75 74
2063 74 -75 72 24 69 -14 43 -19 -98 23 42 -39 -115 9 -60 164 36 112 -72 -79 127 79 -7 70 -53 -7 4
2089 4 83 47 -9 23 -75 6 65 13 92 -32 123 71 6 -48 -4 -94 -38 39 10 -75 -44 25 2 -64 58 -81 55 10
2117 10 1 -94 -76 37 56 -51 77 46 -33 -111 -45 50 87 -37 -22 -5 -115 -1 -42 6 2 2 53 -173 -123 3 -48 7
2145 7 -18 39 54 39 -97 -106 8 -14 -70 30 -7 11 -71 -31 -1 -16 -90 47 -9 64 -33 45 -34 -34 90 33 -5 23 42
2174 42 -42 4 26 -66 3 120 -65 30 85 94 -52 -42 94 -19 -10 -3 -72 22 -64 47 -45 45 8 50 26 22 3 20 -36
2203 -36 -38 13 17 128 17 148 128 58 80 107 10 21 -104 41 11 109 -112 -14 96 31 -46 8 -24 -27 45 24 -1 -45
2231 -45 91 -11 25 32 22 32 -132 60 29 28 27 -31 -48 -5 -101 -112 -30 -9 -70 15 57 -95 -59 -58 -52 50 13 51 -5 -123
2261 -123 68 -24 -15 36 -85 20 62 71 15 -49 41 113 -28 -11 -61 73 27 -8 18 -104 38 16 -2 -48 -58 27 85
2288 85 30 -6 -15 -32 -19 63 28 14 31 39 -8 73 64 -16 -139 81 -20 -77 11 -65 -111 -133 -84 11 27 30 42 -53 -159 -123
2318 -123 -53 -107 -30 107 -4 -12 -18 7 -58 -52 86 49 20 40 65 41 79 18 12 -41 -54 -3 82 -23 57 98 -58 81 -37
2347 -37 87 -92 -21 58 22 43 -30 28 16 -76 25 -47 92 49 47 -130 32 0 -69 -33 -61 62 -60 40 25 -41
2373 -41 -4 -35 41 -3 24 23 27 -12 -131 -34 -55 82 -144 27 45 -31 37 -98 69 -32 -12 -98 -109 -146 17 38 -16
2400 -16 -4 -42 -85 -25 -36 4 -12 -37 32 81 -49 -8 -27 0 -88 -53 94 63 21 15 -42 -27 63 -63 4 46 -78 -19 97
2429 97 60 16 -77 68 13 12 84 38 30 20 -32 -18 -9 80 -49 -5 7 -28 -81 -59 141 -13 65 -90 80 -117 -45 90
2457 90 -103 79 -107 11 -3 64 23 110 10 -15 -54 -74 47 46 47 110 -33 -103 -16 70 45 8 -15 31 31 114 -5 -13
2485 -13 140 36 55 28 -11 -2 20 -7 -32 37 -50 -70 -11 -80 -19 45 46 -81 37 29 64 16 -6 -28 -51 2 44 103 14 8
2515 8 -1 -37 30 34 60 72 -21 110 75 9 58 30 -23 -47 20 12 -27 -130 -112 -6 150 6 -4 89 60 53 -43 35 -21 39
2545 39 -19 63 -100 -38 7 22 -59 -66 29 46 -4 47 -95 -88 -74 5 125 -127 -3 59 -10 58 40 59 -62 40 -25 -17
2573 -17 -84 -78 -134 -62 -27 -3 47 -43 1 112 -43 -121 44 75 16 -75 -34 -20 117 39 -25 49 20 60 -16 72 -38 -68
2601 -68 -24 -21 -86 37 -19 -27 -74 -40 -20 64 -38 -2 13 67 134 83 41 -19 -68 80 11 -60 40 9 -54 -42 -27 -71 112
2630 112 74 -12 101 24 14 73 17 25 -24 7 -9 -17 1 98 35 79 -134 115 -2 50 -17 105 -6 -5 -157 68 83
2657 83 -84 -106 3 -20 -142 16 -42 -4 -68 -5 -7 24 -74 128 -14 37 12 65 -86 -43 -87 119 -34 -20 -83 45
2683 45 19 -116 15 20 -10 -124 3 6 44 32 53 27 15 -54 -33 -32 -1 26 -23 -71 16 4 -54 -46 93 -46 52 118 4
2712 4 33 21 60 30 -25 -57 14 111 78 101 55 -39 -18 36 24 -21 19 -74 -34 -21 119 -11 -111 5 49 -37 -81 -71 39
2741 39 -1 -4 114 -20 -50 13 -86 27 -10 -120 77 -58 -5 -63 0 82 50 59 54 33 -11 18 108 -4 -18 13 69 23
2769 23 -5 61 -17 -157 -106 28 -5 -36 -30 -80 20 -46 81 18 -81 68 -46 88 -47 -96 -26 18 -11 125 58 -1
2795 -1 -68 40 -24 -6 -5 111 85 67 -13 2 -45 -4 -8 -70 4 28 -8 -32 43 120 -95 64 -2 -37 -64 -13 -95 -42 80
2824 80 91 -24 -58 66 0 99 -108 -1 28 74 1 3 40 83 -4 -37 40 12 -72 44 -66 -99 4 11 56 -50 53
2851 53 -37 -3 95 -100 -84 -76 37 24 45 -58 47 -31 -11 -52 -81 -24 -30 110 -51 -61 -124 8 -22 103 9 102 -126
2878 -126 -44 69 26 129 -17 -31 -158 2 15 21 8 -36 43 -71 90 -31 3 1 37 -22 85 -82 -50 16 -31 -109
2904 -109 -2 94 -32 72 -87 101 -35 5 19 -88 43 20 -122 81 1 -27 43 -25 61 65 49 -43 -20 -18 -65 -12
2930 -12 106 -146 -113 52 79 71 -11 -42 20 -31 47 -25 -144 177 51 0 -92 -43 11 12 18 -25 -99 2 12 -100 9
2957 9 78 -43 -55 41 -75 62 77 -130 47 -17 25 -119 -43 -54 72 40 28 89 -60 -48 -75 -32 12 -98 35 5
2983 5 16 -111 72 93 52 -59 25 -37 -48 63 77 18 -98 -86 84 65 -22 -35 34 55 90 85 -87 62 143 14 70
3010 70 22 -50 35 3 55 70 -13 -96 5 -78 128 37 -5 3 -10 80 32 -75 -96 88 64 -58 -28 26 -46 70 42 37
3038 37 -2 -53 -40 64 38 -79 10 58 15 32 -60 -39 -44 -59 17 -2 32 117 2 2 4 -53 8 98 -41 -73 -20 -35 -80 149
3068 149 -85 43 42 -28 -67 28 -5 -73 -40 -136 82 -18 3 -69 9 40 30 -55 48 -12 36 15 16 110 -21 -2 -12 -41
3096 -41 14 1 100 148 -9 92 17 123 -66 -32 7 -10 57 -3 -70 -63 -42 -17 -13 4 -43 3 6 127 78 106 74 70 -28 -39
3126 -39 -10 -19 -58 -98 15 -37 0 11 10 -13 71 -120 -90 14 19 14 -20 -2 118 -23 -5 -82 91 -86 -17 -42 56 -84
3154 -84 -34 25 -16 6 -23 -80 -29 -116 -34 -7 -50 -14 8 -102 32 35 -77 72 74 4 68 34 47 25 55 48 29 99 -53
3183 -53 43 51 8 -88 -80 -1 3 -29 -62 31 -88 4 117 -77 -121 -51 -3 58 20 -9 -57 -6 134 6 2 50 -64 20 -71
3212 -71 -104 27 -91 2 -4 102 -67 -14 -63 30 88 -68 25 21 69 19 78 -168 2 91 -3 -92 -3 -5 -81 48 -87
3239 -87 -29 6 -115 41 -21 40 -12 -112 1 8 -14 -51 -10 -52 118 -113 -88 -104 -10 -80 -39 -7 -39 -109 11 -22 -15 -39
3267 -39 -20 12 -114 -48 33 -9 30 38 -99 9 32 -40 -62 16 -29 41 30 -139 -115 54 -135 -86 113 50 -110 -36 2
3294 2 31 -35 9 59 -90 56 -63 -8 -38 51 10 -3 32 -44 -29 -14 99 3 -60 -51 42 38 62 -83 -4 43 100 65 -22
3323 -22 -62 47 39 16 45 23 -62 14 -45 -15 -8 23 60 29 17 -33 1 49 57 -14 -73 -67 2 4 -39 1 -50 89 19 0 19 8
3355 8 107 -33 46 146 52 100 -78 -113 -26 66 -17 24 60 43 2 112 -28 61 -117 2 131 117 140 -118 -111 -117 -156
3382 -156 117 -45 50 84 102 26 -133 80 44 38 -33 -37 9 -43 -40 -60 25 18 85 -23 -46 90 46 -112 10 36 -8 -65
3410 -65 -175 35 13 -10 -60 -49 27 -6 66 76 34 98 -69 30 7 -74 -132 -77 -23 74 -29 -33 69 108 -7 18 -134
3437 -134 -30 -150 66 136 21 41 -49 32 35 -100 90 25 119 92 -2 121 -56 117 29 -1 48 -52 16 96 28
3462 28 -99 118 0 38 26 85 -5 36 3 38 4 -27 -22 -9 110 40 1 48 -7 -75 19 78 -37 6 4 -6 58 -13 -58
3491 -58 -67 -38 26 -50 -53 49 -185 -56 -87 -74 132 29 -53 -24 -96 30 -12 19 -61 -75 67 25 105 12 -121 21 106
3518 106 -26 108 28 -94 -83 -30 -38 55 119 -54 30 60 -65 13 -19 72 33 -78 82 -56 -14 21 -36 49 -4 -29
3544 -29 46 58 -13 116 -67 -42 -7 47 -26 109 -92 91 4 97 -76 -34 -34 73 80 11 -40 37 -37 61 100 -34 -43 -85
3572 -85 -14 -38 -14 17 -48 44 77 -63 28 -66 48 46 -66 136 13 -41 -1 -48 35 29 56 27 136 -94 32 -65 -80
3599 -80 81 35 -80 -22 58 -43 -66 -11 -103 -13 16 -26 -51 -52 84 -31 -33 54 122 -57 -61 -98 -37 -9 -5 -73 9 -10 -73
3628 -73 89 11 11 41 68 -17 0 90 -16 -30 -113 -6 -75 134 -24 47 -64 -5 -106 34 70 15 -5 -12 1 -75 39
3655 39 4 -19 0 62 0 3 -66 83 30 -64 21 71 -58 -18 -64 105 -37 52 -45 -113 89 -83 66 26 4 3 15 31
3683 31 30 13 62 13 -100 57 65 -38 -31 45 -62 15 5 16 34 -20 -84 33 -13 -46 48 2 90 -152 -74 60 4 78
3711 78 -106 -1 -102 6 -47 85 -36 6 38 -5 -72 12 96 203 -43 -67 33 76 -48 40 107 38 28 25 17 -12
3737 -12 15 -2 13 -18 68 -108 -39 54 -11 -31 -7 -141 34 72 -41 96 49 23 1 -111 -21 -102 103 57 40 -49 13
3764 13 -55 -94 -25 -20 75 20 -27 -11 -33 36 -7 1 -28 66 18 -87 -104 -123 -12 38 -53 -156 12 138 -70 -34 17 64
3792 64 -78 66 86 -82 39 -97 -34 45 15 -95 0 15 -58 136 162 -26 1 3 76 -19 -8 20 -23 -39 6 -40 7
3819 7 66 -10 -67 22 -41 -45 -95 -150 39 -25 -9 5 -60 53 45 67 145 132 26 -38 51 -23 -147 47 35 50 51 70 40 -57
3849 -57 -11 12 -5 -8 63 -34 -45 20 -49 -67 -151 8 5 27 57 -54 8 -56 41 -24 127 4 45 -27 53 30 80 -3 -8 -59
3879 -59 4 -43 -110 43 -60 52 -54 -50 -84 19 -88 90 -61 91 89 57 29 19 20 14 -14 62 13 40 -75 -41 68
3906 68 -29 -36 98 -51 0 16 -60 7 -2 -39 73 -82 105 -14 17 -47 -39 -26 14 52 -84 62 52 39 30 23 -100 -40
3934 -40 64 87 78 22 55 -34 97 121 114 71 34 -46 -96 43 43 -28 63 133 30 115 -8 112 66 -31 -89 -29 -117 56
3962 56 60 -89 89 26 -9 -53 1 7 37 14 32 10 34 76 -98 -69 -13 82 -4 3 -143 -56 33 -76 2 27 -73 83
3990 83 -32 -20 32 -87 -20 -63 111 -40 43 -47 32 33 85 -50 -8 42 -86 -37 -54 -19 23 76 16 -37 -84 38 -16
4017 -16 55 -142 -10 83 72 5 108 -21 135 -42 -24 22 21 -56 -53 118 -56 7 -7 -15 -17 -21 40 -15 -67 -125 29 -19
4045 -19 -21 -116 -11 -83 -91 36 47 67 44 58 10 87 -41 80 -84 -4 -18 27 0 -49 47 -100 87 2 -37 -41 48 72
4073 72 -14 -83 -6 61 -51 11 108 50 56 -81 -118 41 2 -7 -88 31 -5 6 -128 40 -81 48 -37 37 -2 110 47
4100 47 -18 -25 -40 15 28 -125 88 -67 49 56 -95 -25 -73 24 -106 27 0 -32 -42 -3 -28 -21 -132 -96 -37 23 84 -108
4128 -108 38 -46 16 -11 -39 -3 78 -4 65 -30 -13 28 -11 -89 -7 13 -40 -4 -149 -9 172 6 -92 -136 -50 106 0
4155 0 25 128 -8 119 -43 16 -57 -47 82 12 61 11 51 55 -81 -39 -52 81 -88 15 -12 102 -20 -65 -37 -69
4181 -69 -78 -37 -57 -79 20 -67 60 52 38 34 21 -39 -106 13 -22 -33 -57 -66 -108 -34 -7 -110 -11 37 52 11 -41 39 5 -33 -8
4212 -8 134 3 -30 -8 -21 51 8 18 30 -67 -95 25 46 141 -151 -121 104 -19 41 -84 6 -39 72 22 -9 12 81
4239 81 -26 30 -27 -58 46 -68 38 -15 80 -56 -47 63 59 -11 -57 25 -72 5 -67 -159 113 -4 65 34 -30 5 -14
4266 -14 48 10 66 -19 49 -17 40 -60 35 -36 -86 -46 -57 -37 2 30 -91 -46 107 -28 -52 -139 -56 3 18 35 -148 -39
4294 -39 -15 -3 -4 -135 -42 -16 -15 -27 57 103 57 -37 -16 58 61 12 64 -69 15 39 -32 76 32 -8 39 9 55 -18 -34 -68
4324 -68 44 10 -71 -23 61 -16 116 -48 71 -52 -25 64 -129 53 66 52 252 31 53 18 -49 -18 -37 51 -70
4349 -70 3 -36 2 47 -29 97 49 -22 -14 -12 -5 -57 -47 54 -22 -69 -53 0 -35 -119 -38 48 -127 1 -27 -32 54 -16 -30 -141
4379 -141 74 112 105 -49 -52 -52 -33 10 58 -33 79 30 -69 -85 37 -40 -11 38 -46 -18 -117 50 -53 -33 88 -82 -98
4406 -98 86 -16 -18 -50 -19 -49 124 -22 -19 -52 -122 94 -5 7 -55 -58 92 -9 -44 69 121 63 -71 7 -1 130 37
4433 37 68 140 -50 -10 115 6 17 -60 24 29 -38 -36 24 33 61 -73 -41 82 -148 -90 29 43 32 36 -29 -88 54 11
4461 11 26 -17 34 -25 -79 -94 1 -23 -69 -71 -65 -124 -24 61 79 -28 -51 -1 150 93 -5 -86 15 -48 1 0 -8 71 -86 6
4491 6 67 -16 -22 -74 -67 -28 20 49 55 49 26 65 -60 75 110 30 87 -13 39 1 79 44 -13 -6 -55 81 166 32 -66 -59 -46
4522 -46 103 -45 -49 50 -42 -1 30 31 -120 0 -65 -156 -96 33 -27 -99 -15 43 27 -8 95 -1 -121 14 -112 37
4548 37 117 -28 -95 62 -87 -119 58 85 -69 37 9 0 14 -5 -23 8 -56 -21 51 -16 30 47 136 5 -58 67 -33
4575 -33 16 -34 6 8 -2 14 -68 93 -13 -51 -92 32 -2 96 9 66 90 -84 -24 38 -96 -46 87 48 -12 48 84 -31
4603 -31 9 40 -90 -88 46 30 58 -24 70 18 7 -85 -129 -183 60 72 -84 -71 23 -43 -12 49 -3 -9 10 -2 -67 -83 8
4632 8 25 44 31 -31 -103 -18 92 9 60 32 5 -71 -2 19 -74 7 -22 106 -65 9 9 20 77 -32 -6 -167 54 -15
4660 -15 -103 -76 -57 14 -6 -132 0 -49 -73 -47 -13 44 47 -4 -39 1 -59 -111 52 115 -83 -17 38 -49 35 -88 110 9
4688 9 -40 -22 99 -12 -11 -1 32 46 -80 -85 -33 26 -54 -84 184 30 40 -11 62 21 -20 165 -1 -80 -25 98 -45
4715 -45 -39 40 -90 -13 62 135 39 -37 -94 76 -68 -29 -6 16 9 -27 -19 -53 0 3 -53 -44 17 -105 78 -27 8 -29 61 33
4745 33 -7 -64 -28 161 -15 42 -68 8 -70 -92 -31 -6 -21 -20 47 -10 60 -28 -2 131 -71 26 88 -89 -47 -61 29 -1
4773 -1 54 63 -55 -115 -167 -49 110 -47 42 32 38 -18 -30 41 2 -105 31 -73 108 27 -84 60 108 72 -21 -81 10
4800 10 67 -66 20 63 95 29 -71 -23 50 2 -97 -36 -29 -74 64 -64 -15 3 32 31 61 12 -40 6 -9 -73 -36 4 -21
4829 -21 29 49 57 59 -35 -36 30 126 74 -88 59 53 145 48 44 142 -130 -96 -84 -32 -111 -34 25 -60 -37 -42 35 26 -4 71 -60 -21
4861 -21 -10 -75 -60 -1 -44 19 -5 -140 -92 -48 -40 -153 -142 47 27 83 134 56 79 -26 -91 114 43 43 -64 -68 99 11
4889 11 -9 31 147 -113 35 61 74 1 12 -22 29 81 -65 -4 -51 -79 58 -55 19 -1 8 -114 -40 -43 38 66 78 -6
4917 -6 -18 53 37 -56 76 -3 -15 122 -4 75 12 -18 73 54 50 35 3 41 -60 -44 -66 -44 -42 -22 91 -37 169 39
4945 39 5 24 7 -18 39 -9 101 20 35 -93 30 22 -48 -56 40 21 4 -27 39 55 -43 52 -20 10 -88 24 82 -105 -30
4974 -30 124 -72 -109 46 -1 0 -15 -14 -3 52 37 13 53 -31 182 -44 82 97 -36 -103 80 86 -56 31 -51 69 -13
5001 -13 36 66 138 -107 -20 -15 8 91 26 -36 50 -29 58 -57 4 45 28 -49 11 -11 12 79 -29 5 44 -34 -14 78 -26
5030 -26 -7 -86 -69 18 -61 -34 -118 23 93 14 19 -47 63 166 -11 85 39 -12 43 -9 30 61 45 19 -61 27 73 -28
5058 -28 71 25 14 112 30 -44 13 64 49 -137 -82 54 -135 48 26 8 25 19 -22 2 23 -44 -86 -120 89 36 60 31
5086 31 5 51 -65 21 79 -43 22 -54 39 22 130 -32 94 66 24 74 -21 -10 -31 -109 43 19 83 -26 -9 -47 -6
5113 -6 2 -16 -18 -26 -41 -9 -70 -8 44 6 -72 6 63 -49 36 -4 -38 -45 13 23 34 26 56 -13 -5 -45 30 23 -19 -13 70 26 80 -1
5147 -1 -6 4 11 -44 26 5 71 -22 23 27 32 -28 -10 59 -18 47 33 47 -100 -56 -123 97 60 -49 -12 47 25 115 39 30 94 111
5179 111 -62 -26 10 -154 72 15 113 25 55 -56 -46 -15 33 -73 3 65 -52 27 29 -77 40 16 63 44 27 -26
5205 -26 -19 26 47 100 -62 -7 -30 -4 5 -46 86 29 -3 5 44 14 -122 104 -2 25 28 37 91 82 -53 -47 -64 -6 66 9 69
5236 69 -37 93 62 4 -68 -31 126 -25 138 -12 84 -60 16 28 17 -41 -115 -38 -62 22 -13 -7 -70 75 12 1 39
5263 39 -63 -44 34 20 -45 85 75 -124 47 -7 -21 -5 101 -4 -37 -90 -39 141 120 30 45 -128 -41 -59 10 -80
5289 -80 -128 -162 -9 -13 -42 58 9 44 -48 -89 47 40 12 43 -39 42 54 22 14 7 32 41 -21 7 54 -8 15 5 46 22 -99
5320 -99 15 19 113 76 148 -119 185 -72 -43 -67 41 37 -31 91 -21 -54 -44 -108 -44 -22 41 53 -28 -27 -20 70 -92 -32
5348 -32 -22 -9 8 -6 -151 -17 26 18 -49 51 12 35 -78 98 45 -15 -53 -98 53 -76 -11 27 -76 -10 5 44 42
5375 42 30 91 -69 -1 -116 -23 7 87 -14 -67 7 -11 61 -39 29 26 -16 38 26 55 95 0 30 -36 -27 1 -68 -47 139
5404 139 -2 -30 -20 -16 48 -65 -51 122 -47 17 -132 -32 -40 -28 -63 5 -71 -68 -94 -30 -32 57 -19 -11 7 -15 -36 4 33
5433 33 6 27 -54 -13 -28 3 18 65 25 -36 -177 -58 -64 -67 -11 40 52 -122 0 -52 28 128 56 92 48 94 -6 -70
5461 -70 -77 -5 -2 -117 126 -37 64 -106 -86 11 49 40 8 -1 162 95 123 -21 4 -26 -44 175 42 100 -3 24 36
5488 36 106 56 66 -32 -75 23 -6 -11 -19 24 37 -4 -55 -64 39 -38 24 -49 -97 -61 -68 33 22 -34 -5 -36 -26 -24 -47 -23 31 63
5520 63 17 -64 -113 -37 -3 -41 3 93 -116 -58 23 -4 -33 -23 -35 10 -62 21 -50 -49 13 -49 71 -53 38 3 -32 4 -76
5549 -76 -48 26 151 -21 -77 65 38 7 14 10 -10 40 -30 -69 130 84 114 -25 1 24 -59 -35 0 -62 63 -4 -49 13
5577 13 39 56 21 106 65 56 2 -17 3 -59 108 13 88 3 -55 72 12 95 15 -72 42 -67 71 -142 0 77 -1
5604 -1 -35 -51 -39 35 8 -28 81 -57 -14 -116 -22 -30 133 -24 -93 26 -9 20 113 -35 -154 61 2 22 -67 54
5630 54 80 24 32 98 27 27 -67 66 43 -28 40 73 49 -16 82 10 110 -75 48 -124 -71 54 -11 -43 92 -50 -35
5657 -35 -99 -6 -79 -2 24 -62 29 -40 -14 31 25 63 51 -34 -85 76 65 -55 -21 -8 -14 1 58 -6 -50 -24 55 50 67 -17 19
5688 19 65 118 9 19 13 73 1 6 -80 6 22 6 -12 -15 65 71 -59 0 -28 72 18 -66 26 49 -67 -4 64 6 -15 30
5718 30 139 -52 -8 -92 -30 24 60 -121 24 -4 -94 -54 -58 78 -48 64 -5 -10 43 -2 -47 -50 -3 68 8 -98 -57 -57
5746 -57 -68 -45 106 0 25 113 10 -69 15 74 7 13 -72 -74 -49 -10 126 -36 113 -77 -56 -15 -1 -139 -75 96 39
5773 39 -26 123 29 95 44 44 -106 -87 -122 4 20 -40 -72 -2 -99 -73 -86 38 19 78 -36 75 -2 -23 88 13 25
5800 25 73 133 -34 -44 -25 164 19 31 -110 59 4 110 87 33 4 4 28 -26 -14 -31 -25 -53 -12 5 -25 -3 4 6 44
5829 44 -98 33 82 32 -101 -32 -7 -51 -84 29 -48 -35 50 -130 -127 47 61 61 30 -73 67 -10 37 -32 -96 29 90
5856 90 21 -42 133 -19 -60 0 40 25 4 -27 -83 81 -2 -66 3 71 -69 -79 24 48 44 36 -72 23 -1 -103 12
5883 12 52 -54 -57 87 116 62 -44 -66 -37 82 -24 70 63 -86 -20 154 -48 -99 -63 -19 9 -75 -90 37 156 -26
5909 -26 -100 -91 -17 18 73 -94 37 26 -5 99 -4 -57 138 90 4 -33 23 -35 28 -43 -17 -3 -53 0 -24 123 39 92
5937 92 -103 -21 -75 47 17 7 -59 145 49 61 18 17 41 -27 -24 -102 -56 -10 -54 8 108 -32 -21 2 136 19 110 -74
5965 -74 58 54 -16 -67 24 -47 27 -17 -8 -35 45 -132 97 33 0 -3 56 27 51 21 3 68 -134 155 -20 66 1 -42 16
5994 16 18 2 69 -100 124 7 -33 88 -69 -12 -39 34 -51 45 57 -111 9 64 4 33 9 21 35 32 90 -30 72
6021 72 -44 43 3 -131 -28 33 35 96 -7 31 -59 43 -97 -81 -9 -57 3 50 117 42 -33 78 -67 30 -101 -82
6047 -82 -81 131 40 -9 124 -38 101 -59 -23 -77 -99 50 2 -16 6 -36 89 54 -43 -15 -29 58 145 7 -12 -30 -58
6074 -58 51 -47 -78 103 -71 33 14 -126 21 17 -65 -81 -28 65 102 -134 -110 38 4 24 92 14 -25 -97 28 47
6100 47 -83 147 39 -86 50 56 -10 94 2 3 -27 69 -54 -18 -95 -92 -10 -81 27 -7 -70 107 -15 10 -51 84
6126 84 5 -48 -41 116 8 -65 -80 -174 -106 -20 -36 82 -132 9 91 -56 105 -99 -38 -95 110 45 22 -93 -2 -12
6152 -12 18 17 24 54 42 49 52 -33 -32 -2 0 -74 -84 34 -40 -27 -12 -45 60 -10 -84 63 -56 -21 -110 29 47 -11 77 76 50
6183 50 -66 -46 -51 -4 -41 28 -2 -11 3 4 54 131 7 4 -33 58 14 -55 -75 -63 15 -31 -67 -82 41 -10 45 94 -41 -5
6213 -5 -29 33 -24 -57 -19 -43 -40 30 97 38 12 -64 36 143 -40 -2 -22 10 -68 25 91 -29 5 -42 -41 10 145 -142 68
6242 68 -1 -30 -122 -63 8 11 -58 26 -12 98 47 9 51 49 58 0 -57 70 30 -29 -17 -135 8 103 -45 37 -26 -89 -32
6271 -32 21 -58 35 -34 35 -28 94 25 12 -23 108 60 -12 93 41 28 -42 -61 -36 -33 -26 -89 137 73 -19 85 -26 -80
6299 -80 98 -4 -93 -10 136 197 59 94 -40 69 37 0 44 -73 -57 45 101 30 5 61 -56 -73 -51 -20 -56 -59
6325 -59 -110 81 37 -68 1 -5 -164 25 7 -86 -104 -33 76 34 -6 53 -160 47 44 -54 1 -108 81 68 51 -21 63
6352 63 73 70 110 15 47 28 48 -30 -20 56 -74 13 -91 -35 53 -8 -123 -4 27 -64 -59 28 39 -35 -175 15 -4 1 28
6381 28 55 81 6 29 -4 40 -115 -17 8 -98 42 83 17 108 31 66 -1 -42 -16 16 -150 49 48 -34 4 -45 5 -70
6409 -70 5 58 -37 -5 79 72 -18 62 -51 43 -5 -35 11 32 -140 -110 72 -91 -27 67 25 31 96 18 46 9 -26 37 -44
6438 -44 -83 -23 -25 11 -9 93 -73 -3 22 -64 -71 -13 110 -12 7 -144 -4 78 24 31 -31 -72 -39 -24 -18 -132 63 1
6466 1 53 63 -58 17 -130 45 30 -94 45 22 -20 -46 -5 5 -83 56 39 -79 33 42 -69 64 -9 73 113 -137
6492 -137 -75 76 -45 -6 74 -145 47 3 -144 -61 -29 -109 -23 -71 38 39 46 82 117 -18 -67 2 96 12 169 -18
6518 -18 -79 -17 -14 -9 38 -48 65 -66 -1 -47 -28 -14 23 53 30 57 -78 91 -72 32 -67 -35 4 32 -50 -48 50 33 -17
6547 -17 -10 36 -21 -8 58 -22 5 93 1 6 -42 -16 77 15 57 23 5 15 94 4 124 32 25 -8 62 -9 73 5 72 -73 -35
6578 -35 13 77 -16 -6 -104 -78 -40 63 92 8 66 -85 -43 4 -9 29 79 -55 24 5 -58 0 55 -79 -28 -39 -70 -24
6606 -24 16 94 -56 20 32 -8 -19 -17 123 56 45 -33 -33 -11 100 -37 -79 -15 21 44 -41 -38 -54 -72 -6 -3 41 -15 -81 -46
6636 -46 -72 73 148 59 -84 0 -32 -73 -31 51 -118 17 76 12 -1 70 64 30 53 53 13 68 44 45 -59 33 63 -71 -26
6665 -26 -49 -49 -63 -92 57 -67 -40 -113 7 -2 1 9 27 47 10 -13 -112 -9 -43 -44 64 -51 -78 -77 -12 -23 -1 46 55 96 15
6696 15 -71 -54 -61 -43 40 39 49 -19 10 -15 -50 -74 -29 -22 28 52 -53 3 -41 77 -41 -118 9 -7 -23 -31 -52 4 -49 91
6726 91 -33 75 -85 -20 -44 72 125 76 43 30 45 101 -39 -67 -19 -43 22 26 -61 -5 29 20 152 11 -77 -99 -18 16
6754 16 -24 -31 -106 78 -96 -1 -152 23 2 -48 -13 -74 22 70 33 27 -14 -56 -47 33 36 104 -52 -124 22 -56 -56 -67 -8 -42
6784 -42 58 -32 18 90 -22 6 51 -60 -18 -12 23 -14 10 -85 -46 33 37 17 -37 112 -73 13 106 -4 -101 -8 25 129
6812 129 -5 23 1 -22 -42 -69 0 61 -3 125 20 12 -11 -54 -10 -9 -72 13 31 29 -129 -7 -20 -75 -36 -19 5 -39 -41
6841 -41 23 119 -84 -87 -69 59 112 -4 52 -70 41 96 0 14 19 127 -12 21 64 128 -44 -57 -14 -28 20 62 -22
6868 -22 27 -89 -135 -40 18 136 -59 -28 1 -33 -51 -84 -21 49 1 -9 -50 32 -13 -27 62 14 72 -27 -6 59 87 -66
6896 -66 3 20 -6 -88 -85 44 -52 65 -47 -127 6 12 -39 110 27 -94 -23 1 -88 16 55 -19 -21 -9 -7 -31 -7 26 -8
6925 -8 -19 55 38 -107 -74 -52 -89 50 54 -48 -75 0 -6 85 2 66 -49 56 30 -103 50 12 -22 -22 -36 66 -52 -18
6953 -18 17 89 106 -93 -57 29 41 0 65 -111 -60 -3 24 0 -39 -91 -42 48 -28 42 -68 62 -28 95 -66 68 -94
6980 -94 -47 -50 8 -28 -8 12 -57 -13 -128 75 -81 31 29 138 69 36 -3 -52 51 -28 79 -116 18 -28 -41 41 -48
7007 -48 70 -22 34 105 75 37 75 4 -20 -51 73 -120 108 81 15 95 -34 6 101 69 -46 23 30 4 -44 -58 13 40
7035 40 80 24 -34 -31 -52 -94 -88 145 57 48 12 -45 159 8 64 -13 -155 17 26 38 -45 -21 38 27 20 -54 9 -90 -102 8
7065 8 -155 -40 115 -108 83 38 -77 42 -2 28 2 -98 -11 68 -152 -31 83 -24 53 15 50 -60 -7 -163
7089 -163 -50 30 111 -38 -143 99 -50 9 -83 -11 -16 99 66 -13 -30 58 37 113 38 25 -111 14 -38 -13 8 25
7115 25 80 -4 -91 59 135 -30 -31 145 30 68 -123 30 0 57 16 -27 25 38 87 -131 99 -52 -27 90 27 31
7141 31 -9 138 13 38 4 21 -39 -70 -134 25 -69 -34 16 -1 -75 -6 -12 43 75 -11 -10 -58 -28 -131 1 55 126 -85
7169 -85 -14 -10 -44 -68 -11 72 -33 -40 -164 52 -15 6 48 -52 -53 19 -41 36 130 -84 -32 -103 31 -3 -103 41 30 25
7197 25 -26 -67 -75 58 -76 -31 22 37 14 61 -2 41 10 -22 66 19 25 100 33 -86 13 -78 102 -85 -78 11 69 25 63
7226 63 -26 -29 59 85 102 131 -7 -69 4 -88 -26 -27 -98 49 -85 -125 -38 1 -1 -33 -20 -30 72 60 34 -180 13 50 41
7255 41 38 -5 1 -4 -7 -36 82 -64 -39 51 147 -90 -18 -34 -22 81 -25 -28 -67 25 -93 103 7 99 -45 -102 61 -96
7283 -96 44 -35 -47 45 29 6 -8 -5 121 -52 28 -2 22 -37 6 34 -96 55 -9 15 -38 70 -42 34 -36 -3 175
7310 175 -2 12 -12 27 31 0 56 -80 19 23 48 -15 -68 7 73 6 26 7 17 -22 -3 -54 -153 1 -7 11 24 54 25 -71
7340 -71 -6 69 64 73 -102 -92 86 -41 85 12 -7 -20 41 -46 87 -3 -54 64 10 -37 2 40 -42 116 11 70 -32
7367 -32 81 28 0 -19 120 13 -101 31 28 -144 63 9 45 91 63 -94 -60 -6 34 -1 -57 -81 -28 -14 -100 119
7393 119 121 55 46 159 51 93 -90 -5 35 -11 -41 -40 -150 47 98 53 77 40 16 21 -13 -67 8 -31 -52 139 -45 -62
7421 -62 12 2 11 -94 22 -26 80 62 17 -86 15 -46 -69 41 136 -190 -55 -51 50 -73 -28 39 41 -75 -109 50
7447 50 -22 -44 -75 21 18 -65 -37 39 70 -19 12 25 -38 20 -64 -33 -12 34 57 -87 17 -73 18 86 -85 -117 -1 140
7475 140 0 4 81 45 38 166 110 -11 -7 -5 28 -37 111 33 36 -28 22 22 -31 -52 -13 -65 -28 -39 60 -61 -42 29 -38 -70
7505 -70 -12 100 -30 -50 25 24 6 71 -39 21 10 -6 85 -78 -1 -1 17 -22 67 7 -47 28 38 -13 -3 -33 -26 -7 -30 46
7535 46 -39 -52 -55 -36 -244 -50 46 130 -18 -6 5 49 -55 -40 52 23 23 -65 -4 38 6 85 -1 48 144 45 67 -60 22
7564 22 -49 6 -10 -53 19 -2 -21 -17 -29 -56 131 40 -106 62 -30 -49 13 -40 -58 -84 5 -4 -57 -10 90 88 -75 -83 -41 66
7594 66 19 -24 -14 -116 -4 5 116 -51 -87 -36 65 -82 65 -8 -64 96 51 38 -84 38 -4 -45 50 -22 -15 15
7620 15 8 -36 87 32 3 72 15 -3 -40 -36 -79 23 87 -96 -95 -39 63 54 45 -114 -9 30 67 66 23 37 3 3 30 -16 60
7651 60 50 59 77 21 -79 -54 3 35 -63 -38 -53 -71 -62 -101 -51 -45 -16 -52 -40 79 -61 -76 3 31 -1 -44 18 -10 59 -34
7681 -34 -86 54 64 -53 71 17 54 26 -45 24 82 8 -15 -17 -16 -41 3 40 -33 54 -18 14 -72 -21 31 -50 96 39 104
7710 104 21 -69 99 -74 121 77 29 -40 -45 -82 94 90 -31 11 27 77 -74 -42 -8 168 -61 69 91 -10 -2 38
7736 38 -34 -4 45 -55 60 153 -44 -4 -4 -55 -42 2 -31 106 -106 37 126 -10 -58 -43 -47 58 52 -26 26 -31 -33 23
7764 23 -38 56 13 -27 127 -78 70 24 25 -30 36 28 137 -2 74 -38 5 84 -4 28 -111 -6 66 19 -5 -19 19
7791 19 23 -32 32 -57 35 -31 -94 34 -27 85 129 94 -161 7 0 -25 -35 -83 -72 1 -56 16 -8 75 -17 -49 -62 40 39
7820 39 49 47 -47 22 21 -107 1 -15 18 72 -6 -9 -56 6 -34 -59 99 15 -47 -98 75 -30 54 57 11 -25 31 11 -11 -4
7850 -4 71 21 43 94 6 -15 -42 -50 3 14 8 84 42 30 6 -51 77 33 13 -89 -38 10 -52 -90 70 -84 160 41 10
7879 10 60 -33 123 -36 29 -28 68 11 69 -38 76 27 104 155 -18 9 12 -8 1 -26 -95 -26 27 70 59 -21 -9 -107 23
7908 23 49 -20 -30 3 7 -31 29 142 -68 -29 16 -37 112 4 22 -45 -5 6 -55 11 -41 65 -16 -66 48 40 0 82
7936 82 -79 -13 -9 -71 81 -9 32 4 55 52 128 97 42 -75 -20 53 -57 -90 51 36 50 139 37 60 -70 9 -26 -28
7964 -28 -28 17 50 -62 50 -57 -83 64 78 -108 -31 48 69 -77 54 -31 6 66 26 -68 23 -36 -31 -22 -33 -3 23 -25
7992 -25 25 86 55 -38 -74 -119 -7 -48 -101 -19 -14 -5 13 26 3 -56 38 -28 -18 28 -65 -55 26 6 42 -13 31 -81 38 35
8022 35 -30 71 33 80 49 -69 44 45 105 9 70 -96 43 111 -83 148 24 -7 21 -61 38 52 73 -51 -8 24
8048 24 54 -23 35 -70 -100 -36 -3 -50 -23 -26 142 85 -89 5 8 -5 51 -8 148 153 -80 10 108 -41 -115 67 17 -19
8076 -19 1 -22 -148 -48 -19 16 80 16 95 -26 16 -87 -48 6 -16 -76 149 -78 -122 -37 -37 -47 -76 41 26 173 93
8103 93 0 114 9 97 -2 -60 206 28 -13 5 -59 53 -25 -27 36 -49 33 -103 -104 47 39 65 53 112 140 -38 -26 72
8131 72 -39 35 56 100 -123 65 61 52 83 -89 -79 31 99 -34 -7 79 89 9 -43 145 43 23 -21 63 -49 -16 64
8158 64 -52 41 30 -102 129 100 -9 38 8 -64 -53 -29 -18 -12 -22 -31 -89 -14 74 29 121 35 31 134 102 48 85 -69 6
8187 6 117 -41 40 -70
8191g0
##END NTUPLES=NMR FID
##END=
