##TITLE=1H_DE-80H_X3
 200.13MHz, d2o
 8 sc
 
 19ns.26.2.2025
##JCAMPDX= 6.0         $$ Bruker NMR JCAMP-DX V2.0
##DATA TYPE= NMR FID
##DATA CLASS= NTUPLES
##ORIGIN= UXNMR, Bruker Analytische Messtechnik GmbH
##OWNER= pz
$$ XWIN-NMR		Version 3.5
$$ Wed May 14 14:21:17 2025 Russian Standard Time (UT+4h)  Yarkov@DPX200
##.OBSERVE FREQUENCY= 200.1313
##.OBSERVE NUCLEUS= ^1H
##.DELAY= (6, 6)
##.ACQUISITION MODE= SIMULTANEOUS
##.ACQUISITION SCHEME= undefined
##.AVERAGES= 8
##.DIGITISER RES= 18
##SPECTROMETER/DATA SYSTEM= spect
##.PULSE SEQUENCE= zg30
##.SOLVENT NAME= D2O
##.SHIFT REFERENCE= (INTERNAL, D2O, 0, 14.3821)
##AUDIT TRAIL= $$ (NUMBER, WHEN, WHO, WHERE, WHAT)
$$ ##TITLE= Audit trail, XWIN-NMR		Version 3.5
$$ ##JCAMPDX= 5.01
$$ ##ORIGIN= Bruker BioSpin GmbH
$$ ##OWNER= Yarkov
$$ C:/Bruker/XWIN-NMR/data/yarkov2/nmr/H-C/1/audita.txt
$$ ##AUDIT TRAIL=  $$ (NUMBER, WHEN, WHO, WHERE, WHAT)
(   1,<2025-05-14 14:20:44.76 +0400>,<Yarkov>,<DPX200>,
      <created by zg, POWCHK disabled, PULCHK disabled
       configuration hash MD5:
       00 E9 B6 7A A2 85 ED C7 34 08 36 98 17 FE 4E 26
       data hash MD5: 16K
       DD 89 E9 38 09 D9 F9 79 3D 23 60 53 FF CD 58 82>)
$$ ##END=
$$ 
$$ hash MD5
$$ 20 5A 9C AF 4D E8 11 55 16 B9 07 A9 6D 93 18 00
##$RELAX= 
##$RELAX= 
##$RELAX= 
##$RELAX= 
##$RELAX= 
##$RELAX= 
$$ Bruker specific parameters
$$ --------------------------
##$DU= <C:/Bruker/XWIN-NMR>
##$EXPNO= 1
##$NAME= <H-C>
##$PROCNO= 1
##$TYPE= <nmr>
##$USER= <yarkov2>
##$AMP= (0..31)
100 100 100 100 100 100 100 100 100 100 100 100 100 100 100 100 100 100 
100 100 100 100 100 100 100 100 100 100 100 100 100 100 
##$AQSEQ= 0
##$AQ_mod= 1
##$AUNM= <au_zg>
##$AUTOPOS= <>
##$BF1= 200.13
##$BF2= 200.13
##$BF3= 200.13
##$BF4= 200.13
##$BF5= 200.13
##$BF6= 200.13
##$BF7= 200.13
##$BF8= 200.13
##$BYTORDA= 1
##$CFDGTYP= 0
##$CFRGTYP= 5
##$CHEMSTR= <none>
##$CNST= (0..31)
1 1 145 1 1 1 1 1 1 1 1 1 1 1 1 1 1 1 1 1 1 1 1 1 1 1 1 1 1 1 1 1 
##$CPDPRG= <>
##$CPDPRG1= <>
##$CPDPRG2= <>
##$CPDPRG3= <>
##$CPDPRG4= <mlev>
##$CPDPRG5= <mlev>
##$CPDPRG6= <mlev>
##$CPDPRG7= <mlev>
##$CPDPRG8= <mlev>
##$CPDPRGB= <>
##$CPDPRGT= <>
##$D= (0..31)
0 0.7 0 0 0 0 0 0 0 0 0 0.03 0 0 0 0 0 0 0 0 0 0 0 0 0 0 0 0 0 0 0 0 
##$DATE= 1747218044
##$DBL= (0..7)
120 120 120 120 120 120 120 120 
##$DBP= (0..7)
150 150 150 150 150 150 150 150 
##$DBP07= 0
##$DBPNAM0= <>
##$DBPNAM1= <>
##$DBPNAM2= <>
##$DBPNAM3= <>
##$DBPNAM4= <>
##$DBPNAM5= <>
##$DBPNAM6= <>
##$DBPNAM7= <>
##$DBPOAL= (0..7)
0.5 0.5 0.5 0.5 0.5 0.5 0.5 0.5 
##$DBPOFFS= (0..7)
0 0 0 0 0 0 0 0 
##$DE= 6
##$DECBNUC= <off>
##$DECIM= 32
##$DECNUC= <off>
##$DECSTAT= 4
##$DIGMOD= 1
##$DIGTYP= 9
##$DL= (0..7)
0 120 120 120 120 120 120 120 
##$DP= (0..7)
150 150 150 150 150 150 150 150 
##$DP07= 0
##$DPNAME0= <>
##$DPNAME1= <>
##$DPNAME2= <>
##$DPNAME3= <>
##$DPNAME4= <>
##$DPNAME5= <>
##$DPNAME6= <>
##$DPNAME7= <>
##$DPOAL= (0..7)
0.5 0.5 0.5 0.5 0.5 0.5 0.5 0.5 
##$DPOFFS= (0..7)
0 0 0 0 0 0 0 0 
##$DQDMODE= 0
##$DR= 18
##$DS= 0
$$ [...]
##$SUBNAM2= <"">
##$SUBNAM3= <"">
##$SUBNAM4= <"">
##$SUBNAM5= <"">
##$SUBNAM6= <"">
##$SUBNAM7= <"">
##$SUBNAM8= <"">
##$SUBNAM9= <"">
##$SW= 18.0517328524113
##$SWIBOX= (0..15)
0 0 2 0 0 0 0 0 0 0 0 0 0 0 0 0 
##$SW_h= 3612.71676300578
##$TD= 16384
##$TD0= 1
##$TE= 0
##$TE2= 300
##$TE3= 300
##$TEG= 300
##$TL= (0..7)
0 120 120 120 120 120 120 120 
##$TP= (0..7)
150 150 150 150 150 150 150 150 
##$TP07= 0
##$TPNAME0= <>
##$TPNAME1= <>
##$TPNAME2= <>
##$TPNAME3= <>
##$TPNAME4= <>
##$TPNAME5= <>
##$TPNAME6= <>
##$TPNAME7= <>
##$TPOAL= (0..7)
0.5 0.5 0.5 0.5 0.5 0.5 0.5 0.5 
##$TPOFFS= (0..7)
0 0 0 0 0 0 0 0 
##$TUNHIN= 0
##$TUNHOUT= 0
##$TUNXOUT= 0
##$USERA1= <user>
##$USERA2= <user>
##$USERA3= <user>
##$USERA4= <user>
##$USERA5= <user>
##$V9= 5
##$VALIST= <valist>
##$VCLIST= <CCCCCCCCCCCCCCC>
##$VD= 0
##$VDLIST= <DDDDDDDDDDDDDDD>
##$VPLIST= <PPPPPPPPPPPPPPP>
##$VTLIST= <TTTTTTTTTTTTTTT>
##$WBST= 1024
##$WBSW= 4
##$XGAIN= (0..3)
0 0 0 0 
##$XL= 0
##$YL= 0
##$YMAX_a= 38983
##$YMIN_a= -30436
##$ZGOPTNS= <>
##$ZL1= 120
##$ZL2= 120
##$ZL3= 120
##$ZL4= 120
##$ABSF1= 10
##$ABSF2= 0
##$ABSG= 5
##$ABSL= 3
##$ALPHA= 0
##$AQORDER= 0
##$ASSFAC= 0
##$ASSFACI= 0
##$ASSFACX= 0
##$ASSWID= 0
##$AUNMP= <proc_1d>
##$AZFE= 0.1
##$AZFW= 0.1
##$BCFW= 1
##$BC_mod= 2
##$BYTORDP= 1
##$COROFFS= 0
##$CY= 83.5205535888672
##$DATMOD= 1
##$DC= 2
##$DFILT= <>
##$DTYPP= 0
##$F1P= 10.8118882576601
##$F2P= -7.23987719738617
##$FCOR= 0.5
##$FTSIZE= 0
##$FT_mod= 4
##$GAMMA= 1
##$GB= 0.15
##$INTBC= 1
##$INTSCL= 1
##$ISEN= 128
##$LB= 0.25
##$LEV0= 0
##$LPBIN= 0
##$MAXI= 10000
##$MC2= 0
##$MEAN= 0
##$ME_mod= 0
##$MI= 1.114404
##$NCOEF= 0
##$NC_proc= 0
##$NLEV= 6
##$NOISF1= 3.799351
##$NOISF2= 2.8
##$NSP= 1
##$NTH_PI= 0
##$NZP= 0
##$OFFSET= 14.38212
##$PC= 1
##$PHC0= -1346.127
##$PHC1= 2.533749
##$PH_mod= 1
##$PKNL= yes
##$PPARMOD= 0
##$PSCAL= 0
##$PSIGN= 0
##$REVERSE= no
##$SF= 200.129724274929
##$SI= 16384
##$SIGF1= 3
##$SIGF2= 2
##$SINO= 400
##$SIOLD= 16384
##$SREGLST= <1H.CDCl3>
##$SSB= 0
##$STSI= 0
##$STSR= 0
##$SW_p= 3205.1282051282
##$SYMM= 0
##$S_DEV= 0
##$TDeff= 0
##$TDoff= 0
##$TI= <>
##$TILT= no
##$TM1= 0
##$TM2= 0
##$TOPLEV= 0
##$USERP1= <user>
##$USERP2= <user>
##$USERP3= <user>
##$USERP4= <user>
##$USERP5= <user>
##$WDW= 1
##$XDIM= 8192
##$YMAX_p= 0
##$YMIN_p= 0
$$ End of Bruker specific parameters
$$ ---------------------------------
##NTUPLES= NMR FID
##VAR_NAME=  TIME,          FID/REAL,        FID/IMAG
##SYMBOL=    X,             R,               I
##VAR_TYPE=  INDEPENDENT,   DEPENDENT,       DEPENDENT
##VAR_FORM=  AFFN,          ASDF,            ASDF
##VAR_DIM=   8192,          8192,            8192
##UNITS=     SECONDS,       ARBITRARY UNITS, ARBITRARY UNITS
##FACTOR=    0.0002768,     1,               1
##FIRST=     0,             0,               0
##LAST=      2.2672688,     0,               0
##MIN=       0,             -30436,          0
##MAX=       2.2672688,     38983,           0
$$ Real data points
##PAGE= N=1
##DATA TABLE= (X++(R..R)), XYDATA
$$ [...]
792b40R2p2L3K68R7m5R1j12k0k47j38m0K43J07L30r0J22l08q5j24j32j8R1L74
$$ -240 -148 -220 -187 81 178 133 224 112 92 -155 -293 -333 -90 17 347 257 379 71 -14 -138 -270 -288 -197 177
816A77j28J52n9M7k32p4k30J64R1J25qJ59Jj70j06m7j41J14k3Q2K37jO7n8j31
$$ 177 49 201 142 189 -43 -117 -347 -183 -92 33 25 184 185 15 -91 -138 -279 -165 -188 -106 131 130 197 139 8
841Hp7j81Q2M8J00J38J44M5j44k14L2k37J35j2M9J90K00j28N2j72j27%j20l5K18
$$ 8 -69 -250 -168 -120 -20 118 262 307 163 -51 -19 -256 -121 -133 -84 106 306 178 230 58 -69 -69 -189 -224 -6
866fJ68P7j49L9j10j35l2l5n1J29J77J04J1L4j53r2r6q8N9O0Q5J62j0k8o1L3j80
$$ -6 162 239 90 129 19 -116 -148 -183 -234 -105 72 176 187 221 68 -24 -120 -208 -149 -89 -4 158 148 120 59 92 -88
893h8m4q7Q1J31oQ6J13j04q2p8j90J75O5Q8n4Q3J14k81Q1q5m6j02Q7J99k1K11
$$ -88 -132 -219 -138 -7 -13 73 186 82 0 -78 -268 -93 -28 60 6 89 203 -78 3 -82 -128 -230 -143 56 35 246
919B46q0j19K4j12m9m2J49R5p2J5L5j88K5m5O5p9P9J18l7J53j8j76N9j45p3L3
$$ 246 166 47 71 -41 -90 -132 17 112 40 55 90 -98 -73 -118 -53 -132 -53 65 28 181 163 -13 46 -99 -172 -139
945a39N6J13Q2J01j13o1j32r0N3J8k3J29j7P1N5l5L8j08l3j12Q5J54rR7q3rj64
$$ -139 -83 30 112 213 100 39 -93 -183 -130 -112 -135 -6 -23 48 103 68 106 -2 -35 -147 -62 92 83 180 97 88 -76
972g6M9r3N5K9N9J15k5K2l7o3j14j2ro2Q9J55k3J79j98m6l1j42P7j23K29Q8M7
$$ -76 -27 -120 -65 -36 23 138 113 135 98 35 -79 -91 -100 -162 -73 82 59 238 40 -6 -37 -179 -102 -225 4 92 139
999A39l3j35N7j83R9l1%n9J06K49j42l0m9p4q2R3j2J57r5J18M7l3j08K9j60J40
$$ 139 106 -29 28 -155 -56 -87 -87 -146 -40 209 67 37 -12 -86 -168 -75 -87 70 -25 93 140 107 -1 28 -132 8
1025Hj30J56j5P7N4n8l8j57J08q8K9p1L5O7P0J1Rp0m5j7j30J99k1L9J25j32K6
$$ 8 -122 34 19 96 150 92 54 -103 5 -83 -54 -125 -90 -23 47 58 67 -3 -48 -65 -195 4 -17 22 147 15 41
1052D1k1j9q6P0j10K53q1oJ51n9n0j25j08m6lK45N2l8K7Kj08N5k19K3Q1K3Q5J1
$$ 41 20 1 -85 -15 -125 128 47 41 192 133 83 -42 -150 -196 -199 46 98 60 87 89 -19 36 -183 -160 -79 -56 29 40
1080D0P3j34R4j09l6M0qJ04j07J47JOj1r6jj23l7J32J96k6l0K4n1j21l8Q7M6j27
$$ 40 113 -21 73 -36 -72 -32 -40 64 -43 104 105 111 100 4 3 -120 -157 -25 171 145 115 139 88 -33 -71 16 62 -65
1108f5O2R7l0M0j14j1J4r7kR3K6O1N1q1j39M7Q8j49m9Q4R1j4K3J12j31K7l6l8
$$ -65 -3 94 64 104 -10 -21 -7 -104 -106 -13 13 74 125 44 -95 -48 40 -109 -158 -74 17 3 26 138 7 34 -2 -40
1136d0o5M3L1J82j73R9m0M7j81O8P7M2j78J26pJ30r4p2j55O7K38j10n4J5Q1K6
$$ -40 -105 -62 -31 151 -22 77 37 84 -97 -29 48 90 -88 38 31 161 67 -5 -160 -93 145 35 -19 -4 77 103
1162A03%n0q3p4J03j24J57j4O3n3L5j18l7J3J38L9k18J21n8P6Qn5j26Q6N5J7m8
$$ 103 103 53 -30 -104 -1 -125 32 18 81 28 63 -55 -92 -79 59 98 -120 1 -57 19 27 -28 -154 -68 -13 4 -44
1189d4L7L5n7k3R3j45N3j18K17J4L8jr8k0o4O0n4O3k5Pr3J21QP9R0k76J36j99
$$ -44 -7 28 -29 -52 41 -104 -51 -169 48 62 100 99 1 -19 -83 -23 -77 -14 -39 -32 -125 -4 4 83 173 -103 33 -166
1217a66J53L7L7j04L0P4k5r6k3RJ21n5N2q4P4P2r9o4R6k5o3j5L6J54j14O3j70
$$ -166 -13 24 61 -43 -13 61 36 -60 -83 -74 47 -8 44 -40 34 106 7 -57 39 14 -49 -64 -28 126 12 75 -95
1244i5J25o7Pn4O5l0L0J94k20P5p9J5J7l0J4M1k9J26j81l7P5j00j1J74J6q4J12
$$ -95 30 -37 -30 -84 -19 -49 -19 175 -45 30 -49 -34 -17 -47 -33 8 -21 105 -76 -113 -38 -138 -149 25 41 -43 69
1271F9n9RR9n0j08n1P6K6lO9%%j5q6Q2n7R5k13j8O7lK2M6Q7j08l0kJ5N5j03R1
$$ 69 10 19 118 68 -40 -91 -15 11 8 77 77 77 62 -24 58 1 96 -117 -135 -68 -71 -49 -3 84 -24 -54 -56 -41 14 -89 2
1302BJ81k24P5j18J25k4oL1o2N7J7o5K1j03O6K1m4J62n9J0N6m0n6j71J57r4L3
$$ 2 183 -41 34 -84 41 17 11 42 -20 37 54 -11 10 -93 -27 -6 -50 112 53 63 119 79 23 -148 9 -85 -52
1329e2kk5R8O0m2j04L0n1J04k3N1n4M8L4k9mj11%O9l6k%R4J8j0M8n1p6N6p1L1
$$ -52 -54 -79 19 79 37 -67 -37 -88 16 -7 44 -10 38 72 43 39 -72 -72 -3 -39 -41 -41 53 71 61 109 58 -18 38 -33 -2
1360bj40Q5O0j2NJ5Kp0l5J53q8m0J46M7K0k46R0m6J54j04n1R0mj0l2k8J0n3j1
$$ -2 -142 -57 3 -9 -4 11 13 -57 -92 61 -27 -67 79 126 146 -100 -10 -56 98 -6 -57 33 29 19 -13 -41 -31 -84 -95
1389i5R5j48K63m7pr3N4r5L5K8j3Mk4J8J18j48L2M7q5O9J7n2k8J54j35J53j45
$$ -95 0 -148 115 68 61 -32 22 -73 -38 -10 -23 -19 -43 -25 93 -55 -23 24 -61 8 25 -27 -55 99 -36 117 -28
1416b8j62R8M3K8L6r8J32l9oO2j27o6M7J2j8J53l8m2Jj2l7L2m0L5m5Q0o2J86p1
$$ -28 -190 -92 -49 -21 15 -83 49 10 4 66 -61 -127 -80 -68 -86 67 29 -13 -12 -24 -61 -29 -69 -34 -79 1 -61 125 54
1445E4m1J1p4J37j28o2M5N1K6%j03P2j05J41K5nq4J18j9r5j1J03j25L3k5R4lo1
$$ 54 13 24 -50 87 -41 -103 -58 -7 19 19 -84 -12 -117 24 49 44 -40 78 59 -36 -47 56 -69 -36 -61 33 30 -31
1473c1J34j32L0o1K9K6K6m8n3J46q6R5L8j83P9j12P1%K5j9J18p4J5Nq5m3R5k9
$$ -31 103 -29 1 -60 -31 -5 21 -27 -80 66 -20 75 113 -70 9 -103 -32 -32 -7 -26 92 18 33 38 -47 -90 5 -24
1501b4K7%oP4K4k12N8o5j7J36mL1mm0L8n8jLj16J75j9m1J9J1N9p5j5k0N9pJ4O8
$$ -24 3 3 -3 71 95 -117 -59 -124 -141 -5 -9 22 18 -22 16 -42 -43 -40 -156 19 0 -41 -22 -11 48 -27 -42 -62 -3 -10 4 72
1533G2q8R9o1o6O3j05J5J30q7n9J03Kk0J03p6l5Mo4O7o9lJ62j91J65j67O4R1r2
$$ 72 -16 83 22 -44 19 -86 -71 59 -28 -87 16 18 -2 101 25 -10 -6 -70 -3 -72 -75 87 -104 61 -106 -42 49 -43
1561d3k7K15j54J34j03q7J26q2J25j78J90q1Or5lJ35m2r0l3m8K44j53N2m0pp6
$$ -43 -70 145 -9 125 22 -65 61 -21 104 -74 116 35 41 -54 -57 78 36 -54 -87 -135 109 -44 8 -32 -39 -115
1587a15J41k4p0O3l7k9j2J36l7N9j25l1k4J13J7M6q1Q0r3K1j1LL2Jq5p1K12p8
$$ -115 26 2 -68 -5 -42 -71 -83 53 16 75 -50 -81 -105 8 25 71 -10 70 -23 -2 -13 -10 22 23 -62 -133 79 1
1615An4J22K1k7j37k2J02o5k1M2P1n4oJ8J23n2j87O0J04Q5mj64j9M0n4k2J41r3
$$ 1 -53 69 90 63 -74 -96 6 -59 -80 -38 33 -21 -27 -9 114 62 -125 -65 39 124 120 -44 -63 -23 -77 -99 42 -51
1643e1J5P2m1N8M1j56J27n5K0J46k01P3r6J42j01M3N8Mj63P9J07j40K4p0J8n4
$$ -51 -36 36 -5 53 94 -62 65 10 30 176 -25 48 -48 94 -7 36 94 98 -65 14 121 -19 5 -65 -47 -101
1669a01j2J25M7r9J9n6m8J86n9O5k5r5L0j3M7jnm1p6M1k4Q9J35r5M3j15R5q6P7
$$ -101 -113 12 59 -40 -21 -77 -125 61 2 67 42 -53 -23 -36 11 10 5 -36 -112 -71 -95 -6 129 34 77 -38 57 -29 48
1698D8k1Kl2mJ09L8m5j11jN8j48J48qo8O6M7K0r4k8J2n4m4R3j2K1Rl3O9k6m8J62
$$ 48 27 29 -3 -7 102 140 95 -16 -17 41 -107 41 33 -35 31 78 98 4 -24 -12 -66 -110 -17 -29 -8 1 -32 37 11 -37 125
1729A25j85K7rN2P8p5J7J07j95J4N3K4Pj25L9j1M3R2j23l0J33l7m9P0o6l2O3q5
$$ 125 -60 -33 -42 10 88 13 30 137 -58 -44 9 33 40 -85 -46 -57 -14 78 -45 -75 58 21 -28 42 -24 -56 7 -78
1757g8J12k4o7N3J21j60O1m9LK4r3R0J5O7n6l5J03j51oJ07j94O7J7J1M7M0oK8
$$ -78 34 10 -57 -4 117 -43 18 -31 -28 -4 -97 -7 8 75 19 -16 87 -64 -70 37 -157 -90 -73 -62 -15 25 19 47
1785D7j38J18L1j13m8l4J41j30J76j36J85n2j74J00k1j6j9J11N8k5p3L4o0k2m
$$ 47 -91 27 58 -55 -103 -137 4 -126 50 -86 99 47 -127 -27 -48 -64 -83 28 86 61 -12 22 -38 -60 -64
1810f4L7pj0O9L0l9R2p3m6q5J28l8L5K3RM3o8l5J1p7R1j24Q4j1O5J3j30n5O5O0
$$ -64 -27 -34 -44 25 55 16 108 35 -11 -96 32 -6 29 52 61 104 36 1 12 -65 26 -98 -14 -25 40 53 -77 -132 -67 -7
1840gm8KK21k25P7O2q6OM5j18N2K1R7k7m4jn0P3m9M2r4N2L4m1J23j56K6NM8o9
$$ -7 -55 -53 168 -57 20 82 -4 2 47 -71 -19 2 99 72 28 27 -23 50 1 43 -51 1 35 -6 117 -39 -13 -8 40 -29
1870b9L5n5J3o9Q5N2q0Q2j15Q1l9nR4j00J08J4m0n6K3m5n3J60K3K5j2Rj47J0k1
$$ -29 6 -49 -36 -105 -20 32 -48 34 -81 0 -39 -44 50 -50 58 72 32 -24 -1 -46 -99 61 84 109 97 106 -41 -31 -52
1899e2L8L8j2M6rMl4nn8J07j23M9P6l0j9m9O0r3J36K7m9j77K61j45J9QL4ll5L8
$$ -52 -14 24 12 58 49 53 19 14 -44 63 -60 -11 65 35 16 -33 27 -66 70 97 48 -129 132 -13 6 14 48 45 10 48
1929D8o7m7L5rO0q4K6N6l0P8o2j09P7R2r9J34q1q4L8N4QL9M7k25J53PL3j02pj7
$$ 48 -19 -66 -31 -40 20 -64 -38 18 -12 66 4 -105 -28 64 -35 99 18 -66 -28 26 34 73 120 -105 48 55 88 -14 -21 -38
1959c8L4O4j41O6J3k8R0o3M3k4o8J10j78m9K04j45J03r8K16p8jn3Q8k02J22J21
$$ -38 -4 60 -81 -15 -2 -30 60 -3 40 16 -52 58 -120 -169 35 -110 -7 -105 111 33 32 -21 67 -135 -13 108
1985A08j8o1k3J3j13J57j40L0K1p3J77j41pj1K10k17l3O9N0j5K2j26Q0M8j0q7
$$ 108 90 29 6 19 -94 63 -77 -47 -26 -99 78 -63 -70 -81 129 -88 -121 -52 -2 -17 5 -121 -41 7 -3 -90
2011i0J36rL7j04P7L7q6J8Ll9oj4Q5r1P2j06J25n2OJ60j92J41j22j7N4O0k8q9
$$ -90 46 37 74 -30 47 84 -2 16 19 -20 -26 -40 45 -46 26 -80 45 -7 -1 159 -33 108 -14 -31 23 83 55 -34
2039c4J35j13O3j22l2J60j38J90r1m0M3k9K3j23rJ11l8J19q4p0jJ57j01M3k4p5
$$ -34 101 -12 51 -71 -103 57 -81 109 18 -22 21 -8 15 -108 -117 -6 -44 75 -9 -79 -80 77 -24 19 -5 -80
2065h0M2NJ8J8m3P5O1k6m4Lk5J48k75J42r5R3j9P9j43J00l6M7Ok3q7jJ82p3j03
$$ -80 -38 -33 -15 3 -40 35 96 70 26 29 4 152 -123 19 -76 17 -2 77 -66 34 -2 45 51 28 -59 -60 122 49 -54
2094e4P4%q8J05j04l9J26o5M4p0j6q8J40M6J3l0J2Lp2Q2l2J0N2j57J42L0j40L6
$$ -54 20 20 -68 37 -67 -106 20 -45 -1 -71 -87 -175 -35 11 24 -6 6 9 -63 19 -13 -3 49 -108 34 64 -76 -40
2122d0M0j6P8j00J3L2q4J7O7JM3j16R1N0m9J1l6O7j9j73L2Q2j4j0J6K0P7j20K03
$$ -40 0 -16 62 -38 -25 7 -77 -60 7 8 51 -65 26 76 27 38 2 69 50 -123 -91 -9 -23 -33 -17 3 80 -40 163
2151A63j55K5p3j3J13j17K7Q7j23P3k9l9Q3q1p6M8Q6r0J98j52R3o1QJ11n6J0j80
$$ 163 8 33 -40 -53 60 -57 -30 57 -66 7 -22 -61 22 -59 -135 -87 -1 -91 107 -45 48 -13 -5 106 50 60 -120
2178a20R2O2k1nj28R5o2J13n8l0n0J27R2k01K8K22j11m5k2J39p3k0P1j38n8J98
$$ -120 -28 34 13 8 -120 -25 -87 26 -32 -62 -112 15 107 -94 -66 156 45 0 -22 117 44 24 95 -43 -101 97
2204I7j35nO2r1Q5r0J66n2l0r7J2m1J26M5m2M1q9J0r1J19%L3K4k4l9o1L3m0J27
$$ 97 -38 -43 19 -72 13 -77 89 37 7 -90 -78 -119 7 52 10 51 -38 -28 -119 0 0 33 57 33 -6 -67 -34 -74 53
2233E3k1j7R1r2M7j34M9N5J6q1q9J58rL3M2k20J62j34L2J5K0o5q0J83j46J71o0
$$ 53 32 15 106 14 61 -73 -24 31 47 -34 -123 35 26 59 101 -119 43 -91 -59 -44 -24 -89 -169 14 -132 39 -21
2260b1P5p8r5J79j05n7R4rN4q9P7j7Pn9M5J49j45l6j7M6JK4J01j72J32j27M0j6
$$ -21 54 -24 -119 60 -45 -102 -8 -17 37 -52 25 8 15 -44 1 150 5 -31 -48 -2 -1 23 124 -48 84 -43 -3 -19
2288a9P3p8k2J13O3m0l3o1K7N6n0q7m3O2K4K2j6l2l0j8L1J10r0n9Q2O5p5oO3j3
$$ -19 54 -24 -46 67 130 90 57 -4 23 79 29 -58 -101 -39 -15 7 -9 -41 -71 -89 -58 52 -38 -97 -15 50 -25 -31 32 19
2318A9o2K5J1L4j22P5rm9O1n9P5J2o6k8N7J04r4M2p3ok9K7J46j17JR7O7j98J03
$$ 19 -43 -18 -7 27 -95 -20 -29 -78 -17 -76 -1 11 -55 -83 -26 78 -16 26 -47 -53 -82 -55 91 -26 -25 72 139 -59 44
2347D4Qj07J66j26K8j3l8l3K2m8J85j12K9N2K1o8o0Q9m9mJ12j52K4PM9pP8p4j07
$$ 44 52 -55 111 -15 13 0 -38 -71 -49 -97 88 -24 5 57 78 10 -50 39 -10 -14 98 -54 -30 -23 26 19 97 23 -84
2376h4J16j70J39m8Q9N0jj05Q2p9Q8j35RK19k37J39j24qJ73j10N8r1O0O8l3l6
$$ -84 32 -138 1 -47 42 92 91 -14 68 -11 77 -58 -49 170 -67 72 -52 -60 113 3 61 -30 30 98 65 29
2402B9m5L0k7k1K05j67L9MmJ4m9P6o6o3n9O0j8L4M2j8r0K4L8n7R5n3j7M1P1Qj37
$$ 29 -16 14 -13 -34 171 4 43 47 43 57 8 84 18 -45 -104 -44 -62 -28 14 -4 -94 -70 -32 -89 6 -47 -64 -23 48 56 -81
2433h1R4j8p8J49m2PM2o6nN5L5j36M3j10J07J2o7R3O4j83K2R2m9J0l6M3J1L5o2
$$ -81 13 -5 -83 66 24 31 73 7 2 57 92 -44 -1 -111 -4 8 -59 34 98 -85 -63 29 -20 -10 -46 -3 8 43 -19
2462a9lPP5r4kP3j13o6R4LQ6r2l2N8J27kq7o9L5j0K7n0J03n2J5j7m8P4o6J35n3
$$ -19 -22 -15 60 -34 -36 37 -76 -142 -48 -45 41 -51 -83 -25 102 100 13 -56 -21 -31 -4 -54 49 -3 12 -5 -53 21 -45 90 37
2493C7j04J13l0l7l4j0J38q1K2j10J6QP5o4M0R0j12k7NL6q1l7K11j39J59J04j13
$$ 37 -67 46 16 -21 -55 -65 73 -8 14 -96 -80 -72 3 -61 -21 69 -43 -70 -65 -29 -110 -147 64 -75 84 188 75
2520G5r3l4L3Ko6J29m8%o0M8o0J76r1J07q1J4r1K3O3k6l4o2J86j54J60j26J4J11
$$ 75 -18 -52 -19 -17 -83 46 -2 -2 -62 -14 -74 102 11 118 37 51 -40 -17 46 20 -14 -76 110 -44 116 -10 4 115
2548A15j61m8L9J1J22o8K7l9m5n9J06m1K5O0j57L1J65j76L4Q1N5K2q9l2K5J29
$$ 115 -46 -94 -55 -44 78 10 37 -2 -47 -106 0 -41 -16 44 -113 -82 83 -93 -59 22 77 99 10 -22 3 132
2574A32j61n0L6P8n6l0P5O7j86J70p4jpJ59j78j46K99o0j20O0%p8R9K7q8M2pq9
$$ 132 -29 -79 -43 35 -21 -51 24 91 -95 75 1 0 -7 152 -26 -172 127 67 -53 7 7 -71 28 55 -33 9 2 -87
2602h7L1R6R2j06l0n4K14r0p1l6R1n0J30n6o0L9k7pn1Q5j62J04Nn4m8K51r2j03
$$ -87 -56 40 132 26 -4 -58 156 66 -5 -41 50 0 130 74 14 53 26 19 -32 53 -109 -5 0 -54 -102 149 57 -46
2630d6L2qP6j68M3L1r6K04j92J78q8p8O5m3L9J26j92K5J41j16K19k02O8nm1Q0
$$ -46 -14 -22 54 -114 -71 -40 -136 68 -124 54 -34 -112 -47 -90 -51 75 -117 -92 49 -67 152 -50 18 13 -28 52
2656E2Q9j08n8Q5r9O0Q8j30J16k29J90j63L0J93q3o3l2L7k4K0J09m4k30K40m7
$$ 52 141 33 -25 60 -39 21 109 -21 95 -134 56 -107 -77 116 33 -30 -62 -25 -49 -29 80 36 -194 46 -1
2681arJ6K7j20L0k7L5J1Kr7J83J1q9o2J92k3q9l1O1o6J68j74M4j7n7O3PN1j26
$$ -1 -10 6 33 -87 -57 -84 -49 -38 -36 -133 50 61 -28 -90 102 79 -10 -41 20 -46 122 -52 -8 -25 -82 -19 -12 39 -87
2710h7Q0Q9j08p2Q6N1N9r4M1j1l5l4R9J4k46J70MJ8m2J4l8P0K2j12qR3J02q4m
$$ -87 -7 82 -26 -98 -12 39 98 4 45 34 -1 -35 64 78 -168 2 6 24 -18 -4 -42 28 50 -62 -70 23 125 41 37
2739C7K5Nj43L8M7p0kn7J29o8J70j67Q0k8Kp4J8K3L0mn2l5P4N3o6J37o1q1K4P5
$$ 37 62 67 -76 -38 9 -61 -63 -120 9 -59 111 -56 24 -4 -2 -76 -58 -35 -5 -9 -61 -96 -22 31 -35 102 41 -40 -16 59
2769E9j12j54K44j25J93P8k12l4J3O9M0j17L7OJ5o7J03nj8K7q7L7N4j8m8k5kR7
$$ 59 -53 -207 37 -88 105 183 -29 -63 -50 19 59 -58 -21 -15 0 -67 36 31 13 40 -47 -10 44 26 -22 -47 -49 48
2797D8k0q6M9j6n2M6N5K7l5N7n0k2M1q7K9R1p6Op3K82j71L3j20M0mm5M1M6j6N
$$ 48 28 -58 -9 -25 -77 -31 24 51 16 73 23 1 42 -45 -16 75 -1 5 -68 214 43 76 -44 -4 -8 -53 -12 34 18 23
2827B3P2k7n6l3m0m5J50M2j28J67k2j61M9K5m7J02o1j5q5K22j78K3Rp5J19L0k2
$$ 23 95 68 12 -21 -61 -106 44 86 -42 125 103 -58 -9 16 -31 71 10 -5 -90 132 -46 -23 -14 -89 30 60 38
2854C8j03J31j2p8m8M6L6j6o7P2j31R4p0M4O8R9j41P8l8n2J11nj08P6J12j55m2
$$ 38 -65 66 54 -24 -72 -26 10 -6 -73 -1 -132 -38 -108 -64 4 103 -38 40 2 -50 61 56 -52 24 136 -19 -61
2881f1Q1l5j06J21n9J4J3kn7J12j10K12j96J13o9Mn3N0K2m0P4L4k0qM8Q1j81O4
$$ -61 20 -15 -121 0 -59 -45 -32 -34 -91 21 -89 123 -73 40 -29 -25 -78 -28 -6 -46 28 62 42 34 82 163 -18 46
2909D6l6j03O7R6k3J0m6J3o0k4K3m6K7Q1m6K2j9ML6n0j3P9J1k4P3q8q3J45j06
$$ 46 10 -93 -26 70 47 57 11 24 -36 -60 -37 -83 -56 25 -21 1 -18 -14 22 -28 -41 38 49 25 98 10 -73 72 -34
2938c4M1L6j60Q4N4L0m3j4M0K5j4j38P0Q9om6l1J76j56m4K0Om4qJ43p0M4L4q3
$$ -34 7 43 -117 -33 21 51 8 -6 34 59 45 -93 -23 66 60 14 -17 159 3 -41 -21 -15 -59 -67 76 6 50 84 1
2967Aj65J70%KQr9M6L6L6o1R3k41J20Q1j51J26K3j2j9n8N5P4J4m8j41J07J1n1
$$ 1 -164 6 6 8 16 -83 -37 -1 35 -26 67 -174 -54 27 -124 2 25 13 -6 -64 -9 65 79 31 -110 -3 8 -43
2995d3N3l2J33r2PKn1K5l9OL4L4k2J8l3kk5O6M1j85k0J33l7M7K6j10L8k7O3p2
$$ -43 10 -22 111 19 26 28 -23 2 -37 -31 3 37 15 33 0 -2 -27 39 80 -105 -125 8 -29 18 44 -66 -28 -55 8 -64
3025f4jN9M0j34J76J4k4j67J80o5o1K4K7O8j13l6J6J14k3L1p8l8j5J63j43J57
$$ -64 -65 -6 34 -100 76 90 66 -101 79 14 -47 -23 4 72 -41 -77 -61 53 30 61 -17 -55 -70 93 -50 107
3051A07j31J74j48q9J21L1k0j70J76kj2l5k5p6J31p6j17J42l2Q3m0R0k01O7O0
$$ 107 -24 150 2 -87 34 65 45 -125 51 49 37 2 -23 -99 32 -44 -161 -19 -51 32 -8 82 -119 -52 8
3076Hr5J24O3j15j9k9J21k3r3k7K0J49j04J3j6jM4o6O5o2j5O3Q1o1Kp4R3r2NJ28
$$ 8 -87 37 100 -15 -34 -63 58 35 -58 -85 -65 84 -20 -7 -23 -24 20 -46 19 -43 -58 5 86 25 27 -47 46 -46 -41 87
3106H7j20k4N6K1N7j12K6n3J9k7P2m2O3K0m3J30j40J5%K2m2k3R3j47J26j46R2
$$ 87 -33 -57 -1 20 77 -35 -9 -62 -43 -70 2 -40 23 43 0 130 -10 5 5 27 -15 -38 55 -92 34 -112 -20
3133b0j3P5q7j16J27l1n3J70j02J09j32J6j6J49j41nJ08q6MJ23m0j5M1j56J7P8
$$ -20 -33 42 -45 -161 -34 -65 -118 52 -50 59 -73 -57 -73 76 -65 -70 38 -48 -44 79 39 24 65 -91 -74 4
3159DQ3j63J10qOJ38k55M8Q9l1n1P2p8L1Q5j34J33k6Nj0K4r6l4M1L7oQ7o2k1j20
$$ 4 87 -76 34 26 32 170 -85 -37 52 21 -30 42 -36 -5 80 -54 79 53 58 48 72 -24 -58 -17 20 14 101 39 18 -102
3189a02N3M9p5R4r5N7J04j41OO5K0n9M8q4J15n5n5N7L5Q1k9n3j7J6K0K7p5J2j11
$$ -102 -49 0 -75 19 -76 -19 85 -56 -50 15 35 -24 24 -60 55 0 -55 2 37 118 89 36 19 35 55 82 7 19 -92
3218i2l1R1N2m1o4J03N0M7k19J06N8m0LL7r8p6K1J66J20j44Q3j62R2p5J8m7KK2
$$ -92 -123 -32 20 -21 -85 18 68 115 -104 2 60 20 23 60 -38 -114 -93 73 193 49 132 -30 62 -13 5 -42 -40 -18
3246a8J10n0l9L7j75K47j88R0j1O9o7P0K4q5j07M0R5o3K9j12J32j2O6r8M3k0n2
$$ -18 92 42 3 40 -135 112 -76 14 3 72 5 75 99 14 -93 -53 42 -21 8 -104 28 16 82 -16 27 7 -45
3273d5J36r6m9J5K0m0Q7p4J07j43J12M6j34K5J22k0l7Mn3K9l9NN8m7M0J8j57J67
$$ -45 91 -5 -54 -39 -19 -59 28 -46 61 -82 30 76 -58 -33 89 69 32 36 -17 12 -27 -22 36 -11 29 47 -110 57
3301E7J3j20J20l8q8O2O4j06QpM6K8j96M8J52q3J89j00j10J27j15J07j5l5k5n7
$$ 57 70 -50 70 32 -56 6 70 -36 -28 -35 11 39 -157 -109 43 -40 149 49 -61 66 -49 58 43 8 -17 -74
3327g4J22m8j39K11m2q3J7N6jo0K8k2J50Ok01J39o8L3j7j03J76j23O7k2L6r2j0
$$ -74 48 0 -139 72 30 -53 -36 20 19 -41 -13 -35 115 121 -80 59 -9 24 7 -96 80 -43 24 2 38 -54 -64
3354f4J4J13m0j05M5o1J64j14P6l6JM4R1j16o8J50m6q3k9N7J4K7l0q6L1l9J50
$$ -64 -50 63 23 -82 -37 -98 66 -48 28 -8 -7 37 128 12 -56 94 48 -35 -64 -7 7 34 4 -82 -51 -90 60
3381F0j44O1j00MJ28q0R7r0J52j24Mk8P8k6K1K8o4M8j09J76j28M0O2k8n4L6K2
$$ 60 -84 -23 -123 -119 9 -71 26 -64 88 -36 -32 -60 18 -8 13 41 -23 25 -84 92 -36 4 66 38 -16 20 42
3408D2n9m6J43n4q3J70pk80K37K8L6j64OJ29q4j03J57j01j00J25jmJ5K9m5K1L8
$$ 42 -17 -63 80 26 -57 113 106 -174 63 91 127 -37 -31 98 14 -89 68 -33 -133 -8 -9 -13 2 31 -14 7 45
3435D5n2O5o0o8RM8n0m7R0lJ0K4N1j15L7Q5m0m9P2o9M0P0j56J5N4O8n3l3j25J84
$$ 45 -7 58 -2 -70 -61 -13 -63 -110 -20 -23 -13 11 62 -53 -16 69 29 -20 52 -17 23 93 -63 -48 6 74 21 -12 -137 47
3465D7m6n8J07n1M1o9m6M3k5J24j03j01J39m1MJ23l5j32N9P9k0p0O0l2Q4o9N9
$$ 47 1 -57 50 -1 40 -29 -75 -32 -57 67 -36 -137 2 -39 -35 88 53 -79 -20 59 39 -31 29 -3 81 12 71
3492G1o3j00Q1m2P1K5l2O3q0m1Nm8J10p9J23j07M5QOlR2j17M6p6r0J25j24J63
$$ 71 8 -92 -11 -53 18 43 11 74 -6 -47 -42 -90 20 -59 64 -43 2 10 16 13 105 -12 34 -42 -132 -7 -131 32
3520C2p6JMJ97j53q2O9n2L9J27j11l2ML2j9m6J48j34Q3k1j15P9K6o6J59k7R9j81
$$ 32 -44 -43 -39 158 5 -77 -8 -60 -21 106 -5 -37 -33 -1 -20 -66 82 -52 31 10 -105 -26 0 -66 93 66 165 -16
3548a6o6P4qL7N8l8k9j1l5l8O1M1j9n6K1P9j01M2k7Q2j3j03O4l4J4J02l0r3q2
$$ -16 -82 -8 -16 21 79 41 12 1 -34 -72 -11 30 11 -45 -24 55 -46 -4 -31 51 38 -65 -1 -35 -21 81 51 -42 -124
3577a24K00j88Q5n2M7J8r3L6rR7j21OJ25j13M4l6R3M5j57P9N7p2p4J14M4l8l5
$$ -124 76 -112 -27 -79 -32 -14 -107 -71 -80 17 -104 -98 27 -86 -42 -78 15 60 -97 -18 39 -33 -107 7 51 13 -22
3604b2K3o2N1L5m5J24k04J52n4M2k5L0k9r6J40m7K9j02RK9j1K2J37j82K5kn6J70
$$ -22 1 -61 -10 25 -20 104 -100 52 -2 40 15 45 16 -80 60 13 42 -60 -51 -22 -33 -11 126 -56 -31 -33 -89 81
3632H1J9j36O2o6qR6o0m7J29q8rR9j18K7l8L5O9m2j5j9j8O3J3O7j64N5k7R4K4
$$ 81 100 -36 26 -40 -48 48 -12 -59 70 -18 -27 72 -46 -19 -57 -22 47 5 -10 -29 -47 16 29 96 -68 -13 -40 54 78
3661G8n5K6K7K1o4l5L8m7k5k4RJ34n6k4K0k8K1j7l4K6J14r7j38J08J0NM7k04J27
$$ 78 23 49 76 97 33 -2 36 -11 -36 -60 -51 83 27 3 23 -5 16 -1 -35 -9 105 8 -130 -22 -12 -7 40 -164 -37
3690c7Rq4L5J09LM4j39R9p7J01PO1k35Q7K2K5K5r0L5j9N1l6L5J8%qj07J03L3J8
$$ -37 -28 -112 -77 32 35 79 -60 39 -38 63 70 131 -104 -17 5 30 55 -35 0 -19 32 -4 31 49 49 41 -66 37 70 88
3720H8o3J3r6P6k1qJ0L3Q1j28P1m8K4o2L8J40q6j00n0O2k3J31q4l4j0O5J8j51
$$ 88 25 38 -58 18 -3 -11 -1 32 113 -15 56 8 32 -30 8 148 62 -38 -88 -26 -49 82 -2 -36 -46 19 37 -114
3748a14O3M2M8l7n1M2K1j18O3J3L4m0P1j2k5l9J3l8N2K2j07J86j20K0qK1K2q4
$$ -114 -51 -9 39 2 -49 -7 14 -104 -41 -28 6 -34 37 25 0 -39 -26 -64 -12 10 -97 89 -31 -11 -19 2 24 -60
3776f0O8oj09L4M0P4l6j5j4j29J72Mk9L7j17K00k32L1N5J6L8N7j64M6J77j42M9
$$ -60 8 2 -107 -73 -33 41 5 -10 -24 -153 19 23 -6 31 -86 114 -118 -87 -32 -16 22 79 -85 -39 138 -4 45
3803D5N0j62K8R9q6QMJ30j21j1M5q5Q4q6J28Mk14K20j16J7j6no4O7J71j91N8j8
$$ 45 95 -67 -39 60 -26 -18 -14 116 -5 -16 29 -56 28 -58 70 74 -140 80 -36 -19 -35 -40 -104 -37 134 -57 1 -17
3831a7J55j33m4K5M9k6l6M2o7M5L3j8n8p4N6J41k17J08K1j2J46r4k1J1n9J14j43
$$ -17 138 5 -39 -14 35 9 -27 15 -52 -7 26 8 -50 -124 -68 73 -144 -36 -15 -27 119 25 4 15 -44 70 -73
3858g3P2M6J06o2l7j22K2K7k0L4O6k3q1lO4L3M7P5k07l9n1J94j65J04QM1o2j45
$$ -73 -1 45 151 89 52 -70 -48 -21 -41 -7 59 36 -45 -48 16 49 96 171 -36 -75 -126 68 -97 7 15 56 -6 -151
3886a51P0L8K14k25L6O0k3q7Q9j8O3jn5RQo9L4J3N3j6n9N7J8r5N4ml1J9R0M2r3
$$ -151 -81 -43 171 -54 -18 42 19 -68 21 3 66 65 10 19 27 -42 -8 5 58 42 -17 40 58 -37 17 13 -18 1 91 133 40
3917D0J11o8r0p2P0O0p3m3J85o6j03O4p1m4J20M8o5J6l3k9O3L8mj7j15PJ07p7
$$ 40 151 83 -7 -79 -9 51 -22 -65 120 54 -49 15 -56 -100 20 68 3 19 -14 -43 20 58 54 37 -78 -71 36 -41
3945d1M6n1n5O2J4n6J77N2k94J25J02j59O2k4J1m5J12j39J41J6n4J9n0P6l7j9
$$ -41 5 -46 -101 -39 -25 -81 96 148 -146 -21 81 -78 -16 -40 -29 -74 38 -101 40 56 2 21 -29 47 10 -9
3971iK6q7J29Kj2l2J02l5o1j36J19M5o5j19J40N0j37J06k4l4L7pj34K3J83j0m6
$$ -9 17 -70 59 61 49 17 119 84 23 -113 6 51 -14 -133 7 57 -80 26 2 -32 5 -2 -136 -113 70 60 14
3998A4l1K1M7j04J0k2O9j5k3J19n9p7N3j3r4Q6P1r8l0J9l1J62j25J3K1j3M0k2
$$ 14 -17 4 51 -53 -43 -65 4 -11 -34 85 26 -51 2 -11 -105 -19 52 -46 -76 -57 -88 74 -51 -38 -17 -30 10 -12
4026a2jo9R3j5l0K8lK5M2r1K6l3L4Mj7L8L9n3o6M1K0L9n5J6J3q8J44j9o0n6J7
$$ -12 -13 -82 11 -4 -34 -6 -9 16 58 -33 -7 -40 -6 -2 -19 19 58 5 -61 -20 0 39 -16 0 13 -75 69 50 -10 -66 -49
4057d9K5rM4R9j07m4L6l9O2j40K11m2n4p0LO0m3J31q9l6o3N4N0J9J6j02O1okM5
$$ -49 -24 -33 11 110 3 -41 -5 -44 18 -122 89 47 -7 -77 -74 -14 -57 74 -15 -51 -114 -60 -10 9 25 -77 -16 -22 -24 21
4087B1ol9kK6mm9K1Q4j54P6J05j10l0N5K5p0R0p4j2ok9Q5rL6j17J12k8M6j20J3
$$ 21 15 -24 -26 0 -4 -53 -32 52 -102 -26 79 -31 -61 -6 19 -51 39 -35 -47 -53 -82 3 -6 30 -87 25 -3 43 -77 -64
4117f4P0N7q1J0Mr7KM6P2j12J63q2l9O5N2j21J38j1K7m2k1k7l4j6k9J90j16Nm4
$$ -64 6 63 -18 -8 -4 -101 -99 -53 19 -93 70 -12 -51 14 66 -55 83 72 99 57 36 9 -25 -41 -70 120 4 9 -35
4146c5O2M9q4l1QR1q3Q8p0N0j41PO5M9l4N8J3l7K3m1K5k5m5R0L6N5j17n0K3q7
$$ -35 27 76 -8 -39 -31 60 -23 65 -5 45 -96 -89 -24 25 -9 49 62 25 48 7 32 7 -38 52 88 143 26 -24 -1 -88
4176h8J03k2Q3n3k5j02J04j51R4j5m0N6j5J21p0Q2r2j4m8M1Q5K0o1L0P2j31J5
$$ -88 15 -7 76 23 -2 -104 0 -151 -57 -72 -112 -56 -71 50 -20 62 -30 -44 -92 -51 34 54 -7 23 95 -36 -21
4203b1Q5m9m6l9J28j92O6O4j2QQ1k16K06j80P7N0R3j32l2J59j23J57p9J00j29
$$ -21 64 15 -31 -70 58 -134 -68 -4 -16 -8 73 -143 63 -117 -40 10 103 -29 -61 98 -25 132 53 153 24
4228B4m7pl3K2J6Q3j15j49J28J26J07m0j57J38j84M1K3q2K04j03J1m4M7kj8J34
$$ 24 -23 -30 -63 -41 -25 58 -57 -206 -78 48 155 115 -42 96 -88 -47 -24 -106 98 -5 6 -38 9 7 -11 123
4254A23j08K9M7r3J14j79K5J45k13J21j7L4j9j6l7O3rL9K8j01k3J26j07l9K6L8
$$ 123 15 44 91 -2 112 -67 -42 103 -110 11 -6 28 9 -7 -44 19 10 49 77 -24 -47 79 -28 -67 -41 -3
4280cJ21j80R6n9LL1L5j0l8K6l5M4n7l9N8m3n0J05mk4J44j22M4j54J65n4K6JQ2
$$ -3 118 -62 34 -25 -22 9 44 34 -4 22 -13 31 -26 -65 -7 -50 -100 5 1 -23 121 -1 43 -111 54 0 26 27 109
4309A09l9m4q7QJ31M3K7k31L2P7P9k6q8J15j53k3J16j52L2L8O9Q6j10Q1j29k1
$$ 109 70 26 -61 -53 78 121 148 -83 -51 26 105 79 -9 106 -47 -70 46 -106 -74 -36 33 119 9 90 -39 -60
4335f0J34o3j41J47j11J57j47J36p5P0m4j00M2k8kQ2R3o2j42P0L5kK6r3K9P1k4
$$ -60 74 11 -130 17 -94 63 -84 52 -23 47 3 -97 -55 -83 -85 -3 90 28 -114 -44 -9 -11 15 -78 -49 22 -2
4362bp6J23K6r7j23J94n1Ql0L7o8J37k21M5R9On9P9J0N2q6j6lk1M3N5j1J6j18
$$ -2 -78 45 71 -26 -149 45 -6 2 -28 9 -59 78 -143 -98 1 7 -52 27 37 89 3 -13 -16 -37 6 61 50 66 -52
4391e2R8k5n4L7jkj8K7o0K33j83o5Q6m8P0p9NL5N6r1P3K0m4r1O4Mj7L2j2k0M8
$$ -52 46 21 -33 4 3 1 -17 10 -50 183 0 -65 21 -27 43 -36 -31 4 60 -31 42 62 18 -73 -9 -5 -22 10 -2 -22 26
4422B6L0jL2l7P5jk9k18K41k22J73j6Pj73J06r6KJ83j36j3K5N3J5r3oN4k1j23
$$ 26 56 55 87 50 125 124 95 -123 118 -104 69 53 60 -113 -7 -103 -101 82 -54 -67 -42 11 26 -67 -73 -19 -40 -163
4450a63R4P3L9Jo8j7L5j3j23J20R0j19J7K4n5J17k0k1l5J28k5r5M0K9q8K01j70
$$ -163 -69 4 43 44 -24 -41 -6 -19 -142 -22 68 -51 -34 -10 -65 52 32 11 -24 104 79 -16 24 53 -35 166 -4
4477dnl3M8j01J17N0j02Q5j86M6J2J3OR9L5k5O6j39m2J27Km1J31j45m3K02k18
$$ -4 -9 -42 6 -95 22 72 -30 55 -131 -85 -73 -60 -54 45 80 55 121 -18 -60 67 69 28 159 14 -29 173 -45
4504d5K4R4LJ1k22K47o1m8qP0p7L4j50Q1P2p0M9N6qp7K3nM9K1r9knK1klq5J50
$$ -45 -21 73 76 87 -135 112 51 3 -5 65 -12 22 -128 -47 25 -45 4 60 52 -25 -2 -7 42 63 -36 -38 -43 -22 -24 -27 -112 38
4536C8o1M2k3L3M4j53J44j19L7M2L7k0j15J42j5r7P5q6N6J0n9R3K5k8r0J00L8
$$ 38 -23 19 -4 29 73 -80 64 -55 -18 24 61 41 -74 68 53 -44 31 -55 1 11 -48 45 70 42 -48 52 90
4563I0q0m6J3N2K1J8j71J33QlL3j60J24K6k5j36Q2O9k8Rl7k2N9j5l2MO4l0qMo1
$$ 90 10 -36 -23 29 50 68 -103 30 38 35 68 -92 32 58 33 -103 -21 48 20 29 -8 -30 29 14 -18 -14 50 20 12 16 -45
4594d5M7j21Q9J14p6mK4j7Lo1Q7j32P1l9nP9J2M7j04J18j06m3K6%O7p3k8J7l5
$$ -45 2 -119 -30 84 8 4 28 11 14 -47 40 -92 -21 -60 -65 14 26 73 -31 87 -19 -62 -36 -36 31 -42 -70 -53 -88
4623h8R6M2k2l3N0j32l9J07J4K1R8j95JJ40j23J59j01Mj18L5j9q2J85k0P0m6p
$$ -88 8 50 28 -5 45 -87 -126 -19 -5 16 114 -81 -80 60 -63 96 -5 -1 -119 -84 -103 -185 0 -20 50 4 -3
4650cJ55oj33L1l7M0l2kQn8P6p2k3J10o9k3m3O5Q1o1n7K4J06n3J19k59N4L1q8
$$ -3 152 146 13 44 7 47 15 13 21 -37 39 -33 -56 54 -15 -38 -81 -16 65 4 -53 -29 77 24 143 -116 -62 -31 -119
4679a19J90n6m0N2O2j50J5N6l6m3J19j1R7j84K4K8l8J4M5K1j19P5M9p2L1M9Lj26
$$ -119 71 15 -25 27 89 -61 -46 10 -26 -69 50 39 136 -48 -24 4 -34 -20 25 46 -73 2 51 -21 10 59 62 -64
4707f4N0K4j00LM4J17j22p6K15Pm4j47J07O0n0rm5j1nJ26k0r8L8Q0o7o9J35q4
$$ -64 -14 10 -90 -87 -43 74 -48 -124 91 98 54 -93 14 74 24 15 -30 -41 -46 80 60 -38 0 80 13 -56 79 -5
4735eL7L7j82J19k2j9L9l1J3j8J36k21J73m5P8m1m1j9P9l7r3K3Q7j11J16j20J38
$$ -5 32 69 -113 6 -16 -35 4 -27 -14 -32 104 -117 56 11 89 48 7 -12 67 30 -63 -40 47 -64 52 -68 70
4762G0l2l5J07j28R6o5k6P9j51K11j55nJ5L0k7r8M0l2R8j7J7m3R1o4l2M8K3j23
$$ 70 38 3 110 -18 78 13 -13 66 -85 126 -29 -34 -19 11 -16 -114 -74 -106 -8 -25 -8 -51 40 -24 -56 -8 15 -108
4790a08K12j65J03J7n2n6J34pn6j0Jm4K0r4N1Q0n5K6K5L6J0r4J4M5q5O9K6J3P
$$ -108 104 -61 42 59 7 -49 85 78 22 12 13 -31 -11 -105 -54 26 -29 -3 22 58 68 -26 -12 33 -52 17 43 56 63
4819F3j34N4R0j23K9j9P4M1j16k3J46p5k6J02k7K9j00N8l2j8M8p9J75k02OJ28
$$ 63 -71 -17 73 -50 -21 -40 34 75 -41 -64 82 7 -19 83 56 85 -15 43 11 -7 41 -38 137 -65 -59 69
4845F9q0ln3Q4m7J49j61M9o3P1PQ2l1k00J69j28O0K1j21K04p5k7o1L9J81n2o5
$$ 69 -11 -14 -67 17 -30 119 -42 7 -56 15 22 104 73 -127 42 -86 -26 -5 -126 78 3 -24 -85 -46 135 83 18
4872A8p0J19j66J58o6J05q0p0J13o9L7r0J18p4l3M1O1J23q6j46O8L7p2m9J73o2
$$ 18 -52 67 -99 59 -7 98 18 -52 61 -8 29 -61 57 -17 -50 -9 52 175 89 -57 11 48 -24 -73 100 38
4898C8p4R5j03O3kp6l5J79qj14J16p3J01j26M8J8j15M5Rj0l7OJ11M4r5Ln6J19
$$ 38 -36 59 -44 19 17 -59 -94 85 77 -37 79 6 107 -19 29 47 -68 -23 -14 -24 -61 -55 56 100 5 8 -48 71
4926G1n1m2J04o2n6J05L0k02J79l5N0j20L2j1j8Pm1J05O9q0j6K0k8k5J31j50J8
$$ 71 20 -22 82 20 -36 69 99 -103 76 41 91 -29 3 -8 -26 -19 -60 45 114 34 18 38 10 -15 116 -34 -16
4953a6qQ3o2J29q9m3l5qM9LJ1o7M3o7lL0Q6p3R5r1mL1o8R5M7j49O6p6P4L7Nk6
$$ -16 -24 59 -3 126 37 -6 -41 -49 0 3 14 -53 -10 -77 -80 -50 36 -37 58 -33 -37 -6 -74 21 68 -81 -15 -91 -17 20 25 -1
4985aO0J15j34M4j1J4q7L4m4j17J66p4O5l8K8j19J60k3Jk7qMM9k7mq3P4JP3j52
$$ -1 59 174 40 84 73 87 0 34 -10 -127 39 -35 30 -8 20 -99 61 38 39 12 4 8 57 30 26 -57 17 18 91 -61
5015f1N6L5r0Q5m8k7O2m0OJ5O0j44n7J55M5l3j3j1p2j29J04J58r4m7J13m9L7p1
$$ -61 -5 30 -60 25 -23 -50 12 -28 -22 -7 53 -91 -148 7 52 19 6 -5 -77 -206 -102 56 -38 -85 28 -21 16 -55
5043e5J3j32K48n2m5NJP0o4%J16q8qo8J06j32R1%L8k9pN0p8L6j6k0Q3L8r8Lj3
$$ -55 -42 -174 74 22 -23 -18 -17 53 -11 -11 105 17 9 -59 47 -85 6 6 44 15 8 58 -20 16 0 -20 63 101 3 6 -7
5074gMJ8J53j18p7P5m1QR5j34J6J4o6R1Mj02j3J86j69J15m0q3P3K0j5o4O9j1J1
$$ -7 -3 15 168 50 -27 48 7 15 110 -24 -8 6 -60 31 35 -67 -80 106 -63 52 12 -71 2 22 7 -57 12 1 12
5103A2O0j32O7J3m4P7l4k1L2l5l6J04k1K0l8p2O4O1q8Q9j29l8P7O8r2k2O1J2l4
$$ 12 72 -60 7 20 -24 53 19 -2 30 -5 -41 63 42 62 24 -48 16 77 -11 78 -51 -89 -12 56 -36 -58 3 15 -19
5132a9L3K3j07k0J38p6k0O9J5q2n2J50p9l6j4K2m9K03m6j4n4k1J45j52O3j8l2
$$ -19 14 37 -70 -90 48 -28 -48 21 36 -46 -98 52 -27 -63 -77 -55 -104 99 53 39 -15 -36 109 -43 20 2 -30
5159c0Q3qj52Q4J16m1j26P8O6K1j04K8k0K8j2j76J51mR0p6N5j15P7J14j09K1k1
$$ -30 53 45 -107 -23 93 52 -74 4 70 91 -13 15 -5 23 11 -165 -14 -18 72 -4 51 -64 13 127 18 39 18
5186A8K5l0o0k1J38P9j68JP9j2j15J15r3O4N8q7O0j44pM9J48q9n9J62r2Mq2L1
$$ 18 43 13 -47 -68 70 149 -19 -18 61 49 -66 49 -44 20 78 -9 51 -93 -100 -51 97 8 -51 111 19 23 -59 -28
5214b8Q1l4l5k6O9M0o3j0J25j95J35k2J11q6L3m9j42J30n9J8J10j21q6Q3j3n9
$$ -28 53 19 -16 -42 27 67 4 -6 119 -76 59 37 148 62 95 46 -96 34 -25 -7 103 -18 -104 -21 -34 -93
5240i3J32j40R2M2Q0j37P3j15L2M8J5j11J41j96J13j4OM2p2J61r3K1O6j25Pk2
$$ -93 39 -101 -9 33 113 -24 49 -66 -34 14 29 -82 59 -137 -24 -38 -32 10 -62 99 6 27 93 -32 -25 -47
5266d7J06q5Pq1Q4JM4k3Kj2K4j9J6L1q1Q0K6r3O0rl7Q2o4J09j49P9m4m8L0n7Q9
$$ -47 59 -26 -19 -100 -16 -15 29 6 8 -4 20 1 17 48 -33 47 73 -20 40 31 -6 76 12 121 -28 51 7 -41 -11 -68 21
5297B1r1Q1p5O1l5J24j29J5P9l1J5o1J1J37j13j0p6K4R9L3j1m6l0L1O1j0L1p6
$$ 21 -70 11 -64 -3 -38 86 -43 -28 51 20 35 -26 -15 122 9 -1 -77 -53 46 79 68 22 -8 23 84 74 105 29
5325B9q3J27m9l0q1J30rP8K4j50R6j08L3k1L7j12J09r1P1o6Q9k3p1J10l0j07P
$$ 29 -54 73 24 -6 -87 43 34 112 136 -14 82 -26 7 -14 23 -89 20 -71 0 -66 23 0 -71 39 9 -98 -91
5352i1K10r2MP1m8j26O0j16K25r8L2J25r1r2J2N0m7J12j49k4Q2m2Q0k7j9M8o3
$$ -91 119 27 31 102 54 -72 -12 -128 97 -1 31 156 65 -27 -15 35 -12 100 -49 -73 9 -33 47 20 1 49 -14
5379a4P2j69J16ll8RJ14k5p6k0N8O1j20n3J02L0J3O4m8r1m6ML6J97k19K6P2pO
$$ -14 58 -111 5 2 -36 -27 87 62 -14 -34 24 85 -35 -88 14 44 57 121 73 -18 -64 -60 -24 173 -46 -20 52 45 51
5408E1pL1q0N7m4M1N2j37P6p9R9Jq5J01j40JN0nm5J59j69J00l3O9j10Q3KK0j15
$$ 51 44 75 -5 52 8 49 101 -36 40 -39 60 61 -24 77 -63 -62 -12 -17 -62 97 -72 28 -5 64 -46 37 39 59 -56
5437e6J20p2MP4Kj9k0r4P0j7m6L0Q1L0j62J81m6N9j20J7NK3%J03j23M2m8j6N2
$$ -56 64 -8 -4 70 72 53 33 -61 9 -8 -54 -24 57 87 -75 106 60 119 -1 16 21 44 44 147 24 66 18 2 54
5466E4Ol4j39K44k03O6J0mq0J03k9P8q3J3J07j21O1K4q4N4r8J12N5M1p9j00O7
$$ 54 60 26 -113 131 -72 -6 4 0 -80 23 -6 72 -11 2 109 -12 49 73 -11 43 -55 57 112 153 74 -26 41
5493D1n4m3M9M6K1n6KR6j66nP1R6j39Qj7J9p0L9J39p1Q5q2M6mN9j01J26o3OL4
$$ 41 -13 -56 -7 39 60 4 6 102 -64 -69 2 98 -41 -33 -50 -31 -101 -62 77 6 91 9 55 51 110 9 135 72 78 112
5523A12j08k9m3M0N9m5l9k3N6l1O1O1l3K6j18P3L8rj07P1K0q4Q6o3nQ8k9l2j8
$$ 112 4 -25 -68 -28 31 -14 -53 -76 -20 -51 10 71 38 64 -54 19 57 48 -59 12 32 -52 34 -29 -34 54 25 -7 -25
5552b5j2N4n6L8L6L7m2M5j69N2P5J4p0J15j82P2J42j23J14j59K8L0kK3j7O9j71
$$ -25 -37 17 -39 -1 35 72 30 75 -94 -42 33 47 -23 92 -90 -18 124 1 115 -44 -16 14 12 35 18 87 -84
5579h4P5K4O6q3%N6j91K00m6p5N7j5N4j02J00qLl2mm1RL1oL7j9Q7n0j12J85j86
$$ -84 -9 15 81 -2 -2 54 -137 63 17 -58 -1 -16 38 -64 36 28 31 -1 -5 -46 -37 -6 -12 25 6 93 43 -69 116 -70
5609g0Nn8nKJ11K4o8J5k6J13l7j1kJ8j5M2K6j33qM3J64j91K0N0Qm5k9Q1n7j8O4
$$ -70 -65 -123 -128 -126 -15 9 -59 -44 -70 43 6 -5 -7 11 -4 38 64 -69 -77 -34 130 -61 -41 9 17 -28 -57 24 -33 -51 13
5640A3j13J09N2M5j11n5k6M7Mj7J4J9J03j15O3q7J48j76K5N1rk7Q3r1J14M6m9
$$ 13 -100 9 61 106 -5 -60 -86 -39 -35 -52 -38 -19 84 -31 32 -55 93 -83 -58 -7 -16 -43 40 -51 63 109 60
5667F0nl4kq2Q5m3Nkn7O1l4M5J4N8j08N6j6N3q6J02k4L5m5o0l2m3K03j28K1lL7
$$ 60 55 21 19 -63 22 -21 -16 -18 -75 -14 -48 -3 11 69 -39 17 1 54 -32 70 46 81 36 -24 -56 -99 104 -24 -3 -6 31
5698C1Mm5rN8j27j6J8P4Pn3K0Q8m8%N1j50J63p3j18R8O1o0K3o5P7n8J16q9J34
$$ 31 35 -10 -19 39 -88 -104 -86 -12 -5 -58 -38 50 2 2 53 -97 66 -7 -125 -27 34 -26 -3 -68 9 -49 67 -22 112
5727A12r9M4j47J6P4j0J4ON9j46J11N0j54l6N0m4P0m6M6M3J8k6L9KRmq5L8j4l0
$$ 112 13 57 -90 -74 0 -10 4 10 69 -77 34 84 -70 -106 -56 -100 -30 -76 -30 13 31 5 44 46 55 51 -34 4 -10 -40
5757d0O4p3O0L4J7j56n2K03p9K2J9r0M3J4Op8J08K1m7j2m7J15p0NJ27r1k4M2j86
$$ -40 24 -49 11 45 62 -94 -146 57 -22 0 19 -71 -28 -14 -8 -86 22 43 -4 -16 -63 52 -18 -13 114 23 -1 41 -145
5786a45K27k08J35k7R4o8j3J5L6n4L0K5j26J9J3k6k3J56j47N1LN1r7l6J27n7K1
$$ -145 82 -126 9 -18 76 8 -5 10 46 -8 22 47 -79 -60 -47 -73 -96 60 -87 -36 -33 18 -79 -115 12 -45 -24
5813b4R2q2J14r0l0j5J5R8p3J1o5J22l9p0N8q6P3q3R9J2q1j9J91n6p7L4p4R2J3
$$ -24 68 -14 100 10 -20 -35 -20 78 5 16 -49 73 34 -36 22 -64 9 -74 25 37 -44 -63 128 72 -5 29 -45 47 60
5842F0M0j47L4J27j25qP0N5j33K9J8L3j6p7J73k35J76r8l3J05K0q6N9q9M7Q7j65
$$ 60 100 -47 -13 114 -11 -19 51 106 -27 2 20 53 37 -40 133 -102 74 -24 -57 48 68 -18 41 -48 -1 86 -79
5869g9P8K1R5k74K29j15MQ9k2J1J38l2j07K4l5n2rj7J41j53RL5k0O5L6j16O6l6
$$ -79 -1 20 115 -159 70 -45 -41 48 26 37 175 143 36 60 25 -27 -36 -53 88 -65 -56 -21 -41 24 60 -56 10 -26
5897b6J54q6r1O8K3m6j9J17j03j02J70o2N3j9n4K4Kj0K2j0R6j05KLk7oq1Q4P3
$$ -26 128 42 -49 19 42 -4 -23 94 -9 -111 59 -3 50 31 -23 1 3 -7 15 5 101 -4 -2 1 -26 -32 -113 -29 44
5926D4j45O1m9J40m3o2qK2N8k9J1K8L0r5o9J26p4K0L1j3Q7jo3L5J1r8n2Q5J12
$$ 44 -101 -40 -89 51 8 -54 -62 -40 18 -11 0 28 58 -37 -106 20 -54 -34 -3 -16 71 70 7 42 53 -45 -97 -12 100
5955A00n2l0L6n2J3n8lK8kR8j33R0K3j3r1L5ol0Q0j50J65J3k0k7j9k7o1j8J74
$$ 100 48 18 54 2 15 -43 -46 -18 -20 78 -55 35 58 45 -46 -11 -17 -47 33 -117 48 61 41 14 -5 -32 -93 -111 63
5984F3Mm0KL4N0j57O9m9j34J06L0K2K0k1M2J7o5k2P6p2l6K5O6m2R5Mj27m3M9N7
$$ 63 67 27 29 63 113 -44 25 -24 -158 -52 -22 0 20 -1 41 58 -7 -29 47 -25 -61 -36 30 -12 83 87 -40 -83 -34 23
6014B3q1n9J64Q5k44J01QM7p2J55m0j31K3K9j6j4K1J1Lm3o5L9J77j31L1N6j34
$$ 23 -58 -117 47 132 -112 -11 -3 44 -28 127 87 -44 -21 8 -8 -22 -1 10 13 -30 -95 -56 121 -10 21 77 -57
6041e7J37l5L4k4M3j12P6K0n0j94P3J49q4k5J10j03oK04j74j4P8n5K3l7J0N7k5
$$ -57 80 45 79 55 98 -14 62 82 32 -162 -89 60 -24 -49 61 -42 -48 156 -18 -32 46 -9 14 -23 -13 44 19
6068A9j14J03l9J8J5j60J69l4J4R5k14P4J5L0K2R7k37J18J59r7J6o3oJ2K9j02
$$ 19 -95 8 -31 -13 2 -158 11 -23 -9 86 -128 -54 -39 -9 13 110 -127 -9 150 53 69 6 0 12 41 -61
6094f1P2Ol4K6O9k6m8q8O3l7j25K58j33P3m9L4l5J67o0J3r4M1r9JN0K9k5K5m3
$$ -61 11 17 -17 9 78 52 4 -84 -21 -58 -183 75 -58 15 -34 0 -35 132 72 85 -9 32 -67 -66 -16 13 -12 13 -30
6123c0Q8j09j7Q3o2J22q8M3m5R3k2r6k9mJ45n4j2J03k26O7M8n3J12j42O4M2o9
$$ -30 58 -51 -68 15 -47 75 -13 30 -15 78 56 -40 -69 -73 72 18 6 109 -117 -50 -2 -55 57 -85 -21 21 -48
6150d8L5L0O2j49k9J44j3j30J22p0lM9N6j2q3O2%o0l1J47n0j07J69j95J9R0j6
$$ -48 -13 17 79 -70 -99 45 32 -98 24 -46 -49 0 56 44 -39 23 23 -37 -68 79 29 -78 91 -104 -85 5 -11
6177a1n3L8L7Np2J66j12jK7l5k8J5Q0Q4j07l1r8l1Q9J21p7O3p2K4R1n6n4q4J95
$$ -11 -64 -26 11 16 -56 110 -2 -3 24 -11 -39 -24 56 140 33 2 -96 -127 -38 83 6 69 -3 21 112 56 2 -82 113
6206A13n6P6j48L3k5p4J7M9j4K5Qqln5J82j17O3k5k8j14J43k8J7o9LJ35l8r4Q9
$$ 113 57 133 -15 18 -7 -81 -64 -15 -29 -4 4 -4 -7 -62 120 3 66 41 13 -101 42 14 31 -38 -35 100 62 -32 57
6235E7M3j99jK12k0j8j22M4J6p9j9K14j40Q3o3R9l3k1Jj5Q0j72j7K5J36j02N5
$$ 57 100 -99 -100 112 92 74 -48 -4 12 -67 -86 128 -12 71 8 107 74 53 54 39 119 -53 -70 -45 91 -11 44
6262D4p5l5J09K3j27J11j99J16K8r2P7n7J9n0MJ30j14P7J7k4lk8J52j05q9J16
$$ 44 -31 -66 43 66 -61 50 -149 -33 -5 -97 -20 -77 -58 -108 -104 26 -88 -11 6 -18 -21 -49 103 -2 -91 25
6288B5J8j18R0kR6j02l8QJ30j86J22j70J71r6M0K9J8l6K6%J6j67J59J5L5q8N5
$$ 25 43 -75 15 13 109 7 -31 -23 107 -79 43 -127 44 -52 -12 17 35 -1 25 25 41 -126 33 48 83 -5 50
6315E0q6M1Ql8o1L0N2J7j23K5O4J6P2j38J42j57R8j67O9M3RL4M8K0j31NL1J42
$$ 50 -36 5 13 -25 -86 -56 -4 13 -110 -85 -21 -5 67 -71 71 -86 12 -155 -86 -43 -34 0 48 68 -63 -58 -27 115
6343A15k09L9oM9N8p4O9k2n2J13j53M5O8n9j7l1m7J51k8J7Qrj6J48j19j34J55
$$ 115 -94 -55 -61 -12 46 -28 41 19 -33 80 -73 -28 40 -19 -36 -67 -114 37 9 26 34 25 9 157 38 -96 59
6370E9q9nP7O0j64J15r9j2J7N5P6j0k13J46k3j2J66k36J49r5K0L5n3p8J74j84
$$ 59 -30 -35 42 102 -62 53 -46 -58 -41 14 90 80 -133 13 -10 -22 144 -92 57 -38 -18 17 -36 -114 60 -124
6396a24J64j13J40L1r1p0R0Or3oK3KP4N6j47K9oj20J46J7J7Q0m8L4j40K1l3R1
$$ -124 40 -73 67 98 7 -63 27 33 -60 -66 -43 -41 33 89 -58 -29 -35 -155 -9 8 25 105 57 91 -49 -28 -61 30
6424C0J11j62j3m2P2L0M7j02R1j12R2p4L1j4r6O8L8K0NQ1k14J08n1j4J05m1J1
$$ 30 141 -21 -34 -76 -4 26 73 -29 62 -50 42 -32 -1 -15 -111 -43 -5 15 20 101 -113 -5 -56 -70 35 -6 5
6451E%J9N4l1j52J59k6m8nJ08q4j65J91o0P7Jj9n0R5p8%J11j39L7J63r7o4L3O4
$$ 5 5 24 78 47 -105 54 28 -20 -25 83 -1 -166 25 -35 42 43 24 -26 69 -9 -9 102 -37 0 163 66 2 35 99
6480I9r5J5K1r9k1P8n2J22o5p4J68r0o0J07m8K4n3O2J4n9j31P5N9o1R9o9NL5o2
$$ 99 4 19 40 -59 -80 -2 -54 68 3 -71 97 7 -53 54 6 30 -23 39 53 -6 -137 -62 -3 -64 35 -34 -29 6 -56
6509e6JJ43q6k8MO3j02p4J33M2m3o5M7J05L9k04M2J26j48m5J24p3J5J0O2k3J08
$$ -56 -55 88 2 -26 -22 41 -61 -135 -2 40 -3 -68 -21 84 123 -81 -39 87 -61 -106 18 -55 -40 -30 32 9 117
6536A17r1j47J27R0o4n2k5N0M0K3j20M6Rk4N8K3l6kl2J13j70O5j0N3k4P2p7j6
$$ 117 26 -121 6 96 32 -20 -45 5 45 68 -52 -6 3 -21 37 60 24 22 -10 103 -67 -2 -12 41 17 89 12 -4
6564dpl5LO7p4r2J63m7rN9Q4j01M3K2j04J24j18o0O9Lj4l6l6K4J84j14m9o1J60
$$ -4 -11 -46 -43 24 -50 -142 21 -26 -35 24 108 7 50 72 -32 92 -26 -86 -17 -14 -28 -64 -100 -76 108 -6 -55 -116 44
6593D4J2r7M9O3o9p2P6p4J0J06Q8j45L1om2n4J5M8K1j3K6q0J2R0on1PM9p8J22
$$ 44 56 -41 8 71 2 -70 6 -68 -58 48 136 -9 22 16 -26 -80 -65 -17 4 -9 17 -63 -51 39 33 -18 -11 38 -40 82
6623H2r9O7j69O4Q0qJ17j40R7j57N8O4Rj36J03j63J65j10J64o6QO7j21J07n8p5
$$ 82 -17 50 -119 -55 25 17 134 -6 91 -66 -8 56 65 -71 32 -131 34 -76 88 22 30 97 -24 83 25 -50
6649e0J20j66J55o7K8Jo0J10n5j6k6l9J42n4R0k1j5r8N8o7P2rm0J5J8ko9O6K1
$$ -50 70 -96 59 -8 20 21 -39 71 16 0 -26 -65 77 23 113 92 77 -21 37 -30 42 33 -7 8 26 24 -45 21 42
6678D2r7R4m7l0LJ1Jj1O8p6p3J14N7j6O4j67P9r7R2J2o4O8j00N2LM3m2l5P5o4
$$ 42 -55 39 -8 -38 -35 -24 -23 -34 34 -42 -115 -1 56 40 104 -63 16 -81 11 23 -41 27 -73 -21 -18 25 -17 -52 23 -41
6708d1P6j6Qrm3P8rq7Pm3N7l7L1O9KmK0j77J37N5j6mj67J66k1k3L3o9Nj1J0J14
$$ -41 35 19 27 18 -25 53 44 -43 -36 -79 -22 -59 -28 41 43 39 59 -118 19 74 58 54 -113 53 32 9 42 -27 -22 -33 -23 91
6740I1p9j9l5L6r5j6J14M6n2R3j05L5R4j29P9nl6o3P2O5J0j78K26j94K4P6o5n
$$ 91 12 -7 -42 -6 -101 -117 -3 43 -9 84 -21 14 108 -21 58 53 17 -46 26 91 101 -77 149 -45 -21 55 -10 -15
6768a5r8J4m8J07P9j4j24J07r5P7o2O8p5O2o9P1k7J22j42O8j0l3K1M5kJ13j48
$$ -15 -113 -99 -147 -40 39 25 -99 8 -87 -10 -72 -4 -79 -17 -86 -15 -42 80 -62 6 -4 -37 -16 29 27 140 -8
6795hl1M5k7L5j08P7m2O1J4J7j73Q3M2k6q4R5mn8J82q8M4j24M6J26j52l8O6Q0
$$ -8 -39 6 -21 14 -94 -17 -59 2 16 33 -140 -57 -15 -41 -125 -30 -34 -92 90 2 46 -78 -32 94 -58 -96 -30 50
6823E0m8o6j0R0m6m3N5J5R4j28J04q3N4j23P8O7j04P9K3J6n0J01j65N4j49J16
$$ 50 2 -64 -74 16 -30 -73 -18 -3 91 -37 67 -16 38 -85 -7 60 -44 35 58 74 24 125 -40 14 -135 -19
6849a9n9J77q7Q9j21Q1j37M4Q5r1N5P8r3L2N5O3j12o2J7O4J7o5l9LQ9j21J23r0
$$ -19 -78 99 12 101 -20 61 -76 -32 53 -38 17 95 2 34 89 152 40 -22 -5 59 76 11 -28 -25 64 -57 66 -24
6877b4M8O6j48R5po0J16q8Qj16J52p0K2jj1j6lL7J9Jj28K15n6j30Q6k1j0J3p6
$$ -24 24 90 -58 37 30 -30 86 -2 6 -110 42 -28 -6 -7 -18 -34 -37 0 19 20 -108 107 51 -79 7 -14 -24 -11 -87
6906h7R3l0j2n9M2M3O0j34K0J6R9n1j35J12n1J28n5N0k07K19r0n2J58l4J4rN1
$$ -87 6 -24 -36 -95 -53 -10 50 -84 -64 -48 51 0 -135 -23 -74 54 -1 49 -158 61 -29 -81 77 43 57 48 99
6933I9j29K6Q2q4j6QK4L3j16P9J09j02J04q4M6r8nQ4j42Q5ql2j2R8j23J3J96j07
$$ 99 -30 -4 78 -6 -22 -14 10 43 -73 6 115 13 117 33 79 -19 -24 60 -82 3 -5 -37 -49 49 -74 -61 135 28
6961B8j5o4J16n2J22k43P4M3j9M5m7q6J83j02k0R1k8L4r9K3kk0m7J51r0K0J21
$$ 28 13 -51 65 13 135 -108 -34 9 -10 35 -12 -98 85 -17 -37 54 26 60 -39 -16 -18 -38 -85 66 -24 -4 117
6988A17Qo4j21J10n3q7P6jO4p4n2M8j2J26j05K7Q9j01L8j16j0P8j67J07L2J10
$$ 117 125 61 -60 50 -3 -90 -14 -15 49 -25 -77 -29 -41 85 -20 7 96 -5 33 -83 -93 -15 -182 -75 -43 67
7014F7j21L8j5P0l3J31r6l8n6O9l7J23m5j55J21P8m5m1o6J61r5p3J09n1j28J42
$$ 67 -54 -16 -31 39 6 137 41 3 -53 16 -21 102 57 -98 23 101 56 15 -51 110 15 -58 51 0 -128 14
7040A4L5nj5j00P3K5k6J9l2L1p8J40j68J72j18j9J04j08R3j5l5N2p0O2j59J14
$$ 14 49 44 29 -71 2 27 1 20 -12 19 -59 81 -87 85 -33 -52 52 -56 37 22 -13 39 -31 31 -128 -14
7066a4q1J78l8n9J1P8j35l3k6K1J29kp2%M0Q0l3J4M3l6j19J75o5j6j33J53p1l7
$$ -14 -95 83 45 -14 -3 75 -60 -93 -119 -98 31 29 -43 -43 -3 77 44 58 101 65 -54 121 56 40 -93 60 -11 -48
7094d8P5l5n5K04j90R0j1J2k7nm4K7M0m9n2P1J1qM4j36N0NJ75q8N5mp4n4o3J23
$$ -48 27 -8 -63 141 -49 41 30 42 15 10 -34 -7 33 -16 -68 3 14 6 50 -86 -36 -31 144 56 111 107 33 -21 -84 39
7124C9L0n0Q4k0j17o9J01j92J58N3j06J55l8k4Qp8J50Jp7n3j1L2L2J2K3n8j31
$$ 39 69 19 103 83 -34 -103 -2 -194 -36 17 -89 66 28 4 12 -66 84 85 8 -45 -56 -24 8 20 43 -15 -146
7151a46L1N3K0oM6jr0J4Q8K7q5J15p8o%N5O7j26%k0J04Pl7kQ3q1J9K5p4j54J9
$$ -146 -115 -62 -42 -48 -2 -3 -93 -79 9 36 -49 66 -12 -18 -18 37 104 -22 -22 -42 62 69 32 30 113 32 51 76 2 -152 -133
7182a33K05Qj47N6oJ1o8P8L6K6loK1j00j3j2M2M7K0k5qK7p7J5%m1J26N1p0Q0j34
$$ -133 72 80 -67 -11 -17 -6 -74 4 40 66 63 57 78 -22 -35 -47 -5 42 62 37 29 56 -21 -6 -6 -47 79 130 60 140 6
7213FK9j8L3nl5L3j00J46j43J55l7n5J6r7J22n2J9K2o7M9p5J55r9J4Nj2KJ96j72
$$ 6 35 17 50 45 10 43 -57 89 -54 101 64 9 25 -72 50 -2 17 39 -28 21 -54 101 2 16 21 9 11 207 35
7242C5m5K2j15M7P8j22K4J01k3L4l9J9j51K21j06O6l1Rq8m4R3n4Q6n8O6j15J48
$$ 35 -10 12 -103 -56 22 -100 -76 25 2 36 -3 16 -135 86 -20 46 15 24 -64 -108 -15 -69 17 -41 25 -90 58
7269E8j27L6Q0j63P8JN1l5j2N8j13J29J0M1j13P7o4p8P4oO7O9j37R6k4j31O2J65
$$ 58 -69 -33 47 -116 -38 -37 14 -21 -33 25 -88 41 51 92 -21 56 -8 -86 -12 -18 49 118 -19 77 53 -78 -16 149
7297A49j02q0k8K9K0N2k5p7O8j4J9k8J05j56J5KN6Rr3M6J24L2p4l6j38P4J1M5
$$ 149 47 -33 -61 -32 -12 40 15 -62 6 -8 11 -17 88 -68 -53 -51 5 14 -79 -33 91 123 49 13 -125 -51 -40 5
7325ERJ03j58J66K4j20k7J1Rn5o8J12n7J43k9k8m2rN6N0j97K37j22qQ3jj51J08
$$ 5 14 117 -41 125 149 29 2 13 22 -33 -101 11 -46 97 68 40 -2 -11 45 95 -102 135 13 5 88 87 -64 44
7353D4o0P0q5L0J3n9K0N8o8R1o2O8n8N4l1r9Q4K1M3p3J16k58J30KO0l0Rl2J0L5
$$ 44 -16 54 -31 -1 12 -47 -27 31 -37 54 -8 60 2 56 25 -74 10 31 74 1 117 -141 -11 -9 51 21 30 -2 8 43
7383D3l6k3O9j0P8q6k6Pj12M5J05m4P4o9K4o7m3J4lJ18K0k48J87R9j95Q2r1J65
$$ 43 7 -16 53 43 121 35 9 16 -96 -51 54 10 84 15 39 -28 -71 -57 -60 58 78 -170 17 116 -79 3 -88 77
7411G7j13J00k5p7P5OrP9j48lJ23k8j03O3R7j21RO0j67J44K4p2L9m8L2K7o8J4
$$ 77 -36 64 39 -38 37 43 34 113 -35 -38 85 57 -46 17 114 -7 2 62 -105 39 63 -9 30 -18 14 41 -27 -13
7439a3M0o4l0M7J04j11J0J29r6J1j00P3j36N7J00NJ2j4k8N1l7j42J49p7Q2J6J
$$ -13 27 -37 -67 -20 84 -27 -17 112 16 27 -73 0 -136 -79 21 26 38 24 -4 47 10 -132 17 -60 22 38 39
7466C9n0L7J11j32pr6k0J57q1k8Q0Q2j43QP2j38J37l2o2O1l4J34n4j55J00P8p3
$$ 39 -11 26 137 5 -2 -98 -118 39 -42 -70 10 92 -51 -43 29 -109 28 -4 -66 -5 -39 95 41 -114 -14 64 -9
7493ij6P2l7j03J58l9j03Pm6O6p1J50L6j27n0J2J67q6J75k10J6n8N4M5kO1l6J0
$$ -9 -25 47 10 -93 65 26 -77 -70 -116 -50 -121 29 65 -62 -112 -100 67 -19 156 -54 -38 -96 -42 3 1 62 26 36
7521C6j38R7jj4k6J0J43j12m2pN8N5j4L3o1K2o9J31j32P9r3k9J74j42l4J20M0
$$ 36 -102 -5 -6 -20 -46 -36 107 -5 -47 -54 4 59 45 78 17 39 -30 101 -31 48 -45 -74 100 -42 -76 44 84
7548H4j60J38l2q0J01j07L0K9l9M5l1O2l1q8j3J64j11M9Q0j48R2n2P2j72J08O6
$$ 84 -76 62 30 -50 51 -56 -26 3 -36 9 -22 40 9 -79 -92 72 -39 10 90 -58 34 -18 54 -118 -10 56
7574E6l6l7J2J17q4l6J3M2M6o3k1jl1J23p3q2J27m4k9m0l8J08o0nJ60j86R2m7
$$ 56 20 -17 -5 112 28 -8 5 47 93 30 9 8 -23 100 27 -55 72 28 -1 -41 -79 29 -31 -36 124 -62 30 -17
7602a7Q7r7p7J21n0Q3n4o4M8Q1j42O8l5k0K1M4n9JN1M2J39j76On9J69m9k7p2J17
$$ -17 70 -27 -104 17 -33 50 -4 -68 -20 61 -81 -13 -48 -68 -47 -3 -62 -61 -10 32 171 -5 1 -58 111 62 35 -37 80
7631H0j00N3Lj15P1N5q3P4M9j42K9k7M9K7m1J11r4K3O5l8j7o9M6j90J91N7j95
$$ 80 -20 33 36 -79 -8 47 -36 38 87 -55 -26 -53 -4 23 -18 93 -1 22 87 49 32 -37 9 -181 10 67 -128
7658a28P8j3J60j66O2J14n1k2P4j35J76j05P1j80J8OK6p4J04N0L9j83OM0k5P7
$$ -128 -50 -63 97 -69 -7 107 56 34 108 -27 149 44 115 -65 -47 -41 -15 -89 15 65 104 -79 -73 -33 -58 19
7684A9Jj9L2Q8j28J6o1pK4k7R3k9k4O9l9k5m4J35n7l7J31N0j88J7J2%M6J1l0n7
$$ 19 20 1 33 121 -7 9 -52 -59 -35 -62 31 2 -22 47 8 -17 -61 74 17 -20 111 161 -27 -10 2 2 48 59 29 -28
7714b8N7rK6J0j05M0O2q9QJ26l3n5k6K9M3l8L0o9Jj4J41k8j33M9L2J4m8K4M2L1
$$ -28 29 20 46 56 -49 -9 53 -36 -28 98 65 10 -16 13 56 18 48 -21 -20 -34 107 79 -54 -5 27 41 -7 17 59 90
7744I0r6P3p6O7L2k5J5q8m4nN2N2l2p5K6j9J02K0j85N3J60j22Q7K6l7j6j49Q7
$$ 90 -6 67 -9 58 90 65 80 -8 -52 -57 -5 47 15 -60 -34 -53 49 69 -116 -63 97 -25 62 88 51 35 -114 -27
7772b7J00k7L6j13P3j05J18J3K0q3Q8J2j65J5J09o6lK6K7l3n8J5M8K5k3k4M1j9
$$ -27 73 46 82 -31 42 -63 55 68 88 5 93 105 -60 -45 64 -2 -5 21 48 15 -43 -28 20 45 22 -2 39 20
7800B0l8p2P0K2P3o1J0%J3o1R1r1j5Q2K7J5n9K4r9O0M7j58J40J8l9KK0j05J26
$$ 20 -18 -90 -20 2 75 14 24 24 37 -24 67 -24 -39 43 70 85 26 50 -49 11 58 -100 40 58 19 21 41 -64 62
7829F2j20Jj10J40QJ5R3J3n5OJ1q7J09J2j7j07J10m9l0J46j12m8K6l7Oj0N6n6
$$ 62 -58 -57 -167 -27 -19 -4 89 102 47 53 64 -23 86 98 81 -26 84 35 5 151 39 -9 17 -20 -14 -24 32 -24
7857b4P1J9r9P2Lp3M7l9Q0j62O2P7m2QM2r8m8Q1M3nK3j2m7J8O6j10p1K9J35p8
$$ -24 47 66 -33 39 42 -31 16 -23 57 -105 -43 34 -8 0 42 -56 -104 -23 20 15 38 26 -21 -3 63 -47 -118 -89 46 -32
7887c2n7J8KL0J06m5l1o4J20o9J1k9k8R8j2p9O3L8qq0O6M1j66O8L3M7Q1p1p4L8
$$ -32 -89 -71 -69 -39 67 22 -9 -73 47 -22 -11 -40 -68 30 18 -61 2 40 32 -48 18 59 -107 -39 -6 41 122 51 -23 15
7917A5K1j1n3J13j20J05Oj42P7q3J18Jr6J15n7k7P8L5j39q7N6N5j6J37j21QJ8
$$ 15 36 25 -28 85 -35 70 76 -66 11 -72 46 47 -49 66 9 -18 60 95 -44 -131 -75 -20 -36 101 -20 -12 6
7944Fl0L9N3j41k6k1J62k7j01R5J09j01L8j39J87r2o7M9k9J32j97J59q3R6j21
$$ 6 -24 15 68 -73 -99 -120 42 15 -86 9 118 17 55 -84 103 11 -56 -7 -36 96 -101 58 -25 71 -50
7969e0M9O7J6n8k4j3k6M2N9j05P8r3L1l5N6K1J13j31n9J04k2O8m3Mq9J42j70M6
$$ -50 -1 66 82 24 0 -13 -39 3 62 -43 35 -58 -27 -62 -6 15 128 -3 -62 42 20 88 45 49 -40 102 -68 -22
7997b2Jo5N6J59r3lo6P8N7o5o0pJ51j24L0r7K9R7j04J09j11M8K1p6N1k8p7J39
$$ -22 -21 -86 -30 129 36 33 -33 45 102 37 -23 -30 121 -3 27 -70 -41 56 -48 61 -50 -2 19 -57 -6 -34 -111 28
8025B8n8M3L1Kj18n6R0Ro2Q5j2m8L0N6k1L3k4l0J28p6K6l3J07o7O8m1j12N5j19
$$ 28 -30 13 44 46 -72 -128 -38 -29 -91 -6 -18 -66 -36 20 -1 32 8 -22 106 30 56 23 130 63 131 90 -22 33 -86
8054h6J26l5K9m3K3j37J79q9O4j51N5N5O0L7l6n8lm4k1J28j19J09K7m5q5O4J88
$$ -86 40 5 34 -9 14 -123 56 -33 31 -120 -65 -10 50 87 51 -7 -10 -54 -75 53 -66 43 70 25 -60 4 192
8081A92j87n8k3P1M6j6m2q8J13P4j40J27oj32J2J15J8q6NJ9J9ML3OMmp3k1J00
$$ 192 5 -53 -76 -5 41 25 -17 -105 8 82 -58 69 63 -69 -57 58 76 -10 -5 14 33 37 70 76 80 76 3 -18 82
8110H2k07J13j4nR4p4M4Np4J8K4N3j51O5j9oJ16l6q5N3PO9n6%l4R8l4N5q3j7R4
$$ 82 -125 -12 -26 -31 63 -11 33 38 -36 -18 6 59 -92 -27 -46 -52 64 28 -57 -4 3 72 16 16 -18 80 46 101 18 1 95
8141I5j00R7j39N0O0L2k51K51n9m4oJ4Om0O6p9M5m4J18J5o6K0q5J06m5k3q2LR3
$$ 95 -5 92 -47 3 63 95 -156 95 36 -8 -14 0 6 -34 32 -47 -2 -46 72 87 21 41 -44 62 17 -6 -88 -85 8
8170HNO7j59L7K01j66J2o5lJ84k1p7rRj23P7o8J86q3j1q3
$$ 8 13 80 -79 -42 159 -7 5 -60 -63 121 100 23 14 23 -100 -23 -91 95 12 1 -82
8191h2
$$ Imaginary data points
##PAGE= N=2
##DATA TABLE= (X++(I..I)), XYDATA
0@%%%%%%%%%%%%%%%%%%%Qj6J6j6J6j6J6k4L2l2L9m7M8n6O4p2Q4r2J04j19J33j47
$$ 0 0 0 0 0 0 0 0 0 0 0 0 0 0 0 0 0 0 0 0 8 -8 8 -8 8 -8 8 -16 16 -16 23 -24 24 -32 32 -40 44 -48 56 -63 70 -77
41g7J63j81K00k21K44k70K98l28L62m00M41m85N35n90O52p24Q05q99J008j139
$$ -77 86 -95 105 -116 128 -142 156 -172 190 -210 231 -254 281 -309 343 -381 424 -475 533 -606
61f06J300j500J757k102K597l362M727p920L1792J2300l4684o870q537r705r623
$$ -606 694 -806 951 -1151 1446 -1916 2811 -5109 26683 38983 4299 -2571 -11108 -20813 -30436
76c0436J3252J8026J2602K944L211m302j1398j4491o978j875M874J0820J4209
$$ -30436 -17184 842 13444 16388 19599 15297 3899 -10592 -17570 -19445 -14571 -3751 10458
89A0458P056k82m461q020j3992r574K154Q380O617P666Q874K598p382r710p336
$$ 10458 17514 17232 12771 4751 -9241 -18815 -16661 -8281 -1664 6002 14876 17474 10092 382 -6954
104f954n535k861L792R552R656N714J506m380r049r539m926o32K996Q035J0650
$$ -6954 -12489 -15350 -11558 -2006 7650 13364 14870 10490 1441 -8098 -13024 -13656 -10660 -2625 8025
119H025N632j738l804m391p903q362j599N886P032N562N487L452k798q366q177
$$ 8025 13657 11919 8115 3724 -4179 -12541 -14140 -8254 -1222 4340 9827 13279 10481 2115 -6062
134f062m499p95K319N753P806N704J228k867n735o928m773j418J679M758O830
$$ -6062 -10561 -11356 -9037 -3284 4522 10226 11454 8587 2852 -4076 -8849 -10267 -8588 -3830 3000
149C000N941J548k765m697n426n299k455J924N368N867M220J768j253m244n415
$$ 3000 8941 10489 7724 3027 -2399 -7698 -10153 -8229 -2861 3006 7226 8994 7741 3497 -1918
164a918m851k050J499L988M909M342J987p20l644n312m223j708J189L210M498
$$ -1918 -6769 -8819 -7320 -3332 1577 5919 7906 7186 3542 -1770 -5993 -7701 -6512 -3302 1196
179A196M217K017j081l224m115l710k096M32K884M274L699J897m18k613l755l692
$$ 1196 5413 7430 6349 3125 -990 -4700 -6796 -6364 -3480 794 4493 6390 5972 3359 -396 -4088
195d088j934K63K381L778L469J744k22j990l400l553j876J99J937L071L269K037
$$ -4088 -6022 -5759 -3378 400 3869 5613 5391 3401 1 -3552 -5428 -5229 -3292 -221 3048 5085
211E085K6j809l088k962j925j99J701K759K864J810K21j453k619k606j960j31
$$ 5085 5111 3302 214 -2748 -4673 -4872 -3171 -412 2452 4262 4483 3030 411 -2195 -4155 -4286
227d286J185K457K767J742L37j167k319k453j736m31J052K113K247J767M07q71
$$ -4286 -3101 -644 2123 3865 4202 3035 716 -1737 -3473 -3904 -2852 -739 1508 3275 3682 2811
243B811k094k179j659m19Q71J779K224J651L65p60j839j950j401o57P03J615J871
$$ 2811 717 -1462 -3121 -3540 -2669 -890 1334 2985 3350 2590 751 -1199 -2600 -3257 -2554 -939 932
260I32J660L48o06j403j808j411n65P42J295J669J418N54p19j221j542j396n88
$$ 932 2592 2940 2334 931 -877 -2288 -2853 -2111 -816 853 2271 2825 2106 885 -657 -2053 -2641
277b641L66J332J510J406M68l56j129j476j283n75M47R32J423J189O86l91r51
$$ -2641 -2275 -943 567 1973 2441 2085 956 -520 -1803 -2378 -1931 -999 424 1613 2299 1908 957
294I57j273j147n84J41Q51J413J120L65q1q28j237j009m97%Q77J197Q45N50j0
$$ 957 -316 -1463 -2047 -1906 -1055 358 1478 1843 1762 934 -303 -1312 -1809 -1809 -932 265 1110 1660 1650
313A650p08j155r78l68J23O05Q18J145N07o9p22r65q58n71P2O26R54Q73M68q7
$$ 1650 942 -213 -1191 -1559 -1436 -831 -13 1132 1639 1570 848 -117 -975 -1546 -1474 -848 106 979 1447 1360
333A360n50q21r41m71J31M79Q81P91M72m9m08p19q58o87R9N74P45P51L26J03l76
$$ 1360 810 -11 -952 -1423 -1292 -813 68 859 1331 1282 874 155 -703 -1390 -1291 -717 28 779 1105 1208 832
354H32p12p76m25j77L80P54O37N63O3k63o65q27m91k3L70O79N54M74Q7k14o59
$$ 832 120 -656 -1081 -1258 -878 -124 513 1076 1139 876 211 -616 -1107 -1130 -760 -81 473 947 1034 820 161
375A61o93m29p6L05N31P76L61K5k40n06n72n31j65K42N90O54L63K31l09m26n96
$$ 161 -532 -961 -1037 -732 -201 575 936 961 721 215 -357 -888 -1053 -811 -221 433 796 1027 718 292 -304
396c04m45k30J42O05O04L06K27j48m99n96m90q1J38M08O54M42J63k32l71n14n19
$$ -304 -749 -979 -837 -232 372 678 905 757 258 -338 -828 -909 -771 -363 291 733 896 664 293 -221 -740
417g40p8J10M60M70N64P2r8m63m42m92k67J41L86O15M31J14l4m49l67n74j68M3
$$ -740 -818 -708 -248 222 786 858 760 297 -145 -637 -904 -763 -377 238 669 783 749 300 -67 -641 -809 -766
439g66M76M12M45K53j47k95m67l96k59J13L36K88O56O1%l57n74l74n1M9J17N45
$$ -766 -290 122 567 820 673 378 -89 -485 -744 -631 -295 -7 649 710 710 353 -221 -595 -646 -597 -480 65
461F5L44L47o7k15m83m51j96J15K19K90N58P2Nl05k58n63j13RK65L46L62K20L0
$$ 65 409 756 689 474 -9 -460 -656 -541 -322 -32 526 598 603 298 40 -523 -636 -627 -362 -16 346 566 596
484E96n0m72l80k61J4J96L62L08K23M1k08l27l63j28m2R3M45K03K65l3j33k08
$$ 596 546 74 -306 -567 -553 -357 5 313 536 577 369 42 -321 -449 -491 -398 47 250 515 482 349 141
506A41m64k18m5K52L53K81J64j03j4k03m59r9j65K73J44N03N8J84j56l72l13l09
$$ 141 -323 -541 -586 -334 19 300 464 361 347 144 -315 -414 -579 -306 -162 341 399 583 427 55 -258 -567
528e67Q8J36K10L35L32p0j51k12l15k06Q2l2K43K59K04K84l69j13l76l4k05J3
$$ -567 -479 -343 -133 202 534 464 313 101 -214 -420 -338 -370 -127 132 336 620 251 138 -238 -272 -477 -464
550d64K37L46K04P1r5k77j24l11j97K35J77K90K52K08o0m20j63l00%J30J49K71
$$ -464 -227 119 323 394 299 22 -102 -413 -610 -375 -198 92 344 552 492 72 -91 -391 -391 -261 -112 159
572A59J56J40r2k10j52k70j65J77J78J33L56lm7k20k47k32j90J49J08L76J46K12
$$ 159 315 455 363 153 1 -269 -434 -257 -79 54 410 407 360 140 -107 -339 -529 -380 -272 104 250 462
594D62j28j83k40j78j85K40L2J36K89K71j62j33l66j84n7k2L79N3J85K41o6j31
$$ 462 334 151 -89 -267 -452 -212 -180 -44 245 516 354 221 -145 -329 -386 -408 -29 24 209 450 384 253
616B53l12l01l1J39J64J61J59J32r8P7m56k43j1l9K76J62J76J77p4j03k85j68
$$ 253 -59 -360 -391 -252 -88 73 232 364 266 343 -113 -356 -367 -406 -130 32 208 385 311 208 -77 -245
638b45l7j40J27L64J80MO8j88j76j97r3r5K43K41N2K55l3L4k39k94l28J37R1K97
$$ -245 -282 -422 -295 69 249 253 321 133 -43 -240 -333 -428 -185 56 108 363 330 364 125 -169 -497 -360 -269 28
662B8K08R0J05l20j7l01j00l0J29K02J86K71j32o2k48k18j18n8J65J23K45J33
$$ 28 236 326 431 111 94 -207 -307 -337 -208 -6 180 451 319 257 9 -209 -327 -385 -220 -97 148 281
684B81p1M2j85k78r5j48K48J71K44N4O9kk95k06j63n2J55J8L32J45P9r4j57k78
$$ 281 210 252 67 -211 -306 -454 -206 -35 209 263 332 330 35 -171 -334 -386 -231 -213 119 264 343 249 92 -186
708a86J4j06j2K09J98J64L1nk40j32k24r7Q3J13K90J53J80r6k18j91k30Q3j22
$$ -186 -172 -278 -290 -81 117 281 312 307 67 -65 -289 -386 -303 -190 100 253 433 337 119 -72 -302 -219 -341
731c41K42K63M0J37K0k58j59j75n4jJ52L40J8J84j66o1j45k24j30R1Q0J19K51
$$ -341 -99 164 204 341 361 103 -56 -231 -285 -286 -134 206 224 408 242 181 36 -188 -318 -227 -147 -28 223
754B23jL5j05j77k00j9Q3N1J83J28M1r4j7j83j64q4N8J19PK68N2N6j19k9j05j74
$$ 223 222 257 152 -25 -225 -244 -161 -110 73 201 242 148 131 -52 -216 -300 -242 -123 -116 152 204 260 141 112 7 -167
780a67r3N7Q5K78J29j14kj67j56p5k9P6J64J30LP1kj26j30r8q7J19J19O9O8J33
$$ -167 -260 -203 -118 160 289 175 173 6 -150 -225 -254 -178 -14 116 119 190 188 62 -68 -166 -253 -134 -15 54 122 255
806B55j28j55pk18Q1j37K22J79O1J7l1j30m5j99%nJ44J96L6P3j5j55j26r9n3K5
$$ 255 127 -28 -35 -253 -172 -309 -87 92 153 170 139 9 -36 -235 -235 -240 -96 100 136 209 194 39 -87 -186 -239 -214
832b14J69J85m0O6k3o0k05Oj71Q0J97L8J04lM2j15o7j39k9J04J6lK63l6M0j63
$$ -214 -45 140 100 166 143 83 -122 -116 -287 -207 -10 28 132 129 171 56 -11 -150 -179 -75 -59 -62 201 165 205 42
858D2j38k1j12P4P1J02M0J90r1q9j91K0j18K1R9j9L27q8J0O5j19k83o3K1J35J26
$$ 42 -96 -117 -229 -155 -84 18 58 248 157 68 -123 -103 -221 -200 -101 -120 207 119 129 194 75 -208 -271 -250 -115 11
884A1J75m8J01j11j46n9r3K5L1J60l2J31n5O6j13j13j54N2L7P3J20Q8R0k2l01
$$ 11 186 138 239 128 -18 -77 -170 -145 -114 46 14 145 90 156 43 -70 -224 -172 -135 -62 58 146 236 214 -87
909h7J97k37p3J08M7J77j21J15jj93l7m9n4J20J04P9NJ38r4j35j51m3L3l6J10
$$ -87 110 -127 -200 -92 -45 132 11 126 125 -68 -105 -154 -208 -88 16 95 100 238 144 9 -142 -185 -152 -188 -78
934g8J23nJ24j33k7o9p8J21j23R3J1J88k3J29j18j29k02M5O1l9J51J88k4o4r8
$$ -78 45 40 164 31 4 -65 -143 -22 -145 -52 -41 147 124 253 135 6 -196 -151 -90 -129 22 210 186 122 24
959B4n0p8m4Q6mJ61l5L7J3m3J1j49KoL9J65l3qq5k2M5l9j25j46J61L19j57QJ34
$$ 24 -26 -104 -148 -62 -66 95 60 97 110 67 78 -71 -69 -75 -36 129 96 88 3 -19 26 -13 -138 -284 -123 196 39 47 181
988A81j27o6l8j60Q0K9M8J79O1j48LQ9j42j58J1NP7J59M8J5p5n7q0l8J05j76J73
$$ 181 54 -12 -50 -210 -130 -101 -53 126 187 39 42 131 -11 -169 -158 -153 -76 83 131 146 71 14 -66 -104 1 -175 -2
1015bN8k5QJ1m4j24R1r1P5J2J34p5L3rp5l9m6ok6J10L2LQ2Q5j36j54J15Jj03J24
$$ -2 56 31 39 50 6 -118 -27 -118 -43 -31 103 28 61 52 -23 -62 -108 -114 -140 -30 2 5 87 172 36 -118 -3 -2 -105 19
1045A9j10J48O5j01j25M8Lo2J6k0J99p5M1Q9r5Oj62J01j1k9K5m4J03j23K27j96
$$ 19 -91 57 122 21 -104 -56 -53 -115 -99 -119 80 5 46 135 40 46 -116 -15 -26 -55 -30 -74 29 -94 133 -63
1071f3m1J7lJ19m5P1m9O7k5j23R2rj15R8K6Q5K3m4oq1L6j76R5l8L0P2n6J31j9
$$ -63 -104 -87 -90 29 -16 55 6 73 48 -75 17 8 -107 -9 17 102 125 81 75 -6 30 -146 -51 -89 -59 13 -43 88 69
1100F9N0k27J72k03O7L2O7k7P8n1K2M1j20J6o2M0N5Q1m1m7m7Kn5n9n4J91O9j9
$$ 69 119 -108 64 -139 -72 -40 27 0 78 27 49 90 -30 -14 -76 -36 19 100 59 12 -35 -33 -88 -147 -201 -10 59 40
1128D0q8R2p7j01J56m9n9J50n7N4k4n8K9p0P8n8Po8J00J27o4j02K0q6J22q9K8
$$ 40 -48 44 -33 -134 22 -27 -86 64 7 61 37 -21 8 -62 16 -42 -35 -103 -3 124 60 -42 -22 -108 14 -75 -47
1155d7N0J4L5n1K1J0O3k30K6j1J62n9R7j21M6M0K8r2L9p3O2q1O1J91o9j93j1Q7
$$ -47 3 17 52 1 22 32 95 -135 -109 -120 42 -17 80 -41 5 45 73 -19 20 -53 9 -72 -11 180 111 -82 -93 -6
1183fMr1MJ89q0R0k11J50q1mK1p8P3J5J20%j62j4J48n8p1K1l9N3R6p7K2o7RO0
$$ -6 -2 -93 -89 100 20 110 -101 49 -32 -36 -15 -93 -20 -5 115 115 -47 -61 87 29 -42 -21 -60 -7 89 12 34 -33 -24 36
1213C6j29K6Q3M3Oo0J37r7n9L2j04J39o1j8P2n8Q6or9n4K6j4O4j5n1K1J08O2j98
$$ 36 -93 -67 16 59 65 5 142 45 -14 18 -86 53 -8 -26 46 -12 74 68 -31 -85 -59 -73 -9 -24 -75 -54 54 116 -82
1242h2N8p6M6L6j8Q5l0K6N2j12J4j34Q4R9q2L8J08l6q2K9j8K6l2On2Q4LQ0j65
$$ -82 -24 -100 -54 -18 -36 49 19 45 97 -15 -1 -135 -51 48 -34 4 112 76 -6 23 5 31 -1 5 -47 37 40 120 -45
1271d5l0n5J82l1mm8N2L9q9J54j10JN5j15J21j43Q0q1L2Q6J0r9m3J7O2L8r7J61
$$ -45 -75 -130 52 21 17 -31 21 60 -29 125 15 16 71 -44 77 -66 14 -67 -35 51 61 -38 -81 -64 -2 36 -61 100
1299A00j38Qk2M2M0n5j22K05m7j6K7Pp2o6J66j19Pk7J78o9n7m9Q3l9L1n1J6M8
$$ 100 -38 -30 -52 -10 30 -25 -147 58 11 -5 22 29 -43 -109 57 -62 -55 -82 96 27 -30 -79 4 -35 -4 -55 -39 9
1327Il4J5k0j06O3Q2oq8J5M4n9J37j6Jj65R1L5q2N0Q1r3J5N1L6j3j05Q7P5j52
$$ 9 -25 -10 -30 -136 -73 9 3 -85 -70 -26 -85 52 36 37 -128 -37 -2 -84 -34 47 -46 -31 20 56 43 -62 25 100 -52
1356e2J51j11M9k3r5J10L7%l4j32O4K9J41q2N4q9J13j80oK0K7J13k14J90j08L7
$$ -52 99 -12 37 14 -81 29 66 66 32 -100 -36 -7 134 52 106 17 130 -50 -56 -36 -9 104 -110 80 -28 9
1382IM4%o7J21j48P1Jo1M0kO3j28n7Q7o8J36O5m7o4N1o4K5k9KJ6O2n1n0J6Q4m3
$$ 9 53 53 -14 107 -41 30 31 -30 10 8 71 -57 -114 -27 -95 41 106 59 -5 46 -18 7 -22 -20 -4 58 7 -43 -27 57 14
1413A4kk7L2r5J31l3ln3J36q2m6mj4j6J2l8J29j5P0q4m6J44j08k30J88J28l4N
$$ 14 12 -15 17 -78 53 20 17 -36 100 18 -28 -32 -46 -62 -50 -88 41 26 96 12 -34 110 2 -228 -40 88 54 59
1441E9l8jl0J0j48K36j22Ml9L4O1Nq1l4K9M7j18J44L8r6Q1m3o8M0L7r3LR5l5J94
$$ 59 21 20 -10 0 -148 88 -34 -30 -69 -35 26 31 -50 -84 -55 -8 -126 18 56 -40 41 -2 -70 -30 7 -86 -83 12 -23 171
1471A71p4j12k7K1J1o3R4O7n1k18K73j32l0m0l2K4J29l4J1P5j58J76j31k8J4J
$$ 171 97 -15 -42 -21 -10 -73 21 88 37 -181 92 -40 -70 -110 -142 -118 11 -23 -12 63 -95 81 -50 -78 -64 -63
1497f3J09L8K6n3Q8j58N3M4j30K9O4j3Ml1N2M5j14k0J0M4r2L8P9r4L3M0Nr9J6
$$ -63 46 84 110 57 145 -13 40 84 -46 -17 47 34 38 7 59 104 -10 -30 -20 24 -68 -30 49 -45 -12 28 33 -66 -50
1526e0k2J11Q5j76J5PK7j7rk5N8q8MP5l3Q0P1l8j43NoL6O4k5l1QK1n5K1k7L2r2
$$ -50 -72 39 124 -52 -37 -30 -3 -20 -29 -54 4 -84 -80 -5 -38 42 113 75 -68 -63 -69 -33 31 6 -25 -17 4 -51 -30 -57 -25 -117
1558a17P6L5Q0o1P4j60J21j30J14jn3L9pj66K23Q3k73J40n7rj02O7J13o7R5o0
$$ -117 -41 -6 74 13 87 -73 48 -82 32 31 -22 17 10 -156 67 150 -123 17 -40 -49 -151 -84 29 -38 57 -3
1584ck3K4k1r1R8J20j58M9J5M8j60J8P7oj1J20j8l7j55J22Q1j05n9M6R8m7n3j7
$$ -3 -26 -2 -23 -114 -16 104 -54 -5 10 58 -102 -84 -7 -13 -24 96 78 41 -114 8 89 -16 -75 -29 69 22 -31 -48
1612d8K3Ll0K0p0J64o6J28j8p9L5r2Q2n5k0K3o9J72%o5O3q7q1J30q2lJ34j33o1
$$ -48 -25 -22 -52 -32 -102 62 -4 124 106 27 62 -30 52 -3 -23 0 -69 103 103 38 101 14 -67 63 -19 -22 112 -21 -82
1641h2Q9k5J26q1j32P4R6j32M1k6m4K5L5J01k02J23M6O8m7r1J00jp7N9r2J9p2
$$ -82 7 -18 108 27 -105 -31 65 -67 -26 -52 -96 -71 -36 65 -137 -14 32 100 53 -38 62 61 -16 43 -49 -30 -102
1668a02K9L5k1L4oN2m4o3J48P3j24K7n0lJ23j93J16n7P2l4Qj0L2n0J3M3j74J66
$$ -102 -73 -38 -59 -25 -31 21 -23 -86 62 135 11 38 -12 -15 108 -85 31 -26 46 12 20 10 42 -8 5 48 -126 40
1696D0r8J5p1O3J01l9M9j17O7o2p6J38j17J10M4j40O3k2P2r6R7K4m3j19J99k8
$$ 40 -58 -43 -114 -51 50 11 60 -57 10 -52 -128 10 -107 3 47 -93 -30 -52 20 -76 21 45 2 -117 82 54
1722E4p7No7L2N6lLk8Lj02N3J1J16r4K7J07o3j01J04K8M7o8n0L7j38J7M4O1Ll3
$$ 54 -23 -18 -85 -53 3 0 3 -25 -22 -124 -71 -60 56 -38 -11 96 33 -68 36 64 111 43 -7 30 -108 -91 -47 14 17 -16
1752a6O5k9j03K05p8q7PJ4n1J30J5q4m0l9J33o5p6O9J2k6J48p1j20Q5J39j77Q0
$$ -16 49 20 -83 122 44 -43 -36 -22 -73 57 72 -12 -52 -91 42 -23 -99 -30 -18 -44 104 33 -87 -2 137 -40 40
1779D0P8j83O6L4jJj25K2P9l4j1l1L4J03Rm6ko9r8K22j10J3nN1p0Q3o9oM0l2K7
$$ 40 118 -65 1 35 34 35 -90 -68 11 -23 -34 -65 -31 72 81 35 33 -36 -134 88 -22 -9 -14 37 -33 50 -19 -25 15 -17 10
1810A0j0J38q8j1j40P6J54j65J20j10n0J27k9N7n4Pl8k2J5L5m9j9J33o6K9q4Q5
$$ 10 0 138 50 39 -101 -25 129 -36 84 -26 -76 51 22 79 25 32 -6 -28 -13 22 -27 -46 87 21 50 -34 51
1837E1j0n0P1q9N8j28J10N0j35L4J4M8k6J72r3l8R2p8o7M2J23k85K61j60R1j25
$$ 51 41 -9 62 -27 31 -97 13 63 -72 -38 -24 24 -2 170 77 39 131 53 -14 28 151 -134 127 -33 58 -67
1863f7J06q4mn9K8J31l8m8k1J10j19J9R9q4J3Q5q4Rk7j5N0m2j5J24k8q2R9n4n7
$$ -67 39 -45 -49 -108 -80 51 13 -35 -56 54 -65 -46 53 -31 -18 67 -17 -8 -35 -50 0 -42 -57 67 39 -43 56 2 -55
1892e5J8M5R3j04O2j32m9J69l4L9r3N3l1QJ1m5k9Q6j06R5oO2l0p7Q%LK1KJ34j22
$$ -55 -37 8 101 -3 59 -73 -122 47 13 52 -41 12 -19 -11 0 -45 -74 12 -94 1 -5 57 27 -50 -42 -42 -39 -18 -16 118 -4
1923dj9p5Q4J13k70J57n1L0M8n1P0J2K0Ko8j07J39knm5L3l9m2M6k8PK0K1J7j5
$$ -4 -23 -98 -14 99 -171 -14 -65 -35 13 -38 32 44 64 66 -2 -109 30 28 23 -22 11 -28 -70 -24 -52 -45 -25 -4 13 -2
1953blN5M3k35J21j02J13j03J13m7l5oJ32jPOo9Mj4J6K2M6N9k08M1J08p3J3Ql8
$$ -2 -5 50 93 -142 -21 -123 -10 -113 0 -47 -82 -88 44 43 50 56 -13 -9 -23 -7 15 61 120 -88 -47 61 -12 1 9 -29
1983b9R3q8J4Q5j38K4P7p6J7M3jL0j21J55m1m4L1K3o9P3p4N7K3q9m3R1q3m5M2
$$ -29 64 -24 -10 75 -63 -39 38 -38 -21 22 21 51 -70 85 44 0 31 54 -15 58 -16 41 64 -25 -68 23 -60 -105 -63
2012f3Q4j57J04L2O7j27o9r3L16Lp4Mj5k9o0l5P4Q9q3J07o2rJ6Q6r3Mq8K7l2R6
$$ -63 21 -136 -32 0 67 -60 -129 -222 94 97 23 27 12 -17 -77 -112 -38 51 -32 75 13 4 20 106 13 17 -71 -44 -76 20
2042B0j12J07J5j12Q2j15J20l6nj7J82k56K46q1K3m3N4J3j19KkO4j02N0m2J34
$$ 20 -92 15 30 -82 0 -115 5 -31 -36 -53 129 -127 119 38 61 18 72 85 -34 -32 -34 30 -72 -22 -64 70
2068G0r4q9k3J04R4l1M8q6j50K16p4k1M1m0K8m3J21j6o8j4M4L0j17J18p2J4p2
$$ 70 -24 -113 -136 -32 62 31 79 -7 -157 59 -15 -36 5 -35 -7 -50 71 55 -13 -27 17 47 -70 48 -24 -10 -82
2095h2J5Q4l1n9L1j0L2o0K1J53o0k7o2M7M6r1oJ8R9m4j2J2K7j09J03j42N0M7O1
$$ -82 -67 17 -14 -73 -42 -52 -20 -80 -59 94 34 7 -55 -8 38 -53 -59 -41 58 14 2 14 41 -68 35 -107 -57 -10 51
2124E1Kj58J84q8J26r2o8l8J30l4kk1N9Kj13j6K0J4N2%L4j7k44J45J72o4l7r4
$$ 51 53 -105 79 -9 117 25 -43 -81 49 15 13 -8 51 53 -60 -76 -56 -42 10 10 44 27 -217 -72 100 36 -1 -95
2152i5Q3mO8n6j48P0J06r3J6N9l9P2lj7o7n4J16o8K6Q9j05j5l7J62qr1P3k7PK4
$$ -95 -12 -16 52 -4 -152 -82 24 -69 -53 6 -33 39 36 19 -48 -102 14 -54 -28 61 -44 -59 -96 66 58 -33 40 13 20 44
2182D4j01M5jJ6o1O8n8n5J44jr1M3Oj05J16kn7Q1p9N9J0k3J10j59pm4J06pq7m
$$ 44 -57 -12 -13 3 -58 10 -48 -103 41 40 -51 -8 -2 -107 9 7 -50 31 -48 11 21 -2 108 -51 -58 -102 4 -3 -90 -94
2212i4O9M4j10M9Q0Oo7K4j08J07o7R9r7J5J50j21j3P8j24M0J6j5J45m0L1kj98
$$ -94 -25 19 -91 -42 38 44 -23 1 -107 0 -67 32 -65 -50 100 -21 -34 44 -80 -40 -24 -39 106 66 97 95 -103
2239a03Q7n9K25j00p1M6QP4m9Op3n9P5k1p6Q7k6M4k7O2k0r6J34l4L3p8L0p9kO5
$$ -103 -16 -75 150 50 -21 25 33 107 58 64 -9 -68 7 -14 -90 -3 -29 15 -12 50 30 -66 68 34 67 -11 19 -60 -62 3
2269CK1J8j3N1m0l8m0p0O0J5J08j78K6L3N6K3nO3k3j88J29L4r6m1o6K40M5j87
$$ 3 24 42 29 80 40 2 -38 -108 -48 -33 75 -103 -77 -44 12 35 30 93 70 -118 11 45 -51 -92 -158 82 127 -60
2297f0k8J56j87M2N5M3l4L4J3j05J41j41P7j34J62j0q3j02J25O7pn4P7j7n7m8
$$ -60 -88 68 -119 -77 -22 21 -13 21 34 -71 70 -71 6 -128 34 24 -59 -161 -36 31 24 -30 47 30 -27 -75
2323g5J40j8p2J33j6j90jN3K0j2j4J6J8N0lN3j37K2J9rM7l2j0O6L6Jj31L9K1m5
$$ -75 65 47 -25 108 92 -98 -99 -46 -26 -38 -52 -36 -18 32 29 82 -55 -33 -14 -23 24 -8 -18 48 84 85 -46 -7 14 -31
2353c1O3q5l6K4N7k2L9O2p2L0M6j20L7p8J35q6R0K3o0j29J08Q2j81J98j8j04M6
$$ -31 32 -53 -89 -65 -8 -30 9 71 -1 29 75 -45 -8 -86 49 -37 53 76 16 -113 -5 77 -104 94 76 -28 18
2380A8n6l0QO5L8j21P7j3QPO9Kk9K6o8j46J25P6r2K4K8RO8j28J40j62l4l6P0L0
$$ 18 -38 -68 -60 5 43 -78 -1 -14 -6 1 70 72 43 69 1 -145 -20 56 -36 -12 16 25 93 -35 105 -57 -91 -127 -57 -27
2410b7K3k5Q2p7N9p5L8M2P7k0j35Q2j8J6p8L5j5P2q5m7N9O1k9J14r5m8j7J9M9
$$ -27 -4 -29 53 -24 35 -40 -2 40 117 97 -38 44 26 42 -36 -1 -16 56 -29 -76 -17 44 15 129 34 -14 -31 -12 37
2439C7J7K0q1L4n2R4j9m4J1r1j27K77j37J41j04N7j4kpO3q9j7Q0j08m5R4qn7J35
$$ 37 54 74 -7 27 -25 69 50 6 17 -74 -201 76 -61 80 -24 33 19 17 10 73 -16 -33 47 -61 -106 -12 -20 -77 58
2468E8o2o4N1NM5%j9K4q0Q0q1Q1jo7J19r1K2M4m0l6K2jRrJ30j44j0J10j4r5R5
$$ 58 -4 -68 -17 -12 33 33 14 38 -42 38 -43 38 37 -30 89 -2 20 64 24 -12 10 9 18 9 139 -5 -15 95 81 -14 81
2499H1j8j08l4N4J03j92Q0k0LN3q6R9l9m5J18j05L7k9l5jJ10N7j00O4PK1M2k29
$$ 81 63 -45 -79 -25 78 -114 -34 -54 -51 2 -84 15 -24 -69 49 -56 -19 -48 -83 -84 26 83 -17 47 54 75 117 -112
2527a12k4J68m3q1J58l9o7J41n8p5nL4r8O7M5oM7o4n2J28j49O8O4q5n4J56Nq7
$$ -112 -136 32 -11 -92 66 27 -40 101 43 -32 -37 -3 -101 -34 11 5 52 -12 -64 64 -85 -17 47 -38 -92 64 69 -18
2555a8k1R7q9O7O2j95L3J43j05n4J12m1om2J00p3Q5K1j2j05oO4l0Q4n6j27J41
$$ -18 -39 58 -31 36 98 -97 -64 79 -26 -80 32 -9 -15 -57 43 -30 55 76 64 -41 -47 17 -13 71 15 -112 29
2582B9Q1p5o2P8j2N2p9j6ON7o4Q3n9r1J36j4nj07P1K0m3J15m6n3rq5K4R8j07J6
$$ 29 110 35 -27 51 39 91 12 -4 2 59 -5 78 19 -72 64 50 45 -62 9 29 -14 101 55 2 -7 -92 -68 30 -77 -61
2612f1%J39l0j1p3Q5j09L9N5l8kkrL4Qj3N6j18M6Q7j70K2K7j8Q3R3j33Pj1k1K2
$$ -61 -61 78 48 37 -36 49 -60 -21 34 -4 -6 -8 -17 17 25 12 68 -50 -4 83 -87 -65 -38 -56 27 120 -13 -6 -17 -38 -16
2643a6o9j0J21m8l1L8RR6j55O2J33p4n0j2njQ3j70K00m9n1J12k35K92q0j56p1
$$ -16 -85 -95 26 -22 -53 -15 -6 90 -65 -3 130 56 6 -6 -11 -12 71 -99 101 52 1 113 -122 170 90 -66 -137
2670a37J38k0N0m0P3p4k3N3nK4j14R9q2K4rK28k02N8l2Or4M8PM0l2J5kk1j9MJ71
$$ -137 1 -19 31 -9 64 -10 -33 20 15 39 -75 24 -58 -34 -43 185 -17 41 9 15 -79 -31 -24 16 -16 -1 -3 -24 -43 -39 132
2701A32j36o2J22m1j26J25l3M4N4j97Q3N8M1j14J0N4l7O4o3k8P5K3n4m7J14j15
$$ 132 -4 -66 56 15 -111 14 -19 25 79 -118 -35 23 64 -50 -40 14 -23 41 -22 -50 25 48 -6 -53 61 -54
2727e4K7l4P7K9oQ2j15L3P3j55j3qN1O6J8J7j49K6O1p9J06k6o7l8M9m8J19j07
$$ -54 -27 -61 16 45 39 121 6 39 112 -43 -56 -64 -13 53 71 88 -61 -35 26 -53 53 27 -40 -78 -29 -77 42 -65
2755f5P6K6k15K34m9l9P5o5J03r3N3k8l5P9r4J31j2m1J0q3R0P0q0LP2j14J6K5
$$ -65 11 37 -178 56 7 -32 43 -22 81 -12 41 13 -22 57 -37 94 82 41 51 -32 58 128 48 51 123 9 25 50
2783E0j2k5j0O1j1qL3j9j20K17k01P4j30K3Q9m2M0k8j0K4K0j82J65p6K19j32l4
$$ 50 38 13 3 64 53 45 78 59 -61 156 -45 29 -101 -78 11 -31 9 -19 -29 -5 15 -167 -2 -78 141 9 -25
2810b5N8p3j9R3r4J5J0J02m0j6p9P0k5o6K45j25j36O1k8J52n3J4j22M1P1n1K8
$$ -25 33 -40 -59 34 -60 -45 -35 67 27 11 -68 2 -23 -89 156 31 -105 -44 -72 80 27 41 -81 -40 31 -20 8
2837HJ11j30q3M4o0J13J33j62q9J34k2oo9P2O3L1j62J42j34Q9K5r8O9Pp2J30r4
$$ 8 119 -11 -94 -50 -110 3 136 -26 -115 19 -3 -9 -78 -6 57 88 -74 68 -66 23 48 -50 19 26 -46 84 -10
2864a0m3Q2l6o0J36o3P9o2m5M0o3R0j45J88j6q2j3O8nL5Oq9l8%L5p4L1Q9p7k5
$$ -10 -53 29 -7 -67 69 6 85 23 -22 18 -45 45 -100 88 72 -10 -23 45 40 75 81 -8 -46 -46 -11 -85 -54 35 -42 -67
2894f7N0j6rK8k1J25l6j5N2m7j9p5L5j3n4J21Pn3m0L8o4N2N6m6L9N1j85J26l3
$$ -67 -17 -33 -42 -14 -35 90 54 39 91 44 25 -50 -15 -28 -82 39 46 -7 -47 -9 -73 -21 35 -11 28 79 -106 20 -13
2923a3j1J08j01N5j10J58Kj11o3J01K31k10m8L6J9K0q5K1m2l5P8R6l7k7j30P6
$$ -13 -24 84 -17 38 -72 86 88 -23 -86 15 246 36 -12 24 43 63 -22 -1 -43 -78 0 96 59 32 -98 -22
2949b2L7K1m0NO7j44J06m2o4M4N2J3q9l1QJ21mpj16Q8O9M8k31J45m7L5k8q8J15
$$ -22 15 36 -4 1 68 -76 30 -12 -76 -32 20 33 -56 -87 -79 42 38 31 -85 3 72 120 -111 34 -13 22 -6 -94 21
2978B1p2J39r1q4M4M2l8l1j6m1J08J6k2n4J20o6Q9p8o4J22j45pJ40p0J84j76J72
$$ 21 -51 88 -3 -87 -43 -1 -39 -70 -86 -127 -19 -3 -25 -79 41 -25 64 -14 -78 44 -101 -108 32 -38 146 -30 142
3005A42j22m5Q6m4l0J8k8j7J11n3r4P7m3J49m5lm0l5J9l2l3%R8j15L1oJ24o2J1
$$ 142 20 -25 61 17 -13 5 -23 -40 71 18 -76 1 -42 107 62 59 19 -16 3 -29 -62 -62 36 -79 -48 -54 70 8 19
3034A9j48J03O7k8K0o6N3M6j17L2J5N5j05R7k3K9L7o1r0J48k8k2k1J01j14J11
$$ 19 -129 -26 41 13 33 -33 20 66 -51 -19 -4 51 -54 43 20 49 86 25 -65 83 55 33 12 113 -1 110
3060A10j23P6j46J42Rj24K2K6L2J7n9M8o7M0Q4Mo6p8L8O8J8j77Q4O2Q6l4o8j6
$$ 110 -13 63 -83 59 68 -56 -34 -8 24 41 -18 30 -37 3 87 91 25 -53 -15 53 71 -106 -22 40 126 92 24 8
3088Hk2j4J32j81N1J07k0j47j16K54lk03K40q5J10j93J72r6L0oq6J26j16L0j2
$$ 8 -14 -28 104 -77 -26 81 61 -86 -202 52 49 -154 86 1 111 -82 90 -6 24 18 -68 58 -58 -28 -40
3113d0mj34J73m8O3M1no7J3P0j77J08l0L6m5Q0o9P9kQj6j1M0j67J33o6J87k16
$$ -40 -44 -178 -5 -53 10 51 46 -21 -8 62 -115 -7 -37 -1 -46 34 -35 44 42 50 34 23 63 -104 29 -37 150 -66
3141f6LM7k5nL1o0K15j19O8o0Mj12OQ5O5K5j09n9J17j36J19L5K7r0j3ORN6k1k0
$$ -66 -63 -16 -41 -46 -15 -75 140 21 89 29 33 -79 -73 12 77 102 -7 -66 51 -85 34 69 96 6 -7 -1 8 64 43 23
3171B3l8L9Q5j30M6j07J04j35J34p4Q5Kj01KK0PQ3j23K5J64j28Jq4Q3L8m5R1j40
$$ 23 -15 24 109 -21 25 -82 22 -113 21 -53 32 34 -67 -65 -45 -38 45 -78 -53 111 -17 -16 -100 -17 21 -24 67 -73
3199g3J08p9p0J97o0m1kK6n2R5l5j92K00n1Q6r5P7K6m5p9j88L28k2r5L5L3r7J26
$$ -73 35 -44 -114 83 23 -18 -20 6 -46 49 14 -178 22 -29 57 -38 39 65 20 -59 -247 81 59 -36 -1 32 -65 61
3227F1p2n8m2J63m9j8J42p7m0np5OQ5l8P5k6k5L4r1J48k7j9K5o0n0P4L5q8J45
$$ 61 -11 -69 -111 52 3 -15 127 50 10 5 -70 -64 21 -17 58 32 7 41 -50 98 71 52 77 17 -33 41 76 -12 133
3256A33j40P5K5j48l7J29r6OO0j01R3j8Q8j03j2O7pj0L5m0j15Q5J4M2j23P4R8
$$ 133 -7 68 93 -55 -92 37 -59 -53 7 -94 -1 -19 69 -34 -46 21 14 4 39 -1 -116 -31 -17 25 -98 -24 74
3283G4m9l6Q3j9l3r3J02n8kN8o2k5M3O2o0j9J4M7K2J0M2O1j97K1j2O4no1N4j82
$$ 74 25 -11 72 53 20 -73 29 -29 -31 27 -35 -60 -17 45 -15 -34 -20 27 49 59 101 162 -35 -14 -26 38 33 -28 26 -156
3313a56J05L3l9J20j55J47r3M4o1Q1k5q1PM6M9R7j34llnJ46j70J43q1M0Om2o1
$$ -156 -51 -18 -57 63 -92 55 -38 6 -55 26 1 -80 -73 -27 22 119 -15 -18 -21 -26 120 -50 93 12 52 58 16 -45
3341d5L4J1l9L5Q7k4j70R4k9O2Rj52P4M3J0QK7m6k3L8j34J34p4K4N1M9o0O2l9
$$ -45 -11 0 -39 -4 83 59 -111 -17 -46 16 25 -127 -53 -10 0 8 35 -11 -34 4 -130 4 -70 -46 5 54 -6 56 17
3370A7j0lO1j42L8J23r5J34n6K4j25N7k9N3r8M5O2j0l0k1l8J7J12j48R2j09K4
$$ 17 7 4 65 -77 -39 84 -11 123 67 91 -34 23 -6 47 -51 -6 56 46 16 -5 -43 -26 86 -62 30 -79 -55
3397e5P0J12k17P2j3M7j0q2O4ok5J1O5j94J19n4J03l5K0k9J34k4j8j14M2R7r5
$$ -55 15 127 -90 -18 -31 16 6 -76 -12 -18 -43 -32 33 -161 -42 -96 7 -28 -8 -37 97 73 55 -59 -17 80 -15
3424a5M4N7j35N7j52J40m7P1p2Q9Rn9J55j68J5J08j78P6M1M4j06J11o1N1r3L9
$$ -15 29 86 -49 8 -144 -4 -51 20 -52 37 46 -13 142 -26 -11 97 -81 -5 36 80 -26 85 24 75 -18 21
3450B1O0j90J23k9q3N8J10mr7L6K1Q0j08o0R7k1j3j2L3n1j5n2J58k2k2K2Ll1j07
$$ 21 81 -109 14 -15 -98 -40 70 66 -31 5 26 106 -2 -62 35 14 1 -11 22 -29 -44 -96 62 40 18 40 43 12 -95
3479i5J30R4j11p1N8J4o4K4J55j31J11l3l6p4K6m0K7J08j63O8j6l4Q1R9k44O7
$$ -95 35 129 18 -53 5 19 -45 -21 134 3 114 81 45 -29 -3 -43 -16 92 -71 -3 -19 -53 28 127 -117 -50
3505e0R2J29j40o8%L0k5p5J29j2L8l4R3k0o3M9j72J2J62l1r8J28q2K7O1m2r0J0
$$ -50 42 171 31 -37 -37 -7 -32 -107 22 10 48 14 107 87 24 73 -99 -87 75 44 -54 74 -8 19 80 38 -52 -42
3533d2l8M7O9j84J58M7O9q4j86Q5r5J54kN1kj30JO5J44j05N5l6J2p0N0j19N0N3
$$ -42 -80 -33 36 -148 10 57 126 42 -144 -59 -154 0 -2 49 47 -83 -82 -17 127 22 77 41 53 -17 33 -86 -36 17
3561A7Km5L4R0o8j22nJ40r5m7K55j33J08j88M5J13o0j05k3l7J79J27p9j48q0J2
$$ 17 19 -26 8 98 30 -92 -97 43 -52 -99 156 23 131 -57 -12 101 41 -64 -87 -124 55 182 103 -45 -125 -113
3587a13M2OP4M3K1r2l1J23L8j80J03j25N1rO5p5J4J81j86L8L0r4N8J2j8np0J21
$$ -113 -71 -65 9 52 73 -19 -50 73 111 -69 34 -91 -40 -49 16 -59 -45 136 -50 -12 18 -76 -18 -6 -24 -29 -99 22
3615B2m3p1J87l1j40L3KJ18p6p5J82j44QJ6L9j44R8RP8p3JQ0r4p9J00k5J5N6j08
$$ 22 -21 -92 95 64 -76 -43 -41 77 1 -74 108 -36 -28 -12 27 -117 -19 -10 68 -5 -4 76 -18 -97 3 -22 -7 49 -59
3644e9N8J1j02j1J02J44j37k9m8M0K5M2j15K0J30r7Q0N9j63l5O4NP3q2K3r0N2
$$ -59 -1 10 -92 -103 -1 143 6 -23 -71 -31 -6 36 -79 -59 71 -26 54 113 -50 -85 -21 -16 57 -25 -2 -92 -40
3671d0J30j45J30j12N0m6Q1q2J67j72J9J8j17J24k2L4o1L7j4Q7Kj15J1J9k3nm1
$$ -40 90 -55 75 -37 13 -33 48 -34 133 -39 -20 -2 -119 5 -17 17 -44 -7 -21 66 68 -47 -36 -17 -40 -45 -86
3698h6Q2q3J05j23J42j18J04o3L4L9J6Rp6J43j22M2n6J30j35P5p7N0k7P2r3J15
$$ -86 -4 -87 18 -105 37 -81 23 -40 -6 33 49 58 -18 125 3 45 -11 119 -16 59 -18 32 5 77 -16 99
3724I9m6j54N2K7m6J63j48P0k3j5P1K5p1J2J40k68J04J09r5NJ18k14J15n4Ol3
$$ 99 53 -101 -49 -22 -68 95 -53 17 -6 -21 50 75 4 16 156 -112 -8 101 6 11 129 -85 30 -24 -18 -51
3750e1R2p3J8m8L2KM4J39n6j02O0k5r5O5L4q5Q0p9P5n8m1Q8lRn1j02J78k5q9O4
$$ -51 41 -32 -14 -62 -30 -28 16 155 99 -3 57 32 -63 2 36 -49 31 -48 27 -31 -72 16 13 22 -29 -131 47 22 -67 -3
3780cJ4M5j6l7j6L0Pj7o0R2q1j47K10J2J0pj51K40j90J49k4M5n4kl6n1M7R7j56
$$ -3 11 56 40 3 -13 17 24 7 -53 39 -42 -189 21 33 43 36 -115 125 -65 84 60 105 51 49 13 -38 9 106 -50
3809e0P3N4o5J13j65K6N6jj34j7K15k8j07l3J56J6M8j46k7J01m4m5q6J83j45Q9
$$ -50 23 77 12 125 -40 -14 42 41 -93 -110 105 77 -30 -63 93 109 157 11 -16 85 41 -4 -90 93 -52 37
3835C7qq9p2R6K4J65r4Lk1p2J2O5l7k1M3j39R0P7J9j88M6J31o2M0m2j0J9L8N8
$$ 37 29 -60 -132 -36 -12 153 59 62 41 -31 -19 46 9 -12 31 -108 -18 59 78 -110 -64 67 5 45 3 -7 12 50 108
3864A08q5J4j0n0O5L0q4oL2J02M8j41j5O7r2lL5J25j74J6Q3j31N9n6N6M2N0p5
$$ 108 23 37 27 -23 42 72 -12 -18 14 116 164 23 8 75 -17 -20 15 140 -34 -18 65 -66 -7 -63 -7 35 85 10
3892A0O7j8Rk5n6N5j44J21j23M0O5o3O6J7M3p2j12J98o4j0l0J11j54J8RJ90k25
$$ 10 77 59 68 43 -13 42 -102 19 -104 -64 1 -62 4 21 64 -8 -120 78 14 4 -26 85 -69 -51 -42 148 -77
3919g7J22K9q6MJ06k08J1J20p8J4j11J43p9J36O6m5j02O9l6J1LlK6J4r5Jk8J66
$$ -77 45 74 -12 -8 98 -110 -99 21 -57 -43 -154 -11 -90 46 112 67 -35 34 -2 9 12 9 35 49 -46 -45 -73 93
3947I3q5l3O4j6M1j74J20j2j2n0J5l6J38k2o7J33j06j24J10j59K58r9J3M5n0O0
$$ 93 8 -25 39 23 64 -110 10 -2 -14 -64 -49 -85 53 31 -36 97 -9 -133 -23 -182 76 -23 -10 35 -15 45
3973D5j34K03k31J18K3nl9Rj20K86j88J1L4LO8o1o9PO9k1R7j92jJ34k20K11j13
$$ 45 -89 114 -117 1 24 19 -20 -11 -131 155 -33 -22 12 15 83 22 -47 -40 29 8 105 -87 -88 46 -174 37 -76
4000g6L0J11p9L7p7J05j64J47k4N2p3q3J66q4M4j35J62n5m0M5m6N1p5J87j61L1
$$ -76 -46 65 -14 23 -54 51 -113 34 10 62 -11 -94 72 -12 32 -103 59 4 -36 9 -37 14 -61 126 -35 -4
4026dj8R2m8L0j06J18oj80J50k7k3P1k4J0m8O8m4j08K3j8N0J17Qm9j1l1LM0L0
$$ -4 -22 70 22 52 -54 64 58 -122 28 1 -22 49 25 35 -13 55 11 -97 -74 -92 -42 75 83 34 23 -8 -5 35 65
4055F5p0L8r9J36j38K1L3J0n4q1J85j47J41r3n8J46m4J6l3K6Ml9q5K17J9q6nP
$$ 65 -5 33 -66 70 -68 -47 -14 -4 -58 -139 46 -101 40 -53 -111 35 -9 7 -26 0 4 -35 -120 97 116 30 25 32
4083C2j21J08l8J24k09J03J7m9J0L5j46O2J12J0j3m6n8L7J4Pp4O1L3o8L8j1M2
$$ 32 -89 19 -19 105 -104 -1 16 -33 -23 12 -134 -72 40 50 37 -9 -67 -30 -16 -9 -83 -22 11 -57 -19 -30 12
4110A2k6L4J00p2p6R0j41J76j14r4J58j11l0P9Q3j5r7K5j2M5km8pp9J34j4o7J48
$$ 12 -14 20 120 48 -28 62 -79 97 -17 -111 47 -64 -94 -15 68 53 -44 -19 -31 14 12 -36 -43 -122 12 -2 -69 79
4138G9j42n5J22J0Q9j43L3PN4p1k9M3Rk2O3n2l9k5N2J3m4Q4M9q1L7q0P5q1QL4
$$ 79 -63 -118 4 14 103 -40 -7 0 54 -17 -46 -3 6 -16 47 -5 -44 -69 -17 -4 -48 36 85 4 41 -39 36 -45 -37 -3
4168co5P2k6Q5o9R3q9j4KQ3j0J8q8N5p5k2P6mj4L3r7J63r3KQj10J90j97L5M6K3
$$ -3 -68 4 -22 63 -6 87 -2 -16 -14 69 59 77 -11 44 -31 -53 23 19 5 38 -59 104 11 13 21 -89 101 -96 -61 -15 8
4199Hq3P6n2N3j23J68N6l3l1j01N8QK2M5j4l3j24Q5N3K2j82J76l6Qj0M8j03jl7
$$ 8 -75 1 -51 2 -121 47 103 70 39 -62 -4 4 26 71 57 24 -100 -15 38 60 -122 54 18 26 16 64 -39 -40 -77
4228g7N1P5q0N7j65J54m3m2O5k4L4j5N0l8Qq4L7K7r2K3K7P3j3l0L8q6J7KO0J8
$$ -77 -26 49 -31 26 -139 15 -28 -70 -5 -29 5 -10 40 2 10 -74 -37 -10 -102 -79 -52 21 8 -22 16 -70 -53 -51 9 27
4258B7J7j5j37J02Q0j52J13%K8q4L3J7K0mo8j3O2j19J9MJ27j38J4J14l7k1J2K2
$$ 27 44 29 -108 -6 74 -78 35 35 63 -21 12 29 49 45 -23 -36 26 -93 -74 -70 57 -81 -67 47 10 -11 1 23
4286B3q1J8K8n9J47j76J37j8o7J22j23o1J27l8J37j25r9R4M8l7J20n5J0L9q2n7
$$ 23 -58 -40 -12 -71 76 -100 37 19 -48 74 -49 -110 17 -21 116 -9 -108 -14 34 -3 117 62 72 111 29 -28
4312b8k4N4o7J1P8k3p7M2Q1O3q9M7o7%L6p9n2P8o6J60l2j39m0K38r6o6QK7N1J3
$$ -28 -52 2 -65 -54 24 1 -76 -34 47 110 21 68 1 1 37 -42 -94 -16 -82 78 46 -93 -133 105 9 -57 -49 -22 29 42
4342D2p6O4n7k5pP7k7j18J65k1p3l1R6K7r6J16j22Q2M8j81K18l2r5n6Q9r2J00
$$ 42 -34 30 -27 -52 -59 18 -9 -127 38 17 -56 -87 9 36 -60 56 -66 16 64 -117 101 69 -26 -82 7 -85 15
4369A5Kj9J8l0q4J08r7K0Q9r7O0M5l4J73k18L3k6O4m4o4J20jp7L1j5OL2o6J16
$$ 15 17 -2 16 -14 -98 10 -87 -67 22 -75 -15 30 -4 169 -49 -16 -42 22 -22 -86 34 33 -44 -13 -28 -22 10 -56 60
4398F0q6O8m9j6Oj07K33j74J50r8M6j88O5J83L9j56J1J35j62k5l4M9M4J5K2O3
$$ 60 -26 42 -7 -23 -17 -124 109 -65 85 -13 33 -155 -90 93 132 -24 -13 122 -40 -65 -99 -50 -6 9 31 94
4424I4n8M4j07k4N0M8m1O9k9j09J90j08n5k4PM9K0o7L4j8J4o9K6N5NJ40j86p0
$$ 94 36 80 -27 -51 -1 47 6 75 46 -63 127 19 -36 -60 -53 -4 16 -51 -17 -35 -21 -90 -64 -9 -4 136 -50 -120
4452a20J19OO0J6j49P1n1qK4Jo5O1N5j8Pj15K8J37Jm0R0j60M8l1q7J23j61J92
$$ -120 -1 5 65 81 -68 3 -48 -56 -32 -31 -96 -35 20 2 9 -106 -78 59 60 20 110 -50 -2 -33 -120 3 -158 34
4480C4n5l1J0J22j11K8L2j5k9M7n3L9l4M7n6rJ15o3%K7m9L9j48J43QMK9j02M2
$$ 34 -21 -52 -42 80 -31 -3 29 14 -15 32 -21 18 -16 31 -25 -34 81 18 18 45 -4 35 -113 30 38 42 71 -31 11
4509A1k1k3k8J0j7J74q6j7J17j28o0J82k9p3k5m0RN5m1p4J76j5n0m5K7j40J75
$$ 11 -10 -33 -61 -51 -68 106 20 3 120 -8 -68 114 85 12 -13 -53 -44 11 -30 -104 72 57 7 -38 -11 -151 24
4536B4Kn0O8k6j18J57%l3k7l7R1J4j11Q1r6J00m5q4N4Q8j9n4J09j43J08j74J52
$$ 24 26 -24 44 18 -100 57 57 24 -3 -40 51 65 -46 35 -61 39 -6 -90 -36 52 33 -21 88 -55 53 -121 31
4563C1R3r1m7mjJ7J0j21J01K4n4nn6N9R4J7j73P6N7Rm5Mj09N5J9M2K0O6j30oJ73
$$ 31 124 33 -14 -18 -19 -2 8 -113 -12 12 -42 -47 -103 -44 50 67 -106 -30 27 36 -9 -5 -114 -59 -40 2 22 88 -42 -48 125
4594A25j77k8Q6j19J64r7N4J2N5j36k4K7J42q3%j42J90N3k23Q4m0J67j7q9L1j1
$$ 125 -52 -80 6 -113 51 -46 8 20 75 -61 -85 -58 84 1 1 -141 49 102 -121 -37 -77 90 73 -16 15 4
4620DP3L1j85J8L2k5mP3K4k0L3K7m8o1p8J28K0k5jn2M9K9j09J40Jn3J0j3L3j1
$$ 4 77 108 -77 -59 -27 -52 -56 17 41 21 54 81 33 -28 -106 22 42 17 16 -36 13 42 -67 73 74 21 31 18 51 40
4650D0J2q0K7j02mN7j9J55p8r0l0L7J14L6k0j49J83p9J3n6k9J27n1n1nRJ88j40
$$ 40 52 -28 -1 -103 -107 -50 -69 86 8 -82 -112 -75 39 75 55 -94 89 10 23 -33 -62 65 14 -37 -42 -33 155 15
4678A5o3k5J15k0kj10J0R0J7q3k1J42q4QL7q4P7l0N4j13L6J3nQ9l4j34J31p5J0
$$ 15 -48 -73 42 22 20 -90 -80 10 27 -56 -77 65 -19 -11 26 -58 19 -11 43 -70 -34 -21 -26 63 29 -105 26 -49 -39
4707c9J9M5N1j42P6j36J41Q3k28K03n0k7J04k26L6LO3Q6j2j09RJ07j30J8j7J24
$$ -39 -20 25 76 -66 10 -126 15 98 -130 73 23 -4 100 -126 -90 -87 -24 62 50 -59 -50 57 -73 -55 -72 52
4733E2j09K5L9K8n1J02j83J40p2j6lL1L6M6j09nQJ10pl1r0P8j48M5kJ54o8J7K0
$$ 52 -57 -32 7 35 -16 86 -97 43 -29 -45 -48 -17 19 65 -44 -49 -41 69 62 31 -59 19 -129 -84 -86 68 0 17 37
4762C7j5M9j15R6l7N5m1K9q9K1n4L5K5Om3Q1l6K6M0j8j27K26j00O4j35k9J18n4
$$ 37 22 71 -44 52 15 70 29 58 -31 -10 -64 -29 -4 2 -41 40 4 30 70 52 -75 151 51 115 -20 -49 69 15
4790A5L7N1l2j28J19j18J29j21N0N6L9p9N9l3k6J36j61j50J30MQ3o8R5n1pq9K8
$$ 15 52 103 71 -57 62 -56 73 -48 2 58 97 18 77 44 18 154 -7 -157 -27 -23 60 -8 87 36 29 -60 -32
4817c2J18n1p2Q1k4k8N4j64O7K00n2j36oJ5J01p5J16k6j75K07o4j58N7N3K7M5
$$ -32 86 35 -37 44 20 -8 46 -118 -51 149 97 -39 -45 -30 71 -4 112 86 -89 118 54 -104 -47 6 33 78
4843G8r9J14o5mL5j76J88q0JJ4k6K2o7J34k00P3Np0J54j46K67k25L8N2j39J93
$$ 78 -21 93 28 24 59 -117 71 -9 -8 6 -20 2 -65 69 -131 -58 -53 -123 31 -115 152 -73 -35 17 -122 71
4869G1j62N5M9jQ1O6k39J0J42J4j24l2j4J13P3j30K6l8QJ08j22L6M4j1k6k7r3
$$ 71 -91 -36 13 12 93 159 -80 -70 72 86 -38 -70 -84 29 102 -28 -2 -40 -32 76 -46 -10 34 23 -3 -30 -123
4896a23J50J6m5L4q9M1K5l0N6j27K1J28q3j5q6K3M2O9N2k14K50l2l2p7j5Mn5J02
$$ -123 27 43 -2 32 -57 -16 9 -21 35 -92 -71 57 -26 -41 -127 -104 -62 7 59 -155 95 63 31 -46 -61 -57 -112 -10
4924a0m1N7N1n0N6q1MQL2j8K3j3j3Q3n4n8m6J60j6Q3j30r7O2J8k8mr7J04N5j8
$$ -10 -51 6 57 7 63 -18 -14 -6 26 8 31 18 5 88 34 -24 -70 90 74 157 27 -70 -8 10 -18 -22 -119 -15 40 22
4954B2O7o4j07O1pK8p5L8P5K4r5O4J66k36k7R6ojP5m2p0m7K00j20k6J6m9o4L1
$$ 22 89 25 -82 -21 -28 0 -75 -37 38 62 -33 31 197 -39 -66 30 24 23 98 56 -14 -61 139 19 -7 9 -40 -104 -73
4983g3k6J34L1o3j56J62oOOq2k3J00j9l7J06q6L0m3lj1J31p5J3m7M8n7Q5j41J16
$$ -73 -99 35 66 3 -153 9 3 9 15 -67 -90 10 -9 -46 60 -26 4 -39 -42 -53 78 3 16 -31 17 -40 45 -96 20
5012B0j10O8OO5o4j00J15J00m4l1K8k1m1N4o8k5Q4j30J8M4k1N9n7Q8j5j4m1J57
$$ 20 -90 -22 -16 49 -15 -115 0 100 56 25 53 32 -9 45 -23 -48 36 -94 -76 -32 -53 6 -51 37 22 8 -33 124
5040A24o7l6Q6q0l5O2r5N2pm6M2K6j3m0mk8L1j8J9j9N1R7j18L4m6M7ko8J40n6
$$ 124 57 21 107 27 -8 54 -41 11 4 -42 0 26 13 -27 -31 -59 -28 -46 -27 -46 5 102 -16 18 -28 19 17 -51 89 33
5070C3N7M1p7k6M2Nk5o8m5J53j58N2l4K6J33J8Jk25jP4Q7j0m6nM6P9j85P1q4O9
$$ 33 90 131 54 28 70 75 50 -18 -63 90 -68 -16 -50 -24 109 127 128 -97 -98 -24 63 53 7 2 48 127 -58 13 -71 -2
5100bo5O1N1NP6j70Q3p0j5l4NL7Rq0Q6J4n1J18M6l0o1Kq9J16j14J25j29P7J03
$$ -2 -67 -6 45 50 126 -44 39 -31 -46 -80 -75 -38 -29 -109 -23 -9 -60 58 104 74 13 15 -74 42 -72 53 -76 1 104
5129A04j5p0l1K3o9P8J8L1r7j67J17P0O5lo1K5j7l0P3r0N2j18K39r6M2j35LN0
$$ 104 89 19 -12 11 -58 20 38 69 -28 -195 -78 -8 57 54 -7 18 1 -29 44 -46 6 -112 127 31 73 -62 -59 -9
5157iJ3L8m9P0j67l2K60j69P0j04J06j5p6j7J13k3O7k8L7r4jj07J48p9o9J46j17
$$ -9 4 42 -7 63 -104 -136 124 -45 25 -79 27 12 -64 -81 32 9 76 48 85 -9 -10 -117 31 -48 -117 29 -88
5184h8P0Lr2J15J04k27K31k19P3N1L1p5M5M0j92J55J6k7n2j3M8k0l2P7k9j02r
$$ -88 -18 -15 -107 8 112 -115 116 -103 -30 21 52 -23 22 62 -130 25 41 14 -38 -51 -3 -23 -55 22 -7 -109 -118
5211a18J17j04J16L3j7l5J3j08J19LL1J29k31kO6j0O5Qpq9k1Q2k7m6Q2M8j00K
$$ -118 -1 -105 11 44 27 -8 5 -103 16 19 50 179 -52 -54 12 2 67 75 68 -21 -42 40 13 -33 49 97 -3 -1
5239ap8N2J23j41P3j8j08J02J11r4M6j13J32r4Q7j23nk0k7J70j02P9l0K6n0j22
$$ -1 -79 -27 96 -45 28 10 -98 4 115 21 67 -46 86 -8 79 -44 -49 -69 -96 74 -28 51 21 47 -3 -125
5265a25K8J47j21J03m6j3J63p8n1K3m6J5j1n4PJ45pk3r2R4Ql0q4N8NjL5k6O6q5
$$ -125 -97 50 -71 32 -14 -27 136 58 7 30 -16 -1 -12 -66 -59 86 79 56 -36 58 66 36 -48 10 15 14 49 23 89 4
5295Do0l7J44o9jL9n3L7m7k8Q7q3J59q5l3J08j91P3N1J1L3J8l1q8O0j8J35k21
$$ 4 -56 -93 51 -18 -19 20 -33 4 -43 -71 16 -67 92 7 -26 82 -109 -36 15 26 59 77 46 -42 18 0 135 -86
5323h6oQ5R2k24P1P7%l5L0N3p5J79j42k9M7K8k6J00j68Lj5L5R9j31K8J4o0Q0n
$$ -86 -92 -7 85 -139 -68 9 9 -26 4 57 -18 161 19 -10 37 65 39 139 -29 -26 -41 -6 93 -38 -10 4 -56 24 19
5352A9o2k0J94j00q7J67j66J02n3J9j7J23j35j48J23l8K02n7q7n5P8l8q3J21n
$$ 19 -43 -63 131 31 -56 111 -55 47 -6 13 -4 119 -16 -164 -41 -79 123 66 -21 -76 2 -36 -119 2 -3
5377cn2O6N7j23Q4k7O8p3qp5J09j19M9M2o5J22p3j3j24J16R5K6j53J61r5L5j56
$$ -3 -55 11 68 -55 29 2 70 -3 -11 -86 23 -96 -47 -5 -70 52 -21 -34 -158 -42 53 79 -74 87 -8 27 -129
5404a29J00L7j43P4J85p4J9j28J20Qj4K7q5O0j01J2k9K1J31n7j1j8jO1q9J70j29
$$ -129 -29 8 -135 -61 124 50 69 -59 61 69 55 82 -3 57 -44 -32 -61 -40 91 34 23 5 4 65 -24 146 17
5431A7q9N5o7k3J83k8n4J19l6L4q2p6l1J27n0j6J12Rk0q3J3J3L6k9j24P1j5M5
$$ 17 -72 -17 -84 -107 76 48 -6 113 77 111 29 -47 -78 49 -1 -17 95 104 84 1 14 27 63 34 -90 -19 -34 11
5459A1P1Kp6M2M4l6n8QPN4o0J9n6J63j02qQ8j55J03o5j40J76n0k6r3K18q8k8j11
$$ 11 82 84 8 50 94 58 0 8 15 69 9 28 -28 135 33 25 113 -42 61 -4 -144 32 -18 -44 -137 81 -7 -35 -146
5488a46k1K74j77K0P7j28J10P0q8R1k03J54j00o5J26lNO9q5r2N8Q3j5Kj3K5p2
$$ -146 -167 107 -70 -50 27 -101 9 79 -9 82 -121 33 -67 -132 -6 -9 -4 65 -20 -112 -54 29 14 16 3 28 -44
5515d4m8J59p1o3R0l3q9J15m2J17j37N2p2J81j19l6L2P6km6P0j0K2p4j11K3R9
$$ -44 -92 67 -4 -67 23 -10 -99 16 -26 91 -46 6 -66 115 -4 -40 -8 68 66 20 90 80 102 28 -83 -60 39
5542C9j46P2j1m0J92r4r%k7PJ8k3K4q6J05k3r3J3L8Q7M3p9op2O9j9J6l7jJ84j59
$$ 39 -107 -35 -46 -86 106 12 3 3 -24 -17 1 -22 2 -84 21 -2 -95 -82 -44 43 86 7 1 -71 -2 -21 -5 -42 -43 141 -18
5573a8M6l5n1J16K5oL1j14J9M2j02Q6n2P3j4o8k0n1%R3R4j08m3l0J65o4J11j28
$$ -18 28 -7 -58 58 83 77 108 -6 13 55 -47 39 -13 60 46 -22 -42 -93 -93 0 94 -14 -57 -87 78 14 125 -3
5601cp9P9L9J7Ql7p1ql6J81j22J42j82Lk5J28j8k1j26N7M0m3K8Ol2Q3j24J57J7
$$ -3 -82 -3 36 53 61 24 -47 -55 -91 90 -32 110 -72 -69 -94 34 16 -5 -131 -74 -34 -77 -49 -43 -75 8 -116 41 58
5630E8k4K0m1Qj31J18p4J00p8rJ24m0j9k2KqL4LPn4m4MJ04j81Q5J75j75M2L1q2
$$ 58 34 54 13 21 -110 8 -66 34 -44 -53 71 31 12 -10 -8 -16 18 21 28 -26 -70 -66 38 -143 -58 117 -58 -16 15 -67
5660f7m4J46p2k6N9j7q8M9L8O1M2o4j30J23n0L2p0R9O0j46N3N4j03O2K9p7Q0R7
$$ -67 -111 35 -37 -63 -4 -21 -109 -60 -22 39 81 17 -113 10 -40 -8 -78 21 81 -65 -12 42 -61 1 30 -47 33 130
5688A30j23Nm5P8l7j13J79p1J6Mm9K1l6J89j15Lk7J2J1l5j8M4L1j7Lj50J94n6
$$ 130 7 12 -33 45 8 -105 74 3 19 23 -26 -5 -41 148 33 36 9 21 32 -3 -21 23 54 37 40 -110 84 28
5716B8j11N9J11n3k5N3p0N1mp2j1L6Q0P9k07J18n7o1J2J56m6j25O6K17k02Mj22
$$ 28 -83 -24 87 34 9 62 -8 43 39 -33 -44 -8 72 151 -56 62 5 -56 -44 112 66 -59 7 224 22 26 -96
5743i6mK02j67L5K0N3n2J11j60P1q1M2N5m3J2M3l4m3j0k2J38j11N6Rj4n5k5J63
$$ -96 -100 102 -65 -30 -10 43 -9 102 -58 13 -68 -26 29 -14 -2 41 7 -36 -46 -68 70 -41 15 24 10 -45 -70 93
5771I3k8M9j59o7O9P3k3n6N4j6oO1r7J8k6J18q8O6j1O8j26P7o5k3K3O9L1o9J4
$$ 93 65 114 -45 -112 -43 30 7 -49 5 -11 -17 44 -53 -35 -61 57 -31 35 24 92 -34 43 -22 -45 -22 47 78 9 23
5800B3k2M2l6J3qL8l3j13J48M9n2o5J15j72J03M3rp2M1m5j35K25r9J4J02p3MM7
$$ 23 1 43 7 20 12 50 17 -96 52 101 49 -16 99 -73 30 73 64 -8 33 -12 -147 78 -21 -7 95 22 26 73
5828G3j2j07L4O5m9l0lQ0J4k7n5J66q1l5L3l5n2Nj03K54j00l5n6L0n4J66Mq1k3
$$ 73 61 -46 -12 53 4 -26 -29 51 65 38 -17 149 68 33 66 31 -21 -16 -119 135 35 0 -56 -26 -80 86 90 9 -14
5857a4Rm2P0j36J29Jl9N3q6J6P1O5o4O0q2l8J6l0K8o1kJ74j26J20j32O0K2j01
$$ -14 -5 -47 23 -113 16 17 -22 31 -55 -39 32 97 33 93 11 -27 -11 -41 -13 -74 -76 98 -28 92 -40 20 42 -59
5885e9J08p1n2J03j01J56j54J55k5l8nJ8j9k2L7n5o4J27j51J09P3L2j73N8J07
$$ -59 49 -22 -74 29 -72 84 -70 85 60 22 17 35 16 -6 31 -24 -88 39 -112 -3 70 102 -71 -13 94
5910I4j39k0O6M2j26J7L1n5J13K6Rj02K6QmP7p4P1n8m8J13j16L0N6j09M2l3J4
$$ 94 -45 -65 1 43 -83 -66 -35 -90 23 49 58 -44 -18 -10 -14 63 -11 60 2 -46 67 -49 -19 37 -72 -30 -63 -49
5938d9P2m3J05p5l0L0N0o7N6j08pJ09p0P9j68J51j09N4o8o6K14l8M5j53L3J10
$$ -49 23 -20 85 10 -20 10 60 -7 49 -59 -66 43 -27 52 -116 35 -74 -20 -88 -154 60 22 67 -86 -53 57
5964E7m7K7q7O1KJ07j04Q3Nj39n3J32N1n5J2l4m7p4J76j18L1M5j8M7M6j46Q4n9
$$ 57 10 37 -50 11 13 120 16 99 104 -35 -88 44 95 40 52 18 -29 -103 73 -45 -14 31 13 60 106 -40 44 -15
5992a5l2J19j10R6m2r1J18R1k12P8L4l0p1N4k2l7O8N0or6Q5j25N5M1J8N6j39N8
$$ -15 -47 72 -38 58 16 -75 43 134 -78 0 34 4 -67 -13 -35 -72 -4 46 40 -56 29 -96 -41 0 18 74 -65 -7
6020gJ10j53P0m8K2j17N6J20Jn6P2q6m9Q5n4O9kn7k7J15k5j68J35k0K0L0j8Kn0
$$ -7 103 -50 20 -28 -6 -123 -67 53 54 -2 70 -16 -65 20 -34 35 33 -24 -51 64 39 -129 6 -14 6 36 18 20 -30
6049c0J51r5P9n9j24J46n6k2J25k11J1J71p9K2n7M0Pm1M5M0j5r3J03q7P1q2J22
$$ -30 121 26 105 46 -78 68 12 -10 115 -96 -85 86 7 29 -28 12 19 -22 23 63 48 -45 58 -29 42 -40 82
6076H2m6n7k1NK1O2q2J34o1l7O6j7l0jj1m8qR5J3q6N9oR1j62N6m1N5p5P9m3J1
$$ 82 36 -21 -42 -37 -16 46 -36 98 37 0 66 49 19 18 7 -41 -49 46 59 -27 32 26 117 -45 11 -30 25 -50 29 -14 -3
6107cj07K10r3R8j73L1Q6n1r1O3J04r5m8M4M6m4K0Q5L2j83P9j1J07j14J3k6J45
$$ -3 -110 100 7 105 -68 -37 49 -2 -93 -30 74 -21 -69 -25 21 -23 -3 82 114 -69 10 -1 106 -8 5 -21 124
6134A24j43K9NL2j08P9r0M9q9N9J14p6l4jP6j4Qo0j0O3n4J00l0p7J18j08K2J1
$$ 124 -19 10 15 47 -61 18 -72 -23 -112 -53 61 -15 -49 -50 26 12 20 -40 -50 13 -41 59 29 -48 70 -38 -16 -5
6162eK5l5o2k7M3J38j89O3J01o4N5k9L7jj49k1J18rm7N7N4j31J07j36K12j05m2
$$ -5 20 -15 -77 -104 -61 77 -112 -49 52 -12 43 14 51 50 -99 -120 -2 -11 -58 -1 53 -78 29 -107 105 0 -42
6189d2r7O5Q7n3J13j78N3j4M6L9l7m5J5L2k8L0N8m3Mj9K36j75n8J4Jo9J17j35
$$ -42 -139 -74 13 -40 73 -105 -52 -66 -20 19 -18 -63 -48 -16 -44 -14 44 1 5 -14 222 47 -11 3 4 -65 52 -83
6217h3r5J89q5J51N0j11j26O2J9K5n5L1n3o8J69j11J70k3j06L0l7J33j77K18j52
$$ -83 -178 11 -74 77 127 16 -110 -48 -29 -4 -59 -28 -81 -149 20 -91 79 56 -50 -20 -57 76 -101 117 -35
6242c5k1oJ7L7k6J70j05k6R2j69R6p6L9L0Oq7Q3K6j02O4j70J87o4Q5j34J4J09
$$ -35 -56 -62 -45 -8 -34 136 31 5 97 -72 24 -52 -13 17 23 -64 19 45 -57 7 -163 24 -40 45 -89 -75 34
6269C4n0K8o2J61j27k6K11j96J98k49N3K6j1J0m2oJ28J2k8JK1k9r6O3lm3L6j9
$$ 34 -16 12 -50 111 -16 -42 169 -27 171 -78 -25 1 -10 0 -42 -48 80 92 64 65 86 57 -39 24 21 -22 14 -5
6297ej46P6J10N9j33JL4j1lN3j06J41M8k25O7N3q6J5J99j72N7MM8j57J12o5l3
$$ -5 -151 -75 35 94 -39 -38 -4 -15 -18 35 -71 70 118 -107 -40 13 -73 -58 141 -31 26 30 78 -79 33 -32 -65
6324f5J70o4Oj83K36q3l4K2m1J07n7r1J43pp0k7m9J07pj6M4k9l0l2J27o8j00J13
$$ -65 105 41 47 -136 100 17 -17 5 -36 71 14 -77 66 59 -11 -38 -87 20 13 -3 41 12 -18 -50 77 9 -91 22
6352B2J29j56M1qj17l8J06L9R6r7o7L1L9K7o7l3Q3j1Rm7P5m0M5l0j0L1pj8q8J21
$$ 22 151 -5 36 28 -89 -127 -21 18 114 17 -50 -19 20 47 -20 -53 30 19 28 -19 56 16 61 31 21 52 45 27 -61 60
6382F0j65J57Lk9j9r6Q7j9P5j60O7ll7j6J41l7k0rO0j5j8m6Q7m8o3J37q8RoN8
$$ 60 -105 52 55 26 7 -89 -2 -21 54 -106 -39 -42 -79 -95 46 9 -11 -20 40 25 7 -39 48 0 -63 74 -14 -5 -11 47
6412D7M5j65Q2j21K49r2N1j7o4o2L3N1k0K3j39K4l1J31j12R5r4O0p4M5J0M2k1
$$ 47 92 -73 9 -112 137 45 96 79 15 -47 -14 37 17 40 -99 -75 -106 25 -87 8 -86 -26 -100 -55 -45 -3 -24
6439b4N0j09L4L5pJN9q8M5p8K03q1j16J38j13N0m1Pr6J51N1j46J28j33O6KK2j09
$$ -24 26 -83 -49 -14 -21 -20 39 -49 -4 -82 121 40 -76 62 -51 -1 -42 -35 -131 20 71 -75 53 -80 -14 -12 10 -99
6467i9L5M5R8n7n0K5J6m0QJ77j35K6n8m4o1MJ46n9j8R7J7j05J35j09M8k4nk9R0
$$ -99 -64 -19 79 22 -28 -3 13 -27 -19 158 23 49 -9 -53 -114 -110 36 -23 -41 56 73 -32 103 -6 42 18 13 -16 74
6496G4j46M4oN1k2j5L6K3N6n6k1Mm5OP0j56K03j37M3J10j95J13j00P5O6j44Q7
$$ 74 -72 -28 -34 17 -5 -20 16 39 95 39 18 22 -23 -17 53 -103 100 -37 6 116 -79 34 -66 9 75 -69 18
6523A8jj0K7k3N7j31Q0L0j16N4N6m3P3Rn2Q3j59l6L9L4K9k6J2n8Q4l5R1l9p5Q8
$$ 18 17 7 34 11 68 -63 17 47 -69 -15 41 -2 71 80 28 111 -48 -84 -45 -11 18 -8 4 -54 30 -5 86 47 -28 60
6553F0l0l4O5l0j08oJ47j4j36P2KR6j03K5n3K8J58k24R7M8n1pj6J8qO7M5n3jj8
$$ 60 30 -4 61 31 -77 -83 64 50 -86 -14 -12 84 -19 6 -47 -19 139 -85 12 60 9 2 -14 4 -4 63 108 55 54 36
6583C6o1l0nP5M0Q7j34m3k1J09m9m0j3K2P9m1L0m1j8p6M7N2q3k3J25n1O9N2l5
$$ 36 -25 -55 -60 15 55 142 8 -35 -56 53 4 -36 -49 -27 52 11 41 0 -18 -94 -47 5 -78 -101 24 -27 42 94 59
6612E9J0m9J6l8K2o9P2oo3O4o4k1J23R8q3n0J40q6k9m4n7J10j11K8J01q2k7K6
$$ 59 69 20 36 -2 20 -49 23 17 -46 18 -46 -67 56 154 71 21 161 75 46 2 -55 55 -56 -28 73 -9 -36 -10
6640a0n8P7p7P0o1J60p8l2L6l2J9K4Qm6l2PP3k7j2%ql1J31j06M5L1j04M6J23j49
$$ -10 -68 9 -68 2 -59 101 23 -9 27 -5 14 38 46 0 -32 -25 48 21 9 9 1 -30 101 -5 40 71 -33 13 136 -13
6670a3j0K3J04j05Q1j00j15J26l3QPj3j5o4J61j03J10kj31n4J24k2K0J37k14J49
$$ -13 -23 0 104 -1 80 -20 -135 -9 -42 -34 -27 -40 -55 -119 42 -61 49 47 -84 -138 -14 -36 -16 121 -93 56
6696E6j37R3n2M5M5j04M9Q4j00l1LP0l1l8J67o5p7j0K8l5N8Q6j04M0m5k6L0R4
$$ 56 -81 12 -40 5 50 -54 -5 79 -21 -52 -49 21 -10 -48 119 54 -23 -33 -5 -40 18 104 0 40 -5 -31 -1 93
6724I3q5l8N2q6J08l4O5q2o2N3l8R3j06J06j49J91n0q9K05j97O5p7J71l5Pl8n0
$$ 93 8 -30 22 -64 44 10 75 -7 -69 -16 -54 39 -67 39 -110 81 31 -58 147 -50 15 -62 109 74 81 43 -7
6751gJ1J7r8K9J16j45oL6M0l3M1l8J9JM1K1j15Km3M7k1J4J91p2r8O7Pmk1L6m2
$$ -7 4 21 -77 -48 68 -77 -83 -47 -7 -40 1 -37 -18 -17 24 45 -70 -68 -111 -64 -85 -71 120 48 -50 17 24 20 -1 35 -7
6782gJ04j22m4J3J13k1j70J86n2j1J04j54R2j08N7L7R2j11n4K9J35l0p5k4O0p0
$$ -7 97 -25 -69 -56 57 36 -134 52 0 -11 93 -61 31 -77 -20 17 109 -2 -56 -27 108 78 3 -21 39 -31
6808c1J0JL9m2p7J62p9o8R0o6M1P3l3N0j61J38j55J16p2J4J2R2Q5j04q2M5rn8
$$ -31 -21 -20 19 -23 -100 62 -17 -85 5 -61 -20 53 20 70 -91 47 -108 8 -64 -50 -38 54 139 35 -47 -2 -11 -69
6836f9L5mK7J11O9j48n1mL8j7L5l1J4P1m1l9l6k1J03m9J8RJ3l0j2J0L8m5J5N2
$$ -69 -34 -38 -11 100 169 21 -30 -34 4 -13 22 -9 5 76 35 -4 -40 -61 42 -7 11 20 33 3 -9 1 39 -6 9 61
6866F1P3j97M3o2j4K5KP4qJ05k3r9Oop6j9P8J5K7n5L8N0j9n5k0J25p1q4P4J3L5
$$ 61 134 -63 -20 -82 -96 -71 -69 5 -3 102 79 -20 -14 -20 -96 -115 -37 -22 5 -50 -12 38 19 -36 -56 69 -2 -86 -12 1 36
6897C6k0%J9j89J24R0o2n1P6j14N8K4O8k7P8r7j1n1R7j4o6L0L2rk0j9P2q3M0N4
$$ 36 16 16 35 -154 -30 60 -2 -53 23 -91 -33 -9 59 32 110 13 2 -49 48 34 -32 -2 30 21 1 -18 54 -29 11 65
6927F5k9q9P7K0q8K3K9o6R4j24Q6j4R1Ok7q8j0l4J13O1P0p5n2K9j2m0j0K1J6j1
$$ 65 36 -53 24 44 -44 -21 8 -58 36 -88 -2 -16 75 81 54 -34 -44 -78 35 96 166 91 39 68 56 16 6 27 43 32
6957C2m6k7O2R4j35M8L2%o4M2n5J02j5j0q0O9j42J77Oq9R3p1p1M1lKP3p4p1O2
$$ 32 -14 -41 21 115 -20 28 60 60 -4 38 -17 85 70 60 -20 49 -93 84 90 1 94 23 -48 -7 -10 -8 65 -9 -80 -18
6987a8p1Q3N7j44K02n9q3O1PmM6m2P7r3o1N6j71J78MnK5j20J05PJ2n4j4NL5l8
$$ -18 -89 -6 51 -93 109 50 -33 28 35 31 77 35 112 19 -42 14 -157 21 25 20 45 -75 30 37 49 -5 -19 -14 21 -17
7017a7j27J02P9j22J28j2m8k7O4o0O5n3prj1P7j2J19p6l8j44J61Kj6N2p7J12n1
$$ -17 -144 -42 37 -85 43 31 -17 -44 20 -40 25 -28 -35 -44 -55 22 10 129 53 15 -129 32 34 18 70 -7 105 54
7045E4j06P4K6q1k3J23q6j4pQ7o7O6N0j28j14K06P1j42K5j1%m4R1n8NJ53n8j40
$$ 54 -52 22 48 -33 -56 67 -19 -33 -40 47 -20 46 96 -32 -146 60 131 -11 14 3 3 -41 50 -8 -3 150 92 -48
7073d8K5O0Lo7K6j8m1K8J0l3Q1K4MN5r4L9k0r9P7j22O6LL8L2p8R4Lj15M5J4KJ30
$$ -48 -23 37 40 -27 -1 -19 -60 -32 -22 -55 26 50 54 109 15 54 34 -65 12 -110 -44 -41 -3 29 -49 45 48 -67 -22 -8 -6 124
7105A24k46J11R8q4n6j2j6Q0P7j10N4m7N0r1J24r6L0J3q6J15M8j47N6q0J69k49
$$ 124 -122 -11 87 3 -53 -65 -81 -1 76 -34 20 -27 23 -68 56 -40 -10 3 -83 32 80 -67 -11 -91 78 -171
7131a71J90k8O1o4l1O2P3j53k0J33l2J5j14J75q1mq3K4L2l0Q0J2J7o9k7k3R6N5
$$ -171 19 -9 52 -12 -43 19 92 -61 -81 52 20 35 -79 96 15 11 -72 -48 -16 -46 34 46 63 -6 -33 -56 40 95
7159I5L8j48qm4L1MQL5j17J59r5qJ57j0m0j34LQ2op8J89j30m7N8qK1j44J31J3
$$ 95 133 -15 -23 -67 -36 -32 -24 11 -106 53 -42 -50 107 97 57 -77 -74 8 2 -76 113 -17 -64 -6 -14 7 -137 -6 7
7188Gl2L8P6j68N1o9P6j3K3O8l1On6jj0MJ45L6lj68q3J80m2K5k8L7k9mp0l6J52
$$ 7 -25 13 89 -79 -28 -97 -21 -34 -11 57 26 32 -24 -25 -35 -31 114 150 147 -21 -104 76 34 59 31 68 39 35 -35 -71 81
7219H1j60K9N3j32R4J7l3k5M2Q0K4n4j7k2j8J09j62M5R1o4J9nq4J4P0o1O7o7J45
$$ 81 -79 -50 3 -129 -35 -18 -51 -76 -34 46 70 16 -1 -23 -41 68 -94 -49 42 -22 -3 -8 -92 -78 -8 -69 -2 -69 76
7248G6j12L4j06J42j14M5J47q6K3o8N8n6J08mL4k03N3%L7n9j1J37j77J90j40J21
$$ 76 -36 -2 -108 34 -80 -35 112 26 49 -19 39 -17 91 87 121 -82 -29 -29 8 -51 -62 75 -102 88 -52 69
7274F9j60nK13q8j08k4N3P4Q1o1K5j8j14J39j77J12M9m0P9n0m8n4L5Kn0O9j25
$$ 69 -91 -96 117 29 -79 -103 -50 24 105 44 69 51 -63 76 -101 11 60 20 99 49 1 -53 -18 -16 -66 3 -122
7301a22J55K7k12J56K1mn2J1j8J85j34J0N9Lm9q5J4M3K2r1N8J3m1J17j7o2j52
$$ -122 33 60 -152 4 25 21 -31 -20 -38 147 13 23 82 85 36 -49 -35 8 30 -61 -3 10 -31 86 69 7 -145
7328a45P3Q4L9j24P9p0J00J0r6J24pj3qj94R6N1J0j03J4Q3J63k06lP1j6l5O8r5
$$ -145 -72 12 51 -73 6 -64 36 46 -50 74 67 54 46 -148 -52 -1 9 -94 -80 3 166 -40 -43 28 12 -23 45 -50
7356e0p4R3n6P7o4J38n3n2J18j53Q9j1j3P4l3p5L1L4k6n1J9O4M4ok1l2o0%J19
$$ -50 -124 -31 -87 -10 -74 64 11 -41 77 -76 13 2 -11 63 30 -45 -14 20 -6 -57 -38 26 70 64 43 11 -49 -49 70
7385G0N8j80J3J3J9o1Q6J4o7R7J04j68L0q1J04k0j17J10O0p5r9J63r9L6N7j33
$$ 70 128 -52 -39 -26 -7 -68 18 32 -35 62 166 -2 28 -53 51 31 -86 24 84 9 -90 73 -26 10 67 -66
7411f6L0Q2KL6p1oN1j34J21n2N6j3K4l5j12J23Rm7J8K6M4o4K3j00P6J8Jm3r4K00
$$ -66 -36 46 48 84 13 7 58 -76 45 -7 49 36 60 25 -87 36 45 -2 16 42 86 22 45 -55 21 39 40 -3 -97 103
$$ [...]
8191e
##END NTUPLES=NMR FID
##END=
