##TITLE=1H_DE-80H_X3
 200.13MHz, d2o
 8 sc
 
 19ns.26.2.2025
##JCAMPDX= 6.0         $$ Bruker NMR JCAMP-DX V2.0
##DATA TYPE= NMR FID
##DATA CLASS= NTUPLES
##ORIGIN= UXNMR, Bruker Analytische Messtechnik GmbH
##OWNER= pz
$$ XWIN-NMR		Version 3.5
$$ Wed May 14 14:11:51 2025 Russian Standard Time (UT+4h)  Yarkov@DPX200
##.OBSERVE FREQUENCY= 200.1313
##.OBSERVE NUCLEUS= ^1H
##.DELAY= (6, 6)
##.ACQUISITION MODE= SIMULTANEOUS
##.ACQUISITION SCHEME= undefined
##.AVERAGES= 8
##.DIGITISER RES= 18
##SPECTROMETER/DATA SYSTEM= spect
##.PULSE SEQUENCE= zg30
##.SOLVENT NAME= D2O
##.SHIFT REFERENCE= (INTERNAL, D2O, 0, 14.3821)
##AUDIT TRAIL= $$ (NUMBER, WHEN, WHO, WHERE, WHAT)
$$ ##TITLE= Audit trail, XWIN-NMR		Version 3.5
$$ ##JCAMPDX= 5.01
$$ ##ORIGIN= Bruker BioSpin GmbH
$$ ##OWNER= Yarkov
$$ C:/Bruker/XWIN-NMR/data/yarkov2/nmr/H-C/1/audita.txt
$$ ##AUDIT TRAIL=  $$ (NUMBER, WHEN, WHO, WHERE, WHAT)
(   1,<2025-05-14 14:11:15.04 +0400>,<Yarkov>,<DPX200>,
      <created by zg, POWCHK disabled, PULCHK disabled
       configuration hash MD5:
       00 E9 B6 7A A2 85 ED C7 34 08 36 98 17 FE 4E 26
       data hash MD5: 16K
       4E E5 9B 8C 24 C5 09 CC 48 85 22 BD 33 F6 DB 8F>)
$$ ##END=
$$ 
$$ hash MD5
$$ F3 2B EF 16 4A 2E 04 60 59 B0 AE 57 E4 E1 69 8D
##$RELAX= 
##$RELAX= 
##$RELAX= 
##$RELAX= 
##$RELAX= 
##$RELAX= 
$$ Bruker specific parameters
$$ --------------------------
##$DU= <C:/Bruker/XWIN-NMR>
##$EXPNO= 1
##$NAME= <H-C>
##$PROCNO= 1
##$TYPE= <nmr>
##$USER= <yarkov2>
##$AMP= (0..31)
100 100 100 100 100 100 100 100 100 100 100 100 100 100 100 100 100 100 
100 100 100 100 100 100 100 100 100 100 100 100 100 100 
##$AQSEQ= 0
##$AQ_mod= 1
##$AUNM= <au_zg>
##$AUTOPOS= <>
##$BF1= 200.13
##$BF2= 200.13
##$BF3= 200.13
##$BF4= 200.13
##$BF5= 200.13
##$BF6= 200.13
##$BF7= 200.13
##$BF8= 200.13
##$BYTORDA= 1
##$CFDGTYP= 0
##$CFRGTYP= 5
##$CHEMSTR= <none>
##$CNST= (0..31)
1 1 145 1 1 1 1 1 1 1 1 1 1 1 1 1 1 1 1 1 1 1 1 1 1 1 1 1 1 1 1 1 
##$CPDPRG= <>
##$CPDPRG1= <>
##$CPDPRG2= <>
##$CPDPRG3= <>
##$CPDPRG4= <mlev>
##$CPDPRG5= <mlev>
##$CPDPRG6= <mlev>
##$CPDPRG7= <mlev>
##$CPDPRG8= <mlev>
##$CPDPRGB= <>
##$CPDPRGT= <>
##$D= (0..31)
0 0.7 0 0 0 0 0 0 0 0 0 0.03 0 0 0 0 0 0 0 0 0 0 0 0 0 0 0 0 0 0 0 0 
##$DATE= 1747217474
##$DBL= (0..7)
120 120 120 120 120 120 120 120 
##$DBP= (0..7)
150 150 150 150 150 150 150 150 
##$DBP07= 0
##$DBPNAM0= <>
##$DBPNAM1= <>
##$DBPNAM2= <>
##$DBPNAM3= <>
##$DBPNAM4= <>
##$DBPNAM5= <>
##$DBPNAM6= <>
##$DBPNAM7= <>
##$DBPOAL= (0..7)
0.5 0.5 0.5 0.5 0.5 0.5 0.5 0.5 
##$DBPOFFS= (0..7)
0 0 0 0 0 0 0 0 
##$DE= 6
##$DECBNUC= <off>
##$DECIM= 32
##$DECNUC= <off>
##$DECSTAT= 4
##$DIGMOD= 1
##$DIGTYP= 9
##$DL= (0..7)
0 120 120 120 120 120 120 120 
##$DP= (0..7)
150 150 150 150 150 150 150 150 
##$DP07= 0
##$DPNAME0= <>
##$DPNAME1= <>
##$DPNAME2= <>
##$DPNAME3= <>
##$DPNAME4= <>
##$DPNAME5= <>
##$DPNAME6= <>
##$DPNAME7= <>
##$DPOAL= (0..7)
0.5 0.5 0.5 0.5 0.5 0.5 0.5 0.5 
##$DPOFFS= (0..7)
0 0 0 0 0 0 0 0 
##$DQDMODE= 0
##$DR= 18
##$DS= 0
$$ [...]
##$SUBNAM2= <"">
##$SUBNAM3= <"">
##$SUBNAM4= <"">
##$SUBNAM5= <"">
##$SUBNAM6= <"">
##$SUBNAM7= <"">
##$SUBNAM8= <"">
##$SUBNAM9= <"">
##$SW= 18.0517328524113
##$SWIBOX= (0..15)
0 0 2 0 0 0 0 0 0 0 0 0 0 0 0 0 
##$SW_h= 3612.71676300578
##$TD= 16384
##$TD0= 1
##$TE= 0
##$TE2= 300
##$TE3= 300
##$TEG= 300
##$TL= (0..7)
0 120 120 120 120 120 120 120 
##$TP= (0..7)
150 150 150 150 150 150 150 150 
##$TP07= 0
##$TPNAME0= <>
##$TPNAME1= <>
##$TPNAME2= <>
##$TPNAME3= <>
##$TPNAME4= <>
##$TPNAME5= <>
##$TPNAME6= <>
##$TPNAME7= <>
##$TPOAL= (0..7)
0.5 0.5 0.5 0.5 0.5 0.5 0.5 0.5 
##$TPOFFS= (0..7)
0 0 0 0 0 0 0 0 
##$TUNHIN= 0
##$TUNHOUT= 0
##$TUNXOUT= 0
##$USERA1= <user>
##$USERA2= <user>
##$USERA3= <user>
##$USERA4= <user>
##$USERA5= <user>
##$V9= 5
##$VALIST= <valist>
##$VCLIST= <CCCCCCCCCCCCCCC>
##$VD= 0
##$VDLIST= <DDDDDDDDDDDDDDD>
##$VPLIST= <PPPPPPPPPPPPPPP>
##$VTLIST= <TTTTTTTTTTTTTTT>
##$WBST= 1024
##$WBSW= 4
##$XGAIN= (0..3)
0 0 0 0 
##$XL= 0
##$YL= 0
##$YMAX_a= 54293
##$YMIN_a= -46297
##$ZGOPTNS= <>
##$ZL1= 120
##$ZL2= 120
##$ZL3= 120
##$ZL4= 120
##$ABSF1= 10
##$ABSF2= 0
##$ABSG= 5
##$ABSL= 3
##$ALPHA= 0
##$AQORDER= 0
##$ASSFAC= 0
##$ASSFACI= 0
##$ASSFACX= 0
##$ASSWID= 0
##$AUNMP= <proc_1d>
##$AZFE= 0.1
##$AZFW= 0.1
##$BCFW= 1
##$BC_mod= 2
##$BYTORDP= 1
##$COROFFS= 0
##$CY= 83.5205535888672
##$DATMOD= 1
##$DC= 2
##$DFILT= <>
##$DTYPP= 0
##$F1P= 10.8118882576601
##$F2P= -7.23987719738617
##$FCOR= 0.5
##$FTSIZE= 0
##$FT_mod= 4
##$GAMMA= 1
##$GB= 0.15
##$INTBC= 1
##$INTSCL= 1
##$ISEN= 128
##$LB= 0.25
##$LEV0= 0
##$LPBIN= 0
##$MAXI= 10000
##$MC2= 0
##$MEAN= 0
##$ME_mod= 0
##$MI= 1.114404
##$NCOEF= 0
##$NC_proc= 0
##$NLEV= 6
##$NOISF1= 3.799351
##$NOISF2= 2.8
##$NSP= 1
##$NTH_PI= 0
##$NZP= 0
##$OFFSET= 14.38212
##$PC= 1
##$PHC0= -1346.127
##$PHC1= 2.533749
##$PH_mod= 1
##$PKNL= yes
##$PPARMOD= 0
##$PSCAL= 0
##$PSIGN= 0
##$REVERSE= no
##$SF= 200.129724274929
##$SI= 16384
##$SIGF1= 3
##$SIGF2= 2
##$SINO= 400
##$SIOLD= 16384
##$SREGLST= <1H.CDCl3>
##$SSB= 0
##$STSI= 0
##$STSR= 0
##$SW_p= 3205.1282051282
##$SYMM= 0
##$S_DEV= 0
##$TDeff= 0
##$TDoff= 0
##$TI= <>
##$TILT= no
##$TM1= 0
##$TM2= 0
##$TOPLEV= 0
##$USERP1= <user>
##$USERP2= <user>
##$USERP3= <user>
##$USERP4= <user>
##$USERP5= <user>
##$WDW= 1
##$XDIM= 8192
##$YMAX_p= 0
##$YMIN_p= 0
$$ End of Bruker specific parameters
$$ ---------------------------------
##NTUPLES= NMR FID
##VAR_NAME=  TIME,          FID/REAL,        FID/IMAG
##SYMBOL=    X,             R,               I
##VAR_TYPE=  INDEPENDENT,   DEPENDENT,       DEPENDENT
##VAR_FORM=  AFFN,          ASDF,            ASDF
##VAR_DIM=   8192,          8192,            8192
##UNITS=     SECONDS,       ARBITRARY UNITS, ARBITRARY UNITS
##FACTOR=    0.0002768,     1,               1
##FIRST=     0,             0,               0
##LAST=      2.2672688,     0,               0
##MIN=       0,             -46297,          0
##MAX=       2.2672688,     54293,           0
$$ Real data points
##PAGE= N=1
##DATA TABLE= (X++(R..R)), XYDATA
$$ [...]
812C32j25j16l56q2RK5K44L12J11j43Lk36r9j78p1J40P2J90K28J56j29k73j41
835a27j48rK0P8L37Q3Q1J47l39j22k53p7jJ10K49K74p7N4j94j77j69m4L1P4J29
860g0L87o1P0j15j36k15k12Q2J08J63J92Q5J8j95j52mk62J51l5J95J19K82j68
883B27Q8k53j05l11n5K47K13R0J37N5j80q9k23j52J02%J66J39K73rj19k83j07
906a49j45o9J06J72K54M0R3j34j03q2k62jL5N9K70J16J33j02k83oj31k17J71J71
930f4J46J43R6j32q7j16j41j82J55Q7K50J12M3k8k52n0j27j38m1J92J27J62K3
953A78O8k15p4k58k3M7Q3K02L07ml6j14k65o8r4J42J66jJ12J77n6k69j1j10j24
978b40p8K17J66K5J13n7l8j23k2j61o3K15R1Q4J43r4j08q8j29m6k1mJ86J30J35
$$ plain form
812 332 207 91 -265 -347 -338 -313 -69 243 354 211 214 -22 -121 -299 -370 -230 -158 32 260 416 287 14 -127
835 -127 -275 -284 -264 -186 151 234 315 462 123 1 -252 -329 -330 -220 29 303 226 280 86 -91 -260 -304 -273 -199 -70
860 -70 317 256 326 211 75 -140 -352 -270 -162 1 193 278 296 101 -51 -55 -317 -166 -201 -6 113 395 227
883 227 315 62 -43 -354 -409 -162 51 141 278 333 153 64 -159 -311 -209 -209 -43 96 369 360 241 -42 -149
906 -149 -294 -363 -257 -85 169 209 302 168 65 -17 -279 -280 -245 -186 84 200 333 231 -52 -58 -189 -406 -235 -64
930 -64 82 225 321 189 102 -14 -155 -337 -182 -95 155 267 310 282 30 -20 -147 -285 -326 -134 -7 155 178
953 178 246 31 -43 -301 -324 -277 -194 8 315 311 275 161 -104 -172 -266 -124 42 41 153 330 274 5 -6 -116 -240
978 -240 -318 -101 65 90 203 146 108 -15 -37 -198 -261 -46 45 129 272 178 70 -18 -147 -193 -214 -218 -32 98 233
1003B33k9p9j13p2j84N0n2J38K01K09n9j97K6k18l1p8N3J95o3L54p4p3K7k85l4
1028a55o1J73p6K37J12r1j9j27Nj24j69J13J52M0J52J02k46Ro0k10P5O9K3J10
1052C4J37J74k44j35L0k12j2L8P6K5L50L2j39J3k34n4nl4P6J98p0J64j19rj56
1077g6J9j24L2Q9N1R8L4R2j13q7n6j51Q5J7K9J46N6M7m4o8j83K3r0l6J68J08K8
1104I4L6o7m8r6j27J62k7J31j2J33j16j3M9j87o5M2Q0j2J80lp9Kno3k12J87n5
1131i1M3Q9J29m4l5j33m5n0l8J22n0J58M9L2p6m8j09l1m9kR6Q1J18j13J92l61
1157a66N9p1P0O5q7J21J76j0j40m1%j49m5J65K5L0Q9N2j71Q0j38j5j11J82q1K39
1183A28p7K9j7j30%j6l7ML2Q3P1L1L2m9J1r1j93J04R3L9p4J77n7j21P9l6j70J28
$$ plain form
1003 233 204 125 12 -60 -244 -194 -246 -108 93 302 243 46 72 -146 -177 -255 -202 -7 -70 284 210 137 164 -121 -155
1028 -155 -216 -43 -119 118 230 139 120 -7 -2 -126 -295 -182 -30 10 162 264 18 27 -33 -243 -168 -99 -76 34
1052 34 171 345 101 -34 -4 -216 -228 -190 -114 -89 261 293 154 167 -67 -121 -126 -160 -84 114 44 208 89 80 -76
1077 -76 -57 -181 -149 -60 -9 89 123 215 102 15 -41 -192 -107 -90 -61 85 141 188 144 76 -107 -84 -174 -210 -42 66 94
1104 94 130 63 15 -81 -208 -46 -73 58 46 179 63 50 99 -88 -153 -111 -31 -43 137 134 55 57 52 -11 -223 -36 -91
1131 -91 -48 41 170 126 91 -42 -87 -137 -175 -53 -103 55 104 136 60 12 -97 -128 -177 -179 -83 -2 116 3 195 -166
1157 -166 -107 -178 -108 -43 -130 -9 167 157 17 -24 -24 -173 -218 -53 -28 2 91 143 -28 52 -86 -101 -212 -30 -111 128
1183 128 51 80 63 -67 -67 -83 -120 -116 -84 -1 70 101 133 84 95 4 -189 -85 8 47 -27 150 93 -28 51 15 -155 -27
1211b7kL0P1n3K4O9j58N2k71J46N2j7J82o7K6Oj91J01j37J69%l0m0K31o4n5rj86
1239a48J8jJ34m1P2K1jn8n5m4M7P5j93K34L0P9j17L1k09J05k3j15J47P0M1j29
1265c0J03L6k9k03R2l3l8J17K9N4K3Nl8j85L6KJ6P0Q2P0o0p5n8p7Jj7OJ31J9n3
1295dj8M4l5j67K2J39l6l6J11M5O1j8j20L4m3L1J2k7k6J47j1p8r9J12r1j43K14
1322B0p6N1%J23j15j07R9j23L3J6P6R8r1Q0o8M0k01Q1j27M4P9J99j26l1J15p6
1348A3K5j13n7J70p5J06L6l7m8J5l5N7j65P3M2L7N5p1j25J09L1n1n7j44L17p7
1374C1rl9O6r7L1m0K7j51J50J18k5q6k1P6n9r3N9j0k6J79p0M0N9l2n1n6J5j5k5
1403e4O2r3J70N4k76J67o6m1P2N7l8K4k2J71j15m4j35J34n3pJ82j76R8r9N1n9
$$ plain form
1211 -27 -29 1 72 19 43 112 -46 6 -265 -119 -67 -84 98 31 57 63 -128 -27 -164 5 5 -25 -65 166 102 47 38 -148
1239 -148 -130 -131 3 -38 34 55 54 -4 -59 -103 -56 19 -174 60 90 169 52 83 -126 -21 -44 -159 -12 58 99 -30
1265 -30 73 109 80 -123 -31 -64 -102 15 44 98 121 126 88 -97 -61 -59 -43 27 109 179 119 44 -14 -91 -90 -107 -101 30 49 -4
1295 -4 -22 22 -13 -180 -158 -19 -55 -91 20 65 126 108 -12 22 -21 10 22 -5 -31 116 105 27 -72 40 -51 -194 20
1322 20 -56 -5 -5 118 3 -104 -5 -128 -95 -79 -3 95 4 84 16 56 -145 -64 -191 -147 -68 131 5 -26 89 13
1348 13 38 -75 -132 38 -37 69 105 68 20 35 0 57 -108 -35 7 44 99 28 -97 12 43 -8 -65 -209 108 31
1374 31 22 -17 49 -48 -17 -57 -30 -181 -31 87 62 -24 -45 31 -28 -121 -62 -72 -98 81 11 51 110 78 27 -29 -14 -29 -54
1403 -54 8 -85 85 139 -137 30 -36 -77 -5 52 14 38 16 187 72 28 -107 27 -26 -33 149 -27 71 -28 23 -36
1429c6kP1k2Nl4k3J43p6K9j46J08q4Q4R7j05p1J34k4J0q1Kk1Q2K9p3p3J26j01
1457e2J42j20Q7J7j93J35%m4R3M1q9M2j18rQR3j4n2Q6l0K2L1j10r3QO0L9J1K5
1486A6P9j69J01k3o5j6J07j64J65K6o3M4lo1LK6l7L9%N2m3l0n8J16n5m7J2j2n7
1515a17J9J40N7l2l9l1r6k6J17R9m8n1J3M4j6N9j08n0R1R8m6m0m9j4M6q5O7qJ0
1544Dk3L3O4O2j01L9q8N1k9rK9m4O6p5K3L9n9pj5K2L2m2k1J41m8J6N6k15O4O6
1574C1j7j1k6j4N4M3j12K9N5j09J84k53J34L3nm2N8rk7m3O8l0L4rj17N8J9N1r
1603A8j01J32ok7JJ3N5k34J48m0K1K3%K7n4Q7j65J50j8N0qn7j7J4rm6M6R3l4p1
1633iMQ0q2k6N2M8j00P8o9J31l9j52J5R8k3m2N2j20j0R7J16o4R6j81k6J65p4J2
$$ plain form
1429 -36 -38 33 11 16 -18 -41 102 26 55 -91 17 -67 17 114 9 -62 72 48 58 -23 -21 -42 40 69 -4 -77 49 -52
1457 -52 90 -30 57 74 -119 16 16 -28 65 106 17 59 -59 -68 -60 33 19 -33 53 23 45 76 -34 -127 -119 -59 -20 -9 16
1486 16 95 -74 27 4 -61 -77 30 -134 31 57 -6 38 35 -26 -23 3 -34 5 5 57 14 -16 -74 42 -13 -60 -48 -60 -117
1515 -117 -98 42 99 67 28 -3 -99 -125 -8 91 43 -8 5 49 33 92 -16 -66 25 123 77 37 -12 -26 20 -65 2 -6 4
1544 4 -19 14 78 140 39 78 -10 41 12 3 32 -12 54 -21 2 41 -18 -25 -40 -18 14 -28 -49 92 44 60 116 -99 -35 31
1574 31 14 3 -23 -37 17 60 -52 -23 32 -77 107 -146 -12 21 16 -26 32 23 -4 -47 21 -9 25 16 -101 -43 -24 27 18
1603 18 -83 49 43 16 17 30 85 -149 -1 -41 -20 3 3 30 -24 63 -102 48 30 80 72 15 -2 12 3 -43 3 96 62 -9
1633 -9 -5 75 -7 -33 19 67 -33 45 -24 107 68 -84 -69 29 6 -36 16 -104 -114 -17 99 35 131 -50 -76 89 15 27
1661B7m4P9n8r7J47P8r5J2L6q8k6o3M7Q1Jm3JJ5r3k7R0P7p5k3P6o6R8qr6M7j09
1692i9J6Q5m2J5L5k3R2j69J80L0j42L6Kj19O7J16j16J28k15O6KJ7K8J1n9M3L3
1719A8j1l1O7l7J14j40p2K1nJ90j56O2p7L4J01k7Jr4l1J57p3rM5o1k5j6L7k6P2
1748B8K7kl6Q2j42J8M0ko8Q3K7q3om3J47q7j7N9k9R2m3j47K63o2j04M5j71Q8J23
1777H0r0k7J52l7j14l0P0L4n6pM7k9MK8L3j44N9n3J8K2p4J51k2l6j26J03P3j24
1805i5P9R8j58N0J16j21L1J5Om5q7J45j33J55oj05J68j29K4k2P3k9o2J38k08Q6
1831a6L6l5K5J0n0J4K5r4J07R2j68M8nq2R2l1J5jO9k1J8l8l0K1q2O4N9q3j4NR8
1862D8qr5j0J2KN6K2M8j8J8j24jR7m1%K8r7J65j77l5J09K5Lo9%P1O5j14j2R5p8
$$ plain form
1661 27 -17 62 4 -93 54 132 37 49 85 -3 -29 -92 -45 36 37 -6 -5 10 -83 -110 -20 57 -18 -41 35 -31 67 59 -37 10 -99
1692 -99 -83 2 -40 -25 10 -13 79 -90 90 120 -22 14 16 -103 -36 80 -36 92 -123 -57 -55 -38 -10 1 -58 -15 18
1719 18 7 -24 43 6 120 -20 -92 -71 -76 114 -42 20 -57 -23 78 51 52 -42 -73 84 11 2 47 -14 -39 -55 -18 -44 28
1748 28 55 53 17 99 -43 -25 15 13 -55 28 55 -28 -34 -77 70 -17 -34 25 -4 88 45 -102 161 99 -5 40 -131 -43 80
1777 80 -10 -37 115 78 -36 -66 4 38 -18 -25 22 -7 -3 25 58 -86 -27 -80 -62 -40 -114 37 15 -21 -147 -44 29 -95
1805 -95 -16 82 -76 -26 90 -31 0 15 21 -24 -111 34 -99 56 50 -55 113 -16 8 -14 59 30 -32 106 -102 -16
1831 -16 20 -15 10 20 -30 -16 9 -85 22 114 -54 -6 -11 -93 -1 -32 -17 -18 51 30 48 10 -20 1 -81 -17 42 -41 -55 -50 48
1862 48 40 -55 -65 -53 -51 5 27 75 57 75 -49 -50 47 6 6 34 -63 102 -75 -110 -1 24 27 -42 -42 29 94 -20 -32 63 -15
1893a5J8n5m4O1o4J28qRm7J29q6j5K0Q5j16QN3m7m1O3o4m2O9M5o5K6L0M4j3q3
1923a7L6Jj9L5O3j01J3J2j37J02J9qO2k45J09J8J42j6o1m9R2%o7J21p6p7mN4j8
1952a6o8N8J32j07N9m6N2j67P3J18j27J2N9j24M1J58j39n6J88j19j5kNK4r0K0
1978g7O8j3L3l0n4J30q5N5j2K2m2p1Q0J09r3j16J42j30K20j35p2Q3o2RJ57j46
2004c0J05k9q4%M6p0M6J8j8j8r1O1k9PJ6O4k8K8l5N8j42M6K47j95M8q1Q8M0J3
2033H1K1j33J15l2o1JlK9L4ml2o5Q7k3L9k2o2n8J35n2j7LL2j13J29o3m4J41j90
2062a27J72p4J36o0K1Lj89OJ03J1J6lj2mk9J04o6J09k26R3l4O1p3P5P3j44Mp0
2090a24J16R8j1o0k1o6O0r4N5jJ45j37o8K21j28lQ7q4n8R6Kl9P5p9j5J04o5J8
$$ plain form
1893 -15 3 -52 -96 -35 -99 29 21 30 -17 112 26 11 31 116 0 8 61 14 -27 36 -28 -70 -1 44 -21 5 35 79 66 -17
1923 -17 19 20 1 36 99 -2 11 23 -114 -12 7 -1 61 -184 -75 -57 85 69 8 -41 51 51 -16 105 29 -48 -52 2 -16
1952 -16 -84 -26 106 -1 58 12 64 -103 -30 88 -39 -27 32 -92 -51 107 -32 -88 100 -19 -34 -36 -31 -7 -97 -77
1978 -77 -9 -22 11 -19 -73 57 -28 27 15 37 -5 -76 4 113 20 -96 46 -84 136 1 -71 12 -50 -41 116 -30
2004 -30 75 46 -38 -38 8 -62 -16 2 -16 -34 -125 -64 -93 -86 -70 -6 -34 -6 -41 17 -125 -79 168 -27 21 -60 28 68 81
2033 81 102 -31 84 52 -9 -8 -11 18 52 48 16 -49 38 15 54 32 -30 -88 47 -5 -22 -19 13 -100 29 -34 -78 63 -127
2062 -127 45 -29 107 47 68 71 -118 -112 -9 2 18 15 3 -1 -30 74 8 117 -109 -16 -50 11 -62 13 86 -58 -54 -124
2090 -124 -8 90 79 19 -2 -68 -8 -102 -47 -48 97 -40 -108 113 -15 -18 69 -15 -73 23 25 -14 61 -18 -33 71 6 24
2118B4o5J4l6Oj9L8R3j29J53%r3L4q1K00j01L1j40N0p7R9m1k1N1l7L7Q4l1O9k22
2147a10J23O0j00J00m6n0n3J08p8J13r4j14J08K8l9N3O7j28P9Rj3kOk4J1P1l2
2174E3p9M4Mr4O2j4P5r5J11m4m4m4J7J37j4k9j9L0m8qJ7ql6l8Q3j57K58o6K0j21
2204d7n3K28j05k3rN3j1k9P4n4r5L5P9n2j8K7oN1Mkr2nN6j4r6K20j63J21j4j71
2234a11J40J6q2Oq7J24j6M8n8Q5j38P6j6k9J01j09O3n8J03k3k9Q1p8L1K5j6q8
2261c9K28k00J06j55O6k0N2K3o0L3j09J40p2J71k22l0J52j12N2K0j2p8Q5M8L7
2286A04k3j50P8q1N4P5R6j28P8p5ML8J9O8j07j73O0j3P3P9p6NL9j37N7N7O7j41
2314e3J0P6Lj25N8M2M7m8M5J2p8J3n1J23k6K6q8P3k2K7Qrj0m0Q2j39n2J62p4O0
$$ plain form
2118 24 -41 -27 -63 -57 -76 -38 55 -74 79 79 -14 20 -61 139 38 69 -71 -21 -98 1 -40 -61 -10 -47 -10 74 43 112 -110
2147 -110 13 73 -27 73 27 -23 -76 32 -46 67 -27 -141 -33 -5 -44 9 76 -52 27 36 23 21 27 3 14 85 53
2174 53 -26 18 22 -72 -10 -24 51 -44 67 23 -21 -65 -48 89 75 46 27 57 9 1 18 10 -26 -64 19 -138 120 54 74 -47
2204 -47 -100 128 23 0 -9 44 33 4 78 24 -71 -36 43 -9 -27 0 -6 45 49 47 -45 -50 6 -8 -104 116 -47 74 60 -111
2234 -111 29 45 -37 -31 -118 6 -10 38 -20 65 -73 3 -13 -42 59 -50 13 -45 58 35 6 87 9 40 65 49 -39
2261 -39 189 -11 95 -60 6 -14 38 61 1 34 -75 65 -7 164 -58 -88 64 -48 4 24 12 -66 19 67 104
2286 104 81 -69 9 -72 -18 57 153 25 103 28 32 70 89 157 50 -123 -63 -76 -3 76 0 5 44 -93 -36 21 88 -53
2314 -53 -43 33 36 -89 -31 11 58 10 55 67 -11 2 -49 74 48 74 -14 59 37 64 72 63 53 13 95 -44 -96 66 -8 52
2344E2j14N1pQ4q4O4M4j08m5M8J10j62L6J9j6J00j02L5pnj3lL5J2Rr2J67o8J0
2373E0r5p8J63o5O7k6N8j33J20j35J28%n8r7O9J6Mj17J59j53J36k8N2j0j4J7N3
2400H3p1p3M5Oon6J3J03m6Q2M3k18J41R9j47L8j8N4J8o2j44m5L4J12j14j4J74
2427C1p4N1l4L0k0L2n2k0L2J2O8m2m3L9L4n8J0oK6j7j9j46R9J03r3Jj7QoJ46j22
2458d7j8P6n9L7K2M9kK9m8J8j40J88j78R9k8J1K1j02J69j27Lp7k5J29L3km3L5
2486B3l1J3KO2r2Q2q8Olk2qM3j2Q3M6j61J03l2K9m8j2R5o8Qj6Kj25J07L2o3J09
2517F4J4r7K1n5N1m0K0R7j73J42J5k04J78m3nR1j60K7qJ04l7n3M3N8J9k6K9j63
2545i1J93kp1K4O5r5K8l8Q7r7o1l2M3J32q0m7L5J10j64P6j07J23J5m3pM1r8M0
$$ plain form
2344 52 -62 -11 -18 66 -18 46 90 -18 -63 -15 95 -67 -31 -12 -28 72 -30 5 -2 -7 -20 -23 12 24 33 -59 108 40 50
2373 50 -45 -123 40 -25 42 16 74 -59 61 -74 54 54 -4 -101 -32 -16 -12 -129 30 -123 13 -15 37 27 13 30 83
2400 83 12 -61 -16 -10 -16 -72 -59 44 -2 80 123 -95 46 145 -2 36 18 72 90 28 -116 -161 -127 -15 -129 -143 31
2427 31 -43 8 -26 4 -16 16 -36 -56 -24 -12 56 14 -29 10 44 -14 -4 -10 16 -1 -20 -166 -67 36 -57 -56 -73 -65 -71 75 -47
2458 -47 -65 11 -48 -11 11 60 58 87 39 57 -83 105 -73 26 -2 9 30 -72 97 -30 -27 -104 -129 0 33 31 -12 23
2486 23 -8 5 7 69 -23 59 -29 -23 -26 -48 -56 -13 -25 58 104 -57 46 14 43 -5 -17 78 10 18 2 4 -121 -14 18 -45 64
2517 64 78 -19 2 -53 -2 -42 -22 75 -98 44 59 -145 33 -10 -15 76 -84 -57 -65 39 2 -51 -8 50 69 43 72 -91
2545 -91 102 100 29 53 118 23 51 13 100 3 -58 -90 -47 85 5 -42 -7 103 -61 15 -92 31 46 3 -4 37 -61 -21
2573b1P6M3n7j2j37J19L1q5O6N7L4k21O6J19j14Q6l4j13P6n6p0J83p8J6qQ2M5
2600I3k0j1o3j2P1o4j6J12m0k5j18N2O8jN4r1P4o6nk3j04K53r6o5K2n1O8M2j1
2629B7o3J8j5R1p1J17Pj16O2p2j4Mm3P3L3n6j9P9j06k2J51q4R3j33L5n8M9R2L3
2658I2q5P6n5j42L4P0L9j70R1K3j8J29j66J14L1j73M7N1L7j11P5p9R4q0LR2k3
2685dJ05q4r1qjjj7N8j7J05L0r1M0o4P2p3J19j2n9R2k20R6N7n6K0j27O6L6K7j
2715co7J07j34J78p6j49J65q1J09Ln9p0J77q8k5r0J16Jk6Lp2J19K9j44J52rl8
2742B8J1M3k9q0Rk9k5K5jmKJ74o0q5JR9q6q5J02QQP0k9p5pJ8J3p9J26o3r5J20
2774B5n0j11J20P6L1m3j07P3qk3j5K1L1p1J18Jj14o1J80k0j12K43q4j40P5o2l0
$$ plain form
2573 -21 55 98 41 29 -108 11 42 -43 23 80 114 -107 -41 78 -36 50 16 -97 -21 -77 -147 36 -42 -26 -34 48 93
2600 93 73 62 -1 -13 58 -6 -22 90 50 25 -93 -41 27 26 80 -11 63 -3 -8 -31 -135 118 22 -43 -21 -72 -4 38 27
2629 27 -36 -18 -33 58 -13 104 111 -5 57 -15 -29 -25 -68 5 38 -18 -37 42 -64 -86 65 -19 74 -59 -24 -82 -33 59 92
2658 92 7 83 28 -114 -80 -10 29 -141 -50 -27 -45 84 -82 32 63 -110 -63 -12 25 -86 -11 -90 4 -76 -73 19 -4
2685 -4 101 17 -74 -82 -83 -84 -101 -43 -60 45 75 -16 24 -40 32 -41 78 66 7 99 -121 -25 32 -24 -4 -131 -65 -29 -2 -3
2715 -3 -70 37 -97 81 5 -144 21 -60 49 52 -7 -77 100 12 -13 -103 13 14 -12 -9 -81 38 67 -77 75 66 28
2742 28 39 82 53 -27 -18 -47 -72 -47 -48 -52 -50 124 64 -21 -20 79 -7 -92 10 18 26 96 67 -8 -15 3 16 -63 63 0 -95 25
2774 25 -25 -136 -16 60 91 48 -59 14 6 -17 -32 -11 20 -51 67 68 -46 -107 73 53 -59 184 100 -40 35 -27 -57
2801e7jQ8k0K9m4n3n3rJ35j32J32Qm9oJ8L1pj3PRj3J1nj1kO2l4p1J01j85O5J97
2833A28j92J10k1%r9J05R1j80R7p3Oo6J31j36M8N5k9qj2K7m6m5J50Q0m9%r2j4
2861c4j1rk0Q6r0P9mK5l6j05J30J71k42J13j7jk7m3N4J6j42J46j63nJ00n5PK2
2889e5P6Ko5J7Q2Lj04J23Kj59J82j56O5J12k01L4M7O4j08N6o0O5j03r2K23K9m8
2916C1Qk9m8L6qP0n5N8j78J02L8rn3KK6L3j07Q5m8J8l8R6j49J32or6J42m5M5m1
2946A2j21qJ14J23k9k2o6l6rJ21j8o7j09J40q9qQ0J6J0N5m7q3R9j06R1l6p4r3
2974a60N4J24RKk2J42j63J68j31j3nLL1j4pL6q1qM6r2O0J5j35N5J05K5Q2j35M5
3003C6p2J3O0p7J03q0o3R3j21O9K2R8l4p1Q0K0m5P0p2L6j27N3J97j71n0J6K3M6
$$ plain form
2801 -57 -58 30 10 39 -5 -58 -111 -120 15 -117 15 23 -26 -32 -14 17 10 -3 4 13 0 11 6 -5 -7 55 21 -50 51 -134 -69 128
2833 128 -64 46 25 25 -74 31 122 -58 39 -34 -28 -94 37 -99 -51 4 -25 -33 -45 -18 -64 -109 41 121 72 72 -20 -34
2861 -34 -45 -54 -74 12 -78 1 -3 22 -14 -119 11 182 -60 53 36 35 8 -35 19 35 -107 39 -124 -129 -29 -84 -77 -55
2889 -55 21 23 -42 -25 57 60 -44 79 81 -78 104 -52 13 125 -76 -42 5 69 -39 17 -43 22 -81 -173 50 79 31
2916 31 39 10 -38 -2 -10 60 5 63 -115 -13 25 16 -37 -35 -9 24 -83 2 -46 -28 -66 30 -119 13 7 -89 53 8 53 12
2946 12 -109 -117 -3 120 91 69 3 -33 -42 79 61 -6 -115 25 -64 -72 8 24 34 89 42 -41 58 -48 43 7 -67 -160
2974 -160 -106 18 27 29 7 149 -14 154 23 10 5 8 39 25 18 54 -27 -35 11 -81 -21 -6 -141 -86 19 44 126 -9 36
3003 36 -36 -23 37 -40 63 -17 -80 13 -108 -39 -17 81 47 -24 56 76 31 101 29 65 -62 -9 188 17 -33 -17 6 52
3031E2p8R0j21l7P0K4n2L9pj45J46m4m3Q9r0Q6m8Q4p2N3l2n8J59n5pK5p7N9Q7
3060I7j56O7L3o8J36p6r8Q3l9O2n8n7O5N4pM0m1o6M6j2K3j44J61k8L6n3nQ1j03
3089b7JO3l3k6rl4L6M5J5j51K20j71J51j8j33o1J60L2M6r6p6l0R3M2p5J73m0j23
3117b6J1Q5q8OqmK8N5kJ3j02M9j31J44K1M2J2j10m2Q0l7r5J51j6O0o0NPQrL4K
3149H3K6k01O8P7p6l8M1k6L2n2L4j1L8m5J18L8j37M8q9K4J7m1%L6P8o5J35mj38
3178c0M4Q6n7n5N6k3q0J02kM1j37R9r5R6p9J56q4r0N4N0j19N5Jn3P0L2Mj36lJ0
3208h7Q6N2r1p3J35l4M8p8K3rP9L8k27J69j4lj29K54k28M4mL2O6p9nQ8j0o4m2
3237f3kM5K4M9j19J3L5K8Pm6L9j3p6O7R4J4j70L0J67j85j2O1k3N5j69J39n3Q0
$$ plain form
3031 52 -26 64 -57 -94 -24 0 -52 -13 -20 -165 -19 -63 -106 -17 -107 -21 -69 15 -57 -4 -36 -94 65 10 3 28 -49 10 97
3060 97 -59 8 41 -27 109 33 -65 18 -21 41 -17 -74 -9 45 38 78 37 -29 17 5 28 -116 45 17 53 0 -5 76 -27
3089 -27 -26 37 4 -22 -31 -65 -29 16 31 -120 100 -71 80 62 -71 -132 28 60 106 10 -66 -96 -3 39 -36 137 97 -26
3117 -26 -15 70 -18 -12 -20 -24 4 59 57 70 -32 17 -114 30 51 93 105 -5 -47 33 -4 -99 52 36 96 36 41 48 56 47 81 83
3149 83 109 -92 -24 53 -23 -61 -20 -46 -14 -66 -32 -43 -5 -50 68 106 -31 17 -72 -48 -31 -72 -72 -36 42 -23 112 108 -30
3178 -30 14 100 43 -12 44 21 -59 43 41 82 -55 44 -51 45 -34 122 38 -52 2 52 -67 -12 -11 -64 6 38 42 -94 -97 -87
3208 -87 -1 51 -40 -113 22 -12 36 -42 -19 -28 51 89 -138 31 17 14 -115 139 -89 -45 -49 -17 49 -30 -35 53 43 -21 -63
3237 -63 -65 -20 4 53 -66 -53 -18 10 17 -29 10 -3 -79 -12 82 96 -74 -44 123 -62 -74 -13 -36 19 -150 -11 -64 16
3265A6p5R9j8N7j02p2R0m8J42j8j84J91n1KmO9j66Q9n5K8j03J14o7K2M2J26n5
3292F9J1j32P5J17k18K2jO6J50k15J0J2J3%J5k2K6K9n9O3pl9kp6J32o8P1l3K9
3321C8m8j04Q6K5J9NL9j62J25m4j37J03R0j7M0o0N1p2R7q6L5j01l2Q4m0K3N3r3
3349h3J28Mr0K0P1o5K3o9J20q8J29j41P3ln9M0m2L3mn8J1J4P8j15p1J19l2O4l1
3378b4j6j4kK3n4J42jj42M3MO0j03M7J10j9j4j1qM9j37J64j24R3j00P3Pm4n0N4
3407Fl3K8o0j3PLR7Kj63J60j39J22k2m8O9M1j29R7o6J21r8O4q3n8J99j25N5P7
3435A11j26P1m9N7o7R3m5R4j29J14k35Q7P1Pj4l1p3J24o0n2Q7r0KJ0J30L0r7m7
3463b7k3J10q4m9J12k3kM0r7r7J91l7n9K1rP7o2J28J1j58n0P0L8l5k2J00q1J7
$$ plain form
3265 16 -59 40 22 79 -23 -95 -5 -53 89 71 -113 78 27 29 25 94 -72 17 -38 -10 -113 1 -66 -44 -2 124 69
3292 69 80 -52 23 140 -78 -56 -57 9 159 -56 -46 -34 -21 -21 -6 -28 -2 27 -32 31 24 -15 -17 -93 39 -29 42 9 38
3321 38 -10 -114 -28 -3 16 21 60 -102 23 -21 -158 -55 35 18 58 -2 49 -23 74 -12 23 -78 -110 -26 -66 -43 10 -83
3349 -83 45 49 -41 -21 50 -15 8 -61 59 -29 100 -41 32 29 -30 10 -32 1 -3 -61 -50 -36 42 -73 -144 -25 -57 7 -24
3378 -24 -40 -54 -56 -33 -87 55 54 -88 -45 -41 19 -84 -37 73 54 40 29 21 70 -67 97 -27 66 -34 39 46 2 -48 6
3407 6 -27 1 -59 -72 -65 -62 35 37 -126 34 -105 17 -5 -53 16 57 -72 25 -41 80 -18 46 -37 -95 104 -21 34 111
3435 111 -15 56 7 64 -3 90 45 139 10 124 -111 -24 47 54 40 9 -64 60 0 -52 35 -55 -53 -43 87 117 20 -27
3463 -27 -50 60 -24 -73 39 16 14 54 -43 -140 51 14 -45 -24 -33 44 -18 110 121 -37 -87 -17 21 -14 -36 64 -17 0
3491@K2p5J67j58M8J51r0qp5l9O4K8m6M6o8M1L2j08o9J60j23J35n3L9L1n0j10
3518a08J60Nl1M0r6j6K1k0M5L3l5Jm7L9n2O7n2k4K4K7m9R8l2L3K1j54N3L4J29
3547A14l9m1q7K4p1J51p6nM4k9Q8j36M3q5P8M4Q2j33k0m9J82o1M3o4r9K25L1k52
3575i8N5k2P7J24j78J03M9j40J5j86K01N0j36R1m4O0N9r3L5kj33J29j7L2j62J53
3601B2J8j04R0Lm2N2Q5j12PJ7o1LK0K1Kk1R3q2Q4k6m4%m5k3m8Q3N4r7Jp0K05j28
3633d3j30J90m0l6O5j13J34j32%K54j70L4j15K04m1j09O3j49J39r8mJ39K0n4n2
3658d4J7L1j0k4pJJ10j00R9q2j38J00%L4r8K11j47M8K0J5L9j20P5n4L4p6Q0rj3
3687hR4m8n7J0m6J11o9N3p4K2k5P1ln0K3QM4o3OJ18p5j30J22j18R6j5o4J42j14
$$ plain form
3491 0 22 -53 114 -44 4 155 65 57 -18 -57 7 35 -11 35 -33 8 40 -68 -137 23 -100 35 -18 21 52 2 -108
3518 -108 52 57 26 66 -30 -46 -25 -45 0 33 -2 -1 -48 -9 -61 6 -46 -70 -46 -19 -68 30 -2 31 52 -102 -49 -15 114
3547 114 75 34 -53 -29 -100 51 -25 -30 14 -15 73 -63 -20 -105 -27 17 99 -34 -54 -103 79 18 61 -3 -102 123 154 -98
3575 -98 -43 -65 12 136 -42 61 110 -30 -15 -201 0 50 -86 5 -39 21 80 -13 22 20 -113 16 -1 31 -131 22
3601 22 40 -64 26 29 -13 39 124 12 19 36 -25 -22 -2 19 21 0 93 11 95 69 25 25 -20 -43 -91 -8 46 -51 -50 -120 85 -43
3633 -43 -173 17 -23 -59 6 -107 27 -105 -105 149 -21 13 -102 102 61 -48 15 -134 5 -93 -97 42 62 8 -44
3658 -44 -27 4 -6 -30 -37 -36 74 -26 73 -9 -147 -47 -47 -13 -111 100 -47 1 21 36 75 -45 30 -24 10 -66 14 5 -8
3687 -8 86 38 -19 -9 -55 56 -13 40 -34 -12 -37 34 31 -19 4 12 56 -7 -1 117 42 -88 34 -84 12 -3 -67 75 -39
3716c9J07q5m6P9l7J9m4J2p3M9J9Q9k0o7P7n5j7K5j2K9r3M0PM3L7r7J48j37J32
3745I0j48J02J0j39L8K1K1N0P7k11jK05j79jL5nO7L7J3o1J1K1J5j10J15j17Q5
3772D1Rq5J24k3n1Nl0r7K04j29r0J72l4k6J1j07J41p0j1RR4j24m7M6J66l8j9q7
3800d6J27r2M1m4lR8j33Q6P9n4j46%K27o9j60O4k0R7R3j85OJ08p4j25J04Om3P3
3828A5JP3q7L8J3M4j7p1Jj16Q2j2q8J05M1k1m4o2K1Q8l0n7N1J6k8M1n6J35o2r
3858ER7l5l0n3Q0j1Olj68J10K7kj13J25l4j1K0K3Lj23J93j20L7j8q%j33M9O6J6
3888eK0N5p3P9j19L7J4nO8j10O8o8JJ11j21R7j6OM8j17P3r9Q6j1K2l5P3o6nK5
3918C3j16J18q6m4R2l9P0q3l6L5J5P1l0k6N1r7R3pq1O3O2r8M3K4mN8j70O6N7j29
$$ plain form
3716 -39 68 -17 -63 16 -21 -2 -46 -34 -107 -58 -39 50 30 -37 40 -15 -32 -7 -19 10 -83 -43 -36 7 44 -53 95 -42 90
3745 90 -58 44 54 -85 -47 -26 -5 45 122 -89 -90 115 -64 -65 -30 -35 32 69 82 21 32 53 68 -42 73 -44 41
3772 41 50 -35 89 66 15 20 -10 -107 97 -32 -122 50 16 -10 1 -106 35 -35 -46 -37 57 -67 -114 -68 98 60 41 -46
3800 -46 81 -11 30 -14 -17 81 -52 34 113 59 -87 -87 140 71 -89 -25 -45 52 145 -40 -34 74 0 -125 -21 -15 -58 15
3828 15 16 89 2 40 53 97 80 9 10 -106 -24 -36 -124 -19 22 1 -43 -105 -84 4 -26 -83 -32 -16 -44 -3 -59 76 14 5
3858 5 102 67 37 -16 64 53 59 56 -112 -2 25 23 -90 35 1 -10 10 33 36 -87 106 -14 23 5 -3 -3 -136 -87 -21 -5
3888 -5 15 70 -3 76 -43 -6 8 3 71 -39 29 -39 -38 73 -48 49 33 39 87 -30 43 -56 30 19 41 6 79 13 8 33
3918 33 -83 35 -51 -95 -3 -42 28 -55 -91 -56 -41 30 0 -26 25 -72 21 14 -67 -4 58 -40 3 27 23 81 -89 -23 34 -95
3948i5L5N7j65J67j21N5P3j66J76m0P9K0l7m6p3Q3n6J03l1NN0j34K5J55q0n1m0
3975e2O5r6J5N0P1p3k7KQ3J9m6NQ0j38J43j38N0Jp8N9m1jO8L9M4j13M1R6m3j28
4005d3m4J50n0p7K5K6N5l2l2L5l2J52j37pk6o9Q1j2j93K50L6Jq2L9L3QrpR7k01
4035f5M4N8l6L6rr0J08o5l3J1K7R7j31P9P4m1l6l7L9l4J28jl4j94J34l9J47o2
4063G5q7O9Rn5m3J69j72K9N0Q5j56L7j88K40n1l9J4nJ20j22j8O7K6J1K1o0l4o0
4091f8M6J6j51K00q7L0J56k15J21r4M5L9q7J14q4K6Q6p6q5J80o1K4n9j27O6J37
4117I2Lj20l3J02pn2j2kRJ9j9o4n0J04O2k0k2p4J36m1j6R6j58j0O0O3n6j44J17
4146c7Q3j29J39n8k2P5j67J18R7QJq0L3j29K0LmJ80j52R7l8O1lj66J77j04L4j62
$$ plain form
3948 -95 -60 -3 -168 -1 -122 -67 6 -160 16 -24 55 75 38 -8 -81 2 -54 49 18 23 73 -61 -36 119 39 -12 -52
3975 -52 13 -83 -68 -18 53 -20 -47 -45 38 57 11 16 96 -42 101 -37 13 14 -64 -5 -46 -47 21 60 104 -9 32 128 85 -43
4005 -43 -87 63 13 -64 -39 -13 42 10 -22 13 -19 133 -4 -11 -37 -106 -25 -37 -230 20 56 57 -25 14 47 55 46 39 136 -65
4035 -65 -21 37 1 37 28 -62 46 -19 -52 -41 -14 83 -48 31 105 64 28 -9 30 -4 124 123 89 -105 29 -10 137 75
4063 75 -12 57 66 11 -32 137 -35 -6 44 129 -27 10 -178 62 11 -28 -14 -19 101 -21 -39 28 54 65 86 26 -8 -68
4091 -68 -22 -6 -157 43 -44 -14 142 -73 48 -46 -1 38 -49 65 -19 7 93 17 -68 112 51 75 16 -111 -45 92
4117 92 95 -25 -58 44 37 -15 -27 -29 -20 -1 -20 -84 -134 -30 32 12 -10 -84 52 11 -5 91 -67 -77 -17 46 -10 -154 -37
4146 -37 46 -83 56 -2 -24 51 -116 2 99 107 108 28 61 -68 -48 -45 -49 131 -21 76 38 99 96 -70 107 3 37 -125
4174a25J44j05OQ2j38K03j02ok1J06Jm3pK4p9J46j51P7J41kj52K5jm4M4m3Q1k9
4202C2O0o1k7p6RJ53j09J31j50J30o8n4P1j40R3n1L0J4m3L5qj9m6J46Pj73N9Q
4230d7M8p1Q4Oj07o2K9J64j16J33k3o8M8k3o6J39k3l0p0p3l7J96l2Mq3R4k5Qj
4259dL1j04Q1m5j9O9m9j5J45j64MJ01o4K4R3j6j88P1J08j90N7J33j25J17k3p1
4285d3J16L3k23l3J10J7R9p7j6M8l9M6J8j2p6NO9pj3O5j43nJ22K2q8Mr8K5mJ01
4315B3j27Q4K6P9l5Nj35J88m8m9K1J9l2J9q0J7J37j46J00k55J88Q7j66Q0P4k5
4341D9l9m1R8j13J03n8o4j5n2N7O5J82j75L3l4nn8J43n2q7J60j72K3J02L8km9
4368C7q2J15Nr2N7Qm8j2M0R0j44MO8r9N0j4N5n8J48j97M2R8J2j07m9k3J24j8o8
$$ plain form
4174 -125 19 -86 -80 2 -136 67 -35 -41 -62 44 45 2 -5 19 -60 86 -65 12 153 151 -1 24 23 -21 23 -20 61 32
4202 32 92 31 4 -72 -63 90 -19 112 -38 92 24 -30 41 -99 -6 -57 -27 -13 -56 -21 -29 -48 -94 52 59 -114 -55 -47
4230 -47 1 -70 14 20 -87 -149 -120 44 -72 61 38 -30 18 -5 -71 68 45 15 -55 -128 -165 31 -1 3 -80 14 -11 -3 -4
4259 -4 27 -77 4 -41 -60 9 -40 -55 90 -74 -70 31 -33 -9 84 68 -120 -49 59 -131 -74 59 -66 51 28 -43
4285 -43 73 106 -117 -150 -40 -23 76 -1 -17 31 -8 38 56 44 -32 -27 42 35 22 87 -56 -61 61 83 -5 -1 -99 -74 -78 23
4315 23 -104 -20 6 85 50 55 -80 108 60 11 32 51 19 38 -42 -25 112 -34 66 -189 -1 86 -80 0 74 49
4341 49 10 -31 67 -46 57 -1 -65 -80 -132 -75 -10 172 -3 30 -4 -9 -67 76 24 -63 97 -75 -52 50 88 86 37
4368 37 -45 70 75 -17 40 48 0 -12 28 118 -26 -22 46 -53 -3 -17 38 -20 128 -69 -27 71 83 -24 -73 -96 28 10 -58
4397e8M8qM0K2m2q3P1M8m7N6R1q1q0K2J20j23n7J20N1r9P1n4j6O9n9J05q4k1m4
4426b2M3o3J07j38o5J38L9l9P4m4N5j2k29J89j00J9J04%n5m7qJ04j12Q7m7LK8
4453IP1k2j34J24l8n8J5K4N9p7k9K1J04j12R5j02o4J01j03RQ8K7K2LN8L7q9L1
4481G0j1n7j7O5N1m9rj3LK9K1j73P5j1k4P7j61J81n4Q3k5j3M5j17JOJ07j54J49
4510G5j38P9K7j23O5K0K5n1r6R7l1L4o6K6P8r1J11q8R9p9Rj7J6L5R0k0j10N1O
4539C3j4r4K16n6p1j7k1P1L5r6O8mo0J0n4rk0Q2o1k0N7K4J25j44J18j67P3q8J44
4568F0k5p4rPKQ2r1J12o0k6Mk8p0J14J22j39K6n0O1M5M0j14Q1l4%k7l9j12J82
4597D0k7j0p8R3J6k2o2rk1mJ77j14Klj35J76j00N0O6q2P1q6M5L9j4n0J13j58K8
$$ plain form
4397 -58 -10 -18 22 44 2 -81 -10 38 -9 47 138 57 -23 -1 119 -4 -61 59 110 11 82 28 12 81 22 127 43 22 -22
4426 -22 21 -42 65 -73 -138 0 39 0 74 30 85 73 -156 33 -67 -48 56 56 1 -46 -54 50 -62 25 -22 -19 9
4453 9 80 58 -76 48 10 -48 -33 -9 50 -27 -56 -35 69 -43 52 -50 -114 -13 -116 -107 -19 8 30 33 91 128 39 70
4481 70 59 2 -15 50 101 52 43 30 33 62 83 -90 -15 -26 -50 27 -134 47 -7 76 51 38 83 -34 -33 -27 80 -74 75
4510 75 -63 16 43 -80 -15 5 30 -21 -117 -20 -51 -17 -83 -57 21 -70 41 -47 52 -27 -18 -35 -19 16 106 86 -24 27 33
4539 33 19 -75 141 85 14 -3 -24 47 82 -14 54 50 -10 0 -54 -63 -83 -1 -62 -82 -25 -1 124 -20 98 -69 4 -84 60
4568 60 35 -39 -48 -41 -39 43 -48 64 4 -22 -18 -46 -116 -2 120 -19 7 -43 18 63 103 -11 70 36 36 9 -30 -142 40
4597 40 13 3 -75 18 34 12 -50 -59 -80 -84 93 -21 -19 -22 -157 19 -81 -31 35 -47 24 -62 -17 22 8 -42 71 -87 -59
4626e9P4n4N2NK2r5J69j37K2L2o4N9k4j20M5L8L4j0m9N9P2q5K4n5r8J56r7J2J57
4655H5p7O3j10l8J20p0j14J31J02j6m5np0l8P6j12J50r9R9l8r2K7N4L3K4P0l7
4682G3k21J88l6K3N7K9n0m4o9o6L3J18n1q8J23l3n2m8O5J17kl2j1K0l6L0j5K9
4710E1j06kR8l9n2M7N8j4p9P0q5R2K8r7KO4p8l1J40o5j37N1J63o2n0m3M9M9j8
4739DL8J8m7j53J97J5p1o4m2J53j04Q4q6J02j11K4J04n8p4J46n8q0J41j42J89
4764A25j14j49P2J64o6o8k6J89k1o9j5J0m3R2j13Q1r2rj1P1OJ8O3j19J13j21o4
4791i6J20l5J9q8N9M7L4O7j41N7J12k39J41j4N5r5L2j6nJ21k05J46n6j27J24j33
4817a16K9K8J8J7j2K7k2Q7r2M3q6J14k3O0o9k3P4o9m9J35j0p7M8j5J02j36J8N4
$$ plain form
4626 -59 15 -39 13 18 40 -55 114 -23 -1 31 -33 26 2 -118 -73 -35 -1 -11 -60 -1 71 -14 10 -45 -143 13 -84 -72 85
4655 85 8 71 -39 -77 43 -27 -141 -10 92 76 31 26 -44 -82 -6 -118 32 -67 32 -6 -98 -71 -17 16 40 110 73
4682 73 -148 40 4 27 84 113 63 19 -50 -116 -83 35 -16 -104 19 -14 -66 -114 -49 68 66 34 23 43 7 37 22 51
4710 51 -55 -57 41 2 -50 -3 55 41 -38 32 -53 39 67 -30 -28 36 -42 -73 67 2 -135 -84 79 17 -33 -76 -27 22 4
4739 4 42 60 13 -140 57 72 1 -63 -105 48 -56 28 -58 44 -67 -43 61 3 -71 75 17 -63 78 -64 125
4764 125 11 -138 -66 98 32 -36 -62 127 106 37 22 32 -11 81 -32 49 -43 -52 -63 8 14 32 95 -24 89 -32 -96
4791 -96 24 -11 8 -80 -21 26 60 127 -14 43 155 -84 57 43 98 3 35 19 14 135 -70 76 20 -107 17 -116
4817 -116 -87 -59 -41 -24 -36 -9 -31 56 -36 7 -79 35 12 72 3 -20 54 -15 -64 71 61 -16 32 17 119 -17 1 55
4845E5p5J80k00P5j10j3J65n5K8l3n4O8p8P3m1K7Kj8Q4l8l0m8K8M1m0p5N5N0l6
4874a3J3K7m3o4O3J10J16k75O4L1j20J03rO9j43N8K1mJ30j43r2P8K5N6j38O6K1
4901GN2k1M8j22P1%J11j19p4P7j21M8J52j09q5J14j23J10j0o1L6o9J12mM0p1M6
4928C5j13M0K2j6l3M0K6QL5n4L4p6q1P7J01J00k18J01p1m2P0N1p8J43m3j20Q7
4955B5j06N8J9Rm2M9q3J36J4L9q0mm9L3J29j94K3O3j56J79nj60M4Q4o2lJ63n6
4983F7p9l8jJ8Q3J3n7n8O3p2J15kq6k6J24p8pm4J24k4o1J12j23K6P1n7J9n1L3
5012Dn8P4k2knQ1j28Q2Nj05pn4J12J10k77K96q3o4J13o7J7k8L3J0k9O7n4K9p7
5041b7J43j14M0j01J01l8q1mJ14J6k8J6l8O3j7k3j2k4L5qm9j07J27Q7o4K0n6J2
$$ plain form
4845 55 -20 160 -40 35 -75 -88 77 22 50 17 -37 31 -47 26 -15 12 14 -4 80 42 12 -36 -8 33 -7 -82 -27 23 -13
4874 -13 0 27 -16 -80 -17 93 209 -66 -2 29 -91 12 3 72 -71 -13 8 4 134 -9 -101 -23 2 58 -80 -14 7
4901 7 59 38 86 -36 35 35 146 27 -47 30 -91 -43 109 0 -85 29 -94 16 6 -55 -19 -88 24 20 60 -11 35
4928 35 -78 -38 -16 -32 -65 -25 1 9 44 -10 24 -52 -133 -56 45 145 -73 28 -43 -85 -15 36 -42 101 58 -62 25
4955 25 -81 -23 -4 5 -37 12 -71 65 79 118 38 34 -15 18 147 -47 -24 39 -117 62 57 -103 -59 25 -37 -40 123 67
4983 67 -12 -50 -51 -33 50 63 6 -52 11 -61 54 52 -34 -60 64 -14 -21 -65 59 35 -26 86 -37 -11 60 3 22 -29 4
5012 4 -54 20 -2 -4 -9 72 -56 26 31 -74 -81 -135 -23 87 -190 106 23 -41 72 5 22 -6 27 37 8 75 21 50 -27
5041 -27 116 2 42 -59 42 4 -77 -81 33 49 21 37 -1 62 45 22 10 -14 21 13 -36 -143 -16 71 7 27 -29 -17
5069a7R8l7o8P8J6j21m5J27o0Q5J4Mp8N9J5m2J9m9j02J34n2K0Q4l3Lq8P9N1j9
5098G5l5p8J89j94M2j1O2r2R3Kl9l0L6n0j4MN2qn7L0L7nRK4m9nM0j20L0J34j05
5129c3J05n6k7j1O8qo1q3K9J51Mq4q0JK2J15Qj27J67j2k31O8J01M8j13N5kL2m0
5158FJ4RP0j68J10j17M2J07p1m0j15J09J27r9k4Q0J6m6J0l3l4K8j2OP9n3m4R1
5186D8q2Q5k1o6k6J1J02M1n3j23Q9o8M2P0p9N7O8j25j00J91q4mj02J73J9k7J4
5213E0L8n8l2P5j59P0M7J1l2n0oM1k6N3Jmk4Q3J6j26Q6o3mo2N3M7p2N4R6k11J23
5244A5J9N2q1q4J85Pj07l1K8l6jM7k7J1K2Oj01M3J5M1o0%LN7N6j41Q0j64R5J35
5274H4j16J39n6j61J38l6NLPl4K6L1j46K65j18k1M5k6m7J2K3OJ2j32J43l4P2j25
$$ plain form
5069 -17 81 44 -24 54 70 -51 -96 31 -29 56 70 74 -4 55 70 28 47 -2 -104 30 -22 -2 82 49 52 -36 43 94 75
5098 75 40 -38 151 -43 -1 -12 50 -42 51 53 14 -16 20 -30 -44 -40 12 4 -53 -23 14 9 18 42 -7 -12 28 -92 -62 72 -33
5129 -33 72 16 -11 -22 46 38 -23 -106 -77 74 78 -6 -86 -85 -63 52 60 -67 100 88 -143 -75 26 74 -39 16 14 46 6
5158 6 20 29 99 -69 41 -76 -34 73 2 -38 -153 -44 83 -16 -40 40 56 10 20 -13 -47 -19 -31 -25 54 1 -43 48
5186 48 -34 51 30 -36 -62 -51 51 92 39 -84 5 -63 -21 49 -30 27 95 -30 -130 61 -23 -27 -129 44 63 36 50
5213 50 88 30 -2 73 -86 -16 31 42 10 -40 -46 -5 -31 22 23 19 -5 78 94 -32 54 -9 -13 -75 -22 25 -47 7 103 -108 15
5244 15 34 86 5 -79 106 113 6 -25 3 -33 -34 13 -14 -3 19 25 -76 -33 -18 23 -37 -37 -34 23 79 -62 18 -146 -51 84
5274 84 -32 107 51 -110 28 -8 -3 0 7 -27 -1 30 -116 149 31 10 55 29 -18 -6 17 23 35 -97 46 12 84 -41
5302d1K8N3o7p5N0Q5o0O8p1J3m3P7J1J6K1j05R6q9L1k5o5N6K9j27J88O7k13j4
5330a06J35r0P2L0L0p9Pl0J2j0j00J71jm8N3q1J07j40Q1Km0R4m4l9n8J11j15O6
5358a0Q7q7m2J04J4l2m3k3J25j70K3R2j29J20Nr1Q4k6j4J3m6n5J14M2j00O4o2
5385d3N8J5K2Nj66J80o8p7J79p7n8m9rQ4Qj0M0p1N2L9j45J17Q9r9l1NK0N3j04
5414d1J14p8J7M2l2q9N6Q9j22J21K1p3j9p6J69j14P7ORj04O8j30J31Kn0L3j4n8
5442d5n7J75Qk2l0n0p8O6J09r8j1N0j09J27j17K9Om7P4L6Mn2M0j9o5J14n8O0p5
5471c5K4O7n9J53r8K9j81R4p2J41l6p5R9j08N5K1kp2K1J25n3n3n0M0%n1J76j95
5499i5M8N6K9j02m7J75O0q3N6j04J6k9L2k7R6q6k5r2P1Q1j3L6n4O0K9j7l1k6o2
$$ plain form
5302 -41 -13 40 -27 -102 -52 33 -27 41 -30 -17 -60 17 28 44 65 -40 56 -33 -2 -27 -92 -36 -7 -134 54 121 -92 -106
5330 -106 29 -61 11 41 71 -8 -1 -31 -19 -29 -129 42 41 -7 46 -35 72 -68 13 15 -25 69 25 -14 -72 39 -76 -10
5358 -10 77 -10 -52 52 66 34 -9 -32 93 -77 -54 38 -91 29 34 -57 27 1 -13 0 -46 -101 13 55 -45 19 -43
5385 -43 15 30 52 57 -109 71 3 -74 105 28 -30 -79 -88 -4 4 -6 34 -37 15 54 -91 26 115 16 -15 -10 10 63 -41
5414 -41 73 -5 12 54 22 -67 -11 78 -44 77 98 25 6 -70 99 -15 62 68 77 -27 41 -89 42 44 -6 27 13 -45
5442 -45 -102 73 81 59 29 -21 -99 -33 76 -22 -33 17 -92 35 -82 -53 -47 -94 -20 16 20 -32 8 -11 -76 38 -20 40 -35
5471 -35 -11 56 -3 150 52 81 -100 -6 -78 63 27 -48 51 -57 -2 19 17 -55 -34 91 38 -15 -65 -25 -25 -76 100 -95
5499 -95 -47 9 38 -64 -111 64 124 41 97 -7 9 -20 12 -15 81 -5 -30 -122 -51 30 17 53 -1 59 88 71 40 14 -48
5528d8KJ65o8p2R9j10O1O0j50R5p1k0J53K3j28M9l3L6j5m1m2O0P1q7J68j80L2
5555Im7M1l5J18r9P5n9K8p7RK4J6o2J2K6rqL1L3q4L6RM9m9N2K6K1j83J40j6Pn0
5587a6mrM3j3k7O3q2Q8j9J4n4MJ5k9K5pNJ4l2Pn0N5N9m6l6r8J12om4K2K9J08j35
5620d4pJ5J1O7j04OKK6J07p9n1O3J0Km1L4L5j23J58l4l5J2L1m3L2O9j42M2Moj27
5651a10J05n0O0j7N6p7j54K04p3R4p3n0P3j02N0k2Q7j06J87oj61J88j58P9o6J8
5677b4n3R3mN0o3m7N3o8Q0Q4k9j05OqJ8Q3j01J0R9n7o9J65q1j26J28p1k4Q1Q2
5706A02p0Rj6j7L7P9r9o1RJ33j42j4m6Q7pN4r8Q8j0l2k9K3J14j53O8L5j21NJ8
5735e4r3J31J34o1p8k3J9L0Kp3M3Q7j05K5mMq4J73P9q8o8P0j32N3J22j52M8k4
$$ plain form
5528 -48 -46 119 51 -21 78 -32 29 89 -61 34 -37 -57 96 119 -9 40 7 43 28 -13 -55 5 76 -11 157 -23 9
5555 9 -38 3 -32 86 -13 62 3 31 -46 -37 -13 3 -59 -47 -21 -30 -38 -7 26 -58 -22 -13 36 -13 39 65 86 -97 43 27 34 -16
5587 -16 -20 -29 14 1 -26 37 -45 43 24 38 -16 -12 3 -26 -1 -8 -3 11 -21 -14 -64 -9 50 4 -32 -130 -18 -24 -68 -46 -17 91 -44
5620 -44 -51 -36 -25 42 -62 -56 -54 -28 79 0 -51 12 22 24 -17 17 52 -71 87 53 18 30 61 18 50 119 -23 19 23 17 -110
5651 -110 -5 -55 5 -12 44 -33 -187 17 -56 38 -35 -85 -12 -114 -64 -86 1 -105 82 76 -85 103 -55 24 -42 -24
5677 -24 -77 16 12 62 -1 -48 5 -63 17 101 72 -33 -27 -35 -17 66 -35 -25 74 17 -52 113 32 -94 34 -37 -61 20 102
5706 102 32 41 25 8 45 124 25 -36 -27 106 -36 -50 -96 -9 -16 38 -60 28 18 -14 -43 -20 94 -59 9 44 -77 -72 -54
5735 -54 -147 -16 118 57 -21 -44 -25 5 7 -66 -23 64 -41 -16 -20 -16 -100 73 152 64 -4 66 -66 -13 109 -43 5 -19
5763a9N4O6j09q3J37n2P2j28MR4J28j16k5L5p6l2O9j69R5L5L0m8mJ29o6j8K1p8
5791e4k0Q1j00J4k5L9K4o7R6J06j05O4q6L7J3lq9J55j4q5k0q3K9l2J31Jr4k8R0
5820b5P7o6l1pK8O3nl6j2Kj0N0Lo6NJ6Pm8QP3j19M5J5O0r8J42q8L1M0k8j18Q7
5852erl7j0N7K7j09J94q2m1P3j13qJ60r1M7j8O1j94J23n2K8j8j1J62j28k4k5J54
5880A11l1j94J64N2j62J2P2Ro5L7j08N5k6J08J50k33j0k2J45J1j09M7J6k9M9j55
5906a06N2P2l3j18J11P8K6j17k2P7j34K81k75Q7kK9m1Qk5l6J00j19J75K1o9J0
5932C0M7J4m4jr0K3nJ02j14O5k6j10J70j46k3J13M8ql8Jj4J8J04k07K10q6m7P5
5960F1m7M3j39j7R1M4K2q2L1j0J2L5j2k4P4nr4n1k7Q6L3r1J14j40P4K7M1P1p0
$$ plain form
5763 -19 35 101 -8 -91 46 -6 66 -62 -58 36 164 48 23 58 -18 -50 19 -150 -55 -20 10 -38 -42 87 21 3 24 -54
5791 -54 -74 7 -93 -79 -104 -65 -41 -108 -12 94 -11 53 -33 4 17 14 -75 80 66 -19 -39 -122 -93 -125 6 7 -87 -115 -25
5820 -25 52 -14 -45 -52 -24 39 34 -2 -14 -12 -22 28 31 -35 -30 -14 -7 -55 -47 26 -93 -48 -33 27 -71 71 -17 14 54 26 -92 -5
5852 -5 -14 -51 -61 -4 23 -86 108 26 -15 58 -55 -63 97 6 53 35 96 -98 25 -27 1 -17 -28 134 6 -18 -43 111
5880 111 80 -114 50 102 -60 -48 24 33 -32 5 -103 -48 -74 34 184 -49 -59 -81 64 75 -34 13 29 0 49 -106
5906 -106 -54 18 -15 -133 -22 56 82 -35 -57 20 -114 167 -108 -21 -23 6 -35 -27 -52 -88 12 -107 68 89 20 30
5932 30 77 91 47 46 -44 -21 -26 76 -38 27 1 -109 61 -85 -108 5 53 45 7 8 -6 12 116 -91 119 33 -14 61
5960 61 14 57 -82 -99 -8 36 58 -24 7 -3 9 44 32 8 82 77 -17 -68 -95 -9 24 -67 47 -93 -19 8 49 120 50
5989E0n4j10Q1M1o6J12p3k0lR1o1L8m7j11J47kn3J46p4l2l1j7Q9Mp6M6j3j8N6
6018D0j74J47k2ML9O2l1q8o3J21M6q0j1L7p6O2r6R4J09j38M5o9n0J00N1j47j3
6045a01K3P7j35J05%P8j8P9mk4l4j46Q7Oq0K2P2OJ2o3n8M3J18j14J1J68k21J77
6073H6k9kj91J21Jk8qk5O3l5L4j61J66M9m1k1L7n1l3N8%R3m3J8l7j50J83j4j23
6102h3K5P5Rm4J23j18MJ17J9j25M6m9Jj0J0L6n5M5j2m6n8N7LL0j1Lr2J73k3q7
6132c7K4j9J1lRQ6j68M7m6J61n7o4J29j37P8j31J55l7K4Q9l4j11J3k0J03q8J7
6159fm3R2j43K5N6J2RQ6r5J11j37O5j6K4j23n4J74k6j03K40k8j30L8j97K01m3
6185a1J8j94J84Q3l5lj44J63n9n0O8k0p3j12J77K5L6p6K1r7J09k2j1p3O4R7o8
$$ plain form
5989 50 -4 -114 -33 8 -58 54 -19 -39 -42 49 -12 26 -21 -132 15 13 -40 106 32 0 -31 -48 41 45 -31 15 2 -16 40
6018 40 -134 13 -9 -5 34 96 65 -23 -86 35 81 1 -10 27 -49 13 -83 11 120 -18 27 -42 -92 8 59 -88 -101
6045 -101 -78 -1 -136 -31 -31 47 29 108 104 80 46 -100 -13 -7 -87 -65 7 13 25 -38 -96 -53 65 -49 -38 130 -91 86
6073 86 57 55 -136 -15 -14 -42 -50 -75 -12 -47 -13 -174 -8 41 0 -21 16 -35 -68 -10 -10 83 40 58 21 -129 54 40 -83
6102 -83 -58 17 26 -18 105 -13 -9 108 127 2 48 -1 0 -10 0 36 -19 26 14 -32 -90 -33 -30 0 -11 -8 -100 73 50 -37
6132 -37 -13 -32 -21 -24 -15 71 -97 -50 -96 65 8 -56 73 -64 14 -117 38 1 25 114 80 -31 -18 -38 65 -23 -6
6159 -6 -49 43 -100 -75 -19 -7 2 88 -7 104 -33 32 16 40 -83 -137 37 11 -92 148 120 -10 28 -169 32 -11
6185 -11 7 -187 -3 80 45 42 -102 61 2 -48 20 0 -73 -185 -8 17 53 -23 -2 -99 10 -12 -23 -96 -32 65 -3
6212cQ6q0N0m3n6Q8J5L5k3o8K6j01K0K7N7M9k7j16P0l7l1Q8q7P0p8M0QQ9l6o9
6242c7L3q5J19Q3o4j6pK7k0j23J20j6q2Q2P2j31J3J2M9Kp1M6Q7mn9j21J35p5J35
6271A04j44J11k5j13Q5j0R2or4n6J09j11J04k7M5j07Q2r7o4K27q3q1LK4m0M%K9
6299c9l9L2J7J1p6J48j92J20O2j4j24N0K1l7N1m8O4kkm7J47o1n3ro3J38j50J34
6327C9n5N0q0L3nk0L3p2K6O9M0q8Q9Qj20R0o5J1K5kK3p6N8n9l1M0Rj03J10l3O5
6358IK5Jn0K7q5J21l5o6k4J99J2j02j7pk6M0n2p0L6P2n6Q4oN4j48RJ20J2l6l2
6388IJ3j07J85k88J86l3J4r0P7L6pJ9P1j0O2j81j9J14j55J46k4Oj01J11J0k2p8
6415e6N8j43J65l7k5J11K2j62N4n2J34r5N2Pq6P8j2L2k9K2o9O1M6j9j17K3J28
$$ plain form
6212 -3 83 3 53 10 -46 42 57 92 69 1 27 -74 -54 -27 30 79 52 -64 6 -31 -62 26 -61 9 -69 -29 -21 68 32 -37
6242 -37 -4 -89 30 113 49 33 26 53 33 -90 30 14 -68 14 86 -45 -32 -20 29 31 -40 6 93 89 30 -91 44 -31 104
6271 104 -40 71 46 -67 18 8 100 94 0 -56 53 -58 46 19 64 -43 39 -58 -122 105 22 -59 -56 -32 -72 -68 -68 -39
6299 -39 -78 -46 -29 -18 -94 54 -138 -18 44 30 -94 -44 -23 -60 -9 -57 7 5 3 -44 103 42 -11 -20 -83 55 -95 39
6327 39 -16 34 -46 -13 -18 -38 -5 -77 -51 18 58 -30 59 67 -53 37 -28 -17 8 6 29 -47 11 -48 -79 -39 -30 -133 -23 -56 9
6358 9 34 35 -15 12 -73 48 13 -53 -77 122 134 32 15 8 -18 22 -30 -100 -64 8 -48 36 30 84 -64 -55 65 77 41 9
6388 9 22 -85 100 -188 -2 -35 -21 -111 -34 2 -5 14 85 75 137 -44 -63 51 -104 42 18 24 -77 34 44 22 -56
6415 -56 2 -141 24 -13 -38 73 95 -67 -13 -65 69 -26 26 33 -53 25 13 45 16 38 -31 30 76 57 -60 -37 91
6442I1r7J14j91M6K4L2N2j95M0J25j19J03N0r5M1n3N1K0j13N0pj6n5N7J6k8K9
6469b8k4N1Qr5J18L5n2j2m2pj0Q2l9j40J23l0J73n2n9r9Q3j8J05q7qK3K4j23J12
6498A2j02P1M0K1j60J07j0J2m4k7J06r2J20nm5q5Q4j12J50L8Q3k28o4J10M0N8
6524G8j34M0J91k04Q0j75J04P9n2jo6M9q7N8N3j12Q5Q2l2l2N9ko0L5l1K8K2n9
6552dm3N6M3j20NM2O8j1K1J1j85J19m4K3K3j8L1o1P0N7j45N3o7J08l4O7mm8l7
6581b4L5n4N9rQK3K8j06l9J40o9p6M7R0k5j27l1QR2Q5j61J02Q6q0l3R3j11M4k7
6610c2N4J4j29J30Qj03J56p1j02M5J19J4j28qmN4N0j15M3J5m7J10o4LK1K8j00
6637c9K0J6o5N9j20Q9N5QM9m9qNl0JP4l9p5J04k6p6P7k8j6PJo5Q7L0r0L2mj1j1
$$ plain form
6442 91 -6 108 -83 -37 -13 19 71 -124 -84 41 -78 25 75 -20 21 -32 19 39 -74 -24 -31 -47 -102 -45 -29 -57 -28
6469 -28 -52 -1 7 -88 30 65 13 1 -41 -48 -58 24 -15 -155 -32 -62 111 59 0 -99 -16 -34 71 -16 -24 -1 23 -100 12
6498 12 -90 -19 21 42 -118 -11 -21 -9 -53 -80 26 -66 54 49 4 -81 3 -109 41 79 162 -66 -130 -20 20 78
6524 78 -56 -16 175 -29 51 -124 -20 59 7 6 -60 -11 -98 -40 13 -99 -14 68 36 4 63 61 1 36 5 33 55 -4
6552 -4 -47 9 52 -68 -63 -21 47 36 57 68 -117 2 -42 -19 4 -14 17 -44 26 83 -62 -9 -76 32 -2 65 61 13 -24
6581 -24 11 -43 16 7 15 38 66 -40 -79 61 -8 -84 -37 53 28 -99 -130 -122 -30 55 -106 -4 82 2 -31 62 -49 -5 -32
6610 -32 22 36 -93 37 45 -58 98 27 -75 -30 89 103 -25 -33 -37 17 67 -48 -5 10 -37 73 9 12 33 61 -39
6637 -39 -19 -3 -68 -9 -129 -40 15 23 72 23 15 20 -10 -9 65 26 -49 55 29 -47 30 2 -14 -7 -6 -71 16 46 -44 -12 -16 -27 -38
6670c8P9k4q4J45j20O7r3J0J10j54R7N2j24j8P8oL0m6P8m1o7K09j14K9p1L7j5
6697Fp9J04k8N7l8N5n4j15N8M1j2N8j61L6J09n8N9j4K3j50N0P8n1o9j3O6K9j1
6725b4Q9m9j8N5j2q2j4K9r2J12j06N9n9J64l4p0J74l4k35J54n4o5O2j4K5m3J33
6752E1j32J33K4K2j11r3Q8M2j02j1J62l1J7j49J25R5m1l6n5Rr0O3q6K40r3MjJ
6780D5L0j29P2Q5j10L1L4j9n8Nr3J71q6L3l1p0J47k47K24M9l9M9M3j86L2Q5l1
6807C6j30J80K5Qj95P2R1j32M3m5O3l5q6J15N0j43L9J90k68J78p5K6J6o7P7j09
6833g6O4M5Q5j54J31o3o1N7j7j0n1J64j29k1J8J10j59J21j0m8l9O3j6l9J9J48
6859A32k13P4k0O2oO7NMq0P3Po9P9p5n1qj2m0J68p9r9R3j30J08L5j14K01j52L0
$$ plain form
6670 -38 41 17 -67 78 -42 25 -68 -58 52 -102 -5 47 -77 -95 -17 -23 7 -39 39 -2 -69 140 26 55 -16 21 6
6697 6 -73 31 3 60 22 77 23 -92 -34 7 -5 53 -108 -72 37 -21 38 24 47 -103 -53 25 -26 -95 -108 -42 -13 -24
6725 -24 65 16 -2 53 41 -41 -55 -26 -118 -6 -112 -53 -112 52 18 -52 122 88 -147 7 -47 -112 -50 -64 -39 -82 51
6752 51 -81 52 76 98 -13 -106 -18 24 -78 -89 73 42 59 -90 35 130 89 53 -2 7 -83 -20 -106 134 41 45 44 45
6780 45 75 -54 18 103 -7 24 58 39 -19 -14 -107 64 -22 11 -20 -90 57 -190 34 83 44 93 136 -50 -18 67 36
6807 36 -94 86 111 119 -76 -4 87 -45 -2 -47 16 -19 -105 10 60 -83 -44 146 -122 56 -19 7 23 -44 33 -76
6833 -76 -12 33 118 -36 95 32 -29 28 11 1 -50 114 -15 -36 -18 92 -67 54 44 -4 -43 20 4 -35 -16 132
6859 132 -81 -7 -27 35 29 96 101 105 25 98 105 36 115 40 -11 -19 -31 -71 97 18 -81 12 -118 -10 25 -89 112 -40 -10
6888a0L9M6J4n7O4j65P4j5m%j13P7J37j3m9j1ROo7Q6j0P8p1M4j19Q3L4J9j76P5
6918Ej9K7jP0j50J13Pj65J68o2LK1p0R%P8J3m1j1q6J60p3P6j73J47j10J0M0o0
6947g4M0P6l9q4J6m1P9Pn8J15m2N8j49P1L0N8p0J66j32pJ15j09O3j88J19k1J35
6974A34o2j20P1o1rQ0j28J19L8n4M4r5jNK0p4K25j29o2J08o7R5j42J26Np8j15
7001a27R7Q4m3o3J12lLo3m7m7J41j3l9P6J0l6j05J40j24p7P0L7K8j00J14m3m5
7028f3k1P2O0K9n3k3j20J00J41k03Q1M1K5j03J11k2k3n6Q3l9j0N8j15J39j31p8
7054a20Q7J25jp3P8j81M1j9K6N0j1l5J28p7p8J1m5P7K02j65M1j02J00J8k6m9l8
7081c6M3m2L5jm3L7j3j3MK3J08p7qL7k8K2nj2m9O5N8j43J67j00J2j38N9K5K1l9
$$ plain form
6888 -10 29 75 89 32 96 -69 5 -10 -14 -14 -127 -50 87 74 25 14 23 29 -38 48 38 116 45 89 -30 53 87 106 -70 5
6918 5 -14 13 12 82 -68 45 52 -113 55 -7 -4 17 -53 -44 -44 34 47 6 -5 -91 69 -4 72 -101 46 -64 -54 -14 -74
6947 -74 -34 42 3 -81 -65 -106 -27 -20 -78 37 -5 53 -96 -25 5 63 -7 159 27 20 135 26 89 -99 20 -1 134
6974 134 72 -48 23 -38 -47 33 -95 24 62 8 52 -43 -44 -39 -19 -93 132 3 -59 49 -18 77 -65 61 66 -12 -127
7001 -127 -30 54 11 -52 60 57 60 -3 -50 -97 44 31 -8 68 78 42 -63 77 -47 -124 -54 -17 11 -89 25 -18 -63
7028 -63 -84 -12 48 77 24 1 -119 -19 122 -81 0 41 66 -37 74 52 29 -27 56 17 7 65 -50 89 -42 -120
7054 -120 -33 92 91 18 96 -85 -44 -63 -37 13 2 -33 95 18 -60 -49 -94 -17 185 20 61 -41 59 77 51 2 -36
7081 -36 7 -35 0 -1 -44 -7 -20 -33 -29 -6 102 25 17 54 26 48 43 31 -18 47 105 -38 129 29 41 -97 -38 -13 8 -31
7111c1N6K6k7j26J21j0L2o2k2R0K3R8j01m1Pj26L8J23j6j34J31r3J07m6Oq0J43
7138H6k17J22L9j30J57j31J43j92J51n8K2J37j80N2o6j1Q3J07n0o5j37J09R8j41
7162g2L6O3r2J6pJ02J7L2o7l0L5r8N8R0j4j12M6N0j06L1J2O9j26j2J24p9l4J5
7190e3m2K27j78l3j0J61n7J7p8n7J69j19P3M8j14Q6n3m6J00j2o1J11k3Rn5j4J05
7217A01j17J38r7j08R4j26L8m4J48k9l4R9j23O7k0j00J55m7J58k49o0K03j36O8
7241b1J73j31q4J3m0Q3J07j13o7L3J7J25r1kJ14q6o1P8j03J31j51Q2m5L2O1j34
7267h0J22r3R9m2R0j54M5J04r5j17M9J03K0j27K1R3J9j4K6j1j58J65p2K5n8Q8
7293D8j4P7k10J61Mn4L7p3l4N5O4r6L2j2q4J39j1L2n9o6O6RJ1j42K62k39P6J5
$$ plain form
7111 -31 25 51 24 -102 19 9 41 -21 -43 47 70 168 67 26 33 -93 -55 68 52 -82 49 -44 63 17 23 -57 86
7138 86 -131 -9 30 -100 57 -74 69 -123 28 -30 -8 129 -51 1 -65 -76 7 114 64 -1 -138 -29 69 -72
7162 -72 -36 27 -65 -49 -56 46 63 95 28 -2 33 -65 -7 83 69 -43 3 53 -53 -22 -10 59 -67 -79 45 -34 -68 -53
7190 -53 -95 132 -46 -79 -89 72 15 32 -46 -103 66 -53 20 68 -46 40 -13 -59 41 29 -32 79 56 65 10 -4 101
7217 101 -16 122 25 -83 11 -115 -77 -121 27 -2 -36 63 -60 7 -13 -113 42 -5 153 -96 -156 47 -89 -21
7241 -21 152 21 -63 -50 -90 -7 100 -13 -80 -47 -30 95 4 2 116 30 -31 47 -56 75 -76 6 -39 -7 54 -80
7267 -80 42 -51 48 6 96 -58 -13 91 -4 -121 -72 31 51 -76 -55 38 57 43 69 58 -100 65 -7 18 -40 48
7293 48 34 111 -99 62 66 12 49 -24 -58 -3 61 -35 -3 -15 -99 40 29 61 2 -64 2 11 22 -120 142 -97 -21 -6
7321fQ8m7r7J17j81J55m4M6n6o6N3j5J2K9k9Q7p0q5J45j11M0Q9j31pRR4q4K2Q9
7350D6q2j8J38jj6K6j00NP2o2K3K4q3J35k53K16p5P7j13Q9k7L0n6n2L2M9J0pj17
7379i0K5J38q0P2j12J25J8j06k2J3J06j08O0n7%J33j29O3j40J30j38J46m2l8m
7404c7J29j52J42j1n7J9M7k22J55o3M7J4l8M2%n3m6qRR9M0o7R7J7l7j82J81p2
7432glJ89j67K5L6j10J8J2o0J05n0Kj6J9l6j3M4j7J12r8j6k0Q2M0j32M7P3j46
7460h7J42O2j64J51j02o1P8q2L9O7j24J11j10N5M3K4j0n0k5o3J82no4rM5j08k
7487f7JL7L2o2J02L1p4j01M1M0o1R4J7Kr6J87q9j60Q0R2L4o3l5o8J65j37J4O3
7515A9M5j39J97j98J28p3Q1%j0q8M3n5l4L7P9k5J5r3m0J4J6L4q3K46J6k02J39
$$ plain form
7321 -6 82 35 -62 55 -126 29 -15 31 -25 -91 -38 -53 -41 -12 -41 46 -24 -109 36 -75 -35 54 -77 -84 -75 19 -65 -43 46
7350 46 -36 -54 84 83 67 93 -7 -2 70 8 31 55 -28 107 -146 70 -5 72 -41 48 21 51 -5 -57 -25 24 34 27 -90
7379 -90 -65 73 -7 65 -47 78 96 -10 -32 -19 87 -21 39 -18 -18 115 -14 49 -91 39 -99 47 5 -33 -37
7404 -37 92 -60 82 71 14 33 80 -142 13 -50 -3 11 -27 15 15 -38 -84 -92 -83 16 56 -11 86 103 66 -116 65 -7
7432 -7 -10 179 12 37 73 -37 -19 -7 -67 38 -12 -10 -26 -7 -43 -56 -12 -29 83 -15 -31 -51 31 71 -61 -14 59 -87
7460 -87 55 117 -47 104 2 -59 19 -63 -24 43 -81 30 -80 -25 18 42 32 -18 -43 -106 76 71 7 -2 43 -65 -67
7487 -67 -66 -29 3 -59 43 74 0 -101 -60 -20 -81 13 30 32 -64 123 34 -126 -46 46 80 17 -18 -86 79 -58 -44 19
7515 19 64 -75 122 -76 52 -21 60 60 50 -38 5 -50 -84 -47 32 7 22 -71 -111 -97 -81 -47 -130 116 132 -70 69
7542F9j53J04rj12Q5L9k9l7PJ26j51P4qK5K1j71O1L4k3j9J21n7m2n1K5JM7j2L3
7571bK8q5K0M5N4j2P0j21r6K2R1L1k0Q9j67J31j23L7l6M1J37j04q7J88m1p7L3
7598D6j18N8M0l1O5q7K3j0oqJ08j23L3n6Q8j39O9O4j4L6O6o6m1p1J19q3J10jo7
7627DK7o5J28o7j3P1l7nn5k4j6J3l4J53o9l7J15o0r6J17r7K4O7Pp0J19j25j9O7
7656B3rP1j8l7n9J2JM0k3J0q3J48j25QJ03n1j01J09j8n4J63q6r5N0j24K14j44
7683g5R3M7m9J7l6K7kl4noq8J52o7%J2p7J12p7L4k3J7L4J0l9M3l8l2O5m2N5j09
7714h1Q1LO5m1j2n4N9m9J11j36m1Q8J00j42J1L0Q2n0o6%L6l7K0r0J35l2J1n2O4
7743A3k9q3P7lL3l0J46l6j42R2j02Q7kj22J53q8K6J2k5K5J1j5o3K0M6j11K36j91
$$ plain form
7542 69 -84 20 11 -101 -16 23 -6 -43 -36 90 -61 13 5 30 51 -120 -59 -25 -48 -67 54 -3 -45 -96 -71 -70 -23 -35 -2
7571 -2 26 -59 -39 6 60 48 118 -3 -99 -77 14 45 25 114 -53 78 -45 -8 -44 -3 134 30 -57 131 90 13 46
7598 46 -72 -14 26 -5 60 -27 -4 -14 -20 -28 80 -43 -10 -66 22 -117 -48 16 2 38 104 38 -3 -74 45 -38 72 71 4
7627 4 31 -34 94 27 14 85 48 43 -12 -36 -52 -39 -73 80 11 -26 89 29 -67 50 -47 -23 44 51 -19 100 -25 -44 23
7656 23 14 85 67 30 -29 -17 -16 24 1 11 -72 76 -49 -41 62 11 -90 19 1 -53 110 24 -71 -21 -145 69 -75
7683 -75 18 65 16 33 -3 24 22 -12 -17 -23 -111 41 -26 -26 -14 -91 21 -56 -22 -45 -28 6 16 -23 20 -18 -50 15 -27 28 -81
7714 -81 0 3 68 27 15 -39 20 -29 82 -54 -95 -7 93 -49 -38 -8 74 24 -42 -42 -6 -43 -23 -113 22 -10 1 -51 13
7743 13 -16 -99 -22 -25 8 -22 124 88 -54 38 -64 23 21 -101 52 -36 -10 2 -23 2 13 -2 -65 -45 1 -110 126 -65
7771f5J39jj26J49k6r7o4O6q0L8J15j06N4j1J06j62L4J17L3j43Ql7R1n6j1L1m
7798hqJ61k36J06K1m1J5k5k9Lrj0J7qk7J19j14L8L3Omj01J26oj44R5N6KrL4l3
7829B0r6J52j42P6l2l9O7m5J32m9K9q9k6P7l8K2M0k4j20J39k3o0Q4J2r3J7P6J6
7857H3o2r5poN8O3Q2j23Q5j67J6k0j7pP7l8K4NO1n4P1j5k20J79R4q1N4k9Q4j28
7887c3M0M0q1L9Q6n7j4n4j13J24j0Q0J5l6o3J49r4k6K1M6r3O0M4o7O7l8m6K6l3
7916b1r9J57m1MKJ4QJr9K27j67J2l2l2O1QJ94j46L1k7k7l4M2o3o1R7M0n1l6J31
7946I3k3j31J20j24P3j8m0Q1J3L3q8N5j35Q7Q6n1N9k9m9k2o6J10K1p1K10j04k3
7973F7p4o4J20j25O3O3j30L6Q7r8L9pK8p4K7l4J94r2l0l1M2K2j4J0r6Q3k1K0K7
$$ plain form
7771 -65 74 73 -53 96 70 -27 -91 -25 -105 -67 48 -58 -4 -15 91 -71 -37 80 113 -30 -22 -59 32 -24 -35 -4 -8
7798 -8 -16 145 -91 15 36 -5 10 -15 -44 -41 -50 -60 -43 -51 -78 41 -73 -35 -2 4 0 -101 25 19 -125 -30 26 28 19 53 20
7829 20 -76 76 -66 10 -22 -61 6 -39 93 44 73 -16 -42 35 -3 19 59 35 -85 54 31 -29 55 67 -26 -9 67 83
7857 83 21 -74 -81 -87 -29 34 116 -7 78 -89 -73 -93 -110 -117 -40 -78 -54 -49 12 -42 29 14 -206 -27 67 -14 40 11 95 -33
7887 -33 7 47 -34 5 91 34 20 -34 -147 -23 -33 47 62 26 -37 112 18 -8 13 59 -34 26 70 3 70 32 -14 12 -21
7916 -21 -120 37 -4 0 2 16 24 25 -74 153 -14 -2 -34 -66 -5 3 197 51 82 55 28 -6 36 -27 -88 9 49 -2 -38 93
7946 93 70 -61 59 -65 8 -10 -50 31 44 77 -11 44 -91 -4 82 31 90 61 12 -10 -76 34 55 -16 194 90 67
7973 67 -7 -71 49 -76 -13 50 -80 -44 43 -55 -16 -23 5 -69 -42 -76 118 26 -4 -35 7 29 15 25 -71 12 -9 11 38
8002C8J2mk5j4kml2J0n8m2J17m7R1m2qk0K8j1j4l0J22q2q9K3P1Q2L9q9j10M1J9
8033c0N6pJ4L3Om7Jk8O7j12RQ8j29J00l1q1kJ01O8l7Kj41K06r3n7j0J28o9j3j1
8063a9K0j09J02k1Q4m2j34K04j07J88q0k38J78p4M5r3M9J73k56R5K6l6RM7j66
8088a55Q2M3pR7pn3M0L5o4J2J05l8j17j04J88m9j01R9p4R9l9Onq2M1lm6N4K5m4
8118f2M2M0r9R2J5j00J83j60M5O9l5p2J30j30N3O5J8j8J01j97m8J17l0o1M5M8
8144E1J0q7J33j16m4K33k59J18Jl8J5r1J8L6N6J23j49j6m7K3J3qL8O8n8m5N9j53
8172a16J63q8J7n3N7M5o2J26j38J77j80K6J43j44J9K6j1M7Q
$$ plain form
8002 38 50 46 21 7 5 1 -31 -21 -79 -121 -4 -51 40 -2 -10 -30 -2 -13 -27 -57 65 -17 -106 -83 -12 70 109 20 -90 -49 -30
8033 -30 26 19 33 66 72 25 26 -2 65 -47 -38 50 -79 21 -10 -91 -93 8 76 39 41 -100 106 13 -44 -54 74 5 -8 -19
8063 -19 1 -108 -6 -27 57 15 -119 85 -22 166 86 -152 26 -48 -3 -96 -47 126 -130 -35 -9 -45 -36 11 -155
8088 -155 -73 -30 -37 60 53 0 40 75 11 23 128 90 -27 -131 57 8 -93 6 -68 31 -8 -2 -7 -89 -48 -51 -97 -43 -18 -62
8118 -62 -20 20 -79 13 28 -72 111 -49 -4 65 30 -42 88 -42 11 76 94 76 177 -20 -68 49 19 -42 3 51
8144 51 61 -26 107 -9 -53 180 -79 39 40 2 17 -74 -56 -20 36 159 10 -6 -53 -30 -17 -25 13 81 23 -22 37 -116
8172 -116 47 -41 -24 -77 -20 25 -37 89 -49 128 -52 -26 117 -27 -8 18 7 54 62
8191F2
$$ Imaginary data points
##PAGE= N=2
##DATA TABLE= (X++(I..I)), XYDATA
0@%%%%%%%%%%%%%%%%%Qj6J6j6J6j6K4l2L2m0M8n6O4p2Q2r0J04j20J36j52J68j87
39i9K11k36K62k92L24l56L95m37M78n29N84o42P09p83Q62r50J053j170J300j450
59g66J629j843K103k425K839l399M194n429P624j2694M8748J3712o1934O783j0868
74a1726k9690m881L3866J5896J5253J4131k197j6382r977k2653j7706O925J2929
87a6212M757K5099K5572p458j9068l509j6974k6487n79J9022J2339J7044J7648
100C1194l116j3740o948j6245k0782K144J5346O956J1428J7935J282j1314p007
113G133j3429j9819j686J3376Q052J0749J8743M934j1527j0892j2116j5038k281
126b3801J0122Q508J0920J4564K234q873p431j1455j5222j388Q985N062R397J7506
$$ plain form
0 0 0 0 0 0 0 0 0 0 0 0 0 0 0 0 0 0 0 8 -8 8 -8 8 -8 16 -16 16 -24 24 -32 32 -40 42 -48 56 -64 72 -80 88 -99
39 -99 112 -124 138 -154 170 -186 209 -228 250 -279 305 -337 372 -411 451 -499 554 -616 684 -766
59 -766 863 -980 1123 -1302 1537 -1862 2332 -3097 4527 -8167 40581 54293 -7641 -858 -11726
74 -11726 -41416 -46297 -12431 3465 18718 32849 30652 14270 4293 -18360 -36066 -29141 -16212
87 -16212 -11455 13644 39216 31758 12690 9181 -7793 -34280 -34859 -15837 -3498 13546 31194
100 31194 28078 14338 7390 -8855 -29637 -27493 -12147 -5191 6237 24172 25454 14140 7133
113 7133 -6296 -26115 -27801 -14425 -6373 4376 23119 28053 16526 5634 -6482 -21520 -23801
126 -23801 -13679 -5171 5749 20313 22547 13674 6243 -5212 -20434 -21822 -12837 -7775 1622 19128
140A9128N260j0413q097p976j4426o138P758Q554R353J3811M376q105p476p842
154b233j3084n196O891P218Q066J3031N225o468o312p261j3056o521N753O868
168g079P232J2276O132n391o243o643j2155o526N511O669O203J1131O304m419
182A3002n868o318j1142o511M006N391N783J0537O944l368n256n689j0151o698
196a5338L270N302N580R444O584k554n150n489r317o368K084M615N244Q885O572
211A3364j429m725m838q452o659J167M499M794P934O451r18m221m865p620o236
226a1754M29L966M807P544O253q8l555m454p180o249j04L189M288O721O069L47
242A0229l208m432o273n834p68K991M055O413N726R23k385l868o232n907j037
$$ plain form
140 19128 24388 13975 5878 -2098 -16524 -22662 -14904 -6350 3003 16814 21190 13085 5609 -2233
154 -2233 -15317 -20513 -13622 -6404 1662 14693 19918 13450 7138 -123 -13179 -19700 -13947 -7079
168 -7079 153 12429 18561 13170 6927 284 -11871 -18397 -12886 -6217 -14 11117 17421 13002
182 13002 7134 816 -10326 -16837 -12831 -7440 -1657 8880 15824 12456 7200 1511 -8640 -15338
196 -15338 -12068 -6766 -1186 8258 14842 12288 7138 1649 -7668 -14036 -11952 -7337 -2093 6792 13364
211 13364 11935 7210 2372 -6080 -12739 -11572 -7073 -2279 5655 12106 11188 6967 2102 -5518 -11754
226 -11754 -11325 -7359 -2552 4992 11245 11157 7602 3148 -4032 -10281 -10385 -7196 -2908 3813 9882 10229
242 10229 7021 2589 -3684 -9518 -10286 -7295 -3240 3173 8899 9822 7437 3569 -2663 -8570 -9607
257i607K593L551N629N763J585k627l724n092n334j850K091L839N250M972J679
272H718j600l507n314n049j733J519L022M896N283J770j429k977m311m962k007
287g681J304K730M697M609J908j059k753m159m846k332Q20K857M014M388K424
302F921m26k502m121m127k235L85K259L926M065K270l64k260l629l925k379qK237
319c913L682L697K312L21j866l589l791k357j50J782L093L717K495J09j935l160
335D47l065k395o29J769L221L146K099Q75j307l167l113k330p47J354K616L111
351A885K421O57j287k641k656k297j013J198K636K828K152Q72j039k389k673k117
367c463j193Q68K411K395K250J097p04k250k415k043j229O46K272K289K070J183
$$ plain form
257 -9607 -7014 -3463 2166 7929 9514 6887 3163 -1929 -7263 -9113 -7022 -3183 2067 7039 8718
272 8718 7118 3611 -1703 -6752 -8485 -6966 -3944 952 6235 8005 6576 3599 -712 -5674 -7681
287 -7681 -6377 -3647 1050 5659 7567 6508 3755 -404 -5250 -7582 -6762 -3905 109 4497 6921
302 6921 6495 3993 -128 -4255 -6490 -6105 -3846 80 4145 6415 6051 3791 162 -3763 -6142 -6150 -3913
319 -3913 -231 3466 5778 6099 4233 644 -3147 -5504 -5654 -3872 -779 2938 5433 5542 3607 447
335 447 -2618 -5013 -5642 -3873 -652 2494 4593 5468 4161 994 -2119 -4449 -5196 -3842 -1226 1885
351 1885 4306 4963 3676 1035 -1621 -3918 -4931 -3733 -1097 1731 3883 4755 3716 1327 -1346 -3463
367 -3463 -4656 -3788 -1377 1018 3268 4365 3661 1411 -1004 -3047 -4276 -3630 -1358 931 3001 4184
383D184o15k095k297k065j045M35J898K119J877J336k24j945k040j649j390R7
399c419J948J915J597J540k60j768j860j820j320J65J611J891J680J372L6j623
415A685j650j629j498j15J591J542J532J362K55j466j572j372j495k23J368J577
431a08J457J313K26j192j363j403j452l07J157J364J181J516M31j199j311j177
447h67j258n62Q81J448J190J289M52q56j212j034j446o17P25J208J119J267N63
464B290o42j057j074j102o57N90J020J170J000P03m96j186q96j242o04M20J030
481g33R38J115O64k97r17q18j136q53L82Q89P77J096Q42l17q95q40q54q25N6Q68
501h58O97J181Q19k63p49o18r50q68R5O82P07Q76P64M4q16o64p34q12r3N64Q01
$$ plain form
383 4184 3569 1474 -823 -2888 -3933 -3498 -1600 519 2396 3732 3508 1563 -477 -2126 -3516 -3419
399 -3419 -1471 444 2041 3581 3321 1553 -307 -2127 -3447 -3282 -1671 220 1900 3272 3308 1685
415 1685 35 -1594 -3092 -3207 -1616 -74 1458 2820 3075 1609 37 -1335 -2830 -3053 -1685 -108
431 -108 1349 2662 2888 1696 333 -1070 -2522 -2829 -1672 -308 873 2389 2820 1621 310 -867
447 -867 -2125 -2687 -1806 -358 832 2121 2573 1717 505 -529 -1975 -2592 -1867 -659 460 1727 2290
464 2290 1648 591 -483 -1585 -2242 -1652 -632 538 1538 2241 1745 559 -337 -1579 -2183 -1763 -733
481 -733 205 1320 1984 1687 770 -48 -1184 -2037 -1655 -766 11 1107 1949 1632 737 -103 -957 -1782 -1726 -858
501 -858 -161 1020 1839 1576 827 209 -741 -1609 -1514 -832 -125 751 1515 1559 743 79 -655 -1467 -1560 -996 -195
522a95P01R39K0n78n60p06r36%M97L33P75R03J83o17m28o02q49n8M33L93N49R14
544A111K48m57n38m99r04j28L24M38N40P80K12k57k85p55o95k02J95L06O22P02
564G58K89k56m57l87o75k69K77J40N55P19K69j89k01l92p84l48J84L17L61O90
584F01L42r2m98k17n84l63M9J17M92M98L63J70l39j89p54l98M4J73K93N85K71
605E64R1j27j67n17n68l8J69K81N20M75Q1k24k34m14n29lQ1J74M09N67O2n9l60
628B34k45m46j70R6Q9M49M36J04J1j07m91l17j50M3o3K89N76J18J05k01l39m30
650d09r0N8J20J67M76J73LLl36m21j27oM8M9N00L04m6j3k38k69k81j42o5K62L40
675F0L74R3j58j07l29l74J9KJ22M54J73J92k4l01k06k87j44O5R9K69L21K6J91
$$ plain form
522 -195 506 1445 1465 887 327 -379 -1315 -1315 -818 -485 290 1193 1376 759 331 -271 -1120 -1178 -745 -352 197 1111
544 1111 1359 902 364 -135 -1039 -1167 -843 -405 135 915 1127 870 585 -170 -865 -1067 -872 -566 56 758
564 758 1047 791 334 -53 -728 -997 -720 -580 -25 694 963 774 573 181 -603 -951 -767 -450 -89 601
584 601 943 851 353 136 -448 -811 -762 -645 -153 345 708 878 539 350 -404 -802 -758 -585 -292 293 564
605 564 655 528 361 -156 -724 -762 -593 -312 208 683 764 540 306 -108 -637 -640 -559 -385 24 591 653 594 234
628 234 -11 -457 -627 -531 -442 7 443 547 558 451 -40 -357 -507 -464 -527 -238 338 456 561 360 21 -409
650 -409 -499 -441 -321 -154 322 495 498 501 165 -256 -383 -389 -341 -292 208 512 466 453 215 -54 -335 -477 -542 -280 60
675 60 434 527 369 262 -67 -441 -422 -420 -298 156 329 521 497 196 -10 -297 -441 -376 -277 -8 313 339 530
698E30j71l74j97j32j02O1L40L15Q8L0l2l12l35j20M0o5K85L19K04R1p8l06k00
721a21j59j00L7J92J65L48oL2l09k23k73pr7L38K87J68K05jk75l41n6j05j26J77
745b50L59K28%J58k49l27j35j63j05K24J88L72l1K50k31k32k66j43j38K25L19
766E3J25J36J55p8l72k34k04o1K23J97K02J72J00q3k09k74j77m9J7L35K54J72
788D00kk8k06k39k10j92K04P9K32K55N6O4l20k01k31P3n2K54K15M5K34p2j12l37
812i1j55j09Q9J42K51J21J94o0k66j75k13j31J16P4L56O5J04J05j57k36k05o3
834b44PP1Q5L04M8J31j93k14k70j39L2N2L32R3J83K3q1j32k34j09n3P8K77qK34
859B73L0L5l14k08l8j40P5J26L07K59p0j08j87j41j75q2J18O2K18K31K3j93j03
$$ plain form
698 530 359 -15 -212 -344 -446 -385 -45 270 358 388 356 44 -291 -411 -371 -436 -151 168 372 463 385 79 -121
721 -121 -280 -380 -343 -151 14 362 356 388 79 -144 -417 -424 -521 -183 104 272 477 476 201 -140 -196 -301 -427 -250
745 -250 109 337 337 495 246 -81 -216 -379 -484 -260 -72 300 269 519 288 56 -210 -353 -491 -266 53
766 53 178 314 469 391 19 -215 -419 -480 -257 -60 142 314 414 331 122 -152 -329 -378 -361 -26 228 400
788 400 398 370 164 -75 -285 -477 -273 -194 38 293 349 413 93 -108 -339 -266 -318 -64 151 196 430 358 246 -91
812 -91 -246 -355 -266 -124 127 248 442 382 116 -59 -272 -403 -287 -213 143 208 312 417 260 24 -181 -244
834 -244 -237 -166 -81 223 271 402 209 -5 -275 -414 -382 -330 2 95 278 301 220 88 -146 -255 -308 -230 47 39 273
859 273 303 338 24 -184 -222 -362 -287 -161 146 405 335 227 40 -101 -276 -358 -240 -178 40 271 294 101 -2
882bp2o5j69Q6J14J56J30J63l3l58O9k69k7r0K74L1J80R5K6P5l92k28NQ9R9Q5
908b8J99J23n0j77j98n2m2n8M9J44K39J34K4j14n3l81m7O4l4L45J11nO3j26j66
933c6k06k34K18n9K92K18K7R9j25j43j55j04l4J07P7J48R5M2L2j38l46m3R6rK12
958C1j6K24o8p1j10j72l4r0J39J33J31J99m8jj54j15j49j0P4J35P4J00J23k44
982H1oj62j17n9J02Q3Q6J11J89j25m7j45j73no9J11K53m1J92l0o7k40m9j17P8
1007a66K5K79O7j2p9J5j02j23j14R9l0K40J5P0K6j93rk64nO7P9J99J12M8j3qj30
1034I3l19J23q1O9P5O9J51p0k5j11j11r8K3K0K64K7P8m5p5k01O8k4j49J90J44
1059H5M5l5J35j10n9k30K3J2j8J91L9J55q5o9Kk28kj4JJ38PJ36N9j16k0j29j06
$$ plain form
882 -2 -74 -139 -308 -222 -108 48 178 341 308 -50 19 -250 -277 -367 -93 -62 118 213 239 314 -78 -306 -301 -212 -113 -28
908 -28 171 294 244 67 -131 -183 -225 -283 -234 -90 149 283 307 193 140 -241 -288 -224 -258 87 198 193 256 130 -36
933 -36 -242 -476 -258 -317 -25 193 220 319 194 51 -104 -208 -242 -135 -58 90 185 227 259 121 -225 -268 -172 -181 31
958 31 15 239 171 100 -10 -182 -216 -306 -167 -34 97 296 248 247 93 -22 -171 -181 -107 28 102 202 325 81
982 81 75 -87 -204 -263 -161 -78 8 119 308 183 136 -9 -182 -187 -256 -145 108 67 259 229 162 -78 -127 -244 -166
1007 -166 -141 138 205 193 114 129 27 -96 -210 -111 -141 99 114 184 210 17 8 -256 -261 -194 -115 84 196 244 231 223 93
1034 93 -226 -103 -184 -115 -40 29 180 110 85 -26 -137 -235 -212 -192 72 99 177 132 57 -144 -76 -100 -249 -59 85
1059 85 130 95 230 120 61 -169 -146 -134 -152 39 78 233 148 79 81 -147 -149 -163 -162 -24 -17 119 178 62 42 -87 -193
1086a93P6N5R7M3J64j16j42K5q3q1n8R9K7R3Q1Q1R8j80k1j5j92N6P4J75Oq1J07
1113A95j82r1r0L6j22J64J35J75O9k47N3q2j28j3j08K17R2L9M0l4q1l1k20P4O
1138a34N2J28P4j1k8O9j95k6k7J2J3J23J07J7j0j46l7j10k2L2K8J02P1J47q8j15
1164B6j02N4j04PJ34L1L8N8N5j71k2k15N6J25n8J16k6J76j6n3j52P9k00R1J2N2
1190iR1j7K8r6j35J59k85K52q9J79rk0Q4o6j7L2j46K8j44J19J71L5J9o0k0k13
1216a29O1q1P5M0J76q2L3j6j06r6p5L0J19P1o8N5M3M4n5Q0j47m3M8R0k5N3n5J29
1244A69j41j10J34r8N4MQ2N9l7l4j5j8n7j70J32m4J30m6J20K3j80o1m2L5J00J
1270a0R7L4k7l8j03k7j08R9J1n1J81k4M9k1j20N7M7k08J46o5J9J79m6k4N6k5r2
$$ plain form
1086 -193 -117 -62 35 78 242 126 -16 9 -74 -155 -213 -114 -87 6 87 168 266 86 65 50 -142 -86 -12 163 169 88 195
1113 195 13 -78 -168 -132 -254 -90 45 220 289 42 95 13 -115 -128 -236 -19 73 112 152 118 37 6 -214 -140 -134
1138 -134 -82 46 120 109 81 150 -45 -71 -98 -86 -73 50 157 174 164 18 -19 -129 -151 -119 -91 11 82 229 141 26
1164 26 -76 -22 -126 -119 15 46 84 142 197 26 4 -211 -155 -30 -88 28 2 178 162 109 -43 36 -164 -73 -61 -9
1190 -9 82 65 93 -3 -138 21 -264 -12 -101 78 69 49 133 67 50 82 -64 -36 -180 -61 110 145 164 104 84 -129
1216 -129 -68 -149 -74 -34 142 60 93 77 -29 -125 -200 -170 -51 20 -48 7 50 94 39 119 -28 -71 -23 67 42 95 40 169
1244 169 28 -82 52 -46 8 12 94 153 116 82 67 49 -8 -178 -46 -90 40 -6 114 137 -43 -104 -146 -111 -11 -10
1270 -10 87 121 94 56 -47 -74 -182 -83 -72 -123 58 34 83 62 -58 -1 46 -162 -16 -81 -62 117 71 47 103 78 -14
1297a4pq0R7N3j03L9Q2M3j89m7R2m5n9K29k5j08J33n3k71J22J42r1JQ0K7N8p2
1324C4j70K43j17k9q2R9m3J89j8m4j00J98k31K4L5Rq2J02P7J9mm0k07N9J43p3
1350il3R8N9mj14O3Qj52J53k05J39o5J66Pj02J50k26K1K4k4J6R1O7j03j19O3Q9
1377E8n1Jp0J86n7Q6n6M4j29Q4nj37P1m0L5M5j16J24L9j36n7N1j2K4Q1K9on8N8
1406H6j25m4N4J0L8m6R6oq8J08j4q0L2j13P8J23j56J77j11k6o8J16j28L4J35L9
1432A21p9M%k9o0L5p4N7N0n8J53k00J78m7n0nl7J20q7j7k8L6p1J80j70J27l9o1
1460e1L6l9J99j21K7l5Nj08O1K0M6K4j19N8R1o7l6j11J9J99K1j52N7J9l4q3k0
1487i4J24m5n6m8K19m9n4N6O0j39jO7q9m9J54N1q2J34j65LK3k2o9R2J9oj61J3
$$ plain form
1297 -14 -21 -101 -4 49 -54 -15 67 110 -79 -126 -34 -79 -138 91 66 -42 91 38 -233 -111 31 -60 -59 21 48 106 34
1324 34 -136 107 -10 -39 -121 -22 -65 124 106 62 -38 160 -71 -47 -12 -3 -85 17 94 113 109 69 -138 -79 64 -9
1350 -9 -42 56 115 111 -3 60 68 -84 69 -136 3 -62 104 111 9 159 -67 -46 -22 -46 -30 61 128 25 -94 -31 58
1377 58 7 8 -62 124 67 153 97 141 12 96 91 -46 25 -15 20 65 -51 73 112 -24 -81 -30 -42 -18 63 92 86 28 86
1406 86 -39 -83 -29 -19 19 -27 69 63 -25 83 69 -11 21 -92 -14 109 -47 130 19 -7 -75 41 -87 -53 82 121
1432 121 42 46 46 17 -43 -8 -82 -25 25 -33 120 -80 98 51 1 -4 -41 79 -8 -25 -53 -17 -88 92 -78 49 10 -51
1460 -51 -15 -54 145 24 51 16 21 -87 -26 -6 40 64 -55 3 94 27 -9 -120 -101 98 119 -33 24 43 9 -74 -94
1487 -94 30 -15 -71 -119 100 51 -3 53 113 -26 -27 40 -49 -98 56 107 25 159 -6 -3 20 -2 -71 21 40 34 -127 -114
1515a14L08r3j22j07L7M9m6J48k9O1J4j89J10j24R9K1m8M5J6j3P1o4j47J62L2
1540G7k87J55Q9j2L1p7J08j82k6ON2K18j09p4J52k01J25m8M8o7n6N5J5q6J70j05
1566b9RL8Q3j26q3J02R1nq6P9jj21p8R3M6r8K7Q7Q8o5k6M2n2r5P6P7q4l6J39j71
1596g9N3M4Nj12J38K7mj34P6P3j00m6N2M3j02j0R9l4J11j61J78j99J74j47k8P1
1622a2o1K14j93N6n4R6J7o6n5R8k2k8m2J23j50OM6L5l3J22r7O8j29K02j48r9K44
1649A38j36J7m3J7L0l0K2n5K1L7R6j25j5nk6Q1Rj07k6J37r0Q6Ko2R2j00J20n1
1677C4n1r2R5J21n8k1j04R0kk1Q4o1q1P9r0J68Mj63J12o6J9k0j16J60Np3R0Pk4
1706B5m2qnJ8j8PK9rJ4p3J32j06m6J50l6r3O0L2o5M9Oj12P9r1R7PP8j26P7K5R
$$ plain form
1515 -114 194 101 -21 -128 -91 -42 -88 60 31 92 106 -83 27 -97 2 23 -25 20 36 23 94 30 -117 45 77
1540 77 -210 -55 34 22 53 -24 84 -98 -124 -118 -66 152 43 -31 121 -80 45 -3 45 -22 -78 -23 -8 -94 76 -29
1566 -29 -20 18 101 -25 -108 -6 85 80 -6 73 72 -49 -127 -34 12 -86 -59 28 116 51 25 67 15 -80 -4 73 -11 -47 92 -79
1596 -79 -26 18 23 -89 49 76 72 -62 14 87 -13 -59 -7 36 -66 -76 23 -11 100 -61 117 -82 92 -55 -83 -12
1622 -12 -73 141 -52 4 -50 46 63 -3 -58 40 18 -10 -52 71 -79 -73 -27 8 -25 97 0 68 -61 141 -7 -106 138
1649 138 2 19 -24 -7 23 -7 15 -40 -19 18 114 -11 -26 -31 -57 24 33 -74 -100 37 -53 33 35 -27 65 -35 85 34
1677 34 -17 -109 -14 107 49 28 -76 14 12 -9 75 14 -67 12 -78 90 94 -69 43 -23 -4 -24 -140 20 25 -48 42 49 25
1706 25 -17 -25 -30 -12 -30 -23 6 -3 11 -62 70 -36 -82 68 32 -61 -1 31 -34 15 21 -91 -12 -103 -6 1 79 -47 30 55 64
1737F4o5J0j3p5J26P4q6p3Q9MO9m9k19J27k6j2N3lj1j26K96j31r2P8J34j85Q5
1764D3m9q2P3N7O0l3j20J4N0Q0r7n3N4k2P7K5j03k4kQ0M7o6j6lN0p7P6j61J0J25
1794A3L7M0p2jqQ5o4k2r5J44K7j30k9R5L0%n4qO4m0j07J04P4k5l1L4j42J67j97
1823a11J28K9J0m0j01J67q4o0M7P0p6%j3L5k0K5j3O1j21Q2p3Q4p2M4j9m1J17r3
1851c8K4q7P8O6j09K2J9Q9j64Q8k1n2O0N3K1M0j89J89j63J5N5l1pPM3O1m6l6L3
1880B0J08k64Q9J85r6m9q3J76o5k3j0j5N2n5J2N4m2J5m1N9n2k6l0k0R1Rj14J48
1908C3J0q2Q5r0P5j4L7k5P3q7pK4Jk6p1J43j28J20M4j48m5K26j21M1j18J33n7
1935B6j28J59l8k5j18J80o0%J2n4N8Pj21N6nr7KK23j42j14K51j04P1O2p5L9r5
$$ plain form
1737 64 -1 9 -4 -79 47 121 35 -38 51 55 124 75 -144 -17 -43 -55 -2 -5 -16 -142 154 23 -69 9 143 -42 43
1764 43 -6 -88 -15 42 102 69 -51 -37 13 93 -4 -57 -3 -25 52 77 -26 -50 -52 28 75 9 -7 -10 40 -37 39 -122 -112 13
1794 13 50 90 18 17 9 94 30 8 -87 57 84 -46 -75 20 50 50 -4 -12 52 12 -95 9 83 58 27 61 -81 86 -111
1823 -111 17 46 56 16 -85 82 -2 -62 -15 55 -21 -21 -34 1 -19 6 -7 54 -67 15 -58 26 -46 -2 -21 -62 55 -38
1851 -38 -14 -101 -23 43 -66 -44 -25 64 -100 -12 -33 -85 -25 28 49 89 -100 89 -74 -59 -4 -35 -42 -35 8 69 23 -13 20
1880 20 128 -136 -47 138 42 -7 -90 86 21 -2 -12 -27 25 -30 -18 36 -6 9 -32 27 -25 -51 -81 -101 -10 -1 -115 33
1908 33 43 -39 46 -44 31 17 54 29 102 15 8 32 33 7 -64 79 -49 71 115 -33 -78 148 27 68 -50 83 26
1935 26 -102 57 19 -6 -124 56 -4 -4 8 -46 12 19 -102 -46 -51 -148 -146 77 -65 -179 72 -32 39 101 26 65 -30
1962c0J3O0k3o4Q5j11K09j78r4J05jm4Q6P6m1L7j1m8r8p8J87O4j58M9QL6qo8j43
1991a83J43L6o7Q6K2l4m1J3n7J8kJ26o9l3Q0j09K3j9J01r9M0l0J95j90Kk4j6O
2019h2J8Q8j19O4J4L1k5J02RPj82J19Q7j18M9O1j41L8j9j6M0k21K78r6K3K7M9
2046H5q3%p%%lJ3K5P1m3r4L2K0m3K8J25q7rn1k9J18j54K0KK1R2J4k7l4q2K2K9
2078b9N3J7p0P8N1r2q1O4L8O8j80M1JM0l5K6M5q6j2O7p5L4P5q8R2n6om2K03k09
2108f8jJ02m2M9K2J9n5L0j27j2J14j47J98p3K1q6k4r3P4R5p3M6M3N8o3K0k4P6
2136G9m8k8o5R8k5r6J11R5k6j30p2P8K9qK3m9L4P8m3l7n4J25m4K7j1l9K2p5J02
2165E1K1j2j39o1J65M7k6r5j7oP9rO1j63J0Q4J92j20M1p8j46R6R7o2M0pm6QJ6
$$ plain form
1962 -30 -17 43 20 -44 41 -70 139 -39 -133 -28 -29 -73 13 89 48 85 74 26 -72 -150 37 101 -57 -8 0 36 28 -40 -183
1991 -183 -40 -4 -71 15 37 3 -38 -25 -82 -64 -66 60 -9 -42 38 -71 -48 -67 34 -65 -25 -55 140 -50 -48 -72 -88 -82
2019 -82 -64 24 -95 -31 -17 14 -11 91 100 107 -75 44 131 13 62 123 -18 20 1 -15 25 -196 82 -14 9 36 85
2046 85 2 2 -5 -5 -5 -8 5 30 101 58 -36 -4 16 -27 1 126 39 30 -21 -50 68 -86 -66 -64 -43 49 63 36 2 -80 -58 -29
2078 -29 24 41 -29 49 100 8 -73 -9 29 97 -83 -42 -41 -1 -36 -10 35 -51 -63 4 -71 -37 38 -50 42 -14 -20 -62 141 -68
2108 -68 -69 33 -9 40 62 81 26 56 -71 -83 31 -116 82 9 30 -56 -80 -173 -99 -4 -77 -31 12 70 7 27 3 79
2136 79 31 3 -62 36 11 -85 26 121 95 -35 -107 -29 0 -8 15 -34 0 78 35 -2 -56 69 25 52 41 2 24 -51 51
2165 51 72 60 -79 -140 25 72 46 -49 -66 -72 7 -2 59 -104 -94 -10 182 62 103 25 -121 -25 72 10 50 43 -3 5 21
2194B1n0OR3k1j58K62j62J04r8Q3P8k99J37j29K26p4K9r4N5q4m0L5P2J11j12O1
2220E2M3o2K5J0o1K2n4r5N3l2J76Qr3n8J33j69J9J50j9j08M4P9On7P6Ln4o1l1
2249e5J28r8j4J08o1l0pN3k8Ll2pN0K8p4l7Q7q8J72k18P9M3P1j00O3j10J26q4
2277c2p5J32M0l3n5N4Q0j75L0q4J73j26M6J16j01OQ8p1P5j50J06k8m2J00m3Q1
2303A12j94J87m3%rl6m8K6J82j54j03N0M9l0m6J0K3L3O5Pq8K9j0n6l5P5M3j26
2331h7J27p6N7m9OQj61Q1P4J55j72J26m3p2K8J16n7j8p1L7J01j32Q7q3J08j49
2357e9J9lK8k4N9k3j5j0P3K8p4Q0qO3j55Q1j34J41n8Nl2lqN0j17J00o9RJ92j19
2387A7m9O2l6kP8j7l3m1M5r4R1J06k16J46p9K9Mo1R2j15J70k14J72n9N5p2M7O4
$$ plain form
2194 21 -29 -23 70 49 -109 153 -9 95 -3 80 158 -141 -4 -133 93 19 48 -46 9 -75 -115 -80 -8 103 -9 52
2220 52 95 33 58 68 7 29 -25 -120 -67 -99 77 85 -8 -66 67 -102 -83 67 48 -60 -16 63 69 12 88 91 37 -24 -55
2249 -55 73 -25 -39 69 8 -22 -29 24 -4 -1 -33 -40 10 38 -36 -73 14 -74 98 -120 -41 2 73 -27 36 -74 52 -32
2277 -32 -107 25 65 32 -23 31 111 -64 -34 -118 55 -71 -25 91 -10 -4 84 13 88 -62 44 16 -26 74 31 112
2303 112 -82 105 62 62 53 17 -31 -5 177 23 -80 -30 19 -11 -57 -47 -24 9 74 81 -7 22 12 -44 -79 -4 39 -87
2331 -87 40 -36 21 -28 -22 -14 -175 -94 -20 135 -37 89 46 -26 2 118 61 43 -28 9 110 -22 65 -18 90 -59
2357 -59 -40 -43 -15 -39 20 -3 -18 -28 45 73 -1 79 71 134 -21 60 -74 67 9 14 -18 -21 -29 21 -96 4 -65 -56 136 17
2387 17 -32 30 -6 -8 70 53 20 -21 24 -70 21 127 -89 57 -22 7 11 -50 42 -73 97 -117 55 -4 51 -21 26 90
2415I0M9j28l6q1J16N5n8r4J9N8j7J1J2n1M4l0Q8nj77P1J29J01j98k7J33o8p1
2442f5O7N1j36O4J74k12P8N8q5J16q0r1O0j3J7Q8j08m3K06j49LN1Nj06K0Q3q0
2469b7k2N8k8QJ91k46R9N6r9O7q6L7l3Q0l8kk4nj0QP1NK2j01m8O7M3j42R2m4N6
2500Ej4R2n4P5m5n5J9Q7k1p7m5P3N5q7J3j4j4J32j19k0jJ0pN8k0J3p7J26PLj09
2531a1J1KL9L3j28%jK9k6P2j1J18j09Q0Pm2p8JN9j67J89m5mo9k6J13m7r1L8P8
2561A4l8K3NJ5l8M5k7J0j51J83q6P9j62R3M2o1n0J26l0Nr2j1J40j22J13oP0p7
2589A2j07Q8pJR5j11O3p7M0r6J66p8J06o9O6j57K4M7J5J7J9j03k4J60n0k8j03
2616i1Q3kP7J5q0n5J4L8O6l8o0n9J58m4O5j15J01m2p0J12p1K2k2R0j38L3j7q4
$$ plain form
2415 90 139 11 -25 -106 10 65 7 -87 -68 -10 -27 -16 -4 -55 -11 -41 47 42 -135 -64 65 166 -32 -59 74 6 -65
2442 -65 2 53 -83 -19 155 -57 21 79 -6 110 30 -61 -1 -14 3 91 -17 -60 146 -3 0 51 56 -50 -30 53 -27
2469 -27 -49 9 -19 -11 180 -66 33 89 -10 57 -29 8 -25 55 17 15 -9 -14 -24 -16 55 60 82 -19 -67 0 43 -99 -7 -51 5
2500 5 -9 83 29 104 59 4 23 110 89 12 -33 40 95 8 21 7 -7 125 6 -14 -15 -5 -12 46 26 39 -38 88 95 98 -11
2531 -11 0 2 41 74 -54 -54 -55 -26 -52 20 9 127 18 98 105 63 -15 -14 45 -122 67 22 18 -51 -77 36 -11 -102 -64 14
2561 14 -24 -1 4 19 -19 26 -1 9 -142 41 -45 34 -128 -35 7 -54 -104 22 -8 -3 -95 -106 34 -88 25 19 89 12
2589 12 -95 -7 -14 -13 82 -29 34 -43 -3 -99 67 -11 95 26 92 -65 -41 6 21 38 57 -46 -70 90 40 12 -91
2616 -91 -8 -10 67 82 2 -53 -39 -1 65 27 -33 -92 66 22 87 -28 73 31 -39 73 2 24 2 92 -46 -13 -30 -114
2644a14J09qK9q1p2J39m9M3K5M1n9Llq2P2m1J0J79k34PJ66n1mJ05j58J17j44M5
2672a0N9j8lolP4j15L0J10p2r9N7r8J09Q7j55J17j05mP1j11J58l9j39K29j81O7
2699A0q7J15j53K31m0p5J32k21lQ8Q1r5Q0m5K4L3K2k46L7J46L9m8m1Q3j43J30
2725E4j9q4M4p7J28n8R7J2rj76k8QP3O5l5J3r3J95j66K00j08n5K8j02L7K7J17
2752H8j01R7m2j8R3r0j75P7Q8nLk1k6N2o4K8P9k9Mj20J03o4J8O0l5J39n6j18q
2781d3n7Q5o3J10k6O3r4O6mj9K6r3n0J76j05on4L7M6l5J69j41Qn9N5N7l8n9P7
2810B9r6N7N4p5L3M7J0Q2k57J52Jj6n2JL6oj91K86j38J36n0Lk6r8lJ20k3K9K9
2839G4n5m3P6lo8nM0%n0kQ6n0k0k6M4o3LJ1R9l6l3P0m6lK5J21n1o0n1j50J99q8
$$ plain form
2644 -114 -5 -13 16 -65 -137 2 -47 -4 21 62 3 6 3 -79 -7 -48 -38 141 -93 -86 80 29 25 130 -28 89 -55 -10
2672 -10 49 31 28 22 19 93 -22 8 118 46 -53 4 -94 15 102 -53 64 -41 -45 26 -85 73 34 -105 124 -57 10
2699 10 -77 38 -115 116 76 1 133 -88 -91 -3 78 -17 63 18 42 75 97 -149 -112 34 73 25 -16 67 -76 54
2725 54 35 -49 -5 -82 46 -12 85 97 88 -88 -116 -108 -35 30 -5 8 -85 110 -56 144 36 -19 9 -93 -56 -29 88
2752 88 -13 84 42 24 117 27 -148 -71 17 12 15 -6 -32 20 -44 -16 63 34 38 -82 21 -43 -25 35 0 139 83 -35 -43
2781 -43 -100 -15 -78 32 6 69 -25 41 37 18 44 -49 -99 77 -28 -34 -88 -51 -5 -40 129 -12 -4 -63 -8 49 11 -48 29
2810 29 -67 -10 44 -31 2 49 59 141 -116 36 37 21 -31 -30 6 0 -191 95 -43 93 43 46 20 -78 -81 39 16 45 74
2839 74 19 -24 52 49 -19 -24 16 16 -34 -36 50 0 -20 -46 -2 -65 -62 -51 48 12 -21 49 3 0 25 146 95 35 -16 -166 33 -55
2871e5n0J72Nn8jm9k4J03o6n5J65j03N7j9j75K05o6J0KM4m6Q9m5j3J3n7K7r0K9
2900e1j0L4j5J44j42J7j1P1Rj68Q8J36l2m9K8l5N0j12n0M0O3j17J08J17j17Oq5
2927h3P2Q8o6R4kj45Q0o0N6R0j43K4m9j1P3PPl0k2P5Mm9J5K4p6M6k4mp1J32l3
2958A9j09J50J5j71M0L4Jo9N6K3J29Qk01P1M1j10M6On0J7Q7J%o5N0k5o5O6p4N2
2988b7n8J49j08Q2r3k8J47R2k31P4Qj34J48p0J3J7k7N1j1j4k6J09q3q2Q1o0J57
3015G6Oq6P0l4l1m8N7m7M5O1p2n3J29j66J25r2J02oj19J15J07j69j29R1oJ2M1
3042b1m2J08p8N4k5k6j1p3J28j09J81j32Rn3%J13M1o6J4j27P4N0Kmm2j0j7K3J02
3071F3l3M3r9m5K8L0J6qK6M7l2p2J11rl0J4L5j32P9p7n9N4Q9l1n1J5J6Q3L4j69
$$ plain form
2871 -55 -105 67 72 14 13 -36 -60 43 -23 -78 87 -16 41 22 -153 52 -14 -4 -2 42 -4 85 40 27 40 -17 10 -80 -51
2900 -51 -61 -27 -42 102 -40 -23 -34 37 46 -122 -34 102 70 21 49 14 64 -48 -98 -58 5 -112 -4 113 -4 2 -83
2927 -83 -11 77 11 105 103 -42 38 -22 34 124 -19 5 -44 -55 18 25 32 2 -20 55 59 10 25 49 -27 19 -5 -9 -80 52 19
2958 19 -90 60 75 -96 -56 -22 -21 -90 -34 -11 118 126 -75 -4 37 -73 -27 -21 -71 -54 33 34 34 -31 19 -6 -71 -5 -79 -27
2988 -27 -85 64 -44 38 -55 -83 64 156 -75 -1 7 -127 21 -49 -36 -19 -46 5 -6 -20 -46 63 -20 -102 -21 -81 76
3015 76 82 -4 66 32 1 -47 10 -37 8 69 -3 -56 73 -93 32 -60 42 36 -83 32 139 -30 -159 -68 -74 -62 -21
3042 -21 -63 45 -33 21 -4 -30 -41 -114 14 -95 86 -46 -37 -90 -90 23 64 -2 12 -115 -41 9 11 7 -35 -45 -62 -39 63
3071 63 30 73 -26 -71 -43 -13 3 -5 21 68 36 -36 75 66 36 50 85 -47 32 -45 -104 -50 39 8 -43 -28 -12 71 105 -64
3101f4R1j67J33k7M0M7j4n9jJ00o8n3k1J62o2K9Ro1k9J13j20m9J86j35P3n2j20
3128a19J81o4J6q4M5N3l4L3K5q9R2j10J10j38J05j4Q4k20O2J49j24L5K8N3j33
3153e8l1J74j29J43j12k5Q7j0J0r1P8q0R6p9k0n3J45J4qj85R4oJ02j34J30k8j60
3180a36J36r3K08k03R5QK2k7P3j04oO3j00j7R3l2L3P9o9p8J41r4MK2j07J41o5
3207a3J6L9M5j20N0n9J13r4M4K4m5L2N3j23%L1J20r0j19Q7j9L9K7j5m3K6j1Q4
3235G9m9Rj02L7LM5M5j27l8J0J26n8QK9L7j01pJ4n9Q6NL7j38L4J39j98P6O4R3
3264I9j29k6J42o7JO8j69M2K6L2J6K5l7l7Q0o1J17j61M5k4R9n0j15J42P3j96J05
3291D0k7Jo4p6R0R5j59J58o0m1O9jN8q1Lp3j6M8J08p0k0RL4l3L4k4L8nQ3j58J39
$$ plain form
3101 -64 27 -140 -7 -34 6 53 39 -20 -21 79 11 -42 -63 99 37 66 75 14 -15 98 -22 -71 115 -20 53 1 -119
3128 -119 62 -2 14 -70 -25 28 -6 27 52 -37 55 -55 55 -83 22 8 92 -128 -66 83 -41 -6 22 75 -58
3153 -58 -89 85 -44 99 -13 -38 49 39 49 -42 36 -44 52 -27 -47 -100 45 59 51 -134 -40 -46 56 -78 52 24 -136
3180 -136 0 -93 115 -88 7 15 37 10 83 -21 -27 36 -64 -81 12 -20 13 92 23 -55 86 -8 -4 18 -89 52 -13
3207 -13 3 42 87 -33 17 -42 71 -23 21 45 0 32 85 -38 -38 -7 113 23 -96 -9 -28 11 38 23 -20 6 -5 79
3235 79 30 39 -63 -26 -23 22 67 -60 -98 -88 38 -20 -12 17 54 -47 -54 -40 -99 -13 -8 29 -109 -75 64 -134 -58 6 99
3264 99 -30 -56 86 19 20 88 -81 -39 -13 19 35 60 23 -14 66 5 122 -39 6 -18 81 31 -84 58 131 -65 40
3291 40 13 14 -50 -126 -36 59 -100 58 -2 -43 26 25 83 2 5 -68 -84 -36 72 2 -18 -9 25 -8 26 2 40 35 118 -40 99
3322I9j49Q0K1j18K02m2o7M2q6l9J24j09mJ42k02O8J46k6j97J7M9k3Q4J29j51
3347a0L2n8J2n9P9qk2k2j00K83j15m8J78j76Q4p1M3J4q2J45r2Q2m5J9j37K8L9
3374gK7K3k2kj27J2Q8L6q1J16j35J14j05N1M7j4L5o9q3J04OL9j08j3J25j57K24
3401A24j75J12o6K3l4Q4j57Q8pQ2j68J75r0J06j34J1J39q5lq3P8q7K0J28j53O
3427f6R1l5M7M5K5k09J11K3n4J5N9j0j64R2J65j65M5P5l0r5J01n2rJ51k38P6M9
3454D3k9p4O4R7j28J48j20Qj3LP5n7K6l2J5o8J0M0M3j59K20j59k0J75j23J23p9
3481B9j01J59N8j65N7o8L0rK8l3N4m5J0L2o2n7J56p6Q7p0j7J0j25J05l9K03p9
3508G2j07Q8p7R3J2m4n8M6R2k31J99q3pmn9J29j17J94j49O3r0K1k8R8l9n0P2j19
$$ plain form
3322 99 -50 30 51 -67 135 93 26 68 -18 -57 67 -42 -46 96 -106 -38 108 82 -115 -98 -49 -72 12 141 -10
3347 -10 22 -36 -24 -83 -4 -12 -34 -56 -156 127 12 -36 142 -34 50 -21 22 36 -46 99 7 89 44 63 -74 -46 -7
3374 -7 20 43 21 19 -108 -96 -8 28 -53 63 -72 42 -63 -12 35 21 56 -13 -96 8 14 53 -55 -68 57 -100 124
3401 124 -51 61 -5 18 -16 68 -89 -1 -8 74 -94 81 -9 97 -37 -26 113 28 25 -58 20 -67 -47 81 -72 -66
3427 -66 25 -10 37 82 107 -102 9 32 -22 -7 52 42 -122 -30 135 -30 15 90 60 -35 66 14 5 156 -82 -6 43
3454 43 14 -60 4 101 -27 121 1 9 -4 -1 74 17 43 11 26 -42 -32 8 51 -108 112 -47 -67 108 -15 108 29
3481 29 -72 87 145 -20 37 -31 -1 -10 18 -15 39 -6 4 36 -26 -83 73 -3 84 14 -3 7 -118 -13 -52 151 72
3508 72 -35 53 -24 69 81 37 -21 25 117 -114 85 2 -5 -9 -68 61 -56 138 -11 52 -38 -17 -45 53 14 -36 36 -83
3536h3K2Q4j2m3P4p3J96m0j52R1k3nj02J85p4p4N6J69k34r7J78m0m9J01o2J19
3562A12j30j8Q3N9j49nj3J51j67R5j08O8qR8j34O9l2L8r3Q0m7M1M3L6m6o8N2m3
3590c6J12j1l8Q3j07r9N9J6J00j24J05q2n1J75p2m3J37j73K2K4J62k35J01J3q0
3615d2K6J6Q9p1m6Q0n3L0j8j49O6N6n1J07k3k2kL6j19J60j92Q5O0N9j11K7m9J09
3643E8j21j5J66kOPj27n0L9N2K3j04J39l3o0Q7M9j81K9j1J0J38k51Q4N5k0J81
3670A48k18K9L2k0mp7J16K7J3q3L5j06J45m9J26j22j3M6Np3J2m3j3N3P1j33j6
3697a12J33n7N0q8P9kJ4p2J51o8N9j56J13mP4j36L9J44p6q8M8R4j10L6q5l0N2
3724Bm9k6Q6mj29J12O8j98M9J75j05oL0m8J30j22P8j9Nr0J43j16L8P5q3M3J8L
$$ plain form
3536 -83 -61 23 11 -32 42 -31 165 125 -27 64 41 36 -66 119 45 -29 27 196 -38 -135 43 3 -46 55 -7 112
3562 112 -18 -36 47 106 -43 -48 -61 90 -77 18 -90 -22 -30 68 -66 3 -29 9 -84 -4 -51 -10 33 69 23 -45 7 -36
3590 -36 76 65 27 110 3 -96 -37 -21 79 -45 60 -22 -73 102 30 -13 124 -49 -27 -3 159 -76 25 38 -42
3615 -42 -16 0 89 18 -28 52 -1 29 11 -138 -72 -16 -67 40 17 -5 -7 29 -90 70 -122 -37 23 82 -29 -2 -51 58
3643 58 -63 -78 88 86 92 99 -28 -78 -39 13 36 -68 71 38 -22 65 114 -67 -38 -49 -39 99 -152 -68 -13 -33 148
3670 148 -70 -41 -9 -29 -33 -110 6 33 46 -37 -2 -108 37 -12 114 -8 -21 25 30 -43 -31 -74 -87 -34 37 -96 -112
3697 -112 21 -36 14 -74 5 3 17 -55 96 28 87 -69 44 40 114 -22 17 161 85 -3 45 139 29 65 -20 -50 2
3724 2 -47 -73 13 9 -120 -8 60 -138 -89 86 -19 -25 5 -43 87 -35 43 24 29 -61 82 -34 4 79 -4 39 57 60
3752F0j38jJ43nk0j2j8o3PJ20q3R2j00P8kj41Q4J7j37J10n9P3N9q1qN5k6j9o9
3781h4l6M7J65j5q6l6M7J0P4r6M4m4l6J22j28O2K3j2L2l3j7J1N4J2q9P4n4N9K8
3810I8j25L9J19k15P8j3k2N6j13p5K49n6o0k4J60j74N7j1n6J55k5l6j0J20k32
3835a16J71l3n7O0MR9p9q5RJ7op1J00l2Q3q2mqM0k6qJ39p0r4o6P6O7k5r3K7J38
3866G5j30p3J73k7M9k6j65J89j25J33m2l5k3l2Q0R4q2Qj4K5M1k0n8j38Q6J83k6
3893A20j48qR3m2n0R5j02K8J58m7pj50P7n9R9Pq9R6n4nn3J13or2j13J97l4L0o7
3922a3p4J16j30J06q1J32j02J30J3k17K04r1K8P5p3k8p5J13o2j4l0J00p5R7r1
3947d2M2L4j0p1Q0j00q9Q0J47j46N7j30J40J37n3R3k89Q6J14q2K3N0q6Q8p9P4
$$ plain form
3752 60 -78 -79 64 59 39 27 9 -54 -47 73 -10 82 -18 60 58 -83 1 18 -119 -9 -68 5 64 -17 -25 30 4 -15 -84
3781 -84 -120 -73 92 77 -9 -45 2 12 86 -10 34 -10 -46 76 -52 10 33 21 53 20 3 14 68 80 -9 65 11 70 98
3810 98 -27 12 131 -84 -6 -19 -41 15 -98 -173 76 20 -40 -64 96 -78 -21 -32 -88 67 42 6 -4 116 -116
3835 -116 55 22 -35 25 29 128 49 -36 -27 -10 -16 -87 13 -19 64 -18 -22 -30 10 -16 -24 115 45 -49 -115 -39 28 3 -90 -63 75
3866 75 -55 -128 45 18 67 41 -124 65 -60 73 31 -4 -27 -59 21 115 33 41 27 52 93 73 15 -123 -37 146 120
3893 120 -28 -36 57 15 -35 60 -42 -14 144 97 90 -60 17 -42 57 64 -25 71 17 12 -41 72 66 -26 -139 58 24 54 -13
3922 -13 -87 29 -101 5 -76 56 -46 84 97 -120 84 -7 21 96 23 -5 -80 33 -29 -43 -73 27 -48 49 -42
3947 -42 0 34 24 -47 33 -67 -156 -76 71 -75 -18 -148 -8 129 76 169 -120 -34 80 -2 21 71 -15 73 -6 68
3973F8q4J00j24k5O3R6j84J31l5k7Q2j14N5Lq0J27q1n3P0L3l0o2R1n2J4J58p0
4000G0m9P4k1j57J44m6JM3M0n8m3k3j44J00pL0M3Ll5K7k4K7o4o0R9K3M1O5r1k9
4030b1k6J25k67J30J01p7P8j59J55j62J90n1jk2m4Q5n1j25J22o3J32%k9m2J4J45
4056A37o9K3Jm8k8M5q3m4J72p3k2l3P8q0%J7P5q1r8P0M0O0k2Lj02J5J65k19J61
4085F0J9k0r7j00Q5NO7K2J1j06J77o6j1r4J03k9K8Qjm0Kl3L2N1m9k9O7j71Q2q
4115c5lL8N5k8o3P0l8K8j31P9L7L1L9j42P4J5p4O9K0k7n9JQ2m8PP1j5p6O3M4j05
4146b1J5M3ll4qL3m9q3J70r1J8J0%L8p8P4n1P1l0q4J29K2p4N9j36J19K0j06m3
4175g0J62o5m5Q3j21K1m5R1r3P8K9o4l3O7n6J03n2Q8l2r4P6j00J49q1K8J9q3M3
$$ plain form
3973 68 -16 84 -40 -65 -2 94 -90 41 6 -21 61 -53 2 5 -75 52 -29 -82 -12 21 -9 -71 20 -32 -18 140 70
4000 70 21 95 74 -83 61 15 16 59 99 41 -2 -25 -169 -69 -76 -46 -3 0 -35 -8 -32 -5 -69 -129 -30 -7 34 99 8 -21
4030 -21 -47 78 -189 -59 42 -35 43 -116 39 -123 67 16 15 -7 -51 34 -17 -142 -20 -83 49 49 20 -22 -8 137
4056 137 68 91 92 44 16 61 -22 -66 106 33 11 -22 56 -24 -24 -7 68 -13 -111 -41 -1 59 37 40 -62 -47 118 -101 60
4085 60 79 59 -38 -138 -53 -48 19 41 52 -54 123 57 46 -48 55 26 54 62 61 21 23 -10 22 73 24 -5 62 -109 -27 -35
4115 -35 -38 0 55 27 -36 34 -4 24 -107 -28 9 40 79 -63 11 26 -48 21 41 14 -45 -44 38 -10 -3 68 53 -23 40 84 -21
4146 -21 -6 37 34 0 -8 25 -24 -107 63 -28 -10 0 0 38 -40 34 -17 54 24 -60 69 91 17 76 -60 59 79 -27 -70
4175 -70 92 27 -18 65 -56 -35 -80 11 -82 -4 25 -39 -72 -5 -61 42 -10 78 46 -48 28 -72 77 -4 24 43 -40 3
4203Cn5j4mR0J1Po6PL7M4j9j16NN4N1o8K1J09Jn8q0rM3j45J69K8l9PK0j21J32
4234D5j63O0N3o6QR4j7k0Q9p4l7j1L2M8qn5P1mm2k2J5j85K54q0o9Q1M3j24J63
4263G9j94J42%l3R0j11PJ43j02pPL5M3j37P1Q6j32M9j12J00l2k0K5M0q3Q3l5J9
4291B1J2k8R2j35j8O3J7K0j8L5j55J30Mj8l3O1Jj79J56P6j41K9N7J2o3o9O3O9
4319F1j01K4j2QN8J1j63J19J3L2j14N6J30j92N6Rl0QK7m6J62j29m3J37j38J35
4345G8q6N0po6N0N3%K0m4k3K5k5l0O8l5MR1j18r9J62j10O0L3l4j7j00J48%q3K8
4375gr5M2Q7k8O0m9n6O7K1j47K24j75K3L6KrQ5j05o8J11n8P6l3n5J17j40L8J1
4403b5J3l0O5l0M3j7M4m3k6q4O0R0M1n0j3r1J18q3N3q1K7J48j36p7N1qL4k4l3
$$ plain form
4203 3 -52 -66 -70 20 31 38 -28 -21 16 60 41 -75 -70 -16 35 -33 -12 97 98 40 -40 -49 -6 -151 18 46 7 14 34 -87 45
4234 45 -118 -58 -5 -71 -63 31 14 -6 83 9 -28 -39 -7 41 33 -22 49 45 3 -19 -4 -189 65 -15 -84 -3 40 -84 79
4263 79 -115 27 27 -6 84 -27 -20 123 21 14 21 56 99 -38 33 119 -13 36 -76 24 -8 -28 -3 37 -46 37 2 21
4291 21 33 5 97 -38 -56 7 24 44 26 61 -94 36 40 22 -11 50 51 -128 28 104 -37 -8 49 61 -2 -71 -8 61
4319 61 -40 -16 -28 -20 38 49 -114 5 18 50 -64 -8 122 -70 -14 -5 -35 -27 0 -46 116 -13 -56 81 -57 78
4345 78 -8 42 35 -31 19 72 72 92 48 25 50 25 -5 63 28 32 123 5 -94 68 -42 18 51 17 0 -100 48 48 -35 -7
4375 -7 -102 -60 27 -1 59 10 -46 21 42 -105 119 -56 -33 3 5 -4 81 -24 -92 19 -39 37 4 -51 66 -74 -36 -25
4403 -25 -12 -42 23 -7 36 19 63 20 -6 -90 -30 60 101 51 38 -53 65 -18 35 -46 -19 129 -7 -84 -33 -41 -7 -31 -64
4432f4K08j17m2p3J62j54O9j1m1K1m8J11q3N3nJ13j02l6m0M2Kj1j2M2R3j17m1
4459h1o4J4LK44qq2o4J25o1o3L8P4j00N1J0k4L5p5Nl1%J8J67j55L9J3J9k2K7n0
4489Bj21J59p8j10R4L7k8L1k1N3R4p1N7MN3o3m7j4O3j59J12j95J61NM0j98K26
4516H6j47OJ20j14Q8M0k51K69n4Q5k15L5J06k0lJ6l8K4j56J10j14J10J0j15J75
4541E3j06J10n7P5q3N1j49J39Ok9J39j19M5r7RQ3l9Pl9Q0j07nk1L9Q1j40N1n0
4569g3OL6%k8rJ00q5J09K8k18J72MJ1j65J01k5L8LO5l6j7o9M7K9l1p4L4J13K0
4598H6j2j65J38m3o3L3L3o1O5q4N7J9oO4N6p0j6o4J2j9m0R7r2R8L7K5J7r0l6k5
4628d9K8L7l0K8J2J09j21o2rJ25Lo8l9R3j03N1J3j13N3L2N9mk0L7nk9m3K3L7R5
$$ plain form
4432 -64 144 27 -15 -88 74 -80 -11 -22 -63 -42 -90 21 -62 -9 -14 99 -3 -39 -79 -37 -35 -46 -58 -16 77 -40 -81
4459 -81 -145 -131 -128 116 108 26 -38 87 26 -37 1 75 -25 26 36 12 47 -28 -23 -54 -54 -36 131 -24 15 28 47 25 52 2
4489 2 -119 40 -38 -148 -54 -17 -45 -14 -35 18 112 41 98 102 155 92 45 31 94 -65 47 -148 13 18 58 -140 86
4516 86 -61 -55 65 -49 39 79 -172 97 43 128 -87 -52 54 34 31 47 9 33 -123 -13 -127 -17 -7 -122 53
4541 53 -53 57 0 75 -8 43 -106 33 39 10 149 30 75 -22 -13 70 31 38 -1 79 -28 -33 -54 -15 66 -74 -23 -73
4569 -73 -67 -31 -31 -59 -68 32 -53 56 84 -134 38 42 53 -112 -11 -36 2 5 70 34 17 -52 -5 24 -7 -81 -47 66 86
4598 86 74 -91 47 4 -59 -26 7 -54 11 -73 -16 3 -3 61 117 47 31 -33 -21 -40 -80 17 -75 23 60 85 102 12 -24 -49
4628 -49 -21 16 -14 14 26 135 14 -48 -57 68 71 3 -36 57 -46 5 18 -95 -42 -10 49 45 25 62 57 28 -15 8 45 140
4658A40Jrj21o9K5K7l4J20l4r7P1m3N1k6L1l9R7q3j3NO3r4LK4NK1j59J88j53Q9
4688a3L2J4J4r7O4o0M9J9M5L8J2k44R8M9o7J03j65P0L6P5n8Q2j10L5k4O6p4Q7
4716G6j88Q0J10q0m7mN4pk8L9M7j32k7J59P7j07O8J5j63J77j45L1M5j42K14q9
4742C3L9r4Pq7J19j26J08N5j21J51r7m4J29j44N7N7n2l7J75r2l8K3j17J08m4P7
4768D5k0l2mP2k7q3N7N5p7j00R2Q1o3O1n8k2O3l8l4Q8r8l5l4J55n3Q6j17pM8j2
4798a1k3j3J01k4l4KJ1O6n1n1j0N2q2J8J31%j33J10j8r2M6Q4n1O2J7j51R0l4n9
4827d7M7O3j34J02j28J74kj60J11l6M9n4l3R1o6O3k4P3j47K6l4N0J0N3j01m4J29
4854C1o4k3P6Rm3%M8N9n3j4M1j71J46L0J0j14k2KK9M7m8P0k02Q0l8J26J22q8l9
$$ plain form
4658 140 141 132 11 -58 -33 -6 -40 80 46 -51 20 -23 28 2 33 -6 91 8 -5 0 63 -31 -28 -4 1 22 -137 51 -102 -13
4688 -13 19 33 47 -50 14 -46 3 22 67 105 117 -127 -29 20 -47 56 -109 -39 -3 72 14 96 -14 21 -3 63 -11 76
4716 76 -112 -32 78 -2 -49 -53 1 -6 -34 5 52 -80 -107 52 129 22 90 105 -58 119 -26 5 50 -92 122 33
4742 33 72 -22 -15 -102 17 -109 -1 54 -67 84 -13 -57 72 -72 -15 42 -10 -47 128 36 -2 21 -96 12 -32 45
4768 45 25 -7 -11 61 34 -49 8 63 -14 -114 -22 59 -4 57 -1 -23 40 2 -32 56 -42 -77 -111 44 -9 77 -40 -47 1 -11
4798 -11 -34 -47 54 30 -4 -2 9 75 24 -27 -37 15 -67 -49 82 82 -51 59 41 -51 -5 79 28 90 107 -44 46 12 -47
4827 -47 0 63 -71 31 -97 77 75 -85 26 -10 39 -15 -48 43 -23 40 16 89 -58 -32 -66 -16 -6 47 -54 -98 31
4854 31 -33 -56 20 29 -14 -14 34 93 40 26 67 -104 42 72 82 -32 -54 -52 -23 24 -24 46 -156 -76 -114 12 134 46 7
4883GKJ39j95Kk8Q9Lk2J38j00m3m5J3N5m6J18q6N2o8k5R2j4Q2k3r3MO9J0q4P6
4913G9n5o8J29k69K07n3J62k77Q6N7o8jMJ33k0j99R9N7L0l0m6L4NL7K1j66O0M1
4941a1ON0j0j10K3Q2j5O1j14O7m7J0L0l7jO9j26K8KL5N5Pm7q7N1k2R0L4n5m7L0
4972Ak9qj7K7n0P2N1r9RQL5j8o1P8l7jL5K1J2J7O8j71Q3j22n8J46J7k4k2O3J1
5003C7l5k8Q4m8k1M7j38J70p6l4O1Mm7l5O5j10Q2L4qo6M7k0J00p5n5J82j10%J
5032HnJ14j50K5J0L1l4k0K6j3m1J01Qj52K4jj7L7j2J17Jj1r7OPO6j07J23R0k4
5062A10j76O7M3%k3K5o2K2K2j00K18k33K3J42j04Q3%j9Jj9l4J2rl4l2P9M1m0k4
5091b1L4k0K8ln8K8Jk1O3k1o4J73r7oo4R6p4n9%O0J43r0p8j0l9K0K44k36n4J73
$$ plain form
4883 7 9 148 -47 -45 -73 16 19 -3 135 35 -8 -53 -40 15 -31 87 1 53 -15 -40 52 38 120 97 4 8 77 87 3 79
4913 79 24 -44 85 -184 23 -30 132 -145 -59 -2 -70 -71 -67 66 46 -153 -54 3 33 3 -43 -9 -4 33 54 -112 -52 -11
4941 -11 -5 45 35 -75 -52 30 15 76 -38 29 -18 -8 22 -15 -16 53 -73 -45 -43 -8 47 54 7 -80 -29 -51 39 73 18 -29 1
4972 1 -28 -36 -53 -26 -76 -4 47 -52 -43 -35 0 -18 -79 -1 -38 -39 -4 17 29 46 114 -57 26 -96 -154 -8 9 -15 -37 26 37
5003 37 2 -26 58 10 -11 36 -102 68 -8 -42 19 23 -24 -59 6 -104 -22 12 4 -62 -15 -35 65 -10 -65 117 7 7 8
5032 8 3 117 -33 -8 2 33 -1 -21 5 -8 -49 52 60 -92 -68 -69 -86 -49 -61 56 57 46 -51 -45 -38 28 -79 44 134 110
5062 110 -66 1 44 44 21 46 -16 6 28 -72 146 -87 -64 78 -26 57 57 38 39 20 -14 -2 -11 -45 -77 2 43 3 -21
5091 -21 13 -7 21 18 -40 -12 -11 -32 31 10 -54 119 22 16 -48 48 -26 -85 -85 -25 118 28 -50 -60 -99 -79 165 -71 -125 48
5121D8Jp9M4m2N8n3j59P8M9N0p3R4K4j08R9j0lK3lq7O3l8l8J54j85K19r0m9m8
5150f1N6K8k9n4L0K3J85j90K0n0L5K2L0M2m0j04L7p1J09l2R7j23J48k16L6J59
5176H7j27l6M3oL1O3k6r1N2o4R7l7%M6j33J37r5O8k3n1P7k8M0L5q7J39k07J20
5204B4l5N3km6J40j47J41k57RP1J12j46M5J3j68K2J66r4J66Nk5J1o3%K7l3K9m
5232A4Q8r6K3M6l2K0q1M3o7P7o7P1m5o1N5l2j0m6K57j76O1J00n5j53K6l5P8R0
5260I3o7j39M0N2N4n6j42P4J87l9m6K3l4j5O3o5j3J16j7K8k8j4m4M4k4k0k8L3
5288A6K4n3P3m6K2pJ9j49J06j0j18Q4L7O9r1O4L3j22R4ol7m0O0O3k8r9J34J0j39
5317c7L4p3R7n7l5J03qp7J33N3m7o8nOl4N7r4j3L9k7j30K18K9j03O1k9o9J76j05
$$ plain form
5121 48 49 -30 14 -28 30 -23 -182 -104 -55 -5 -78 16 40 -68 31 21 18 41 38 -49 14 -24 -62 92 -93 126 36 -13 -61
5150 -61 -5 23 -6 -60 -30 -7 178 -12 8 -42 -7 15 45 87 47 -57 -20 -91 18 -14 83 -40 108 -108 -72 87
5176 87 -40 -76 -33 -39 -8 55 29 -62 -10 -74 23 -14 -14 32 -101 36 -59 9 -14 -65 12 -16 24 59 -28 111 -96 24
5204 24 -11 42 40 -6 134 -13 128 -129 -120 -49 63 -83 -38 -25 -193 -171 -5 -99 67 72 47 58 -5 -5 22 -11 18 14
5232 14 102 6 29 75 43 63 -18 25 -42 35 -32 39 -6 -67 -12 -44 -54 -100 157 -19 42 142 87 -66 -40 -75 3 93
5260 93 26 -113 -73 -21 33 -23 -165 -91 96 57 11 34 0 -15 48 -17 -30 86 69 97 69 55 11 55 31 11 -17 16
5288 16 40 -13 60 14 36 29 48 -101 5 -5 -123 -39 -2 67 -24 40 73 -49 45 39 2 -38 22 85 57 -42 92 102 -37
5317 -37 -3 -76 21 -36 -71 32 24 -53 80 133 86 18 13 19 -15 42 -52 -65 -26 -53 -183 35 64 -39 22 -7 -76 100 -5
5346el5o6J0N8N2lm4K3n5N1M3Jq1K86l16L1P6q6O7JJ07r9j29R7N6%L0k3rL8r1
5377a5j5J07L0p4o0J24j06m2OK9N9Qj37N5n0l8J19m0J11q3j21P1M8l2k6J03o9
5404c8N7q5J15J7j01Q8J9l1n2O5p5J0rMk7J01P7j10J9l3j27J16nJ2l2J42k20O0
5432d3K5k6J00j13J78j52l5J15M6n3m3j9J28p9J9J2q9%l8M9K4J8m5J20j38J6L
5459b0n0J28n2l0Q2J6r0J13q6k6Rn5P3LP8r6l9k4R7rL1r7O4j8R3j11KN8j13O8
5489aL0O2r3p1K3J4l1O2L4q7J34J0j56j7OO6o0J36j61N0N5O7j61O7O8n7k7P4j10
5518g4Q7RK6j30LQ8L4j10n2J89r1O6KO0m8m2j09P7O5K1M3p8L9j02k9M4M8q2j6
5547f2o4J41n2j0k2o6O4R7j05J49q0q0R6m6j0J5J05K5l5J10j48N6l3p0o9J59j06
$$ plain form
5346 -5 -40 -106 -96 -38 14 11 -33 -10 -65 -14 29 30 -51 235 -81 -50 26 -60 7 8 115 16 -113 -16 40 40 70 47 38 76 -15
5377 -15 -30 77 107 33 -27 97 -9 -51 -45 -16 43 51 -86 -31 -81 -119 0 -40 71 -12 -133 -62 -14 -46 -72 31 -38
5404 -38 19 -66 49 66 -35 53 72 41 -11 54 -21 -11 -20 -16 -43 58 135 25 44 11 -116 0 -5 7 -25 117 -103 -43
5432 -43 -18 -44 56 -57 121 -31 -66 49 95 42 -1 -20 108 29 48 60 -29 -29 -67 -18 6 24 -21 99 -39 -23 -20
5459 -20 -70 58 6 -24 58 74 -16 97 11 -15 -6 -61 12 15 93 -3 -42 -66 31 22 53 -44 20 2 95 -16 -14 44 -69 -1
5489 -1 29 91 -2 -73 -50 -36 -67 -5 29 -58 76 86 -70 -87 -81 -15 -75 61 -100 -50 5 72 -89 -22 46 -11 -38 36 -74
5518 -74 13 22 48 -82 -79 9 43 -67 -119 70 -21 45 47 107 59 17 -92 -15 50 71 114 36 75 -27 -56 -12 36 -46 -62
5547 -62 -126 15 -37 -47 -69 -135 -71 26 -79 70 -10 -90 6 -40 -50 -35 70 95 60 170 22 78 45 -25 -94 65 -41
5574d1N5K3n8J04l6r0M3m1R3L3j03L8n6l5M9k4O1M1j9q6K7lQ5j78Q7J03q5O9m5
5603A1j2m4J25p3k0L5oP0q4j64J59J5J9J3q2P1k7M3j05J2M2r3R2L3n9P4o3L7N3
5632G2l9j40O4l1J67j32P2K1Oq1J16j6n5j16J35j3j13P9O8l3J6p2k9m6J58p3J8
5659Cp5J40j68J47l0l3J7N6k6o9k3K0L8j8P7j59J16O1o9j16R4J9n7N9K0J26k29
5686g9J28r8k25K24O1j49J15J31k18J38m4J3J3PO3m1p7N3J8j9J14j46J10p8J2
5711B6j1m6N9k2q8J57p7r4k8K55l05R9J08k7n7nP7q2Q0j48J18l4jo2J35o6M7l1
5739b3rk7J13o2n0J24p6k8j3j8J62j00P3n4Ml0M2p9J17n9k7o2M8J14p9p0J43o0
5767A4mr9J05j03JJ09K5l6r4K1M2o0pQ7K5l8L9k8R4o8n7L5m6PN9m1m7J05n4N8
$$ plain form
5574 -41 14 37 -21 83 47 -43 0 -41 52 85 -18 20 -36 -71 -22 -46 15 56 37 -49 -22 -25 60 -118 -31 72 -13 56 11
5603 11 -1 -45 80 7 -13 22 16 86 2 -162 -3 12 31 44 -38 33 6 49 -56 -44 -2 -95 -3 30 -29 45 -18 19 72
5632 72 33 -107 -43 -74 93 -39 33 54 60 -21 95 79 24 -92 43 30 -83 -4 64 31 47 -25 -54 -100 58 -15 3
5659 3 -72 68 -100 47 17 -16 1 57 31 -38 -61 -41 -3 -21 56 -103 13 74 5 -111 -17 2 -55 4 24 150 -79
5686 -79 49 -49 -274 -50 11 -138 -23 108 -110 28 -16 -3 10 17 80 39 -38 15 33 14 128 -18 92 14 26
5711 26 15 -31 28 6 -82 75 -2 -96 -124 131 -174 -75 33 6 -51 -56 21 -61 19 -129 -11 -45 -46 -108 27 -39 8 -23
5739 -23 -32 -59 54 -8 -58 66 -10 -38 -51 -69 93 -7 66 12 16 -14 28 -51 66 7 -20 -82 -34 80 1 -69 74 14
5767 14 10 -89 16 -87 -86 23 48 12 -82 -61 -19 -79 -86 1 26 -12 27 -1 93 25 -32 3 -43 -36 23 -18 -65 40 -14 44
5797D4m6K4mmn0%K2j03J63j58J28M9j20Q7N0p8PL8j12R0j0l8K7K4J7l4N2K6j30
5826c9k6J08J9k48K33k4J5m0o7P8j9nM8L9p8M2O1n9k2n5r9J03Q4qnj05O1N0o6
5855b4l8N3M6j60O0O1j26J17j64J99l0N8mo7l9O7P3J1j04J20j00J1m7J09o5o2
5881d5J23j5M8j91L0P1l1q3J05n3r3J00K9j1N5o0J17o0j97J67N8j87J44N6p8j3
5907a4M7j07J22Op4Q3j17J02n7J5M1j18Q1L1o6M5M9K6j8op0j32K60j89J8J45r9
5934Dr1J39n1r4J31o9n5O3p3J05q2J14k3nm0J1j1N4j05J8J32j06J32k3n6R8k40
5961a23J28Jq0J6NQ5Q5j15nP9n2rL8l9m0R9k7q8m6K0l7J36o3l8L5q6J04R9j21
5990c9P1l4J19n6o6m3J06j03L1j07J58KP2j11Q2j43P7O3j14N0l6j1R8M1j06J8
$$ plain form
5797 44 -2 22 18 14 -36 -36 -14 -117 46 -112 16 65 -55 32 82 4 11 49 -63 27 17 -21 6 30 47 13 65 91 -39
5826 -39 -65 43 62 -186 47 23 38 -2 -69 9 -10 -15 33 72 -6 36 97 38 16 -39 -138 -35 49 41 36 -69 -8 42 -24
5855 -24 -62 -9 37 -123 -63 -2 -128 -11 -175 24 -6 52 48 -19 -58 9 82 93 -11 109 9 20 -27 82 17 -45
5881 -45 78 63 111 -80 -50 21 -10 -93 12 -41 -134 -34 -5 -16 39 -21 96 36 -161 6 64 -123 21 77 -1 -14
5907 -14 33 -74 48 54 -20 63 -54 48 -9 6 47 -71 10 41 -25 20 69 95 77 71 1 -131 129 -60 -42 103 4
5934 4 -87 52 1 -93 38 -31 -86 -23 -96 9 -73 41 18 13 -27 -16 -27 27 -78 -60 72 -34 98 75 19 117 -123
5961 -123 5 6 -74 -58 -53 32 117 2 -3 76 24 15 53 14 -26 73 46 -42 -88 -68 -105 31 -32 -70 -35 -121 -17 82 -39
5990 -39 32 -2 117 61 -5 -48 58 -45 -14 -121 37 39 111 0 82 -61 16 79 -35 15 -21 -32 66 107 1 19
6016A9qL2j3n2j3L9k9J28r4o6O5Q3o5m3J79j40n8j7R4k9J9O9j8j02N5O3r0O3M0
6045A11n1o6j8M7o3j5J83k23J5K00rnq8K4j06Q6m2j9Q9l8J26r8j07l7K12j04L8
6072D2o9P9q5J36j87O1J07pn2oL0q2k5oP9m1Q9n9Qmq3%J39q6N4o4K0N0j7Lk5l1
6104c2L6J07k42K21q0P2r0N4j90R0O0K5j44P2M6k5J9N5K7q0J08q8%lK7l5O3N3
6132A26j20n9Q9j2o8M5J10j24k5j0N3N9o9J2K1K6k8k16N7K03j83N7l0j3J4L4J80
6159A29j42J25j36P6lmj02O7j2K5pj6j5O7p3p1J04m9M7j08K0J20j00M1j7o3P9
6186a8kJ5k2J5j0k1K8N8o5J32k33J69j18Q4q0K1M0j1p5J25n1rK9q5J25j6n8J41
6214A08j32J9P0j0r4J7k4m9M4m3L8N7J15j67M4K4O4j20P9Qr1R8j05N1L0l0j2o9
$$ plain form
6016 19 11 43 30 -22 -35 4 -25 103 9 -57 8 91 26 -17 162 22 -36 -53 41 12 31 100 82 -20 35 98 8 71 111
6045 111 60 -6 -24 23 -40 -55 128 -95 -80 120 111 106 18 42 -64 22 -20 -39 50 12 138 40 -67 -104 108 4 42
6072 42 -27 52 -33 103 -84 -23 84 77 25 19 49 -33 -58 -64 15 -26 63 4 12 8 -75 -75 64 -22 32 -32 -12 38 21 24 -1 -32
6104 -32 4 111 -131 90 10 82 -8 46 -144 -54 6 31 -113 -41 5 -20 -1 54 81 1 109 21 21 18 45 10 73 126
6132 126 6 -53 36 24 -44 1 111 -13 -38 -48 5 64 -5 7 28 54 26 -190 -133 70 -113 -56 -86 -99 -85 -51 129
6159 129 -13 112 -24 52 49 45 -57 10 -2 23 16 0 -15 52 -21 -92 12 -37 10 -98 -78 42 -58 -17 -34 -97 -18
6186 -18 -20 -5 -27 -12 -22 -43 -15 43 -22 110 -123 46 -72 12 -68 -47 -7 -18 -93 32 -19 -28 1 -84 41 25 -33 108
6214 108 -24 -5 65 55 -39 -22 -46 -95 -51 -94 -56 1 116 -51 -7 17 81 -39 40 48 -43 55 -50 1 31 1 -11 -80
6242h0J89p9M5m8m7L4M0n4L9j05k8M3L9o0J4N3l8j03K69j15j41J42m4J14j04J4
6268a1m5J08j30K3P2K2m7r9J34o9L2l3L8R5j73J38q5N0J8q5K3O9r0P1j7j44J25
6295a0O0r2R0%Mn7L4j42R4L9l8N6l2OKl0NQ5j36K25j48M3k3n1P8j0j4j1j22R3
6325bL0q9O0j95J62J38p0J0l2k6j26J21P0j23P1m7K9N9n5l2O4K8l4r6O0prJ02
6353F1k2k47J55n2J90j48P1j2p1qj1MO5J02j54P5j47K1O0J04o0J4q5P8K6j44K16
6380H1n9R4j49M2Mj60J43m5L7p2J36j19O0L4o7Q4n3J1p1R6L9L4j07rN1r1R6j4
6408B6r2P4On8MN5P1p8n9J05r4Q3K5k4q8J6JJ07k27P9K1J2Q0o2kPQ8m9Kk0m1J6
6440a6OJ8P2k9r9M5k4o0rJ9J4J6K1n1M9k5P5q7K0j0Q7J17q2k0p5rJ08m8K5j19
$$ plain form
6242 -80 109 30 75 27 -20 14 54 0 39 -66 -94 -51 -12 -72 -58 -5 -43 -146 123 8 -133 9 -35 79 -25 -11
6268 -11 -56 52 -78 -55 17 39 -8 -107 27 -42 -10 -43 -5 90 -83 55 -30 20 38 -47 -24 45 -45 26 9 -135 -10
6295 -10 50 -42 48 48 52 -5 29 -113 -19 20 -18 38 6 12 14 -16 -11 74 -62 163 15 58 35 -16 62 52 38 27 -95 -2
6325 -2 28 -61 -1 -196 -34 104 34 44 12 -14 -140 -19 51 -72 -1 -48 -19 40 -15 -47 17 45 11 -85 -25 -32 -41 61
6353 61 39 -208 -53 -105 85 -63 8 -4 -75 -83 -94 -90 -25 77 -77 -2 -149 -128 -68 36 -24 -10 -95 -17 9 -135 81
6380 81 22 116 -33 9 13 -147 -4 -49 -12 -84 52 -67 -7 27 -40 44 -9 2 -69 27 66 100 -7 -16 35 -56 40 26
6408 26 -66 8 14 -44 -40 15 86 8 -51 54 -40 43 68 44 -44 -28 -27 80 -147 -68 -47 -35 45 -17 -19 -12 76 27 29 9 -32 -16
6440 -16 -10 8 80 51 -48 -3 -27 -87 -96 -77 -63 -47 -26 -77 -28 -53 22 -65 -45 -55 32 149 67 47 -28 -37 71 23 48 -71
6470g1LJ04m3L0n1J2K0Q7j14J9j27K07j30O2j2K8p9J93p8q7J04L3j38J22j09M4
6496B9jMjn1K15j87L1JP5r9j7L7Q1j05j8L2j8l3N5j83R2R3n2m9R2P9j15L1j04
6525h6J72j75J67n9j8N6j19KO0q3Q0J31j24Q8p3m2J8J9OPl9Q0n3Q6j15m2J8Q2
6553D4J3%m1m6p0J28L1MJm0JN6k5l6Pn8m5J25%N3j23j21J81n6j6n5J31Mm5J4K3
6584C9RRm2J3l6k8OO6l9J1lL9q4J56j7j8q3m6l9R8j74J43j5L0o1l9J1J28l0k8
6614b4Pr5J29J9o4L6q3K0N6P8o4Q8M5j74p1J62j68J19j13R7J19j16j64Q5N9j53
6640a70K44j04O9j27J60o9l8OR0p7l8J19n1l9qk1K2n5N4O6R5j57n1J26n8Q1j7
6667E2J0q6P3n6N6L0m6r4M2m6J34n3J1J8j12J0P9o3P3j7j06J15p4J31mp5K4J00
$$ plain form
6470 -71 -68 36 -7 23 -28 -16 4 91 -23 -4 -131 76 -54 8 -4 24 -55 138 60 -27 77 110 -28 94 -15 29
6496 29 28 32 31 -20 195 8 39 40 115 16 -1 36 117 12 -6 26 8 -25 30 -153 -61 32 -20 -69 23 102 -13 18 -86
6525 -86 86 -89 78 19 1 57 -62 -60 0 -83 -3 128 4 92 19 -23 -5 14 20 27 -12 68 15 101 -14 -56 -38 44
6553 44 57 57 16 -30 -100 28 59 63 64 24 25 81 56 20 27 -31 -76 49 49 102 -21 -142 39 -17 -33 -88 43 47 2 16 39
6584 39 48 57 15 28 -8 -36 -30 36 -3 8 5 44 -40 116 99 81 -2 -48 -87 11 -163 -20 -35 -5 -66 -105 -94 34 4 -24
6614 -24 -17 -112 17 36 -28 8 -75 -55 1 79 15 103 148 -26 -97 65 -103 16 -97 0 119 3 -161 -76 -17 -170
6640 -170 74 -30 39 -88 72 3 -35 -29 61 -16 -54 65 14 -25 -33 -54 -32 -87 -33 33 128 -29 -80 46 -12 69 52
6667 52 62 -24 49 -7 49 79 33 -61 -19 -65 69 16 27 45 -67 -57 22 -41 32 15 -91 24 -50 81 77 2 26 126
6695A26j01j40J7l1J61l8p2J48j70J37Jp7l6L5qJ12n9k1P5n6L2L2o8L9J34j24
6721D8L0Ln2k6Qm8J19J35j65j14O3r4J44K6j17J20o5K2m8L6P0j47J07q7r3J38
6747A3K7l2L4j26L3J12o6rK8N4j25J24n8k8j05L1J37K6Ko1KOK5r1J21l3j06N7
6775hm7J34k6n6l3l7K10j60O7o9P3k3j5j49N3J24n8pl9Q0l5QM3r5J04k9J13r9
6803B4q1L0J5M8p6R6l3Q1j8o6k3j1K8o8PK5L6M4k8P0n5p0j8l2N9J5O0r5k5M9o
6834a8j62K53k8l0QJ21l7k52Q4J6Q4M3j8J4j07Q3j34O1j0J05jm5j1J9qr0R6k1
6862A5J82k54J02j26K8M1J18j55J11o6L0k2n4M7ml4J07q8j3J57j47J2K22j72n1
6887a4J11j99P3K0P1kj3K9n9l5q4PJ47r3M9n5Q0L4n1K8K6j21l9l7Q9J9Q4r0J5
$$ plain form
6695 126 25 -115 -98 -129 32 -6 -78 70 -100 37 38 -39 -75 -40 -48 64 5 -16 59 3 35 67 -1 38 172 48
6721 48 78 81 29 3 11 -37 82 217 52 -62 1 -93 51 77 -40 80 15 37 -11 25 95 -52 55 -32 -125 13
6747 13 40 8 42 -84 -51 61 -5 -14 14 68 -57 67 9 -19 -124 -93 44 70 72 11 13 19 44 -47 74 41 -65 -8
6775 -8 -55 79 53 -3 -36 -73 137 -23 44 -25 48 25 10 -139 -86 38 -20 -27 -66 14 -21 -13 30 -65 39 10 123 24
6803 24 -57 -27 -12 36 -40 56 23 104 86 20 -3 -14 14 -54 -47 -22 14 58 30 100 45 -25 -43 -75 -16 -1 59 -36 -61 -12 -18
6834 -18 -180 73 45 15 23 144 107 -145 -61 -45 39 82 64 78 -29 54 -80 -19 -29 76 75 30 19 38 30 -60 36 15
6862 15 197 -57 45 -81 -53 -12 106 -49 62 -4 26 4 -50 -3 -7 -41 66 -22 -35 122 -25 -13 209 37 -14
6887 -14 97 -102 -29 -9 62 60 47 76 17 -18 -102 -95 52 -41 8 -47 33 67 16 44 70 -51 -90 -127 -38 -19 65 -25 -10
6916a0M1Np3N4p4J50m9p7J14q3L7J2k6n0R7j4l3q4J65j27O9l0qO8p7lqJ44j64
6945c4M4L6m0L6n4N3j10K8M6L8l6l9p9K5L9j2Q9k0J25j66N0j8KL7j1L7j66K09
6973A09j67J47j50M4j3N3L6o5j2OM8p2L1PJ84r7j5j69J43q6k9K4P4j5nJ8j3PP4
7002I7n8r4M5O8j00n8J88r6P1m5KL1o3jP2k1n9R1j27p0Q8L6Q0j05M4n0K4j6N4
7031B8k1j22K00n5n6K7pJ09j61J7N5mP4k4l2o5L4ko9J14j39J60l4j9%j27Q5M8
7059A4K2q4J3P8n9l2PK0Q3j9m1j00M3P9m7p6K9p4J44j15P9O2j05L9Rqm7J47L5
7088I6p0m5k6Q5j1j24P4L6K0q6l5J44L0j33R8J3q9O8p1N9O2n1j4J2j16N2L4J9
7116C1l8J1J2m5J16j12R3o8j3J8j33J23MrL8q3N1o2M7j5M7k5K6p0J27K5j47J82
$$ plain form
6916 -10 31 36 -37 17 -57 93 44 -33 81 -2 35 47 21 -29 68 54 21 -63 102 -25 44 14 6 74 -3 -6 -14 130 -34
6945 -34 10 46 6 42 -12 41 -69 -41 5 43 7 -32 -111 -86 -47 -59 30 10 135 -31 19 1 3 40 29 66 -100 109
6973 109 -58 89 -61 -17 -30 23 59 -6 -18 -12 36 -36 -5 2 186 89 74 -95 48 -38 -67 -43 31 16 11 29 16 23 97
7002 97 39 -55 -10 58 -42 -100 88 -8 63 18 20 51 -12 -13 59 38 -21 70 -57 -127 -39 -3 77 -28 16 -34 -10 -26 28
7031 28 7 -115 85 30 -26 1 -6 103 -58 -41 14 10 84 60 28 -37 -3 -5 -74 40 -99 61 27 8 8 -119 -34 14
7059 14 36 -48 -35 43 -16 -48 -41 -21 62 43 2 -98 -55 24 -23 -99 -70 -144 0 -115 -36 26 -79 -40 -31 -39 -86 61 96
7088 96 26 -19 -45 40 29 -95 -21 15 35 -51 -86 58 88 -45 53 66 -23 45 -26 33 95 44 30 42 -74 -22 12 31
7116 31 -7 4 16 -29 87 -25 68 0 -13 5 -128 -5 -1 -10 28 -55 -4 -66 -19 -34 13 -12 14 -56 71 96 -51 131
7144A31j68N6LQj70M5J76k6j26K2J43j79P0K6K1M3r7J17l1m2r5J29j38%J04l3
7170a1P7q1n3J33j13P2j04J05M8j12%J82k15R1P6nm1j55J27o4lP6m6r4P8k3K18
7197A63p7r9K4p0m0K8J25Pr0n3J47j52j5L9PP3K9j34J91j82J8M4N0pr1O4Oo8J55
7226I2j51O3N3j66J22lk9Q3l1j10K03j44O3J0m6j67J99o4l5M8J08q5j45M5R5j05
7252i7N0L3M8J1j3o8l2P1k4rjN7j44J74j56K00m6j26J18p8k6k7R9J97k87N3l2
7279e5J04j25j8J28m0j8J04r7L1M9r4O0n7k2L7O7j23M3j0J44l4j89J73k4K4j5
$$ plain form
7144 131 -37 19 22 30 -140 -95 81 55 -71 -49 94 -85 -15 11 32 75 -22 95 64 22 -73 56 -82 -82 22 -11
7170 -11 66 -15 -68 65 -48 24 -80 25 73 -39 -39 143 -72 19 95 90 49 -106 21 -43 -46 30 -16 -110 -32 -55 163
7197 163 86 -13 11 -59 -99 -71 54 61 -29 -82 65 -87 -102 -63 -56 17 46 -88 103 -79 -61 -17 33 26 -65 -1 5 -63 92
7226 92 -59 4 57 -109 13 10 -19 64 33 -77 126 -18 45 55 9 -158 41 -23 -58 -10 98 13 -132 -87 8 -97
7252 -97 -47 -14 34 45 32 -36 -68 3 -21 -30 -31 26 -118 56 -100 100 54 -72 46 -32 -58 -85 14 211 -76 -23 -55
7279 -55 49 -76 -94 34 -6 -24 80 -17 14 63 -31 29 -28 -50 -13 54 -69 -26 -36 108 74 -115 58 34 58 43
$$ [...]
8191A3
##END NTUPLES=NMR FID
##END=
