##TITLE=1H_DE-80H_X3
 200.13MHz, d2o
 8 sc
 
 19ns.26.2.2025
##JCAMPDX= 6.0         $$ Bruker NMR JCAMP-DX V2.0
##DATA TYPE= NMR FID
##DATA CLASS= NTUPLES
##ORIGIN= UXNMR, Bruker Analytische Messtechnik GmbH
##OWNER= pz
$$ XWIN-NMR		Version 3.5
$$ Fri Jul 31 10:55:14 2026 Russian Standard Time (UT+4h)  Yarkov@DPX200
##.OBSERVE FREQUENCY= 200.1313
##.OBSERVE NUCLEUS= ^1H
##.DELAY= (6, 6)
##.ACQUISITION MODE= SIMULTANEOUS
##.ACQUISITION SCHEME= undefined
##.AVERAGES= 8
##.DIGITISER RES= 18
##SPECTROMETER/DATA SYSTEM= spect
##.PULSE SEQUENCE= zg30
##.SOLVENT NAME= DMSO
##.SHIFT REFERENCE= (INTERNAL, DMSO, 0, 14.3821)
##AUDIT TRAIL= $$ (NUMBER, WHEN, WHO, WHERE, WHAT)
$$ ##TITLE= Audit trail, XWIN-NMR		Version 3.5
$$ ##JCAMPDX= 5.01
$$ ##ORIGIN= Bruker BioSpin GmbH
$$ ##OWNER= Yarkov
$$ C:/Bruker/XWIN-NMR/data/yarkov2/nmr/H-C/1/audita.txt
$$ ##AUDIT TRAIL=  $$ (NUMBER, WHEN, WHO, WHERE, WHAT)
(   1,<2026-07-31 10:54:19.51 +0400>,<Yarkov>,<DPX200>,
      <created by zg, POWCHK disabled, PULCHK disabled
       configuration hash MD5:
       00 E9 B6 7A A2 85 ED C7 34 08 36 98 17 FE 4E 26
       data hash MD5: 16K
       23 46 0C 42 DB A3 F7 1F 92 E5 F1 85 94 0D AF 4E>)
$$ ##END=
$$ 
$$ hash MD5
$$ 00 35 81 ED 86 5D C6 2C 31 CB 5E D1 10 A9 D4 60
##$RELAX= 
##$RELAX= 
##$RELAX= 
##$RELAX= 
##$RELAX= 
##$RELAX= 
$$ Bruker specific parameters
$$ --------------------------
##$DU= <C:/Bruker/XWIN-NMR>
##$EXPNO= 1
##$NAME= <H-C>
##$PROCNO= 1
##$TYPE= <nmr>
##$USER= <yarkov2>
##$AMP= (0..31)
100 100 100 100 100 100 100 100 100 100 100 100 100 100 100 100 100 100 
100 100 100 100 100 100 100 100 100 100 100 100 100 100 
##$AQSEQ= 0
##$AQ_mod= 1
##$AUNM= <au_zg>
##$AUTOPOS= <>
##$BF1= 200.13
##$BF2= 200.13
##$BF3= 200.13
##$BF4= 200.13
##$BF5= 200.13
##$BF6= 200.13
##$BF7= 200.13
##$BF8= 200.13
##$BYTORDA= 1
##$CFDGTYP= 0
##$CFRGTYP= 5
##$CHEMSTR= <none>
##$CNST= (0..31)
1 1 145 1 1 1 1 1 1 1 1 1 1 1 1 1 1 1 1 1 1 1 1 1 1 1 1 1 1 1 1 1 
##$CPDPRG= <>
##$CPDPRG1= <>
##$CPDPRG2= <>
##$CPDPRG3= <>
##$CPDPRG4= <mlev>
##$CPDPRG5= <mlev>
##$CPDPRG6= <mlev>
##$CPDPRG7= <mlev>
##$CPDPRG8= <mlev>
##$CPDPRGB= <>
##$CPDPRGT= <>
##$D= (0..31)
0 0.7 0 0 0 0 0 0 0 0 0 0.03 0 0 0 0 0 0 0 0 0 0 0 0 0 0 0 0 0 0 0 0 
##$DATE= 1785480858
##$DBL= (0..7)
120 120 120 120 120 120 120 120 
##$DBP= (0..7)
150 150 150 150 150 150 150 150 
##$DBP07= 0
##$DBPNAM0= <>
##$DBPNAM1= <>
##$DBPNAM2= <>
##$DBPNAM3= <>
##$DBPNAM4= <>
##$DBPNAM5= <>
##$DBPNAM6= <>
##$DBPNAM7= <>
##$DBPOAL= (0..7)
0.5 0.5 0.5 0.5 0.5 0.5 0.5 0.5 
##$DBPOFFS= (0..7)
0 0 0 0 0 0 0 0 
##$DE= 6
##$DECBNUC= <off>
##$DECIM= 32
##$DECNUC= <off>
##$DECSTAT= 4
##$DIGMOD= 1
##$DIGTYP= 9
##$DL= (0..7)
0 120 120 120 120 120 120 120 
##$DP= (0..7)
150 150 150 150 150 150 150 150 
##$DP07= 0
##$DPNAME0= <>
##$DPNAME1= <>
##$DPNAME2= <>
##$DPNAME3= <>
##$DPNAME4= <>
##$DPNAME5= <>
##$DPNAME6= <>
##$DPNAME7= <>
##$DPOAL= (0..7)
0.5 0.5 0.5 0.5 0.5 0.5 0.5 0.5 
##$DPOFFS= (0..7)
0 0 0 0 0 0 0 0 
##$DQDMODE= 0
##$DR= 18
##$DS= 0
$$ [...]
##$SUBNAM2= <"">
##$SUBNAM3= <"">
##$SUBNAM4= <"">
##$SUBNAM5= <"">
##$SUBNAM6= <"">
##$SUBNAM7= <"">
##$SUBNAM8= <"">
##$SUBNAM9= <"">
##$SW= 18.0517328524113
##$SWIBOX= (0..15)
0 0 2 0 0 0 0 0 0 0 0 0 0 0 0 0 
##$SW_h= 3612.71676300578
##$TD= 16384
##$TD0= 1
##$TE= 0
##$TE2= 300
##$TE3= 300
##$TEG= 300
##$TL= (0..7)
0 120 120 120 120 120 120 120 
##$TP= (0..7)
150 150 150 150 150 150 150 150 
##$TP07= 0
##$TPNAME0= <>
##$TPNAME1= <>
##$TPNAME2= <>
##$TPNAME3= <>
##$TPNAME4= <>
##$TPNAME5= <>
##$TPNAME6= <>
##$TPNAME7= <>
##$TPOAL= (0..7)
0.5 0.5 0.5 0.5 0.5 0.5 0.5 0.5 
##$TPOFFS= (0..7)
0 0 0 0 0 0 0 0 
##$TUNHIN= 0
##$TUNHOUT= 0
##$TUNXOUT= 0
##$USERA1= <user>
##$USERA2= <user>
##$USERA3= <user>
##$USERA4= <user>
##$USERA5= <user>
##$V9= 5
##$VALIST= <valist>
##$VCLIST= <CCCCCCCCCCCCCCC>
##$VD= 0
##$VDLIST= <DDDDDDDDDDDDDDD>
##$VPLIST= <PPPPPPPPPPPPPPP>
##$VTLIST= <TTTTTTTTTTTTTTT>
##$WBST= 1024
##$WBSW= 4
##$XGAIN= (0..3)
0 0 0 0 
##$XL= 0
##$YL= 0
##$YMAX_a= 145165
##$YMIN_a= -133044
##$ZGOPTNS= <>
##$ZL1= 120
##$ZL2= 120
##$ZL3= 120
##$ZL4= 120
##$ABSF1= 10
##$ABSF2= 0
##$ABSG= 5
##$ABSL= 3
##$ALPHA= 0
##$AQORDER= 0
##$ASSFAC= 0
##$ASSFACI= 0
##$ASSFACX= 0
##$ASSWID= 0
##$AUNMP= <proc_1d>
##$AZFE= 0.1
##$AZFW= 0.1
##$BCFW= 1
##$BC_mod= 2
##$BYTORDP= 1
##$COROFFS= 0
##$CY= 83.5205535888672
##$DATMOD= 1
##$DC= 2
##$DFILT= <>
##$DTYPP= 0
##$F1P= 10.8118882576601
##$F2P= -7.23987719738617
##$FCOR= 0.5
##$FTSIZE= 0
##$FT_mod= 4
##$GAMMA= 1
##$GB= 0.15
##$INTBC= 1
##$INTSCL= 1
##$ISEN= 128
##$LB= 0.25
##$LEV0= 0
##$LPBIN= 0
##$MAXI= 10000
##$MC2= 0
##$MEAN= 0
##$ME_mod= 0
##$MI= 1.114404
##$NCOEF= 0
##$NC_proc= 0
##$NLEV= 6
##$NOISF1= 3.799351
##$NOISF2= 2.8
##$NSP= 1
##$NTH_PI= 0
##$NZP= 0
##$OFFSET= 14.38212
##$PC= 1
##$PHC0= -7253.183
##$PHC1= 2.82197
##$PH_mod= 1
##$PKNL= yes
##$PPARMOD= 0
##$PSCAL= 0
##$PSIGN= 0
##$REVERSE= no
##$SF= 200.129724274929
##$SI= 16384
##$SIGF1= 3
##$SIGF2= 2
##$SINO= 400
##$SIOLD= 16384
##$SREGLST= <1H.CDCl3>
##$SSB= 0
##$STSI= 0
##$STSR= 0
##$SW_p= 3205.1282051282
##$SYMM= 0
##$S_DEV= 0
##$TDeff= 0
##$TDoff= 0
##$TI= <>
##$TILT= no
##$TM1= 0
##$TM2= 0
##$TOPLEV= 0
##$USERP1= <user>
##$USERP2= <user>
##$USERP3= <user>
##$USERP4= <user>
##$USERP5= <user>
##$WDW= 1
##$XDIM= 8192
##$YMAX_p= 0
##$YMIN_p= 0
$$ End of Bruker specific parameters
$$ ---------------------------------
##NTUPLES= NMR FID
##VAR_NAME=  TIME,          FID/REAL,        FID/IMAG
##SYMBOL=    X,             R,               I
##VAR_TYPE=  INDEPENDENT,   DEPENDENT,       DEPENDENT
##VAR_FORM=  AFFN,          ASDF,            ASDF
##VAR_DIM=   8192,          8192,            8192
##UNITS=     SECONDS,       ARBITRARY UNITS, ARBITRARY UNITS
##FACTOR=    0.0002768,     1,               1
##FIRST=     0,             0,               0
##LAST=      2.2672688,     0,               0
##MIN=       0,             -133044,         0
##MAX=       2.2672688,     145165,          0
$$ Real data points
##PAGE= N=1
##DATA TABLE= (X++(R..R)), XYDATA
$$ [...]
984E5m20P10j061L94O01n58L39j01p41R16J13k07L63o08N63L7j250P67M61o35
1004b62N68o97n93J285q6m63J49l45M99n5p14J032J54p93Q77o07k13J002n89K86
1024D35K33j393J90P92k70K00n11J29Q87q64l82Q84j07J85m35j124J260K86q22
1043d27J017m03n85P36k36j99L0k60M79m91o08J190n07n9J193j176k77J129m77
1062F9r8K46p18M69J43m16M53k76N62K00j237M47Q26r12K12j06p56J066l2l36
1082a94R57o22l21R18o44k39L71o6J60p98J88O19o89Q21P58k111L34J522j493
1101e29j80R05m32k2K03j98j6M29J014r65j216J581k92j469J513R8j397R43L91
1120C61o84L03J69J80j19o26J88M7r1P96p21k03Q33n51N14L73j195P89M09j622
$$ y = [55, -365, 345, -716, -322, 279, -279, 60, -41, -782, 134, 247, 40, 403, -205, 358, 395, -855, -88, 373, -262, 306, -391, -984, 301, 215, -248, -99, -444, 55, 0, -714, 318, 472, -321, 556, -51, -264, 738, 149, 435, 668, -725, -535, 257, -13, 187, -324, -195, 692, -172, -554, 330, 223, 408, -27, -1151, 109, 395, -427, 590, 187, -398, 338, 102, -97, -67, -327, 152, -339, -947, 243, -264, -323, 870, -306, -583, 546, 69, -29, 217, -501, -32, 111, -305, 148, -128, 434, 634, -603, -156, 670, -242, -30, -136, -892, 174, 142, -194, 763, 141, -180, 738, 94, -145, 226, 160, 320, -478, -290, 329, -360, 461, 1219, -892, -558, 964, -529, -709, 196, -236, -258, -55, -253, -269, 160, 1174, 209, -1007, 574, 282, -1187, 326, 424, -973, -30, 361, -323, -20, 149, 329, 210, -416, -228, -181, -272, 524, -197, -400, 433, -118, 396, 769, -426, 363, 772, -850]
1140h50N98P79j045M15N03n70j35P81K73r53l11J355j191n35K108j111j411K297
1158I97k23j880J049R80p94o88M70j30o64Q18O48j615N39J515j400j65J484r65
1176b4k47M44m74J52m3L62N12p16j47O40m21J96k5m07J94l30K20L88j035Q87J214
1197A340j793j92J581p62m71P90l28o45J38R81o19o81J473j42j812J312O56j835
1215a009P76J096j509j63J182Q6n69R2O86p98l98J177o37q51J348j95r81M28L21
1234H2K12j06o11N52N2o86N75J84q24N70K56l27j21L66M35n12l02Q64q62m05J739
1255A131o78j486J231M20j320O06N41l56n39N44J61j245Q28J391j668k12J593
1272I42q61m38R29l60o70K82K31j40m41N33M53r78L20M59q67O25N79q31k81N29
$$ y = [-850, -252, 527, -518, -103, 400, -170, -305, 476, 749, -204, -515, 840, -351, -886, 1222, 111, -1300, 997, 774, -1106, -57, 923, 129, -559, -89, -219, -883, -65, 583, -1032, -493, 1022, -378, -543, 941, -24, -271, 173, -301, -149, -192, 170, 682, -34, -181, 459, 38, 234, 209, -198, -4, -334, -114, 274, -761, 126, 1340, -453, -645, 936, 174, -297, 493, 165, -480, -342, 639, 20, -661, 812, 670, -1142, 170, 826, -1009, -233, 863, -646, -809, 373, 459, -110, -18, 668, -130, -528, 649, 12, -839, 509, 314, -667, -239, 82, 294, 188, -423, 129, 181, -505, 70, 254, -570, 0, 256, -71, -192, 174, 609, 97, -205, 659, -203, -608, 1131, 453, -1033, 198, 618, -702, -96, 445, 89, -450, 94, 255, -990, -162, 1229, -439, -651, 942, 81, -357, 572, 212, -458, -176, 55, -85, -526, 7, 460, -518, -198, 261, -606, 19, 598, -233, -514, 15]
1292A5J93O5n76L13O80q97J3O11o24J41N00n20l69K13N95p1o81O60K66j218Q19
1313A28M55j120L85P11n47l41M09K57j10l90K88l69m81J150m8j063O54M67q79
1332d44K55L00N0j54j95M63l22m41R44k67n63M79K7k88L06N6j66k46ON29o77k34
1354e82J168l82n80N55k9m1J53o6k06j67Q8L64n46J3Q29p19j93P71n54m2M95l41
1376a2j65j45K02M93l91J16L19o96K17N26q87J49O51n08k17n8L16M97m98m2K94
1397A61m05K96L05o78J92K47k33N7L1N0L09l22L0L6n41M48K37l64j6J65q8M03
1419C20l72O6L05j31J48m13k46N15J37o84K46l9K0K38j12R0k2k17K62l45j13M47
1441A00j1m24L98j58m4M72j04r7l70r7L80j11l55N04j16j99M10k78J58K52k50
$$ y = [15, 208, 273, -303, 10, 690, -207, -194, 417, -207, -66, 434, -86, -455, -242, 353, 282, -399, 261, 527, -691, 128, 583, -537, -152, 559, 12, -329, 80, 337, 227, -163, 125, -244, -725, 425, 377, -686, -32, 435, -444, -189, 111, 161, 7, -188, 275, -47, -488, 456, 189, -374, 105, 132, -156, 150, 206, 40, -206, -200, 329, -348, -582, 586, 204, -376, 179, 150, 109, 262, 196, -10, -177, -89, 275, -271, -258, 571, -148, -341, 430, -124, -166, 329, -12, -177, -322, -120, 373, -18, 98, 417, -279, -62, 464, -423, -274, 377, -131, -348, -406, -90, 407, -91, -133, 161, -244, 52, 357, -321, -129, 118, -115, -58, -27, 23, 332, 10, 40, 76, -465, -17, 220, -144, -160, 5, -83, 320, -52, 14, 319, 188, 336, -77, -323, 192, 329, -355, -109, -148, -128, 110, -2, 88, 66, -151, 111, -234, -347, 100, 89, -335, 63, -95, -139, 333, 229, 132, -238, -335, 45, -66, -421, 83, -33, -232, 178, -100, 58, 310, 60]
1462F0o1j53p8M60k34j20K43j53j49M61k66M4J41l96J60N5l07L00R0p8J48l73
1484b06K28L97l83j1O9k16J57j14j98L52k5j35J19l07K97J13j33K5q4k18L76r1
1506A2j28K31j75K5J94k41qJ92j79J63l97KK59J74j89J50j77K76L4m69M06J18
1528B73l38J26jj30J98j4j00Pk79J77J14p7J22j69k33M66k67j45N55j90Q1m0m13
1551b77K49K46k31j6j01M1K09k50J8K31l58L28j94q2K11J13k55L32j78k57K88
1572F7J03m4M0k12J74ok16J49j86J40J32m42J86J98j27N2J24l58L24O5r4O6j91
1595e6P9J8r2J77k3j69J56j63j74K66J1j65K38j48p7J77k0l1mKJ03m2k75K77n6
1620IJ49p0k74O4K65j47p8K17k97K33m0j7o0nO4R2j58l8J34m3L14j73l90L43l
$$ y = [60, -1, -154, -232, 228, -6, -126, 117, -36, -185, 276, 10, 54, 195, -201, -41, 14, -293, 7, 97, 19, 167, -206, 22, 419, 36, 25, 94, -122, 35, -79, -277, 75, 50, -85, 34, -273, 24, 137, 4, 29, -55, -273, 103, 12, -116, 115, -60, -35, 159, -82, -90, 102, -77, 86, -311, -309, -50, 124, -65, 85, -92, 184, 218, -251, 155, 273, -65, 61, 60, -70, 128, 114, 14, 21, -258, -81, 33, -44, 78, -91, -324, 142, -125, -270, 285, 95, 176, 136, -277, -28, 218, -13, -29, -130, -89, 120, -130, -112, 119, -239, 89, -105, -187, 24, 137, -118, 214, 36, -221, 67, 170, 126, 166, -46, 128, 122, -94, 55, -131, 9, 141, -301, -115, 83, -44, 8, 132, -226, 98, 163, 69, 135, -56, 23, 41, -51, 126, 103, -66, 90, -73, -247, 19, 30, -135, 103, -45, -122, 55, 35, 4, 0, 2, 105, 63, -212, 65, 9, 158, 88, -186, -122, 143, -4, -82, 135, -162, 71, 31, 14, -46, -51, 13, 105, -53, -91, 43, 0, 314, 141, -249, 94, 91]
1645I1l9kj88N4J27j14ML2J48M1k68r8L30n9q9K37k94Lj1JK50j66j98L48r7j26
1671h3J75j85J88J9l10P2l3J29L89n50R2L58l47P5J59k44J38M3k66J26M5J30N0
1694A70k43J07l0j64J48K44l82J10K44k37M6J07o5O3j88q8J15J00M5j4l47J73
1716h6J32k40K29k1N8qj20K9O2p5K16j05j75J05J1j6J86k51l7J83k13K84q9k10
1740a51J79J70l41J75P9rn2j9j20P9k8J65K4l05K47n6l13M16j34q5J83p0j55M5
1764g6J33j9M3j94J59j55J73l5l6p7J89p1j42J80p7J18m4k28N4O2j76K87k06N7
1788h1K02k40J87p5Q2J06k05r1J24r3J42K55m04j1K26j21Q4J2j05J11q3j75K13
1811F0j19J23R2j44j21J56l6L5K8k65J39m2l5J97j52J11R0j55P4L6k86K29j4m1
$$ y = [91, 52, 50, -138, -84, 43, -71, -67, -35, 113, 154, -114, -212, 118, 59, -30, 207, -87, -84, -95, -94, 156, -10, -208, 140, 43, -83, 92, -93, 95, 114, -196, -124, -157, -28, 361, -189, -97, 261, -86, -11, 148, -96, 42, 85, -181, -55, -10, 120, 170, -73, 34, 4, -160, -12, 232, -150, -40, 204, -33, 13, 120, 55, 118, -70, -158, -43, 57, 102, 88, -259, -86, 46, -194, 35, 14, 72, 64, -56, -27, 35, -40, 176, 71, -104, 1, 12, -4, 182, -69, -106, 77, -136, 148, 59, -151, 28, 198, -143, 32, 111, 102, 50, 31, -89, -10, -38, 127, 151, -154, 93, 37, -276, 140, 6, -79, 104, 34, -121, -76, 57, 38, 81, -113, 46, -109, 64, 29, -7, -84, 105, 34, -108, 72, -5, 113, 69, -159, -105, -43, -219, 68, -138, -81, 121, -119, 68, -7, 75, 181, -24, -115, 9, -84, 58, 313, -91, -102, 124, 3, 87, 99, -6, 105, 22, -153, 60, -59, 64, 156, 12, -109, 47, 11, 46, 74, -191, -52, -94, -129, 68, -84, 27, 117, -38, 36, 72, -214, 15, 1, -40]
1835d0k6j32K81O2k11N0J82k07P6r6J9J79j78l3J08j22K67o4k22K20o7o4J95m6
1859A31j43K2K2m8J24j08J7J07j37l2j23P6L54j44k46J02J5O3m0n1J65j76J8P2
1883D0k36Q7J80j34q1J99j73J68M3r8J02r2J7M8j23PJ07k4k5k9k9L15j44k14M7
1908d2k3KJ23p4m1J82j29J07o9l4N2k8M5j30R3r6J98j89l2K6p5J46J9k35L10k0
1934H6j41oj09K04J6j40J15L2j17K65j97J9K5k2j47J72j63O8K3j13J63n6J6R6
1958H9J9j17J0j28J88N0q3m0Ro9J84q3m9J23j03j9L1j31L2K41q0On3l1J73j90
1984b1qJ24j25J0K9q7J96q0k3J5k00p9L19j86PN5k43K68J65j69O5Nk2J48l63J08
2010i2K66m2j88L2j18J36M3j85K57j19j23J80r5N3K05j59p2O6k09K37M0k05J03
$$ y = [-40, -66, -198, 83, 145, -66, -16, 166, -41, 35, -61, -42, 137, -41, -74, 34, -88, 179, 115, -107, 113, 46, -18, 177, 131, -12, 10, 32, -16, 108, 0, 17, 124, -13, -45, -168, -92, 262, 118, -128, -26, -11, 52, 12, -39, 126, -50, -32, 40, -196, -109, 71, -63, -144, 55, -118, 50, 93, -5, 97, 5, 22, 70, -53, -46, 61, 37, 12, -17, -46, 269, 125, -89, -42, -65, -63, 60, -14, -55, 127, -2, 105, 36, 2, 54, 26, 71, -59, 34, -62, 136, -53, -85, -59, -134, 12, 31, -204, 106, 86, -55, -61, -170, 34, 50, -90, 25, 57, -60, 205, 8, 27, 52, 30, -117, 55, -108, -40, -17, -130, 33, -23, -7, 89, 108, -9, 1, -127, 61, 111, 28, -12, -3, -72, 112, 29, -20, 103, 0, -19, 12, -119, -87, 154, 74, 80, 27, -4, 169, -21, -29, 95, -30, -20, 9, -78, 118, 38, 15, 30, -170, -249, 70, -116, -109, -54, -297, -29, 136, -33, 32, 37, 15, 163, -200, -92, 174, 132, -56, -24, -142, -6, 37, -148, 109, -10, -133, 47, -48, 5, 210, 51, -21, 45, -164, 73, 113, -92, 11]
2033A1J37j45J35r6k8P8l4l3o2j67K39Jl7K9n1k6J51o6N4O0j82J72q2k34K62l4
2059E2j20J75j71k0J68n4K21j99k22K80j54m9L09j83j06L6l8R4J3Q2Or8k5J49
2083A46q1m1K2j35J76l9j17J56q2m1R2m3n9j39J86n3P0j98J75J16j74J69m7j08
2107d9N6mq6J91j63M6K6Nq6P6P8N2j86l8KQ0m9J19q5K9j0j44K23J3r9K63l07l2
2135g9J55P3p9l2j3PlJ4j7j11P1l5r5O7R0M4l9O6j98J57o1N8n9kJ8P3j45O7M8
2164D0j26J23o6o5N5Q6p0Lo9J62L4j58J7N7j3J05p1j51J46j1j3J25k16OJ02r8
2190f6K22k6l23J78M6q7P8L5J4K4m8m8J00q7J48j44o8J12j46k9J95j02N9J6j14
2215f1j8L1j1K44j60o3N3KK5M6k44N8J32j21J22o4q3J54J9j67J03jQ1n2J2J27
$$ y = [11, 148, 3, 138, 42, 14, 92, 58, 25, -37, -204, 35, 36, -1, 28, -23, -49, 102, 36, 90, 150, -32, 140, 58, -176, 86, 52, -68, 107, -64, -84, 84, 30, 251, 52, -170, 110, -44, -93, 216, 33, -73, -37, -75, 19, 32, 114, 120, 22, -3, 146, 65, 24, 46, -89, 87, 48, -69, 87, 5, -36, 56, 13, -46, -185, 1, -52, 18, -180, -5, 111, -63, 106, 59, -49, 7, 3, -83, 108, -55, -9, 17, 22, -64, 12, 90, 142, -44, -82, -80, 0, -49, 70, -15, 14, 4, -140, 83, 96, -3, 260, -47, -79, 76, 149, 70, 38, 25, 32, 29, 43, 26, -85, -14, -49, -144, -77, 13, 57, 18, 84, -114, 43, -18, 40, -19, -21, -3, 70, -75, -8, 40, -86, 37, -29, -94, -39, 47, -23, -20, -89, 73, 107, -51, -34, 23, 10, 115, 44, -107, 39, 28, 15, 140, -76, -70, 32, -66, 156, 130, -193, -15, 31, -56, 22, 57, 71, 95, 47, -1, 99, 12, 160, 16, -52, 60, -86, -115, 80, -22, 37, 53, -61, -79, -48, -59, 185, 25, -38, 15, 17, 42, 88, -156, -98, 34, -87, 35, -29, -112, 42, 61, -106, -3, -4, 77, 25, 37, 164]
2241A64o4j19J12J7j15J48j90L0M4j7K7J2j01MN6m2J33n5j09J83j54J17N3j93
2265e9J36nN2j18M1l9J13j95K0J4l9N2J11j27J4P3j22J35j49N0M3K7r9J72j18
2290a7O6m8MM0p9P1L6j50R7J07k38J2J09M6j15K29j59J4L5o9J07j56L2j8j3J82
2316A25o7j00P5o6q2R8l9q6J88m0p2O5n7J30n7j43J59p9m3R7m1J6O4j60N8L2m2
2343f7O7J05k00J66j15J8J66j91J29Q9l32J48J6j00K01P2j70j6oP2j6j5JK3j91
2368a46K15n6r3K51k29PR7k27K42j0J4r2j5k1K22j55j33J80j42P4m9K5OK6Q1r
2394F3j9j49K15p1j24J20o8o8J60o7NJ1M4j47J3N6M5OK5L1o2j60K69j72pOm9J02
2422Hj48N4J80n3o9J16o0K9QR3k6k26J19M7p8r4J52j27J53O0k45J08p7oP5j4j3
$$ y = [164, 100, -19, 93, 110, -5, 143, -47, -17, 27, 10, 37, 49, -52, -48, 8, -34, 99, 44, -65, 118, -36, 81, 134, -59, 77, 72, 124, 6, 47, 8, 121, -74, -54, -40, -79, -27, 84, -43, -29, 44, -78, 57, -92, -42, 1, 28, -71, 101, -17, 49, 1, 5, 45, -34, 37, 73, -77, 20, 127, -111, -99, 10, 56, -59, 170, 11, 25, 60, -9, 98, -58, -26, -44, -57, 125, 58, -42, 33, -33, -115, -17, -56, -142, 46, 6, -66, -1, -58, 72, 15, -128, 31, -48, -91, 6, -35, -19, 45, -115, -57, -25, -67, 0, 105, -95, 71, -44, -26, 140, -51, 78, 167, -165, -17, -1, -101, 100, 172, 2, -14, -20, 52, 36, 21, 22, 45, -146, 69, 13, -80, 171, -58, -51, 46, -181, 61, 51, 65, -27, -42, -63, 159, 4, -129, 51, -91, -17, -66, -41, -35, -9, 72, 63, 44, -105, 110, 39, -85, 35, -33, -101, 59, -8, -3, 8, 52, -95, -82, -26, 19, 25, 50, 81, 19, -141, 128, -44, -51, -45, -94, 8, -140, -86, 94, 41, -28, 88, 28, 57, 65, 158, 132, -94, 25, 72, -6, -100, 52, -75, 78, 138, -107, 1, -76, -82, -7, -21, -34]
2449c4L1j9L4p9k5K51j12r8R0m1M1n5J41j24J25k8j21p7K2J04k6J3K2M0m9M7N3
2476A26p7l3m2J2q3RJ20Q3k01J40n4k4J73j95M7l7N7jr4M8M3M8n2K8k3l2J47k11
2504g8J66j91R1J82k34L3K0Qr6J60j63N9p3J54L9k02m2K12n2L1J9j32J87o3K7
2529F2Q4l1j12qj21N1J34r5J25k8j14N9R4o4K1n2j37J61qo9O1o0J21j75M8Q8k8
2556Gj27J33r2O6J11p9j9%K9l8N1o6O1P9j07K6o7L7P5j15O2j12J5P7l8l6J19m5
2584GK8M4j73R1N7m3Om5pN2Jpj7j50Q2J01ro2M4p5K8M4m6K07j50K6K5j17J00M7
2614H9p0O5j30p0O3R2rM5p6nN7o3M1K0j36O9m6J4N3N4k9j17O3J11j86l1J28J12
2642A08r7L7r4J7P3j2m9R6r6R2m6rJ5l3p2J13j27O3RrL2j20J20j5O2j09J1J6N1
$$ y = [-34, -3, -22, 12, -67, -92, 159, 47, -51, 39, -2, 39, -16, 125, 1, 126, 98, -23, -100, -78, 26, 0, 13, 35, 75, 26, 73, 126, 49, 16, -26, -14, -97, -88, 32, 115, -86, 54, 0, -24, 149, -46, 1, -36, 21, 20, -74, -26, 17, 65, 13, 41, 18, -14, 133, -78, 88, -103, -12, 170, -64, -31, -11, -3, -99, 61, -102, -43, -116, 38, 77, -125, -167, 45, -7, 24, 43, -89, 98, 35, 62, 146, 115, 3, -5, -126, -75, 59, -36, 89, 61, -53, 6, 100, 36, 57, 5, -132, 29, 21, -48, 13, -47, 74, -101, -53, 35, 7, -120, 13, -79, -13, 98, 19, 0, 0, 29, -9, 42, -24, 37, 116, 9, 35, -32, 5, 80, -35, 27, -85, -70, 7, -31, -67, 52, 7, 35, 79, -94, -3, 54, 11, 17, -28, -35, 17, 18, 11, -6, -156, -74, 27, 18, -44, 0, -75, -47, -3, -49, 158, 8, 34, 59, -58, 42, 89, 19, 84, -46, -116, -53, 39, 30, 75, -1, -6, 51, -12, 29, 49, -87, -18, -64, -50, 3, 57, 28, -89, -26, 85, -101, -132, -4, 108, 11, 48, -46, -29, 44, 32, -17, 79, -17, 75, 29, 20, 35, 2, -70, 43, -84, -21, -12, -21, 11, -109, 11, -4, 58, -51, -40, -24, 27]
2671B7R2l7l2l3p2k4J64j26J60j48j5P3j97P3J34o1K11n4k80K28j03r0K14r4J6
2696B6J48o5j69O0l4lln0J25j25R6N5j00N3O8j13nJ08n2m9M7L0r5j06J52k5jK5
2724bJ41q6p8j7R5n1L5j20M7R9n1K7j29m5K09j8l0q3n5J66Jr2LJ8K3J46j81O5
2752C7m2l9O4q5J04Km9pm2M8o1Q4p0J9M2j40K00j49qlR9%kO7j60K59j92P3J8m2
2782B5N4j72K10r8n2K0J26j77P1L1r7J10o0M9k1pK4p7J6J2M1n3J16q8L1n4l8k
2810f0J7J2R2j04lQ9j00M4k8l4M6J03q6L5L1j08J67j9q5qo3nR2j07J10k2M4j11
2838f1j1Q0Rm0o4p0J02O3J1L2Oj3j15R5p5M6O6n1J1j9k7L2K04j52po3r7K05j04
2867gO6j5J4p3K9m6n1J41j14O7r1J12L0K2l4J8o9q9J56k2j17N4P0j58J90j87K43
$$ y = [27, 119, 82, 50, 17, -55, -79, 85, -41, 119, -29, -44, 29, -168, -95, 39, -22, 189, 135, -145, 83, -20, -110, 104, 10, 26, 174, 109, -60, 0, -34, -37, -40, -90, 35, -90, 6, 61, -39, 14, 82, -31, -36, 72, 20, -29, 18, 48, -47, -153, -1, -26, -27, -2, 139, 53, -25, -42, 53, 2, 37, -83, -36, 63, 12, 39, -90, -135, 74, 56, 26, -57, -112, 54, 55, -37, -34, -16, 7, 153, -28, 37, -5, -44, 20, -65, 39, 41, -8, -15, -57, -9, -70, 14, -56, -37, 5, -135, 65, -84, -92, -95, 4, 4, 2, 69, -91, 168, -24, 49, 67, 25, 79, -93, 117, 19, -33, -13, 113, -64, 7, 38, -59, 51, -9, 40, 19, 12, 36, -41, -25, -13, 28, -25, 91, 3, 34, -20, -58, -60, -43, -31, 61, -43, -46, 43, -57, -13, -41, -75, -29, 74, -12, 23, 54, -54, 113, 94, 9, 1, -62, -67, 25, -82, 28, 6, 50, -61, -72, 8, 17, -23, -87, -157, -55, 8, 19, 51, 57, 44, -71, 24, -51, -5, 61, 10, 21, 2, -25, 7, 211, 59, 52, -11, -108, 97, -7, 59, 44, 58, -15, 14, -32, -83, 58, -56, 11, -80, 32, 62, 84, 50, 68, -1, -90, 66, 44, -73, -19, 51, -107, 83, -104, 139]
2894A39q8j61M5M8R2q4j22P2O5k0J2O0r2M5o8Q9j11J20n0L7o3J7p9J01J21k14
2920h9J03O2k25M8K2O4J04k5p5j20Q7m6R3N9j82M1L8J21j48l8Q4p9P9N2L9o1O
2947A4k8j7J33j22l7j5O7j0j5k3P1l4Q5p7O9n5j18O9J00j14j11K79J5j80J03r9
2973e0J1J58j94R5rj23K32j52Q0q4Q0m7n8P1O1l0N%m1K6Lp7L9l3J0R0l2j20Q0
3002iK8j24R5n0J33l3Q1j81N7RJ8L4l0m8m3k8K6J48j07Lm1J27q5j16J66M1j15
3029d4k5jK06l5r4K1KK0JJj63pJ16j63K29o7K2l8l9J27j20M7Mr6O8Q8j34P7ko2
3059f1k3J06j22J93j5j74QK21j69J06o3L8o5m4N6m0O2N5L1o7K3r9ron4Q2P5n3
3087hK3k3N6j9j5OK2j52J19K7n9n1J63q0m9p4K2Q6K3r4J63p4O7n4j29M5O5K1k9
$$ y = [139, 51, -110, -65, -17, 75, -9, -131, -59, 6, -14, -2, 58, -34, 11, -57, 32, -79, 41, -9, 28, -35, -18, -97, 4, 125, -89, 14, 76, -149, -101, -79, -15, 89, 64, -11, -131, -44, -90, 3, 62, -120, -79, -41, 80, -68, -106, -22, -101, -22, 30, 69, 8, 14, -14, -31, 102, -20, -57, -72, -5, -15, -30, -53, 18, -16, 69, -8, 61, 6, -112, -43, 57, -57, -168, 111, 126, -54, 49, -50, -39, 119, -75, 20, 11, -112, 120, -32, 48, -36, 44, -3, -61, 10, 71, 41, 46, 46, 5, 31, 34, -43, -4, -37, -27, 63, 31, -89, -9, 19, -105, -10, -60, 73, 40, 121, -60, -3, 6, 24, 58, 28, -20, -63, -91, -65, 83, -24, -21, -62, 65, -20, -136, 30, 71, -44, -69, -70, 136, 101, 7, 28, 30, 50, 51, 52, -111, -118, -2, -165, 64, -3, 19, -19, -58, 69, -51, -4, 0, -96, -28, 60, -74, 3, 1, -61, -84, 22, -100, 93, 78, -96, -88, 133, -36, 70, 7, 45, -20, -64, -8, -48, 14, 69, 100, 33, 56, -43, -52, -58, -112, -30, 45, -8, 15, -8, 48, 29, 14, 20, 42, -110, 9, 36, -23, -74, 89, 9, -40, -114, -92, -6, 17, -77, 86, 12, 79, 25, -104, -59, 6, 27, -2]
3116bm2NJ38o7p8jK3J01Nj88J02p2J41kj10k0l9J37J7q7N4q1K7P4n3O5j55J20
3144A2J2k9j17JQ9M5j5oP7j26K3lJ60n6j51M9k8j08J57N6o8N4Qk3j4m4J61p8p8
3173d0L5J4J8o8R2r3L1rj8K1R2j49R1lK1L4j75O6Q3p3N1q1P2M1j2o9j2KKl5R2
3204B1k9J4O8J5m4Mk6kJ2l8k5J35r0J07l1o6M3n0o3n5J53j56R7Lj47Q5N0Q9M6
3233A20k09l6Q9Q9j62OJ18K3q1m9J82j70J04JoMQq5R7j22J5L9p1Q9j5K0o0J42
3261H0Rj27R6K1m0l4N8j10N9J5M4q9l3P1j1J5q4J07j11J15r5J07j0k6r2K7L7O7
3289F6qn4N9Q5j51J8k8Q4n1m2K3l3K2J6m0J3J59j21k3l9J8J1J17j11Rpl8p9K43
3318A18n8n2Pnok6m6Q9mk0nj19RQ4K2M9k4j2l3j16J88Pon6K5l0j5j2N4j59J15
$$ y = [-2, -44, -39, 99, 32, -46, -47, -24, 77, 82, -106, -4, -76, 65, 63, -47, -67, -106, 31, 48, -39, 15, -66, -39, 35, -18, 47, -108, 12, 24, -5, -122, -121, -32, 13, -2, -8, 69, -57, -34, -37, 123, 67, -84, -35, -63, -171, -14, 42, -26, 28, 36, 13, -1, -45, 116, 38, -40, -5, 9, 27, -41, 51, -42, -11, -20, -38, -17, 75, -74, 17, 14, 35, 69, -106, -40, 43, -30, 21, -60, 12, 53, 41, -28, -40, -38, -36, -71, 21, -8, 6, 74, 89, 45, 49, 23, 21, 33, -5, -30, 105, 15, 122, 91, 25, 68, 18, -45, -100, 53, -103, -6, -3, -150, -65, -15, 74, 120, -89, -125, -36, 53, -109, -103, 15, 38, -43, -92, 90, -80, 24, 25, 19, 23, 31, -54, 43, -79, -64, -25, -96, -7, -22, -2, -62, 80, 89, -38, 58, 79, 39, 5, 63, -47, 12, 27, 71, -18, -51, 20, 9, 24, -60, 47, -64, 51, -44, 63, 53, 27, -65, -38, -1, 66, 58, 4, 63, 148, -3, 15, -13, 71, 20, -22, 1, -32, -10, 6, -34, -21, 138, 17, -6, -45, -27, -16, 101, -10, -1, -8, -46, -125, 118, 60, 8, 15, 10, 4, -22, -68, 21, 17, -3, -8, -127, -118, -34, -12, 37, 13, 1, -32, -148, 40, 47, 41, -15, 10, -20, -35, -47, 7, -152, -37]
3349c7k0m7J23m1L5p5J64j51J01p1pM4k0j5J3k8Q0j04J15l1p7J16k08J45m7K33
3375A90j46L8Kj24Q2O3j15l1J85j81l0J1K4%j18K19L5p4j8k4m8J08J11j11j19
3400g1PJ02o0p5J24NK7%n2n3O2Mn0JPP9j37M6J54q6M4m0J8J8p6J7k0N4j01Q4p4
3431d2J11l9qk4n9P1q6K0P4j4k4M0M8p7P4q2m2J73j88P2QQ9k30J31p5J31j6k4
3459A2l8j22J70J8J4l3j2oM2K1r0q6J72j38P9p2Q2j8N8j2k3j30J67r9M0oJ18k08
3487a00M7J58j19N3Mp4J15k03J02N7m7N4j38J38M7j43J1J87r6r7J25j65k7K03
3511I2j66R1M6l8m6J04n5K8J7j19R9j01L4nJ1l3j8J15m3j06J19p1J03K3j05jK6
3538AL4p4N4k7Lk4q9R4R3j11J23q2k0j5J29q1m1OO6K8n6n2l7M9J47q5j12R4n7
$$ y = [-37, -57, -104, 19, -22, 13, -62, 102, -49, 52, -19, -26, 18, -2, -17, -4, -32, 48, -56, 59, 28, -49, 67, -141, 4, -43, 190, 44, 82, 84, -40, 42, 105, -10, -41, 144, -37, -67, -56, -32, -32, -150, 69, 104, 30, 12, -12, -60, 48, 159, 48, -71, -64, 38, -22, -97, 27, 32, 59, 59, 7, -46, 16, 20, -30, -29, -22, 57, -80, -34, 120, 34, 78, 38, 56, 74, -2, 15, -5, 49, -52, 32, -42, 69, 30, 22, -2, -61, 10, -76, -56, 18, 4, -20, 20, 68, -9, 65, -17, -59, 114, -74, -2, 6, 95, -135, -4, -79, 52, 36, 12, -26, -148, 22, 40, 54, 21, 9, 3, 45, 66, -24, -110, 62, -76, 3, -69, 13, -5, 53, 41, 18, -112, 55, -44, -4, -10, 108, -100, -53, 105, -14, 39, 43, -31, 84, -119, -17, 40, -7, 47, -91, 47, 94, -49, -38, 149, 53, -44, 81, -84, -111, 92, -74, 17, 63, 25, -21, 83, 28, 56, 73, -46, 53, -48, -14, -19, -8, -41, -59, 56, 13, -93, 26, -45, 58, 81, -24, -25, 1, 35, -39, 15, -12, -9, -33, -122, -28, 65, -46, 77, -5, -25, -40, 89, 8, -33, -27, 39, 67, 11, -41, -78, -29, 118, 33, -79, 15, -42]
3567d2J1k0K9N4n7Q1r4n3J06n7R8j9m8J23j37L4j26N1J40m1O4j03Pk5R6M1m7j11
3595d5L5k3l9J30jJ00k52J62jk6j32J00Pn2M9oj34R6l5Q8r6L7j0J31j28P6L7L0
3623I8o7j05QO2j8Qq6J16m7M1j34R1q9J49j5n8N1P9j59N3j9OP8q0J12j29J27p1
3651BM7Rj29Q2k6l8J05r8K5J71j24n0q6J72q3n1lJ19n7J27j81P6o5K2J41q4nj2
3679Fq6jM3J5k3Q0N9j86J58q5m3J44k8o8rJ9o0M9o6R1o5P1lM2q0M7J2n3J0L7o2
3710c5m2Q0JK8j8j6J48k35LP3K4M7r4q1O5N7Q8k33M9J16L0k9K5l7nON1q6p9P1
3740b8MN9j55J18KJ8q4J05L2k5o7l4J30j33M1N1j69J61N5j13P9M6n8lJ6K3N4r7
3768B8lpQ6k10L3K3j10P5P2j6n5J95j18k3m6M0J9q9O7k3J4O6M2o1r2J60o8j6J7
$$ y = [-42, -31, -51, -22, 32, -25, 56, -38, -91, 15, -42, 56, 37, -11, 112, -25, 9, -117, -66, 74, 33, 97, -6, 1, -24, 72, 113, 66, -45, -10, -33, -72, 58, 57, 157, -95, 67, 66, 40, -92, 8, 15, -37, 12, 6, -128, -32, -67, 21, -75, -38, -48, 83, -45, 31, 68, 98, 31, -74, -66, -4, -22, -14, -100, 16, -31, 10, -124, -33, -122, 27, 12, -46, 5, 84, -75, -22, -41, -35, 43, -37, 75, -54, 73, 2, 49, 58, -71, 11, -15, -53, 52, -46, -21, 150, 26, -24, -110, 62, -21, -72, -75, 44, -13, 114, -67, 9, -56, -34, 107, 23, 18, 6, -80, -81, -38, -23, -46, 34, 93, -93, 65, -20, -63, 81, 53, -15, -24, -5, -65, -16, -82, 9, -56, 15, 12, 54, -26, 21, 33, -20, -10, 27, -35, -77, 3, 4, 32, 14, -2, 146, -89, -86, -13, 11, 58, -36, -117, -52, 5, 93, -140, -91, 25, 55, 26, 51, 14, 9, 15, 66, -20, -99, -28, -24, 35, -120, -2, 0, 18, -66, 39, 71, 46, -21, -55, 75, -58, -17, 34, -135, 26, 81, -32, 47, 93, 35, 32, 48, 71, 125, 28, 25, 18, 104, -106, -73, -50, -160, -85, -13, -29, -84, 111, -7, -30, -76, -36, -17, -106, -39, -62, -48, 18, 60, -1, -93, 67, -1, -17, 0]
3797@L4j8mj05N3J1k9J25j3j37P1k3k6J18l9j15P3Q5J7r9m8O4n4j12J99q6J19
3824F1p0L8j4j50J57n7J30r9Rk2k4M9kn4o0J47p0q1J9J00J7J16k17l9P2rJ50j05
3852hJ4q6M5l1Kj7QJ66q4n5N4m7j0J49j53J18m3K1m5j4k0R3Ok63K19q1P9K7l5
3881In6K16l12K20j06Q3q7M0k6QJ6j22P1J5p7R2M2k3l2R0k01O7L5j4J62j16k2
3908b8K9j9J08j25n2J52j31M4j8j1P1k9M6m7k5OmR9j02K8M5q9PJ27j38J34n8r8
3936g8L9l2J42q0rkQ3o2nJ2lR7j35N6Mk1m6k3L7j4O9K6Jl5qJ8p5lL6o1J22j31
3968h1J14Q6j41k8R6o2j84J06J01K4j34J01kl2Q9k5j4j14k2P0R6j71J49r5Q2R
3994A8oj36J03j35Q9J4%J58j21J3p4p2R3oQ4j06M4o3N3K77k55J31j19O0q1LP3
$$ y = [0, 34, 16, 12, -93, -40, -29, -58, 67, 54, -83, -12, -35, -61, 57, 18, -97, -24, 61, 78, -21, -69, -5, -59, -171, 28, -58, 61, -9, 29, 15, -135, 22, -35, 95, -4, 5, -17, -41, 8, 6, -48, -108, 39, -31, -112, -93, 7, 24, 140, -77, -116, -44, -53, 97, -8, 6, -80, -35, -66, -64, -81, -73, 93, 9, -46, 8, -39, -49, 100, -53, 65, 22, 43, -2, -16, -36, 57, 63, -200, 19, -62, 17, 44, 9, -47, 169, -143, 77, -29, 54, -33, 7, -19, -11, 5, -117, -46, -31, -108, -16, 26, 3, -29, 61, -140, -73, -38, -52, 110, -6, -28, 1, -18, 90, -35, -87, 65, -66, -22, -40, -51, 20, -9, 37, -10, -35, -29, -33, 66, -36, -8, 37, -52, -45, 82, -56, 78, 20, -78, -39, -71, 71, -9, -18, -20, 63, 1, -4, 8, 5, 102, -33, 23, 27, 6, -40, -63, -26, -40, 29, 55, 56, 21, 13, 31, -44, -47, -11, -72, 50, -81, 33, 119, -22, -50, 46, -16, -200, -94, 7, 31, -103, -2, -4, -36, 53, 28, 14, -100, -122, -52, 44, -127, 22, -73, 9, 18, 12, -124, -21, -156, -67, -53, -53, 105, -16, -3, -77, -149, -56, -62, 22, -84, -40, -103, -50, 227, -28, 103, -16, 44, -37, -34, 39]
4021C9j3J00j82L4N6jk6Q0m3r7k3P0L4p2K3L7N1j10J46j50k7J85j94J67r8L9j04
4048g9J4J77j38j9J8j1K1J22m6m9p2L9Q4r8Rm4P7L6j06K2o3l6J96j39R2n1O5q8
4076f7M7J4m9M7J13j60J00p6N5J2j48R4O8j57R3K2On4K2r2J62q4n8J44j5k0k1
4103bQ3j13p0J77j06o3M9O9q7Nj1R3J15j39Q6j82K01r6p9N4J1m0J64j57O5lmo7
4131d7J07J4j22Q9j25Q3R2j21J24n7M5j51J84j13RMn2M3lKm4OJ25r2KM8p9R8k9
4160D0o9p8J86j03J7K0MJ14r7K3o8J05k04J19K3j2r8J0J5K19k53J28k4J3O7j13
4186a6J0NL9Q6j53P2J01j54m0Q6K2j08N2j8J28j30l3J45qRo8r7K6O1M1M2j66Q7
4214B1j20J17K6o5m2J42j61J17L7n6J5n1o7R9J0n7K1Q1q3q3J98k09J80j46Q1l0
$$ y = [39, 26, 126, -56, -22, 34, 33, 7, 87, 44, -53, -76, -6, 28, -44, -21, 16, 67, -43, 103, -47, -74, 111, -83, 84, -14, 25, -79, -65, 112, -26, -45, -27, -38, -17, 105, 59, 10, -62, -23, 61, -37, -28, -72, 5, 41, -65, -43, -106, -142, 54, -85, 7, -44, 21, -67, -20, -6, -55, -8, 105, -55, 45, -31, 24, 36, -112, -18, 50, -107, -14, 8, 14, -40, -18, -110, 52, -32, -90, 54, 39, 19, -2, 81, -32, -102, 75, -31, -94, -45, 24, -63, -58, -69, 24, 139, 0, 86, -96, 105, 9, -70, -16, -5, -45, 119, -38, 27, 24, 20, -47, 60, 74, -48, 41, -84, -1, 91, -30, 94, 37, 82, -69, 115, 2, 11, 15, -37, 6, 3, 5, -39, -33, 92, 0, 2, 50, -29, 69, 40, -29, -107, 79, -24, -7, 13, 17, 131, 34, 57, -11, 94, -110, 9, 32, 20, -78, -68, -53, 166, -87, 41, 17, 30, 97, -16, -6, -1, 38, 124, -29, 43, 144, -10, -50, 36, 58, -50, 2, -16, 112, -18, -51, 94, 86, 95, 27, -70, -44, 17, 58, 100, -66, 21, -99, 18, 44, -21, -63, 79, -82, 35, 72, 16, 31, -20, -87, 12, 22, -35, -14, 67, -16, -99, 99, -110, 70, -76, 5, -25]
4240b5O2M9M6n9j55%J60%M4r4m8o1J04P6j16m5J19k4o3J33j65L7K5Mo0J3mJ8o0
4269h9P4M1k0J8L1L8j05O8j20J19Lr5L2j3J47j1r1l5k2J55j07O3q6Q8p6j10J7
4296h6P9M3r3O0p4p0J29J4K7p4M3p1K5N4j9L7P5p6p8R5p8L8j8M8j0l1Ql9O1M1
4326F0q4O0l5o0R7K7j19P3J36j07K6j15N6L3q5K3R7o8o2L1N7q3l5l8O7J87j67
4353b8J16o4m7KJ7r3J35q6O7K3m6P7m4q4P7r2N5k1MR4j14OR9q7P8K4om3k8N7%
4384D8q5N7M5Jm7n1J28j60K22j67K6k8Q9j48O5j8m3o6K25j22J8j5R7j01K0J37
4410A27j78L4l3J94j15k7K4m1n4M3M0qM6Nr6O2K2j10N3M1P7j16J5K8m3k6J9m8
4438f5n2J10mM1kj2l0Lk1L9L8o1J3R0Nn3m2K1k9l6K8M8Pm9J01k05Q7N1p7j2Q5
$$ y = [-25, 37, 86, 132, 73, -82, -82, 78, 78, 122, 28, -20, -81, 23, 99, -17, -62, 57, 33, -30, 103, -62, -25, 0, 4, -56, -43, -47, -29, -89, -15, 26, 6, 24, 55, 93, -12, 56, -64, 55, 58, -37, -5, -18, 129, 118, 27, -8, -30, 125, 18, 81, -5, 83, 7, -103, -86, -7, 36, -57, 3, -71, -141, -12, 2, 29, -45, -2, -73, -48, 6, -13, 24, 99, 23, -55, 40, -38, 0, -18, 30, 20, -11, -3, -42, 19, 60, -24, 36, 1, -59, 38, 65, -54, 19, 155, 48, 74, -41, 15, 48, -37, -14, 83, 15, -47, -16, 41, -42, -77, -115, -48, 139, -28, 88, 24, -23, -21, -4, -97, 38, -48, 19, 42, -4, 73, 29, -55, 22, -70, -15, -36, -32, 62, -52, -46, 53, -34, 44, 68, 62, 19, -9, 48, 48, -37, 20, 65, 66, 19, -32, 96, -64, 158, -9, 17, -11, 78, -70, -5, -23, -66, -132, 93, -29, -11, -26, 71, -30, -10, 127, -51, -17, -50, 144, 29, 2, 26, -15, -69, -26, 14, 6, 52, 57, -39, 23, 45, -65, -12, 29, 106, -10, 5, 33, -10, -36, -17, -65, -117, -7, -11, 30, 28, 16, -14, -11, -32, 7, 45, -16, -3, 87, 92, 39, -3, 18, -11, -47, -19, 29, 36, -13, 88, -117, -30, 21, -56, -68, 17]
4469A7N9j36J01mQ9j86J25p7o4J08J8j11J10j42J55J2j14l3R3J7r9P3l5J36j43
4494c1M5j4p1N3p1K5J37Jr6n9J51Rr6JNl9P9p7J2J1L5n4N1J1Rl0j41K02n7J10
4524A11r8mj02J0J32m3K3oq0P1P8j00O1j26R0Lk4L1j29L7J38j14O3n4J0Q2O0j83
4552f3m9P2J15j00J26j4o0J0r6N2P5j23J8l0l3K5J13j85R6K6J19p0q6J26M9j31
4578a8L2J78j80mp1P0l0L4JN7r6J25q4M5Rl6K7K8j12k3K6l5P3K3r5J2O4Lk9m1
4608d7K0M1j0L3l7K0Q9p5n7Q3KNp9J1r7J0j0N2J0m2J0k9N6k6M7L4J9q3J10j8l5
4639Gr7Q4j2l7P4NM6m8k5k5N0j19J63j20M4L0PKj68J45J61j25j08R9N7j09L5j3
4667CJ05q5M7o5q6R1k7m7QJ49J9j25R0m8q7M4O6j59R3j2O0p0Q8M0j18L6j2l6O7
$$ y = [17, 76, -60, 41, 37, 126, -60, 65, -12, -76, 32, 50, -61, 49, -93, 62, 74, -40, -73, 20, 37, -62, 11, -24, 112, -31, 14, 0, -71, -18, -89, -64, 73, 74, -22, -81, 70, 79, -17, -16, -11, -50, 29, -48, -36, -25, 10, -44, 7, 18, 27, -3, -144, 58, 1, 111, 13, 9, -93, -83, 49, 6, 29, 23, -57, 14, 92, -8, 53, -73, 17, 20, -4, 27, -102, -65, 73, -41, 22, -32, -22, 60, 120, -63, -112, -40, 75, -25, 101, 87, 27, 37, -59, -7, 68, -55, -37, -67, -100, -75, 38, -147, -51, -25, 94, 24, -62, 64, 113, -18, 14, 192, 12, 8, -63, 7, -23, 11, 12, 69, -27, 98, 14, 59, 68, 32, 59, 87, -25, -48, -22, -57, 16, 39, -56, -44, 20, 23, -6, -47, -27, 14, 4, 37, 0, 20, 109, 34, -23, 60, 62, 67, -12, -1, -98, -88, -98, -46, -36, -78, -68, -97, -41, -67, -20, 14, 33, -50, 60, 42, 7, -90, -6, -18, -55, 19, 24, 70, 22, -3, -28, 22, -97, 66, -54, -10, 20, 27, 29, -139, 6, 167, 42, -66, 33, 90, -19, 16, 3, 108, 23, 70, 5, -81, 10, -17, -64, -56, 93, 112, -13, 77, 29, -58, -14, 52, -107, -14, -26, 34, -36, 52, 92, -26, 10, -2, -38, 29]
4696B9n8p6L3nN8k0J02j7Q6j52MjK4m8J40j51N0OJ4j8KN6j73O5N0l4j3J37j11
4725b1M8j4J13j89P6QR1j04n9n3J06L5j2j54J81p2J13p8k0P7j3n8M4q9K0Kj4J06
4753G0q7r5J71n5M5J6j53N5K8J01%o4l7RO3m8o0n7R8J7Kl1n4J36j53J90j90J51
4781F8o5K4k0O5j28M9Nm2J01l3R2j09q8lQ0N4N2r7R0k46O7L6l6J50k5L0p4Q4j17
4810c6l1L9oj03J11J06q5J3p7P4m9P5n6K3K6j09L2km3J92j54Q4O4j05j09R1m7
4837h2N7mj1J78j25j2P3j52J51p4m0Q2n5n1R6j22J07j12O2j8M3j05J35O5j50J40
4863G6m2K4m9J8l6J03j06K7k2l0J15j02j6j00J89o6l6J1J4O8j73J49p6k6PJ59
4889H0o1m8P5j33Q0mJ8l5k3PJ04p5o5J14o7K9m5N9n6J11j10j5mN2K1Rj01R3j05
$$ y = [29, -29, -105, -72, -77, -19, -39, 63, 46, 132, -20, -16, -17, 7, -41, 99, -52, -2, 4, 18, 0, 2, 58, -115, -50, 0, -34, -47, 90, -21, 27, 13, 126, -63, 13, 21, 112, 8, -51, -104, 2, 37, 25, -129, 52, -20, 93, 15, -5, 72, 59, 1, 45, -44, -24, -22, -36, 70, -17, -112, 59, 4, 49, 65, -88, -33, -5, 96, 96, 32, -5, 4, 67, 19, -41, -98, 0, 17, 19, -12, -66, 70, -83, 107, -83, 68, 3, 27, 7, 72, -56, -7, -2, -44, 57, 24, 116, 7, -81, -84, -4, 50, 102, 5, 95, -151, -84, -48, -84, 66, 41, 71, -3, 81, -36, -67, -28, -34, -137, -26, 80, -5, 8, -69, 5, -44, 31, -25, -2, 24, -85, -53, -55, -98, 94, -60, 24, 88, -17, -126, -35, -82, -25, -29, -40, 138, 13, 1, 74, -78, 73, -1, -41, 41, -14, -65, 31, -91, 16, -96, -34, -52, -9, -114, 21, 86, -64, 76, 34, 58, 9, 27, -9, 94, -12, 15, -7, -37, 78, -24, -40, -140, 49, -17, -53, -42, -28, 40, -133, 16, -60, -86, -79, 80, 19, -29, 46, -87, -7, -11, 7, -28, -51, -44, 60, -15, -80, 34, -33, -4, -49, 10, -46, 65, -45, -60, -64, -12, 9, 18, -83, 10, -95]
4918i5J79o7m9k8K4M6q4K2L3N0n8R2j21N4NL0l7M8K8q8M1K7J6j08J05Kl2q8J56
4947A03j85P0J09j54K2M8n2J17q1K9M0k9q4M4O6p9O9j23J70p2K7n6m3J59p7p2
4973c4N0L4n7n8R9Jq2RN6m0j07M3P8m0J53n9P4j14O1j42Q1l6p8J63r3O3k2K4j49
5002a22R5lN3R4j32R9j26K2P3l2J39k42MKJ87r5m8o1J06J54j76L0p6L9p5O4J7
5029a0P7J2q8q4rP2k3N6o1J28j5n4J13k79K48k26J23j7O6k5m3k3M1pP8N1o7n3
5057a9p3J51r6k3QN8j2Jn4n0J3O2N6Nm1J00M9p6n6k4P4r3J1J5n1J41j48L7J33
5086I8j01n2Q9j30K11j13k6J21j88R7O2k8kn3J8L6r2M6j0j72J54R6N6j13P9q2
5112AN8j04O3r7P2n4Q5Jj00L6J16q8PQq0J35r2K2j5L8q3N7N1r1P1J00r9n6mQ2
$$ y = [-95, 84, 17, -32, -60, -36, 10, -74, -52, -19, 31, -27, 65, -56, -2, 3, 33, -4, 44, 72, -16, 25, 52, 68, -40, 65, 67, 35, -53, 103, -82, -12, 97, -57, -35, 13, -39, 78, -3, 26, 66, 37, -47, -3, 63, -16, 53, -70, 100, 28, 55, -1, -44, 115, 38, -34, 16, 50, -7, -65, 34, 35, -47, -38, 18, -22, -129, -86, -8, -48, 105, 46, 120, 6, 67, -75, 6, -30, -108, 55, -38, 25, 3, 27, -122, -27, -30, 23, 117, -15, 84, -42, -20, 53, 21, 160, -82, -78, -76, 111, 16, -32, -93, 13, 167, -9, 21, -55, -16, -91, -27, -10, 67, 79, -9, -93, -102, -30, -53, 3, -58, 70, 55, 1, 114, -165, 83, -143, -20, -37, 29, 4, -39, -62, -21, -28, 50, 101, 34, -19, -92, 59, -37, -60, -52, 6, -6, -5, -59, -109, -96, -34, 22, 27, -14, 86, 135, 59, 3, -21, 53, -40, -29, -14, -65, 76, -72, -35, 98, -3, -55, 34, -96, 115, 2, -24, 97, -91, 6, 68, 40, 38, -15, 3, 39, -53, -7, -17, -189, -35, 61, 117, 4, 83, 1, 59, -45, 18, -79, -7, -61, 24, 25, -75, -39, 77, -11, -4, 4, -76, 59, -33, -11, -26, 12, -71, -14, 37, -54, 17, 117, 18, -38, -42, 40]
5142D0J5j36J01l8q1Q2N7O6j47Q2P1l7j51l9J15L1m5M0j0jO7j73K0J9J62j49K3
5169a6l1J4o1J0J44l2m9q1J53j43J11n3k8k4R3r3Q7L4j47J76j22R8j60R7J2j04
5195a15J52K0pn7M2o2K1l2M7n9K1P4n4N5m6M0q2PPJ33j15L5J2m7m6q0K35j23q
5224c2P0o9m0N4K7Rn1J3oK9nQ1j10N4R1j14KJ0j3n8M4k6N6L7L1j00P1o5pq0J44
5255D7o0K4kk9q9J40r2J3J30j29N4n5n6R5J13o5k0ko4J3p2J4J57j06N2J00j93
5282h2P5m6p7J87n0r6k4J85j18M4j4L6m1k9O0p6j5R5k4n6Q0j06O9J6N5o6L9k8
5310gOL2j7o2M2J05M5j60LK5k2L9o2P4p4j0k6N3nM9M6k0M7l3p5rJ52j57j01J51
5340B9r2L9J52Qj41q0K87k27N0K7K6j45j28J21R8M5j72K9P2P2p3j8q2J37l1L4
$$ y = [40, 55, -81, 20, -18, -99, -17, 40, 106, -41, 41, 112, 75, -76, -115, 0, 31, -14, 26, 16, 15, 82, -91, -71, -52, 110, -39, -16, -47, -33, -94, -84, 60, 28, -21, -102, 51, -92, 19, -34, -62, -86, 7, -86, 1, 35, -112, 64, -58, 40, -120, -23, -11, -115, 37, 57, 50, -7, 35, -27, -6, -38, 9, -50, -29, 45, -9, 46, 0, 40, -42, -35, -28, 105, -10, 25, 37, -10, -56, -136, 99, -24, -32, 38, -31, -71, -17, 10, 19, -32, -19, -25, 4, -1, 80, -30, 24, 115, 1, 3, 13, 0, -58, -14, -40, 16, 53, 84, -16, 55, -10, -17, -97, 47, -13, 11, 9, -20, -109, 31, -61, -48, 82, -47, 7, -48, -104, -9, 104, 39, 19, 17, -47, -34, -106, -92, 65, -41, 11, 111, -82, -7, -53, -130, 57, 7, -89, -113, 72, -46, -2, -16, 20, -21, -50, 10, -66, -81, 14, -10, -66, 14, -92, -23, -7, 48, -18, 21, -7, -1, 31, 14, -48, -6, 99, 144, -16, -13, 12, -10, 29, -33, 41, -33, -43, -69, -16, -21, 28, 74, 54, 101, 68, -7, -16, 136, -21, -122, 29, -63, -24, 128, 136, -5, -85, 202, -25, 25, 52, 78, -67, -195, -74, 24, 69, -103, -74, -2, 70, -3, -21, -103, 34, 3, 37]
5366C7j09lJ63j82J19l3K0K4j9N6Mp1O0j71R4j8P9j7Rl9L5m2JJ00m9r1M8K6p4
5395d3l0M2m9L2J8n0J25qj21J11r4MO4L8m8QM3o3M7K6o8pM9N9p8m2k4P1R7j45
5425c6N1j0nO9q5N5j0N2k4l8M7j77K38k07N7L9K5N8r7M0p6mQ6K5o8n4M9k9M2p7
5455f4O3k3r5R0L9%L3r5J56p3o8J3K8j8J0k8K6l0nJ13j82J55j8l8O5m5k3Km5O4
5485GNJ8k6m1j4O3r0R2K7j0J1l8l4K9M6j68J00k3P5p7n1J20m6l3mJ9K8J33j45
5514b7j2j4kJ33q6n4L7Q2j53J40l4o0M9M6j44j3Q0N5r4N7R2kr4M7m6Q0n1j46J92
5543E8J22k17K7M8N8r9J5n4P7r4jJR2L1q1N9q0J73j62J12j45J55jo8n3N4j71N1
5571i3%J17J8p2k7P0Mj26K29j31L5k4J09o4j10J09N1l0q8kQ8k1j20L5Rqn6J16
$$ y = [37, -72, -75, 88, -94, 25, -8, 12, 36, 17, 73, 77, 6, 66, -105, -11, -29, 50, 33, 42, 3, 38, -4, -3, 97, 48, -43, 5, 31, -43, -73, -31, -80, -48, -30, -80, 45, 37, -84, 27, -67, -63, 1, 39, -9, -1, 42, -21, 26, 52, -16, -23, 26, 85, 7, -35, -59, 12, 109, -36, 15, 5, 0, 69, -16, 39, 29, 81, 57, 19, 66, -111, 127, -80, -23, 16, 41, 99, 2, 42, -34, -38, 48, 73, 5, -49, 0, -29, 13, -64, -1, -24, -119, -29, 10, 10, 43, -52, 104, 31, -37, -24, 4, -14, -4, -32, -6, -36, -41, 72, -110, 45, 27, -11, 54, 9, -14, -12, -57, 7, 12, 30, 4, -37, -51, 12, -78, 14, 41, 31, 42, 4, -30, -1, 45, -123, -23, -46, 29, -48, -99, 21, -25, -58, -62, -43, -15, 118, -27, -39, -53, -55, 78, -8, -62, -25, 57, -96, 44, 10, -50, -1, 45, -99, -112, -32, 23, -71, -14, 78, 76, -18, 29, -17, 63, 12, -134, 58, 180, -37, -10, 38, 96, -3, 12, -42, 35, -59, -60, -59, 33, 64, -17, 42, -38, 135, -27, 85, -60, 95, 94, 26, -27, 27, -144, -93, -93, 24, 42, -30, -57, 13, 17, -109, 120, -11, 24, 0, 109, 45, -65, 44, 95, 65, -23, -25, 63, 42, -78, -43, -34, -42, -98, 18]
5599A8J09j52r1J33K2pRj0pN8p6j12J39K4k2r2Q4N4n0r4O0%j9m6P6N3j37M6O0
5628C0j03J02o7o6J02j5l2NO1j4QQ2n5r6R7m3M0l1J94k69N6q2J58L4k2j3r9J24
5656H6p3j21K8O4K6LK6j08m0J62P3m2o9j6O2j0n8K3m8L2P6n3N3q5k4M4k7l4J26
5685G6N9l8j90J69j8j14L3M4k0M5n8O8L3j12M1j00R7p9L0R9r3JK5K8rK5m1N7j06
5714d8NJ20N7n2n2n0J0l6L3Lk6p9Q9R8j14n0Q8R0p8L5q6L0O3r8J27o6n2J14NJ1
5744I1j68J73j37J2J02O8q1j08l7P2P5q4j3%L8M3j38N5L3J04j44J19kj51L9O2
5770B3n5J4jO4j05L7j7M8O8j0o0M3q9%O7j27L2R3pjp4Q5K9q4M9l2P7q3J18j44
5800d2Q0p9P5l3k6kj6P3p0J36p4m0K4l6o6J27j42J26L8j62N8N2j4j3J30j73M6
$$ y = [18, 127, -25, -116, 17, 39, 32, 41, 31, 24, 82, 6, -106, 33, 57, 35, -57, 27, 81, 31, -63, -3, -3, -22, -68, 8, 61, -76, -30, 30, -73, 29, -38, -104, -2, -17, -49, -44, 17, 3, 11, 93, 38, -58, 39, -4, 36, 5, 199, -70, -14, -96, 62, 96, 74, 61, -38, 86, 13, -108, -80, -16, 10, 13, 39, -69, -109, 53, 126, 84, 15, -1, 61, 51, -7, 16, -32, 0, 76, 23, 76, -9, -33, 11, -16, -50, 76, 135, 97, -93, 76, 58, -56, -23, 21, 1, 46, -12, 56, 89, -23, 18, -82, 15, -64, -34, 65, -28, -27, -2, 26, 17, 42, 1, 58, -48, -43, 77, 134, 82, 30, -20, -10, -46, -13, -10, -36, -115, -26, 72, -42, -92, -4, 86, 8, 43, -43, -13, 50, -48, 79, 13, -39, 75, 80, 91, -77, 96, -41, -29, 73, 141, 60, -48, -85, -13, 62, -22, -35, -35, 3, 46, -92, -37, -4, 100, -44, 75, 73, -78, -39, 23, -32, -18, -19, 45, -60, -23, -40, 8, 76, 66, 6, 49, -40, -40, 27, -100, -68, 25, 18, 17, -57, 28, 57, -27, 22, -10, 67, -16, 102, -42, 38, -41, 34, 1, -25, -27, -43, 30, -40, 96, 22, -18, 6, -30, -96, 31, -111, 15, 53, -109, -51, 1, -13, -26, 104, -69, -23]
5827b3Kl4J7L9P5k16J83l5k4J36j09nK1n3Q3j19J23rp4O2k7P1j34O6m3R7k14K35
5855I1q8l4r8J79l8p5K9L2P2m4j95Q1J16J4%n4J0M6r2K1J26p8qm9P8ql6L8j33
5884i7p4J68j08O0J35r8J1N1o4N4p1J11j42J09p1R6j07oQ2Om1l0J41p2j21J92
5910A14q4k6j23J81q9n4K4K5M1j44J26N9j22N0j10J58q1J28r1m0J10nj41l1Q9
5935c6N2K1q2M0j9N8j13R1J1l2J0k4j0m8J09m5P6p3oJ20q7ol8J1P2K9oj13l8J55
5965G9n5p5K6K1k6P0k3J31k34m7Q2j9O0J18j60Q6ql6m9K4n0O1N9k3N3j29R1pr
5994A1Q9r2p0P8j9m2nM6M1nq9N1J6l5j7P1P0Nj34K9M0pj6J06p7j17J90j82O9l4
6024b9J36j78J24O9n0n3R%P4j03NL6q8J8J05L3r6k5O8j0m5J5JO8k9o6Q7qj9m4
$$ y = [-23, -21, -55, -38, 1, 76, -140, 43, 8, -16, 120, 11, 6, 27, -26, 57, -62, 61, 52, -22, 40, 13, 84, -50, 16, -27, 70, -144, 91, 3, -31, -129, 50, 12, -63, -34, -2, 70, 26, -169, -88, 28, 42, 42, -12, -2, 44, -48, -27, 99, 21, 13, -36, 42, 34, -2, 36, -97, -171, -3, -111, -51, 84, -14, -3, 48, -16, 38, -33, 78, -64, 45, -26, 70, -37, -43, 39, 45, 4, -26, 115, 43, -78, 114, 30, 4, -119, 62, -27, -81, -57, -32, 9, -135, -9, 50, -72, -22, -132, 26, -55, 73, -18, -58, 52, 47, -94, -125, -36, 16, 37, -45, -5, -24, 34, -79, 12, 23, -9, 1, -23, -33, -81, 28, -17, 59, -14, -20, 100, 13, 7, -31, -20, 52, 81, 75, -38, -76, 79, 24, -51, -25, -4, -30, 40, 17, 148, -86, -133, -51, -70, -10, 108, -52, 34, 26, -10, -59, -35, -85, -24, 35, 12, 65, -64, 27, 20, 11, 100, 8, -62, 16, -3, -45, -50, -4, 37, 32, -57, -6, 10, -25, -42, 29, 99, 104, -30, -1, 39, 32, 16, 122, 45, -72, 118, -64, 5, -29, 107, -71, 53, 122, 72, 19, 28, 28, 102, -1, 4, 40, -48, -30, 75, 108, 12, -13, 55, 45, 0, 15, 16, 84, 55, -11, 76, 68, 49, 5]
6054EK4L9O7j44N5k6o6N2m3l7O0RN1j21J22j1n3o6N5kO3q9r8J25k4j9Q2j39K41
6083A12k50J61Q1p1K0k00K23r8J15p2j2k9Q2j46L2P7Ql0M5k4m5J13r7m0J24r8
6109a9k5J46j2j14L1PJ11j79Q1k0n3KQ1n5qJ04j64R1m1M1j9l1L0J7l2L9j1J9o6
6138d9K7Ol5N3O4m9mMn1j3J53r8R5j37O8q3OM6n6N9J9QM9j02Q5m2j43O2J32q7
6168a3M7j31L9N0o6J93j50J23j61j2J08MkK2j01l5J85%j69O0M3L4q3L5Lo4J36
6195I5k04J65p3o9rN7Q4r7Q6p9l7J29p4l2L4P2n6N8q6K6mM8K9k9J7o9L1J3r6N1
6225a9QL7P1qn0j10l3J6J04L2Lq0j4J02q2k7J5L4n9N8l4J39m7n2J1J2l0l7J17
6254G7p3P7j15P8k6Nl4R1k6j60J92M5j80J47j34M1n8N7o9RJ11j4N2j09n5Q3q0
$$ y = [5, 29, 68, 135, -9, 46, 20, -46, 6, -37, -74, -14, -5, 46, -75, 47, 36, -17, -83, -28, -30, 33, -56, -154, -29, -53, -72, 10, -129, 112, -138, 23, 104, 33, 53, -147, 76, -22, 93, 21, 9, -20, 62, -84, -52, 25, 33, 3, 48, 24, -21, 92, -5, -45, 79, -19, -44, 102, 90, -24, 7, 14, 125, -54, 27, 7, -46, -44, 37, -18, -26, 78, -86, 5, -36, 5, -14, -45, -15, 2, -30, 9, -2, 17, -49, -22, -16, -51, 2, 66, 17, 13, 17, -34, -47, 106, 8, 103, -34, 34, -49, -43, 3, -53, 6, 25, 33, 82, -20, 65, 23, -120, -58, 74, -13, 34, -97, -58, -8, -74, 119, -31, 92, -69, -81, 27, 31, 29, 51, -50, -85, 100, 100, -69, -9, 34, 68, -15, 20, 23, -41, 95, -109, 56, -17, -86, -95, -38, 46, -51, 35, -44, -81, 48, -26, -58, -24, 48, -8, 50, -36, -10, -14, 34, 63, 34, 51, -18, 13, 26, -70, -19, -11, 26, 97, 89, 39, -71, -104, -88, 16, 48, 51, -29, -43, 59, -23, -50, -35, -1, -60, -2, -36, 103, 56, 4, 15, 27, -3, -40, 77, 4, 81, -34, 44, 18, 23, -11, 80, 54, -106, 86, 131, -49, 98, -36, 5, -53, 4, -65, -56, 55, 41, 93, -16, -71, 12, -68]
6281f8J73n9l7ro5P0K5K9j13J9J59k40J67N3l4Q1k04K9J14k8m2M9r3Q5Pr7O6l
6309C4p4MQ4k8m8l0R5p4J18n5j11J51j32P9k0k4K9j7O3r0P8l2M7mj87J86P4p2
6337D4j9n9J68nj37N1l3QQ8j62Q6r9K1R9k7k6R4p0r8J26q8m0K1K2k1Q1l9j39J37
6366a6K0Lj33J58m5K3q4J11pm1L6r4R4j7o1M2J4j04j3L0O1k4O7o1k7J83j54p2
6394a11J20k3P4M7j58P0p4j4j4J27k7j07J79j28N5L8P6p6o6k5pR2p4M8o7m6P1
6421b0M2J05k2o4m5O7o3o7L5Lk2Q6o4J22j41n4R5jKk2n3LN0J5q3K5P2j8k9K9j04
6452a21P6OK9k6j0o0K18N3r7n7l3M4K1m8L9o2j3N6m4l2N9J9n3j36J42r3J13m0
6480e0k9J22Lq8M9k7Q2o3k0m3j6m7O8Q8q6M4l4J22k0ro2O6j27Q7r9J11o9O3O2
$$ y = [-68, 105, 46, 9, 0, -65, 5, 30, 59, -54, -35, 124, -116, 51, 104, 70, 151, -53, -24, 90, 62, 20, 69, -24, 61, 68, -29, 37, 34, -40, -36, 48, 20, -28, -58, 37, -37, 81, 26, -85, 66, -66, 13, -7, -31, -2, -19, 44, -46, 32, 0, 47, 43, -144, 42, 116, 44, 25, -34, 134, 129, -8, 43, 10, 18, 106, -56, 30, -69, -48, 51, 24, -2, 92, 22, -76, 50, -38, -78, -57, -35, -56, 25, -14, -153, -16, 4, 7, -126, 32, -13, 10, -74, 37, 30, -11, 25, -69, 25, 8, -53, -11, 3, -101, -114, -84, -23, -47, 20, -41, -68, 115, -39, -111, 9, -14, 60, 107, -51, 19, -55, -69, -83, 44, 17, -90, 89, -39, 16, 54, 130, 54, -12, -37, -44, 48, -26, 22, -45, -91, -20, 22, 127, 105, 41, -4, 63, 0, -67, -32, -29, -51, 35, -29, 93, -48, -102, -7, -8, -6, -28, -81, -78, -28, -13, -96, -71, 1, -17, -46, -17, -121, -45, -39, -10, -36, -46, -106, 112, 165, 68, 11, -22, 22, 43, -5, 34, -28, -41, 15, -29, -61, -2, 17, -36, -172, -30, -123, -10, -50, -79, 43, 46, -42, 7, -20, 62, -1, -21, -64, -80, -127, -59, 29, -57, -13, -47, 75, 55, 46, -16, 50, -77, 10, -89, 22, -47, 16, 78]
6509G8m0r0P8J8m3oM2j13n6J53K4lK2m6l7p2N8M0j5k1J7K5p6KR9j19RJ25o4J39
6539A28j64N9j20P2L7K0Rk9p9L9PJ27j82J56j40J53r5%M8l3l1j6R8j64J14MN7
6566G5j5K6k8J8q4J4LK2j81L00r4nm5m7R5o5LK9o3J19J4j55K40j67J9L2j9J1j03
6595e1j34J33l3L3J8Q6k6M1r0j4J00p2l9Q0qJ06p0j28J4P1P0j24O0L4L4pj15P1
6623D0k0j20J65rn1J8p7P7r3O9K7l7jQ0o9kl8j20P0P8j00J69j31J42j70K8M5J09
6651G9j12R9J2o3r3L3j6L6o0J66j70K0K3R9r2J84k25q2J62K8l7mkoP5k3j22R4
6679Ck01K20P4o3j28J07no4J60o9n1RMk2K1N4j48lJ47r9Q5n1j7J27o3n8O1o9J18
6708G9m5J3p9Qj00K06L1r4q0J12lp4l3K6j5j2k6J03m7O3p3Q6Q6j41O9m3j21O1
$$ y = [78, 38, -52, 26, 44, 1, -5, 37, -76, -132, 21, 45, 42, 64, 18, -19, -91, -33, 7, -8, -29, -12, 13, -63, -61, 38, -81, -72, 53, -11, 128, -36, 23, -97, -25, 12, 32, 41, 12, -67, -28, -21, 106, -76, 80, -60, 93, -2, -2, 46, 13, -18, -34, 64, -100, 14, 18, 75, 60, 86, 58, 76, -8, 6, 9, 31, -150, 150, 56, 51, 6, -41, 54, -11, -8, 21, -42, 77, 91, -64, 176, 9, 28, 60, 41, 52, -51, -185, -52, -85, -52, -34, 52, 26, 67, -23, -37, 63, -9, -48, 32, 24, 130, 60, -68, -54, 17, 87, -37, 23, 57, 91, 84, -31, 40, 20, -100, 65, 56, 5, 23, -54, 23, -70, -1, 26, -11, -12, 68, -1, -3, -41, -161, -91, -13, -113, 56, -75, 67, -103, -75, -30, 79, -33, 66, 78, 15, -78, -45, -61, -25, -85, 81, -89, -69, -46, 53, -39, 145, -80, -162, 0, 28, -9, -13, -15, -21, 54, 31, -91, 3, -198, 22, 96, 33, -95, 12, 7, -57, 103, 34, -17, -8, -4, -26, -5, 49, -99, -102, 45, -54, 31, -20, -37, 90, 27, -31, 30, -39, 79, 34, 47, -32, -24, -124, 82, 113, 19, -61, 51, 48, -26, -59, -33, -48, -60, -86, 17, -30, 33, -40, 46, 132, -9, 60, 17, -104, -43]
6736d3J01j1m0L5L3j3j09O7j5l1l7J43j90Q9qN3L7n9q7O9Q2j9m7m8O9N6jm4rm6
6766b3M1k0Pq4N6nJ31j28j71J56o3J4J08j7p8j0m9J29N4L4j52J8J56k28J04JP5
6793E6K4q3o4Q4o2K8J77j03j20Q8m1J28J3j21L1j11R1p9M2RO6N4N6k70P9p8J59
6820E3q9O7k7J0Nq1K9j2k8L0K5L0q0N9K4j5nN3m9Rj01J75q3K4o1R1m5o6J00rl9
6851fJ5k6j0J03o0m9Q6j4K1p6R4j16J2L9q2M6k7P4r1J28j34r1N2O9L3k7pN7Q9
6880A02kr7q1nM0N9J43l11J05l5P2L9K7j0J30r5K0Nj54P4Mq1J5qO2m4L8M3m7M1
6910D9j2j11R6q9K5k3J14j54J31k5n1OK9n8M5j0j3J48j36O3R3p2q9R4m1P9j88
6937a00P4J4n0L2R7j80M6J20j22N6k2l6K18k49J50m5K6lN8q0K4M5l2K5j11O1Q
$$ y = [-43, 58, 47, 7, 42, 75, 62, -47, 20, 5, -26, -63, 80, -110, -21, -29, 24, 61, 2, -85, -16, 66, 47, 0, -48, 21, 77, 76, 32, 23, -23, 18, -2, 5, -79, -23, -28, 103, -25, -196, -40, -103, -89, 19, 2, -76, -86, -135, -6, 48, 82, -70, -52, 104, -124, -20, -19, 56, 80, -3, -67, 17, -45, -17, 160, 57, -63, 25, -16, 112, 125, 4, 35, -76, 15, -64, -22, -13, 53, 107, 163, -107, -28, -106, 53, -36, 31, 4, 14, 19, -62, -33, -45, -73, -43, -18, 12, -68, -9, 15, 0, -5, 48, -1, 8, -93, 82, -1, 23, -38, 53, 8, -58, 42, 33, -6, 9, -17, -27, 76, 16, -33, 53, 39, 60, -16, 78, -38, -26, 13, -69, -23, -50, 24, -67, 61, -73, -164, -112, -43, -10, -37, -44, 13, 102, 100, 3, -78, -83, -43, 16, 159, -152, -47, -82, -10, 29, 56, 46, 176, 81, 101, 106, -48, 26, 30, -51, -36, -44, 18, -26, 12, 55, 8, 49, 37, -74, 22, -67, -42, -65, 49, -105, 26, 1, -50, -44, -15, -73, -28, -38, -51, 97, -39, 24, 117, 45, -44, 50, 9, 88, -100, -26, -12, -62, -30, 67, -113, -67, 53, -69, -13, -35, -71, 147, -102, 48, 3, 29, 26, 84, 4, 28, 73, 41, 66, -45, 16, 24]
6964B4m2K6k9k1k2%M4j11K11nm0p7Q6q0O5pj15J7P6p6J5K4M4m5RO1M3l2J6j42
6994h3L3m1J07p1M0J11r6k6J23o3K1j72J33pJ1j4M7J2l1kK9l6j10K3J17K1j07
7021c1pk7l1J38p5J6m0N8r6J77j28J13l6j5l7K8Lj21L4R2K7p8N7j86R8J49j20
7048c8j9O1J4p7P3o5N2J12k09R2J22j42J0N2p0m2Q2J63j83k3KK5q9n3J75m0M2
7075B7J1j48J87j20Kn0J14n4O8ko9P7j46R4K0J6rrpJ2LM5j1r2K0rJ58j26r9P1
7105b6J6q4O5K4K1K2j05KJ43m8k6jn5k8P9K2J00r2n2K5p5m0Q6pL7jk4J08n4l4
7135bP6j24j9J37p5MR1o7p6k4J13j5MJ12j34M4o2n8J59k2r2O5j20M9R9j4q1Q9
7163E7k5n6M5K8qK4q0J59j75N1p2N5k8KQ8qj46J59K6j00M1j12J04J4j47J25l8
$$ y = [24, -18, 8, -21, -42, -64, -64, -20, -131, 80, 75, 35, -42, 44, -36, 29, 22, -93, -76, 0, -76, -61, -37, 7, -38, -29, 32, 75, 43, 59, -83, -50, -91, 16, -55, -15, 96, 0, -26, 97, 34, 55, -117, 16, 9, 20, 6, 53, 65, 34, 32, 61, 25, -85, -62, 55, 76, -31, -38, -65, -96, 42, -33, -17, -57, 1, -95, 82, -46, 67, 31, 16, -21, 7, 10, -111, -77, 15, 42, -36, 21, -165, -67, 82, -38, -57, 4, 18, -59, 14, -51, 1, 113, -96, -4, 118, -24, -14, 38, -32, -74, 8, 171, -12, -35, -33, -8, -97, -150, 25, -15, 27, 38, -110, 77, -43, -41, -91, 23, -31, 37, 35, -34, 43, -103, -9, 11, 27, 18, 9, 2, 14, 17, 62, 51, -41, -21, -30, 128, 2, -97, -26, -10, -94, -29, -5, 16, 38, -67, -65, 78, 30, 4, 3, -52, -80, -1, 21, 121, 29, -23, 2, -73, -113, -27, -34, 3, 2, -22, 86, 32, -2, 74, -50, -69, 68, -7, -3, 88, 21, -55, -79, 34, 19, 23, 135, 1, 45, -17, -75, 84, 62, -30, 35, -85, -36, 63, 49, -32, 57, 32, -24, 21, 49, 41, 65, -15, 144, -31, 20, -52, 3, -25, -23, 65, 57, -89, 70, 96, -4, 37, -75, 29, 43, -104, 21, -17]
7190a7K5p5J4L4j4N0m2Q2q9J24o0j12R7m2L5J24j32pk0K1n3L2j12J77k9M6p4K9
7218A2N8k09J90j56J28j1j65J67K3m5R7j11J42j52N9j22N2oL0J22j48J07l0J19
7242A51q2lr4J5L8r0K6R4m9l2K5O4r7k6L6L7N6p7p2L7QJ29L3l0k03J16N9m8j39
7271a18J59n1K7K3M5j30J34lq0J8p0K5k7P5J6K9Np5j2J24j94O2NjO6Mj85J20J84
7300A75j11l2K1p1k5oJ04r8J29j53L0m4L3K9J24n7k6m2L2k5RK5lnj2K9O3l6j30
7329g3M0N9o3K4J35j31jq4K35j58N0rn6M0j8k4k8O4p6O8M1j8K1J19j65oJ05q0
7357A1k2M9r9Q1pK6m1J8M1l1j44J19p6Q3j5j7J19o4Nj7J7m3K3q8M1o6N6R4o8j0
7387b5K8p8r0J28N8pj6k0K2N0p6O4M7J5k53P6O9j35J24n3L5m4J38m4j75K24n9
$$ y = [-17, 8, -67, -53, -19, -33, 17, -25, 57, -32, 92, 32, -80, 17, -25, 10, 134, 2, -5, -25, -4, -57, -25, -137, 40, 11, 57, -17, 12, 70, -139, 51, -105, 23, 12, -153, 14, 37, -8, 89, -22, 120, -32, 27, -95, -43, -49, -19, 103, -45, 62, 32, 151, 69, 66, -28, -13, 25, -65, -39, 55, 6, -26, -1, 63, -34, -60, -24, 13, 69, -8, -80, -43, -35, 94, 127, 97, -106, 10, 69, 21, -118, 41, -10, 17, 40, 85, -45, 89, 86, 6, 24, -46, -21, -48, 27, 43, 72, 77, 2, -10, 114, -80, -18, -13, -14, 52, 56, -129, -9, 175, 64, 32, 53, -18, -43, -49, 55, -43, 86, -67, -37, -81, -48, -19, 105, 48, 22, -20, 12, -13, -4, 21, 18, 13, 1, 30, 93, 57, -73, -33, 26, -37, -13, 122, -9, -10, -94, 141, -17, 33, 24, -32, 8, -10, -34, -62, 2, -74, -6, 35, 17, 38, 157, -8, -14, 91, 11, -11, 38, -61, 20, 13, 39, -2, 16, 57, 26, -118, 1, -75, 8, -7, -24, 95, 31, 36, 19, 36, -7, 16, -72, -31, -97, -41, 53, -15, -25, 3, -75, -165, -37, 21, 14, -2, -22, 0, 50, -26, 38, 85, 100, -153, -77, -8, -143, -19, -72, -37, -81, 57, 13, -162, 62, 3]
7414CR9m4j7m3N4n6Q5j06l6M4l0J14j09M6Jk5K4K7K0j44M1N8K9k0Pm7N3l7K6l8
7444b1jq5J01r7J07Q1p3j37J07J04j8p3K7QkP7r1Qj36J93m2j20J26l7o3NM0O9
7472E7j26J46n1M5m0p2NN2m2Q9Mm3j6l4JOL2L1o5J7J10j15K8K1K5r9R8j07N3l4
7502b4L7J5OJ01r2r4P5r9Q3q1R2%o5J69j30P1p1K3j02J00o5R1q9M4l8k4J27m8
7530A2Kq6l3J32m6l0K7N1l4RJ7k4Q4j13oM3q6J05j26J06O6Oj9p1k4p2J76r6nN2
7560A7J00r2J1p3J31j17mJ39j68k7J42q8K5L9j21N5Q7N5j07NN6p3J9O5k30J30
7586b4J55j54k0PR7j5l4Q1p3k2L8Kk2j18P3N5%qL2l0J2o6j3Q1L6r0K9oN7j2q7
7617c9M8nL3P4j59J15j7o0O9m9J8l4P6n1o0j13K55j09j10P0L6OJ3l2l9P6j14J12
$$ y = [3, 102, 58, 41, -2, 52, -4, 81, -25, -61, -17, -47, 67, -42, 4, 5, -20, 4, 31, 51, -93, -52, 6, 35, 15, 22, -25, 28, -9, 17, -21, -22, -107, -6, -103, 4, 85, 12, -125, -18, 86, 68, -5, 22, 30, 28, 105, 14, 22, -114, 79, 37, -83, 43, 6, -57, -52, -12, 57, -69, 77, 26, 71, 31, -41, -36, 16, -26, 63, 67, 24, 8, -26, -25, -19, 13, 44, -21, -4, 106, -9, 19, 40, 65, -34, 64, -43, 10, -24, 13, 28, 34, 135, 43, -51, 24, -75, 8, -73, 19, 19, -46, 123, -7, 64, -7, 16, -86, 14, -51, 40, -49, -5, -43, -67, 60, 12, 14, -72, -105, 27, -19, -49, -22, 29, -5, 4, 21, -3, 81, -32, -38, 5, -81, 24, -102, 4, 70, 76, 57, -14, -38, -110, 66, -30, -35, 17, 117, 25, 36, -37, 94, -23, -27, 112, -56, -83, 59, -29, -4, 35, -86, -31, 56, 111, 4, 9, 65, -8, 11, 76, -154, -24, 131, -23, -43, -36, 61, 46, 12, 93, 20, -2, 36, 38, 16, -102, -29, 26, 26, 18, 50, 20, 32, -34, -47, 34, 70, -20, 9, 3, 60, 48, -39, 9, 4, 37, 111, -48, 67, 50, -10, 59, 10, 28, -6, 70, 19, -41, -154, 101, -8, -118, -48, -12, -6, 7, -25, -64, 12, -102, 10]
7645A0M0L3j77P6M7l9k2ql7J02Rp9P5NJ2l9J5Q8j86K7J8O7p7P5n5M3k4J1l5L5
7675A0L8J9j30M8K3lj15J62j40J17l3M2n8RJ7J3Q1Rj00r3J27q5PR7l7o2P8j35
7703i4R2M3q7P5r8Q7K8j83J11R2j20J07j45J31j24R0o6J02j1M9n5O6j35N2K7J6
7729E0n9LL1l8N0j2jJ7l6Q5j47Q2r4K9O1p5J12p9K1LJ8k9o5M9K4L0k3J02m7k2
7759D0j5n9O0j3j6K1j27P8K2J05k5J2j03Q6j92J82K3n1q9J66k45J41o9J06p6J63
7785A25q5j28J13j02J33m5L0l5K0j7N7j17J22k35J54J9j7o9N0j6o6j8M9L2J70
7810A24j33n9K8mR6j38N6J21n4m8P6j55R6j2M6lq0P9o7J29n7n9K5l4J08p5L5m1
7838@r9R6r8J83J0j33O7l9J26j48l0M6K6J0K1j7n4R2P9j36P7k0n0r4J21j23L1
$$ y = [10, 50, 83, -94, -18, 29, -10, -32, -40, -77, 25, 34, -45, 30, 35, 47, 8, 23, 111, -75, -48, -30, 37, -40, 35, -20, 23, -1, 10, -25, 10, 48, 67, -63, -15, 8, 5, -110, 52, -88, 29, -4, 38, -20, -11, 6, 19, 100, 109, 9, -84, 43, -42, -35, 62, 25, -37, 41, -94, -2, 41, -46, 29, -69, 18, 46, -137, -26, 66, -54, 53, -92, 39, -85, 5, -61, 41, 30, 79, 24, 90, -45, 7, 34, 50, -9, -6, 25, -13, 37, 25, 24, 41, 5, 90, -57, 25, -69, -40, 21, -54, 58, -21, 0, 3, 21, -8, -73, -24, 0, 30, 7, 109, 62, 40, 25, -34, 26, 13, -3, 18, -109, -31, -9, 96, 71, 83, -20, 66, -126, 56, 79, 28, -61, 105, -140, 1, -68, 38, -38, 125, 40, -88, 25, -77, 56, 11, 41, 6, 26, 9, 66, -51, 71, -164, -10, 9, -8, -77, -27, -43, -109, -127, -78, -46, 124, -9, -68, -40, -44, 52, -86, -30, 91, 37, -11, 65, -90, 6, -6, 40, 37, -43, 36, -31, 98, 41, -18, 7, -27, 81, 6, 41, 0, -99, -3, -101, 82, 92, -41, 26, -13, 113, -35, -65, -19, 7, 17, 38, 21, -33, 59, 138, 2, 79, 59, 9, -85, 36, -87, -56]
7865e6Q4N6j89J83p8K8j02O2J10j08m5N1m8J04l3m7K9q2J70k2j79J61o8oO6K8
7891F9k3r3J26j54J27J1j07lm4P8N6l2j20P2l7Q8k6k2RO6j31N9J12j21J11p3J09
7918A07j33M5L4k8j01L2R2j45O1J1O5n5J8J39j67M4j1Rjo6P1JO5n0j34Q7J3l6
7946c3NO3K5j04O9L8j19J27p1Kql5J46L4n8q9R1m9o1L2L3j29J47j15K8K8q2J17
7974C2n9J07j27J5J41j83m1J48N8j05m5K5KM4J7n0j1n6kJ10M7j01J06m9o0NRO1
8002C8m0K9J4j53J80p9M0J5j7k7Ro3N6J1p9O3N3L7p9J04j48R6r7K8K8K8lj6o5
8031c7j0m4Q8j5K0K6o3J33j47J05p5P7Ko5M8q2Q7M5j07OL5m5k2J4J1L0q3L8j16
8060a46J39J24j63M3K7M4j11K7N8j0l5J13j02P8r3MRQk2K2K2q9N4n6J05mj9J12
$$ y = [-56, 28, 84, -105, 78, 0, 28, -74, -12, 98, -10, -55, -4, -52, 52, 19, -28, 1, -81, 89, 67, -112, 49, -19, -25, 41, 69, 46, -47, 79, -75, 52, 63, -44, -47, -91, -13, 43, 11, -109, -37, -74, 14, -12, -34, -25, 41, -90, -31, 81, -40, 71, -2, 107, -26, 19, 53, 25, -76, -44, 48, -97, -36, -25, 40, -15, 3, 142, -25, 19, 8, 17, 16, -50, 21, 22, 87, 37, -97, -10, 3, -33, -28, 35, 60, -44, 25, 63, -56, 71, 0, 2, -6, -41, 105, 139, 81, -8, 83, 34, -27, 5, 38, -91, 56, -59, -31, -3, -85, 32, -27, 80, -47, -32, 109, -74, -115, 33, 91, -14, -59, -34, -32, 12, 29, -21, -32, -88, -90, 20, 67, -34, 72, 23, -37, -32, -23, 38, -2, 27, 41, -112, 68, -11, 29, 44, 27, 0, 9, -54, 2, 13, -66, -3, 50, 87, 8, 112, -36, 60, -37, -9, 19, 47, 44, 28, -37, -47, -91, -3, -18, 2, 28, -35, 98, -49, 56, -19, 58, 60, -5, 43, -39, 48, 93, -14, -8, 27, -18, -40, -26, -15, 15, -68, -30, -146, -7, 117, -46, -3, 24, 68, -43, -16, 42, 32, -3, 110, 8, 86, -7, -3, 6, 14, -8, 14, 36, -53, 1, -55, 50, 46, 27, 139]
8088A39j14j00Q2K0j19R0l7Q1r4Q7l1J34j34l7N6p1J71j26j04J26q3J2j9J21p2
8113b2j8L9J0J4j5Rj49J68m5P4k4k9rm6J20r1jQ8o6j60R7J65k19N0k9J41p0N3
8141C5m0M8K7j13K10k42Q7n8O7m4m6O4N1j2j40J92m8n5r4K12j46j0j0L1j22K41
8167H5j0j82J53k8Q7q6P8q1m6J1K6o0n8l1K07j67O6O4n2N8K7K1NN3
$$ y = [139, 25, -75, 7, 27, -92, -2, -39, 42, -52, 35, 4, 138, 4, -33, 23, -48, 123, -3, -107, 19, -64, -52, -71, 50, -22, -40, -1, 9, 23, 8, 17, -132, 36, -9, 65, 41, 12, 3, -43, 77, -14, -15, 73, 7, -153, -56, 109, -110, -60, -89, 52, -18, 35, -5, 43, 70, -43, 167, -75, 12, -46, 21, -23, -69, -5, 46, 34, -106, 86, 38, -17, -111, 101, -45, -55, -65, -34, -156, 85, 75, -107, 46, 18, 105, 19, 97, 16, -30, -19, 7, -53, -111, -142, 65, -102, -36, 28, -24, 34, 61, 82, 87, 140]
8191A40
$$ Imaginary data points
##PAGE= N=2
##DATA TABLE= (X++(I..I)), XYDATA
0@%%%%%%%%%%%%%%Qj6J6j6J6k4L2l2M0m8N6o9P7q8J04j20J36j52J76k00K24k56
36a36K88l20L59m02M46m96N49o08O74p44Q21r08J002j102J214j338J474j625J793
55I41j985K205k453K741l082L488l984M605n413O505q070J0524j4930K5245r3787
70g7450n5594J55803m8441l8948Q8131L8516n6615L5427L6171l2136L686M2667
82I1217l9573k6094L9281k335l2261K2749k940k8065J0155J235k5148O871O246
95B1338j5251j0377p286m174J2638l732k4040N491J5242l6274k4607K9913r226
108e0345l3377K8482J0637k6295L6227L1417l4011J6397N0003k4488j8524N3485
120C9608J0363l6608L0585L0877m4309K046M7049l5632l5116L9789o131m6160
$$ y = [0, 0, 0, 0, 0, 0, 0, 0, 0, 0, 0, 0, 0, 0, 0, 8, -8, 8, -8, 8, -16, 16, -16, 24, -24, 32, -37, 40, -48, 56, -64, 72, -80, 96, -104, 120, -136, 152, -168, 191, -211, 235, -261, 288, -320, 354, -390, 431, -477, 525, -577, 637, -701, 773, -852, 941, -1044, 1161, -1292, 1449, -1633, 1855, -2129, 2476, -2937, 3568, -4502, 6022, -8908, 16337, -77450, -133044, 22759, -25682, -64630, 23501, 62017, 5402, 40829, 77000, 44864, 48550, 91217, 51644, 25550, 64831, 62496, 30235, 52984, 50044, 21979, 32134, 33369, 8221, 15092, 21338, 6087, -4290, -11576, -15750, -3112, -6844, -30884, -25393, -10151, -46425, -71032, -41119, -50345, -83722, -55240, -44603, -70898, -34671, -3254, -37265, -20868, 29135, 4647, -13877, 39608, 49971, 13363, 43948, 74825, 30516, 32562, 79611, 43979, 8863, 48652, 42521, -3639]
132c639J2970J3335k9261l076J7069j5179r935K2176l055k4353R124O805k2207
145b9226j793R582q135k337L127O01M517n361j785J5422j575j1868J5333J8019
159D521n929L278K3728J677j0005K1071Q321k3887J0513J7739k9170q534K1491
172C4814j6651j8570J7016l615k4453Q857J3452k4497j0478K3577r172k2766J9084
185a3402Q155j9174Q312J0970j3682m23R549o733o681O655L375o777L841J2919
199c096m90l78J0571L396J992N582J74M700K153m812M196J322p345L497J425j0938
215A1949m387Q64n103p573j602k80q155J17P949q305l040J4274l288j1134O541
230a1173L082m594J552N30k591J481N742M47n361O941Q089q065o76R547m52N72
$$ y = [-3639, 9331, 22666, -6595, -9671, 7398, -7781, -17716, 4460, 1405, -22948, -13824, -7019, -29226, -31019, -21437, -29572, -31909, -28782, -28181, -23664, -29025, -30810, -15388, -16963, -28831, -13498, 4521, -1408, 1870, 25598, 27275, 17270, 38341, 46662, 22775, 33288, 51027, 21857, 13323, 34814, 18163, -407, 16609, 12994, -11459, -2602, 10850, -13647, -24125, -548, -9720, -32486, -13402, -5247, -24421, -16109, -5139, -18821, -19244, -9695, -16428, -23109, -16454, -13079, -19856, -16015, -3096, -3586, -3964, 6607, 10003, 11995, 17577, 17751, 22451, 24604, 19792, 23988, 25310, 17965, 21462, 22887, 11949, 7562, 8426, 3323, -4250, -5852, -6132, -14287, -14170, -6221, -14526, -17566, -3292, -6580, -17714, -11173, -8091, -12685, -11133, -10603, -13194, -11713, -5971, -5524, -10885, -3944, 4145, -3920, -4596, 4951, 4499, 5071]
246E071N506J143J742K463K380K405l369q99K57o769k150r28o412l07L67n731
262e231k000N09Q32j192m903R16J576l925K195K343n09M681J63k251M990P87k768
279c787J222j78j72q81n32N118K544l32K666M54K936L571m274N57L717l811j221
296G597M48j822K576j280m438n21k369k447r69l835j582j138j592K749n05k83
312i411N623l80j053K755k459J052M651l534k208L203J916J378r40J407L196j893
328C303j49P68k677L909K101m868J847L306j348J543R6j683m96l079j043j074
344D56l585R60j061l665J802m39j445K918q61j670Q47j221J806J963j089K395
360a889O55k34L533m50o67K909j600p91N20k175K462K250k323O53N20L18J547
$$ y = [5071, 10577, 11720, 13462, 15925, 18305, 20710, 17341, 16442, 16699, 9930, 7780, 6852, 440, 133, 500, -5231, -7231, -6722, -5890, -7082, -11985, -11069, -9493, -13418, -11223, -8880, -9389, -4708, -4545, -6796, -1806, -1019, -3787, -2565, -2743, -2915, -3796, -4328, 790, 3334, 3002, 5668, 6122, 9058, 12629, 8355, 8912, 12629, 8818, 7597, 8045, 6223, 8799, 7519, 3081, 2560, 191, -2256, -3225, -7060, -8642, -9780, -11372, -8623, -9128, -9411, -3788, -4168, -5221, -2466, -4925, -3873, 778, -2756, -4964, -1761, 155, 1533, 593, 2000, 5196, 3303, 3154, 3922, 1245, 5154, 7255, 2387, 4234, 7540, 6192, 7735, 7831, 6148, 5652, 2573, 1530, 456, -3129, -2169, -3230, -6895, -5093, -5532, -6977, -4059, -4920, -6590, -5743, -6964, -5158, -3195, -4284, -1889, -1234, -1468, 2065, 1615, 948, 3857, 2257, 1466, 1986, -189, 2273, 4523, 2200, 2853, 3373, 3691, 5238]
377E238r63L98K15k822J752m47m225L047Q94m480M74j223k244K423n27l263j517
394g270J487K004k729j35N398j231j355M036k136O38N768k191k580K910l23m36
410A855P05J76p9j654O02N96k103J927Q93k360K493j599l158N607O83n227K254
427A611P32k661J308n43k012L95N00l093l655M327K651p387K131O878o435o31
443e884Q173j889j596M026j819j095L766L51l592J093M780m078m998O501N90n958
459a629L037l43m727M127Q84l810K514J255j410P78L02j56O0N33r73l118J701
476i75J026l229K753j0n934M699L689p385J864N483m493m40L944j392q60N167
492C907Q80n970K640O806o322k810Q157n087o183P558j046o675M816J999n155
$$ y = [5238, 4275, 4673, 4888, 2066, 3818, 3371, -854, 2193, 3087, -1393, -919, -2142, -4386, -1963, -2490, -5753, -7270, -5783, -3779, -6508, -6643, -1245, -2476, -3831, 205, -1931, -1293, 4475, 2284, -296, 2614, 2291, 1855, 2560, 2736, 2657, 1003, 1605, 2201, 98, 2025, 2918, 558, 3051, 1452, -1706, 3901, 4584, -643, 1611, 2343, -318, 990, 447, -1565, -1170, -670, -3763, -7418, -3091, -440, -7827, -5696, 1182, -5253, -5884, 2289, 400, -1196, 2830, 1011, -84, 3682, 4033, 441, 1534, 6314, 2236, -2762, 3739, 4329, -1629, 1408, 1065, -3662, 465, 1349, -2461, 53, 1308, -102, 676, 978, 822, 882, 1415, 442, -2676, -975, 51, -3178, -425, -435, -6369, -1670, 2019, -5366, -3502, 1981, -2512, -2952, 992, -400, -1260, 3907, 4787, -1183, 1457, 8263, 1941, -869, 7288, 2201, -3982, 3576, 2530, -4145, 671, 2670, -2485]
507b485j83K998j585j871L671m3n232L548L996n004J418L384l322N84J173k976
523a929J539P34k707M56j32r12J519J182L63p81J366J229k266K091K822n027J282
540H29N491n672j262O369k809l807K809j127l901J552L103l960l373N756M88n663
556e177M648K967m816K741K325m545J206L227j966k758O53K641j599j370L506
571A683j142l144K240M4k150J360P30J023M7j366L073R08k140K311r63l654K381
588A241J248k863p89J678M55l207n60L817j876j314L689k646k769M577m79k538
604b336K640J333j642K08K297O92m024M26L111m853k073M443k58j023R05j84J96
621a42L53L09L71j993J560K144l569N20L861k320j359J837o33j585q1J589o11
$$ y = [-2485, -2668, 330, -1255, -3126, 545, 502, -4730, -1182, 2814, -2190, -772, 2612, -710, -126, 1047, -1929, -390, 344, -2363, -1907, -2039, -2951, -1432, -250, 113, -668, 698, 1927, -339, 1752, 4574, -453, 829, 6320, 648, -614, 5755, 2946, -861, 1948, 821, -3080, -1528, 1575, -2385, -5758, -2, 486, -5177, -529, 2438, -2378, 363, 2688, -1857, -651, 2576, 610, -2148, -1495, 1146, -453, -1823, 1683, 541, -2603, -363, -319, -2469, -1109, -379, 644, 691, -675, 2398, 3306, 1166, 3477, 2514, -1140, 1241, 2489, -374, -1163, 515, 970, -2237, -2797, 1020, -856, -2170, 1519, -1127, -3896, 681, 202, -2336, 304, 1637, -5, 203, 2500, 3192, -832, -406, 2705, -2148, -4221, 222, -36, -1059, -154, -338, -142, 211, 520, 891, -1102, 458, 2602, -967, -447, 3414, 1094, -265, 1572, 939, -646, -727, 862, 251]
638B51l651J162J556k627K141J716k301J982K251k468n21J630P51j417k405K206
654B56K024k305R30J124k062l97L0k72j02r41J719L64k555K625J408k684K876
671B038J133m268N81L237j797k513J015J728k930o97L736k111j854M997k509m747
687d961M682J236l244J452J879r78N8J576P24j955M72J246k942KJ716k048J085
704@J451k806M70J582j179J197m47j677J856L53j657Q52J523j6j769P97J386k982
722a066P10L068m585j382M415k526j775M396r79k664K555J279k364m20L284p45
738A201l407K985R19l481L156J824n006R65K681k357p08R25q3%l55L20M00lJ598
757A574n86j354R75m05K39M46k053R99J297k886J431K112k983M62K307k250j258
$$ y = [251, -3400, -2238, -682, -3309, -1168, 548, -1753, 229, 2480, 12, -509, 1121, 1872, 455, -1950, 256, 2280, -25, 905, 2029, -33, -430, -400, -672, -774, -1715, 4, 368, -2187, 438, 1846, -838, 2038, 3171, -1097, -516, 2721, 924, -1589, -574, 1154, -1776, -2473, 1263, -848, -2702, 2295, -214, -4961, -279, 957, -2287, -835, 1044, 66, 124, 1700, 2424, 469, 941, 2187, -755, -753, 963, -1085, 0, 1451, -1355, -885, 697, -482, 715, 268, -1409, 447, 800, -857, -5, 1518, 1502, -267, 530, 1916, -1066, -356, 2712, -1873, -3255, 1160, -1366, -3141, 1255, 276, -2388, 167, 1446, -918, -1338, 1946, 1201, -2206, 779, 1698, -1783, 1373, 3197, -1809, -844, 1837, -520, -1228, -303, -386, -386, -741, -421, -21, -24, 1574, 988, -366, 609, 204, 443, 889, -1164, -165, 1132, -1754, -323, 1789, -1194, -732, 1575, -675, -1933]
774a933J825J269j748l74K064j120q49L786j883k968L907n82m290K337J840k490
790a209j18J628l31j286J297J959k202n78J757j756O1K259j898k61J876j043k51
807i6J28k94J268q36j759O35M73K32J99m33Q29q7m1J252j478J08K286k639j416
826a669K923j187j013J966k83j442J62J297j79j651Q14O39k130J171J399k405
842a588K022J854k679l12J705k81n32n94K68j48j333J293L80j237J454J19j220
859h29R15j70m79J008m08j84J25o12K142L77k182R58O77j093o4p01L59M74j150
878h37J65j16j44J987m78j716J566N5r43R59k49k77K68m05P03k55o02J432n76
897E37j226N72r62J43J177j056l65O27J30R19m96l34J658p94q79J004q28J39J077
$$ y = [-1933, -108, 1161, -587, -961, 1103, -17, -866, 2920, 1037, -1931, 1976, 1394, -2896, -559, 1281, -1209, -1327, 301, -30, -1316, -19, 1940, -262, -840, 917, -839, -778, 1481, -417, -678, 1198, 155, -96, 32, -262, 1006, 170, -1589, -954, -481, -249, -50, -483, 346, 259, 218, 1470, -8, 100, 2386, -253, -1669, 1254, 67, -946, 1020, 737, -705, -543, 754, 575, -1076, -262, 377, -1753, -582, 817, -1588, 434, 2288, -391, -703, 1002, 721, 189, -405, -137, -285, -1618, -325, 55, -1182, 272, 391, -829, 86, -84, -563, 445, 37, -147, -22, -634, 1508, 1885, -297, 661, 1338, 245, 181, -520, -161, 313, -837, -672, -788, -932, 1055, 577, -1139, 427, 482, -461, 498, 249, -28, 240, -165, 538, 283, -319, 1113, 537, -689, -117, -1079, -936, 241, -815, -1180, -553, -423, 496, 0, -334, 1324, 530, -349, 655, -173, -34, 1043]
916A043r72l34J57J3Q10o61m99P78j219J03J065j102M66J042r76M81J26l07J098
935A112q4r43M9o57P88M86j627R43L23q72L87k86k21J251q04o04P46o82O87P13
955G05p41K82r5l84Q83n13k91N43p78K03Q1j158J247O79j177K73l78Q8J151o92
975g2m29P66l80M14r0n91J488l06j080P65o61j70J054p29k40K96o89N77N80o76
995a73K48k69m9O96j079M45J099q70J22k1q21J298K39j281Q1j3J31J92q08O36
1015a97N99j058M75K03o46J070k44m58N83q79k8J253j75m62l4k34P60m12p74J053
1035C95j02l94p4o64Q80Q02j115M40L67q16O06J07o83M22q0Q7j84n45Q15O2o88
1056c62Q47n42q73J328j65q60M40j99Q9O21n18K40J01K06K02j049P5J147q41j71
$$ y = [1043, 71, -263, -106, -93, 717, 56, -443, 335, -884, -781, 284, -818, -352, 690, -286, 195, 321, 14, 1112, 1028, 85, 134, -523, 265, 751, -876, 67, 390, -482, -95, -381, -602, 649, -155, -759, -13, -695, -8, 705, -36, 246, 151, -233, 650, 137, -154, 389, -389, -186, -105, -1263, -16, 663, -514, -241, -619, -531, 620, -72, -501, 265, -115, 299, 209, -382, 1106, 800, -280, 485, -176, -346, 708, -21, -261, 35, -654, -77, 503, -173, 75, -194, -243, 453, -626, -181, 918, 48, 170, 149, -672, 626, 865, -416, -335, -348, -217, -25, -833, -197, 402, -656, -181, 22, -624, 446, 202, -256, 327, -552, -580, 673, 498, 36, 2, -232, 528, 116, -658, 395, 293, -101, -175, -839, 41, 843, -272, 168, 535, -281, 325, 432, -251, 171, 91, 178, -6, -551, 264, 326, -362, 485, -57, -930, 398, 233, -627, -187, -386, -297, 324, -194, 46, 147, 353, 555, -494, -419, 728, -113, -284]
1076b84M34r43Q62L70o91N30k47p20R58j63n43O22j08j37j27j36R23l02l1Q51
1096A118j656k62J879j001j014J327l08n35O54j23j81K81N79n45j259J102P75
1113H31j807J032R94j808O33J010r80L1L99l28N3o30N8L76k05N23l49m45Q91m6
1133B33k51M98r53J76J029j412J97J476j032k65R17p07j16N09K93q47n56J261
1151D50m60j131J896j85k012K100O39k219P08J322r22p10L59M27n93M44Q11j354
1169d30j41J655j095q63J469o09p92P87k90j12M76J21K84m72m15P52k15l54L99
1188A55m24J23P9k24O33o57J37J140j446p19J790j94j034O78J36o46K89Q83m01
1207B98o68R59M59j954P01J395j826J18J529j344m79J296o1n49j45M30j69o09
$$ y = [-284, 150, -793, 69, 439, -252, 278, 31, -689, 269, 106, -437, 185, 77, -60, -187, -323, 600, 298, 267, 1118, -538, -800, 1079, 78, -936, 391, 83, -452, 202, 79, -102, 179, 758, 213, -1046, 56, 831, -976, 56, 1050, -758, -125, 885, -95, -64, 335, 7, 60, -570, -512, -136, -341, 182, -167, -612, 279, 233, -18, 480, -473, -297, 732, -680, -483, 993, -39, -304, 613, -94, -210, 299, 592, -255, -811, 450, -10, -1141, 755, 570, -1442, 658, 1297, -922, -214, 1108, 186, -524, -165, 262, -331, 113, 924, -430, -571, 1084, -11, -874, 595, -14, -806, -19, -309, -421, 55, 176, 460, -12, -427, 325, 110, -244, 155, -269, -146, -67, -291, 342, -315, -178, 962, -484, -1203, 587, 393, -641, 37, 173, -473, -184, 699, 298, -370, 589, 1048, -906, -205, 1190, -636, -518, 1011, -333, -812, 484, 423, -126, -271, 159, -10, -619]
1225f19P81J5r76J122L52j254M67O34k77p6m98J86N20p70K69O40j026L69M88n86
1245b39N9K26J72l26m12P28j98o64J493k12j670J177R89j516J23P59l34p39N09
1264g5M86r00J06J596j349j017J796k10j233J102J42j021M31N01q4m06L68M67
1282G00q64j50P35q49K9Q87p18m49O61K69m2n37Q5P47p84k54Q56k51k97M98k82
1303a0j61R1N00O7r02L54M10r35K86J027j247N5J125n58m28M84L16j77m80J94
1323A1ol63O97L05j244M62P87q36j47N04r2j16j59J29J10m71P58N3q98M87M03
1344C74n26K35R7m21J10j34L39k87j99Q13o4q69N56K54m64L55j29k59N4R0L84
1365C09m36n0O97m52n53P53j50n60O73k86k21N4K41L80l30j11L83l22j37N77m58
$$ y = [-619, 162, 177, -799, 323, 675, -579, -112, 522, 245, 169, -329, -143, 377, -393, -124, 516, -510, -141, 347, -239, -180, 46, 218, -108, -520, 208, 10, -654, 839, 627, -1043, 134, 1123, -393, -270, 489, 155, -584, -75, 411, -489, -383, 1213, -136, -1153, 643, 433, -800, 302, 444, -577, -146, 355, 271, -135, 233, 700, -164, -314, 421, -428, -399, 488, -230, -679, -18, 251, 209, -328, -243, 504, -280, -534, 322, 71, -226, 272, -10, -171, -80, 420, 487, -415, -61, 349, -586, -300, 727, -520, -465, 660, 102, -326, 158, 474, 297, -183, 11, 5, -358, 339, 644, -600, -138, 649, -187, -334, 170, 78, -38, -197, -68, 42, -429, 329, 382, -516, -29, 374, -152, 83, 180, -241, -131, -265, 74, -213, -412, 401, 337, -532, 24, 278, -186, 169, 40, -219, -165, -75, 309, -127, -177, 520, 68, -485, 268, 118, -442, 231, -55, -276, -222, 19, 399, 69, -42, 341, 19, -118, 459, 1]
1386Al37P97n25k72K97L2K97j44k93K15l30M5L42m68J4M62l15R8K45j15L02k71
1408G7r9J97n72K98M47n73n1K62j13K49J1k55K94k19J8Q3n13N66L57p00J58L21
1430B43j42K09q4k43K16m08J79J3k77K44J75m47L11J02l47M61L4k80r1p9K68J78
1452B35m56K76R5l84K26J06k77L66j56k91J98j54L11J04m19L28m3k59M62j66j29
1473b7K77l88l0K00k66K01K26k17m5r7N5N45m44j59L67l39J62J20k98K92J07l44
1495a02J89j01j43L55k10j35J26l35L89J62l95K80Kj57M03m23N9L21k12j95N9
1516f3k41M28Q1l45J04r1M4K30l40J15K89k75nk0J11R7M9j77J32r3j00J51L5L7
1540A53j99k20L65n2l63M82o7j90K18k45J36K70k28N2p0j53J94j07K0J69k29n0
$$ y = [1, -336, 461, -64, -336, -39, -7, 290, 146, -147, 68, -262, -217, 125, -343, -329, 133, -182, -84, 161, 46, 348, 77, -22, 175, -397, -99, 348, -225, -276, -14, -127, 122, 133, -122, 172, -47, -29, 54, -459, 107, 464, -236, -78, 243, 101, 310, 226, -17, 199, -209, -30, -17, -294, -50, 125, -322, -11, 91, -256, 205, 239, -41, -132, -211, 57, 235, -221, 55, 150, -234, -8, 98, -179, 187, 31, -260, -62, -216, 95, 199, -220, 108, 65, -194, 268, 102, -27, 250, -138, -168, 32, -234, -33, 193, -24, -69, -166, -111, 434, -10, -169, 198, -141, 21, 141, -157, 135, 242, -102, 87, -14, -157, 198, -12, -147, -21, -356, 33, 195, -200, 80, 82, -75, 328, -95, -36, 285, 73, -122, -63, -304, 124, 205, -140, -36, -127, -83, 147, -193, -78, 211, -64, -69, -89, 22, 119, 168, -9, 123, 30, -70, 81, 116, 153, -46, -266, 99, 47, -316, 166, 99, -91, 127, -118, 18, 288, 60, 112, 42, -111, 83, -24, -4, 165, -64, -114]
1562a14K61k52J41J09l98J64k9l13L65J84j10O2l33K66K19k38R9m5k55L98k18
1583c7q2L76k62l6P3k10J59K70l59K6Q1j0J53k87K77J89k92R3K5k98J62J54k35
1606g0J76j55j74L46j9Kj26o1J05R7k03J47P8k16K38l73J01K88j91j17K63k97
1628a61J42J38k27j5oN0K2k32J99K43j38J21m2k34K54K02k66q3R3q8L8J5p5J76
1652A26k6O4k69j15N03r4k91J52%k54K68j13K14q8j71J99j0j46Q8N6q7m8j18L
1676a57J68KJ71k52j63L58j33j49K35p8j06J80j87J16J55j01J9j60o3K88k65J07
1698a5K02m04P4K93j51j04J49j2O6j27l7J19r1N7J81m69K67K25l26J78R4k89Q7
1721c3Jk56L68j57J23J42l20J51Q0j10J29p0r1J77j77mJ24l09K15J47l38J00K37
$$ y = [-114, 147, -105, 36, 145, -253, -89, -118, -431, -66, 118, 8, 70, -263, 3, 222, -16, 83, 38, -217, 181, -37, -119, 257, -5, -41, 32, -178, -19, 251, -108, -82, -1, -11, 142, -145, 132, 321, 29, 122, 147, -151, 11, 165, -70, 106, -49, -223, 123, 104, 106, -20, -81, 24, 121, -82, 65, 143, -73, 165, -208, -107, 181, -10, -127, 136, -161, -19, 119, -108, -123, -129, -79, -57, -289, -90, 153, 15, 136, 94, -140, 114, 316, 50, -33, 60, -28, 10, 25, -50, 126, 100, 164, -105, -220, 283, 189, -102, 50, 50, -204, 64, -49, 165, 77, -94, 105, 95, -51, 37, 93, 6, -42, -160, -157, 11, 13, 184, -68, -231, 127, -6, -155, 80, 2, -104, 76, -111, 5, 160, 59, 78, -82, -145, 143, -122, -15, 187, -217, -143, 150, -1, -105, 44, 32, 98, -29, -66, 53, -38, 19, 200, -269, -2, 223, -103, 75, 169, -120, -33, -32, -288, 80, -77, 46, 188, -132, 19, 99, -11, 118, 48, -43, 134, -43, -47, 77, -232, -17, 130, -208, -108, 129]
1744A29r2j56J55j16J84j31J79o5k41K22R9k71Q5J0o4J95q6j54R1J71k8j25l8
1767d7K1J38p9J04j48r4K64j7k60J38o1K49k39l11K32R7q0K09k18k6J97j85j4
1790a30J17K0M6o9j12K46j1k31K34j05k26L01n5km3p1L2n1Q2J39k05J29K77l26
1814a4k07L44j08p3J98k10O0K5pJ21j96N7K15k36p0J33j30M9J04j55Q1j6J09Q2
1838A56l18J22l9J83j70J4n5M7R4j30JP4J83q3k39R3J16j52J06j2p5P2J2N8N7
1863A15o3J77j18j50o3J14j94L40j61j99K84m5k2R5j19J39k8j48J11n7j59L39
1885A88p6l06K00q0J3L2L8L3j43N5K1k7q7K47p6ro0j61K99j0k42R8l5m9J81N0
1911I4j48J34q5J1N5j10l5J30rlr5j4J68j47p8K34q2K3J91l34Q8Rj6Or7J03J62
$$ y = [129, 37, -119, 36, -80, 104, -27, 152, 87, -154, 68, 167, -104, -19, -9, -73, 122, 36, -118, -27, 144, 116, -9, -47, -26, 112, 33, 137, -11, -105, 159, 142, -118, 20, -41, 208, -31, -342, -110, -13, -93, 116, -102, -128, 69, -116, -130, -13, 7, 53, -16, -128, 118, 107, -124, 110, 5, -221, 80, 25, 23, -20, -91, -59, -110, -28, 111, -94, 35, 312, -14, -221, 123, 15, -58, 140, -70, -10, 15, 8, 129, -67, -10, 205, -31, -101, 32, -98, -49, 55, -100, -19, -35, 74, 156, -162, -40, -79, 104, -66, -52, -107, -60, 34, -96, -95, -21, 162, 79, -160, -67, 49, -103, 3, -9, -84, -12, 0, 58, 115, 52, 229, 111, -39, -102, 12, -182, 158, -3, -202, 82, 37, 15, 110, -9, 130, 102, -46, 65, 8, -151, 188, 112, -194, 6, -74, -61, -29, 9, 42, -101, -46, -25, -52, -139, 108, 32, 23, -37, -198, 101, 91, -151, -53, -88, -137, 44, 94, -54, 80, -5, 6, 61, -49, -84, 46, 37, 34, -61, -75, 93, -54, -132, 102, 20, 43, 234, -100, -12, -3, -19, -13, -110, -7, 155]
1938A55j98n7J95j84J30N8j14j5n9qL9J09q9P5j50O7O8k69J75J13l04J54N2KN2
1963cJ57j74J89j60KJ9p1Q7q4j05J56Jq1J89j16j1o3M4L1l6k30M51p9j55J77j43
1989hq2J86J7j29j3J7J14%r7o9k3N5J88k34L7R8j50O4j67J03K68j81K8o1L0K2
2015A3R9j14m3L5j2J33o3k19K55o2l0j0j62J70R5j61N0mk3J27k5l5J21j86N3O2
2041F4k35K76K2k94K05mo9J09Kj50J73k78J47K20k68J25J5j48J40n4m0J25o4O4
2065H3j03m6OJ50k55K50m6j61K30j71Q4R4j65k8Q4P5o0O8p7K7q3o8J78j04k6O7
2091Cj5oK05l36J52K07k49O9j16j00L47j87K8K9o9K0o9PJ73pk50K65j61J4J36
2116I0j68J92k05Q5J89j05j38LN6K5K7%m8M1j28N2J06j70J07J07j95J57j08l1
$$ y = [155, -43, -100, 95, -89, 41, 99, -15, -30, -89, -97, -58, 51, -38, 37, -113, -46, 22, -247, -72, 41, -263, -109, -57, -55, -3, 154, -20, 169, 9, 11, 30, -41, 46, -38, -143, 13, 14, -67, 122, 6, -5, -68, -24, 7, -29, -259, 192, 113, -42, 135, -8, -90, 96, 113, -16, -29, -12, 102, 102, 5, -64, -87, -32, 156, -78, -41, 57, -93, -29, -196, -93, 175, -6, 22, -39, -9, 13, 112, -2, -45, -10, -22, 111, 48, -171, 84, 22, -8, -18, -180, -10, 85, -76, -26, -30, -53, 74, 49, 14, 135, -51, 2, 64, -171, 105, 127, -167, 38, 34, -35, 74, 76, -74, 99, -179, -32, 188, -80, 45, 60, -88, 52, -2, -42, 83, 19, 83, -20, -66, -60, 90, -165, 85, 39, -122, 108, -63, 21, 115, -50, -78, 6, 81, 21, 89, 12, 39, -44, -112, 66, -38, -64, 3, -12, -18, 187, -149, 3, 210, -39, 30, -86, -186, 161, -26, 2, 31, -38, -18, -87, -80, 93, 86, -164, 101, -60, -46, 90, -78, 114, -91, -6, 183, 78, -60, -57, -1, 24, 51, 51, 3, 44, -84, -32, 74, -96, 11, 118, -77, 80, -28, -59]
2140e9J58j28Q2pp9O4m6j27J98Oj06J80k46j1J01O8lq7l4J37k7j17K44k10RJ15
2166G5J3j82N4L2N8o4p3K09p7j4j3lOk3j28J30J42k11J26j61k4J70L7j07lj30
2192a61Q9J98j73o4J08P6j2j85M2L22j56rL2k90K00Q6j93J81j56n9J60j24P5Q1
2216F8p0O3p2q0O7Q7k0j4l8m6J59k4n0Rj84R8n8j27K70j0j22J54j54M3J03o1M5
2243C6J04k72J59J9j06K28j30k31L14j31p0Q7J3jK7k80K45L8k8J5N7j23J46j11
2267Er4J78n8P6l5j09o9K24j80K59k50j29K25j40J65j17K3J83j12j30J25o7j7
2290d4J44l91L57R8p1j40Jp5K59j77j4J90k29R4Q3k01J23l5N7Q1j71n2N6J14L6
2315I3Rk08J09M5m1j66R2N8J26r7r7J29j16M3J45k29M7R7K3L0q2j11L00k53M3
$$ y = [-59, 99, -29, 53, 46, -33, 31, -15, -142, 56, 62, -44, 136, -110, -121, -20, 48, 45, -42, -76, 61, 34, -83, 161, -49, -40, 75, 88, -94, -40, -8, 50, -14, -87, 122, 45, 31, 18, 15, 21, -2, -130, 0, 142, -69, 57, -104, -128, 42, 79, -28, -31, -161, -72, 126, -47, -111, -3, 73, 61, -124, -82, 240, 84, 75, 107, -183, 17, 103, -90, 91, -65, -124, 36, -88, -13, 68, -2, 61, -11, -91, -24, 63, 43, 29, -9, -55, 104, 80, 30, 39, -145, -47, -105, -232, 38, 28, -94, 60, -94, -51, 52, -9, 36, 140, -132, 27, 46, -60, 168, 38, -193, 121, -10, -80, 7, 20, 19, 46, -234, 11, 49, 21, 36, 93, -30, 116, 5, -89, 89, 31, 107, 72, -37, -106, 118, -62, 197, -53, -182, 43, -97, 68, -49, -26, 157, 45, -85, 40, -27, -44, 100, -291, 66, 164, 93, -47, -46, -121, 138, -39, -53, 137, -92, 2, 85, -116, 7, -28, 29, 110, -61, -113, -57, 57, 93, 102, -106, 3, 48, 7, -159, -67, -9, 117, 20, -77, 52, -64, -21, 124, -105, -58, 39, 62, 92, 10, -101, 199, -54, -11]
2340a1J9l0J04l1j45J03J4K2J1j29m2J30N4j07J53k59K02j0r8jJR1J01j74j0O
2366c6oJ17l6j21mM5l8K53j29j06J40O5j49Nq6K02J0j95L5mn3R4J14j20J20k19
2392a02J1J28m8J19l7r7O1n0N3m0nK6L2n3p8L6o6J20r6p6J82n6Q6N8j51L7LR6
2420I3l1j31kJ8P9j31J80j7k17J36j4m0J07j44J29o2o5J93j20J4J13j63Q1R5p0
2445C1p0l1m6J48L9k73N8N4P1Q1j00O3M0l4M6j06N6p5n2N0J44q4J07j30N1n8l9
2472e9R6j1n4k20K73m6MJ9q9j1J44O7j12j02M5K24o2k66J69r3J63j23m2K53k00
2497c3N7J8j12N8P7k16K07l2q6K7J16n2oq0N1P2j65J14k2n4J7p1O1J78j75K6q
2524c3J19p9PN9j45R9K2l4p2K2J16l3j21L1l3J17P2k02P1Q3j2J5p9n8qk9R5l7
$$ y = [-11, 8, -22, 82, 51, -94, 9, 23, 45, 56, -73, -115, 15, 69, -38, 115, -144, 58, 48, -50, -51, -50, 41, 142, -32, -42, -36, -42, 75, 39, -82, -86, -41, -79, 174, 45, -61, 79, 144, -5, 0, -86, 116, 126, -69, -34, -38, -91, 3, 117, -3, 117, -102, -91, 37, -11, 108, 71, -26, 35, -15, 38, -2, -7, 19, 51, -2, -80, -44, -110, 10, -86, -162, 20, -36, 50, 108, -43, -6, -3, 93, 62, -69, -71, -53, 26, -105, 75, 58, -159, -23, -37, -77, 30, -114, 15, -47, -112, 81, -39, -25, 88, -75, 6, 101, 31, -39, -70, -116, 32, 71, -202, -144, -90, -19, 62, -38, 25, 65, 31, 77, -29, 27, -48, -100, -50, 94, 10, 117, -13, 38, -20, -59, 37, 26, -28, -248, 25, -21, -17, 2, -87, -98, 46, 113, 1, -101, -56, 168, 106, -160, 9, -84, 79, -44, -86, 167, -33, 24, 42, -70, -12, 65, -151, 56, 24, -62, -35, 81, 29, 23, -57, -6, 66, -99, 15, -7, -61, -44, -115, -54, 124, -51, -25, -33, 86, 7, 14, 73, -72, 27, 49, 15, -57, -35, 81, 48, -73, -42, -75, 42, 114, -88, -17, 66, 54, 69, -10, -68, -76, -105, -10, -47]
2552d7l6J20p7K5l3L3L7l8n5K1L9J2p0J60j14J0J57j17r1O8k5L2qp2J15j60J53
2579C9N7j01ll0r1K07j0j41J78j5j95R7j7J03j43N4r1P8Q1o0P4o5m8l9O8J20j30
2606b3M0m9J76k4k01Q8J22m2n7l0J13J1j28K9O9p1m4P0k18J54K5o2J5J27j16P2
2632D6L3j83Q0J71j68M8m3N2nL1K0l9p2M3J3j16J10L2m9J14j44R8m7n5M0l7k6
2659e3l7J50Jm7J5m6O6j74Q4J45j60N5j28l5L43k25J22mk29O6J25L5Qj14K9O7
2685E9L7j86M6R3J33n4l11J70OL3j22%K0J24m9Q2o1o8N4k5k10L43j79P5J32j91
2711d9MJ70j56P4K5r9L8J41j04l1j5J4j18K5M5L0j32J58J0l1N3p0QOL9j8R0m6
2739F1q5J7o5Q0m8Q8lj41R2qq7K19p6lq6J08j89J34KoL8j05M3J51j22M3J0j26
$$ y = [-47, -83, 37, -40, -15, -48, -15, 22, -16, -71, -50, -11, 1, -69, 91, -23, -13, 144, 27, -64, 4, -21, 11, 3, -69, 46, -114, 39, 96, -5, -8, -38, -129, 78, 68, -73, 105, 90, -105, -8, -25, 78, -65, -11, -102, -24, 57, -3, 71, 6, -42, -81, -13, 107, -23, 17, -32, 144, 120, -81, 7, 129, 87, 30, 0, 113, 124, -4, 25, 94, 23, -21, 49, -169, -15, 10, -52, -37, 90, -26, 46, 79, -104, -24, 147, -21, 27, -16, 36, 31, 62, 82, 43, -29, 14, 27, -89, 21, 53, 4, 118, -26, 72, 25, -30, 10, -27, -53, -90, 60, 61, 14, 29, -17, 49, -125, -41, 104, -56, -1, -129, -164, 179, -46, 76, 72, -157, -91, 34, 69, 77, -37, -8, 59, 96, -90, -44, 49, 182, 128, -183, -13, -7, 26, -96, -96, -76, 48, -1, 81, 20, -48, 6, -19, -229, 114, -65, 10, 142, -49, -45, 125, -31, 43, 68, -31, 7, 148, 44, 13, -2, 12, -106, -81, -36, -6, -138, 20, 30, -1, 52, -18, -10, -4, 35, 17, 107, 61, -24, -7, -72, 8, -40, 48, 45, -96, -4, -12, -99, 120, 44, 41, -45, 63, -126, 8, 10, 4, 42, -63, -20, 131, 9, 52, 62, -64]
2767f4M3J14j71J28O2k71J15j84J99J34j06j41J41Q2j09n1N8m9LK6R1l6p3J02
2791D3m8k6m8l9O6L2n0J44o2J24j10l5P4j69jJ27q3K2R0k5j6J5J6l7O8j55M8O7
2819C2r3kj2R7m5K4J76j84L3j80K35o2J4n4O9N9j08o6J10Lpn4J7l3j9J26j6q9
2847b9J4J18p7M8p5o6k1Q8kp6P0l3J17j00LJ65j90P8j59J33L3l2J0K5j7PR7j50
2875b1k4K24j51Q6j83L6O8plj0N0p6P2j40J14n6o1Q1L7j8P5j30k4J37q5o7J1M0
2903b5l0J47j02J00j20l9Q5n5Q5l3K9o8qK2L4N9j47P8om0Q3m6K1Kk2j18J17M7
2931E0o0M0q2P7qn4O9q3Q0K4j17O1l3O5L4j29M0K3K4J5P7j28J15j17m5R2n5l5
2959f0J01o5j0l9J04J7J9n6M5p3r7J38q2J16m0L7k9P1j65J55j75P0J22r2J4j7
$$ y = [-64, -21, 93, -78, 50, 112, -159, -44, -228, -29, 105, -1, -142, -1, 81, -28, -79, -21, -70, -67, -41, 50, 14, -59, 43, -5, -31, -79, -118, -52, -20, -70, 74, 12, 136, 26, -9, 65, -104, -105, 22, -61, -39, 51, 26, 10, 25, 41, 4, 72, -83, -35, 32, -61, -63, -75, 22, -23, 1, 177, -7, 26, -154, 81, 19, 33, -21, 48, 107, -1, -67, 43, 46, 39, -15, 2, -31, -50, 76, 60, -29, -15, 103, 26, 74, -1, -67, -88, 0, -2, -78, -8, -41, 76, -24, -21, 144, -46, 32, -127, 6, 39, 7, 17, 42, 25, 32, 129, -21, -45, 179, 28, 114, -69, -33, 35, 28, 25, 15, 65, -11, 61, -79, 35, -21, -82, -1, 36, 18, 93, -37, -61, 76, -9, -76, -65, -25, -55, 92, -10, 90, -30, -69, 16, -39, 46, 13, 42, -26, -34, -12, 22, 81, -66, 12, 6, -34, 49, 3, 24, 26, 4, -114, 3, 50, -10, 30, -52, 25, 17, -37, 32, -51, 29, 53, -64, -3, -36, 29, 63, -66, -26, -3, 21, 36, 113, -15, 100, -17, -62, 30, -25, -60, 41, -24, -34, -73, 31, 48, 67, 11, 56, -17, -114, 24, -58, 58, 18, 55, 26, 97, -68, 87, -88, -18, 104, 12, 26, 9]
2985IN6j57J92q2o4MRN4p6O2K5j40Q4R5rk8j0p4LO3J03j28L5N0j80J59j9L1j16
3014d9K6R7p2q9J16n6N9o1k0K07j83Kk0J45j97J44p0j4N6j64J37N6l7L3K9r2L0
3041A3l8N2oLjj3M4n4N4k1J2n0M3J08r1o1J2Q8j36J00k6l8m7M5k6n9L8N0Q7p4
3071Hq9P5Q8o4p8N2P0j11n4K7J99j28m2J52k7L6j01l9J3k2O8lm2O2k6l6n4J40
3099G4k6p3q0J70J5n1Pk1r1J26M1q3r4R9k4J0o0J19l5o3R3J6q5K7Q9k12J04M6
3127C8Qk4q0P9j1n9K6l5J25p0L2m2R5j07n1R4K3m0J9j00J41jq0Q2q2o3L1MM4M9
3157D5j43k1J82j0o0M8j17N5K0N5p0r2L8n3J96j51Q0Oj0P9r7Q7j16M8L5J7k2O8
3185I7j31K4m9O0p9J12jJ7o2j3P5j75O6qL6j4K01j04j29LJ13j65N3n2J09R4p1
$$ y = [9, 65, -92, 100, 18, -46, -42, -33, 21, -55, 7, 32, -108, -24, 71, 62, 34, 24, -50, -47, 16, 119, -9, 26, 76, -104, 55, 36, 67, -49, -23, 74, 2, -87, 29, -27, 32, -29, -49, 158, -25, -23, -43, 102, -95, 49, -21, -35, 21, -143, -6, 50, 13, 46, 75, -17, 13, -25, 27, 21, 24, 23, 10, 54, 0, 54, 33, 45, -5, 38, 146, 55, -6, 6, 94, -42, 58, 32, -6, -53, -8, -34, -93, -55, -5, 82, 8, -81, -6, 82, 18, -60, -8, 62, -49, -103, -76, 123, -5, -47, 105, 78, 114, 13, -26, -13, -35, 33, 30, -12, 50, 24, -12, -66, 74, 48, -25, -105, 65, 80, 29, 36, 15, -76, 50, 91, 8, -86, 13, -11, -1, -61, 58, 23, -40, 53, 69, -16, 11, 100, -112, -8, 38, 46, 22, -58, 21, 10, -49, -23, -58, 67, -3, 29, -13, 82, -25, -76, 18, 41, 1, 20, -80, 61, 60, -20, 62, -20, -83, -52, -48, -4, 45, -98, -119, 63, 53, -7, 41, -76, -21, -1, 54, -16, -108, -70, -123, 73, -78, 2, 8, -2, 77, -20, 67, -49, -1, 34, 51, 29, 97, -34, -10, -59, 1, -78, 34, 33, 50, -12, -25, 50, -125, -59, -67, -31, -45, 156, 52, -77, -74, 39, -126, -73, -125, -16, 78, 7]
3212Gr4J4l3J08O1l0R9q4o7L0K0l3N7j1Jp3L7j9L5L3n2pQj21R4n6R3n5O4l6M0
3243C0p2J8J8K8o6K2n6R6j09Q5QL2L0k5q6p5J32m7m2J52N6o9j53J32k9J04m9n3
3271A2j37J28J5k4nL5j07Q9K3l6Q3p3j35J80m2P2l0L0j30J73r9L7j67J3J55o8
3297hM0j03J24r0R1k2R8q8L1l6m6Q4J9p7P3j04j31J28Q0o2m7K6p9J52j9J07j19
3324B2r6J00j32m3K16o7r5K12j82P9N2o6n9O1K3Nk9Q0m0p2j5P7p0J03jj21K7N6
3352B5o8N7n7l6P1O6j9Lp1k9M7O3j27J69j10L2Q9j49J67l8j99J70n4M2n1K0M5
3379E8N9j46Q5Mk6NK4q7O9j01P2M3l4k7J9l5K1L9k0K5m8rQ4Ok6j18P1J1k8K9r
3410A0q5R5l2m1O8J6L2L6o7n8k7M2J30o7o0R0p4J22n5j3Po2jm5k8J7OK21j99K2
$$ y = [7, -87, -73, -106, 2, 63, 33, 132, 48, -19, 11, 31, -2, 55, 44, 45, -28, 9, -10, 25, 58, 6, -1, 7, -114, -20, -76, 17, -38, 26, -10, 30, -42, -24, -6, 22, -44, -22, -78, 18, -91, -6, 2, 34, 64, 39, -47, -122, 10, -37, -79, 73, 129, 60, -93, 39, 10, 114, 65, 12, -125, 3, 18, -6, -11, 24, -83, 6, 29, -7, 76, 3, -132, 48, 6, 78, 48, 78, -52, 121, 22, 59, -108, -95, 60, -8, 32, -71, 53, -37, 54, 32, 130, 42, 73, 37, -9, 75, 94, 17, 90, -14, -145, -17, 63, 1, -46, -20, -99, 53, 34, 141, 22, -74, 26, -106, -149, 67, 0, -95, 117, -65, 14, 66, 0, -59, 2, 25, 30, 1, 81, 41, -31, -46, 31, -39, 64, 63, -58, -31, 25, -43, 14, -43, -79, -8, 58, 39, 42, -29, -58, -11, 52, -75, 94, -16, 16, 105, -44, 123, 85, -114, 56, 2, 44, -7, 13, 58, 117, -29, 56, 60, 34, 39, 63, -24, 45, -56, 16, 59, 25, -2, 17, -18, 3, 42, 22, 47, -1, -10, 74, 80, 54, -64, 7, 18, -10, 19, 10, -75, 20, -12, -53, 15, 31, 63, 99, 32, -26, -53, -11, 119, 52, -8, 82, 8, 130, 75, 62, 69, 7, 6, -39, -67, -50, -44, 177, -22, 0]
3440@j9k0J40j13K3n1M9q8L3L9J48p9p3P0p6M4l8K2pl4J07l4r7M4j7j05J15Jm4
3469f0R3k4P9j83M5M0P1Rj56J86q1j6j5J5j05J80j20P3l8M5oO6p8q3J12j04N3
3496bP7j6Qk4j00L0K8N2L1o5O5j08K3P3k6r4o0P3lJ67j45P9j10R8r2lJ4qj6J27
3526G3n2n6l2J51m1l4l7O8L5j07J13o3J5q3rP1n5QJ3Q2L9j26O6L1j31M3J1J33
3554A26j56N9r9l5L3M3m0K00j36L2Nj03J14nL4j47L3%R7m7n8oO7k8R2q5N2j00
3582e8R0j3l3k7R9n5n2k0J27J6q1J13j20o5L4L9l7m4J44K4L2j07l6n8K4J36jo5
3610FP2j23jL7m3K1J13j78J39p3M0l6jM6j40J56j13Q9o5J58j84J4J54p3n0N9k
3637B2j8J26j56l9M5l1O0R8r7mOO5k7l2l6l5J75j06o0J4K0L5J64j77N7j75J46
$$ y = [0, -19, -39, 101, -12, 11, -40, 9, -79, -46, -7, 141, 62, -11, 59, -17, 27, -11, 11, 4, -30, 77, 43, -54, -10, -27, -132, -17, -16, -60, 33, 9, 88, -95, -50, -10, 61, 70, -86, 100, 19, 3, -12, 3, -102, 78, -42, 31, -7, 38, 32, 98, 20, -63, 49, -55, -2, 75, 59, 67, 43, -57, -27, 1, 53, 84, 19, 84, -24, -1, 72, 46, -48, -108, -35, -38, 129, -16, 63, -47, 51, -41, -44, -30, -38, -54, 73, 21, -35, -67, 84, 43, 9, -28, 40, 75, -32, 81, 18, 33, -50, -59, 12, -43, -35, -22, 60, 99, -27, 39, 70, -61, -18, -7, 126, -30, 29, -70, -105, -72, -29, -69, 131, -5, 27, 32, -71, 43, 38, 72, -75, -42, -42, 55, 8, -50, -56, 11, -17, 75, -10, 42, -58, 32, 19, -14, -41, 58, 3, -49, -69, 58, 74, -7, 106, -14, -79, -45, -6, -43, -87, 57, 81, 113, 6, -30, -88, -64, 72, 71, 6, 78, -45, -46, -9, -52, -31, 82, -96, 43, -30, 10, -26, -27, 19, -121, 35, -78, 11, -54, 104, -80, -66, 88, 15, -35, 24, 22, 4, 130, -26, -65, -20, -51, 9, 107, 10, 6, 12, 77, 50, 18, -18, -53, 122, 16, -44, -30, -10, 25, 189, 12, 69, -106, 40]
3664D0r4l1M4l0jJ53M5r2j23J06j7J9M0j91J40nJ6K0m2J1J1j40J36K7lm0j0J9
3692Hm2M2K7o0L4N6j33N8M5nj9q9J25o2N9j01K4NL3j3K1Rr6M2O9j3j6j2R8j02
3722hN0Nj21J18M3l5o6k1k6O4J4r3J34o0q8P4J39j32j0lo2k3P8R3m4m0O5k2L8
3751F1p7J70r8j58P9M5J5m6J04m7q2J35Kj09r5Q6k0K4oj9K8M5k6J0m2L0qO2N2
3780A15j48O1j13R8K8o1L0%k7rl6K1O4l9J19q2l3j2QM1m0J13j61J05m9p2J57j58
3808h0O9RJj7O3l4Km4LO4k0o1O6K8nMo7l0L4O6r2R1M5n3J3j77J09l2o6J13N4o8
3840a2O0l5j6j0r8j7K35j9j39J3M9m2J2N4o9N8j00O0P3j61K4J14k8o5J56j54N1
3867fO4j01Q7r1N1k5J1P6j33J9j7PJ45p9k3l4J06k6l6J03k4j47L9J86j87J17p0
$$ y = [40, -54, -85, -41, -71, -72, 81, 126, 34, -89, 17, 0, 19, 59, -132, 8, 3, 19, 39, -3, 8, 19, -121, 15, 42, 39, -1, -11, 8, -34, 8, 35, -25, 9, 65, -68, -10, 35, 30, 11, -78, 47, -15, 44, -57, -33, -28, 5, -8, 13, 22, -74, -32, 37, 24, 8, -4, 94, -8, 42, 47, -74, 44, 87, 52, -14, -35, -61, 3, 17, -76, 58, -2, -90, -16, 123, -9, -19, -22, -84, -107, -29, 64, 20, -20, 45, 23, 61, -16, 154, 56, -102, -23, 22, 37, -9, 95, 48, -34, 101, 103, -6, -101, -15, -35, -11, -17, -36, -8, 37, 11, 21, -21, 9, 1, 63, 115, -33, 28, -85, 13, 41, -20, 10, 10, -17, -26, -62, -41, 23, -16, 103, 21, -12, -24, -16, 25, -15, 98, -63, 42, -7, -79, 78, -80, -11, -2, -1, -18, 45, 11, 13, -31, -28, 36, 16, -45, 21, 49, 44, 48, -19, -49, -15, 51, -41, 50, 95, 42, 55, -122, -13, -45, -111, 2, 56, -12, 48, 13, -3, -13, -111, -128, 107, 88, -51, -38, 11, -31, -19, 35, -34, 24, -76, -16, 57, -104, -80, 34, 6, -59, 97, -57, -6, 58, -43, 44, -47, 4, -21, -10, 66, -67, -48, -65, -58, 87, 8, -15, -49, 57, 31, -5, 98, 74, -73, -34, 152, -35, 82, 12]
3894A2m4Q3k2J27j40j2m5q8J14j3k5J41j5j15PJ1P7o1Jj0k5K0L7j50K26m1k9j6
3922Ej53J17NQ7j57J33r8M6M9n5P5o0J6N1R1j40j15J03M1QJ7l4n4lO6J66k36O4
3950C5j44Q0qM9j19P9N8J4j1n1r2O6P2j36J40L8j50Q2Q2j5p5J79j92p2J1P7M7
3977D4r8J01J6p8N8m8m5J71j63R2L4p5j9J16j14n0j14K28o9j08J30r7P1K3L4l1
4003IJ5l6q5N0J84j71J08j56J26J7m9k5m0J5PR5r7k7J4p4M5M4J57r9j4J10j00
4030B3nj67J89o9J9k6K7m8jJ1K8L7J7on1j0j6O3n6O0P2p0m5J55j07p4J09J7j00
4059b4L3m1P7j58J65l5n2O3n1K0k7n0mL7O1j17N0O5m0P3n1p%M0j6o5J33m7q0J7
4089c1J06l6K1j46Q5k9orJ39q2QJ45k24L0K2K3O9q7L7q1P4j02L4J0J05j52P3M1
$$ y = [12, -32, 51, 29, 156, 16, 4, -41, -129, -15, -28, -53, 88, 73, -42, -35, -24, 53, -8, -7, -17, -42, -22, 15, -135, 91, 50, 21, 5, -148, -31, -26, 61, -96, 37, -61, -15, 34, -21, 54, -6, 10, 61, 152, 12, -103, 0, 41, 49, 66, 32, -22, -25, 41, 207, -29, 35, -109, -29, -37, 12, -107, -28, 30, 44, 33, -18, -110, -44, 28, -108, 32, 70, -80, 2, 84, 69, -6, 173, -19, -91, -80, -3, 44, -54, 47, 63, -15, 43, -5, -50, 121, -42, 50, 84, 9, -10, 106, -8, -58, -172, 56, -13, -121, 9, -88, -17, 6, 40, 9, 24, -12, -97, -47, 137, -34, 74, -82, 44, 61, 12, -13, -53, -38, -31, 64, -33, -60, -46, -120, -75, -31, 126, 27, 13, 123, 23, 18, -149, 40, -29, -10, -36, -9, -57, -58, -47, -19, 18, 35, 29, -22, -32, -48, 15, -41, 19, 91, 21, -24, 131, 24, -50, 59, 76, -24, 9, -32, 45, -113, 52, 17, -35, 28, -23, -3, -30, -80, -84, -47, 14, -103, -53, 12, -28, 45, -6, -13, -13, 27, 11, -54, 79, 32, -48, -31, 75, 39, 60, -86, -1, -30, -36, -45, 94, 12, 20, 165, -59, -29, -7, 16, 85, -2, 35, -46, 28, -74, -40, -30, 75, -77, -4, 37]
4117C7K6j04L0m0o7J89q2k7jj3lQ0r1lN6m4nK1M5M2j23J12P5n6q0PN1r2Q7j44
4147a17K22j52J03p0j0p2J69j16O4%p2N6nl8J4l2J6O8j10J39j50M1Q8M9j67lL7
4174d8N1j14J70K7k9o8p1M7O6K5m7n4J5O0j32J37L0j05J14k17K82j51P3N2j15
4199bR3j29M8j69J65n6J08K3j11m7J6O0j91J68j5O3N3r0j09J29J6L5Oj3ko7J06
4226H8j35j9j6K2N5N9k0j31k3P8P3o6J15j65R5j61L58j26o5O0j8k5J9j27J43j13
4252d5MQ8j39J74m3j03K1K2M8m5J22l9j9pr8M9pJ8lJ8j7J3p8PRM4P2p3nM9k5r2
4284h0K4L2j0R0j16R6j4Ml7L4QJ03m7j59J7N8K7K2p0N7q1O5Q4j41rN9j0JL9j10
4314f4pQ3m8n4R2j5P7j1j20J22l2m7M8k8j23N9N3rJ00l3Rr6K5kO1p8k6M2O4oj1
$$ y = [37, 63, -41, -11, -51, -118, 71, -11, -38, -39, -52, -55, 25, -66, -69, -13, -57, -62, -41, 4, 46, -77, 35, 110, 54, -26, -19, 32, -60, 27, -117, 105, -47, 56, -14, -24, -96, 73, -43, 21, 21, -51, 5, 0, -38, -24, -56, -40, 28, -82, 57, -93, -52, 36, 85, -82, -85, -48, 3, -111, 59, 86, 57, -11, -82, -35, 31, 56, 9, -45, -30, 30, -102, 35, 65, -40, 74, -143, 139, -12, 61, 113, -2, 91, -38, 10, -159, 6, -50, 58, 81, -30, -77, -61, -1, -192, -24, -39, 24, 77, -13, -122, 7, 23, 58, 64, 51, 49, -18, 88, -47, -66, -82, -60, -5, 54, 34, -97, -120, -42, 31, -35, 80, -85, 10, -151, 207, 81, 16, 76, 58, 33, 52, -75, 68, -45, -41, 47, -92, 82, 39, -64, -43, -21, 27, -18, 104, 65, 46, 39, -59, -10, -17, 1, -2, 16, -1, 12, -66, -59, -50, -6, 66, -7, -12, 37, 12, -80, -56, -24, -34, 56, -60, 36, 22, 26, -11, 23, 31, 134, 87, -72, -55, 3, 30, 52, -18, 39, -42, 23, 107, -34, -43, 16, 6, 7, 46, -64, -71, 12, -36, -90, 2, -13, 64, 53, -67, 55, 23, -24, 24, -4, -127, -68, -15, -24, 76, 43, 52, -44, -19, -21, 40, -38, -64, -22, 42, 36, 25]
4345B5n5J51j33O3j15J60m8n2Mm0J52j60R3j45J30Mn2Q3r0M0M2m9Q7l9r0lK2Q4
4373F9o7K7r5J12ro0l4Q8m7J11j19M6l0j37R8P5j31O4Q0q8M5pr3K4J36o7mJ20
4401A07r5o4J19j25J43q7nL3N0j12J26j1j43Q1J2n7J04q3k2j1K8J7j02P5K1mJ2
4428GJ1J2q5O5M7q4N9M9%j39Q0p5k4J53j46J33Jmp6p1J71j33N6k1q5P3l5J48n8
4457B9J9j10K4%Q1J10j44mn8R1Q7k22K0K2J19q5kN9o6J1M4m8J4q9J04l6J8M0m2
4486a4Om1P7R7q4o9N7m3m7jP1J01j30NK8K2o0m9P7J2j5R5j00N3j7p6O1L9k1K0
4516E4p1R9k0j31L4O4Jp5J02j14O0N2j26o2R9J18j10j0M5l6O9r4L9l5l6L6O4m
4544A2LNOp7k3J20o7R3p0L9r2O7P9j41k1N6L5K0RNq4n8K2mL9kL6o5N7N4k6k3M
$$ y = [25, -30, 121, -12, 51, -64, 96, 48, -4, 0, -40, 112, -48, 45, -100, 30, 34, -18, 65, -25, 15, 57, 8, 95, 56, -34, -37, -15, 69, 2, 29, -66, 46, 37, -23, -57, 31, -16, 95, -24, 22, -8, -145, -47, 28, -103, -39, 41, -47, -2, -9, -102, -78, 58, -9, -13, 107, 12, -52, 67, -58, 85, -2, -7, 26, 76, -36, 90, 79, -64, 17, 29, -28, 76, -7, -29, -40, -12, 5, -97, -22, -1, -5, 7, 18, 30, -55, 10, 57, -27, 32, 81, 81, -58, 22, -53, -77, 76, -70, 63, 64, 60, -16, -87, 84, -49, 7, -14, -99, -26, -61, 87, 29, 48, -62, -38, -38, 43, 153, 9, 5, -53, 38, 125, -97, -77, -55, 64, -21, -23, 36, -30, -19, 25, -23, -9, -98, 6, -30, -12, 28, -14, -8, -49, 28, 125, 41, -28, 29, -14, -61, -62, 9, 110, -20, -15, 13, 35, -25, -74, 3, 15, 0, 95, -5, 48, 31, -45, 16, 55, 34, 54, -17, 82, 62, -69, -35, 29, 30, -45, 57, -57, 3, 55, -71, -133, -34, 84, -26, -36, 9, -27, 42, -52, -13, -48, -84, -48, 16, 12, 15, 20, 26, -51, -74, 46, -21, 72, 2, 41, -51, 16, 95, -46, -67, -11, 24, 44, 53, 58, -26, -84, -62, -66, -27, -29, 7, -58, -1, 53, 27, 4, 8]
4577Ho8R7M9N6q8o2J30k08j5N9mnK1j2J6K3K2pj73J63jJ22q2jn3j2R9j01n5R3
4607A1p7m2J80Lj62K21r4m0q9M7j7P5q8N5J1J7p3j10K45j17M4N4K0Jj35J5Q0q7
4635e2K9j0Q5jQ8j18p8P1n0R8M6l2j13Q6o5m2R5m9m9O3m7Q7q3Q0p8J05k3l7j1
4664eP7n2m8L8j4j5n6R3J42l38J57Q8j09J06q0M5j31J74l7k4J1p3L7R1m7R8j60
4691c2M8K0o4J3N2k8n6P7j8J38j27L6m0n6L8k8p0N4L8K7l4n1J22q3L8m8l0J25
4719F1q5L6k3m7Jk8Q7M6n4L7J6L1o1N7p7q3Q0N1n9R3M2j56J62j94M3o6J02m6J51
4748A17j3j02n1j9N4KL4j31O7L8n2J37j48P2M0n8P1j17O0K1Q6r9J3N6k27J33L3
4775A7M0K3M3kq0r0J52r8j05K11j78Q6K4j16N2r8J96j01k9j9M6P6k5n3Kl2J18
$$ y = [8, -60, 37, 86, 142, 54, -8, 122, -86, -101, -42, -46, -51, -30, -42, -26, -3, 19, 12, -161, 2, 1, 123, 41, 40, -13, -25, 74, -27, -82, 11, -66, -108, 72, 75, -87, 134, 40, 0, -89, -42, -59, 16, -72, -17, -6, 11, -62, -172, 73, -44, 0, 54, 74, 75, -60, -45, 35, -52, -23, -33, 52, 51, 139, 21, -57, 14, -36, 62, 108, 76, -37, 49, -16, -58, 37, -12, -61, 2, -45, 42, -41, 39, -39, 66, 43, 6, -5, 72, 20, -28, 10, -4, -19, -75, 18, 160, -178, -21, 67, -42, 64, -16, 29, -102, 72, 35, 11, 22, -51, -14, 77, 30, 128, -32, 16, 36, -28, -15, 37, 9, -47, 30, 12, 150, 23, 59, 19, -37, 1, -27, -97, -43, -5, 22, -12, -63, 59, -24, 14, -34, -64, 61, -24, 12, -11, -58, -57, -85, 2, 48, -6, 31, 47, 78, 17, 74, -3, -86, -6, 45, -14, 79, 121, -35, 127, -67, -24, -90, 12, -34, 117, 104, 2, -49, -68, -14, -12, 22, -109, -42, -4, -56, 81, -67, 5, 45, -13, 58, -59, 1, 22, 108, 9, 22, 78, -149, -16, 17, 57, 80, 123, 121, 41, -49, 103, 5, -100, 111, -67, 19, 43, -73, -21, -119, 77, -24, -53, -72, -26, 50, 25, -28, -26, -58, 60]
4802F0Np5m2J68o6j42O7kQ4J5l6k8M3m7J60l10J84o8l9k9J31m9L3n4m3K16j55
4829a9N5p4L8M0L4j11R8L3j13P3N9m8k9o8j8n4K0J70l4N9j63M6O1j7n3P9K6j09
4857a9j07R0P4q4N3L0m0j09J49n4J2Q8j02J12q4q4M0%P5N8j10j7J5M3K9j23LJ30
4885F8k2j0j6O1j7n9O8j68PJ64r9Kk1R7o3m0m9J0P0N8l5kR5n5l6p0J2l6N9j4J27
4916H6j63J26m6j20M2J66l6n5J2q8q6P8P2O5r6k8R0o8n9P6K4l6JR0q4p3P6j4K8
4945b0O8k7m4J08J6k01P0o9J41J7l1l4l0L1J0j7l1NPL5j37J46l3j0Q2mo6n0R6
4974B8qO4o8M6n4J7P9n7N1j43j0N5q8J09j9j2n3l2P3P7j5O6j50L2j2J07qj3j77
5003a15J23rP6j25n0J88j60M8J6R5j11Q1j32JR9r8J07r3J47J5j06Q5j65N9L7N4
$$ y = [60, 65, -10, -52, 116, 50, -92, -25, -27, 57, 72, 36, 8, 51, 4, 164, -146, 38, -30, -69, -98, 33, -16, 17, -37, -80, 136, -19, 36, -38, 0, 40, 74, -37, 61, 94, -19, 54, 113, 65, 36, -32, -50, -104, -84, 86, 52, 111, -52, -6, 55, 38, -15, 64, 90, -19, -126, -36, 38, -46, 7, 37, -3, -112, 37, -17, -5, 83, -19, 93, 9, -75, -35, -35, 40, 98, -12, -29, -14, 29, 58, -65, -62, 68, 46, 36, 20, 81, 64, 5, 73, -95, -88, 76, -23, -21, -42, 55, -8, -48, -97, -87, -17, 41, 6, 4, 99, 44, 8, -62, -50, -86, -27, -41, 86, -77, 49, 3, -117, -75, 91, 55, 0, 12, -76, -162, -84, -12, 53, -43, -71, 19, -49, -108, -32, -8, -44, -43, 47, -37, -110, -34, -48, -20, 48, 21, -23, 85, 101, -100, -30, -99, 42, 59, 28, -6, -36, -5, 5, -12, -43, -38, -31, 4, -133, 13, -20, -30, 52, 48, -18, -68, 28, 20, 84, 16, 62, 8, 25, 104, 47, 98, -45, -55, 0, -88, 21, 2, -10, -63, -95, -22, 55, 40, 106, -44, -12, -24, 83, 75, 62, -115, 8, -1, 75, -50, -100, 88, -72, -24, -8, 87, -24, 57, -75, -74, 25, -73, 34, -59, 88, 103, -3, 82, -83, -24, 13, 67]
5029F7j20J16jp6P6j46P5q9J03q2L5L9R3j71R5r2m1N9P3o6K3m5NRR8oo3M8M7j00
5059c7qJ42q6J21r7l1q4N6JK2J7j16O4j6P3r6M4Kl5Q2q1O1lnk9J0l1Q0L0j8nJ3
5091D0j0k3N5m4Ml0q2O1O2j94J17L3J47j61MR9nk2j49J74N3p5o1r7J9J43j42J47
5119F3n3M5o2o7R5rj1j4Q3%k3j04J00j75J39j4q5J35o7n2O6L5JK2o8k2L0M7j04
5148f9J82j06j09K7Q2L5J3nj00K1l3k0K5J55j63J3J6O6n2R3j21K8M6J0Mm4j37
5175a43J79J4r0K0J3p1Q3j62J66j1mO0l6O0j28J20j91J50k2N9p3k2RR8j0p4MP
5203Eo5O1j9J9M5j8k2mo0o3L0j5L4L9mJ55j7j20K7N8j72O4R5m3k1L1Lm9R1k08
5233a43P4O9mM5JNM7j32L4P6j64J08j23K3O7R8j08l7J05J3m8Nk5l4M1L7R%J3n3
$$ y = [67, -53, 63, 62, -14, 62, -84, -9, -98, 5, -77, -42, -3, 90, -81, 14, -78, -119, -60, 13, -53, -30, -75, -70, -61, 37, 31, -32, 16, 63, -37, -45, 97, 11, 132, 35, 4, -80, -24, -23, -1, 16, -100, -36, -52, 21, -75, -31, -29, -64, 18, -63, -2, -5, -10, -39, -29, -60, 20, 50, 32, 27, 40, 30, 7, 62, 18, 22, -8, -90, -29, 33, -161, -44, -11, 136, -25, -21, 78, 73, 51, -98, 76, 129, 54, -7, -104, -85, 58, -84, 63, 10, 55, -7, -74, 21, 12, 1, -13, 70, 70, 47, -57, 43, -132, 7, -7, -92, 43, -24, -76, -10, 25, 26, 48, -20, -42, -12, 35, -69, 113, 7, -102, -75, 7, 42, 55, 50, -50, -29, -62, -82, -57, 98, -65, -52, -36, 30, -22, 71, -50, -22, 24, 34, 38, -6, -143, 36, 50, -40, -20, -7, -78, 5, -157, 9, -2, -6, 54, 18, 78, -50, 70, -121, 29, 7, 66, -7, -29, -20, 78, 68, -6, -2, 5, -60, 1, -18, 1, 46, 28, 6, 2, -58, -121, -91, -106, -72, -33, -37, 118, 101, -19, 8, 66, -106, -42, 53, 10, -11, 20, 23, -26, 65, -143, -69, 0, -4, 41, 42, 47, 94, -38, -4, 72, -92, 16, -107, -84, -17, 81, -27, -64, 41, 54, 6, 11, -14, -48, -7, 30, 39, 39, 52, -1]
5263ao8M2Q9J7m3L0p6m4nj5O1k6J23j77J07J9J0K2q7j0L0J6q0J19o2p8J52q1j25
5292a41J64J45k24lJ8J4R7k7j11k1J00R0q2m5K1m2%M7K4J37j60P3r7l9NO3j64
5319a58O4J27l5J5m8k1j3N3K4oP3j23Oj2N6l7L4mm8J16J5r2j9lJj3Q0l6o9J17
5349D4p0JO3j8J9oo2N3m0p0J98k6j44J7O1r0O8k2j6mR5m3o5J07q0j36M2J40j13
5378i7O5Q6k7J4p4M8N0j4r9M0l3L9j1J79j45j10J15ml6q5J53n2N2k1J01k12J48
5405G0Rj44O9J6n3J32j19R6l1q9J15j22O8j08J17k6MN8k7p3P1j15Q1M2j9k4RJ45
5433A52j00k2q2R4Lj5J2o8j0O9Nk8J5M1N6j48L9O2r8m2J47j52N8k1J3L2m0Mo2
5462h6KK3Q4q6N7K6rR0j12nMJ4k1J3L2o6RN1J4r3O3r4q1J12P4j49O2MR4L6o2k3
$$ y = [-1, -69, -27, 62, 79, 36, 66, -10, -54, -59, -74, -13, -39, 84, -93, 14, 33, 43, 65, -22, -32, -2, 14, -66, 53, -9, -87, 65, -16, -141, 23, 168, -56, -59, -41, -27, 70, 43, -68, -89, 11, 101, 19, -26, -5, -47, -47, 0, 24, 161, 1, 74, -23, -62, -57, 6, -158, -94, 33, -2, 13, -35, -56, -69, -16, 8, 2, 75, -48, -42, -54, 2, -35, -1, -5, -53, 63, 78, -14, -33, -36, -35, -48, 32, -4, -73, 44, -26, -25, 38, 20, 39, 33, -29, 24, -16, -86, 112, 86, -58, -41, 20, -70, -2, -24, -40, -44, 51, 8, -57, 50, -30, -166, -124, 16, -97, -32, 54, 27, 41, -33, 15, 65, 51, -48, -8, -41, -2, -13, 166, 21, -89, 26, 22, -14, -99, 54, 2, 54, 33, 134, -78, 70, 79, -65, 4, 20, -33, 99, -20, 76, 45, -44, 71, -51, 17, -91, 26, 0, 4, 62, 35, -38, 33, -82, -1, 41, 22, -2, 7, 152, 52, 30, -52, 42, 45, 30, 42, -26, -36, 33, 38, 10, 25, 66, 122, -26, 13, 75, -23, -65, 82, -70, -12, -33, -20, 12, -28, -24, -86, -84, -61, 23, -63, -6, 20, 11, 101, -11, -16, -12, 2, -19, -6, 26, -40, -31, 20, 34, -59, 4, -90, -171, -59, 15, -134, -72, -68, 26, 62, 0, -23]
5494b3Q3j6j11J04j2j26J59P2j64P1q5mj02K01p0K9j0N1J1r1J47k83J53N4q1J48
5520A05j04l2J10q2N4j0j46J89Np6r8J26N1k0o2J5Mo8J52r2O7j51J06o6j1K2P1
5547E9p3K7n7J20m4q2J3J12r6m8J30j25J49o6m8J05n4o5l5M1L3j1J02q4Km5K2
5574a8J62j10r2M3j3J7j1Q0j65pJ33oLJ1J1k8N0n8l6J20j18P9j1o7k1M4j6Q0j08
5603e2J00o1J02l6q2O8j49J20J05j33K8L5k8L2j10pJ22M3j16O5m7J15n0r5J08
5628G7L4j98n8P4R8j02P3k1k3j58J91Q7r5M0J8q5M7K9j58K17p2J7l4K9m1k3N1
5655A4j25R0J8o0L0JN5p9J5O3l4L9p2J7J67j66J2n8Q4k1J2L3Kp3J7J7o4N1Q7j11
5685c9J28r1O9p1n4M7j9j5P0l3q8J10L2j65J10n0J5N4k4P1j7o9K2KQ0k34K73n5
$$ y = [-23, 60, 44, -67, 37, 25, -101, 58, 130, -34, 37, -48, -52, -154, 47, -23, 6, -4, 47, 58, -33, 114, -169, -16, 38, -43, 105, 1, -31, 79, -3, 51, 41, -105, 84, 89, 13, -85, 41, 92, 72, 10, 25, 29, -39, 113, 21, 88, -63, 43, -23, -34, -12, 59, -14, 13, -44, 76, 32, -50, -37, 75, -21, -69, 61, -64, 85, 19, -29, 76, 22, -43, -78, -37, -4, -15, 87, 3, 5, -40, -18, 144, 34, -58, -15, -28, -11, -22, 58, -107, -114, 19, 13, 16, 27, 38, 10, 60, 2, -34, 86, -32, 47, 36, -31, -52, -8, -24, 56, -52, 48, -13, 89, 53, -29, 39, -110, 10, 115, -18, 10, 45, 17, 49, -61, -68, 54, 97, -19, 46, -1, 114, 64, -31, 77, 111, -87, -145, -71, 27, -75, -2, -23, -46, -204, -13, 74, -21, 19, 37, -48, -1, 28, -130, 87, 15, 32, -2, 27, -14, -37, 14, -111, -21, -3, -63, -33, -32, 23, -56, -41, 22, -12, 27, -45, -28, 139, -27, -15, -73, 11, -10, 2, 35, 37, -36, -19, -2, -66, -15, 72, -39, 89, -2, 67, -4, -58, -11, -30, -45, 25, -8, -96, 14, 46, -119, -9, -59, -44, 10, -14, 57, 40, -29, -7, -5, 75, -159, 114, 59]
5713E9o1l6J35k42P7J08m4P5q0r3J24M0j03J16j44M6J14j8j52K0n1P2j08L5J96
5738H5l8q3qN4o4j8n1P4lN6L1o0k4L2L8j4l4PN5p6L0j7o2Q9o7J4K1L0q2j5J18
5769A8m1Mn3l1J39N9j34O1n8K9J0m1P2j10K06q5j13N4O3k8J1nn9Q1j12J83j41
5796b1k5PP4m8j2K3k1mL7Q2j33Q6m6Nj9J58j27M2j7r6K5j08L6J82j19R3q3j57
5824a86K61p6Poj7j38J65m2NO6J42j89k5N8%p8n3J89j55J82l3m6j49J61q6J71
5850A28j19M7j2r5q7Q7N8n8Q8l1O1j89J44J5L1q3P9qj13P3L9r0j0K5j43J39PM9
5878C2l9K8Ql3J24j6o3o5Q0p2Q6j1o7k4L1p4Q9j20J33M3o0p9J49op0N2j3j9r5
5907g1P5p4L3J31r0L4k2j7pr2J18m7O0m8J5qO2j71P2P1l3nL0o1M2O7j43J13m5
$$ y = [59, -2, -38, 97, -145, -68, 40, -4, 71, -9, -102, 22, 62, -41, 75, -69, -23, 91, 73, -79, -59, -110, -38, -146, -111, 85, 47, -36, -44, 10, -54, -72, -123, -49, -52, 4, 35, -25, -49, -17, 21, 7, -27, -20, 35, -41, -11, -28, -90, -1, -68, -54, -33, -3, -85, -100, 18, -23, -19, -72, -103, 36, 95, -39, 22, -36, -7, 3, -38, 34, -76, 130, 45, -68, -14, 49, 21, 32, 27, -32, 49, -63, 120, -21, -46, -39, 35, -13, -25, -2, -23, -27, 10, 92, -41, 45, -1, 4, -15, 143, 16, 58, 41, -55, -30, -138, -102, 80, -39, 54, -29, -186, 75, -1, 6, 0, -17, -155, 10, -32, -27, 39, 181, -8, -33, 25, 25, -53, -106, 83, -72, 110, 77, 31, -118, 43, -43, 128, 9, 56, 44, -51, -138, -51, 7, -51, 37, 6, 67, -122, 22, 37, 68, -15, 64, 56, -57, 16, 55, -35, -45, -20, -163, -24, -17, 32, -7, 21, 29, -4, 120, 104, 41, -24, 56, -16, 70, 59, -8, -32, -1, -75, 14, -106, 27, 70, 10, -69, 80, 74, 4, 56, 43, 24, -71, 4, -70, -37, 94, 4, 38, 16, -1, -8, -100, 18, -29, 31, -17, -2, -10, 52, -119, -47, 24, -9, -14, 16, -45, -3, 64, -79, 34, -11]
5936a1L8K6j46M1O8l0jj2L5j23Q7L1jM7N1j03J13j63P3N6m6j22J43L7L3mj12M6
5964E1j40P9J20q4l4jpL1l6L0n9O4l8K2p6O8mL9p4LrQ5M3j52J06m8K6p9R0K1o1
5995b4J95j12rlq1J86j21N3r8j1J2K9K1l2k5j03J41k7l3J8N9m8LP8j28j8J73j28
6023c3l5Q9M7n3m5R5K1j18q8P0QK4N8J9j18LJ02n1J1K1j15M4J40j65k1J28p4k2
6051e8kK5N1J3j07j4M2rO3Q4N1j40OM1J35j51mK7N2k5n8O9j36J04O8J5q1j71K12
6080A02L4j24m2N5L%n6Q3j30p2J93q4jO6j03P3J10r0m2J00J7j4m4o8J2N5jk6M3
6109D9j58J46Q6q4P1j72O0J4K5L2m8L7L4r4q0pJ18L4k8j2p1O8O7n4O0Rj00J2l0
6138a6P7j10M3J8K3p2J01r2J20q2O8n6N6n6l8M3q7mO3J14j60oP1k3n3P6lOL0n
$$ y = [-11, 27, 53, -93, -52, 16, -14, -15, -27, 8, -115, -28, 3, 2, 49, 100, -3, 110, -53, 20, 76, 30, -92, 51, 88, 121, 117, 5, 51, -89, -10, 110, 26, -8, -9, -16, 15, -21, 9, -50, 14, -24, -2, -78, -10, -14, 25, -49, -46, -55, 30, 73, -79, 27, -21, 5, -74, 16, 37, -24, 171, 59, 50, 47, -34, 152, 31, 84, -14, -25, -13, 16, 37, 5, -20, -123, 18, -9, -42, -24, 35, -13, -10, 68, -60, -78, 95, -33, -68, 21, 68, 15, -30, 65, 86, -32, -120, -50, -42, -18, 40, 59, -59, -56, 46, -5, 6, 27, -88, -44, 96, -69, -90, 38, -36, -58, -60, -35, 16, 29, -78, -92, -50, -59, 4, 88, 139, -1, 5, 46, 181, 30, 26, 53, 105, 80, 22, 91, -45, 59, 127, 142, 61, -110, 102, 136, 12, -30, 25, 28, 28, -28, 55, -75, -147, 46, -38, -39, 27, -76, -3, 107, 17, -25, 75, 92, 78, 34, -34, -22, 33, 32, 6, 49, -109, 37, 123, 39, 110, -62, -2, 12, 37, 69, 21, 58, 92, -2, -82, -89, 29, 63, 35, 23, -48, 20, 87, 33, 93, 102, 2, 14, -16, 61, -49, -6, 12, 35, -37, 64, -28, 92, 10, 78, 22, 78, 22, -16, 27, -60, -64, -1, 113, -47, -53, 18, -5, -58, 18, 15, 21, 51, 46]
6168D6n1m0M6Q9j55K43j71lj2O3n8p7J76q1ll5O6J6n2n1K20l06J13L3N2j27K53
6195A94k00K5R0j03o7J60k6j41J12N7r3m6N5P1j44PP8M8j24NN0l2P7p7P7k4l3
6222dnM1q5r5J82m8J03m4J4l2m6P6o4j0J9k8n3N6l3o3J84l9p6L5J44j5j85O2L1
6251B2k8L7o2N7j08K1N5j8Q4j16L6mJ38j17M0r3Q8l3J2J8j42J93j19K7KNM9o6
6279b2p4J82n4k4M7l6L2Np0KJ0J02j15o9L5o2R9kl8M1N0o5J18r4K1n4N2N9J9r7
6309bM3o9K8r4Q5O0l2L0r4P0R8r0p4P6L5q3o4L8M4O3k8j8lj15J67l3j36J05O6
6338G3k2j55J14N0n0p7M5r1J47j4m8J7JN1j5qkM2kn7j5QJ3LNQ9j27J7Q0j14N1
6369IJ27k13K4J06q1P8k8Nm2NJ76k30O7J3L7o0j22K22m7m1K7j0r6k5N6R3q0o1
$$ y = [46, -5, -45, 1, 90, -65, 178, 7, 4, -8, 55, -3, -80, 96, 15, 12, -23, 43, 59, 7, -44, 176, -130, -17, 16, 68, -59, 194, -6, 19, 109, 6, -61, 99, 73, -68, 44, 101, 8, -38, 17, 88, -56, -49, 29, 77, -47, -42, 8, -24, 53, -24, 53, 29, -4, -9, 32, -53, -148, 34, -14, 89, 45, 59, 27, -19, 57, -7, -17, 2, -26, -79, -23, -56, -119, 65, 26, -50, -15, 129, 114, -71, -9, 22, -6, 31, -31, 26, -82, -61, -6, -24, 60, -56, -20, -24, 114, -3, 37, -56, 32, -1, 11, 29, -113, 80, -39, -12, -10, -5, 44, -22, -96, 86, 32, 8, 55, 19, 51, 56, -14, -12, -2, 100, -15, -84, -49, -111, -12, -14, -52, -11, 39, -26, 92, -2, 19, -35, 17, 76, 95, -2, 41, -28, 0, -94, -9, 51, 19, 49, -45, 25, 123, 33, -41, 35, 70, -13, -77, -39, 5, 68, 40, 22, 19, -96, 71, 38, -98, 7, 73, 51, -104, 10, 60, 10, -67, -22, -113, 34, 20, -28, -11, -10, 41, 26, 18, 16, 58, 56, -1, -16, -8, 5, 8, 13, 102, -25, -8, 72, -42, 9, 136, -77, -53, 53, -28, 50, 22, 27, -15, -10, 166, -64, 3, 16, 53, -7, -129, 93, 46, 5, 32, 22, -74, -99, -43, 50, -30, -91]
6397i1J00j7J04o9q7J9M7l2lj1N1l3J3o4J05p8J5p0J1J64r5M4O0j31P4n5O9j8
6425B2P5k1j30R8j48rJ12jl1R2o4K7N0j02J15p4k6n1J39M9j03m5j32J14O5Rj60
6452a30J17j39QJ57k9n9J6J30j21l2R5nk4j35O7J1O4J28j44O1M5j35J10j01OP9
6478D0P8K9o7K0L0m4j10J1J8r5P2J4k2NN6j00J6J6L5kQ7j12LL2m2P4o6J01k8j14
6508f5P4l0J13j51m0J07nk6%M0n9n3J2J38Rj07nJ20j8l5N6KJ3l5J0r4J38l2p9
6537bL6j20J04O6j36N6oN8nj05M4l1L0o0K23k15J70j50L9Q3q0Lk1K9l4N6rj4r5
6566h6O5rQ4Qj24J42n9J06j66P9M8j08M9n5N5j8m2L6K4Qj1J2j09N2j6l4L1L8M0
6595D0j80K29p9m3L5k1PR0r2Ml2J37q0J5o3j1L4k5N3j4R7j92N8k5O3m4kO5l1K
$$ y = [-91, 9, -8, 96, 27, -60, -41, 6, -26, -29, -40, 11, -22, -9, -73, 32, -46, -31, -101, -90, 74, -21, 23, 83, -48, 26, -29, 40, 22, 97, 76, -54, 44, -104, -113, -1, -2, -33, 59, -5, 22, 72, -30, 85, 11, -15, -66, 73, 122, 19, -26, -158, -44, 21, 30, -130, -13, -152, -144, 13, -16, -75, -59, 71, -50, -82, 13, 8, -16, -151, -84, -73, -9, 119, -25, 36, 81, -54, 56, -45, -39, 40, 118, 147, 80, 100, 130, 86, -24, -13, 5, -90, -18, -4, -26, -21, 35, -65, -49, -33, 2, 0, 87, -25, -22, 10, -32, 42, -24, 77, 49, -65, 9, -21, 92, -59, -99, 8, 3, -23, -23, 17, -42, -95, -83, 55, 64, -43, -48, 72, 54, 19, 75, 77, 90, 55, 65, -29, 109, 77, -2, 34, -86, 18, 84, -52, 4, -2, 56, 51, -54, -10, -41, -11, -71, 152, -63, 107, -43, -4, 79, -1, 2, -19, 10, -24, 32, 23, 9, -86, -21, -30, 54, 62, -62, 80, 21, 127, -39, 40, 88, -20, 29, -26, 29, 11, -31, 5, 29, 37, 26, 38, -71, -19, -35, -69, -38, 0, 40, -140, 89, 10, -33, 2, -19, -12, 78, -14, -10, -42, 95, 15, 30, -33, -44, -10, -35, 18, 4, 101, -91, -33, -58, 5, -39, -41, 24, -7, -5]
6625eLJ43p3l2n0j0p3J18pJ40j55l4K2j7K3Jj26R3k9R9j44K14j43N5n2K5N2j18
6653h0J01LNo6P2lK5k9j07QK3j5M9m2O6q0J56j39K4J37j78l9J14J3m3L5j18J14
6681Fl4O3q3J02l0J1j65O5J36n5j4L7l8J3N2qm6M1j29J24j1j18J18p2J4L6r0k8
6709a03J76k7O8o4N6j24K6P2k6q6k0J09l1k0l1N9k8n2J4L5Q0o9Q4q8l5J07m0R
6737E1r1N9k7L9L9K0Kr3r5P9Jm4Q2l1l6M2k2Q2p8o3J21K3q5K0qK1kM2r5j19K21
6768E5N1r6j9m2Q2L3q2P9j03J26r1lL4l9L5L6k1r7m6J26k4Q8j33J36o2J0n0j00
6796a17J91j18MQ9l9q9J09P3j51J03m2o1P9O6k24P5nk3J5n9J44J1j22M5m3K15
6822A26j56M1m4R0JRj46K8O9NN3j19L9K8Jl1K0M8j2n7J85j87r2J5K13j81m6P8
$$ y = [-5, -2, 141, 68, 36, -14, -24, -97, 21, 14, 154, -1, -35, -13, -30, -7, -6, -132, -39, -68, 31, -113, 101, -42, 13, -39, -14, 38, -80, 21, 24, 29, -37, 35, 32, 57, 28, -79, -71, -48, -63, -14, -56, 10, -70, 86, -53, -29, 108, -70, -109, 5, 18, -25, 10, -108, 6, -28, 35, -48, 54, 24, 35, -130, -65, 71, 16, 2, 39, 1, 14, 66, 58, 12, 53, -76, 48, 37, -81, 37, -35, -21, 15, -75, -103, 73, 46, 114, 50, 106, -18, 8, 80, 54, -32, -52, 57, 26, 6, -25, 34, 6, -46, -32, 3, 83, 14, 98, 10, -25, 82, 42, 51, -40, 19, -8, 31, 70, 90, 92, -1, -96, -17, -16, -60, 22, -9, -45, -3, -25, 57, -21, -84, 37, 60, -25, -5, -13, 8, 6, 48, -47, -166, 55, 106, 10, -9, -51, 31, 64, -18, 61, -42, 84, -7, -10, 24, -15, 20, 56, 35, -62, -108, 18, -6, 82, -51, 85, 23, 33, -17, -117, 74, -44, -40, 49, 10, -79, 30, 103, -48, 55, 13, -48, 31, 97, -127, -52, -57, -80, -65, -124, 20, 31, -91, -46, -89, 126, -30, 11, -33, 57, 58, 67, -79, -51, 18, 23, 76, -43, -4, 24, 25, -6, 14, 62, 50, -7, 178, -9, -101, -86, 127, -54, -100, -22]
6850b2kL8m0J7m3l8K7j0J15mo5R2o9L1P3j64L3K9L1l1L0k8j04Q5M3n5M6R5n3J6
6880G3r5M4m9n4M7j3K5n1P0J4J31j28jj16K4J68j56J25l2o3J1J3l1L0oQ7p6k7
$$ y = [-22, -24, 14, -26, -9, -52, -90, -63, -73, 42, 38, -27, 65, -4, 27, 100, -64, -31, -2, 29, -2, 28, 0, -104, -19, 24, -31, 15, 110, 57, 73, -22, 22, -27, -81, -34, -47, -22, -73, -3, 11, 142, 14, 13, -103, -79, 89, -67, 58, 26, -37, -26, -13, -44, -14, -20, 67, -9, -36]
$$ [...]
8191E8
##END NTUPLES=NMR FID
##END=
