##TITLE=1H_DE-80H_X3
 200.13MHz, d2o
 8 sc
 
 19ns.26.2.2025
##JCAMPDX= 6.0         $$ Bruker NMR JCAMP-DX V2.0
##DATA TYPE= NMR FID
##DATA CLASS= NTUPLES
##ORIGIN= UXNMR, Bruker Analytische Messtechnik GmbH
##OWNER= pz
$$ XWIN-NMR		Version 3.5
$$ Tue Jul 28 11:02:46 2026 Russian Standard Time (UT+4h)  Yarkov@DPX200
##.OBSERVE FREQUENCY= 200.1313
##.OBSERVE NUCLEUS= ^1H
##.DELAY= (6, 6)
##.ACQUISITION MODE= SIMULTANEOUS
##.ACQUISITION SCHEME= undefined
##.AVERAGES= 8
##.DIGITISER RES= 18
##SPECTROMETER/DATA SYSTEM= spect
##.PULSE SEQUENCE= zg30
##.SOLVENT NAME= DMSO
##.SHIFT REFERENCE= (INTERNAL, DMSO, 0, 14.3821)
##AUDIT TRAIL= $$ (NUMBER, WHEN, WHO, WHERE, WHAT)
$$ ##TITLE= Audit trail, XWIN-NMR		Version 3.5
$$ ##JCAMPDX= 5.01
$$ ##ORIGIN= Bruker BioSpin GmbH
$$ ##OWNER= Yarkov
$$ C:/Bruker/XWIN-NMR/data/yarkov2/nmr/H-C/1/audita.txt
$$ ##AUDIT TRAIL=  $$ (NUMBER, WHEN, WHO, WHERE, WHAT)
(   1,<2026-07-28 11:01:41.31 +0400>,<Yarkov>,<DPX200>,
      <created by zg, POWCHK disabled, PULCHK disabled
       configuration hash MD5:
       00 E9 B6 7A A2 85 ED C7 34 08 36 98 17 FE 4E 26
       data hash MD5: 16K
       7B 1A 1C DA C3 27 04 65 0A 91 C9 04 DB 81 B0 8C>)
$$ ##END=
$$ 
$$ hash MD5
$$ A3 D5 F4 06 05 F7 BE B2 51 79 08 F2 21 CC 3F A9
##$RELAX= 
##$RELAX= 
##$RELAX= 
##$RELAX= 
##$RELAX= 
##$RELAX= 
$$ Bruker specific parameters
$$ --------------------------
##$DU= <C:/Bruker/XWIN-NMR>
##$EXPNO= 1
##$NAME= <H-C>
##$PROCNO= 1
##$TYPE= <nmr>
##$USER= <yarkov2>
##$AMP= (0..31)
100 100 100 100 100 100 100 100 100 100 100 100 100 100 100 100 100 100 
100 100 100 100 100 100 100 100 100 100 100 100 100 100 
##$AQSEQ= 0
##$AQ_mod= 1
##$AUNM= <au_zg>
##$AUTOPOS= <>
##$BF1= 200.13
##$BF2= 200.13
##$BF3= 200.13
##$BF4= 200.13
##$BF5= 200.13
##$BF6= 200.13
##$BF7= 200.13
##$BF8= 200.13
##$BYTORDA= 1
##$CFDGTYP= 0
##$CFRGTYP= 5
##$CHEMSTR= <none>
##$CNST= (0..31)
1 1 145 1 1 1 1 1 1 1 1 1 1 1 1 1 1 1 1 1 1 1 1 1 1 1 1 1 1 1 1 1 
##$CPDPRG= <>
##$CPDPRG1= <>
##$CPDPRG2= <>
##$CPDPRG3= <>
##$CPDPRG4= <mlev>
##$CPDPRG5= <mlev>
##$CPDPRG6= <mlev>
##$CPDPRG7= <mlev>
##$CPDPRG8= <mlev>
##$CPDPRGB= <>
##$CPDPRGT= <>
##$D= (0..31)
0 0.7 0 0 0 0 0 0 0 0 0 0.03 0 0 0 0 0 0 0 0 0 0 0 0 0 0 0 0 0 0 0 0 
##$DATE= 1785222100
##$DBL= (0..7)
120 120 120 120 120 120 120 120 
##$DBP= (0..7)
150 150 150 150 150 150 150 150 
##$DBP07= 0
##$DBPNAM0= <>
##$DBPNAM1= <>
##$DBPNAM2= <>
##$DBPNAM3= <>
##$DBPNAM4= <>
##$DBPNAM5= <>
##$DBPNAM6= <>
##$DBPNAM7= <>
##$DBPOAL= (0..7)
0.5 0.5 0.5 0.5 0.5 0.5 0.5 0.5 
##$DBPOFFS= (0..7)
0 0 0 0 0 0 0 0 
##$DE= 6
##$DECBNUC= <off>
##$DECIM= 32
##$DECNUC= <off>
##$DECSTAT= 4
##$DIGMOD= 1
##$DIGTYP= 9
##$DL= (0..7)
0 120 120 120 120 120 120 120 
##$DP= (0..7)
150 150 150 150 150 150 150 150 
##$DP07= 0
##$DPNAME0= <>
##$DPNAME1= <>
##$DPNAME2= <>
##$DPNAME3= <>
##$DPNAME4= <>
##$DPNAME5= <>
##$DPNAME6= <>
##$DPNAME7= <>
##$DPOAL= (0..7)
0.5 0.5 0.5 0.5 0.5 0.5 0.5 0.5 
##$DPOFFS= (0..7)
0 0 0 0 0 0 0 0 
##$DQDMODE= 0
##$DR= 18
##$DS= 0
$$ [...]
##$SUBNAM2= <"">
##$SUBNAM3= <"">
##$SUBNAM4= <"">
##$SUBNAM5= <"">
##$SUBNAM6= <"">
##$SUBNAM7= <"">
##$SUBNAM8= <"">
##$SUBNAM9= <"">
##$SW= 18.0517328524113
##$SWIBOX= (0..15)
0 0 2 0 0 0 0 0 0 0 0 0 0 0 0 0 
##$SW_h= 3612.71676300578
##$TD= 16384
##$TD0= 1
##$TE= 0
##$TE2= 300
##$TE3= 300
##$TEG= 300
##$TL= (0..7)
0 120 120 120 120 120 120 120 
##$TP= (0..7)
150 150 150 150 150 150 150 150 
##$TP07= 0
##$TPNAME0= <>
##$TPNAME1= <>
##$TPNAME2= <>
##$TPNAME3= <>
##$TPNAME4= <>
##$TPNAME5= <>
##$TPNAME6= <>
##$TPNAME7= <>
##$TPOAL= (0..7)
0.5 0.5 0.5 0.5 0.5 0.5 0.5 0.5 
##$TPOFFS= (0..7)
0 0 0 0 0 0 0 0 
##$TUNHIN= 0
##$TUNHOUT= 0
##$TUNXOUT= 0
##$USERA1= <user>
##$USERA2= <user>
##$USERA3= <user>
##$USERA4= <user>
##$USERA5= <user>
##$V9= 5
##$VALIST= <valist>
##$VCLIST= <CCCCCCCCCCCCCCC>
##$VD= 0
##$VDLIST= <DDDDDDDDDDDDDDD>
##$VPLIST= <PPPPPPPPPPPPPPP>
##$VTLIST= <TTTTTTTTTTTTTTT>
##$WBST= 1024
##$WBSW= 4
##$XGAIN= (0..3)
0 0 0 0 
##$XL= 0
##$YL= 0
##$YMAX_a= 114509
##$YMIN_a= -93580
##$ZGOPTNS= <>
##$ZL1= 120
##$ZL2= 120
##$ZL3= 120
##$ZL4= 120
##$ABSF1= 10
##$ABSF2= 0
##$ABSG= 5
##$ABSL= 3
##$ALPHA= 0
##$AQORDER= 0
##$ASSFAC= 0
##$ASSFACI= 0
##$ASSFACX= 0
##$ASSWID= 0
##$AUNMP= <proc_1d>
##$AZFE= 0.1
##$AZFW= 0.1
##$BCFW= 1
##$BC_mod= 2
##$BYTORDP= 1
##$COROFFS= 0
##$CY= 83.5205535888672
##$DATMOD= 1
##$DC= 2
##$DFILT= <>
##$DTYPP= 0
##$F1P= 10.8118882576601
##$F2P= -7.23987719738617
##$FCOR= 0.5
##$FTSIZE= 0
##$FT_mod= 4
##$GAMMA= 1
##$GB= 0.15
##$INTBC= 1
##$INTSCL= 1
##$ISEN= 128
##$LB= 0.25
##$LEV0= 0
##$LPBIN= 0
##$MAXI= 10000
##$MC2= 0
##$MEAN= 0
##$ME_mod= 0
##$MI= 1.114404
##$NCOEF= 0
##$NC_proc= 0
##$NLEV= 6
##$NOISF1= 3.799351
##$NOISF2= 2.8
##$NSP= 1
##$NTH_PI= 0
##$NZP= 0
##$OFFSET= 14.38212
##$PC= 1
##$PHC0= -7253.183
##$PHC1= 2.82197
##$PH_mod= 1
##$PKNL= yes
##$PPARMOD= 0
##$PSCAL= 0
##$PSIGN= 0
##$REVERSE= no
##$SF= 200.129724274929
##$SI= 16384
##$SIGF1= 3
##$SIGF2= 2
##$SINO= 400
##$SIOLD= 16384
##$SREGLST= <1H.CDCl3>
##$SSB= 0
##$STSI= 0
##$STSR= 0
##$SW_p= 3205.1282051282
##$SYMM= 0
##$S_DEV= 0
##$TDeff= 0
##$TDoff= 0
##$TI= <>
##$TILT= no
##$TM1= 0
##$TM2= 0
##$TOPLEV= 0
##$USERP1= <user>
##$USERP2= <user>
##$USERP3= <user>
##$USERP4= <user>
##$USERP5= <user>
##$WDW= 1
##$XDIM= 8192
##$YMAX_p= 0
##$YMIN_p= 0
$$ End of Bruker specific parameters
$$ ---------------------------------
##NTUPLES= NMR FID
##VAR_NAME=  TIME,          FID/REAL,        FID/IMAG
##SYMBOL=    X,             R,               I
##VAR_TYPE=  INDEPENDENT,   DEPENDENT,       DEPENDENT
##VAR_FORM=  AFFN,          ASDF,            ASDF
##VAR_DIM=   8192,          8192,            8192
##UNITS=     SECONDS,       ARBITRARY UNITS, ARBITRARY UNITS
##FACTOR=    0.0002768,     1,               1
##FIRST=     0,             0,               0
##LAST=      2.2672688,     0,               0
##MIN=       0,             -93580,          0
##MAX=       2.2672688,     114509,          0
$$ Real data points
##PAGE= N=1
##DATA TABLE= (X++(R..R)), XYDATA
$$ [...]
951H59l61j095K99M74r87P64J96j196J550N00j188R71J71j247L53r15l89J218
$$ 859 498 -597 -298 176 -811 -47 149 -1047 503 1003 -185 786 957 -290 63 -852 -1241 -23
969b3k39J28k3l92J537J39o27O40o75m01J72j563N33R30j286P21P15j185J067
$$ -23 -262 -134 -157 -549 988 1127 500 1140 465 64 236 -1327 -794 136 -1150 -429 286 -899 168
988A68J001o32j24n37J27r5q55N74n5m89J641n94p83J845r3j243O00p14m96M53
$$ 168 1169 537 413 -124 3 -92 -947 -373 -428 -917 724 130 -653 1192 1099 -144 456 -258 -754 -301
1008c01k96J83l59J20J483m46l20J493q60m01L83j085l0L26m02O51p51l76J942
$$ -301 -597 -414 -773 -653 830 384 64 1557 697 296 679 -406 -436 -110 -512 139 -612 -988 954
1027I54j37o03Q08q91k67K95r54L96K98p5J37r95P09J629j223K32R24j690j51
$$ 954 817 214 1022 131 -136 159 -795 -399 -101 -176 -39 -1034 -325 1304 81 313 1237 -453 -604
1046f04R02r17M3K17Q7L99p65N45Q92o56N40K54j742M18N70q10M48l00M7P20o42
$$ -604 298 -619 -576 -359 -272 127 -638 -93 799 143 683 937 -805 -387 183 -627 -179 -479 -432 288 -354
1067c54K79Q70p45O55k2j338M67N80p48J92k24L40L67m16P96M8j354J374Qj682
$$ -354 -75 795 50 705 683 -655 -188 392 -356 -164 -388 -48 319 -97 699 747 -607 767 775 -907
1087i07P31K85o82K24m3J98K88N1P09p89q40J577o95j098J232l71p47R88k60l7
$$ -907 -176 109 -573 -349 -392 -194 94 145 854 65 -775 802 107 -991 241 -130 -877 111 -149 -186
1107a86O05J27K31q42l49R26q72M5Q95j232j98J286n26L0M73j11O49r30n68Q13
$$ -186 419 546 777 -65 -414 512 -360 -315 580 -652 -850 436 -90 -60 413 302 951 21 -547 266
1127B66k98q3L75q90M79L97l88O24n32j18R04r60m08J207q17J17N21p63J34M93
$$ 266 -32 -115 260 -630 -151 246 -142 482 -50 -168 736 -224 -632 575 -242 -125 396 -367 -233 260
1147B60j98L11l96J20M07j005M97M17j392P74R19j453J57R25k98K8k64J40K77
$$ 260 62 373 -23 97 504 -501 -4 413 -979 -205 714 -739 -582 343 45 73 -191 -51 226
1166B26m34M50J89j040P76k6o46O34J08m29M06k61k29L93m1M90l82r25Q87Nm75
$$ 226 -208 242 431 -609 167 141 -505 129 237 -192 214 -47 -276 117 76 566 184 -741 146 151 -324
1187c24O48j45k82P57n32k2P8k32Q41o78j027Q07L3l85P95n34j17N43k05J37O4
$$ -324 324 179 -103 654 122 100 178 -54 787 109 -918 -111 -78 -463 332 -202 -319 224 19 156 220
1208B20l54L22k36l66M98m29L48P39j120K03N73k21Lj82l96N48l36l40M77k64
$$ 220 -134 188 -48 -414 84 -345 3 742 -378 -175 398 177 180 -2 -398 150 -186 -526 -49 -313
1228c13K30M78n56K80J99j56N64n64o46P44l46l22P78n46O9M82m38R2L2p5L58
$$ -313 -83 395 -161 119 318 162 726 162 -484 260 -86 -408 370 -176 -107 375 -63 29 61 -14 344
1249C44m74l38L10j53M21M09r07L55O57o16K56J31l20J19m82k13J92k50O23J02
$$ 344 -130 -468 -158 -311 110 519 -388 -33 624 8 264 395 75 194 -288 -501 -309 -559 64 166
1269A66n35M41M5k58O66n02l15M94l93o8M25n00N15L54o50L43j38J5M91q46k69
$$ 166 -369 72 117 -141 525 23 -292 202 -191 -259 166 -334 181 535 -115 228 90 105 596 -250 -519
1290e19M41j62J45Q3k04M82P5m31M14L2j95K99m66k67L01l68N11K7n84N03n3k21
$$ -519 -78 -240 -95 -12 -216 266 341 -90 324 356 161 460 -6 -273 28 -340 171 198 -386 117 64 -157
1312a57L80m10O2M37n60r7K53k55N95O4o24M78m6M0K25m67q0K55l58J43J62l59
$$ -157 223 -187 -125 312 -248 -345 -92 -347 248 312 -312 166 120 160 385 -82 -162 93 -265 -122 40 -319
1334c19N87l31l54N98l19J64N23n51j91L06l55M50n3k84M17k35n6J34l51L98K96
$$ -319 268 -63 -417 181 -138 26 549 -2 -193 113 -242 208 155 -129 288 53 -3 131 -220 178 474
1355D74p07J06N5k68N55k20l63M50m9o3K08l63M36j4m14K36k27m2N73l78l10K73
$$ 474 -233 -127 -72 -340 215 -5 -368 82 33 -30 178 -185 251 237 -177 59 -168 -210 363 -15 -325 -52
1377e2k30L46K95n43K8K79l06K61k26K4L91j83j87R1j47L98K41o32L06j23k50
$$ -52 -282 64 359 -184 -156 123 -183 78 -148 -124 267 84 -103 -12 -159 239 480 -152 154 31 -219
1398b19K52k33j16M41k76P4K43l02K67K29m38J30k87J40N31l99l26M94m88P62
$$ -219 33 -200 -316 125 -151 -77 166 -136 131 360 -78 52 -235 -95 436 37 -289 205 -283 479
1418D79j99j73j57O7K3j03R5l71N29l85O5M4j49M31N8l72L00k24k26N04m65PN66
$$ 479 280 107 -50 17 40 -63 32 -339 190 -195 -130 -86 -235 196 254 -118 182 -42 -268 236 -229 -222 344
1441C44m73m5J19j63M03J89m66J10j34J40O7l24L15J4l06K44K21l76M61k7k99
$$ 344 -129 -174 -55 -218 185 374 -92 18 -116 24 91 -233 82 96 -210 34 255 -121 340 313 14
1462A4P9j88QM48m34M1M6k19L64j48j17K69j05jo5m09M58J41l36j5J60j43M37
$$ 14 93 -95 -87 361 -73 -32 14 -205 159 11 -106 163 58 57 -8 -417 41 182 -154 -169 -9 -152 285
1485B85k09j87K41j52q1J19k19L09n2k63J42r2p1L47M5p6J15l77K49J11k77K13
$$ 285 76 -111 130 -22 -103 16 -203 106 54 -209 -67 -159 -230 117 162 86 201 -176 73 184 -93 120
1507A20l2j32J95k17j44M35k31K4J5m04N19R9m26J08J7k8L00k22K8M4J0j9n9k51
$$ 120 88 -44 151 -66 -210 225 -6 18 33 -371 148 247 -179 -71 -54 -82 218 -4 24 68 78 59 0 -251
1531b51K98N3k44K07k84r1N49j96k66K38M4j8r6m5K84j70O6P0m00J18M97l30j09
$$ -251 47 100 -144 63 -221 -312 237 41 -225 13 57 39 -57 -102 182 12 78 148 -252 -134 363 33 -76
1554g6J47m39L95J49k39J51J3j48m7q8J42J75l7N4k32j14L40p8j70K09m10K07
$$ -76 71 -368 27 176 -63 88 101 -47 -94 -182 -40 135 98 152 -80 -194 146 68 -102 107 -303 -96
1576i6J98k99R0K78j63O7j37K9L8J2K3k0l06K70J67j68J37m3j79K57r8k00J92
$$ -96 102 -197 -107 171 8 75 -62 -33 5 17 40 20 -286 -16 151 -17 120 77 -102 155 57 -143 49
1599D9l4r1o4L4J52L7j61J57j85j76L43N1k36J59j25J63oj81L01nj91J20k20K1
$$ 49 15 -76 -140 -106 46 83 -78 79 -106 -282 61 112 -124 35 -90 73 67 -114 187 182 -9 111 -109 -88
1623h8J65j39J96k1k17J20J35k75K59o2k4J19k34p7J68J39k08Kq6J10O1j23J11
$$ -88 77 -62 134 113 -104 16 151 -124 135 73 49 168 -66 -143 25 164 -44 -42 -128 -18 43 -80 31
1646C1j89q4M13l50n8L86j87R0o8j22J00K6J87n4k49L6J65k42J17J4L9R1K9m00
$$ 31 -158 -242 171 -179 -237 149 -38 52 -16 -138 -38 -12 175 121 -128 -92 73 -169 -52 -38 1 92 121 -279
1670b79K94M1j06J20j83j8J56J7l0J62k59O9k6m8J54q7k1Q0j10rJ29j31J28M7
$$ -279 15 56 -50 70 -113 -131 25 42 12 174 -85 -16 -42 -90 64 -23 -44 36 -74 -83 46 -85 43 90
1694I0j99J75km7R1k12R0N7j78J39P1q8P2j19o6R5J57j31P2J02k95K10k05K34
$$ 90 -109 66 64 17 108 -104 -14 43 -135 4 75 -13 59 -60 -126 -31 126 -5 67 169 -126 84 -121 113
1718A13qk02N4Q1j60J20mQ4m0j88N7J08j29J30l5j34J58J2k19K44j45K46j7j74
$$ 113 105 -97 -43 38 -122 -2 -6 78 38 -150 -93 15 -114 16 -19 -153 5 17 -202 42 -103 143 126 -48
1742d8O6J35J5O7j79p8P1p2J21M8l63K50mj45J33K7o6J19j44l2N5p6J78j00j67
$$ -48 18 153 168 235 56 -22 49 -23 98 146 -217 33 29 -116 17 44 -22 97 -47 -79 -24 -100 78 -22 -189
1767a89K68j00k3J70k57j0K00p0j58L9M4J21J13l37K69r2N4R3k43p8K22j90J25
$$ -189 79 -21 -44 126 -131 -141 59 -11 -169 -130 -86 35 148 -189 80 -12 42 135 -108 -186 36 -154 -29
1790b9N5n0K9K91l85P7J01N2n9j63o1K54j43P3K1j39J54nj38J14l0r2Rq4LJ51
$$ -29 26 -24 5 296 -89 -12 89 141 82 -81 -142 112 -31 42 63 -76 78 73 -65 49 19 -73 -64 -148 -145 6
1816Fkk3ml4J84j59l3J54n8K2k8p8jJ26q4K05j27j71J24K3NJ55k10m6J90k42J60
$$ 6 4 -19 -23 -57 127 -32 -65 89 31 53 25 -53 -54 72 -12 193 66 -105 19 42 47 202 -8 -54 136 -106 54
1843E4k3j09K65j05j59R8n7M7J54k52R1l1P4K4j3j32J73j72J23m9j43K03j8o2
$$ 54 31 -78 187 82 -77 21 -36 11 165 -87 4 -27 47 71 58 -74 99 -73 50 1 -142 61 43 -19
1867a9KL3n2J05j12O1oL0j28J31j05J63j80o0J52qr7K00p1j81K51k22J09J01k01
$$ -19 -17 16 -36 69 -43 18 12 42 -86 45 -60 103 -77 -137 15 7 -90 110 39 -142 109 -113 -4 97 -104
1892a04J51O3j34J1j1K0J27j98j50K16r8J83K0j51K08k26QJ09p2j0K09k85jK80
$$ -104 47 110 -24 -13 -24 -4 123 -75 -225 -9 -107 76 96 -55 153 -73 -65 44 -28 -38 171 -114 -115 165
1916A65j99J30j77J8M1K2Q6mr4l2o8pK12j06k01K34P0j66O9n7JL12l05p5Q9l2
$$ 165 -34 96 -81 -63 -22 0 86 82 -12 -44 -112 -119 93 -13 -214 20 90 -76 -7 -64 -63 249 -56 -131 -42 -74
1942g4J54r2ol5M3jm5j4N7N2m1q0M9J4N4K9o9n3N8J25j24N6rj9j6j72O8K2L13
$$ -74 80 -12 -18 -53 -10 -11 -56 -70 -13 39 -2 -82 -33 -19 35 64 -5 -58 0 125 1 57 48 29 13 -159 -91 -69 244
1971B44k04k28J65O6n1J7j2j0J04j14J43k19R6L9j28%R2j41K52J8j51o7J50n3
$$ 244 40 -188 -23 43 -8 9 -3 -13 91 -23 120 -99 -3 36 -92 -92 0 -141 111 129 -22 -89 61 8
1995HM3r7J24j7M6k14J78j28L3Kk9Q1r4j7K48N2l05K44j53L4m6l3Q8r3m5J08r2
$$ 8 51 -46 78 61 107 -107 71 -57 -24 -22 -51 30 -64 -81 167 219 -86 158 5 39 -7 -40 48 -45 -90 18 -74
2022g4N3kN8m5o5o2J60j2j9P3j07K4n8J01r4J43j80J01J39j86K20j65K0L3r0J0
$$ -74 -21 -23 35 -10 -75 -137 23 11 -8 65 -42 -18 -76 25 -69 74 -106 -5 134 -52 168 3 23 56 -34 -24
2048b4M4J0j55K18m3j4K1p9L3M3j18P0k7Q3Kj19K9M7j5N5j10Q5O3q3n9O7j09J21
$$ -24 20 30 -125 93 50 36 57 -22 11 54 -64 6 -21 62 64 -55 -26 21 6 61 -49 36 99 16 -43 24 -85 36
2076C6J21j62r4L3j16J93N5j5l6j81Q9P4o7jM4j6L0K8l3N1M5j6k8J22k16K36j75
$$ 36 157 -5 -99 -66 -182 11 66 51 15 -166 -77 -3 -70 -71 -27 -43 -13 15 -18 33 78 62 34 156 -60 176 1
2103Am6K7M4o1N0k2m5J64k04J30j56O7OR5N1k1n0q3N3Pk2jRJ2j5N0j8j65J58k8
$$ 1 -45 -18 26 -35 15 -7 -52 112 -92 38 -118 -51 -45 50 101 80 30 -53 0 7 -15 -16 -7 5 -10 40 22 -143 15 -13
2133a3j8qM4p5R9L0n9O3j60J76p4r9J47oo4P7j43N1o5P9Q4mj54N4n5J24o2m0O0
$$ -13 -31 -39 5 -70 29 59 0 63 -97 79 5 -94 53 47 -17 60 -83 -32 -97 -18 66 62 -92 -38 -93 31 -31 -71 -11
2162a1Q1l5RJ6k1l4M3p6J21r8l8Q0M6l7p0Q0qJ0j12J56p0q5J55j30R3m9n7J0O5
$$ -11 70 35 44 60 39 5 48 -28 93 -5 -43 37 83 46 -24 56 48 58 -54 102 32 -53 102 -28 65 16 -41 -31 34
2191C4k0nO4m2m2L5q2K02k41nJ68n6l5J6n4j6P0m7J74j86J29m9J05N2l09J95q8
$$ 34 14 9 73 31 -11 24 -58 144 -97 -102 66 10 -25 -9 -63 -79 -9 -56 118 -68 61 12 117 169 -140 55 -33
2218c3M8J7j6N6j59J58N2j01M1n3J2j13Q4K6o2J06k4j34K3R7m3l3P7N6j37O4k3
$$ -33 15 32 16 72 -87 71 123 22 63 10 22 -91 -7 19 -43 63 39 -95 -72 25 -18 -51 26 82 -55 9 -14
2245a4K6k4q0J17m8n7K9J0KJ72j99J21j33Q8K7M7n7rJ0J3kj22J13k4Qrrmn6Q7
$$ -14 12 -12 -92 25 -23 -80 -51 -41 -39 133 -66 55 -78 10 37 84 27 18 28 41 39 -83 30 6 14 5 -4 -8 -64 23
2275B3J48j54j0M7o3r7J41j1J16j61M9p3M5M6j39J04q3N7J9j1m1J49n0p8j00J41
$$ 23 171 17 7 54 -9 -106 35 24 140 -21 28 -45 0 46 -93 11 -72 -15 4 -7 -48 101 51 -27 -127 14
2301A4pl5k7M1l7k4J58o6K2p5j6K9P4r6N9l1M5o6lRL5o6J21rl7n5rN3m7n8J73
$$ 14 7 -28 -55 -14 -51 -75 83 17 39 -36 -52 -23 51 -45 14 -17 28 -38 -41 -32 3 -63 58 49 12 -43 -52 1 -46 -104 69
2332F9j71K11r2L2n9K4j30L1N3L0J2m6RO4M9j75J52m7O2j11p5J71j56K44j08j27
$$ 69 -102 109 17 49 -10 14 -116 -85 -32 -2 10 -36 -27 37 86 -89 63 16 78 -33 -108 63 -93 151 43 -84
2358h4L8j5J2J4nP9o3J35j32m5J52j20M3k5O0p0M6o8J14Lj08O0Q6j40R4j32R7
$$ -84 -46 -61 -49 -35 -40 39 -24 111 -21 -66 86 -34 9 -16 44 -26 20 -48 66 69 -39 21 107 -33 61 -71 26
2385B6k0O6j39N1N2j6J20j29L0j78P3K34k22J15j01P5j27K7L3pj3P3O2j32J16
$$ 26 6 72 -67 -16 36 20 140 11 41 -137 -64 170 -52 63 -38 37 -90 -63 -30 -37 -50 23 85 -47 69
2410F9q8M1l1q0O4m7n9J56J8q5M3j5KnJ8J4q7J23k5j02M5N6r8J29r2p3J18K2q8
$$ 69 -19 22 -9 -89 -25 -72 -131 25 43 -42 1 -14 -12 -17 1 15 -72 51 26 -76 -31 25 -73 56 -36 -109 9 31 -57
2439e7RP9l8J6r1L5L5l8J6Q6k0k6r2J23j31O2Q2k5p1Q2q9l6J02K4k7J08j22j20
$$ -57 -48 31 -7 9 -82 -47 -12 -50 -34 52 32 6 -86 37 -94 -32 50 25 -46 36 -53 -89 13 37 10 118 -4 -124
2467a24P7L5l8M2M4j65J40j4k6l9P8l5l2O9l2J59J4j27Nl1K2j23J62p7M6n3q8
$$ -124 -47 -12 -50 -8 36 -129 11 -3 -29 -68 10 -25 -57 12 -20 139 153 26 31 0 22 -101 61 -16 30 -23 -111
2494a11J49Mj36Q9J15j40J3L4j7J40j58j43J54l9J5P0l4J7J3j50R6l2M1P6n7L1
$$ -111 38 42 -94 -5 110 -30 -17 17 0 140 -18 -161 -7 -46 -31 39 5 22 35 -115 -19 -51 -10 66 9 40
2520D0pj17J59r1N8l9K5K9jq1k3N1J0O0j01P6k22K91k14nK0P7m2M0r8J71j04K7
$$ 40 33 -84 75 -16 42 3 28 57 56 -25 -48 3 13 73 -28 48 -174 117 -97 -102 -82 -5 -47 -7 -105 66 -38 -11
2548a1J3o9J28r5l4N6p2R9K9l9R7j79N7J29j70K8J18Q9k09J11m2k2N1m6l0l7P8
$$ -11 2 -67 61 -34 -68 -12 -84 15 44 5 102 -77 -20 109 -61 -33 85 174 -35 76 34 12 63 17 -13 -50 28
2575B8%j14J69p1m0Kl3M2P5j00K8M0K9k7J8m4m9J3j7L8J7n4P2m0J0L1j5P4j05
$$ 28 28 -86 83 12 -28 -26 -59 -17 58 -42 -14 26 55 28 46 2 -47 -34 -51 -13 4 -50 22 -18 -8 23 8 82 -23
2604b3l6Q6m8k6R7J63k22nK8Jj11J60L2j27N5k2j10R8OQ9L9q9j2p8Q9o6mj31J60
$$ -23 -59 27 -21 -47 50 213 -9 -14 14 15 -96 64 96 -31 24 2 -108 -10 -4 85 124 35 23 -55 34 -32 -36 -167 -7
2633gOp0o6R4O8n0P5p2L3N6N1j38p0J46%j32J36j22Q9R5j89j8J06r2j0P2M0M8
$$ -7 -1 -71 -137 -43 25 -25 50 -22 11 67 118 -20 -90 56 56 -76 60 -62 27 122 -67 -85 21 -71 -81 -9 31 79
2661G9o3j13J89j29J10p9ML5r4J3n2O8qP4j00J17mj02L1J07L4j50q6O0N8J4n6
$$ 79 16 -97 92 -37 73 -6 -2 33 -61 -48 -100 -32 -40 34 -66 51 47 -55 -24 83 117 -33 -119 -59 -1 13 -43
2688d3m0L2J0K09j66m9P0O3Pq8P6j01k3l1J46p1K2o1r7N5Q4Mj2o3R7l5j5l3J28
$$ -43 -83 -51 -41 168 2 -47 23 86 93 5 81 -20 -43 -74 72 1 23 -38 -135 -80 4 8 -4 -67 30 -5 -20 -53 75
2717G5L7j13l4o1J03O9j2p1J32r7j7j47J15O0J1j49J64p3J1KL3n3M6Lj01O3j7
$$ 75 112 -1 -35 -96 7 76 64 -7 125 28 11 -136 -21 39 50 -99 65 -8 3 5 38 -15 31 34 -67 -4 -21
2744b1P0j55O0M2K4n0M6o2O4l2K7N5j13P7q5P5o7n2J63l0Rr4Qj23J03N0r2K29
$$ -21 49 -106 -46 -4 20 -30 16 -46 18 -14 13 68 -45 32 -53 22 -45 -97 66 36 45 -49 -41 -164 -61 -11 -103 126
2772A26j43jj1J33r1lJ2R6o0p7J18j31J45r1MK9j7l9J24j80J05j3o1l4J19K3r1
$$ 126 -17 -18 -29 104 13 10 22 118 58 -19 99 -32 113 22 26 55 38 -1 123 -57 48 35 -26 -60 59 82 -9
2799iP1j18M8L0o9m4J09K1k5j25Q7J35j75N3R0m6L0j3k9M0n8j10Q4j6l7J32l5
$$ -9 62 -56 -8 22 -47 -91 18 39 14 -111 -24 111 -64 -11 79 33 63 50 21 61 3 -107 -23 -39 -76 56 21
2826B1j1K1j5o2J84k11J68o1p3m2L4J13o8l1nO3M0p5j9L5M5L0j54J84o3R0j40
$$ 21 10 31 16 -46 138 -73 95 34 -39 -81 -47 66 -2 -33 -38 25 65 -10 -29 6 51 81 -73 111 48 138 -2
2853bQ7j15M2j6Q8p6l6J46j64j2n5J12l3M2o7Q0r4LJ3J09j52J12n9R8L1n7q9R5
$$ -2 85 -30 12 -4 84 8 -28 118 -46 -58 -113 -1 -34 8 -59 21 -73 -70 -57 52 -100 12 -47 51 82 25 -64 31
2881C1L2r3L1j17J81k39Q9J11l4j43J65N8j7o2r8J93k05K63p1j39R5j3Pk2p2J39
$$ 31 63 -30 1 -116 65 -174 -85 26 -8 -151 14 72 55 -7 -105 88 -117 146 75 -64 31 18 25 3 -69 70
2907G0k0K1k9m5nO1M3r3J00K6j23r4J33p8J22j68R0Lj16J51j17j5J57k7r4K3l9
$$ 70 50 71 42 -3 -8 53 96 3 103 129 6 -88 45 -33 89 -79 11 14 -102 49 -68 -83 74 47 -47 -24 -63
2934f3J22J21k64J72l2p7K5J0M7m5n1m7R5r7o2J41j1N8o5p0J45j63K18r2r6K6
$$ -63 59 180 -84 88 56 -21 4 14 61 16 -35 -82 13 -84 -146 -5 -16 42 -23 -93 52 -111 107 15 -81 -55
2960e5P4J8O6p3p7K1Nq9J25P7j33P0j27J55l7r1L0L8p4Q0K5O4j62k9J59j8m1J3
$$ -55 19 37 103 30 -47 -26 -21 -110 15 92 -41 29 -98 57 20 -71 -41 -3 -77 3 28 92 -70 -99 60 42 1 14
2988A4rn8L5J70j31rJ05k10J92j90j23J55Q1R8p5j0l5L6j12P1l9j6Q7k20J64O0
$$ 14 5 -53 -18 152 21 12 117 -93 99 -91 -214 -59 22 120 45 35 0 36 -76 -5 -44 -60 27 -193 -29 31
3014C1o4L8M8q2Q5R3j53M9j34J13J7n3J40j61oJ0r5R1N1NJ09r6oj14J04j9q9K8
$$ 31 -33 5 53 -29 56 149 -4 45 -89 24 41 -12 128 -33 -39 -29 -124 -33 18 23 132 36 30 -84 20 1 -88 -60
3042f0q2J30J32j18KJ3o7J12Lj31K8l4O7L5R2n1j09n8Q7J64k06L2K0n2o0N2N4
$$ -60 -142 -12 120 2 4 17 -50 62 65 -66 -38 -72 -5 30 122 71 -38 -96 -9 155 -51 -19 1 -51 -111 -59 -5
3069el4J6O7J1k7Q0j38N5jj5Q6q6J04r1n1mJ44j08K4KLj6p6R5l2LNR4j79pJ34
$$ -5 -39 -23 44 55 28 108 -30 25 24 9 95 9 113 22 -29 -33 111 3 27 29 32 16 -60 35 3 6 11 105 -74 -81 53
3100E3k0o7n7N5Lk8%J48j45O2M6N0K4j02j9p2K1J41j66J45p3J18j03p8Q7j3l1
$$ 53 33 -34 -91 -36 -33 -61 -61 87 -58 4 50 100 124 22 3 -69 -48 93 -73 72 -1 117 14 -64 23 10 -21
3127b1l5M6J1j4q2J8R9n2O5j07J87n3j17L0L7j07M2P9j3P5p4q0J1R6l3m9P2j58
$$ -21 -56 -10 1 -13 -95 -77 22 -30 35 -72 115 62 -55 -25 12 -95 -53 26 13 88 14 -66 -55 41 8 -41 31 -127
3155a27J89j09P5k6N9jn5l2M0m5l0MQ3L0l5l6l6J27Pj09j08J58o3l9J9K1M7Nq1
$$ -127 62 -47 28 2 61 60 5 -27 13 -32 -62 -58 25 55 20 -16 -52 75 82 -27 -135 23 -40 -79 -60 -39 8 13 -68
3184f8J44j68PO1k9Q3o4R2jm2m4K4o7J30m0J06k07J47j1j06L7o5J31l2%PO7n2
$$ -68 76 -92 -85 -24 -53 30 -34 58 57 15 -29 -5 -72 58 18 124 -83 64 53 -53 -16 -81 50 18 18 25 92 40
3212D0n5mK4K6O8r4On4j5Q4j28K7Q7L2on4j30R1P9o2k9P9K16k35j7n5P8J22j90
$$ 40 -15 -19 5 31 99 5 11 -43 -58 26 -102 -75 12 44 38 -16 -146 -55 24 -38 -67 12 228 -7 -24 -79 -1 121 -69
3241f9j18J87K3n9L3P2j04l2j6M6mL4o6R5J04j47J4K3j5K4K7J5k5m7o1pJ6J36
$$ -69 -187 0 23 -36 -3 69 -35 -67 -83 -37 -41 -7 -73 22 126 -21 -7 16 1 25 52 67 42 -5 -66 -73 -57 79
3269G9m0j0k8p2M0k1j4N6k7P1j1m7P7j20n2J60q1J02n3q0L0R9n3mj8LP5n9l3l8
$$ 79 39 29 1 -71 -31 -52 -66 -10 -37 34 23 -24 53 -67 -119 41 -40 62 9 -71 -41 58 5 1 -17 -14 61 2 -31 -69
3299f9P5k0q5O1N2p9Q9J8j5o1Q1P1j44N8ro0J1nM2m3J30j3j55K4R8j13M5L3lk
$$ -69 6 -14 -99 -38 14 -65 24 42 27 -34 47 118 -26 32 23 -37 -26 -31 11 -32 98 85 -70 -46 52 -61 -16 17 14 12
3329A2J10l07K39po9n2Q0r2J0J25m0Q7m5q7K8jJ10n5j6o7R4oJ4rj30J67n9O7j80
$$ 12 122 -185 54 47 -22 -74 6 -86 -76 49 9 96 51 -36 -8 -9 101 46 30 -37 57 51 65 56 -74 93 34 101 -79
3358g9p8K06L4j21k4M0j8J14j29o4J61k7m4K4L1j01J04q5R1n3M1l0l2k1K2P0L9
$$ -79 -157 49 83 -38 -62 -22 -40 74 -55 -119 42 15 -29 -5 26 -75 29 -56 35 -18 23 -7 -39 -60 -38 32 71
3385G1j32J16m5j17N6J29n7M5j26N0Rl5j2j9J15k6l1J48j11M2j01O5j61J99rl5
$$ 71 -61 55 10 -107 -51 78 21 66 -60 -10 -1 -36 -48 -67 48 22 -9 139 28 70 -31 34 -127 72 63 28
3411B8j2K5j31P7m4j4J75j46M6Q4q3p7N9M2K1j7k1j08R4j2l5l1L2n1J06L0p4P8
$$ 28 16 41 -90 -13 -57 -71 104 -42 4 88 5 -72 -13 29 50 33 12 -96 -2 -14 -49 -80 -48 -99 7 37 -37 41
3439D1m8L0j6j42K10o4L5l4N3p8N1j31J82j28P7k2J1n9J2l3l4P5j02R6P1l1j39
$$ 41 -7 23 7 -135 75 11 46 12 65 -13 38 -93 89 -39 38 16 27 -32 -20 -53 -87 -12 -114 -18 53 22 -117
3466a17J35j9j5J4L5L4K9q3q2N6j4j1k1O8J8r9J8J44p8p5n4J84j06J54p5l7OL4
$$ -117 18 -1 -16 -2 33 67 96 13 -69 -13 -27 -38 -59 9 27 -72 -54 90 12 -63 -117 67 -39 115 40 3 9 43
3494D3j1l8j5j4R5L9p5qJ55k34J45n5m4m7O2k5J09m9l9j0K0J1N4j43J18L5j14
$$ 43 32 -6 -21 -35 60 99 24 16 171 -63 82 27 -17 -64 -2 -27 82 33 -6 -16 4 15 69 -74 44 79 -35
3521c5J09N2j61N9n0%l1J75j15l9R8j42l8K05j20k4O1j9l6Q3m8l7l1KJ03kk2P9
$$ -35 74 126 -35 24 -26 -26 -57 118 3 -36 62 -80 -118 87 -33 -57 4 -15 -51 32 -16 -53 -84 -82 21 19 -3 76
3549G6j31M5J9j8N3po9J21m4j7J9n0o8J36j15J3K4M8l4oO9j25P6j4m1L3oN7j54
$$ 76 -55 -10 9 -9 44 37 -32 89 45 28 47 -3 -71 65 -50 -37 -13 35 1 -5 64 -61 15 1 -40 -7 -13 44 -110
3578a10J02N8k4r0J01l3jM7r2Q8j6Pj25O5JQ8J2j50R6k8J9j01j04J68j15J15J23
$$ -110 -8 50 26 -64 37 4 3 50 -42 46 30 37 -88 -23 -22 66 78 -72 24 -4 15 -86 -190 -22 -137 -22 101
3605A01j58qR5K8K2kj72Q3n3K9q0J06m4Q0O0o9kL8m2l0q2R8l0Kk4l6K53j47q6
$$ 101 -57 -65 30 58 80 78 -94 -11 -64 -35 -115 -9 -53 27 87 18 16 54 12 -18 -100 -2 -32 -30 -54 -90 163 16 -70
3634g0J65k6o5q8J54k19J47k9M1l4KqN3q2J64J1j62J6K3J7n2P0j19J19l5Kj1m6
$$ -70 95 69 4 -84 70 -149 -2 -31 10 -24 -22 -30 23 -59 105 116 -46 -30 -7 10 -42 28 -91 28 -7 -5 -16 -62
3662f2N4mn9L3J10j15J78j3k29J38km0j10J63m5m6J65o6rp7J66j32k1j2o3M6K1
$$ -62 -8 -12 -71 -38 72 -43 135 122 -107 31 29 -11 -121 42 -3 -49 116 50 41 -36 130 -2 -23 -35 -98 -52 -31
3689c1rJ54j69J6K7O3j2k3l6p8Q7M6j21m3Q4K3M1l8r9J49m5k4O8J8p2k2J02m0
$$ -31 -40 114 -55 -39 -12 51 39 16 -20 -98 -11 35 -86 -129 -45 -22 19 -19 -118 31 -14 -38 30 48 -24 -46 56 16
3717A6j9P5k8j35R8M2n0L8L5j2m3k5J4L5q5J09r0Q4l0q2Q0P6j39kN8j4n2N4Nj54
$$ 16 -3 72 44 -91 7 49 -1 37 72 60 17 -8 6 41 -44 65 -25 59 29 -53 27 103 -36 -38 20 6 -46 8 13 -141
3747a41J18k6R4r5R6j7n4J9m7N2J7j5L5N0j16k3j0J85j40%K07j73J9J9M2J0o5
$$ -141 -23 -49 45 -50 46 29 -25 -6 -53 -1 16 1 36 86 -30 -53 -63 122 -18 -18 189 16 35 54 96 106 41
3774D1j52J9J60m1m7P0q5L5j2l2K0N2K9m8N6p0J62j54r5J27p8L9RMl3N5L2k4J6
$$ 41 -111 -92 68 27 -20 50 -35 0 -12 -44 -24 28 57 9 65 -5 157 3 -92 35 -43 -4 5 9 -24 31 63 39 55
3803E5j37Q9jJ11p1Mpj36K30j76P6n3J30j20j10J31K2r9K4J08j81N9J1l1Q8n5
$$ 55 -82 7 6 117 46 50 43 -93 137 -39 37 -16 114 -6 -116 15 37 -62 -38 70 -111 -52 -41 -72 16 -39
3829c9k1J23n7Q1p5M0q0o7J42M9j44K3K2O7j75O9n6Q0l2N0M3k0Qj30K5J47j05
$$ -39 -60 63 6 87 12 52 -28 -95 47 96 -48 -25 -3 64 -111 -42 -98 -18 -50 0 43 23 31 -99 -74 73 -32
3856c2K1KK7K0o3L0J30l8j07O2j06L3L8q5MP3p9O4Q2o4j6P4l7q5N8j5R5j04J10
$$ -32 -11 -9 18 38 -25 5 135 97 -10 52 -54 -21 17 -68 -64 9 -70 -6 76 12 -4 70 33 -52 6 -9 86 -18 92
3885I2o7n3P9K5o5J58j56J1p0M5P8qo7L6Jo8k8N3P2q0J33j78O0O4o5J0O6j25J46
$$ 92 25 -28 51 76 11 169 13 24 -46 -1 77 69 2 38 39 -29 -57 -4 68 -12 121 -57 3 67 2 12 78 -47 99
3914I9k14J32m0j2q4J99p8ON0o1m5JJ18q3Q7r7M6r9J28j16L7j2J7j38J84J7j12
$$ 99 -115 17 -23 -35 -119 80 2 8 58 -3 -48 -47 71 -12 75 -22 24 -75 53 -63 -26 -38 -21 -159 25 42 -70
3941g0J15q8J36K1j39k3l2j10K49j41K02j64q7J65o2lQ6k7o3O1J6o4Q3k5j07L2
$$ -70 45 -43 93 114 -25 -48 -80 -190 59 -82 120 -44 -131 34 -28 -31 55 28 -35 26 42 -22 61 36 -71 -39
3967c9NO4k2r1Q7L4l5k5P2o9K9K2n5Q4j70J74Lj50K00j7k8oj46lR6J6p7Q5p9J7
$$ -39 -34 30 8 -83 4 38 3 -22 50 -19 10 32 -23 61 -109 65 68 -82 118 101 73 67 -79 -82 14 30 -47 38 -41 -24
3997b4n3J52J0k33J26M5j3P0j48Q9n2QL3p0J63k9j53J10K1J37k18k3J3R5r3J2
$$ -24 -77 75 85 -148 -22 23 10 80 -68 21 -31 -23 10 -60 103 74 -79 31 52 189 -29 -52 -39 56 -37 -25
4023b5N0K7j04J10J4l2o5J57m6j01L5m7L6j0J7K2m0M5o3K7Qp4J08m2lP7j15L0
$$ -25 25 52 -52 58 72 40 -25 132 86 -15 20 -27 9 -1 16 38 -2 43 -20 7 15 -59 49 7 4 81 -34 -4
4051dN2j3m1j4M7nK4p9QJ33j26M7n1JP2qK9q2M0r9J94j65j04J16p6O9Q3n7M0q8
$$ -4 48 35 -6 -20 27 22 46 -33 -25 108 -18 29 -22 -21 51 43 72 -10 30 -69 125 -40 -144 -28 -104 -35 48 -9 31 -57
4081e7K2P3Jl6pNl8j5j2L7J8O8n4Nk7N6Q8j84K9k2J57n8p5J78r1o7N9m2r0O6k6
$$ -57 -35 38 39 3 -4 1 -37 -52 -64 -27 -9 59 5 10 -17 39 127 -57 -28 -50 107 49 -26 152 61 -6 53 11 -79 -13 -39
4112c9k7M0rq7J37q8J10k3p0P9m2N9j11N1L0L4k9j47J82q1J8l6J3k4L3L5Ql8m3
$$ -39 -66 -26 -35 -122 15 -73 37 14 -56 23 -19 40 -71 -20 10 44 15 -132 50 -31 -13 -49 -36 -60 -27 8 16 -22 -65
4141f5J4O7K9P7k62J55J4j7j9K3J7lj09N1K1lK0l1J3jk1K7J11r0r6qJ58Mj22J59
$$ -65 -51 16 45 122 -140 15 29 12 -7 16 33 30 -79 -28 -7 -10 10 -21 -8 -9 -30 -3 108 18 -78 -86 72 76 -46 113
4171A13k41J70j9j5n5O4k0m9O9O2l4o5K1k3P6j28J06m6m2Q2mr1P1K2m4K5r5J34
$$ 113 -128 42 23 8 -47 17 -3 -52 17 79 45 -20 1 -22 54 -74 32 -14 -56 26 22 -69 2 24 -20 5 -90 44
4199D4j4q1J49Kr3m9l6R6ol7m9J03m8J25j57n5O7MM8L1j53K07Qn3j70J01J3l8
$$ 44 30 -51 98 100 7 -42 -78 18 12 -25 -74 29 -19 106 -51 -106 -39 -35 13 44 -109 98 106 53 -117 -16 -3 -41
4227d1P8Pp8Q9n8m3J57j00O3j2jk2l8o6O6p4J37j14m2Q8kJ0O9j08n3J34k2m4m9
$$ -41 37 44 -34 55 -3 -46 111 11 74 62 61 39 1 -65 1 -73 64 -50 -92 -4 -6 4 73 -35 -88 46 24 -20 -69
4256f9l4P0kJ3N5j32J54R3k21J14l7r2J80j20Q2J3n7J01q1j08N7K4J1M0l9q7M1
$$ -69 -103 -33 -35 -22 33 -99 55 148 -73 41 4 -88 92 -28 54 67 10 111 30 -78 -21 3 14 54 15 -72 -31
4283c1Q4p9n6K3Q1Nm1J4Qk4j2L2J9o5O5n3L7o9M9L6n9N4Q3j19Q8q6j28K47J1p6
$$ -31 53 -26 -82 -59 22 27 -14 0 8 -16 -28 4 23 -42 23 -30 7 -62 -13 23 -36 18 101 -18 70 -16 -144 103 114 38
4313C8l8Jp3O3m7M2j13qJ25PR4l6k2J9o7Q9j2m6J02j58q0N3J42p6n5J7nQO8j04
$$ 38 0 1 -72 -9 -56 -14 -127 -135 -10 -3 91 55 33 52 -15 74 62 16 118 -40 -120 -67 75 -1 -56 -39 -44 -36 32 -72
4343g2J53Rm6j29J03O2j65J13J13j62K2N7j8J2p7K8M6L4r0Mo6K16j06r0J27p0
$$ -72 81 90 44 -85 18 80 -85 28 141 -21 1 58 40 52 -25 3 49 83 -7 -3 -69 147 41 -49 78 8
4369HQ9m5j02J06n7J7M8Rk13J50K4Om8J10j4j48J14q4JK2P2j25J4P9J01n4L4o2
$$ 8 97 52 -50 56 -1 16 64 73 -140 10 34 40 -8 102 88 -60 54 -30 -29 -7 65 -60 -46 33 134 80 114 52
4397E2n6M6m9Ro2R2j56J42j2L1J7j18L8m8L0M7orl3N3R1k25K77j57j3r9J66l6
$$ 52 -4 42 -7 2 -60 32 -124 18 6 37 54 -64 -26 -74 -44 3 -3 -12 -45 8 99 -126 151 -6 -19 -118 48 12
4425A2Ql0k1j30J02J08r5O3n0O5j26o3J01J52j48J17j19L7J4N9j66J25m6O5p8
$$ 12 20 -10 -31 -161 -59 49 -46 17 -33 32 -94 -157 -56 96 -52 65 -54 -17 -3 56 -110 15 -31 34 -44
4450d4M6K2j68J90Q3j03k03J96j7m7O2n3O5r3P3Mj8K7l7k5M4N8k46J18J66j56
$$ -44 2 24 -144 46 129 26 -177 19 2 -45 17 -36 29 -64 9 13 -5 22 -15 -40 4 62 -184 -66 100 -56
4476e6Q3q1O2N4n2kJ8j12n4J12m7J45r7R9j28l6K51j67P6oq3J2R0j21Pl4J14j8
$$ -56 27 -54 8 62 10 8 26 -86 -140 -28 -75 70 -27 72 -56 -92 159 -8 68 62 -21 -9 81 -40 -33 -67 47 29
4504B9M5j36J11j09P0l3o5J52p1l2J65p1j10P7k4L2m9m2J21o7L3j30J62q9O8m2
$$ 29 74 -62 49 -60 10 -23 -88 64 -7 -39 126 55 -55 22 -2 30 -19 -61 60 -7 26 -104 58 -31 37 -5
4530ej06J33M7L5k8m4QOJ03k34N6L8Lk5o9K4J49Mn7n8O1L5%q0q0Q2k9l5J01pO1
$$ -5 -111 22 69 104 76 32 40 46 149 -85 -29 9 12 -13 -82 -58 91 95 38 -20 41 76 76 -4 -84 -2 -31 -66 35 28 89
4561H9n4k9l4L9L1Q4p3p2P8q7J46q0n0O1p8P5Kj33J97j70j36K10J6j26R3J32q1
$$ 89 35 6 -28 11 42 126 53 -19 59 -28 118 38 -12 49 -29 46 48 -85 112 -58 -194 16 32 -94 -1 131 50
4588E0n5Mk9P4J39k07N6m3n8RQ7k2q6M8N0jn8N7M5j00j0J56j22j9M6m2J33j47
$$ 50 -5 -1 -30 44 183 -24 32 -11 -69 -60 27 5 -81 -33 17 16 -42 15 60 -40 -50 106 -16 -35 11 -31 102 -45
4616d5mQ2M7N3j42K9q1M8R3r8M5L3l6J5q2O3r1R5Nm5o4J36p9l1J1K7M7r2J6N8
$$ -45 -49 33 80 133 -9 20 -61 -13 80 -18 27 60 24 39 -43 20 -71 24 29 -16 -80 56 -23 -54 -43 -16 31 -61 -45 13
4646A3p4K6J03j55L4R8n1R7Nj03K9J43j79L0M0k7k04K06k4R0j56Q9r8O1m9J9J14
$$ 13 -61 -35 68 -87 -53 45 -6 91 96 -7 22 165 -14 16 56 29 -175 31 7 97 -59 30 -68 -7 -56 -37 77
4673G7n0j0j23J89k06J51j29J02Q8j04q8J3Q5k2J33q6m8L2k8j9O4Pj00J94o1k4
$$ 77 27 17 -106 83 -123 28 -101 1 89 -15 -103 -90 -5 -27 106 20 -28 4 -24 -43 21 28 -72 122 61 37
4699C7L4q0M4R6r3m5j9K6l8j3Rj2L1J30qr9l8J44q2l6P3o8KRRM6p3J3q9J02R5
$$ 37 71 -9 35 131 38 -7 -26 0 -38 -51 -42 -54 -23 107 99 0 -38 106 24 -12 61 -7 -5 4 13 59 -14 -1 -90 12 107
4730A07l2j09K1Ml1R5p9l6J78j05r2N2jM0j17P7N5k5nQ3j69P4rK4L9j7MK8p4K7
$$ 107 75 -34 -13 -9 -40 55 -24 -60 118 13 -79 -27 -28 12 -105 -28 27 2 -3 80 -89 -15 -24 0 39 22 26 54 -20 7
4760Gn7K6M1p8n5Q9n2J60j04Q2q1O2j46l6K9J26L1o7M0oJ0j7k8R0j04O0l8O5n0
$$ 7 -50 -24 17 -61 -116 -27 -79 81 -23 59 -22 40 -106 -142 -113 13 44 -23 17 11 21 4 -24 66 -38 22 -16 49 -1
4789aN1p1J0O3j56J27Q2j52l9J51j55PP1J21q1pm8n3j7J42p6N9l9J79k78J17J7
$$ -1 50 -21 -11 52 -104 23 105 -47 -86 65 -90 -83 -12 109 28 21 -27 -80 -97 45 -31 28 -11 168 -110 7 24
4816B4O8j2j29O5K0m8l0rJ18M7j03J02j02l3J12p6j41J06Q4q5kkQ9o6J3K9j03
$$ 24 92 80 -49 16 36 -12 -42 -51 67 114 11 113 11 -22 90 14 -127 -21 63 -22 -24 -26 63 -3 10 39 -64
4843f4J39n1J9q5Ll8J29nkN5k53K20rj55O8JP9k49J85J6M5O8r9n6N6j4kj1J9o5
$$ -64 75 24 43 -42 -39 -77 52 47 45 100 -153 67 58 -97 -29 -28 51 -198 -13 3 48 116 17 -39 17 3 1 -10 9 -56
4873e6qn8J42l5N8n8N4Oj20K49j77Pm3l6M8N5J46j42J6q4K9K3j2L6o1J09j51Q2
$$ -56 -64 -122 20 -15 43 -15 39 45 -75 174 -3 4 -39 -75 -27 28 174 32 48 -36 -7 16 4 40 -21 88 -63 19
4901A9M3p8O5j12J36jj02m4P8J1RK1LN1j28J8oj7M4M5n6P1m5n9O8j13J67k00k
$$ 19 62 -16 49 -63 73 72 -30 -74 4 15 24 45 48 99 -29 -11 -17 -34 10 55 -1 70 25 -34 34 -79 88 -112 -114
4930a14J20o9Q0m9Q6l7m6P0n5O4Jlj0o2J16j06Mjn9O0j84L06m6n4N6l9p3N5l0
$$ -114 6 -63 17 -32 54 17 -29 41 -14 50 51 48 38 -24 92 -14 -10 -11 -70 -10 -194 112 66 12 68 29 -44 11 -19
4959a9J30j48J00j80J63j3j02Q8r2K8k9O5O3j01M6j2P4j05K2O1ll6L9k7m5l1J69
$$ -19 111 -37 63 -117 46 33 -69 19 -73 -45 -74 -9 54 -47 -1 -13 61 -44 -22 39 36 0 39 12 -33 -64 105
4986A05r2r5J12J3m9j6M7m1J15p0Rp1o1J76r1lK7Q2k7q9N2n7J07r9N4p2k2Q6j1
$$ 105 13 -82 30 43 -6 -22 25 -16 99 29 38 -33 -94 82 -9 -12 15 97 70 -19 33 -24 83 -16 38 -34 -56 30 19
5015A9Nj14J76j14Q4j10M2J35j73O0J0J4m8k2L6R3q0j29J29o4j1J6R6k0k4J04
$$ 19 24 -90 86 -28 56 -54 -12 123 -50 10 20 34 -14 -36 0 93 13 -116 13 -51 -62 -46 50 30 6 110
5041A10j03R9p6r8n9K37j43Jo9J31K7k14J44j0N3j4k4m5J29o9k5K2M7o1K1m6N5
$$ 110 7 106 30 -68 -127 110 -33 -32 -101 30 57 -157 -13 -23 30 16 -8 -53 76 7 -18 4 51 -10 11 -35 20
5068B0j79R6J09m5K7o5J28m1O0J8j14J82j92j6J24j15j1l2jJ25q1J64k43J15Q
$$ 20 -159 -63 46 1 28 -37 91 50 110 128 14 196 4 -12 112 -3 -14 -46 -47 78 -3 161 -82 33 41
5093D1j60J30n8J75j46n2P4p1J03K1j3n4P7r0Qo5R0Q2q3j23O7N3n5J17k8o4L0
$$ 41 -119 11 -47 128 -18 -70 4 -67 36 57 44 -10 67 -23 -15 -80 10 92 9 -114 -47 6 -49 68 40 -24 6
5120FL2Q4r8m1pK4Op4k0J16Q8j35R3k5o0j6Q0n4q5J47p2l0J51j73Q8rk9J6p5p9
$$ 6 38 122 24 -17 -24 0 6 -68 -88 28 116 -19 74 49 -11 -27 53 -1 -86 61 -11 -41 110 -63 25 16 -13 3 -72 -151
5150a51J97q1J4R6j16K1L3J06p2k9n6J28j23O4MkM9j58J74m2r9L5N3m5O8mj53
$$ -151 46 -35 -21 75 -41 -20 13 119 47 18 -38 90 -33 31 35 33 82 -76 98 56 -43 -8 45 0 68 64 -89
5177h9rJ25j5o8K8k6M6n6O9Kkl2K4L2p0QL4%k6o0K42j54N1Np1K7O7k1n2J1q9O0
$$ -89 -98 27 12 -56 -28 -54 -8 -64 5 7 5 -27 -3 29 -41 -33 1 1 -25 -85 157 3 54 59 -12 15 82 61 9 20 -69 -9
5209iJ6L3oL0j68P1Q0r0J31l1q3k1K1j5M3K5j4J7j6J02j08K9j53K08q4q3Q9j0
$$ -9 7 40 34 64 -104 -33 47 -43 88 57 -26 -47 -26 -41 2 27 13 30 14 116 8 37 -116 92 8 -75 14 4
5237Dj7l2m9P6J15q3r2Q7J31j87Nm5J00n1J24j14J60j09j5lo4PJ76j56J19L7j95
$$ 4 -13 -45 -94 -18 97 14 -78 9 140 -47 -42 -87 13 -38 86 -28 132 23 8 5 -59 -52 124 -32 87 124 -71
5264g1J43j27kj7k6Q2J68j00o3K4j32J31N4p0k0r0J05l4P8N0j46Nl4M3M6K1j19
$$ -71 72 -55 -57 -74 -100 -18 150 50 -13 11 -121 10 64 -6 -26 -116 -11 -45 33 83 -63 -58 -92 -49 -3 18 -101
5291a01Q8J35p2j05j8J00L9m5L5m5k4K8l3P1p3l7N2o5J46k6K3n5Rj3L4j26Q7M0
$$ -101 -13 122 50 -55 -73 27 66 21 56 11 -13 15 -18 53 -20 -57 -5 -70 76 50 73 18 27 14 48 -78 9 49
5319D9N4r6m3m9J23m8O7k40J71J1k3L4r8N7M3N6m1%L8k1L9K1r7N7r4J7m4M8j9
$$ 49 103 7 -36 -85 38 -10 57 -183 -12 -1 -24 10 -88 -31 12 68 27 27 65 44 83 104 7 64 -30 -13 -57 -9 -28
5348b8m7J14Nj10R0N3m2n5M7J07q6j02j0J80r1lK3K0j62Q8L4K9K9p7L9r9J69j53
$$ -28 -75 39 44 -66 24 77 35 -20 27 134 48 -54 -64 116 25 22 45 65 -97 -9 25 54 83 6 45 -54 115 -38
5376c8R5r2J54p7M0JL7q7R2j04J0m2Pl6L5j11J08k8R8K7q2J6pRL2j44J17r3K8
$$ -38 57 -35 119 42 82 83 120 33 125 21 31 -11 -4 -40 -5 -116 -8 -36 62 89 7 23 16 25 57 -87 30 -63 -35
5405c5P1n5N4k1K3m9n8J7Q4l9j10O3k0K7qK9J5O1j1r5J33q6L3j5o7M3M2o3L0J07
$$ -35 36 -19 35 14 37 -12 -70 -53 31 -8 -118 -55 -75 -48 -56 -27 -12 49 38 -57 76 -10 23 8 -59 -16 26 -37 -7 100
5435A00m9m9j00O7O0J6L3n1j07N1k5N9j6R8k8jq4J1l0KO3n7K4rQ6j35Q4n5j09
$$ 100 51 2 -98 -31 29 45 78 27 -80 -29 -54 5 -11 87 59 58 -26 -15 -45 -43 20 -37 -13 -22 64 -71 13 -42 -151
5464a51J48Q0j1n2o4J69r9j8j2J9qj3R8k10J23N8l0n6j4l8M6K0j55R6PM7J5L5
$$ -151 -3 77 66 14 -50 119 20 2 -10 9 1 -12 86 -124 -1 57 27 -29 -43 -81 -35 -15 -170 -74 -67 -20 -5 30
5492C0j01J51n6k7lJ44j65o4n4K48j63mK0j6N9k8o0P2R7l5j79R4p8J38LN9j33
$$ 30 -71 80 24 -3 -6 138 -27 -91 -145 103 -60 -64 -44 -60 -1 -29 -89 -17 80 45 -134 -40 -118 20 23 82 -51
5519e1Q1l0j27J69j23mO7j5NM1o1O7m0o5J11R9m9Qj12k9Q8r8p9R6P0l8q6J05o1
$$ -51 30 0 -127 42 -81 -85 -18 -33 -28 13 -48 19 -21 -86 25 124 75 83 -29 -58 30 -68 -147 -51 19 -19 -105 0 -61
5548f1M4n2J06j19J16J08j93J03p7O0k0M4m6p2N2l4J29j23JJ06j7qr2O2j4k7p8
$$ -61 -17 -69 37 -82 34 142 -51 52 -25 35 15 59 13 -59 -7 -41 88 -35 -34 72 55 47 -45 17 3 -24 -102
5575a02J17p0J05j28j5J27m3jl4L9p8O1m6J22l8j1J26k23P1M3m9K2j6P6r9J38
$$ -102 15 -55 50 -78 -93 34 -9 -10 -44 -5 -83 -22 -68 54 16 5 131 -92 -21 22 -27 -5 -21 55 -44 94
5601I4n3m1j0k4R3l0J4j1q4Q4N7O5j45n2N8j1j8KM0j6Rk7lR0j04O3q2O8j23J45
$$ 94 41 0 -10 -34 59 29 43 32 -52 32 89 154 9 -43 15 4 -14 -12 28 12 21 -6 -9 81 -23 40 -42 26 -97 48
5631D8j03P1j20J19M4K2j07m2O0N0o2L3j17J60o1k5p6M5J0JL5J7Q0o1r0k8J69
$$ 48 -55 16 -104 15 59 81 -26 -68 -8 42 -20 13 -104 56 -5 -30 -106 -61 -51 -50 -15 2 82 21 -69 -97 72
5658G2q7L5n6O7l2J0j5k1J6m5n8L4L2j4j9P6jj08J62j35J38j38O8k0J74j75J29
$$ 72 -15 20 -36 31 -1 9 -6 -27 -11 -56 -114 -80 -48 -62 -81 -5 -6 -114 48 -87 51 -87 -19 -39 135 -40 89
5685H9m7M4j5K5j70K02j28O7j06M9k4j36J40O8N6j29P9M1p6j8J36j46Rp7Oq0J42
$$ 89 42 86 71 96 -74 128 0 67 -39 10 -14 -150 -10 58 114 -15 64 105 29 11 147 1 10 -67 -61 -141 1
5712AJ9j1o1L1k3J96j70oJ15j0Rj2n5Q8j02L0P2q8m8n7m0O4m1J02K9j13K17j52
$$ 1 20 9 -52 -21 -44 152 -18 -24 91 81 90 78 23 111 9 39 111 23 -25 -82 -122 -58 -99 3 32 -81 136 -16
5740a6j50J93N5j07J1JK0k9n8J48j31N9%K4o3L5m3j19J26O0M5r6M4L0r0P4K1%
$$ -16 -166 27 82 -25 -14 -13 7 -22 -80 68 -63 -4 -4 20 -43 -8 -51 -170 -44 16 61 -35 9 39 -51 23 44 44
5768D4MR9j33pK1q1R5j8r6j2J28k8j6j9JQl1L5j12J64N1j61ll0J70r8N7q8L1j
$$ 44 48 147 14 7 28 -53 42 24 -72 -84 44 16 0 -19 -18 -10 -41 -6 -118 46 97 -64 -67 -97 73 -25 32 -56 -25 -26
5798b6N7k02J86k1oj16J21o6O8k4P3n9N4o7K8K7r3O5r3J13m1k0L1P9J2l08K14
$$ -26 31 -171 15 -6 -12 -128 -7 -73 -5 -29 44 -15 39 -28 0 27 -66 -1 -94 19 -22 -42 -11 68 80 -228 -14
5825a4Q0o7k2J0o4O9pM2N3j35j2O1PJ15j46l7J1J05j06J2M1K3l7k6N0l8kL6m2
$$ -14 66 -1 -23 -13 -77 -8 -15 27 80 -55 -67 -6 1 116 -30 -67 -56 49 -57 -45 -4 19 -18 -44 6 -32 -34 2 -40
5854d0Q1KNJ8K7j08mR4o4K5k4j39J68JQo0j20N2k3O3O6j2L9r6K7J61k65m4J13
$$ -40 41 43 48 66 93 -15 -19 75 11 36 12 -127 41 42 50 -10 -130 -78 -101 -38 28 16 55 -41 -14 147 -118 -162 -49
5883d9o7N9Q3J06j05p5O7n8PL4l6m2R5K3J0k7K3o5l9n5J23j4N6n9k8R0J8q6p7
$$ -49 -116 -57 26 132 27 -48 19 -39 -32 2 -34 -76 19 42 52 25 48 -17 -56 -111 12 -2 54 -5 -33 57 75 -11 -88
5912h8M8Q6q5O9K9j12Q4M4j37J0P4Q3q8N5p8J3l2N5J10o0n5o3J12o8Q2j39J4N3
$$ -88 -40 46 -39 30 59 -53 31 75 -62 -52 22 105 17 72 -6 7 -25 30 140 80 25 -38 74 6 88 -51 -37 16
5940A6pk5P9nJn2nL8j02OK7j4l8L3P4L0p8Q7O4k17J30j07J67j50R1n3J4P4r8J25
$$ 16 9 -16 63 58 59 7 2 40 -62 -56 -29 -43 -81 -48 26 56 -22 65 129 -88 42 -65 102 -48 43 -10 4 78 -20 105
5970A05n9r6r3J53KJ50r7m5J4o2QN3%j17J12Q8j43l0Q7j5l5K2NK3o1Ml6o6J32
$$ 105 46 -50 -143 10 12 162 65 20 34 -28 -20 33 33 -84 28 116 -27 -57 30 15 -20 2 7 30 -31 -27 -63 -129 3
5999Co9qJ26n8M3o6n2J18q4J26j62Q5m4m8J80k12j0J12O5m0m5J28p7J62l04J49
$$ 3 -66 -74 52 -6 37 -29 -81 37 -47 79 -83 2 -42 -90 90 -122 -132 -20 45 5 -40 88 11 173 -131 18
6025A8m7o0J35m8m8P7j7q4J17l1K2O7j24P5p0l1O7N4q2PK7m9R2Or4j6L9%p3J70
$$ 18 -29 -89 46 -2 -50 27 10 -74 43 12 34 101 -23 52 -18 -49 18 72 -10 -3 24 -25 67 73 -21 -37 2 2 -71 99
6055I9j66J2j7J5n6J35L0J0OJ5j70J51p0%J16K5j66Q0n8M9q1P8J4m5j02J10M9
$$ 99 -67 -55 -72 -57 -113 22 52 62 68 83 -87 64 -6 -6 110 135 -31 49 -9 40 -41 37 51 6 -96 14 63
6082F3m2q2m8O3P9j4p8m0J48o0j28J70qn4ploR1mm3j2O0l7k7N3k3j19K45j84O
$$ 63 21 -61 -109 -46 33 19 -59 -99 49 -11 -139 31 23 -31 -38 -41 -47 44 40 -3 -15 45 8 -19 34 11 -108 137 -47 -41
6112d1P5R5j68k7R2%L6r9n8RR1L6o9J3K9L8q0n4J2R8J7p7J29k7o0O7r7J03j84
$$ -41 34 129 -39 -66 26 26 62 -37 -95 -86 5 41 -28 -15 14 52 -28 -82 -70 28 45 -32 97 70 10 77 -20 83 -101
6141a01J79p5l6R1q7J0m3J19J5j82O9R7n2j03Q9o0N2J33j3J7j52l7Q6K2L3r1j0
$$ -101 78 3 -33 58 -29 -19 -62 57 72 -110 -41 56 4 -99 -10 -70 -18 115 102 119 -33 -70 16 38 71 -20 -30
6168c0K5R0k3j10O7r1M2R6j74J11L9J8M9m4l2k7j37P8Q0j4J0r1M9j35K20j05J57
$$ -30 -5 85 62 -48 19 -72 -30 66 -108 3 42 60 109 65 33 6 -131 -53 27 13 23 -68 -19 -154 66 -39 118
6195A18Nj04MP0j29J89r1J6j12J4Q2q8pP4M7j04P1j02o8P0jm8M7j6O4o2N4J6j25
$$ 118 123 19 23 93 -36 153 62 78 -34 -20 62 -26 -33 41 88 -16 55 -47 -115 -45 -46 -94 -47 -63 1 -61 -7 9 -116
6224a16R7L9K1k5j82J69P3l4K2m2n1J03r5k4K14j50j0J3Jj54M7J79o8q2P2L0L6
$$ -116 -19 20 41 16 -166 3 76 42 64 22 -29 74 -21 -45 169 19 9 22 23 -131 -84 95 27 -55 17 47 83
6251H3o0l6MLn7Q9j25J2J4M5J11j06N0o1K7M6Nj9o6k3J17qL7l4M7j22P1l7N8j09
$$ 83 23 -13 -9 -6 -63 26 -99 -87 -73 -28 83 -23 27 -34 -7 39 44 25 -41 -64 53 45 82 48 95 -27 44 7 65 -44
6281d4J1J17j80J33m3r4J13k1j8Q9n1P8j6m5N1p3m3M2k6J57j28ro5K5N7m8OJ2
$$ -44 -33 84 -96 37 -6 -100 13 -8 -26 63 12 90 74 29 80 7 -36 6 -20 137 9 0 -65 -40 17 -31 -25 -13
6309a3N6nj2o1P4r8L1o7J00Q5j88P2J3N7P2r8o2J30j7j55N9J6N3j14J7M1N0Q5
$$ -13 43 38 26 -35 39 -59 -28 -95 5 90 -98 -26 -13 44 116 18 -44 86 69 -86 -27 -11 42 -72 -55 -14 36 121
6337A21p2p1P1j49J09q7J21q5L1L5j07M1N9k5M6j19J8Q3r7j4J89n9r7P4p6N2J6
$$ 121 49 -22 49 -100 9 -78 43 -42 -11 24 -83 -42 17 -8 38 -81 -63 20 -77 -91 98 39 -58 16 -60 -8 8
6364Hj8r6J06j6J43j39k5N9j1M1J11j14j85J51q3J50p6q3J28j33r2R7R9J1j99
$$ 8 -10 -106 0 -16 127 -12 -37 22 11 52 163 49 -136 15 -68 82 6 -77 51 -82 -174 -77 22 33 -166
6389a66J46R5j39J30p2j09M9j0lJ67j52J08J07j35j1J1p5k6K01r5M9j19L3L8O
$$ -166 -20 75 -64 66 -6 -115 -66 -76 -79 88 -64 44 151 16 5 16 -59 -85 116 21 70 -49 -16 22 28
6414B8J6q1OJ2P6k3L9m4m9L6q4Q7nN2j46R9m1j2J5k9J08l1j7k0O6%j7L9p3j1o3
$$ 28 44 -37 -31 -19 57 34 73 29 -20 16 -68 19 14 66 -80 19 -22 -34 -19 -48 60 29 12 -8 58 58 41 80 7 -4 -67
6445f7J00j14N2rk5k8R1Pj58J81j7ok9K3j6J12j69N5QJ15n6pn1Q1j58J67j31o4
$$ -67 33 -81 -29 -38 -63 -91 0 7 -151 30 13 7 -22 1 -15 97 -72 -17 -9 106 50 43 -8 73 -85 82 -49 -113
6473a13J40j0J1M8k53K48L7j16J6M3j15N8L7j22J00R5p4m9l6r5K48j00M7j43J71
$$ -113 27 17 28 76 -177 71 108 -8 8 51 -64 -6 31 -91 9 104 30 -19 -55 -150 98 -2 45 -98 73
6498G3p2ml9Q0n2m0M3m6K9P3o3m0O8L7j28M6P2J0j22K1N7m7L3j35J14Q6N8o2r4
$$ 73 1 -3 -42 38 -14 -54 -11 -57 -28 45 -18 -58 10 47 -81 -35 37 47 -75 -54 3 -44 -11 -146 -32 54 112 50 -44
6527d4K8Q1r1M9Oo3O8r6J39j03J2J3P1ll8jL7k5k8Q0o1m7M7%q9N1P5q7M7Jl6p5
$$ -44 -16 65 -26 23 29 -34 34 -62 77 -26 -14 -1 70 67 29 28 65 40 12 92 31 -16 31 31 -58 -7 68 -19 28 29 -7 -82
6559h2R2J7J38k24MkOJ37j32jP8n3Om5J03Nq6L3RJL5n7Q6p2J6j8J03K4j41n5J81
$$ -82 10 27 165 -59 -55 -57 -51 86 -46 -47 31 -22 -16 -61 42 47 -39 -6 3 4 39 -18 68 -4 12 -6 97 121 -20 -75 106
6590A06j15M2%m3O9q1P5k7o1R3k2r5JJ05j9J9l5J2l9k2K3m7O3lN7j86J41J37j67
$$ 106 -9 33 33 -10 59 -22 53 26 -35 58 36 -59 -58 47 28 47 12 24 -15 -37 -14 -61 2 -1 56 -130 11 148 -19
6619a9l4O1J7jo6q8J63l0K2o7R5L0J2r0j5j7R6k2p0J3l8N6n8l8k0J37K5J4o2r3
$$ -19 -53 8 25 24 -42 -130 33 3 25 -42 53 83 95 5 -10 -27 69 47 -23 -10 -48 8 -50 -88 -108 29 54 68 6 -87
6649h7J13Q8j15q9J39Rj33J2J7j3MR3q0o0M8Q1qlr5Q9R9j57J18j04J15j27N0L9
$$ -87 26 114 -1 -90 49 58 -75 -63 -46 -59 -55 38 -42 -102 -54 27 19 16 -79 10 109 -48 70 -34 81 -46 4 43
6677D3k6l0rn0J07p2J01o7j13J81j13j5jk8J6Q7j5p3J0J28j09N8nj6P3j53Q8J25
$$ 43 17 -13 -22 -72 35 -37 64 -3 -116 65 -48 -63 -64 -92 -76 11 -4 -77 -67 61 -48 10 5 -11 62 -91 -3 122
6705A22m0o7q4K2P7O5j54K3J9N0p4J26n4lj89J50j2m4K6O7p2M9kl7J41m4j15n5
$$ 122 82 15 -69 -47 30 95 -59 -36 -17 33 -41 85 31 28 -161 -11 -23 -67 -41 26 -46 3 1 -36 105 61 -54 -109
6733a09R3O3j23Q8lR3j15mj8M8k5R9p6L3p5J06j03k4J54L5o6j02M7rn8J23j43
$$ -109 -16 47 -76 12 9 102 -13 -17 -35 13 -12 87 11 44 -31 75 -28 -52 102 137 71 -31 16 7 -51 72 -71
6760g1J27l3J1o6p7J29l3J9j56K34m4r1j6J35k1m7Nl0L2J1l1Q1k3j36Q2p7L3p3
$$ -71 56 23 34 -32 -109 20 -13 6 -150 84 40 -51 -67 68 47 0 5 -25 7 18 -13 68 45 -91 -9 -86 -53 -126
6788a26J33L2q9N3J0O1PJ9j27p0J91Jj98J12P4j15J02j47O4j0%l3M5J1j13J38
$$ -126 7 39 -50 3 13 74 81 100 -27 -97 94 95 -103 9 83 -32 70 -77 -13 -23 -23 -56 -11 0 -113 25
6814B5o2K1K8n9L6L2j07J2M3l1N9P5m7r7lJ05n1LR7j0R9j65K2L7q7O8m9rL0K5
$$ 25 -37 -16 12 -47 -11 21 -86 -74 -31 -62 -3 72 25 -72 -75 30 -21 -18 79 69 168 3 25 62 -25 43 -6 -15 15 40
6844D0k0o9O0K7n9N9j05N7k8QJ3n3O6m5Q6m6oR7j63%j03K31L2r1J13j42j9O1K6
$$ 40 20 -49 11 38 -21 38 -67 -10 -38 -30 -17 -70 -4 -49 37 -9 -15 82 -81 -81 -184 47 79 -12 101 -41 -60 1 27
6873B7Q1Rj85J1R5k0m4rO8l4r3Q3j0J38o6K8j23J52j59l5O3R1q1o0J32j39j4J50
$$ 27 108 117 -68 -57 38 18 -26 -35 33 -1 -94 -11 -21 117 51 79 -44 108 -51 -86 -23 68 -13 -73 59 -80 -94 56
6901E6k9j07k1M6O4J00j67N4j5k7l9O2J39j32k7L9Lp8R1O1l9j9P2m3r1M9q1O8
$$ 56 27 -80 -101 -55 9 109 -58 -4 -19 -46 -85 -23 116 -16 -43 -4 -1 -79 12 73 34 15 87 44 -47 2 -79 -11
6929a1L0J0o1k3Q4n8P2LR6j16L3n3l1M8j70O3N5Q0o3L0l1R1Mj05N6j22P0q3J09
$$ -11 19 29 -32 -55 29 -29 43 46 142 26 59 6 -25 23 -147 -84 -29 51 -12 18 -13 78 82 -23 33 -89 -19 -102 7
6958GLJ9n5J88k18k7J6J29n1N0m3r7R1O1r3L7p7M6r8J35kOj00R9j13J10R8k01
$$ 7 10 29 -26 162 -56 -83 -67 62 11 61 18 -79 12 73 -20 17 -60 -14 -112 23 21 27 -73 26 -87 23 121 -80
6986h0J3J19j43Q4J9K8o4P9n3M5Nj19J79p6o0J11k2J0l7o9P6l0RJ4O2m3n3L9K8
$$ -80 -67 52 -91 -7 12 40 -24 55 2 47 52 -67 112 36 -24 87 65 75 38 -31 45 15 24 38 100 57 4 43 71
7015G1K4j31M9J14n6m4J9j38J26M0j61J11L9j84J20pj0QR9j17M6p5L2NN7k9n4
$$ 71 95 -36 13 127 71 27 46 -92 34 74 -87 24 63 -121 -1 -8 -18 -10 89 -28 18 -57 -25 -20 37 8 -46
7042d6j01J19R8n5L7M2n3l2K2k7Lrpj06J38q4L8J28j05ok0l3J03l8K7m6k8J44
$$ -46 -147 -28 70 15 52 94 41 9 31 4 7 -2 -9 -115 23 -61 -23 105 0 -6 -26 -59 44 6 33 -13 -41 103
7070A03k24K42k05J25M7l5j7l7J02j12l2L4l2L1N4l4K1O7j25J0Pn9R8r4N7o3J56
$$ 103 -121 121 -84 41 88 53 36 -1 101 -11 -43 -9 -41 -10 44 10 31 98 -27 -17 -10 -69 29 -65 -8 -71 85
7097H5p6P6k33J48om0N4k6n5P7L0M2q9M4j23R0P7o8q6l2j5L9J99j66Q2n3j03o
$$ 85 9 85 -148 0 -6 -46 8 -18 -73 4 34 76 -13 31 -92 -2 75 7 -79 -111 -126 -87 112 -54 28 -25 -128 -134
7125a34J02o4P9M3l7mN6k6J07j37M5o8Q1j7l4N2n4p6J5L5O2j26J74r9L6j18O2
$$ -134 -32 -96 -17 26 -11 -15 41 15 122 -15 30 -38 43 26 -8 44 -10 -86 -71 -36 26 -100 74 -25 11 -107 -45
7152d5N4j18O5J05l8p6p6p4N7K47r2M2L0qj42J53j78J13K3j03R2n6K3j20J14J21
$$ -45 9 -109 -44 61 23 -53 -129 -203 -146 101 9 51 81 73 -69 84 -94 19 42 -61 31 -25 -2 -122 -8 113
7178A13j50P4P4j74K6K4k2J56j47l8O0L9J3p0Q5j91P3J09K0k2o1m6Q1j11M0Q8
$$ 113 -37 37 111 -63 -37 -13 -35 121 -26 -64 -4 35 48 -22 63 -128 -55 54 74 52 -9 -55 26 -85 -45 43
7204D3j88J81L2j37Q1j9Ok0O7l7Nl9L4M7j39J4K5P%O4l6Q8k32J45P2J6o0qj21
$$ 43 -145 36 68 -69 12 -7 -1 -21 46 9 14 -25 9 56 -83 -69 -44 -37 -37 27 -9 79 -153 -8 64 80 20 12 -109
7233a09K6R4o3P9n5N5l8j6L0p9J22j26O4LK1l3p3J18j1r2kL5J11m6qM5j09J13
$$ -109 -83 11 -52 27 -28 27 -11 -27 3 -76 46 -80 -16 -13 8 -25 -98 20 9 -83 -85 -50 61 15 7 52 -57 56
7261E6L1l2o7J13n5k1p1J55r0j8j7J2J1r1J71J1j11O8p2k4O7j5J3j1J1j8p4O2
$$ 56 87 55 -12 101 46 25 -46 109 19 1 -16 -4 7 -84 87 98 -13 55 -17 -41 26 11 24 13 24 6 -68 -6
7289fK4M8j6j6o2o1M0M6m4KR2rn7M0K0n0p9O9L3J0L5N8q0p3pO0j05J2J99j47M2
$$ -6 18 66 50 34 -28 -89 -49 -3 -47 -45 47 38 -19 21 41 -9 -88 -19 14 24 59 117 37 -36 -43 17 -88 -76 123 -24 18
7320A8n6R0o3J2l9N8K4j7j51L1J11j45Q3J25n9r1J1J01l7kn1K1N7M9j73L7N4P
$$ 18 -38 52 -11 1 -38 20 44 27 -124 -93 18 -127 -44 81 22 -69 -58 43 6 4 -47 -26 31 80 -93 -56 -2 5
7348EM1j44J54j73J72j03N0K7o5M5M0j04q6J23Q1q5L9n6j8lO5m7K8K4J3p8n9J77
$$ 5 46 -98 56 -117 55 -48 2 29 -36 9 49 -55 -141 -18 63 -22 17 -39 -57 -60 5 -42 -14 10 23 -55 -114 63
7376F3j95J55o8NJ08r1Qj3m9J22P7q6J3n3P9p5J1oo0N4j0P9J4jq6L5o8J5m2N6
$$ 63 -132 23 -45 -40 68 -23 -15 -28 -77 45 122 36 49 -4 75 0 11 5 -55 -1 -11 68 82 81 -5 30 -38 -23 -65 -9
7406iO0k2l2n0JK13k11J8J8j40J49n5J22p0q1J60r1K6j5j06O7Q8L8L3l6k9j05
$$ -9 51 29 -3 -53 -52 161 -50 -32 -14 -154 -5 -60 62 -8 -89 71 -20 6 -9 -115 -48 40 78 111 75 46 -59
7433e9N5J28q2j14N1J02j5M9k7o7n4k9P7q1J5J33j58P4L0M6q1N5N9j56QJ03j16
$$ -59 -4 124 42 -72 -21 81 66 115 88 21 -33 -62 15 -66 -51 82 -76 -2 28 74 -7 48 107 -49 -41 62 -54
7460e4M3%R7j76j9K08j04J2q8O5l1O7J4L1m8ko8o8K83j78PN3k5P3j34J33k3j9
$$ -54 -11 -11 86 -90 -109 99 -5 7 -81 -16 -47 20 34 65 17 15 -53 -121 162 -16 -9 44 19 92 -42 91 68 49
7488D9p1K6L0K2j02O8p0J2mLO3p0J7J51j6q1pO6j01J6o4J04J8j99J77m1nQ3k0
$$ 49 -22 4 34 56 -46 22 -48 -36 -40 -37 26 -44 -27 124 108 27 20 86 -15 1 -63 41 59 -140 37 -4 -9 74 54
7517E4r9j1L9j3p3jK37q4O1q1n2J19r0K1R0o2k1P3j62K3K0kPM2j25M7M9j1o2K7
$$ 54 -45 -56 -17 -30 -103 -104 133 49 110 29 -23 96 6 27 117 55 34 107 -55 -32 -12 -14 -7 35 -90 -43 6 -5 -67 -40
7547d0o7J55o4Q6l6l4l1l3J01J4q2O5o6k1M5O2l7J6R2l4q2j3K0l4J21j46m9J20
$$ -40 -107 48 -16 70 34 0 -31 -64 37 51 -31 34 -32 -53 -8 54 17 33 125 91 9 -4 16 -18 103 -43 -92 28
7575B8J01m9n7q6K3j1q1J26l5oj30K13j5n7k5M1K4K4k8J3J1q2P1j0pqK5j5O9n9
$$ 28 129 80 23 -63 -40 -51 -132 -6 -41 -47 -177 36 21 -36 -61 -20 4 28 0 13 24 -58 13 3 -4 -12 13 -2 67 8
7605HO5k1N1l8k1O7m7l7j14R4M7j09o6J88p4P1p6%n9J27J02k21J11O9k41K01l5
$$ 8 73 52 103 65 44 111 64 27 -87 7 54 -55 -121 67 -7 64 -12 -12 -71 56 158 -63 48 117 -124 77 42
7632D2l3M7j16l3M1j7J06Pk0m0N5j6l4n9P8k1N4O4p0l6o9K5M9K6k2O9p0o7Q0R
$$ 42 9 56 -60 -93 -52 -69 37 44 24 -16 39 23 -11 -70 8 -13 41 105 35 -1 -70 -45 4 30 8 77 7 -60 20 29
7662B9K0j54J53j31kQ1l7N5K9n6n2J22j00J08o7q1O3j1J01o1qK7j02R5J5l0M4
$$ 29 49 -105 48 -83 -85 -4 -41 14 43 -13 -65 57 -43 65 -2 -83 -20 -31 70 9 1 28 -74 21 36 6 50
7689E0K5k0oj18K9L2M6j14R7Q3j5Jk2o4m8J75k06N1m8K57j98r8P9PoM0l8J1M9
$$ 50 75 55 49 -69 -40 -8 38 -76 21 104 89 90 68 4 -44 131 -75 -24 -72 185 -13 -111 -32 -25 -31 9 -29 -18 31
7718C1ML2j09R7m0q3L8m5N5M9k8R3j72J66j12J33p2k5R7j03M1l0M8l6j68R3J34
$$ 31 35 67 -42 55 15 -68 -30 -75 -20 29 1 94 -78 88 -24 109 37 12 109 6 47 17 65 29 -139 -46 88
7745H8K6m6q9O7n1q6J75q4LlPM8Ko6k2L1N5j92J54JK6j42R0jP9j21k2Q9J5lK0
$$ 88 114 68 -21 46 -5 -91 84 0 3 0 7 55 57 -9 -31 0 55 -137 17 18 44 -98 -8 -9 70 -51 -73 16 31 28 48
7776D8J8o9o6L1O1q5M3l3J36j40J15j5r1Q1l5N3LNK1j18kP4K1o5J6lkQ2o9L5j10
$$ 48 66 -3 -69 -38 23 -62 -19 -52 84 -56 59 44 -47 34 -1 52 55 60 81 -37 -39 35 56 -9 7 4 2 84 15 50 -60
7807f0J12j08J29j39Q3J8o9L1q8qM2J14o2m7J34j13Q9k1N4j97J34L7j57O7q4J25
$$ -60 52 -56 73 -66 17 35 -34 -3 -91 -99 -57 57 -5 -52 82 -31 58 37 91 -106 28 65 -92 -25 -109 16
7833A6k7J9J1J16k15P3L3l9o1Q1PR6r5j4k4j1lM7l5R0l3Ln3j8RM1o7J10r9M5n2
$$ 16 -11 8 19 135 -80 -7 26 -13 -74 7 14 110 15 1 -23 -34 -37 10 -25 65 32 35 -18 -36 -27 14 -53 57 -42 3 -49
7864d9O1O1o2Q8j87J57J9m0Op2j03O3j2O5J16j57L8J48j74K1j4O6OKj23J2O3J17
$$ -49 12 73 11 99 -88 69 88 48 54 -18 -121 -58 -70 -5 111 -46 -8 140 -34 -13 -27 39 45 47 -76 -64 -1 116
7892A16k17O6J26k1k3n9n5J63p8J9j45J27L1J8Pj1m8K1o5K4O6nJ8p6k9P9j13L5
$$ 116 -101 -35 91 70 47 -12 -67 96 18 37 -108 19 50 68 75 64 16 37 -28 -4 62 57 75 -1 -30 49 -64 -29
7920b9Q3j02M9j8L9k5r3J60j7j38O2j9J11j68QJ49m1l6P0l2L0k5j13J62p4K1n6
$$ -29 54 -48 1 -17 22 -3 -96 64 47 -91 -29 -48 63 -105 -97 52 11 -25 45 13 43 18 -95 67 -7 14 -42
7947d2J31j16J51j23K0nJ5n5o2N8jN4r7KL1Q9n8j13P2R0k8j50Q7P9M1j5o5O8r8
$$ -42 89 -27 124 1 21 16 31 -24 -86 -28 -29 25 -72 -70 -39 50 -8 -121 -49 41 13 -137 -50 29 70 55 -10 58 -40
7976d0n3R2m0p9J61M2j6K3k1l5M5j03m3J38q9J20o5k0J8p1RJ14j01J05L3k26K92
$$ -40 -93 -1 -41 -120 41 83 67 90 69 34 79 -24 -67 71 -18 102 37 17 35 -36 -27 87 -14 91 124 -102 190
8003A90j40j16Q4Ok7P1p0k2N8n5n2P4J5N5l3m8L1l6m5L9k8J21o0L6n7Q1n0M8j43
$$ 190 50 -66 18 24 -3 68 -2 -24 34 -21 -73 1 16 71 38 -10 21 -15 -60 -21 -49 72 12 48 -9 72 22 70 -73
8032g3P9j6J77j34lj8J0N4J4j33OM7P1L7q6N9k1o1m0q5J18J01j41k9o5O0K31k44
$$ -73 6 -10 167 33 30 12 22 76 90 -43 -37 10 81 118 32 91 70 9 -31 -116 2 103 -38 -67 -132 -72 159 -85
8060h5J54j94J44J4J06k42J67o4LoLM7l4jl0Q8j71J61n7n6J63p5p9N9op4J35m2
$$ -85 69 -125 19 33 139 -103 64 0 3 -3 0 47 13 12 -18 70 -101 60 3 -53 110 35 -44 15 9 -65 70 28
8088B8L6r7m4R5m1Q0l1o5M7M2kk0lO4p0O8L5j52N2p5K0K5o0N7J12q9j10J9J05
$$ 28 64 -33 -77 18 -23 57 26 -39 8 50 48 28 25 89 19 87 122 -30 22 -53 -33 -8 -68 -11 101 12 -98 -79 26
8117B6P0j09N2MK4r1n8N1J7r2J13m3N3k9p4J23p4m2N5k1L7O9j16l6NJ04o5K3R1
$$ 26 96 -13 39 43 67 -24 -82 -31 -14 -106 7 -36 17 -12 -86 37 -37 -79 -24 -45 -8 61 -55 -91 -86 18 -47 -24 67
8146F7j45N9j29J86K0j96J22r6J36m9n9J03o7L0m1k9K13j34O0p8K8J13m2k5j00
$$ 67 -78 -19 -148 38 58 -138 -16 -112 24 -25 -84 19 -48 -18 -59 -88 125 -9 51 -27 1 114 72 47 -53
8171e3J05K4q7l7J0O5Rn2O1J00j46J6o0R6r2J8j3J7M3j10
$$ -53 52 76 -11 -48 -38 27 36 -16 45 145 -1 15 -45 51 -41 -23 -36 -19 24 -86
8191h6
$$ Imaginary data points
##PAGE= N=2
##DATA TABLE= (X++(I..I)), XYDATA
0@%%%%%%%%%%%%%%%qJ6j6J6j6K4l2L2m0M8n6O4p2Q5r3J04j20J37j58J81k03K27
$$ 0 0 0 0 0 0 0 0 0 0 0 0 0 0 0 0 -8 8 -8 8 -8 16 -16 16 -24 24 -32 32 -40 45 -48 56 -64 73 -85 96 -107 120
37A20k56K87l20L56l95M39m87N39n95O58p24P96q78R67j066J175j296J432j585
$$ 120 -136 151 -169 187 -208 231 -256 283 -312 346 -378 418 -460 507 -559 616 -680 752 -833
56h33J758j956K186k457K781l175L668m308N171o407Q340j1796J9852p3870l2534
$$ -833 925 -1031 1155 -1302 1479 -1696 1972 -2336 2835 -3572 4768 -7028 12824 -61046 -93580
71i3580J32276m410j541N4301J2381n0313q585k2740m7217j2453Q057l4848N759
$$ -93580 38696 34286 32745 87046 99427 49114 40529 17789 -29428 -41881 -33824 -68672 -62913
84f2913N5724J6190O920M9030l928l5597K868j9591n4993j0049R332r040L425
$$ -62913 -7189 9001 15921 64951 61023 25426 28294 8703 -46290 -56339 -47007 -56047 -52622
97e2622L0520L4004L1727K2921J541l727l72l8917n3163o628r522l5553J0115
$$ -52622 -22102 11902 43629 66550 68091 64364 63992 25075 -28088 -34716 -44238 -79791 -69676
110f9676L1902J0149K9399L4900L911O916J0062k2802l3720j1445j3142k5299
$$ -69676 -37774 -27625 1774 36674 40585 47501 57563 34761 1041 -10404 -23546 -48845
122d8845N130K4139K381K1128M1012k936j1593J7390j1369l9446k0484j2518j7496
$$ -48845 -43715 -19576 -17195 3933 44945 42009 30416 47806 36437 -3009 -23493 -36011 -53507
135e3507o428J1215J8005K1830L0423J9828J576R379N15k5877j8856j3086k4187
$$ -53507 -59935 -48720 -30715 -8885 21538 41366 42942 52321 52836 26959 8103 -4983 -29170
148b9170j3209K287P846J2783J5600K1001J4172k680q12n475j9031j3449j1567
$$ -29170 -42379 -40092 -32246 -19463 -3863 17138 31310 28630 27818 22343 3312 -10137 -21704
161b1704j3835n11Q759J3749J6410J4740J7700R453o582p366j3625k0490j4179
$$ -21704 -35539 -36050 -27291 -13542 2868 17608 35308 44761 38179 30813 17188 -3302 -17481
174a7481j6144j1706M716P926J2846J8563J3229J5172J0105n853p118r029j5339
$$ -17481 -33625 -45331 -40615 -32689 -19843 -1280 11949 27121 37226 31373 24255 15226 -113
187a13j3867j0256j597L577N058J6123J2820L863J1638J489j3580n288j0162k0146
$$ -113 -13980 -24236 -25833 -22256 -17198 -1075 11745 15608 27246 28735 15155 9867 -295 -20441
201b0441p945j003k30P552J4759J5760R681R913R674p893r940l000j8682j9437
$$ -20441 -28386 -29389 -29619 -22067 -7308 8452 18133 28046 37720 29827 19887 16887 -1795 -21232
215b1232l561n417P5J1883Q605R760J3566Q474J257n700m120o156j5723r242k751
$$ -21232 -24793 -30210 -30135 -18252 -9647 113 13679 22153 23410 17710 13590 7434 -8289 -17531 -20282
230b0282k669R664J0147L323J3059J0875p18j788p422j0575r026j3229r234j372
$$ -20282 -22951 -13287 -3140 183 13242 24117 23399 21611 14189 3614 -5412 -18641 -27875 -29247
244b9247M155J0796Q840R658J5057N538J454J411j1542j1380o863j3208p461J141
$$ -29247 -25092 -14296 -5456 4202 19259 24797 26251 27662 16120 4740 -2123 -15331 -22792 -21651
258b1651K470Q520R265P775Q459L231J429m067j2878p360o582j0407P05M778M342
$$ -21651 -19181 -10661 -1396 6379 14838 18069 19498 15431 2553 -4807 -11389 -21796 -21091 -16313 -11971
273a1971J2317R790N837P901R27m958q122j1835r163j0316p552M681M861M981
$$ -11971 346 10136 15973 23874 24801 19843 11721 -114 -9277 -19593 -27145 -22464 -17603 -12622
287a2622J1974Q366P962P350l941n146m565j0979q941o391j847O006L943N596
$$ -12622 -648 7718 15680 23030 19089 13943 9378 -1601 -10542 -16933 -18780 -12774 -8831 -3235
301c235J0317M789N151K225p554o183p256j0476m281l507J28R193O980P305R109
$$ -3235 7082 11871 17022 19247 11693 5510 -1746 -12222 -16503 -20010 -19882 -10689 -3709 3596 12705
316A2705L963M961Q3r405p301p636q478l276m272R86Q985N096N922P080K199L573
$$ 12705 16668 21629 21712 12307 5006 -2630 -11108 -14384 -18656 -17670 -8685 -3589 2333 9413 11612 15185
332A5185k046q929m896n300n538p38j191M159Q071L777O854N443j062l1n040q792
$$ 15185 13139 4210 -686 -5986 -11524 -12262 -13453 -9294 -1223 2554 9408 14851 13789 13758 8718 -74
348g4m787p133m943J775N68M504P558N704Q819M397k134m6m711p561m587o636
$$ -74 -4861 -11994 -16937 -15162 -14594 -10090 -2532 3172 11991 16388 14254 14208 9497 1936 -2651 -9287
364i287k585J544p58N108O814L526O408J883k978k151o883o145j574m612j549
$$ -9287 -11872 -10328 -11086 -5978 836 4362 10770 12653 9675 7524 641 -5504 -7078 -11690 -13239
379a3239K820L341P697N198L331O713l66n079l933q283m895j325n649o23M049
$$ -13239 -10419 -7078 619 5817 9148 15861 15495 10416 6483 -1800 -6695 -8020 -13669 -14292 -10243
394a0243L686P334N635K990L583j372l424n002q150j717l45m598J643M235L773
$$ -10243 -6557 777 6412 9402 12985 11613 8189 3187 -4963 -6680 -7025 -11623 -9980 -5745 -1972
409a972Q464L082o25K811k862o488m687n350k063j390o24L899L129O136Q545N34
$$ -1972 6492 9574 8949 11760 8898 2410 -2277 -7627 -9690 -11080 -11704 -7805 -4676 1460 10005 10539
425A0539L70J728n883m229k803o944p63J019k537L300O191M300K395J035J682
$$ 10539 10909 12637 6754 2525 -278 -7222 -7985 -6966 -9503 -6203 -12 4288 6683 7718 9400
440I400l262o950j074l340m428J980k056O62J0472K892n18O875J682m616l095
$$ 9400 6138 -812 -1886 -5226 -9654 -7674 -9730 -9068 1404 4296 3778 10653 12335 7719 4624
455D624l483m321l513m50j615k991O699P276j975M419N685m656k83Q8q112j475
$$ 4624 1141 -3180 -6693 -7143 -8758 -11749 -5050 2226 251 4670 10355 5699 5416 5504 -2608 -4083
471d083K115m540j610M633M169J265K788M236k517k881K414o312n986K743m193
$$ -4083 -1968 -6508 -8118 -3485 684 1949 4737 8973 6456 3575 5989 -323 -6309 -3566 -7759
486g759k958O491N91R06Q148J968j578J385j28l767l474k44l600n268M163K691
$$ -7759 -10717 -4226 -3635 -2729 5419 7387 5809 7194 7066 3299 -175 -419 -4019 -9287 -5124 -2433
502b433l067O651M519m248L621J521p055j29J970n412l550J505K511O89L323M617
$$ -2433 -5500 1151 5670 1422 5043 6564 -491 -620 1350 -4062 -7612 -6107 -3596 -2907 416 5033
518E033r50J244M080n841m076L922m923n568J566j330L40M471J871K087K454Q81
$$ 5033 4083 5327 9407 3566 -510 3412 -1511 -7079 -5513 -6843 -6503 -2032 -161 1926 4380 5261
534E261j62j927l42j755m500M03j48k594L850K854K92M051m1k185J750k125l851
$$ 5261 5099 3172 2830 1075 -3425 -3022 -3170 -5764 -1914 940 1232 5283 5242 3057 4807 2682 -1169
551a169j992l215j89J178K4K373K982L552K501j808J262J640n327k434r47m376
$$ -1169 -3161 -6376 -6565 -5387 -5363 -2990 -8 3544 6045 4237 5499 7139 1812 -622 -1569 -5945
567e945N41J790j37K885J642J027K776o77j220n57k611j579k792k376L441K238
$$ -5945 -5404 -3614 -3751 -866 776 1803 4579 3902 2682 2125 -486 -2065 -4857 -7233 -3792 -1554
583a554J025L154J095J931J246l066K90j112o150q61l41l391K078M117J234J518
$$ -1554 -529 2625 3720 5651 6897 3831 4121 3009 -3141 -4002 -4343 -7734 -5656 -1539 -305 1213
599A213J408K152m20j521J077l641m043K030j349k035M230J157P41L433p38j293
$$ 1213 2621 4773 4353 2832 3909 268 -3775 -1745 -3094 -5129 -899 258 999 4432 3694 2401
615B401N34j505k323l157j009J104j315J286L218L82L400K328k016J638l25m211
$$ 2401 2935 1430 -893 -4050 -5059 -3955 -5270 -3984 -766 -384 3016 5344 3328 4966 4641 430
631D30J28j367m010J268J811j15L16J565K255j25r7J623l535k332K409l100k244
$$ 430 558 -809 -4819 -3551 -1740 -1855 -1539 26 2281 2156 2059 3682 147 -2185 224 -2876 -5120
648e120M421N08m34K741L7M26J678r8j688k755p44p96l374J459K256k063K584
$$ -5120 -699 -191 -625 2116 2153 2579 4257 4159 2471 -284 -1028 -1824 -5198 -3739 -1483 -3546 -962
665i62K720k013J944J845j149j12j641k184J92k44N39N4k00K476j65p44K058j163
$$ -962 1758 -255 1689 3534 2385 2273 632 -1552 -1360 -1604 -1065 -1011 -1211 1265 1100 356 2414 1251
683A251r54J242l708j642K411j024Q5J550L89J392J333P81M03j514L95o71l567
$$ 1251 297 1539 -2169 -3811 -1400 -2424 -2339 -789 -400 992 2325 3106 3509 1995 2390 1719 -1848
700a848P44M09k860K086J135k450K377K737o66l26k09j79p84j296R96r53q42K855
$$ -1848 -1104 -695 -3555 -1469 -334 -2784 -407 2330 1664 1338 1129 950 166 -1130 -134 -1087 -1929 926
718I26j180q49L610l59j231J352k050j919N23r55j94o51L08J789j25J519K452
$$ 926 -254 -1103 2507 2148 917 2269 219 -1700 -1177 -2132 -2326 -2977 -2669 -880 -1005 514 2966
735B966j226J191J101l478n61N03j789L57o32j364J997Q94L06O45q8J202r20k376
$$ 2966 1740 2931 4032 554 -7 496 -1293 -936 -1568 -2932 -935 -41 265 910 822 2024 1104 -1272
753a272J046p02j093J834p62n45K784K72M71J037j375j26p54j662k83j520k64
$$ -1272 -226 -928 -2021 -187 -949 -1494 1290 1562 2033 3070 1695 1569 815 -847 -1130 -2650 -2914
770b914J866j290O23K287k0J598Q53k049K74k4j534k09j016K2J228j061R31J432
$$ -2914 -1048 -2338 -1715 572 552 2150 3003 954 1228 1204 -330 -539 -1555 -1533 -305 -1366 -435 997
788I97p30J042O8j989L45o90j011J255j209k76J862N03J269N89p06J647m53k142
$$ 997 267 1309 1377 -612 -267 -957 -1968 -713 -1922 -2198 -336 167 1436 2025 1319 2966 2513 371
806C71K29j072n87O89j887j14J695J77J236J10n60J253q89q61P82j291k3Q73j397
$$ 371 600 -472 -1059 -370 -2257 -2371 -676 -499 737 847 287 1540 651 -210 572 -719 -742 131 -1266
825a266P02J492m35J409J06j344J08j070j77k3j902J08R15j077J559Q15N7K312
$$ -1266 -564 928 493 1902 2008 664 772 -298 -475 -498 -2400 -2292 -1377 -2454 -895 -80 -23 2289
843B289j48j518P07n79l05P8j538oL18n28J396L3j48J410j105o91N46j518N63
$$ 2289 2141 623 1330 751 446 524 -1014 -1020 -702 -1230 166 199 51 1461 356 -335 211 -1307 -744
862g44O89j634M91Q12L76J669k30k54J221q95o43k96j357M80m13j613J039J87
$$ -744 -55 -1689 -1198 -386 -10 1659 1429 1175 2396 1501 858 562 -795 -315 -728 -2341 -1302 -1115
880a115Q4J899m77l39J085j036K25M71j411K12N1m90Q00J2M16J201r83j44Q5j394
$$ -1115 -1031 868 391 52 1137 101 326 797 -614 -402 -351 -841 -41 -29 387 1588 605 461 546 -848
900h48J049j43k245Q83K26l16J436l24N20J302n56j77R2m50P96j014j240Q04p26
$$ -848 201 58 -2187 -1304 -1078 -1394 42 -282 238 1540 984 807 899 449 1245 231 -1009 -205 -931
919i31J19J365q09L08R60j310O56L32j650Q33K34j067K01k20J197Q34p46N87o5
$$ -931 -812 553 -256 52 1012 -298 358 690 -960 -127 107 -960 -759 -979 218 1052 306 893 828
938H28m35J041j167j380J509j136j267J547l09j47J191o2q4j64K81R31j116o89
$$ 828 393 1434 267 -1113 396 -740 -2007 -460 -769 -916 275 213 129 -35 246 1177 61 -628
956f28P81j320N86J191j376Q16J189j242L38N6o44Q66m14j087L5m58R72O71p86
$$ -628 153 -1167 -581 610 -766 50 1239 -3 335 391 -253 613 199 -888 -853 -1311 -339 332 -454
975d54R51K71l67N75o69j19J085j566k96P11j257N14J258o68j96L97P0L46p57
$$ -454 497 768 401 976 307 188 1273 -293 -589 122 -1135 -621 637 -31 -227 170 240 586 -171
994a71J70L02j119P74j03j237J659P00j532Q31K66n43O75l34n93m2n36O64j26
$$ -171 -1 301 -818 -44 -147 -1384 275 975 -557 274 540 -3 672 338 -255 -297 -833 -169 -295
1013b95p53J406k13p13R98q7j75Q11q68P5l50j079J407K50j178O66P3k39R72m82
$$ -295 -1048 358 145 -568 430 343 168 979 111 186 -164 -1243 164 414 -764 -98 -25 -264 708 226
1033B26K7N16n82l67m69j89J553q19n63J319o70n09J652m87n16L04m22k08n76
$$ 226 253 769 187 -180 -649 -838 715 -104 -667 652 -18 -527 1125 638 122 426 4 -204 -780
1052g80jJ082o34nQ14j053K01J539p28l95J12n14L36o57q2Q24l73J27O45q46M37
$$ -780 -781 301 -333 -338 476 -577 -376 1163 435 40 152 -362 -26 -683 -765 59 -314 -187 458 -388 49
1073D9R63r58j46J00k24K74n44L56L72j031Q80J167j643M56J044j184r5J68j79
$$ 49 1012 54 -92 8 -216 58 -486 -130 242 -789 91 1258 -385 71 1115 -69 -164 4 -175
1092a75J67k72K39k28o13J535J39j324J064J27j308O25J72p91O31N5j63j19l67
$$ -175 -8 -280 -41 -269 -882 653 792 -532 532 659 -649 -24 148 -643 -12 43 -120 -239 -606
1111f06J269k91m52Q81p74q96J345o70o15O08j61L22j94n67J192L45m84M02p98
$$ -606 663 372 -80 801 27 -869 476 -194 -809 -201 -362 -40 -234 -801 391 736 252 654 -144
1130a44j07O48o32K4K2k95P76j72o47J132M0p20N89n35m51O19j76j82l5N9O58
$$ -144 -251 397 -235 -211 -189 -484 292 120 -527 605 645 -75 514 -21 -472 147 -29 -211 -246 -187 471
1151D71k87mQ66j021j02J094j546m77J177l19l73j4K31P05k81J28L60q40K44M21
$$ 471 184 180 1046 25 -77 1017 -529 -1006 171 -148 -521 -535 -304 401 120 248 608 -232 12 433
1171D33r80L60M35r01O42J16m19P53j79J94k44q35M66N17j006M11J45m55N36J28
$$ 433 -547 -187 248 -653 -11 105 -314 439 260 454 210 -625 -159 358 -648 -237 -92 -547 -11 117
1191A17j02M19j51L78k07j036O95L25q86N54j88m59P41r1l9L96m12j2Mn93N95
$$ 117 15 434 283 661 454 -582 113 438 -448 106 -82 -541 200 109 70 466 54 42 46 -547 48
1212D8j69k06Q55r60j92J135j57k16J89o56M30O3p31N09o4k03M83m70l9O18l41
$$ 48 -121 -327 528 -432 -624 511 354 138 327 -329 101 164 -567 -58 -122 -325 158 -312 -351 267 -74
1233g4L12j8r48R83j0o09Q00m03l22N52k76MK82k62L24k57n14L93J4k9M48r37
$$ -74 238 220 -728 255 245 -364 436 33 -289 263 -13 -9 273 11 335 78 -436 -43 -29 -58 390 -547
1255e47J29J014o77nN43m24J81j35k25L53j30J64R8q39L60M11n66M02N2o06M95
$$ -547 -418 596 -81 -86 457 33 214 79 -146 207 77 241 339 -500 -140 271 -295 107 159 -447 48
1276D8j7l86N38l23k8L95m73p1M36j55M16k06o21O62r8j27K34n25J59K53o21L89
$$ 48 31 -355 183 -140 -168 227 -246 -317 119 -36 380 174 -447 215 117 -10 224 -301 -142 111 -510 -121
1298a21K39k89M14p3m66N36Lo0K67p09J36L39k85J36p7j17L60j47l15M14k00O5
$$ -121 118 -171 243 170 -296 240 243 183 450 -259 -123 216 -69 67 -10 -127 233 86 -229 185 -15 50
1320E0J68o63K11L25j41K25j23l18O99l76J08J22k68L7n5n33L44R7k11N96k85
$$ 50 218 -445 -234 91 -50 175 52 -266 433 57 165 287 19 56 1 -532 -188 -91 -302 294 9
1341Il13M12j33R0J66n49K09O4k40L93j65L4N77n86j56O69m99J76O6o29K22J56
$$ 9 -304 108 -25 65 231 -318 -109 -45 -285 108 -57 -23 554 -32 -188 481 -18 158 224 -405 -183 -27
1363b7k22L47j30J21J92l58J79J33k98L79j13o48M69N5n9M08m87qL59k87j61l
$$ -27 -249 98 -32 89 281 -77 102 235 -63 316 203 -445 24 79 20 428 -59 -67 292 5 -156 -159
1385a59r8L27j84k93M18j83K29L25o80K23K95k99K46N0l51K34j35k54M03l18L33
$$ -159 -257 70 -114 -407 11 -172 57 382 -298 -75 220 -79 167 217 -134 100 -35 -289 114 -204 129
1406A29J43m56k8J90j95N15l16l20M51j61K05lj0M89o45j30J46k79L07K94l10
$$ 129 272 -184 -212 -22 -217 298 -18 -338 113 -48 157 154 144 633 -12 -142 4 -275 32 326 16
1427A6m20M19j79K77O5l56K01J03l74M19j69k42M88k73k18J73j86K95K06m81p5
$$ 16 -404 15 -164 113 178 -178 23 126 -248 171 2 -240 248 -25 -243 -70 -256 39 245 -236 -311
1448c11L54j41J76j71m5L22l65Q3J82r2M5k4j49PP6p9L59j21k74K07l0J61J3l84
$$ -311 43 -98 78 -93 -138 184 -181 -98 84 -8 37 13 -136 -129 -53 -132 227 106 -168 39 9 170 183 -201
1472b01K29N4k49K83k21l3N00l34j47K11k16K84n3l32K36p6n2K33k86K32K33m32
$$ -201 28 82 -167 116 -105 -138 362 28 -119 92 -124 160 107 -225 11 -65 -117 116 -170 62 295 -137
1494a37o8K24j99J70J43l83J64j30Q5L84l11o0K83k83N1ko1K39j45j39K79j62
$$ -137 -205 19 -180 -10 133 -250 -86 -216 -131 253 -58 -118 165 -118 -67 -69 -130 109 -36 -175 104 -58
1516e8K39Q1m58J86R2j28k3J07p0J03j46N8K23l12K96O7l14J67j59j29N69j93
$$ -58 181 262 -196 -10 82 -46 -69 38 -32 71 -75 -17 206 -106 190 257 -57 110 -49 -178 391 198
1538A98n08K80P6k18K44j00J59kj94J57k64J0N13l39k68L32j21l6K29k56LJ01
$$ 198 -310 -30 46 -172 72 -28 131 129 -65 92 -172 -162 351 12 -256 76 -45 -81 148 -108 -105 -4
1560dj81J56o7j6L32k62lO8k03K91M7j91K7Q9k46L69j23k51N17k28k31K81k32
$$ -4 -185 -29 -96 -112 220 -42 -45 23 -180 111 158 -33 -6 83 -163 206 83 -168 349 121 -110 171 -61
1583f1J34O8q3O5k67P9L49k84k0J68k46K08l1j85J02J08pnk41mL03k32k9q7J7
$$ -61 73 141 58 123 -144 -65 284 0 -20 148 -98 110 79 -106 -4 104 97 92 -149 -153 150 -82 -111 -198 -181
1608a81L00J5k93L31j05l2J0k39K29K31k36j99J60j66K20Pj15J39p1n2J56k13
$$ -181 119 134 -159 172 67 35 45 -194 35 266 30 -169 -9 -175 45 52 -63 76 5 -47 109 -104
1630a04J05J26k84J19j7j45L49N2k59P0j26R6K63k66J34j74j08L20j79p0K34j
$$ -104 1 127 -157 -38 -55 -200 149 201 -58 12 -114 -18 245 -21 113 -61 -169 151 -28 -98 136 135
1652A35j82j0m9J21R7k07K46k53k9L26j18o1J63j96jJ76l32J81Kj48J6J9j9K30
$$ 135 -47 -57 -106 15 112 -95 151 -102 -131 195 77 16 179 -17 -18 158 -174 7 9 -139 -123 -104 -123 107
1676A07m0j27J32j24kJ63k34K77k59P1K00k87J27J48p4p8O3j82L5N7R1j39j2Q5
$$ 107 67 -60 72 -52 -54 109 -125 152 -107 -36 164 -123 4 152 78 0 63 -119 -84 -27 64 -75 -87 -2
1700bJ73j44r5R7p1O2J02l10K57O7j21m2K48M7j52j38K7K20k43nL7l15K84Q9j45
$$ -2 171 27 -68 29 -42 20 122 -188 69 136 15 -27 221 268 116 -22 5 225 -18 -23 14 -301 -17 72 -73
1725g3pn8J43K4Q7j23J82k85K12j8j89N9Q0j13Q6L4j04J00l3P0m6j41K56k17n0
$$ -73 -80 -138 5 29 116 -7 175 -110 102 84 -105 -46 34 -79 7 41 -63 37 4 74 28 -113 143 -74 -124
1750a24K57j63L0J92j32MN3m2O1k3l37J29J40J5oj62J52J7j15Q0l9j05K16k17
$$ -124 133 -30 0 192 60 64 117 75 136 113 -224 -95 45 60 54 -108 44 61 -54 26 -13 -118 98 -119
1774a19l3J29J37m6m9j43O5J27j16J34k03OJ23j71J50J33k62K51j0j81J2J49J8
$$ -119 -152 -23 114 68 19 -124 -59 68 -48 86 -117 -111 12 -159 -9 124 -138 113 103 -78 -66 83 101
1797A01lj08o5K20j10L9K3j92N4J74j72J10r7J0qOk7J22n3pK7n3J2Nj62K06o9
$$ 101 98 -10 -75 145 35 74 97 -95 -41 133 -39 71 -26 -16 -24 -18 -45 77 24 17 44 -9 3 8 -154 52 -17
1824a7r5J42r0N6Q3p3N0Q2k89P3P4l0J61j50m2N4J2l7O5J1Q5j01k82K51L3o5J39
$$ -17 -112 30 -60 -4 79 6 56 138 -151 -78 -4 -34 127 -23 -65 -11 1 -36 29 40 125 24 -258 -7 26 -39 100
1851A00j66j02J57o4J37o6j19K08j76R9k1j1J5R7l5n9j8KN3j47L5R3k2q0R0l3
$$ 100 -66 -168 -11 -75 62 -4 -123 85 -91 8 -13 -24 -9 88 53 -6 -24 -22 31 -116 -81 12 -10 -90 0 -33
1877c3J4KK8l4QpP1j20j02J24Q0q6J01k1r5M5m0J14L2r1J05k04oN4J9P1J00j99
$$ -33 -19 -17 11 -23 -15 -22 49 -71 -173 -49 31 -55 46 25 -70 -25 -65 49 81 -10 95 -109 -115 -61 -42 29 129 -70
1905g0J20L6j44K01j17j28L5O1n5N2K0L5L8r7lJ24m3J17P9j99j7j32J45J62k43
$$ -70 50 86 -58 143 26 -102 -67 -6 -61 -9 11 46 84 -13 -16 108 65 182 261 62 45 -87 58 220 -23
1930b3j0J00j17M6Rq2J85j24j85J80L1j6M5n2LL6j45N3J01k06K15o8k8M7L0J46
$$ -23 -33 67 -50 -4 5 -77 108 -16 -201 -21 10 -6 39 -13 -10 26 -119 -66 35 -171 44 -24 -52 -5 25 171
1956A71k3k02NJ15j07J27j00K0Kk4l9M9j13J68N1l0o8Q0J8q2Pj47J96j71J53p1
$$ 171 148 -54 -49 66 -41 86 -14 6 8 -16 -55 -6 -119 49 100 70 2 82 100 18 25 -122 74 -97 56 -15
1982a5k5%r2J7K58j57k3J5qm3K6p7J55l7r4J56j21L7l3R4l0J19j28L9J7j04J94
$$ -15 -40 -40 -132 -115 143 -14 -37 -22 -30 -73 -47 -124 31 -6 -100 56 -65 -28 -61 33 3 122 -6 33 50 -54 140
2009A40q5j13L6l5K5J52q2p6O8m8rl2P6P0k0j31K1m4R1k1j02K6Q8P8j26K1j1J08
$$ 140 55 -58 -22 -57 -32 120 38 -38 30 -18 -27 -59 17 87 67 -64 -43 -87 4 -17 -119 -93 -5 73 -53 -32 -43 65
2037F5p4j1O1j07J33M1j19k5K9p0K4P7q0J29j86J30M4j32L2J82j43J4j4j14J37
$$ 65 -9 -20 41 -66 67 108 -11 -36 -7 -77 -53 24 -56 73 -113 17 61 -71 -39 143 0 14 0 -114 23
2062B3j72J5J96j5j22K30k34J00J29k95J56j6m4R9qMK3K8j26k1k5J49l5j62J78
$$ 23 -149 -134 62 47 -75 155 -79 21 150 -145 11 -5 -49 50 42 46 69 97 -29 -50 -75 74 39 -123 55
2087E5p1l3J0P3m1p0L0rO7mO6j26pJ8J21j18J40j34mn2P7J1j2J5%r3K9K62j70
$$ 55 -16 -49 -39 34 -7 -77 -47 -56 11 7 73 -53 -60 -42 79 -39 101 -33 -37 -89 -12 -1 -13 2 2 -91 -62 200 30
2116C0j26J58q9Pk0j1J08j02L4O6j85J35J64j55M2n2p7K1J26p7o2O4k9R1j01P1
$$ 30 -96 62 -27 -20 -40 -51 57 -45 -11 55 -130 5 169 14 56 4 -73 -52 74 -3 -65 -1 -30 61 -40 31
2142C1n5L3Mn1l1j8J27kjp1J87j41m3j6J43j54J36j04lJ0j6m4P0Q2j02k2K08j05
$$ 31 -24 9 13 -38 -69 -87 40 38 37 -34 153 12 -31 -47 96 -58 78 -26 -29 -19 -35 -79 -9 73 -29 -51 157 52
2170E2J6N9j26k0nm5p2J65K3oL1o9j24P6J03j9Qj10OJ6J76j36k4L9l2l0k9J71
$$ 52 68 127 1 -19 -24 -69 -141 24 47 41 72 3 -121 -45 58 39 47 -63 -57 -41 135 -1 -25 14 -18 -48 -77 94
2198I4k8o6L5o0k2rJ11r8l3P7q2k6P8Q2j33K0J84k7m5j14l4K10n4k06K14Kj28
$$ 94 66 0 35 -25 -47 -56 55 -43 -76 1 -81 -107 -29 53 -80 -60 124 97 52 -62 -96 114 60 -146 68 70 -58
2225e8Q0jLQ3r4M1o3j21J56oO3n7q0k4R9N5r5O2n3Q5L2j94L4k8M4O0j09O2M5l6
$$ -58 22 21 24 107 13 54 -9 -130 26 20 83 26 -54 -78 21 76 -19 43 -10 75 107 -87 -53 -81 -37 23 -86 -24 21 -15
2255a5R7q7LM2j8j0qj23R8lq6R8k4O4o4m6k0Q4K5J20r7p5M6O3m0p3m7P6J14j94
$$ -15 82 -5 -2 40 22 12 4 -119 -21 -24 -110 -12 -36 28 -36 -82 -102 -18 7 127 30 -45 1 64 24 -49 -96 -20 94 -100
2285a00J63k3J6j40J05Po4N3j8N2P0j19j11J86j68J05o8K8M1j2j2M9p7J07k8m6
$$ -100 63 40 56 -84 21 28 -36 17 -1 51 121 2 -109 77 -91 14 -54 -26 15 3 -9 40 -37 70 42 -4
2311dO8j17rJ01j08kJ80r5m7N9l0J10k57J70l7O2k7j65P4R5p9J53j33RJ9LQ1L
$$ -4 64 -53 -62 39 -69 -71 109 14 -33 26 -4 106 -151 19 -18 44 17 -148 -74 21 -58 95 -38 -29 -10 -7 74 77
2339G7j5%l1n0L7K7m5l7J16o7J0J21q2Kr0l9O5k4r4J60Q8j47k0J08r9m6J96k35
$$ 77 62 62 31 -19 18 45 0 -37 79 12 22 143 61 63 -27 -66 -1 -25 -119 41 129 -18 -38 70 -29 -75 121 -114
2367a14J39M8m0J48j93jjK9J4k6n7J32j40J1j9J1J19n7J5r8R4J5j7j25J24o7J94
$$ -114 25 73 33 181 -12 -13 -14 15 29 3 -54 78 -62 -51 -70 -59 60 3 18 -80 14 29 12 -113 11 -56 138
2394A38k37n3J20Mk2j14L12k5j04J0q6j9N5r4J30j5j00L8P8o2P0r6K40k80l9J22
$$ 138 -99 -152 -32 -28 -50 -164 148 123 19 29 -57 -76 -21 -115 15 0 -100 -62 16 -46 24 -72 168 -112 -151 -29
2420b9L9n3M5j2P5K7m2J4k1Qo3k2P2k2l9P0j08M8O0m9j7PM4n0j36J04Lo5J09L2
$$ -29 10 -43 2 -10 65 92 50 64 43 51 -12 -34 38 16 -23 47 -61 -13 47 -2 -19 -12 32 -18 -154 -50 -47 -112 -3 29
2450B9k8n4M9NjJ8m6N6o0K2qK4Q4o2N5j71Q1L1o0m3J13m1K4OJ0l1m8l4N1n3R2
$$ 29 1 -53 -4 1 0 18 -28 28 -32 -10 -18 6 90 28 83 -88 -7 24 -36 -79 34 -7 17 23 33 2 -46 -80 -29 -82 10
2481A0K9o3M8n7NL0j2K3O8n8p6J46Nj18J10j38R8L4q5M6j10J17m7q0J25l0p9j7
$$ 10 39 -24 24 -33 -28 2 -10 13 81 23 -53 93 98 -20 90 -48 50 84 -1 45 -65 52 5 -75 50 20 -59 -76
2509g6M1k4R8j01J44Lo2jp1J3Q2J4j3j00K7q8J23R8p9qP6q6K0m6m2J09l0q5J03
$$ -76 -35 -59 39 -62 82 85 23 22 -49 -36 46 60 47 -53 -26 -114 9 107 28 20 96 10 30 -16 -58 51 21 -64 39
2538C9M5j4q8j7L4M0k2l0P5q9J21o2j44P7M4j3j2l6Q2q1JL6J03Oo4j1k3J04j44
$$ 39 84 70 -18 -35 -1 39 17 -13 62 -27 94 32 -112 -35 9 -4 -16 -52 30 -51 -50 -14 89 95 31 20 -3 101 -43
2567d3l6O7Q7p5j0j0Q7j25M7Lk2j8P3l9J2R6r5j6K5pJ2l2J9p5qP4p1L2PM1J00
$$ -43 -79 -12 75 0 -10 -20 67 -58 -11 -8 -30 -48 25 -14 -2 94 -1 -17 8 1 13 -19 0 -75 -83 -9 -80 -48 -41 0 100
2598A00j58L5P7r1l3P5R0p9M5j10N9j5m7J4l6L4J05mj12M6O2j19Q7q3M6j12J34
$$ 100 -58 -23 54 -37 -70 5 95 16 61 -49 10 -5 -52 -38 -74 -40 65 61 -51 -5 57 -62 25 -58 -12 -124 10
2625A0n4m7R7q9J95j87P6qj0M3o2O2L5j42P0N6o5Op3R6n2K0Q3j4J0j81P8O1J9
$$ 10 -44 -91 6 -83 112 -75 1 -7 -17 26 -36 26 61 -81 -11 45 -20 -14 -87 9 -43 -23 60 46 56 -125 -47 14 33
2654C3j19J68q4J54j96RJ27p3r6J71j93N6O6J35j08j16J18o4nR8o1k6mj35R8O4
$$ 33 -86 82 -2 152 -44 -35 92 19 -77 94 -99 -43 23 158 50 -66 52 -12 -17 81 20 -6 -10 -145 -47 17
2680A7N6Q4k18PL7l2J05j42P1K0N6mp6j08J09J2M1j5q5j9K33j17L0j28Q9j16J27
$$ 17 73 157 -61 -54 -17 -49 56 -86 -15 5 61 57 -19 -127 -18 -6 35 20 -65 -84 149 32 62 -66 23 -93 34
2707C4p3j26J12N8N7j0m6Jo9L5J9m4p2M1L9K2J18j48J35j6j08J24P7j78J4m8J33
$$ 34 -39 -165 -53 5 62 52 6 7 -62 -27 -8 -52 -124 -83 -44 -22 96 -52 83 67 -41 83 160 -18 -4 -52 81
2734H1j05L7O1Lj12n7J22M7q4k0K9m8O4p8O8j35R4k4M2M9mk4K2k6n%J15j67L9
$$ 81 -24 13 74 77 -35 -92 30 77 -7 -27 2 -46 18 -60 8 -127 -33 -57 -15 34 30 6 28 2 -3 -3 112 -55 -16
2763a6m9nj7J47j7M1j30k9J06q2L6P5p5J0j1K9L0m5j0L4N5j07Q5j42K1mp2J51
$$ -16 -65 -70 -87 60 43 84 -46 -75 31 -51 -15 60 -15 -5 -16 13 43 -2 -12 22 77 -30 55 -87 -66 -70 -142 9
2791IN9j65N0J21n4j00L4r9M3J63j24L7K2rro7j3R4j2Lo2M3KR0L6n5rj14J13k5
$$ 9 68 -97 -47 74 20 -80 -46 -145 -102 61 -63 -26 -4 -13 -22 -89 -102 -8 -20 -17 -79 -36 -34 56 92 37 28 -86 27 2
2821BqNL3j43R9R6n3n4J4jn5P7n7P6N9q0j6m0PP0j03R9Rj21J05j06J26oj50Q9
$$ 2 -6 -1 32 -111 -12 84 31 -23 -9 -10 -65 12 -45 31 90 10 -6 -46 -39 31 -72 27 36 -85 20 -86 40 34 -116 -27
2851b7O6j0p8O2jJP6j07R3N9j01K4j32K9J05q7l1J29j20J1jJ28j46O9q8J06Q6
$$ -27 39 29 -49 13 12 13 89 -18 75 134 33 57 -75 -46 59 -28 -59 70 -50 -39 -40 88 -58 11 -77 29 115
2878A15l7nl3o1l5N8j0K8k0K5l4J20j60N5l7J3O6o8L9q9J27j76J44p6J1J4k2O5
$$ 115 78 73 40 -21 -56 2 -8 20 0 25 -9 111 -49 6 -31 -18 48 -20 19 -70 57 -119 25 -51 -40 -26 -48 17
2906A7m8kn0R9J13k29J4OQ3m5J2L8j0j06J73J5j22J39qj37N3o4K2K7o1K7k1L0
$$ 17 -31 -33 -83 16 129 -100 -86 -80 3 -42 -30 8 -2 -108 65 80 -42 97 89 -48 5 -59 -37 -10 -71 -44 -65 -35
2934c5l0R4jJ28j47r2J28j06P1J09j75R3K7k9K6j06N3nnj6J16j27q0J06l2J15
$$ -35 -65 29 28 156 9 -83 45 -61 10 119 -56 37 64 35 61 -45 8 3 -2 -18 98 -29 -109 -3 -35 80
2960H0k01J33m2K0L1j5k3P0o8m7R5m4MOk0P1L7M1j80J25j31L5k9J00l9p4Q0M1
$$ 80 -121 12 -30 -10 21 6 -17 53 -15 -62 33 -11 -7 -1 -21 50 87 128 -52 73 -58 -23 -52 48 9 -65 15 56
2988E6j0j83K56j06l5M2p4L7j2m6J20j7j1j4p1R8Pk4l3O8j32K1J25K9r7K2l9p1
$$ 56 46 -137 119 13 -22 20 -54 -17 -29 -75 45 28 17 3 -68 30 37 13 -20 48 -84 -63 62 91 -6 16 -23 -94
3016i4R7p0j2J39jo9oR9j54R5j5j2N5j69J23M1RO4q3m9PJ16o8J7j9m0R5j44J28
$$ -94 3 -67 -79 60 59 -10 -16 83 -71 24 9 -3 52 -117 6 47 56 120 37 -12 -5 111 43 60 41 1 96 -48 80
3045H0K3j6j22N1j09K6J23j12J04r3Q5n5J4o1J77l9n8rj15O2J14r1j3J01k1o5
$$ 80 103 87 -35 16 -93 -67 56 -56 48 -45 40 -15 -1 -62 115 76 18 9 -106 -44 70 -21 -34 67 46 -19
3071a9j2M9N0pQ0j11j08k0K44j67O3j03R5o9lJ31q5j7r3J46o0L8k8k2J84k05M3
$$ -19 -31 18 68 61 141 30 -78 -98 146 -21 42 -61 34 -35 -38 93 8 -9 -102 44 -16 22 -6 -28 156 -49 -6
3098fJ22j27k8J6L5L9j13mN9P0m4R2k53P4J6j9Q6kj1J04j41P7q9Q8On3R9K6j50
$$ -6 116 -11 -39 -23 12 51 -62 -66 -7 63 19 111 -142 -68 -52 -71 15 13 2 106 -35 42 -47 41 47 -6 93 119 -31
3127c1k9k1J65r2J4J4Qj4O0J0o2r2J06M6j66R8rj23J26j21Q0J11o5pK4J1K4Q2
$$ -31 -60 -81 84 -8 6 20 28 14 74 84 22 -70 36 82 -84 14 5 -118 8 -113 -33 78 13 6 30 41 65 147
3155A47j31nQk4R4q7m1J3n7J06j65J43J0r2O0L7M5j41J51p6ML4pK2o1o7J05j34
$$ 147 16 11 19 -5 89 2 -39 -26 -83 23 -142 1 11 -81 -21 16 61 -80 71 -5 -1 33 26 48 -13 -80 25 -109
3183a09K43j36OJ20j53R3m8Q7p5q5L1k3J29q0k7R6r2kJ8k8J24p7k6O8q6Q5l7P1
$$ -109 134 -2 4 124 -29 64 16 103 28 -57 -26 -49 80 0 -27 69 -23 -25 -7 -35 89 12 -14 54 -32 53 16 87
3211H7n2N1k3J8L3j29Q5n7j8K5o4J5J93j08j04R7j77J19m9L3m4J89j07j13J62
$$ 87 35 86 63 81 114 -15 70 13 -5 20 -44 -29 164 56 -48 49 -128 -9 -58 -25 -69 120 13 -100 62
3236F2j43J51k10K58k8o4o0O8j48Q8jN3j89J56k0J71j15q6M4L7p3P3K0Jj27J27
$$ 62 -81 70 -140 118 90 26 -34 34 -114 -26 -27 26 -163 -7 -27 144 29 -57 -13 24 -49 24 44 45 -82 45
3262D5l9r0J38k5j39J04j15J29m1N3m9K0J1l4L2kN1n7k9NJ3j2O1M4p5k5M7j7m4
$$ 45 6 -84 54 29 -110 -6 -121 8 -33 20 -29 -9 2 -32 0 -2 49 -8 -37 -32 -19 -31 30 74 -1 -26 21 4 -40
3291d0R9o4J11j63N1o2M6P7j10J3p7K11j53N3R7j15Pj01P6k9P1j0M8p0n6O8P0
$$ -40 59 -5 106 -57 -6 -68 -22 55 -55 -42 -119 92 -61 -8 89 -26 -19 -120 -44 -73 -2 -12 36 -34 -90 -22 48
3318D8o0O5j07J9n8J30j6N5J2j24m1K6M3j1q3Q4J03p8r6R5N1p0R2j57O2m7P4j2
$$ 48 -12 53 -54 -35 -93 37 21 76 88 -36 -77 -51 -8 -19 -102 -18 85 7 -89 6 57 -13 79 -78 -16 -63 11 -1
3346aM3r7K1j9J77j09J2j8n5rN7p7%Q2j13J73k8K0q5Q8Km5j0l6mj6R0j10LP7J8
$$ -1 42 -55 -34 -53 124 15 27 9 -46 -55 2 -75 -75 7 -106 67 39 59 -26 62 64 19 9 -27 -31 -47 43 -67 -64 13 31
3377C1m9lJ2q6P7N2L1l3K4O3n4m1j0J2j17J02j7m7R2r5k0J09j14J79l3j07P3m4
$$ 31 -18 -21 -9 -95 -18 34 65 32 56 119 65 24 14 26 -91 11 -6 -53 39 -56 -76 33 -81 98 65 -42 31 -13
3405a3n8J15L2p9M3j9o5R0o7k7J8O5J09k94J30L7Oj23R6J36q5m8Oqj29J54q2O7
$$ -13 -71 44 76 -3 40 21 -44 46 -21 -48 -30 35 144 -150 -20 17 23 -100 -4 132 47 -1 5 -3 -132 22 -60 7
3433Gq9K6K2p1P6K4l4P3r4Q8j08J76j45J03J8r3m3L5N1o4J12q9l6K9Q2P0j4L5
$$ 7 -82 -56 -34 -105 -29 -5 -39 34 -60 28 -80 96 -49 54 72 -21 -64 -29 22 -42 70 -19 -55 -26 56 126 112 147
3461A47k11J49r4koL2M4j23J16q8J1O4r8K3k1R6j03J7O1rJ8r0L9J05j04jL7l0
$$ 147 -64 85 -9 -11 -17 15 59 -64 52 -36 -25 39 -59 -36 -57 39 -64 -47 14 5 23 -67 -28 77 -27 -28 9 -21
3489b1M5Q5q9j2m1K4L4m7L6o4O4n0Q0k4l2J3NR0j37J48p6P4o1J3o0p1J66j81J22
$$ -21 24 109 20 8 -33 -9 25 -22 14 -50 14 -36 44 20 -12 1 6 96 -41 107 31 105 44 57 -3 -74 92 -89 33
3518C3l5J20j31P0j05J78p4j64M2M6J1K0p2J1J13p7R2j32%J21m8m6m3J65Rk1p2
$$ 33 -2 118 -13 57 -48 130 56 -108 -66 -20 -9 11 -61 -50 63 -14 78 -54 -54 67 19 -27 -70 95 104 83 11
3545A1r5KN5M7mL4r2J08J7n6o4Q9p4N1M1l2M8p9P8j89J12j0O4l8j09N3J78j91
$$ 11 -84 -82 -27 20 16 50 -42 66 83 27 -37 52 -22 29 70 38 86 7 85 -104 8 -2 62 24 -85 -32 146 -45
3573d5R7j32O1q3J29kn4P3q9J25p5N1M6j64L9K0pq1J48j73p2J43j9J62j5j28O0
$$ -45 52 -80 -19 -102 27 25 -29 44 -45 80 5 56 102 -62 -23 -3 -10 -91 57 -116 -188 -45 -64 98 83 -45 15
3600A5O8m4jM6M4j65P9m2OM7K2j8l3j10L2O3q5R7K1j41qL6K6Q0N0k3N2j25j2k5
$$ 15 83 39 38 84 128 -37 42 0 6 53 75 57 24 -86 -54 9 -76 21 42 -99 -107 -71 -45 35 85 62 114 -11 -23 -48
3630d8N0lK2p5K2J12j64J5N1K1J6n7J9m5l5J13pk0J74j70P3J7j79J48r3N8r8K8
$$ -48 2 -1 21 -54 -32 80 -84 -69 -18 3 19 -38 -19 -64 -99 14 7 -13 161 -9 64 81 -98 50 -43 15 -83 -55
3658e5j0J04j30P8qK2o1N5j8P1P8q1p8l1o6J46M4k8Jp3Q3n4m4J48j18R8n4j17
$$ -55 -65 39 -91 -13 -21 1 -60 -5 -23 48 126 45 -33 -64 -130 16 60 32 33 -40 43 -11 -55 93 -25 73 19 -98
3686i8J38n5LMo7l3K35q6l8L1j16J03R6m0l6j7j85K19j50R6j24J05L9L5rm5l2
$$ -98 40 -15 -12 -8 -75 -108 127 41 3 34 -82 21 117 77 41 24 -161 58 -92 4 -120 -15 24 59 50 5 -27
3713b7K2j9R0r1Q2n0n5R9l3n1J26kj3j45J10r0lQ0n5M6j06J4J1J68j84J57j43
$$ -27 -5 -24 66 -25 57 7 -48 51 18 -33 93 91 78 -67 43 -47 -50 30 -25 21 -85 -71 -60 108 -76 81 -62
3740f2O0OJ17r5k3k2J25j55K0L5ON7j98J42RL6m3l7J48p2k6J4q3K19j33j28qK3
$$ -62 -2 4 121 26 3 -19 106 -49 -29 6 12 69 -129 13 22 58 15 -22 126 54 28 42 -41 178 45 -83 -91 -68
3768f8k0J09O0n9m3jR9j68J56p1L4M9j4K4j31Q2N9j07p0P7L9r2j6J8L1Q5n7J8
$$ -68 -88 21 81 22 -21 -22 77 -91 65 -6 28 77 63 87 -44 38 97 -10 -80 -3 36 -56 -72 -54 -23 62 5 23
3796B3p1J0K1L5o6Q8j48J65m2Q6j29N6O3mq2P8j23L0P5l1n1M1K7m7m2q4J30P3
$$ 23 -48 -38 -17 18 -48 40 -108 57 15 101 -28 28 91 87 5 83 -40 -10 65 34 -17 24 51 4 -38 -122 8 81
3824H1o2j5nom0jJ07k1K7oq0l2J16j70J05k2j0O0n2P3n8O7j96J23pN8K3j6op1
$$ 81 19 4 -1 -7 -47 -48 59 38 65 59 -21 -53 63 -107 -2 -24 -34 26 -26 47 -11 56 -140 -17 -24 34 57 41 35 -36
3854c6O6j6j3JN8m2M6l4P9r9L3k8q4P6P7o7L8L1j27Q6r8J97j82M4J07o3m8k2l5
$$ -36 30 14 1 2 60 18 64 30 109 10 43 15 -69 7 84 17 55 86 -41 45 -53 144 -38 6 113 50 2 -20 -55
3883e5O7JK5Jmn1pR6j50r2Q9R3K2j6j4o2k1P0K2K8r5%J27j13J16j63R3np1Q0p5
$$ -55 12 13 38 39 35 -16 -23 73 -77 -169 -80 13 35 19 5 -57 -78 -8 14 42 -53 -53 74 -39 77 -86 7 2 -69 11 -64
3914f4J31o3K6Q2j35n6Q4j7N7n9Q5l8L8q3j06R4L6P1Lm5k0nKJ28j07M3j81J36
$$ -64 67 4 30 112 -23 -79 5 -12 45 -14 71 33 71 -12 -118 -24 12 83 86 41 21 16 18 146 39 82 -99 37
3942C7k0j9j28J88j38L9mL6j21P6K4o1J07RJ2l1o6o1P8k1J75j11K4K3k5rj8L4
$$ 37 17 -2 -130 58 -80 -41 -45 -9 -130 -54 -30 -91 16 25 37 6 -60 -121 -43 -64 111 0 24 47 22 13 -5 29
3970B9Lj55R0N2K9o4KO9r2K0Rk4P7j78P9j7J83j92J13j1l2RL8k5L9p7N5K8J6J8
$$ 29 32 -123 -33 19 48 -16 -14 55 -37 -17 -8 -32 45 -133 -54 -71 112 -80 33 22 -10 -1 37 12 51 -26 29 57 73 91
4000I1j73J49q9q8J45K0q0J27j33R3j01O1l0J2r0P0J8l7j9nJ7mR6n1MJ24j32Q2
$$ 91 -82 67 -22 -110 35 55 -25 102 -31 62 -39 22 -8 4 -86 -16 2 -35 -54 -59 -42 -46 50 -1 3 127 -5 77
4028G7j2p7N4j27M5m5J37j15Q8k8o6J3l4Q7L1O8n2M8j17o6Q2o4P9M1j07n1K96
$$ 77 65 -12 42 -85 -40 -85 52 -63 25 -3 -69 -56 -90 -3 28 96 44 92 -25 -91 -9 -73 6 47 -60 -111 185
4055A85j35r2r9J56M6j7k7O0k6m7M0o3q1J84o8l6J23r2O0j06O4L2j77N4L1O3K3
$$ 185 50 -42 -141 15 61 44 17 77 51 4 44 -19 -100 84 16 -20 103 11 71 -35 29 61 -116 -62 -31 32 55
4082E5j70J19J2k7Ll3O5O5nj47J7J15j27P9k7Q6l4n0n7P9J2j0N9j67J63j09P5
$$ 55 -115 4 16 -11 -8 -41 24 89 84 -63 -46 69 -58 21 -6 80 46 -4 -61 18 30 20 79 -88 75 -34 41
4109D1j1o4l3nL1l9O5j06R3ko0O5L4R0p0r4k6J85Pj43J21p4K2J23j56O0J07k01
$$ 41 30 -34 -67 -72 -41 -80 -15 -121 -28 -30 -90 -25 9 99 29 -65 -91 94 101 -42 79 5 27 150 -6 54 161 -40
4137d0J23j12O5J2J2r2R1m0P8o6q4L0O7l0p5J07o8J09j28P6J7m6M2J06k18O9O4
$$ -40 83 -29 36 48 60 -32 59 19 97 31 -53 -23 44 14 -61 46 -22 87 -41 35 52 6 48 154 -64 5 69
4164F9j05L4k8N6J6r6L9k0J4J00Qqj18M7L6J34k72P0l2J6M5oOK0n9J1Q4j66J46
$$ 69 -36 -2 -30 26 42 -54 -15 -35 -21 79 87 79 -39 8 44 178 -94 -24 -56 -40 5 -1 5 25 -34 -23 61 -105 41
4193D1n3pr9L2K11j19n5P7Q8j62J14k8j06J30k4n2r8J67j22oJ50j20J79J7j81
$$ 41 -12 -19 -118 -86 125 6 -49 28 116 -46 68 40 -66 64 40 -12 -110 57 -65 -71 79 -41 138 155 -26
4218b6K3L8Rj54J28k7oq2rQ6M7KPn8J06j49K5oJ99k19M6K0q6L6K9JK4O2n6P3j10
$$ -26 -3 35 44 -110 18 -9 -15 -97 -106 -20 27 29 36 -22 84 -65 -40 -46 153 -66 -20 0 -86 -50 -21 -20 4 66 10 83 -27
4249b7l2l4P4L3m4Q2J0OM9o6pj44J61q0O4Lp4P0K3j12L9K3N9q1m0J49n5k4nnj7
$$ -27 -59 -93 -19 14 -30 52 62 68 117 51 44 -100 61 -19 45 48 -26 44 67 -45 -6 17 76 -5 -45 104 49 25 20 15 -2
4280bpQ7m7k3o0M4J33j96R7j04J14N8n6J7j42P5Kj90J64J24j54J50o0M1p4L7o9
$$ -2 -9 78 31 8 -52 -8 125 -71 26 -78 36 94 38 55 -87 -12 -10 -200 -36 88 -66 84 24 65 -9 28 -41
4307d1J0N9k9o4J7n9J2J60j8N1j08J55j39Rj13J55l1p9L6Q4j28M5R9n5j5nk4M0
$$ -41 -31 28 -1 -65 -48 -107 -95 65 47 98 -10 145 6 15 -98 57 26 -53 -17 67 -61 -16 83 28 13 8 -16 24
4335B4m5K3n3m7N2K8L4q9O2m7Q6K1Q1jj95o0R2P7q7O9Q8j02M1k5K7r0L1MK2K3
$$ 24 -21 2 -51 -98 -46 -18 16 -73 -11 -58 28 49 130 129 -66 -126 -34 43 -44 25 113 11 52 27 54 -36 -5 -1 21 44
4365D4l1L4k2L0j10Q6r1J70m2j07j2m5R2P0l7l0J35o2O3k6j31N8J4p4l7J23q3
$$ 44 13 47 25 55 -55 31 -60 110 68 -39 -51 -96 -4 66 29 -1 134 72 135 109 -22 36 50 -24 -61 62 -21
4392b1N8m7l1O6J6%J4j21O7KmP1p8m7J02j21M5P3j00J05m6j9POk6k1j8K0N1K8
$$ -21 37 -10 -41 25 41 41 55 -66 1 3 -1 70 -8 -55 47 -74 -29 44 -56 49 3 -16 -9 -3 -29 -50 -68 -48 3 31
4422C1k2J0k8O6o7L4P7m2q7L2L1j1j3k0O3O9j46N8kk2J21n3q8P7pn0n6J93j00
$$ 31 9 19 -9 57 -10 24 101 59 -28 4 35 24 11 -9 54 123 -23 35 33 11 132 79 -9 68 61 11 -45 148 48
4451D8n0O7r5J31j12K3J0l0Mr3K7pJ04R9j11n9q5J95j30K41j37J6J3p8O7j02N2
$$ 48 -2 65 -30 101 -11 12 22 -8 -4 -97 -70 -77 27 126 15 -44 -129 66 -64 177 40 56 69 -9 58 -44 8
4478HM3j3k4Jj08P3P0p8M9o6n3M2J60j56Q5q1Q0j88J72j26J09j9N4j29L1Q2o7
$$ 8 51 38 14 15 -93 -20 50 -28 21 -45 -98 -56 104 -52 33 -48 32 -156 16 -110 -1 -20 34 -95 -64 18 -49
4505d9O2K3j08n1J24n4R9j00j1j3M4l1M4N5l2j0J15m2O1j15L4l9j24K23j15l6
$$ -49 13 36 -72 -123 1 -53 46 -54 -65 -78 -34 -65 -21 34 2 -8 107 65 126 11 45 6 -118 105 -10 -46
4531d6J54m4r2P5Kp8n3K2J00r4pN3N9q5J67j00L1J6k21J67o8L1m2j9J34l1m8L2
$$ -46 108 64 -28 47 49 -29 -82 -60 40 -54 -61 -8 51 -34 133 33 64 80 -141 26 -42 -11 -53 -72 62 31 -17 15
4559A5K6n1j2m6L5K0J07o1j19k0P8M1Pq8Q8N6j33J03K8l2n6M4j54J42M0k8m2M2
$$ 15 41 -10 -22 -68 -33 -13 94 33 -86 -106 -28 13 20 -68 20 76 -57 46 74 42 -14 30 -124 18 58 30 -12 30
4587C0j38J9K9N4mJ14j36L5n3J3n6J20j26O2K0O9o7M1k7L3j73J09J4j5J19j89
$$ 30 -108 -89 -60 -6 -10 104 -32 3 -50 -37 -93 27 -99 -37 -17 52 -15 26 -1 32 -141 -32 -18 -33 86 -103
4613a03J84j62J11J29j98O3rm9n8M9P8q5J16J6j81K5K2K6L2k9KP7o2m5J00j28
$$ -103 81 -81 30 159 -39 24 15 -34 -92 -43 35 -50 66 82 -99 -74 -52 -26 6 -23 -21 56 -6 -51 49 -79
4639g9m6P6P7j16O0L2L6k6m3N2k3LN4o1j9R9r8N9j8l9lj0M7j1J7l2n2L0O3j05
$$ -79 -125 -49 28 -88 -28 4 40 14 -29 23 0 3 57 -4 -23 76 -22 37 19 -20 -23 -33 14 3 20 -12 -64 -34 29 -76
4669g6oP9Rr7J07n3o8J59k17J96Qj4J1q9J62j5j44P5oN6j38J24p3J01j17J5L7
$$ -76 -82 -3 6 -91 16 -37 -105 54 -163 33 41 27 38 -51 111 96 -48 27 21 77 -61 63 -10 91 -26 -11 26
4696B6P8q0P9r2P5o3j07J27j01J46j70L7r9J16j0K2Mj9K2p1J59j10R1l0Ll3o6
$$ 26 104 24 103 11 86 23 -84 43 -58 88 -82 -45 -144 -28 -38 -16 -12 -31 -9 -80 79 -31 60 30 33 0 -66
4723f6J06m0r0J92o7o7J79k19J5N3J12n1m7j0MMl0J12j05lk1oK3N2M8m3j56J56
$$ -66 40 0 -90 102 35 -32 147 -72 -57 -4 108 57 10 0 4 8 -22 90 -15 -18 -39 -45 -22 30 78 35 -121 35
4751C5p6J43k5q9K8mMm9jQ9N4n3n1n0N9K4j1o6J5N3j21R6L6k4J9M2j28J90j49
$$ 35 -41 102 77 -12 16 12 16 -33 -34 55 109 56 5 -45 14 38 27 -39 -24 29 -92 4 40 16 35 77 -51 139 -10
4780a0j02J03j8J55j71L9L6J57l18O7J48n0J7j06M7o3M4R2n6p4N3O1n4moJ3K7
$$ -10 -112 -9 -27 128 -43 -4 32 189 -129 -62 86 36 53 -53 -6 -69 -25 67 11 -63 -10 51 -3 -7 -13 0 27
4807B7p3J10L2l9r6k9l1J42o3R0q0m6q8K15q5k0J07k9J9k4m2Q3k6Oq4%J47j73
$$ 27 -46 64 96 57 -39 -68 -99 43 -20 70 -10 -56 -144 71 -14 -34 73 44 63 39 -3 80 54 60 -24 -24 123 -50
4835e0M6J5J4L7p6p1J48k4r6j2O0j2R8k7k8p2Q2j7m5K9Rl6R5l6K2q9K5P4r4Q0
$$ -50 -4 11 25 62 -14 -85 63 39 -57 -69 -9 -21 77 50 22 -50 32 15 -30 -1 8 -28 67 31 53 -36 -11 63 -31 49
4865D9j65J71j08J00j21L5p2R4l0m9J64j07N6p7QR8kl0l7M5q6l9K06j70M3KM7
$$ 49 -116 55 -53 47 -74 -39 -111 -17 -47 -96 68 -39 17 -60 -52 46 44 14 -23 22 -64 -103 103 -67 -24 -22 25
4892B5m0l8J0P3m5j13K8J91n3q9J06j03N5k8J15j87J02OP3k2j07J38j34J32r8
$$ 25 -15 -53 -43 30 -15 -128 -100 91 38 -51 55 -48 7 -21 94 -93 9 15 88 66 -41 97 -37 95 -3
4917cQM0j41J24qo4J00j06lJ09o3Q6j81L2R3K8o2rj4j2J49j40N9r7j0Q2k9J1r0
$$ -3 5 45 -96 28 20 -44 56 -50 -53 56 -7 79 -102 -70 23 51 -11 -20 -34 -46 103 -37 22 -75 -85 -3 -32 -21 -111
4946a11O2R2J8l7m0m0k9J77q6R9j65J02n5o5J14kM2k7JJ3N7j05KKM8j43J51j10
$$ -111 -49 43 61 24 -16 -56 -85 92 6 105 -60 42 -13 -78 36 34 76 49 50 63 120 15 17 19 67 -76 75 -35
4974c5l3L7m5LM1ON5o1L9r8J17rJ0m4L7n8O4m7P8n5q4K7L9M7n4J5poL8K6m1J06
$$ -35 -68 -31 -76 -73 -32 -26 29 -32 7 -91 26 17 27 -17 20 -38 26 -21 57 2 -82 -55 -16 31 -23 -8 -15 -21 17 43 2 108
5006A08q9q0Q2n5k7J3N2q0M9n6O3j8J6N3r9k1O4l2k0k4P1O8j07Q3J5M8j36P2n
$$ 108 19 -61 21 -34 -61 -48 4 -76 -27 -83 -20 -38 -22 31 -68 -89 -25 -57 -77 -101 -30 38 -69 14 29 77 -59 13 8
5035Hn7k2m0K4J37j3j3j14R5N9o0m1J05l7J48p2k43J29K0L8j60J58r0lJ47j71
$$ 8 -49 -71 -111 -87 50 37 24 -90 5 64 4 -37 68 31 179 107 -136 -7 13 51 -109 49 -41 -44 103 -68
5061f8%O8k7O4j26N2K9Kj35O0J18m0j2r7J67p8P7j08Q9l4N4RNo2k6j2P3j36J14
$$ -68 -68 0 -27 37 -89 -37 -8 -6 -141 -81 37 -3 -15 -112 55 -23 54 -54 35 1 55 64 69 7 -19 -31 42 -94 20
5090B0m0Q2r3rK5j02J39O9r3O0o1Qj2R6K6j07N6k2r4Jm3J96j5k7j3Oj14L6Q7j06
$$ 20 -20 62 -31 -40 -15 -117 22 91 -2 58 -3 5 -7 89 115 8 64 42 -52 -51 -94 102 87 60 47 53 -61 -25 62 -44
5120d4N3j7M3K8r2O3M5j39J24r9O3n3K3m1Q3K6j13O2l3N2r7p9K34j77P9J0j20
$$ -44 9 -8 35 63 -29 34 79 -60 64 -35 28 -25 -2 -43 40 66 -47 15 -18 34 -63 -142 92 -85 -6 4 -116
5147a16P7R8m1p4L3pPp6J27J2j19J00J23q6p9J35j86J50j06r0J96p8m2J57j78
$$ -116 -39 59 18 -56 -23 -30 -23 -99 28 40 -79 21 144 58 -21 114 -72 78 -28 -118 78 0 -42 115 -63
5172f3K0l6P4P7r3K8L2oJ36q9j83J43l8m5M3m4L4j2L2m5P3j62k3J07K7O0p6N5
$$ -63 -43 -79 -5 72 -21 7 39 33 169 80 -103 40 2 -43 0 -44 -10 -22 10 -35 38 -124 -147 -40 -13 47 -29 26
5200B6k6j6J14j02P8r5J13j51J38q3J0Qn9J05j46J32Nl7o0Q7j11kJ82p5l8R1j01
$$ 26 0 -16 98 -4 74 -21 92 -59 79 -4 6 14 -45 60 -86 46 51 14 -46 41 -70 -72 110 35 -3 88 -13
5227a3J17q3o1N5Jp7J9P0j15OM0J06J3j12ol8L3O8k7j7j6JO3N1q6Q8r1n3Q8j17
$$ -13 104 21 -40 15 16 -61 -42 28 -87 -81 -41 65 78 -34 -40 -78 -45 23 -4 -21 -37 -36 27 78 -8 80 -11 -64 24 -93
5257i3J30n2M8lk1p2R5N1j0p8J4Pq6R7o1P2r8J21j11N7M5r6mk1O5J4K6j16n1K44
$$ -93 37 -15 33 30 9 -63 32 83 73 -5 9 16 -70 27 -34 38 -60 61 -50 7 52 -44 -48 -69 -4 10 36 -80 -131 113
5287A13j70k3J04L9p8L6Jm0Rm0K9N7R4o6M0q3O0m5J3j40J08j25R8k6M2l2J0L8
$$ 113 -57 -80 24 63 -15 21 22 -18 -9 -49 -20 37 131 65 105 22 82 37 50 -90 18 -107 -9 -35 7 -25 -15 23
5315B3k1p6R3l4n7pQ1N2R9j15m3m0qM6k4J9j8j3O4k0J3K0O5l3K4j3r0M3O5r1q5
$$ 23 2 -74 19 -15 -72 -79 2 54 153 38 -5 -45 -53 -7 -31 -12 -30 -43 21 1 14 34 99 66 90 77 -13 30 95 4 -81
5346h1J67q7K6q4O1o6P6L2L1Mq9rL0k1M6J5L4j02K7p6P8N5j52R0j7J5k6n5P7p6
$$ -81 86 -1 25 -59 2 -64 12 44 75 79 -10 -19 11 -10 36 51 85 -17 10 -66 12 67 -85 5 -12 3 -23 -78 -1 -77
5376g7J54o2J8rJ9n6M7P7j70O2M3o7N1r3R3K0j8K4r2O1J3k6QJ2l3%l5OK9L0qL5
$$ -77 77 15 33 24 43 -13 34 111 -59 3 46 -21 30 -63 30 50 32 56 -36 25 38 12 20 32 -1 -1 -36 -30 -1 29 21 56
5408E6j99R3OkR3q3J15j4p5l9N5m2J79j65O3j4J67j34o7R7m0p7M5N0k5M1j91J4
$$ 56 -143 -50 -44 -46 47 -36 79 65 -10 -49 6 -36 143 -22 41 27 194 60 -7 90 50 -27 18 68 43 84 -107 -93
5436i3J61m5O0q8LM8L8p6OlO2j79rM4L8j0k7K8M1K4J2p6k6M7L5R7m8j6k6N1j40
$$ -93 68 23 83 -5 -2 46 84 8 14 11 73 -106 -115 -71 -33 -43 -70 -42 -1 23 35 -41 -67 -20 15 112 64 48 22 73 -67
5467f7j0Q0N4m4N1l3P7j01Q9r1mJ4l3M8rj07J23j72M9j1P5R3%j22L4M4Kp6J40
$$ -67 -77 3 57 13 64 31 108 7 96 5 1 15 -18 30 21 -86 37 -135 -86 -97 -22 71 71 -51 -17 27 29 -47 93
5496I3j48R7r3J7%L4o0K6k6m3J32j14J83m3j1J36k70K00l2r0O2j1m4m3R8m9PN8
$$ 93 -55 42 -51 -34 -34 0 -60 -34 -60 -103 29 -85 98 55 44 180 -90 110 78 -12 50 39 -5 -48 50 1 8 66
5524F6l9m8kK3K6M3j29L0Q7k3JM0j22Jp8J53l7j3r0N3K7Q3mm2p0P7m1J27j87j7
$$ 66 27 -21 -23 0 26 69 -60 -30 57 34 35 75 -47 -46 -124 29 -8 -21 -111 -58 -31 52 48 6 -64 13 -28 99 -88 -105
5554a05J4O1P3q1O1P3j34K4K8m4lJ8j09J35KM0m1J1k4N7m6j0J1j3or2R5o6N0J1
$$ -105 -91 -30 43 -38 23 96 -38 -14 14 -30 -33 -15 -124 11 13 53 12 23 -1 56 10 0 11 -2 -8 -100 -5 -71 -21 -10
5584a0K2K6L2k5j37J01OM7k4ql8R2j42M4jk3N6l2J49j34N6j11O1j4KO9N1p1k3
$$ -10 12 38 70 45 -92 9 15 62 38 30 -8 84 -58 -14 -15 -38 18 -14 135 1 57 -54 7 -7 -5 64 115 44 21
5613B1%j06J53K9k03J04M2n4j7lM6m3k1L9QK2O6l1p8m2P4pP7j20L5O7j18J14j71
$$ 21 21 -85 68 97 -106 -2 40 -14 -31 -34 12 -31 -52 -13 -5 17 83 52 -26 -68 6 -1 76 -44 -9 58 -60 54 -117
5642a17Q2pJ45q2J9M6p7l4O3Pj13P8or7K3O4L3K0jK0j32K5L5R4j12K3J8j1O1q2
$$ -117 -35 -42 103 21 40 86 9 -25 38 45 -68 10 4 -93 -70 -6 27 47 46 66 -66 -41 -6 88 -24 -1 17 6 67 -15
5672a5k0J20j91J30p9Ql0J02r8O3K6o1J01mlj56K22k4r6Q5q1Q7j97J18k5RM5L4
$$ -15 -35 85 -106 24 -55 -47 -77 25 -73 -10 16 -45 56 52 49 -107 115 91 -5 80 -1 86 -111 7 -18 -9 36 70
5700G0l1N8j05L7j14M8m6R9N6r0M8q5lJ00J2j13K6j09K21o7L2j0j10K6R6l3m3
$$ 70 39 97 -8 29 -85 -37 -83 16 72 -18 30 -55 -58 42 54 -59 -33 -142 79 12 44 34 -76 -50 46 13 -30
5727c0K3Q9m9p7J65j38J16n1q6M5R9k37K76j80O7r4J7O7r2O0nN8Ml4m2J4P2pk8
$$ -30 -7 82 33 -44 121 -17 99 48 -38 7 106 -131 145 -35 32 -62 -45 22 -70 -10 -15 43 47 13 -29 -15 57 50 22
5756B2P4n4N4j44O8r5J59o3m6R0n6k9j6NJ37j01m7Q2m1jm9NN0J30K3j57n8P8q
$$ 22 96 42 96 -48 20 -75 84 21 -25 65 9 -20 -36 -31 106 5 -42 40 -1 -2 -51 -46 4 134 157 0 -58 20 12
5785A2k4n2J31n4M3kj36Q0j0J2j04J38j29J44K9j93J20M7o3pK5j52J04k8O4O0
$$ 12 -12 -64 67 13 56 54 -82 -2 -12 0 -104 34 -95 49 78 -115 5 52 -11 -18 7 -145 -41 -69 -5 55
5811E5oq4N1q6J52j11K0M5q1J10K3j00R8j75J46m2l6L7M4r6k8N7j8n5k9R5R7N0
$$ 55 49 -35 16 -70 82 -29 -9 36 -45 65 88 -12 86 -89 57 15 -21 16 60 -36 -64 -7 -25 -80 -109 -14 83 133
5839A33k57J18J14j22p8J50p1q7R1oL9j01J3J26j32J65j33n5J00k1KR6q5J7j09
$$ 133 -124 -6 108 -14 -92 58 -13 -100 -9 -15 24 -77 -64 62 -70 95 -38 -93 7 -14 -12 84 -1 16 -93
5864i3R6R0p1%n6Q7p8M8j33J06J20j08k0R6j04O6j1lP6n4j55J77%j07KR9Q6j92
$$ -93 3 93 22 22 -34 53 -25 23 -110 -4 116 8 -12 84 -20 46 35 32 108 54 -101 76 76 -31 -29 70 156 -36
5892c6R4k9Qm9J9K4j23Q9P0m9K1L6j17Q7j2j9K5j21J10N8q2J15j12N8nr8P5J6
$$ -36 58 29 37 -12 7 31 -92 -3 67 18 39 75 -42 45 33 14 39 -82 28 86 4 119 7 65 60 -38 37 53
5920E3mj5l4J2K5j1j3J36j77M5nm2J36l8j04N1o4l0J70n2J1j6j29J41l9K6k0R0
$$ 53 49 34 0 12 37 26 13 149 -28 17 12 -30 106 68 -36 15 -49 -79 91 39 50 34 -95 46 7 33 13 103
5948A03n1Lj07R1r0O7k9J3L0j31O1J1J7J7Q3j62J51j36L6n9P0J00k01O0P0Nm3
$$ 103 52 55 -52 39 -51 16 -13 0 30 -101 -40 -29 -12 5 88 -74 77 -59 -23 -82 -12 88 -113 -53 17 22 -21
5975b1M4J7m5N9o8lR9l8q9J19j94J92l6k0l6j5K6k5M1m8N3j4q0O5R9M7p7r0M5
$$ -21 23 40 -5 54 -14 -17 82 44 -45 74 -120 72 36 16 -20 -35 -9 -34 7 -41 12 -2 -82 -17 82 129 52 -38 7
6004G%J21j66O1m6J63k32N1O5o9RN2K8p5m0R2L6j6P5r3o8J48j12L6nPj03O1n5
$$ 7 7 128 -38 23 -23 140 -92 -41 24 -45 -36 16 44 -31 -71 21 57 41 116 23 -45 103 -9 27 22 29 -74 -13 -68
6033f8jLQ4Kj7%Q9o1m8J56j88L7M6Qo1k9kLM8N8j57J00K7R2j21N6J9j34Q2l7M2
$$ -68 -69 -66 18 20 3 3 92 31 -17 139 -49 -12 34 42 -19 -48 -50 -47 1 59 -98 2 29 121 0 56 75 -59 23 -14 28
6064B8O4j91P8N4j0Q0r8l2on6J40q6k8J23q7k6O2L9n1p1J00j7P7j47K4J27L7j41
$$ 28 92 -99 -21 33 23 103 5 -27 -33 -89 51 -35 -63 60 -27 -53 9 48 -3 -74 26 9 86 -61 -37 90 127 -14
6092a4Kpj4j1J30k4j21O6p5J07L1k1mK1j76l1Q3J6N8j3n9O0K3k8N6J0j02J78k07
$$ -14 -12 -19 -33 -44 86 62 -59 7 -68 39 70 49 45 66 -110 -141 -58 -42 16 3 -56 4 27 -1 55 65 -37 141 -66
6121f6l3J10N2j6j8qr3J27rK6k4l9p8P4O7j17J40j07q1J30m8J9j11m9J91m2P9
$$ -66 -99 11 63 47 29 21 -72 55 46 72 48 9 -69 5 72 -45 95 -12 -93 37 -11 8 -103 -152 39 -3 76
6148G6n3J3J08n2p6P7j44O1O5J3p2k1r5L1J69j84K3J52p3n4L2m8O6m6o8Q1J3j13
$$ 76 23 36 144 92 16 93 -51 10 75 88 16 -5 -100 -69 100 -84 -61 91 18 -36 -4 -52 14 -32 -100 -19 -6 -119
6176a19J7j1J28j8O6m5J7j67J09j8j7J4l9Q0%p2J02m3m8KOR3j39J39m9q0Q6P1
$$ -119 -102 -113 15 -3 63 18 35 -132 -23 -41 -58 -44 -83 -3 -3 -75 27 -16 -64 -62 -56 37 -102 37 -12 -92 -6 65
6204F5K3j08K5j04N8M8j00L21k50J36p9o1K01k02pP1j0N8j41K5K5K5J04j25p9
$$ 65 88 -20 5 -99 -41 7 -93 228 -22 114 35 -26 175 -27 -34 37 27 85 -56 -31 -6 19 123 -2 -81
6229h1J08j51J20N7j00M3nk7rN4j32J54j24j3J77j10M7Q6j12R4j44J3J94j71Q1
$$ -81 27 -124 -4 53 -47 -4 -9 -36 -45 9 -123 31 -93 -106 71 -39 8 94 -18 76 -68 -55 139 -32 49
6254D9n5J01m0n9K0O3M6r1nj35J51M1j28K7P2m2O6p5m5m0J07J1j8K2o3O1p1p2
$$ 49 -6 95 55 -4 16 79 125 34 29 -106 45 86 -42 -15 57 15 81 6 -39 -79 28 39 21 43 -20 41 -30 -102
6282a02O9R0L2j22L5J3n7QP7j4l9q1J12k5o6J29ok9o1M6O0L6p3N8j84R7O4j30
$$ -102 -33 57 89 -33 2 15 -42 -34 43 29 -10 -91 21 -4 -70 59 53 24 -37 9 69 105 32 90 -94 3 67 -63
6310f3lmQ5j65O6M8l6L9R6j28lM7j7J33n1R9k34Q7L3k3j22J28J3q8P3p6Q6j35
$$ -63 -66 -70 15 -150 -84 -36 -72 -33 63 -65 -68 -21 -38 95 44 143 -91 -4 29 6 -116 12 25 -63 10 -66 20 -115
6338a15J17j8M5j10O3J07p9N1p0p3L3M7j2n7J61j10J13J6j51m9R6J1J4%p6N2j23
$$ -115 2 -16 29 -81 -18 89 10 61 -9 -82 -49 -2 -14 -71 90 -20 93 109 -42 -91 5 16 30 30 -46 6 -117
6365a17J00M0p6R4j18J51k2l6j21J31N5r0R9j73O2KM7q7J58l2p9L7j49J20mk4
$$ -117 -17 23 -53 41 -77 74 52 16 -105 26 81 -9 90 -83 -21 -19 28 -59 99 67 -12 25 -124 -4 -8 -32
6391c2p9J55r0O6n7N9k1n5N7o3Q6Nj68P5J7L5q6R4pp1R5M3j40Q2J01j50K1p4O1
$$ -32 -111 44 -46 20 -37 22 1 -54 3 -60 26 31 -137 -62 -45 -10 -96 -2 -9 -80 15 58 -82 0 101 -49 -28 -102 -41
6420d1l9J73N7m2j66j5M9k0j7j6N6M7m8J5k7p4O5LJ2J34j33Q4p4O6oor0l9J11
$$ -41 -80 93 150 108 -58 -73 -24 -44 -61 -77 -21 26 -22 -7 -34 -108 -43 -40 -28 106 -27 57 -17 49 43 37 -53 -92 19
6449A9k1K5J13q9Kk0l6K3M7j42J6J94p8j46P2R7q0l5k4L6O8L6j24Q8k8Pp1j6J78
$$ 19 -2 23 136 47 49 29 -7 16 63 -79 -63 131 53 -93 -21 76 -4 -39 -63 -27 41 77 -47 41 13 20 -51 -67 111
6478A11j05pj7M6p8J7j9j1P2K2q2J42k02J38N5p8q2M8N1j08J26m7J35q3n4j26
$$ 111 6 -1 -18 28 -50 -33 -52 -63 9 31 -51 91 -111 27 82 4 -78 -30 21 -87 39 -8 127 44 -10 -136
6504a36K7J22m1j20J91%m2j6k6P1k5J0m2RP3k9L8l4j31J05k6n7M0k5O8l8J0N8
$$ -136 -109 13 -28 -148 43 43 1 -15 -41 30 5 15 -27 -18 55 26 64 30 -101 4 -22 -79 -39 -64 4 -34 -24 34
6532C4o4K4R6j52J4J28l2j90R0J8O5o6P9k3j07P1O3j4M7m0j00J50l5j25N9o3M0
$$ 34 -30 -6 90 -62 -48 80 48 -142 -52 -34 31 -35 44 21 -86 -15 48 34 81 41 -59 91 56 -69 -10 -73 -33
6559c3P4j37R6o7L2oM1jl7L4L3%j17J00n5R3jj53R2nP8j34KJ62j28J38Nq1P6n5
$$ -33 41 -96 0 -67 -35 -41 0 -1 -38 -4 29 29 -88 12 -43 50 49 -104 -12 -17 61 -73 -71 91 -37 101 106 25 101 46
6589D6K2o1qRK9o7J6M3m4J3K6k7K1j08N7M1nK1K4k2m9M2K7k3q8J48OJjj6j10N2
$$ 46 68 7 -1 8 37 -30 -14 29 -15 -2 24 -3 18 -90 -33 8 3 24 48 26 -23 19 46 23 -65 83 89 90 89 73 -37 15
6621A5m2N8j41J00p1J69j76KJ3J24j11J29o1k2l5l4O3n0J48k8n9m8O2n0K4k7J66
$$ 15 -27 31 -110 -10 -81 88 -88 -86 -73 51 -60 69 8 -14 -49 -83 -20 -70 78 50 -9 -57 5 -45 -21 -48 118
6648A18r4p6J49p2op1N1n8R9r9N8J44j87K1J2j0l0M5jMJ9J7NO8k15M5P8k6L0Q7
$$ 118 24 -52 97 25 19 -52 -1 -59 40 -59 -1 143 -44 -23 -11 -21 -51 -6 -7 -3 16 33 38 106 -109 -64 14 -12 18 105
6678A05j25L8Mj33R2N2n8N2M0l6j25j2J33JK0jM5p0o6J24r3mK5J57j36O9j62J43
$$ 105 -20 18 22 -111 -19 33 -25 27 67 31 -94 -106 27 28 48 47 92 22 -44 80 -13 -17 8 165 29 98 -64 79
6706G9j29pO6L8%l0%%N4j21m8J14j6p4O4K3Q2j00m1M9M0j3J3p8r2K01mj15J42
$$ 79 -50 -57 9 47 47 17 17 17 71 -50 -98 16 0 -74 -10 13 95 -5 -46 3 43 30 43 -35 -127 74 70 -45 97
6735I7j98J18o6R5N4j89RQ9M3Q3o9n8J23j64M8J35k23J86j11k1M6n9O0l7R8N1
$$ 97 -101 17 -49 46 100 -89 -80 9 52 135 66 8 131 -33 15 150 -73 113 2 -19 27 -32 28 -9 89 140
6761A40k03J53j34jJ93j05j13L4N3j8l8l3J5mP6j05NO6r0J59j01J16l8l7n1M5
$$ 140 -63 90 -44 -45 148 43 -70 -36 17 -1 -39 -72 -57 -61 15 -90 -85 -19 -109 50 -51 65 27 -10 -61 -16
6787a6J01r9r2P0m4J19p1Q3j52J88j20L3Mq5J06j0o3R6n4KJnL7p7q0J03N9mn3
$$ -16 85 -14 -106 -36 -80 39 -32 51 -101 87 -33 0 4 -81 25 15 -48 48 -6 -4 -3 -8 29 -48 -128 -25 34 30 -23
6816b3K0j77J52j3lK0R0L3ro5J3k7j06N7m1P7j2J12j22pp5N5L5k7j1RM7M2p0R7
$$ -23 -3 -180 -28 -41 -44 -24 66 99 90 25 38 11 -95 -38 -79 -2 -14 98 -24 -31 -106 -51 -16 -43 -54 -45 2 44 -26 71
6846G1p1L9j5j06j0N4P8r5O7K4j53J13o0J18r9J01p7r2N0J0R4j02l6J79o0P0j50
$$ 71 0 39 24 -82 -92 -38 40 -55 12 36 -117 -4 -64 54 -45 56 -21 -113 -63 -53 41 -61 -97 82 22 92 -58
6873e8K3J37o7q3M3L8l6n9LJ02m0po3J13m5j8%J26l2o6J6O6j44NJ9O1j17N5k6
$$ -58 -35 102 35 -48 -5 33 -3 -62 -59 43 3 -4 -67 46 1 -17 -17 109 77 11 27 93 -51 -46 -27 34 -83 -28 -54
$$ [...]
8191f
##END NTUPLES=NMR FID
##END=
