##TITLE=1H_DE-80H_X3
 200.13MHz, d2o
 8 sc
 
 19ns.26.2.2025
##JCAMPDX= 6.0         $$ Bruker NMR JCAMP-DX V2.0
##DATA TYPE= NMR FID
##DATA CLASS= NTUPLES
##ORIGIN= UXNMR, Bruker Analytische Messtechnik GmbH
##OWNER= pz
$$ XWIN-NMR		Version 3.5
$$ Thu Jul 23 14:39:54 2026 Russian Standard Time (UT+4h)  Yarkov@DPX200
##.OBSERVE FREQUENCY= 200.1313
##.OBSERVE NUCLEUS= ^1H
##.DELAY= (6, 6)
##.ACQUISITION MODE= SIMULTANEOUS
##.ACQUISITION SCHEME= undefined
##.AVERAGES= 8
##.DIGITISER RES= 18
##SPECTROMETER/DATA SYSTEM= spect
##.PULSE SEQUENCE= zg30
##.SOLVENT NAME= CDCl3
##.SHIFT REFERENCE= (INTERNAL, CDCl3, 0, 14.3821)
##AUDIT TRAIL= $$ (NUMBER, WHEN, WHO, WHERE, WHAT)
$$ ##TITLE= Audit trail, XWIN-NMR		Version 3.5
$$ ##JCAMPDX= 5.01
$$ ##ORIGIN= Bruker BioSpin GmbH
$$ ##OWNER= Yarkov
$$ C:/Bruker/XWIN-NMR/data/yarkov2/nmr/H-C/1/audita.txt
$$ ##AUDIT TRAIL=  $$ (NUMBER, WHEN, WHO, WHERE, WHAT)
(   1,<2026-07-23 14:39:23.09 +0400>,<Yarkov>,<DPX200>,
      <created by zg, POWCHK disabled, PULCHK disabled
       configuration hash MD5:
       00 E9 B6 7A A2 85 ED C7 34 08 36 98 17 FE 4E 26
       data hash MD5: 16K
       11 AC 5E 9D 4D D5 B6 08 D7 4E B0 FB 16 68 CD 61>)
$$ ##END=
$$ 
$$ hash MD5
$$ 0C DA 8E 8D 89 39 31 CF 40 BE FC D4 56 1F D9 AA
##$RELAX= 
##$RELAX= 
##$RELAX= 
##$RELAX= 
##$RELAX= 
##$RELAX= 
$$ Bruker specific parameters
$$ --------------------------
##$DU= <C:/Bruker/XWIN-NMR>
##$EXPNO= 1
##$NAME= <H-C>
##$PROCNO= 1
##$TYPE= <nmr>
##$USER= <yarkov2>
##$AMP= (0..31)
100 100 100 100 100 100 100 100 100 100 100 100 100 100 100 100 100 100 
100 100 100 100 100 100 100 100 100 100 100 100 100 100 
##$AQSEQ= 0
##$AQ_mod= 1
##$AUNM= <au_zg>
##$AUTOPOS= <>
##$BF1= 200.13
##$BF2= 200.13
##$BF3= 200.13
##$BF4= 200.13
##$BF5= 200.13
##$BF6= 200.13
##$BF7= 200.13
##$BF8= 200.13
##$BYTORDA= 1
##$CFDGTYP= 0
##$CFRGTYP= 5
##$CHEMSTR= <none>
##$CNST= (0..31)
1 1 145 1 1 1 1 1 1 1 1 1 1 1 1 1 1 1 1 1 1 1 1 1 1 1 1 1 1 1 1 1 
##$CPDPRG= <>
##$CPDPRG1= <>
##$CPDPRG2= <>
##$CPDPRG3= <>
##$CPDPRG4= <mlev>
##$CPDPRG5= <mlev>
##$CPDPRG6= <mlev>
##$CPDPRG7= <mlev>
##$CPDPRG8= <mlev>
##$CPDPRGB= <>
##$CPDPRGT= <>
##$D= (0..31)
0 0.7 0 0 0 0 0 0 0 0 0 0.03 0 0 0 0 0 0 0 0 0 0 0 0 0 0 0 0 0 0 0 0 
##$DATE= 1784803162
##$DBL= (0..7)
120 120 120 120 120 120 120 120 
##$DBP= (0..7)
150 150 150 150 150 150 150 150 
##$DBP07= 0
##$DBPNAM0= <>
##$DBPNAM1= <>
##$DBPNAM2= <>
##$DBPNAM3= <>
##$DBPNAM4= <>
##$DBPNAM5= <>
##$DBPNAM6= <>
##$DBPNAM7= <>
##$DBPOAL= (0..7)
0.5 0.5 0.5 0.5 0.5 0.5 0.5 0.5 
##$DBPOFFS= (0..7)
0 0 0 0 0 0 0 0 
##$DE= 6
##$DECBNUC= <off>
##$DECIM= 32
##$DECNUC= <off>
##$DECSTAT= 4
##$DIGMOD= 1
##$DIGTYP= 9
##$DL= (0..7)
0 120 120 120 120 120 120 120 
##$DP= (0..7)
150 150 150 150 150 150 150 150 
##$DP07= 0
##$DPNAME0= <>
##$DPNAME1= <>
##$DPNAME2= <>
##$DPNAME3= <>
##$DPNAME4= <>
##$DPNAME5= <>
##$DPNAME6= <>
##$DPNAME7= <>
##$DPOAL= (0..7)
0.5 0.5 0.5 0.5 0.5 0.5 0.5 0.5 
##$DPOFFS= (0..7)
0 0 0 0 0 0 0 0 
##$DQDMODE= 0
##$DR= 18
##$DS= 0
$$ [...]
##$SUBNAM2= <"">
##$SUBNAM3= <"">
##$SUBNAM4= <"">
##$SUBNAM5= <"">
##$SUBNAM6= <"">
##$SUBNAM7= <"">
##$SUBNAM8= <"">
##$SUBNAM9= <"">
##$SW= 18.0517328524113
##$SWIBOX= (0..15)
0 0 2 0 0 0 0 0 0 0 0 0 0 0 0 0 
##$SW_h= 3612.71676300578
##$TD= 16384
##$TD0= 1
##$TE= 0
##$TE2= 300
##$TE3= 300
##$TEG= 300
##$TL= (0..7)
0 120 120 120 120 120 120 120 
##$TP= (0..7)
150 150 150 150 150 150 150 150 
##$TP07= 0
##$TPNAME0= <>
##$TPNAME1= <>
##$TPNAME2= <>
##$TPNAME3= <>
##$TPNAME4= <>
##$TPNAME5= <>
##$TPNAME6= <>
##$TPNAME7= <>
##$TPOAL= (0..7)
0.5 0.5 0.5 0.5 0.5 0.5 0.5 0.5 
##$TPOFFS= (0..7)
0 0 0 0 0 0 0 0 
##$TUNHIN= 0
##$TUNHOUT= 0
##$TUNXOUT= 0
##$USERA1= <user>
##$USERA2= <user>
##$USERA3= <user>
##$USERA4= <user>
##$USERA5= <user>
##$V9= 5
##$VALIST= <valist>
##$VCLIST= <CCCCCCCCCCCCCCC>
##$VD= 0
##$VDLIST= <DDDDDDDDDDDDDDD>
##$VPLIST= <PPPPPPPPPPPPPPP>
##$VTLIST= <TTTTTTTTTTTTTTT>
##$WBST= 1024
##$WBSW= 4
##$XGAIN= (0..3)
0 0 0 0 
##$XL= 0
##$YL= 0
##$YMAX_a= 27907
##$YMIN_a= -32279
##$ZGOPTNS= <>
##$ZL1= 120
##$ZL2= 120
##$ZL3= 120
##$ZL4= 120
##$ABSF1= 10
##$ABSF2= 0
##$ABSG= 5
##$ABSL= 3
##$ALPHA= 0
##$AQORDER= 0
##$ASSFAC= 0
##$ASSFACI= 0
##$ASSFACX= 0
##$ASSWID= 0
##$AUNMP= <proc_1d>
##$AZFE= 0.1
##$AZFW= 0.1
##$BCFW= 1
##$BC_mod= 2
##$BYTORDP= 1
##$COROFFS= 0
##$CY= 83.5205535888672
##$DATMOD= 1
##$DC= 2
##$DFILT= <>
##$DTYPP= 0
##$F1P= 10.8118882576601
##$F2P= -7.23987719738617
##$FCOR= 0.5
##$FTSIZE= 0
##$FT_mod= 4
##$GAMMA= 1
##$GB= 0.15
##$INTBC= 1
##$INTSCL= 1
##$ISEN= 128
##$LB= 0.25
##$LEV0= 0
##$LPBIN= 0
##$MAXI= 10000
##$MC2= 0
##$MEAN= 0
##$ME_mod= 0
##$MI= 1.114404
##$NCOEF= 0
##$NC_proc= 0
##$NLEV= 6
##$NOISF1= 3.799351
##$NOISF2= 2.8
##$NSP= 1
##$NTH_PI= 0
##$NZP= 0
##$OFFSET= 14.38212
##$PC= 1
##$PHC0= -7254.183
##$PHC1= 2.82197
##$PH_mod= 1
##$PKNL= yes
##$PPARMOD= 0
##$PSCAL= 0
##$PSIGN= 0
##$REVERSE= no
##$SF= 200.129724274929
##$SI= 16384
##$SIGF1= 3
##$SIGF2= 2
##$SINO= 400
##$SIOLD= 16384
##$SREGLST= <1H.CDCl3>
##$SSB= 0
##$STSI= 0
##$STSR= 0
##$SW_p= 3205.1282051282
##$SYMM= 0
##$S_DEV= 0
##$TDeff= 0
##$TDoff= 0
##$TI= <>
##$TILT= no
##$TM1= 0
##$TM2= 0
##$TOPLEV= 0
##$USERP1= <user>
##$USERP2= <user>
##$USERP3= <user>
##$USERP4= <user>
##$USERP5= <user>
##$WDW= 1
##$XDIM= 8192
##$YMAX_p= 0
##$YMIN_p= 0
$$ End of Bruker specific parameters
$$ ---------------------------------
##NTUPLES= NMR FID
##VAR_NAME=  TIME,          FID/REAL,        FID/IMAG
##SYMBOL=    X,             R,               I
##VAR_TYPE=  INDEPENDENT,   DEPENDENT,       DEPENDENT
##VAR_FORM=  AFFN,          ASDF,            ASDF
##VAR_DIM=   8192,          8192,            8192
##UNITS=     SECONDS,       ARBITRARY UNITS, ARBITRARY UNITS
##FACTOR=    0.0002768,     1,               1
##FIRST=     0,             0,               0
##LAST=      2.2672688,     0,               0
##MIN=       0,             -32279,          0
##MAX=       2.2672688,     27907,           0
$$ Real data points
##PAGE= N=1
##DATA TABLE= (X++(R..R)), XYDATA
$$ [...]
762E7J4j19L5J03o8j47R0j6J89j83n9J25R4m5j6o1o3P1l9j9Q1J02p8Kk8m8J42
$$ 57 71 -48 -13 90 22 -125 -35 -51 138 -45 -104 21 115 70 54 -7 -70 1 -38 -57 24 126 48 50 22 -26 116
789A16j23Q4o5o2kJ14r4M9o7R7p9M1J36j72O1l7j07J45j17J18O5r6k8j4Q6l1J42
$$ 116 -7 77 12 -50 -52 62 -32 17 -50 47 -32 9 145 -27 34 -3 -110 35 -82 36 101 5 -23 -37 49 18 160
816A60j45q2R7q7Q6l7n9P8K9m6J4N1j09Q6j51K14j44rM1J2O1n4O3J8p3Ro3rn2
$$ 160 15 -67 30 -57 29 -8 -67 11 40 -6 8 59 -50 36 -115 99 -45 -54 -13 -1 60 6 69 87 14 23 -40 -49 -101
845a01P0lj55QK89j24P1r6O2m0m3j2o7L54k2N9oq70P43m4O6j30m55O67n23L86
$$ -101 -31 -34 -189 -181 108 -16 55 -41 21 -19 -62 -74 -141 213 191 250 244 -626 117 73 139 9 -446 221 -302 84
871H4J98j55j74K97k27J42k26P9K3K6p0mM3l7Mj7J20j15M3K9O4r8m7p9J35n2j56
$$ 84 282 127 -47 250 23 165 -61 18 41 67 -3 -7 36 -1 3 -14 106 -9 34 63 127 29 -18 -97 38 -14 -170
898a70m62M92J84m7M0k1p6m1J23L5QKm4K4l0j14J20j8j1l2m9J03p4KJ44q4M3m0
$$ -170 -632 -140 44 -3 37 16 -60 -101 22 57 65 67 23 47 17 -97 23 5 -6 -38 -87 16 -58 -56 88 4 47 7
926Gj7J40j60Q5p1O0o0K8N0r9j18K08P1r9p9O9P4M1j26Lk8K2Kk9q7N5J55j85J57
$$ 7 -10 130 -30 55 -16 44 -16 12 62 -37 -155 53 124 25 -54 15 89 130 4 7 -21 1 3 -26 -113 -58 97 -88 69
955F9l8N7m6p5J02m1j5m7J42r3k3k7l7R4Ol0L2j68J29m1L4P2j31J75j70K3j0O7
$$ 69 31 88 42 -33 69 28 13 -34 108 15 -8 -35 -72 22 28 -2 30 -138 -9 -50 -16 56 -75 100 -70 -47 -57 10
983A0k2M4q4kJ36jj0j32J7O7L5k8NM4l7k1o5O5J7o9K9P7o1p9M3q5OO2O1o%L0n2
$$ 10 -12 32 -52 -54 82 81 71 -61 -44 23 58 30 35 79 42 21 -44 21 38 -31 -2 75 14 -65 -22 -107 -101 -39 22 16 16 46 -6
1016fj01J79k7j10M2K0p5J80m4j8n9J3o4J19r3O9m8N6q7P9j3r2J72K3k28J80p
$$ -6 -107 72 45 -65 -23 -3 -78 102 58 40 -19 -6 -70 49 -44 25 -23 33 -54 25 12 -80 92 115 -113 67 60
1043F0j04J2L8R3p7K2mj18oL7R7m3L8l4k4P5p6k5K4Rn3J66k26J15N6j54K04j12
$$ 60 -44 -32 6 99 22 44 40 -78 -84 -47 50 7 45 11 -13 62 -14 -39 -15 -6 -59 107 -119 -4 52 -102 102 -10
1071a0J0K3R7j47Kl6M1pQ2j09J5l5J54j84J77l0j11M1k2n9J06l3j9L2n3J68j26
$$ -10 0 23 120 -27 -25 -61 -20 -27 55 -54 -39 -74 80 -104 73 43 -68 -27 -49 -108 -2 -35 -54 -22 -75 93 -33
1098c3nj06J17O2j11J23j32P8Qk8J4l2k6Q0J8o3K3N5j4M0j4r9K7J4o1nJ25o9p
$$ -33 -38 -144 -27 35 -76 47 -85 -7 1 -27 -13 -45 -71 9 27 -36 -13 42 28 68 54 -45 -18 -4 -65 -70 55 -14 -21
1127b1k3N5J1J2J7Pm8j31P4R0q4Q6r3j2J00r0NJ38j38PPQ8j14K0O1o0K7n1J06
$$ -21 -44 11 22 34 51 58 10 -121 -47 43 -41 45 -48 -60 40 -50 -45 93 -45 -38 -31 57 -57 -37 24 -36 -9 -60 46
1156D6j05N1j43J30K5l6M8o0Q4k8p3J12J1k9p7mOJ22j52J46r6j11R6J00k2q5O2
$$ 46 -59 -8 -151 -21 4 -32 16 -44 40 12 -61 51 62 33 -44 -48 -42 80 -72 74 -22 -133 -37 63 41 -44 18
1183A8m5j2R8Lj01J88j55J8k8m8P5L2n6k3J22j16J9O5n3m5o3J48l3Jm3J27k0p2
$$ 18 -27 -39 59 62 -39 149 -6 12 -16 -64 11 43 -13 -36 86 -30 -11 54 1 -44 -107 41 8 9 -34 93 73 1
1211Am9O0MP1n9o1o2J28k9K17k63J28k1k59L65k71J50J1Pk29l3J16J32r9J2L7
$$ 1 -48 12 16 87 28 -33 -95 33 4 221 -42 86 65 -194 171 -100 50 61 68 -161 -194 -78 54 -45 -33 4
1237Dn5J02q2J24r3r6R5Lk7m7k0K33p6j56J60l3r2P3j9M4l6R9p6O9j16k5k0K2
$$ 4 -51 51 -31 93 0 -96 -1 2 -25 -72 -92 141 65 -91 69 36 -56 17 -2 42 6 105 29 98 -18 -43 -63 -41
1265d1L7k5J09j09M6K1l2j33P8L8J17j49J6N0Q9r7K6K4o1K1p4J6k8O7l7N4p0R5
$$ -41 -4 -29 80 -29 17 38 6 -127 -49 -11 106 -43 -27 23 112 15 41 65 4 25 -49 -33 -61 6 -31 23 -47 48
1293D8n5J4r1P1L6L9m8OOqR0%n5n1%jN0k3K6n8j8L0m8j4P5J49k93L28m37J61L6
$$ 48 -7 7 -84 -13 23 62 14 20 26 18 108 108 53 2 2 1 51 28 54 -4 -22 8 -40 -54 21 170 -123 205 -232 -71 -35
1324c5op1J09M4j25k7M1J10j13L4J31j32R6j11o8L2J75r1R4j43J48l97N28J30
$$ -35 -41 -112 -3 41 -84 -111 -70 40 -73 -39 92 -40 56 -55 -123 -91 84 -7 87 -56 92 -305 223 353
1348C53m57N4O9n7j97J86J3l8K01j53j2N1qQ6j63m1R0KR6q4%l7qN7qJ14j32O3
$$ 353 -104 -50 19 -38 -235 -49 -36 -74 127 -26 -38 13 5 91 -72 -113 -23 -21 75 -9 -9 -46 -54 3 -5 109 -23 40
1376D0j9O5j72J20m1M7l8m3J45q7l5j1J22k74J71N1k80L13q0J47k17O92q37j49
$$ 40 21 86 -86 34 -7 40 2 -41 104 17 -18 -29 93 -181 -10 41 -239 74 -6 141 -76 616 -221 -370
1400c70M22N70n46l16j56K50J98l62K43K7J63k68J44K1J03j83N3J2K0on3O6J8
$$ -370 52 622 76 -240 -396 -146 52 -310 -67 -40 123 -145 -1 20 123 -60 -7 5 25 19 -34 32 50
1423E0q1m3O2O7r4Q6L1m2l8RM1k3o1OP7J6j6J6o5M1J7O0j15j2K5l5K6L7j6J9K4
$$ 50 -31 -74 -12 55 -39 47 78 36 -2 7 48 25 -36 -30 47 63 47 63 -2 39 56 116 1 -11 14 -21 5 42 26 45 69
1454F9o2r3lQ0k3k9Q2rm4j03Q6Q8n10M63j97M12k28L4KMk01K73kj62K51j21j56
$$ 69 7 -86 -89 -9 -32 -61 21 12 -32 -135 -49 39 -471 -8 -205 207 -21 13 15 19 -182 91 89 -73 178 57 -99
1481i9J41o5NJN7j8n5M4L6k8J52k61J93l4oJ5l9rM1n5N8J7k4j48K4O6l7m2P2K0
$$ -99 42 -23 -18 -17 40 22 -33 11 47 19 171 -90 103 69 63 78 39 30 71 16 74 91 67 -81 -57 9 -28 -70 2 22
1511B2Or8N7K1j14R0n9J3pN5J7L8j9jn3Q5j7m3j02J7J18o9j2jJ55j30j3L2M8j40
$$ 22 28 -70 -13 8 -106 -16 -75 -62 -69 -14 3 41 22 21 -32 53 36 -7 -109 -92 26 -43 -55 -56 99 -31 -44 -12 36 -104
1541a04J49l4r6J16j33K13j69j0m9R0Ok3J8NL3J3K2j25N7k7p9K47n1O3k01O2o4
$$ -104 45 11 -85 31 -102 111 -58 -68 -117 -27 -21 -44 -26 -21 12 25 47 -78 -21 -48 -127 120 69 132 -69 -7 -71
1568g1Q0L5q1O5l1l5K7N9mn6P8j52K27j64j5R4r7o2J05j47J37%N1k1JM6l2j20
$$ -71 9 44 -37 28 -3 -38 -11 48 44 -12 66 -86 141 -23 -38 56 -41 -103 2 -145 -8 -8 43 22 23 69 37 -83
1596h3M0m7J38p9j2l9J69q2j7J11j77J31j34J60j39QJ58q6j13P3M8o5M5j23R7
$$ -83 -43 -90 48 -31 -43 -82 87 5 -12 99 -78 53 -81 79 -60 -52 106 20 -93 -20 28 -37 8 -115 -18
1621a8J6k8O5o0P3M1j36J35j36K8l8m2J33j16R6m4J14p2nK5l7j4kLoR7j06%o6
$$ -18 -2 -30 35 -25 48 89 -47 88 -48 -20 -58 -100 33 -83 13 -31 83 11 6 31 -6 -20 -22 -19 -25 72 -34 -34 -100
1650a00J92n4p9M9j61J94K6k1o3k3j6J75j16m0K3l8P2l2o5%Q7mo7k1J41Rj00q
$$ -100 92 38 -41 8 -153 41 67 46 -17 -40 -56 119 3 -37 -14 -52 20 -12 -77 -77 10 6 -61 -82 59 68 -32 -40
1678d0n5k6L4j9J52j34J59p8J09n8L6n7k1J8J1L4r3Pn8j1O3Q7n6J1J01j31P0L7
$$ -40 -95 -121 -87 -106 46 -88 71 -7 102 44 80 23 2 20 31 65 -28 -21 -79 -90 -27 60 4 15 116 -15 55 92
1706I2j25P2k36L84J92l65o9KJ4ql4J25L9j66J25o9K2l3J00j59OJ22k6k8l5ll2
$$ 92 -33 39 -197 187 379 14 -55 -53 -39 -47 -81 44 83 -83 42 -27 -5 -38 62 -97 -91 31 5 -23 -58 -61 -93
1733i3LQ1K6J0j06K4Q2j4l2j1QM1L4k2J7n0j08K00j46J6L3j11J20lO2n8n0M9N7
$$ -93 -90 -9 17 27 -79 -55 27 13 -19 -30 -22 19 53 31 48 -2 -110 90 -56 -40 -7 -118 2 -1 61 3 -47 2 59
1762E9j9n9PK8j71R8l0k54M20o9o3J9O4K4k3Lo1M1o4q2K23j70J30r1J4L1r6J33
$$ 59 40 -19 -12 16 -155 -57 -87 -341 79 10 -53 -34 30 54 31 34 -27 14 -50 -132 91 -79 51 -40 -26 5 -91 42
1790D2j1L8k1n2K2LM1o1l8J1r6L8N2L6p5R3M2j90J45r5R6o3N5j1j12Q4R2q0j5
$$ 42 31 69 48 -4 18 21 62 1 -37 -26 -122 -84 -32 4 -71 22 64 -126 19 -76 20 -43 12 1 -111 -27 65 -15 -30
1819c0k5M7L5R5j21m7j9P4M9q4l8P1JK3j8j3k2Kj4O4L8j41J87k03M9OM9r0L3p
$$ -30 -55 -8 27 122 1 -46 -65 9 58 -26 -64 7 8 31 13 0 -22 -20 -34 30 68 -73 114 -89 -40 -34 15 -75 -42 -49
1849d9O4n5k2R6o6j4J42r7n0O7j9j07J27r9R8L1r8J48j03Q9j56kR0L7J3j63P5
$$ -49 15 -40 -62 34 -32 -46 96 -1 -51 16 -3 -110 17 -82 16 47 -51 97 -6 83 -73 -75 15 52 65 -98 -23
1876b3L1m9M7q0Q6J55j15m9r8O5J07o3P7j58J23j44M4O5Jn6l0J01L0j16L7M8L7
$$ -23 8 -41 6 -74 12 167 52 3 -95 -30 77 14 91 -67 56 -88 -44 21 22 -34 -64 37 67 -49 -12 36 73
1903G3j05J89k08L8l7J16l1m8L6N9o1j18J15j3P9j6K0J4n8j03MMR3q3L0m0m37
$$ 73 -32 157 -51 -13 -50 66 35 -13 23 82 21 -97 18 5 84 68 88 102 44 -59 -55 -51 42 -41 -11 -51 -488
1930d88Q56j570Q89N51p89K64K72l9k51O24m43N68p17O34j44k5j194K87R40k99
$$ -488 368 -1202 -313 238 -551 -287 -15 -54 -305 319 -124 444 -273 361 217 192 -1002 -715 225 -74
1950g4l98J69M24l55P9O2K23J59k22K36j3l56k97K71J54p7j4J79k18p2J04M8N2
$$ -74 -472 -303 121 -234 -155 -93 130 289 67 303 290 -66 -363 -92 62 -15 -29 150 -68 -140 -36 12 64
1973F4q0P5m9K2L9j15J19r1J6l8K8k9J16j71J12L1l5n6R8J6j5J0l1Jj01P3n7J2
$$ 64 -16 59 10 32 71 -44 75 -16 0 -38 -10 -39 77 -94 18 49 14 -42 56 72 57 67 36 37 -64 9 -48 -36
2001c6N8K0K9l3Mr1R3q5P8p9P1O7p2K4m3K9j14J04j04O8O7K7J0j05M7L3o3K2j5
$$ -36 22 42 71 38 42 -49 44 -41 37 -42 29 96 24 48 5 34 -80 24 -80 -12 55 82 92 -13 34 67 4 26 11
2030A1n2N8Mnpq1J13L6j82M8J8PP4j0L3l5j8J4Nm0k7n2J12n8N9k3j90J22Q6J29
$$ 11 -41 17 21 16 9 -72 41 77 -105 -57 -39 -32 42 32 65 30 12 26 31 -9 -36 -88 24 -34 25 2 -188 -66 20 149
2060A49j56N5k0L2J2o6J09j45K3o3Q0n4N8j14P2O9o8m2J27n6l1l5P1R9k1j34M0
$$ 149 -7 48 28 60 72 6 115 -30 -7 -70 10 -44 14 -100 -28 41 -27 -69 58 2 -29 -64 7 106 85 -49 -9
2087inM2O1q0M1k0o5k9J0p9J62n7l7mJ68%q4j0j63J68J4J39o9J7k03J10O1o1K9
$$ -9 -14 28 89 9 50 30 -35 -64 -54 -133 29 -28 -65 -69 99 99 15 5 -158 10 24 163 94 111 -92 18 79 18 47
2116D7l1M9j08k1O8j66K02m5p8o7J57j3m0M6N1M9o5m5P5K9j3n9N2r9N6r4O0J14
$$ 47 16 65 -43 -64 4 -162 40 -5 -83 -150 7 -6 -46 0 51 100 35 -10 65 94 81 22 74 -25 31 -63 -3 111
2144A11j68n5J08J06K7j28L4Jo5M9L9n5N7o5l7J43j12L6k5J6M4o8q7J11m1O8r4
$$ 111 -57 -112 -4 102 129 1 35 36 -29 20 59 4 61 -4 -41 102 -10 26 1 17 61 -7 -94 17 -24 44 -50
2171e0k5Q7m5R5r2JMK6%k2M7j11J37p9m4J11j08J02M0r7mj7Q8n5R5j9o9j0m3J00
$$ -50 -75 12 -33 62 -30 -29 -25 1 1 -21 26 -85 52 -27 -71 40 -68 34 74 -23 -27 -44 44 -11 84 65 -4 -14 -57 43
2201D3q0J3NM0L6j96J98p3j7M6k9j5Q6p5J1m2N3l4Q5j36L3Q4l1K9o5J06p9J1K4
$$ 43 -37 -24 -19 21 57 -139 59 -14 -31 15 -14 -29 57 -18 -7 -49 4 -30 55 -81 -48 36 5 34 -31 75 -4 7 31
2230C1j67J85j43N6k4j4n0L8k5J27k5Q3j7k3m7Ql1kk1Q4MM1p0oOqJk2j9P4M6j00
$$ 31 -136 49 -94 -38 -62 -76 -126 -88 -113 14 -11 72 55 32 -15 -7 -38 -40 -61 23 27 68 -2 -8 -2 -10 -9 -31 -50 24 70 -30
2262c0JM8j07P3l2K9K2n7o4Q4N7l2Q4o6K0Jo5R3j27J32n8jJ09k75K11o7M2K6k5
$$ -30 -29 19 -88 -15 -47 -18 4 -53 -117 -33 24 -8 76 10 30 31 -34 59 -68 64 6 5 114 -161 50 -17 25 51 26
2291B6p5P7Lk5kk5M6k0l4J63j20N5p1l8Q0R2j71oK4J1N2J3oj57J53j07J5O2lo4
$$ 26 -49 28 31 6 4 -21 25 5 -29 134 14 69 -2 -40 40 132 -39 -45 -21 -10 42 55 49 -108 45 -62 -47 15 12 -52
2321e2J9R3r6J4J17l2K1j76J57j43JJ39j94J42l3N5j82J87j08J08Mn8J7l0q1P8
$$ -52 -33 60 -36 -22 95 63 84 -92 65 -78 -77 62 -132 10 -23 32 -150 37 -71 37 41 -17 0 -30 -111 -33
2347c3R7r5NM2M5j07r8J13j18K91k24J6K9M1n3P2L4P1p5m5lK7np7J2M8p5ML4R6
$$ -33 64 -31 -26 16 61 -46 -144 -31 -149 142 -82 -66 -37 4 -49 23 57 128 53 8 5 32 27 -50 -38 10 -65 -61 -27 69
2377F9k1O3j21K0k9J1J01o8Np1J66n8r7K4j1pJ3pk2j2J26m4k0L5k3K0n9P0k3P2
$$ 69 48 111 -10 10 -19 -8 93 25 30 -41 125 67 -30 -6 -17 -24 -11 -18 -40 -52 74 30 10 45 22 42 -17 53 30 102
2407A02l4L5n7j49J41J0n3k1N3k3K4o3L0q2J70k0q2M7L5K2k8L2j62L7K1o1j21
$$ 102 68 103 46 -103 38 48 -5 -26 27 4 28 -35 -5 -87 83 63 -19 28 63 85 57 89 -73 -36 -15 -76 -197
2434a97K64j6l1K9p0l8O9k0j9k9M8l7P0K6j76R6L7m6J38%j50p3P5k1O3J4k1rQ9
$$ -197 67 51 20 49 -21 -59 10 -10 -29 -58 -10 -47 23 49 -127 -31 6 -40 98 98 -52 -125 -50 -71 -8 6 -15 -24 65
2463F5k7q8P3O6l8j9Q3j21j1l4l5J17n9m7M4R7J1r9Q7j16oJ30j48O4M6qj4J6R3
$$ 65 38 -50 23 89 51 32 115 -6 -17 -51 -86 31 -28 -75 -31 66 77 -22 65 -51 -57 73 -75 -11 35 27 13 29 122
2492A22j25o4K06j61O4K4m0M1j0J8j06K1J5R3o8J1M3j03P5K7j81R1j1L2p0kR3
$$ 122 -3 -67 139 -22 42 66 26 67 57 75 -31 -10 5 98 30 41 84 -19 56 83 -98 -7 -18 14 -56 -58 35
2519C5N8r1l7lP3J36j73J04q0O4m3K1q9j46J87p5j6R1M0l5p7L9M7n6R3m2L1j9
$$ 35 93 2 -35 -38 35 171 -2 102 22 86 43 64 -25 -171 16 -59 -75 16 56 21 -56 -17 30 -26 67 25 56 37
2547C7r8PM1O4j1j32J13Nj06O6QkP7j10mM1J2r6O8N3k2O1j40N6M5o3J02j16J01
$$ 37 -61 -54 -13 51 40 -92 21 26 -80 -14 -6 -8 69 -41 -45 -4 8 -88 -20 33 11 72 -68 -12 33 -30 72 -44 57
2576E7m2n5J1K7M3r6ML3J10jn9j1o6o3J66j48P8J27j02j5l4rR9n3L2j71J34M1
$$ 57 15 -40 -29 -2 41 -55 -51 -18 92 91 32 21 -45 -108 58 -90 -12 115 13 -2 -36 -45 54 1 33 -138 -4 37
2604C7m2K8M7n0N8j17n6N3O5n5M6L0m8Q6q9q3J20m4P7q0O2qm8o2j4Q8J09o4r5
$$ 37 -5 23 70 20 78 -39 -95 -42 23 -32 14 44 -4 82 -7 -90 30 -14 63 -17 45 37 -11 -73 -87 1 110 46 -49
2633d9O5j48J57k3M2r2J21j22M2P7j19J00K0n7r%M5j7Pj69K03n4o4K2L9J0j29
$$ -49 16 -132 25 2 44 -48 73 -49 -7 70 -49 51 71 14 5 5 50 33 40 -129 74 20 -44 -22 17 27 -102
2660a02J74K4p1k7K1l2K5r5O8n0J77l7p1Q1n5j36O7q5O7K12j14j17J14L3j04N1
$$ -102 72 96 25 -2 19 -13 12 -83 -15 -65 112 75 4 85 30 -106 -39 -124 -57 155 41 -76 38 71 -33 18
2686A8k7Q5m8m0J21j23k9n7M6N2R0o6O3r2jL4m5NN3J28r2j06m8J58o3mM8n7l9
$$ 18 -9 76 28 -12 109 -14 -43 -100 -54 -2 88 22 85 -7 -8 26 -19 -14 39 167 75 -31 -79 79 16 12 60 3 -36
2715c6k5N6JrQ0j81R4Lk7K1k5N6J3m4m6K12k75J78O1j80n5jj5J84jQm7N0pm4L
$$ -36 -61 -5 -4 -13 67 -114 -20 -17 -44 -23 -48 8 21 -23 -69 143 -132 46 107 -73 -128 -129 -144 40 39 47 0 50 43 -1 2
2746Bn6P1j7P0J8l8p3ML0Jo3N4q4P9j6P6k9k1mp2rQ6j4n8N9J53k19J76j23k2m5
$$ 2 -54 17 0 70 88 50 -23 -19 11 12 -51 3 -81 -2 -18 58 29 8 4 -68 -77 9 -5 -63 -4 149 -70 106 -17 -39 -84
2777h4P0n3M9K3K4L0pj60J47M3k32J47l2N3j7O1K7j13j6l9JM7J1l1k6J7K3l7M6
$$ -84 -14 -67 -18 5 29 59 52 -108 39 82 -150 -3 -35 18 1 62 89 -24 -40 -79 -78 -31 -20 -51 -77 -60 -37 -74 -28
2806b8K1k9j8pJ6N8K9j5l3P5j06J27k37K11p2n1Q4n5R1p0L3q5P9L7J0r3Ln3J22
$$ -28 -7 -36 -54 -61 -45 13 42 27 -6 69 -37 90 -147 64 -8 -59 25 -30 61 -9 24 -61 18 55 65 -28 -25 -78 44
2835D4j10Q8L8j33M6R4j66O7j6Q5p4N0l8L0J5M4m3J8m6j4O5j0p4o6J00L6j37J0
$$ 44 -66 22 60 -73 -27 67 -99 -32 -48 37 -37 13 -25 5 20 64 21 39 -7 -21 44 34 -40 -106 -6 30 -107 -97
2863i7J17k9J26j49K6P5j56J15N5j09Q1n1N7mq0N0K4j14J28m7k9L3m9Q3m9o5Q1
$$ -97 20 -9 117 -32 -6 69 -87 28 83 -26 55 4 61 57 -23 27 51 -63 65 18 -11 22 -27 56 7 -58 23
2890B3j26J65K9j43J7P7j17p5J32k1J53n18N96o26L79KJ35j23L1k1m5J2J51n4
$$ 23 -103 62 91 -52 -35 42 -75 -150 -18 -39 114 -404 192 -434 -55 -53 82 -41 -10 -31 -76 -64 87 33
2914C3N0j49N2O4mOq9jk2K4L1nn9J12pM2q7P2L5m8j39Q1P6o5jk9q7J78j1Lo0k4
$$ 33 83 -66 -14 50 46 52 -37 -38 -60 -36 -5 -10 -69 43 36 78 -9 63 98 50 -89 -8 68 3 2 -27 -114 64 53 56 -4 -28
2946b8k6J34k5J5j49J29j2n5m4mJ28n3M1p6J12n6J2o5N6l6Q0j2J8j71Q9n9J23
$$ -28 -54 80 55 70 -79 50 38 -17 -61 -65 63 10 51 -25 87 31 43 -22 34 -2 78 66 84 -87 2 -57 66
2973F6n9l8P8oo1K8n1j25J89m7M7r5m3J72p3K8j9N0q0L2n7J9J32j18j0N9p9J44
$$ 66 7 -31 47 41 -20 8 -43 -168 21 -26 21 -74 -117 55 -18 10 -9 41 -39 -7 -64 -45 87 -31 -41 18 -61 83
3001H3q8Q6j02rJ29p1m3L4k8N6K0r5J9m3J45j45KJ7J47m2k21R5P5q7N5J6k6L3
$$ 83 -5 81 -21 -30 99 28 -15 19 -9 47 67 -28 -9 -52 93 -52 -50 -33 114 72 -149 -54 21 -66 -11 5 -21 12
3029A2NL8r8o2N2l5J23NL0j11P2OL3m2M1m2O2j68O1L0K2j02N2J7m8N9j5q6J18
$$ 12 17 55 -43 -105 -53 -88 35 40 70 -41 31 37 70 28 69 27 89 -79 -18 12 34 -68 -16 1 -47 12 -3 -89 29
3058B9J6jo1O6qL1o3J3j21Q8o3J24j24L3J13p4L9q1J05n5l8M6r1l4K00m6p2P8
$$ 29 45 44 -17 49 41 72 9 22 -99 -11 -74 50 -74 -41 72 -2 37 -44 61 6 -32 14 -77 -111 89 43 -29 49
3086D9Q9j63M6j01J73j12j4k5Q0l0K7lN8m2N4o1m2k2M0j38J36M4N4j50RN4k2J70
$$ 49 138 -25 21 -80 93 -19 -33 -58 22 -8 19 16 74 32 86 25 -17 -39 1 -137 -1 43 97 -53 -44 10 -12 158
3114A58j20r3o2J1J28N7j79K04j11K0O4n9j15R9j5p5J29n3N6pO9j18j19K21j47
$$ 158 38 -55 -117 -106 22 79 -100 104 -7 13 77 18 -97 2 -13 -88 41 -12 44 37 106 -12 -131 90 -57
3139e7J23j03mj7n0L8N1k5J03k9j42J32j7rj8pO7m9N6k8j0N1n9K8K4r2J9k1J13
$$ -57 66 -37 -41 -58 -108 -70 -19 -44 59 30 -112 20 3 -6 -24 -31 36 -13 43 15 5 56 -3 25 49 -43 -24 -45 68
3168F8j31P5q2J23k9j1p1J9k2O3J8R8j33M6j78K10p9m2K1RL2roJ3P7j26M7J5k9
$$ 68 -63 12 -70 53 24 13 -58 -39 -61 2 20 118 -15 31 -147 63 -16 -58 -37 -28 4 -5 -11 2 79 -47 0 15 -14
3197a4j21K04q0P7p2J1mp3J14q0K3Q8o0O9m8p8N5J6k9m0P1J0j85K30m5pm1M3q9
$$ -14 -135 69 -11 66 -6 5 1 -72 42 -38 -15 73 13 82 34 -44 11 27 -2 -42 29 39 -146 84 39 32 -9 34 -55
3226e5J8J07p1j24J09j4J16o4qL1l9M2j41K09j01n7J02K8j09k0R9J3j08J31j30
$$ -55 -37 70 -1 -125 -16 -30 86 22 14 45 6 48 -93 116 15 -42 60 88 -21 -41 58 71 -37 94 -36
3251c6K1J8N7po0m9R3pM6L3r6N1q7L4K0k1M2o2n9M8R2k2l0J7k20K44Qj09Q7n5
$$ -36 -15 3 60 53 -7 -56 37 30 76 109 13 64 -23 11 31 10 52 -10 -69 -21 71 49 19 36 -184 60 68 -41 46 -9
3281iK9k06K27m8K78k13N8l58J61M9p2P8pQ3o4Ko2J27p5N0n1jn7J52nk37J65r
$$ -9 20 -186 41 -7 271 58 116 -242 -81 -32 -104 -26 -33 50 -14 -12 -74 53 -22 28 -23 -24 -81 71 66 -171 -6 -15
3309a5p3P4N1m5L2J1Ml2k5L7K3M0p4L4j24J04j09J31m5r0K1N2M5J7p3O4L3np7
$$ -15 -88 -14 37 -8 24 35 39 7 -18 19 42 82 8 42 -82 22 -87 44 -1 -91 -70 -18 27 44 -29 35 68 63 -14
3338a4K4j4n9K08j35jm2LoO9o3R4r3pJ09q9J21q8l6M8j04M6J38j47J5M8N9j24
$$ -14 10 -4 -63 145 10 9 -33 -30 -36 33 -30 64 -29 -36 73 -16 105 17 -19 29 -75 -29 109 -38 -23 25 84 -40
3366d0Q0L4k05J02P3j34O6J1j28J32P8k7j04J71j11nk42L95m01j001J507N7n46
$$ -40 40 74 -131 -29 44 -90 -24 -13 -141 -9 69 42 -62 109 -2 -7 -249 146 -255 -1256 251 308 -238
3389b38L06q6K8M4l8Rj00NJ13j11L6M4qn5P2rp5QR4j34K48o3k7qJ5j04Q0P2j50
$$ -238 68 -18 10 54 16 25 -75 -70 43 -68 -32 12 4 -51 21 12 -63 -55 39 -95 153 90 63 55 70 -34 46 118 -32
3418c2N8o2Q8Npj60N4O7o5J41q3K9Jk8n7nl3N7o6J21J7n3J4R0m7j09Q1j7mJ57
$$ -32 26 -36 52 57 50 -110 -56 11 -54 87 4 33 34 6 -51 -56 -89 -32 -98 23 40 -13 1 91 44 -65 16 -1 -5 152
3448A52k29K03j18P5Kl6j4j34J04j6J2PQ6q9J01j80R8o3O8q7lL3n0N9P9j9rM5
$$ 152 -77 126 8 83 85 49 35 -99 5 -11 1 8 94 5 106 -74 24 -39 29 -58 -61 -28 -78 -19 60 41 32 77
3476G7o7n7k9J00o7O3k4l0P4j3m7R4P0j57j1j0J47m6j35J33o0k3N8L1k7l4L1p5
$$ 77 10 -47 -76 24 -43 20 -4 -34 40 27 -20 74 144 -13 -24 -34 113 67 -68 65 5 -18 40 71 44 10 41 -34
3504c4lKj1O7L3k6K8k2Or1J1j4k9N4j7J09q0k3M4j4K3o1J15j68J11r9J50l0p3
$$ -34 -37 -35 -46 21 54 28 56 34 40 -51 -40 -54 -83 -29 -46 63 -17 -40 4 -10 13 -48 67 -101 10 -89 61 31 -42
3533d2L9l6P0o2M1l3J16j55N8J2j04J4J18r1J32m8J3j28Q3J47m2j7l1p6K8K1j3
$$ -42 -3 -39 31 -31 10 -23 93 -62 -4 8 -96 -82 36 -55 77 29 42 -86 -3 144 102 85 54 -22 6 27 14
3560A4l3J8M8L9k1j21n6R4N2j9k1L1O3r2R0r2q4O5q7N7R9j01J37r1L6j3O5j2j29
$$ 14 -19 -1 47 86 65 -56 -112 -18 34 15 -6 25 88 -4 86 -6 -90 -25 -112 -55 44 -57 80 -11 25 12 77 65 -64
3589f4N7j9J22j83Q6J06j11j20K07k01K0P4J8L6q5N9KK6J41j34R7m09n73R93k04
$$ -64 -7 -26 96 -87 -1 105 -6 -126 81 -120 -100 -26 -8 28 -57 2 4 30 171 37 134 -275 -848 145 -59
3614e9K57r6k35J51M04k27j78p9j3J35j28J14L0p3p9J36o4L2lk9o5P2j7j01J1
$$ -59 198 102 -133 18 422 195 17 -62 -75 60 -68 46 76 3 -76 60 -4 28 25 -4 -69 3 -14 -115 -104
3639a04J36p2L7O0R7q1j25KL2M8j99J82n5Q5j62J99j27J86j04j16R9q0M9K4Qp8
$$ -104 32 -40 -3 57 154 73 -52 -50 -18 30 -169 13 -42 43 -119 80 -47 139 35 -81 18 -62 -13 11 19 -59
3665e9QO7M6o1j2n4J69o3L0j4n3k2J33j60O5J6M4Lk46R5N2P8N5r8J0L0m8J45j46
$$ -59 -51 16 62 1 -11 -65 104 41 71 57 4 -18 115 -45 20 36 80 83 -163 -68 -16 62 117 19 29 59 11 156 10
3694A0m0K3n1R5o4jm2J39j24R2q1k9M1pl2J20o8J20k6O3j52l0K9J2n9N5l3L4m1
$$ 10 -30 -7 -58 37 -27 -28 -70 69 -55 37 -44 -73 -32 -39 -71 49 -19 101 75 138 -14 -44 -15 -3 -62 -7 -40 -6 -47
3723d7R9L6j40K5MQ0j08L9K7N8j44N4K8k3pl7P2L7O4j33J15k5K8p3m9o1J16N1
$$ -47 52 88 -52 -27 -23 57 -51 -12 15 73 -71 -17 11 -12 -19 -56 16 53 117 -16 99 74 102 29 -20 -81 35 86
3751H6o8p5K6L5k7O7J6n4j9N5j0k2K8m8m6qK5O5p9J30r6l2P0K4j48J28J8L0j54
$$ 86 18 -57 -31 4 -23 44 60 6 -13 42 32 10 38 -10 -56 -64 -39 26 -53 77 -19 -51 19 43 -105 23 41 71 -83
3780h3O5J01k9j9j12J58o6m6M8J0Q6j43m1K8Q4p4N5L7j24R0P5j24O1l7j28J46
$$ -83 -18 83 54 35 -77 81 15 -31 17 27 113 -30 -71 -43 41 -33 22 59 -65 25 100 -24 37 0 -128 18
3806A8M9k11J08P8o1P1p9K6j7on2Q0n7R3j06M3M1j20J57j01Oj8N8q2R8k8RP0k4
$$ 18 67 -144 -36 42 -19 52 -27 -1 -18 -24 -76 4 -53 40 -66 -23 18 -102 55 -46 -40 -58 0 -82 16 -12 -3 67 43
3835D3j2r8J53p2m9p9J24NQ2j31J42j13j08J03M4O0r1M5p6l8J32o1j3N3m6n5J09
$$ 43 31 -67 86 14 -35 -114 10 15 97 -34 108 -5 -113 -10 34 94 3 48 -28 -66 66 5 -8 45 -1 -56 53
3862E3j62L2J74j7j50J02k9J09p2q7J32j42R9m1n9J70j12J14j55J42j50N5M7j1
$$ 53 -109 -77 97 80 -70 32 3 112 40 -47 85 -57 42 1 -58 112 0 114 -41 101 -49 6 53 42
3886D2m7j04J3P8Mp7J72k6k3j15L6L5m0N5j05P8j2M9J35k58Q8l4P6jo2j7J23j54
$$ 42 -5 -109 -96 -18 -14 -91 81 55 32 -83 -47 -12 -52 3 -102 -24 -36 13 148 -110 -22 -56 20 19 -43 -60 63 -91
3914i1J34q8O0n9j23o3L34n95O03m47Q33o59L97k32j77K31j03l8O7J8J6mR4n6
$$ -91 43 -45 15 -44 -167 -230 104 -491 112 -335 498 -161 236 4 -173 58 -45 -83 -16 2 18 14 108 52
3938E2p5M6j9o4J2Q1m6p3L3k3n5K32q5j21J74j60n6M0J02K9m8R9j15L0Q9L0j50
$$ 52 -23 23 4 -60 -48 33 -13 -86 -53 -76 -131 101 16 -105 69 -91 -147 -107 -5 24 -24 75 -40 -10 79 109 -41
3965d1L9O0j08M9J9j00J72n8K8l3q7J03k5J4O0j05P7Q4k03N8Q8j55R4j4l8P3j22
$$ -41 -2 58 -50 -1 18 -82 90 32 60 27 -60 43 18 32 92 -13 64 148 -55 3 91 -64 30 16 -22 51 -71
3992g1MK8P1mM1L5j20Rj19R2O2o2L1R1Kq9r0P3Q1j05kK39j00j62M2J9Nn9l6O5
$$ -71 -67 -39 32 28 69 104 -16 -7 -126 -34 28 -34 -3 88 90 1 -89 -16 65 -40 -42 197 97 -65 -23 -4 1 -58 -94 -29
4022b9L8j3o7lJ78j24N3kn0J45k23J69Oj18m4L1J19L4O4J94Q7l98q7N1J2j00l9
$$ -29 9 -4 -71 -74 104 -20 33 31 -19 126 -97 72 78 -40 -84 -53 66 100 164 358 445 47 -40 11 23 -77 -116
4049a16J69j5k28K25q4O8p2P6p9J40o9q9oM6P1q6O0L1o7m9P0j5J07j68Q8m4jO6
$$ -116 53 38 -190 35 -49 19 -53 23 -56 84 15 -74 -80 -34 37 -49 11 42 -25 -74 -4 -19 88 -80 8 -36 -37 29
4077B9M2j52O0O9j35J18K3K2p6OKm3K4M7k9%k1j5J05q3L1n5M9Rl9K7q8N4N9j11
$$ 29 71 -81 -21 48 -87 31 54 76 0 6 8 -35 -11 36 7 7 -14 -29 76 -7 24 -31 18 27 -12 15 -73 -19 40 -71
4107g1Q4p0J14M4J8j23m5Q2L0j05Jk2O7kK2k8qj7J91j56j04R1o0R4r8M5J58m9
$$ -71 13 -57 57 101 119 -4 -49 33 63 -42 -41 -63 4 2 24 -4 -12 -29 162 6 -98 -7 -67 27 -71 -26 132 83
4135H3j04k6l1J7nJ50j55Oj7J5n0O2LJ63l2j11L9j7o4J01n5%M7j23PQ3K6r2J84
$$ 83 -21 -47 -78 -61 -66 84 -71 -65 -82 -67 -117 -55 -52 111 79 -32 7 -10 -74 27 -28 -28 19 -104 -97 -14 12 -80 104
4164A04j91L8j6N1R8j67N3JR1o2r5J42n1N0l8j4PL8n8mkl8M3O0q7n0Q9j9K6R0
$$ 104 -87 -49 -65 -14 84 -83 -30 -29 62 0 -95 47 -4 46 8 -6 1 39 -19 -23 -25 -63 -20 40 -47 -97 -8 -27 -1 89
4194H9j01P6M8j56K9m8J02q9k1J1Q6LM3r3j3P8m0N4n4nn9R6m5Oq0J70q6N5q0N3
$$ 89 -12 64 112 -44 -15 -63 39 -50 -71 -60 26 29 72 -21 -34 44 4 58 4 -1 -60 36 -9 -3 -83 87 1 56 -24 29
4224B9L8j2j73J31k5l2K7k0L5o6P9J27p4q0PpQ1m3kL3j57J84l7k8J4k4N8J3m4
$$ 29 67 55 -118 13 -12 -44 -17 -37 -2 -68 11 138 64 -16 -9 -16 65 22 20 53 -104 80 43 15 29 5 63 76 32
4253C2or0K1M9J94r5j40M2Mj23O3j6N9J0m4Q1p9N7J7mn7r4J43k6p9m2J85o3r9
$$ 32 26 -64 -43 6 200 105 -35 7 11 -112 -49 -65 -6 4 -40 41 -38 19 36 32 -25 -119 24 -2 -81 -123 62 -1 -100
4282a00J8P3L1M7j58P9P0j81J44M7lQ7l2j51O6q9O8M9k4l1M1L4j08L2M1%pp6j8
$$ -100 -82 -9 22 69 -89 -10 60 -121 23 70 67 154 122 -29 37 -52 16 65 41 10 51 85 -23 9 50 50 43 -33 -51
4311e1RL8O0j8m9k3k6J40j69M7k2K3J22j74M6QJ22k21K3J64jj15lO7K6j14J91
$$ -51 -42 -4 56 38 -11 -34 -60 80 -89 -42 -64 -41 81 -93 -47 -39 83 -138 -115 49 48 -67 -70 -3 23 -91 100
4338A00j08j6N4N1r3P2J8r5j4k7N1k7k8J7K5K5qn1J93n5j42J29r2J6l0N2j41O7
$$ 100 -8 -24 30 81 -12 60 78 -17 -31 -58 -7 -34 -62 -45 -20 5 -3 -54 139 84 -58 71 -21 -5 -35 17 -124 -57
4366e7nk3J15J30j09Jk6n4qP8k3p2M4j3K7j5J34k52J30M2n8n5J22J6k03J07k9
$$ -57 -62 -85 30 160 51 52 26 -28 -36 42 19 -53 -9 -22 5 -10 124 -128 2 44 -14 -69 53 69 -134 -27 -56
4393e6N8P7j2m0l1qN9n8k4J2Q3q9k4J27q4O6m5Qj9j2qp1L5L3l8M7n1N0Q0k4LM3
$$ -56 2 79 67 27 -4 -12 47 -11 -35 -23 60 -29 -53 74 -10 56 11 19 0 -12 -20 -91 -56 -23 -61 -14 -65 -15 65 41 44 87
4425H7j27R3o1L5K4q8Q1j41J22o2l6J0K6K8P3j40J03j6o8O3K5K5Ll4m1O9pJ2r0
$$ 87 -40 53 -8 27 51 -37 44 -97 25 -37 -73 -63 -37 -9 64 -76 27 11 -57 6 31 56 59 25 -16 53 46 58 -32
4454c2k1J13q9j9L8l8J27j12n1N9O6J11j64n1N5k0K1rl5N1j3K3n3J0Q9j17O8n
$$ -32 -53 60 -29 -48 -10 -48 79 -33 -84 -25 41 152 -12 -63 -8 -28 -7 -16 -51 0 -13 10 -43 -33 56 -61 7 2
4482BM1j53N9j1J26j07Ol3R1Q5p5Pj1O2j26R5K5Jq2N0n3p4O2R3n6k1M2l2o6N3
$$ 2 43 -110 -51 -62 64 -43 -37 -70 21 106 31 38 27 89 -37 58 83 84 2 52 -1 -75 -13 80 24 3 45 13 -53 0
4512@k9P1j31m1J36j48J94r2K1JM1Pm4Q2j42O7L2rM9n3qJ2R8p1q7P0j08R5K4k1
$$ 0 -29 42 -89 -130 6 -142 52 -40 -19 -18 23 30 -14 68 -74 -7 25 16 65 12 4 16 114 43 -44 26 -82 13 37 16
4542A6oJ54k41J14M2q8n0M8P2j21K8J5o2R5M6m0J34j31j24P2j3J7L3n1L2m9K7
$$ 16 10 164 -77 37 79 -9 -59 -11 61 -60 -32 -17 -79 16 62 22 156 25 -99 -27 -40 -23 10 -41 -9 -58 -31
4569c1m5M2J07rn6p4J19Jr6l3L8Q4M4p5k5r6J28O7n7l1P2j3Mr7j0j2k7O2P9o0
$$ -31 -76 -34 73 64 8 -66 53 54 -42 -75 -37 47 91 16 -9 -105 23 90 33 2 74 61 65 -32 -42 -54 -81 -19 60 0
4599@K9k7l1P2N9j46R8m6o0J99k74O6P4%p4Q7k6KP1j15P0q1L2mN0Jj7J3j0l2k8
$$ 0 29 2 -29 43 102 -44 54 8 -52 147 -127 -61 13 13 -61 26 0 2 73 -42 28 -53 -21 -25 25 26 9 22 12 -20 -48
4630d8j5J25j32J24j05M7o7j2Q4Pk0L2j80R1P1Q0q5J35q6l6J25r7p9K3R4j02J15
$$ -48 -63 62 -70 54 -51 -4 -71 -83 1 8 -12 20 -160 -69 2 82 -3 132 46 10 135 38 -41 -18 76 -26 89
4657H9r5j2L4M2j95M93n24l3K15p2J21r8J66k26M9l2J22r7K44l84J01k5K02j74
$$ 89 -6 -18 16 58 -137 356 -168 -201 14 -58 63 -35 131 -95 -46 -78 44 -53 191 -193 -92 -117 85 -89
4681h9J04J8k30K20K1k7lq0O4R8j66R0j6P4m2Kj93J75j0j1R3p9J3k0m7N4kP8m6
$$ -89 15 33 -197 23 44 17 14 -66 -2 96 -70 20 4 78 36 38 -155 20 10 -1 92 13 26 6 -41 13 11 89 43
4710D3q3N6o3L1j24J41n0n3J07M6L4q3k1R8k7m4J2l2n3J20j7p1J32j34l6M1L8
$$ 43 -40 16 -47 -16 -140 1 -49 -102 5 51 85 2 -19 79 52 8 20 -12 -65 55 38 -33 99 -35 -71 -30 8
4737HL6l4k8l6N1Q9j17J30j09k02K14l4M1M4j43Q5O6m4n6j9l8J00q8L4J24o2J01
$$ 8 44 10 -18 -54 -3 86 -31 99 -10 -212 2 -32 9 53 -90 -5 61 17 -39 -58 -96 4 -84 -50 74 12 113
4764A13p7j85R7P7m3L5M8j07M9k7r4K06k0j29P8k2j29J90k2o4J5J08j91J13M8
$$ 113 36 -149 -52 25 -18 17 65 -42 7 -20 -114 92 72 -57 21 -1 -130 60 38 -26 -11 97 -94 19 67
4789F7k8Kmkl8R3j25Q6M9p0Q2j26po7J20L7m5Pm7O7mj0j04j2R4k0r6J59J1j8r8
$$ 67 39 41 37 35 -3 90 -35 51 100 30 112 -14 -21 -88 32 69 24 31 -16 51 47 37 -67 -79 15 -5 -101 58 69 51 -47
4820d7k4R1n2J12j51Q7j4L7q9R1m9M0o9J23j25L5J33j61l6M3L9k1J26r1n0k8K7
$$ -47 -71 20 -32 80 -71 16 2 39 -50 41 -8 32 -37 86 -39 -4 129 -32 -68 -25 14 -7 119 28 -22 -50 -23
4847b3J3P4q0N4q2k6K1J45j52KrM0p7J18Rj93K91k46J89N9k44Q5NL9J26j18N3
$$ -23 -10 64 -16 38 -44 -70 -49 96 -56 -54 -63 -23 -100 18 27 -166 125 -121 68 127 -117 -32 -27 12 138 20 73
4874G3j08J34j81J09J10k40R2j7Q8J3m3kl3N5m3J3K3j15O7j25J56o4lm2O4m4O5
$$ 73 -35 99 -82 27 137 -103 -11 -28 60 73 30 28 -5 50 7 20 43 -72 -5 -130 26 -38 -41 -83 -19 -63 2
4901BR2p0J5jj06j9J35Ko6m3J87j4j18K8m3J50j39n7P4L4j02J30m6o9N1L7J32
$$ 2 94 24 39 38 -68 -87 48 50 -16 -59 128 114 -4 24 -19 131 -8 -65 9 43 -59 71 25 -44 7 44 176
4928A76k46P5R3m6p0K6k5k8J44j66J61j06p4R2j6rk1K22j84m5O4J7oJ9o7K4m7
$$ 176 -70 5 98 52 -18 8 -17 -45 99 -67 94 -12 -86 6 -10 -19 -40 182 -2 -47 17 34 28 47 -20 4 -43
4955d3N0j4l0j8N2O4j68J59nj2J5K8r4k8PPJ6N0m1j17J23l9J22l6q6K6n7q1J62
$$ -43 7 -7 -37 -55 -3 61 -107 52 47 35 50 78 -16 -44 -37 -30 -14 36 -5 -122 1 -38 84 48 -38 -12 -69 -150 12
4984A2l7P4k6l7n0O8mJ5j05J73j2m0k5N0mj50J45j24jQ1KM8rp7J23p9j68J88j5
$$ 12 -25 49 23 -14 -64 4 0 15 -90 83 71 31 6 56 52 -98 47 -77 -78 3 5 53 44 -33 90 11 -157 31 16
5013A6o2O8J2ok0j3Ok0J8m3L1L2j7JL9o8P1oj04R5l9L0N2q5r0K42j45p0J14k5
$$ 16 -46 22 34 28 8 -5 1 -19 -1 -44 -13 19 2 3 42 -26 45 39 -65 30 -9 21 73 -12 -102 140 -5 -75 39 14
5043A4NN9l9l6j4Q2j11r9R9J76n4o4J5L2q2N7K7j06J7p7P1j1O5M8k04N7N1K0k
$$ 14 19 78 39 3 -11 71 -40 -139 -40 136 82 18 33 65 -17 40 67 -39 -22 -99 -28 -39 26 74 -130 -73 -22 -2 -4
5072dl0l5R3j31N5L9M1K7m7j22K39j79L9R6j8j19R4J0q1J25j51Q3j1K1j18R6l1
$$ -4 -34 -69 24 -107 -52 -13 28 55 8 -114 125 -54 -15 81 63 -56 38 48 -33 92 -59 24 13 34 -84 12 -19
5099a9j4n0P0o0K4K3N7p5j8J09Mj80J42o9M6P8r2J6l2M8K9l5N0k4r6J93q7o4L1
$$ -19 -33 -83 -13 -73 -49 -26 31 -44 -62 47 51 -129 13 -56 -10 68 -24 -8 -40 8 37 2 52 28 -68 125 38 -26 5
5128EL1l6J8P2j63J86l4r3O4n7L5NK5j25Q4P1k6j80J76J5j35o1R5M4J0J5o7j2
$$ 5 36 0 18 90 -73 113 79 -14 50 -7 28 33 58 -67 17 88 62 -118 58 73 -62 -123 -28 16 26 41 -26 -38
5156c8J00q3M0km3nO7n9J5J09rr2l5O7o7M6N2p1n8Q7K1k2k5l9k3k0P1Q8m6m8n
$$ -38 62 -21 19 17 -26 -31 36 -23 -8 101 92 0 -35 32 -35 11 63 -8 -66 21 42 20 -5 -44 -67 -87 -16 72 26 -22 -27
5187b7m5O9Pl3j3J13q7k0M5K5m5O1j66L3N7K7r0N03k57m26k64J075j52n44K23
$$ -27 -72 -3 4 -29 -42 71 -16 -36 9 34 -11 50 -116 -83 -26 1 -89 414 157 -269 -533 542 390 -154 69
5212F9k05K25n5L1j42M8n6O7j08K49k46J74o7M5l0K4l7J4N7j37O5J6J29p9p6R6
$$ 69 -136 89 34 65 -77 -29 -85 -18 -126 123 -123 51 -16 29 -1 23 -14 0 57 -80 -15 1 130 51 -25 71
5238G1k4m5q1J94j47rj0J9J4j5l6J16n0R3o3p3L5p3J02q8R5m3l7J09j35K4L8j7
$$ 71 47 2 -79 115 -32 -41 -51 -32 -18 -33 -69 47 -3 90 27 -46 -11 -84 18 -70 25 -18 -55 54 -81 -57 -19 -36
5266c6m1J01N6j38Oj46J09Q1j7m9L5L8n3N8J32o0p0q1J44r0j7O4p2k7J13l6J1
$$ -36 -77 24 80 -58 -52 -198 -89 -8 -25 -74 -39 -1 -54 4 136 76 6 -75 69 -21 -38 26 -46 -73 40 4 15
5293A5Q9q0j40K03j66M5k3L6j5j5P3oO8o6M3p0m5K1J08j07P0mj23R7kQ6r8l4j2
$$ 15 104 24 -116 87 -79 -34 -57 -21 -36 -51 22 16 84 18 61 -9 -54 -33 75 -32 38 34 -89 8 6 92 -6 -40 -52
5322e2K1O7l8m4O9N0j06j0o8Q4q6N9J9J23j19k1K7M2q6M4K6j7j6K3N6j40N2j6
$$ -52 -31 36 -2 -46 23 73 -33 -43 -111 -27 -113 -54 -35 88 -31 -52 -25 17 -69 -25 1 -16 -32 -9 47 -93 -41 -57
5350e7J27j28N4J34j87m1J09l6K7m5l1J11j19O0K7JPp7P2j20K26j14j9O3p8Nq
$$ -57 70 -58 -4 130 -57 -98 11 -25 2 -43 -74 37 -82 -22 5 6 13 -64 8 -112 114 0 -19 44 -34 -29 -37
5377c7kJ02p2m8j0m5J97m4r3J8Q5l5J0m1k8pM3RJk1j1lMJk4J42j8r4o9J00k8o9
$$ -37 -39 63 -9 -57 -67 -112 85 41 -52 -34 51 16 26 -15 -43 -50 -7 2 3 -18 -29 -32 -28 -27 -51 91 73 -21 -90 10 -18 -87
5409h7J46l4J3O08m14j88j6O5r6J09j78J23j2m8%j6Nj45P9J55j27J1N7M9RM3p2
$$ -87 59 25 38 646 232 44 28 93 -3 106 -72 51 39 -9 -9 -25 -20 -165 -86 69 -58 -47 10 59 68 111 39
5436C9l8K8p5%Q6r3N4p2K6J14r4j7L7n1J9%rQ4j82K30Jj47P1j32R4l0rP5j01Q4
$$ 39 1 29 -46 -46 40 -53 1 -71 -45 69 -25 -42 -5 -56 -37 -37 -46 38 -144 86 87 -60 11 -121 -27 -57 -66 9 -92 -8
5466hM7l2j7J7N4K1J2j7J9r6o1N1nMp0m9K09Lm0k3m1M9L8j5j39m0M8J01P7k4J7
$$ -8 39 7 -10 7 61 82 94 77 96 0 -61 -10 -15 -11 -81 -130 79 82 42 19 -22 27 65 50 -89 -129 -81 20 97 73 90
5497I0j8m8K9r6P1n5R5k7p3J21j13M9j36J55k3j02J02m2Ll5K7P9p2n3J10no5L0
$$ 90 72 24 53 -43 28 -27 68 41 -32 89 -24 25 -111 44 21 -81 21 -21 -18 -53 -26 53 -19 -72 38 33 -32 -2
5525bK5J01n8k7q2M4l5O6k6k7l8N9%p9o1O6k6J13O5l6p9J5j9J03l9j41J34j51
$$ -2 23 124 66 39 -43 1 -34 32 6 -21 -59 0 0 -79 -140 -74 -100 13 78 42 -37 -22 -41 62 23 -118 16 -135
5553a35J47L%Nl6LJ7J8J5mp1M6o9L3J45j70N3j1Kq0J00J5j5O9j31L5m5J4O4l8
$$ -135 12 15 15 20 -16 -13 4 22 37 33 -38 8 -61 -28 117 -53 0 -11 -9 -89 11 26 11 80 -51 -16 -61 -47 17 -21
5583b1K9m8m2J06O6j01Q7j2j16O7O4j04R4L0j29N2o8L6L8Km4N0r0NO6R7k26J98
$$ -21 8 -40 -82 24 90 -11 76 64 -52 15 79 -25 69 99 -30 22 -46 -10 28 30 -14 36 -54 -49 17 114 -112 86
5611H6k4j94K4O2R6J0k6r1J92j72N2l9nm5R7k1L1j5l2RQ5j90J03N2j97J64N8k2
$$ 86 62 -132 -108 -46 50 60 34 -57 135 -37 15 -24 -29 -74 23 2 33 18 -14 -5 80 -110 -7 45 -152 12 70 48
5639D8k0j5J3P1o9j91K49oj03Q3m6j6K4J0No1J8N7p4N7m0J6j4k9J34j81N7Rr1
$$ 48 28 13 26 97 28 -163 86 80 -23 60 14 -2 22 32 37 -24 -6 51 -23 34 -6 10 -4 -33 101 -80 -23 -14 -105
5668a05J77j81J42r0Q4q0K3L7p6J22n9J0Q0j96J13%l1N2m6J6J01lk41J47J04j31
$$ -105 72 -109 33 -57 27 -53 -30 7 -69 53 -6 4 84 -112 1 1 -30 22 -24 -8 93 90 -151 -4 100 -31
5694c1Q7j75J12M9R2j69N4q5J4O9k0o6J04O5r3l3M9o2J28p1n3L1N4j4j61P8L7
$$ -31 56 -119 -7 42 134 -35 19 -66 -52 17 -3 -69 35 100 7 -26 23 -39 89 18 -35 -4 50 36 -125 -47 -10
5721a0j8o0J14k3J2QJ3r1J26l1n0k4l8m0K2J4J58o8K4j02K24j19n5J1j49J60k7
$$ -10 -28 -88 26 3 15 23 36 -55 71 40 -10 -34 -72 -112 -90 -76 82 14 38 -64 160 41 -14 -3 -152 8 -19
5748a9l2J57j96O2o7R5j54J65j2J26j44N2q6q0K09n0J02k58J85n8k0N7o0j9N1
$$ -19 -51 106 -90 -28 -95 0 -154 11 -1 125 -19 33 -53 -133 76 26 128 -130 55 -3 -23 34 -26 -45 6
5773Fo1R0L2q6O9j5J4r4J33j11M5Q7j15q9J24oL2j8m6O5n5n2M3pN3o9J17o9q5
$$ 6 -55 35 67 -19 50 35 49 -45 88 -23 22 109 -6 -95 29 23 55 37 -9 56 1 -51 -8 -15 38 -31 86 17 -68
5802f8J56Lo7MO2j02J03j20pM9o1P3ol1J53j59Q8j26R6n6m7N7P4j41mO2m6Q1M4
$$ -68 88 91 24 28 90 -12 91 -29 -36 13 -48 25 19 -12 141 -18 70 -56 40 -16 -63 -6 68 -73 -77 -15 -61 20 64
5831F4r5K3M9J6q3J26j01J3q0M1n2N7ooP7q4lM9p6J01l2m0O2Q7o5j3p8R2J37j01
$$ 64 -31 -8 41 57 -26 100 -1 12 -68 -27 -79 -22 -28 -34 43 -41 -44 5 -71 30 -2 -42 20 107 42 29 -49 43 180 79
5861G9m8r7%J62p7M6j15k2J16no6P8l0J6l8m3J0o4J54j43R0L3k1M5j78J33mJ7
$$ 79 31 -66 -66 96 19 65 -50 -72 44 39 -27 51 21 37 -1 -44 -34 -98 56 -87 3 36 15 60 -118 15 11 28
5889B8j49P4J18lm6j31J39j32J75j39R4Nk9M2q6m7M4R3j32J96j12J48j83L1N0
$$ 28 -121 -47 71 68 22 -109 30 -102 73 -66 28 33 4 46 -40 -87 -43 50 -82 114 2 150 -33 -2 48
5914D8j00J30m0o8J49k14J51r6K04k43J17m7l0O2m0K8rJ3J8j09J15M3j18N4j03
$$ 48 -52 78 38 -30 119 -95 56 -40 164 -79 38 -9 -39 23 -17 11 2 15 33 -76 39 82 -36 18 -85
5939h5J46j59K15p5j29J53L3n1J15o7m64O9mK98j5M1n5r1K38j66O0j45K40j0n6
$$ -85 61 -98 117 42 -87 66 99 48 163 96 -368 -299 -303 -5 -20 21 -34 -125 113 -53 7 -138 102 92 36
5964C6l8N5j39N9K9j10O9pJ8L6%m2Nl1Q3n6M3j36K0J11J5J2n2J8M8q3K9J6q9J60
$$ 36 -2 53 -86 -27 2 -108 -39 -46 -28 8 8 -34 -29 -60 23 -33 10 -126 -106 5 20 32 -20 -2 46 -37 -8 8 -81 79
5994G9p2K8j21M8J14j33Q2m0L0k9p3pmKO9j4Q9q8R9oj43J39M1j26J4J31l8j05
$$ 79 7 35 -86 -38 76 -57 25 -15 15 -14 -87 -94 -98 -96 -27 -41 48 -40 59 53 -90 49 90 -36 -22 109 71 -34
6022c4L4L1o8Q7n2j8k7L3P0j91J49j41J28M1K2j11P1m0nJ9P4q1J1j00J16L6M4
$$ -34 0 31 -37 50 -2 -20 -47 -14 56 -135 14 -127 1 42 64 -47 24 -16 -21 -2 72 -9 2 -98 18 54 98
6049I8KJ1j15j4J40j10L7q4P7n3P4l3j03O4Q9j40k1R1lrj4M0O7n2M7j62O7L5O5
$$ 98 100 111 -4 -18 122 12 49 -35 42 -11 63 30 -73 -9 80 -60 -81 10 7 -2 -16 24 91 39 86 -76 -9 26 91
6078I1n9k6N9q6N7K2j9J4j15K3O4m0knP3j45Jm4J13O4j41J45j18J5qJ44j15R7
$$ 91 32 6 65 -21 36 58 39 53 -62 -39 25 -15 -17 -22 51 -94 -93 -137 -24 40 -101 44 -74 -59 -67 77 -38 59
6106E9j18R3q4J77j24kj32J73p3K3o5P1l7l9J32m7q9M3Q4K4p7N7r4m1M8L0j6j3
$$ 59 -59 34 -50 127 3 1 -131 42 -31 -8 -73 -2 -39 -78 54 7 -82 -39 45 69 -8 49 -45 -86 -38 -8 -24 -37
6134c7M6l4K6m8J2M4R6j32K1l9R4n1K4k2%M4m2l0O7Pl9J13j81J25K8j49Q6N6m2
$$ -37 9 -25 1 -47 -35 9 105 -27 -6 -45 49 -2 22 0 0 44 2 -28 39 46 7 120 -61 64 92 -57 29 85 43
6163D3l6j20R1j21O4R0r7P3P0J3j7p0N0j14Q9J5j25K35j64L6Lk9Jp2J53p1J08
$$ 43 7 -113 -22 -143 -79 11 -86 -13 57 70 53 -17 33 -81 8 23 -102 133 -31 5 8 -21 -20 -92 61 -10 98
6190I8r2L%k5k1K2q7K08j71O4J11j46M8r4K9J83j38L4j5j5o3N1M5n2K0m6K5J57
$$ 98 6 9 9 -16 -37 -15 -102 106 -65 -1 110 -36 12 -82 -53 130 -8 26 11 -4 -67 -16 29 -23 -3 -49 -24 133
6218A33k12J52m3nJ2n1l6pJ28j11L7q9j4j6L6P2L8p2K9N7m9q6Q7M8k5k4P1k9l0
$$ 133 -79 73 30 25 37 -14 -50 -57 71 -40 -3 -92 -106 -122 -86 -14 24 -48 -19 38 -11 -97 -10 38 13 -11 60 31 1
6247Aj53K49o1O4j9p6o8N2J3J15j48L2n6K1N1K9M9j95J24q0N3n9M8k2j3M3mOM0
$$ 1 -152 97 36 100 81 5 -63 -11 2 117 -31 1 -55 -34 17 46 95 -100 24 -56 -3 -62 -14 -36 -49 -6 -10 -4 36
6276C6m3O5j33lR5j5J90j98m7J5ln1J47j62J55M9j52k2N9J15J9j58k7J04rMn8
$$ 36 -7 58 -75 -78 17 2 192 -6 -53 -38 -41 -92 55 -107 48 97 -55 -77 -18 97 116 -42 -69 35 26 30 -28
6303b8j5J99j80kJ11l2m1rm2j6O2n2J39oj13nQ6j76P4M7LR0j49K3p2R1Q3J1n9
$$ -28 -43 156 -24 -26 85 53 12 3 -39 -55 7 -45 94 88 -25 -30 56 -120 -46 1 4 94 -55 -32 -104 -13 70 81 22
6332B2J5o9P2j20J05J0k9Q3r3j2k2M4L5j86J30M5k6P2l7Kp7O2j04N3K9mQ5j34
$$ 22 37 -32 40 -80 25 35 6 89 -4 -16 -38 6 41 -145 -15 30 4 76 39 41 -36 26 -78 -25 4 0 85 -49
6360d9J4j4R5n7j0J7r3O4J19p1m7J08j26J47j46R5L20l89q2k7K40n9K83n03J91
$$ -49 -35 -49 46 -11 -21 -4 -97 -33 86 15 -32 76 -50 97 -49 46 366 -23 -105 -132 108 49 332 -171 20
6385B0M7j38J04j57K1N9J21j6J3p3j00J24Q0rl0J5k7o5k1Q5j26Q3rp0J72q6nj6
$$ 20 67 -71 33 -124 -103 -44 77 61 74 1 -99 25 105 96 66 81 54 -11 -32 53 -73 10 1 -69 103 17 12 -4
6413dj00P7j7RJ28Rk41J67LmJ1m8N3J5mj01Q2p0K6J6o3L5n1J0R1o7j8Q5j78K18
$$ -4 -104 -27 -44 -35 93 102 -139 28 31 27 38 -10 43 58 54 -47 35 -35 -9 7 -56 -21 -72 -62 29 -38 -56 29 -149 69
6443F9j2o1j1Q1q8l4O3M0m7Q1p7NJ3k0J7p4N8P4m8j5nQ0j4J19l5l14K69J4k91
$$ 69 57 -4 -15 66 -22 -56 7 47 0 81 4 9 22 2 19 -55 3 77 29 14 9 89 75 194 159 -155 114 128 -163
6472a63Q5k42Q1L56O7j70j07J84L75m53n7M5n6O9j8o8J01K1j07O1K7l8O3o6j4
$$ -163 -78 -320 -239 117 184 14 -93 91 466 13 -44 1 -55 14 -4 -72 29 50 -57 4 31 -7 56 -10 -24
6497b4K9qQ8m3j14L7N9n2J0k1m1J40L6r2N1Ll0MqJ5K0m6L8j15L9j3J17o9k6P8
$$ -24 5 -3 85 42 -72 -35 24 -28 -18 -39 -80 60 96 4 55 58 28 32 24 39 59 13 51 -64 -25 -38 79 10 -16 62
6527F2j49jQ0K1k1k8L4k1J08j65j0J47o9j6K0k1N4j24L8L8N8J7j9r4P1k7m4P5
$$ 62 -87 -88 -8 13 -8 -36 -2 -23 85 -80 -90 57 -12 -28 -8 -29 25 -99 -61 -23 35 52 33 -61 10 -17 -61 14
6555A4N7r5K9r9P2R9q4Kp7L0J28k9n8j4K4J20j15m1P2n6K8j3k8p0J91q7O7k8n6
$$ 14 71 -24 5 -94 -22 77 -7 -5 -82 -52 76 47 -11 -25 -1 119 4 -37 35 -21 7 -6 -34 -104 87 0 67 39 -17
6584a7k1l2M3J3m2O6Q8r4R8l2l6o4J05j05k9L6kj6O7j10J39p3P8n6o6Q7l9k0J47
$$ -17 -38 -70 -27 -14 -56 10 98 4 102 70 34 -30 75 -30 -59 -23 -25 -41 26 -84 55 -18 60 4 -62 25 -14 -34 113
6613A13j35L5Q4j48N6M7m4J9j79J60J6o9N3P3p6K8n4j1M4r3J19L2k4L5j60K58
$$ 113 -22 13 97 -51 5 52 8 27 -152 8 24 -45 8 81 5 33 -21 -32 12 -81 38 70 46 81 -79 179
6639A79j50l8j8l1K4k5J78j70J6O7rN3k4nj4K8o9j03Q7k6R0j22R7oL2j3q8J10
$$ 179 29 -9 -27 -58 -34 -59 119 -51 -35 32 23 76 52 47 33 61 -8 -111 -24 -50 40 -82 15 9 41 28 -60 50
6667E0rl4q9O7R6j10k2Q4m2M2p4M9j0m5R2l5mJ34k24J29n6R0n7k3P8o3rm0O0j39
$$ 50 41 7 -82 -15 81 -29 -51 33 -9 33 -41 8 -2 -47 45 10 6 140 -84 45 -11 79 22 -1 77 14 5 -35 25 -114
6697a14N5j9l4J25o6M7O2q9L5O0p2Mj8M7L6o5K4K3J9o1L2n5KK7J6J4J2p9M4L9
$$ -114 -59 -78 -112 13 -53 -6 56 -33 2 62 -10 -6 -24 23 59 -6 18 41 60 -1 31 -24 -22 5 21 35 47 -32 12 51
6727E1P6j87J23p3N1mR7j89N7M6R6j45L02l59QP5j08O6Jj03Q8j3j7J70k6l3n9
$$ 51 127 -60 63 -10 41 37 134 -55 2 48 144 -1 301 -58 -50 25 -83 -17 -16 -119 -31 -44 -61 109 83 50 -9
6754iL2J35k61J96qjJ35k71J11p2P8r5l5J04k2q3J21N0n4p8L3Nj9M7k25J59OL0
$$ -9 23 158 -103 93 85 84 219 -52 59 -13 65 -30 -65 39 17 -66 55 105 51 -27 6 11 -8 39 -186 -27 -21 9
6782IL2J1j68K25q5J69j63p3R7p2J14o3p6J23j40Q9j04N9R2j24N6J8ql6m1P6P9
$$ 9 41 52 -116 109 24 193 30 -43 54 -18 96 33 -43 80 -60 29 -75 -16 76 -48 8 26 18 -18 -59 17 96
6809I6r0Mk9Q8q6Q0r8K0P4q4p8O8J7O5r3k7J43j20J15j72N9J6Q2n8kJ4N9j11m6
$$ 96 6 10 -19 69 -17 63 -35 -15 59 -25 -103 -35 -18 47 -46 -73 70 -50 65 -107 -48 -32 50 -8 -10 4 63 -48 -94
6838i4K19j60O6rj24J59j0N7q7Ok4j1J6j12J72J0m2km4k8j9P5k5r3P9N3nr7J63
$$ -94 125 -35 31 22 -102 57 47 104 17 23 -1 -12 4 -108 64 74 32 30 -14 -42 -61 14 -11 -104 -25 28 23 -74 89
6867H9m6p5L4M4j1M7j06L2m3LO4P6l0j07j5K7J7Qm3M6N8q5J2p6J4N9l4J21k2j33
$$ 89 43 -32 2 46 35 82 -24 8 -35 -32 32 108 78 -29 -44 -17 0 8 -35 11 69 -16 -4 -80 -66 -7 -41 80 58 -75
6897g5P0J29j51J6L2l7MnN5k8L2K1j10Qj8k1K4OJ25o0L0p7P7o8k9l0K1M7m0OK6
$$ -75 -5 124 -27 -11 21 -16 -12 -17 38 10 42 63 -47 -39 -57 -78 -54 -48 77 17 47 -30 47 -21 -50 -80 -59 -12 -52 -46 -20
6928b0K6l5K8k1Q2l3j57K40j83R5N2r5J1LO2j48O6R2m7M9p2k8K3K1Jm6K5J2p1
$$ -20 6 -29 -1 -22 60 27 -130 110 -73 22 74 -21 -10 -7 55 -93 -27 65 18 67 -5 -33 -10 11 12 -34 -9 3 -68
6957f8J02m3M7m6M5K4r7K8J2n7K6R1p9N8L7j11J14q9K2q0L4PJ7J1j0o6R1l8J7
$$ -68 34 -9 38 -8 37 61 -36 -8 4 -53 -27 64 -15 43 80 -31 83 -6 16 -64 -30 -23 -6 5 -5 -71 20 -18 -1
6986alK3N9p4P9j17J8o4L9K3Rq6K2p0J49j00O0K9MK4p2K0L9m7K4m5J92l9j26P3
$$ -1 -4 19 78 4 83 -34 -16 -80 -41 -18 -9 -95 -73 -143 6 -94 -34 -5 -1 23 -49 -29 10 -37 -13 -58 134 95 -31 42
7016D2K3J2j18O2j1JkJ6j34Q9m3P3m9J6O0jj98J54M7J8J9o5M4p1JP1j5j90K02
$$ 42 65 77 -41 21 10 11 9 25 -109 -20 -63 10 -39 -23 37 36 -162 -8 39 57 76 11 55 -16 -15 56 41 -149 53
7045E3K5L1j28l6Q1k0lnj59J71l3K5k7J36r6l0k0roM1l6m4J41j59J48k9m6L5M
$$ 53 78 109 -19 -55 26 6 3 -2 -161 10 -23 2 -25 111 15 -15 -35 -44 -50 -9 -45 -89 52 -107 41 12 -34 1 5
7074EK8J61k61K2K%M2l3m0N2K1KK2j55K09l1q1L7l0P7j25P1J02o2n4J08m8J8k6
$$ 5 33 194 -67 -45 -43 -43 -1 -34 -74 -22 -1 1 23 -132 77 46 -35 2 -28 49 -76 -5 97 35 -19 89 41 59 33
7103C3o0R4q8Q4j01n%Q4m6N2J9j9j8j1q0N3J25r3o2J31j81R6l6J37r2k00K07K
$$ 33 -27 67 -21 63 -38 -43 -43 41 -5 47 66 47 29 18 -62 -9 116 23 -39 92 -89 7 -29 108 16 -184 23 25
7131B5P5K5p3k9J25j33o5L6O4l7K4%pj29J43o0m7p5J54P0pl2j08J31L6j82k9J54
$$ 25 100 125 52 23 148 15 -50 -14 50 13 37 37 30 -99 44 -16 -63 -138 16 86 79 47 -61 70 106 -76 -105 49
7159D9p7j3m7k0N8Q7QL8pj70N9J75j14j26K05j49J9LL3k2l3k3K2r8P3J17q0j06
$$ 49 -28 -41 -88 -108 -50 37 45 83 76 -94 -35 140 26 -100 105 -44 -25 -22 11 -11 -44 -67 -45 -143 -70 47 -33 -139
7187a39Q7M2O9q1k1J27j22K4M7m6N2j24J6L6QJ36l5j25J07q6n2l1N2J22p7K3j49
$$ -139 -52 -10 59 -22 -43 84 -38 -14 33 -13 39 -85 -69 -33 -25 111 76 -49 58 -28 -80 -111 -59 63 -14 9 -140
7214a40J51j19P3rL8L6j9l2mR6p5R0m9j4K8j05J40m2j14J65m8n2n8j5Q0m9M1M4
$$ -140 11 -108 -35 -44 -6 30 11 -21 -25 71 -4 86 37 23 51 -54 86 44 -70 95 47 -5 -63 -78 2 -47 -6 38
7242C8m8J3l6J05p7QM7m2J45p7L0l1m3k2o1O5NK6r2L1K0L4r3O8J07k1j79J5Q9
$$ 38 -10 3 -33 72 -5 3 50 8 153 76 106 75 32 10 -51 14 19 45 -47 -16 4 38 -55 13 120 99 -80 -65 24
7271B4p9J00r0L3p0j4K22j24J3l4n2O0j5L9n6N1p6J90j4q5p4J51j61R5lJ37l4
$$ 24 -55 45 -45 -12 -82 -96 126 2 15 -19 -71 -11 -26 13 -43 8 -68 122 108 23 -51 100 -61 34 31 168 134
7298A34j50L4mm3O9k19K47j05J16k00M97k21O11j046j23Q18o83M30p50O37j40
$$ 134 -16 18 14 -29 40 -179 68 -37 79 -121 376 155 766 -280 -403 415 -268 162 -588 49 -91
7319i1K19k14Q3J8J8m6Q0m8O6j43Q5l4m4N0KK5k9l6M9pJ0j01N2K1M1n5pp5Q1M9
$$ -91 128 -86 -3 15 33 -13 67 19 85 -58 27 -7 -51 -1 1 26 -3 -39 10 3 13 -88 -36 -15 26 -29 -36 -111 -30 19
7349A9j01J43j5j10oO6J09mp8Rk1Lk8J2Jn8J0J07o8K8N9n0nJ5qO4l2Mr4k26L30
$$ 19 -82 61 46 -64 -70 -4 105 101 23 32 11 14 -14 -2 -1 -59 -49 58 -10 18 77 27 22 37 29 93 61 65 -29 -255 75
7380G5j61K5P8J04k9p6K2n6R8L0j01j4p9N6N0j6m6R3R0m7j75J70j11Q3o8J06j17
$$ 75 -86 -61 17 121 92 16 38 -18 80 110 9 -5 -84 -28 22 6 -40 53 143 96 -79 91 -20 63 -5 101 -16
7407a6K07j55n7M1j09K11j48R9r7M2k3ql8k2J11p3J02q9K5o3R7m9k8J94k08q0
$$ -16 191 36 -21 20 -89 122 -26 73 -24 18 -5 -13 -51 -73 38 -35 67 -22 3 -60 37 -12 -40 154 -54 -134
7433a34R6N5O6j07N1m5J15j41J30j48M9O6J1l6N9j74N4P2P5r1L1n1RnJ17j26J9
$$ -134 -38 17 83 -24 27 -18 97 -44 86 -62 -13 53 64 28 87 -87 -33 39 114 23 54 3 12 7 124 -2 17
7460A7kK2mk6j0o6O3O3o9KM8q9M3q9J89rK0j10J60j40M6n7l3RL3o7oN0m5qJ18
$$ 17 15 37 33 7 -3 -69 -6 57 -12 -10 38 -51 -8 -97 92 83 103 -7 153 13 59 2 -31 -22 11 -56 -62 -12 -57 -65 53
7491E3k7Kk4J05j36J04r0mQ0r2N4L4p3n4Q2l6k7Qk4J2K2Q1J09q6k07J42L3k4L5
$$ 53 26 28 4 109 -27 77 -13 -17 63 -29 25 59 -14 -68 14 -22 -49 -41 -65 -53 -31 50 159 73 -134 8 41 17 52
7520E2J10j98L2R7j31Nn9J25k7RNnj0J96j83ko8O6J1Po9J14k9J45k04l9M4NK2
$$ 52 162 -36 -4 93 -38 -33 -92 33 6 15 20 15 5 201 18 16 -52 14 25 32 -37 77 48 193 -11 -50 -6 -1 21
7549B1J1j2k9J5l9J2J68j36n6J00j3m9o3Q6j24J14O3p6J0Nj20J64K5l2o4J21p4
$$ 21 32 20 -9 6 -33 -21 147 11 -45 55 42 -7 -70 16 -108 6 69 -7 3 8 -112 52 77 45 -19 102 28
7576B8k7l8L7j9P1rm4k6M0J7J7m0j9J02n2p5Q3k5q7M0J5N1O0lk29K74k9n34M10
$$ 28 1 -37 0 -19 52 43 -1 -27 13 30 47 7 -12 90 38 -37 46 21 -66 -26 -11 40 100 97 -132 142 113 -421 -11
7605a1m9rk3J54Rn1k9k0o7J34o0K1p6P9lM3q3J06rj07RK25j72pJ4J10j13j39J23
$$ -11 -60 -69 -92 62 71 20 -9 -29 -96 38 -22 -1 -77 2 -1 42 -41 65 56 -51 -42 183 11 4 18 128 15 -124 -1
7634aKj14J58J0m0Rk8L6rnJ12j18O1o9O9N3Mj71Q9p1j3m8J53l3o2O7K3q4N0N6
$$ -1 1 -113 45 55 15 24 -4 32 23 18 130 12 73 4 73 126 130 -41 48 -23 -36 -84 69 36 -26 41 64 -20 30 86
7664H6o9N3q1j5J11j23J03r8N2j07N6m7N2M8K7l4p5M8O4pm6L7j4j3jj8L7o3j5
$$ 86 17 70 -11 -26 85 -38 65 -33 19 -88 -32 -79 -27 21 48 14 -61 -13 51 44 -2 35 21 8 7 -11 26 -37 -52
7693e2%JJ12m0oK5m3R0j57J25o1q6J61j76M5J09p7N1j0J2m3K5N0j11L1k5P6j07
$$ -52 -52 -51 61 21 15 40 -3 87 -70 55 -6 -92 69 -107 -62 47 -30 21 11 23 -20 5 55 -56 -25 -50 26 -81
7721h1J20l7N9m3q5M7j7N5O5j00Q5j54L7P1o0k5K23k10q8J20N1p1N3n7Q4j6r4
$$ -81 39 2 61 18 -67 -20 -37 18 83 -17 68 -86 -49 22 -38 -63 160 -50 -138 -18 33 -38 15 -42 42 26 -68
7748f8Q4J7M3Lj59P5R0Lr0m1P3j18J34j03N2n8J4KN1m5k9P7m6M8j2N0Op7K2r0
$$ -68 16 33 76 79 -80 -5 85 88 -2 -43 30 -88 46 -57 -5 -63 -49 -47 4 -41 -70 7 -39 9 -3 47 53 -24 -2 -92
7778i2R4o5M0k6L4p8J62k7kp4J20k7j80J54j28J6J86k0j33N5M6j13Q2Oq1o5Q3
$$ -92 2 -63 -23 -49 -15 -93 69 42 40 -34 86 59 -121 33 -95 -79 107 87 -46 9 55 -58 24 30 -51 -116 -33
7805c3m0J20lp6NJ1p6RJ05m8k8M8Kq3J33p8LL5n8J28o0j8j8j0n3J30j9%m3o4R6
$$ -33 -73 47 44 -32 -27 -16 -92 -83 22 -26 -54 -6 -4 -87 46 -32 -29 6 -52 76 16 -2 -20 -30 -83 47 28 28 -15 -79 17
7836A7p1N3O1j14M3L6L1M2j3l6N8j49m3J21q0J10j58K02j45K1lL1l3L1p5J28n6
$$ 17 -54 -1 60 -54 -11 25 56 98 85 49 107 -42 -85 36 -44 66 -92 110 -35 -14 -17 14 -19 12 -63 65 9
7863IM7mp8q3J87n0rJ2p7O7L8M7j72M0k3L8m4J65q9j2n4nkO7j4P0r7L0P9n4k0
$$ 9 56 52 -26 -109 78 28 19 31 -46 21 59 106 -66 -26 -49 -11 -55 110 21 9 -45 -50 -52 15 1 71 -26 4 83 29 9
7894Il1n3j8R0K8Nj16J38l6J16m7r2l8QK2P1J4n5K5J0K4k5l3k1m1J06j13L4rL0
$$ 9 -22 -75 -93 -3 25 30 -86 52 16 132 85 -7 -45 -37 -15 56 70 15 40 50 74 49 16 -5 -46 60 -53 -19 -28 2
7924BO7j65mK3J00n1K8J5M0K9n7N7j04L8L7m7qn6J4k6J16J1j53J73r9L7l8J90
$$ 2 69 -96 -100 -77 23 -28 0 15 55 84 27 84 -20 18 55 8 0 -56 -42 -68 48 59 -94 79 -20 17 -21 169
7952A69k32NQ1M2k6K3r1N6J0r5O7k3L6j69P9J45J9j50K1p9P8K9N8q5M4j09j5J75
$$ 169 -63 -58 23 65 39 62 -29 27 37 -58 9 -14 22 -147 -68 77 96 -54 -33 -112 -34 -5 53 -32 12 -97 -112 63
7980F3o3o4J41N0l26K18K4j7l2plMN2j29J09n6RR8%oM6j15J03j19q2N5k8P7j34
$$ 63 0 -64 77 127 -199 19 43 26 -6 -13 -16 -12 40 -89 20 -36 -27 71 71 65 111 -4 99 -20 -102 -47 -75 2 -132
8009a32J72q1j11J00P6p6J15J9n5q0L2j9RJ05j12J03k7j40Q0M7r0J88k07P4J15
$$ -132 40 -41 -152 -52 24 -52 63 82 27 -53 -21 -40 -31 74 -38 65 38 -102 -22 25 -65 123 -84 -10 105
8034A05q1l1j10J63j6oo2k7K07o9j78N8m7J64r1K1N5r8J11m8ql9K9o9P7Pk5J6
$$ 105 24 -7 -117 46 30 24 -38 -65 142 73 -105 -47 -94 70 -21 0 55 -43 68 20 12 -27 2 -67 10 17 -8 8
8062HOM0j10N0q9J21J9j3p7Q8r3j2j7N5J9j4l0K0N1j09J76Q4o5O7m62K65K07j87
$$ 8 14 54 -56 -6 -95 26 45 32 -45 43 -50 -62 -79 -24 -5 -19 -49 -29 22 -87 89 173 108 175 -287 -22 185 -2
8090bQj15M6J76q8k8Q5m8O3j21j9Q1mLL5m3k5J0l9n1m5Q5J06o0p8J57r9n6J47
$$ -2 6 -109 -63 113 25 -3 82 34 97 -24 -43 38 34 37 72 29 4 14 -25 -76 -121 -36 70 10 -68 89 -10 -66 81
8119H1J4j35O6j3M8N8pk25K22j40N2Mo2J06q5O0j69N4J14j0L5J2J8j28oJ19j02
$$ 81 95 -40 26 13 61 119 112 -113 109 -31 21 25 -37 69 -16 44 -125 -71 43 33 68 80 98 -30 -36 83 -19
8146a9l3P5J5j67J38pl2L8m8K0P9m5JM7j8m8M1n3n3m9J37k4j03J95k7p9m5J68
$$ -19 -52 23 38 -129 9 2 -30 8 -40 -20 59 14 15 62 44 -4 37 -16 -69 -118 19 -5 -108 87 60 -19 -64 104
8174A04k30J46j34K86j77J23k22K53j65J39k97K29j27N60p43j19J282
$$ 104 -126 20 -114 172 -5 118 -104 149 -16 123 -174 55 -72 488 -255 -374 908
8191I08
$$ Imaginary data points
##PAGE= N=2
##DATA TABLE= (X++(I..I)), XYDATA
0@%%%%%%%%%%%%%%%%%%%qJ6j6J6j6J6j7K5l2L2m0M8m8N6o4P2q2R0j04J20j34J48
$$ 0 0 0 0 0 0 0 0 0 0 0 0 0 0 0 0 0 0 0 0 -8 8 -8 8 -8 8 -9 16 -16 16 -24 24 -24 32 -32 40 -42 48 -56 64 -70 78
41G8j64J82k00K18k42K67k93L24l56L94m34M76n29N86o47P19q00Q95j006J137
$$ 78 -86 96 -104 114 -128 139 -154 170 -186 208 -226 250 -279 307 -340 379 -421 474 -532 605
61F05j299J504j768K124k638L437m863Q158l0706o833M9211k7184K179K2749m918
$$ 605 -694 810 -958 1166 -1472 1965 -2898 5260 -25446 -32279 16932 -10252 -8073 14676 9758
76I758n52P405j461k001j3561Q111j913k3444J2900O366k3133J5885O981j6014
$$ 9758 9206 16611 15150 13149 -412 7699 5786 -17658 -4758 1608 -21525 -5640 1341 -14673
90a4673J4285L411q728J2701l552k539Q339p028K124L590q355O331k748p540Q489
$$ -14673 -388 3023 -5705 6996 3444 905 9244 2216 4340 7930 -425 5906 3158 -4382 4107
105D107p838m570J0325j2484J90J3006j2184K874J3294q007L620P046l948J968
$$ 4107 -3731 -8301 2024 -10460 -10270 2736 -9448 -6574 6720 -1287 2333 9379 5431 7399
119G399k958m11K075j1197L046M913j3941O141P631j2101O462O627q120N103K256
$$ 7399 4441 4030 6105 -5092 -2046 2867 -11074 -4933 2698 -9403 -2941 3686 -4434 669 2925
134B925l298L437k638J857K380o918N640J728q978O509L08q415N926j267n050
$$ 2925 -373 3064 426 2283 4663 -2255 3385 5113 -3865 2644 2952 -5463 463 -804 -5854
149e854N236k745k70M564l346L328L034m326M874o1m517M213l243k919M179n329
$$ -5854 -618 -3363 -3633 931 -2415 913 3947 -379 4495 4434 -83 4130 887 -2032 2147 -3182
165c182k57M579n528K070L984m466K908J766k982K906j082q09K794l701J606K726
$$ -3182 -3439 1140 -4388 -2318 1666 -2800 108 1874 -1108 1798 716 -93 2701 -1000 606 3332
181C332n666L183K149o042L166J232m645K512K05j981K217j032J281J800k617
$$ 3332 -2334 849 2998 -3044 122 1354 -3291 -779 -574 -2555 -338 -1370 -89 1711 -906
196i06L323P10m346M030m60m490L445j154k944K723j416m51K119j889J654J137
$$ -906 2417 3127 -1219 2811 2351 -2139 1306 152 -2792 -69 -1485 -1936 183 -1706 -52 1085
212A085k313K569l53k057L136j610j099K906k550r7K271k874P62J092k812J555
$$ 1085 -1228 1341 988 -1069 2067 457 -642 2264 -286 -383 1888 -986 -224 868 -1944 -389
228c89P2j915K074n09m88J994j149R03J529k298J768L36k459K157o81k719K459
$$ -389 -317 -2232 -158 -667 -1155 839 -310 593 2122 -176 1592 1928 -531 1626 945 -1774 685
245F85j004j805J987q08L20Q12j081J395L76j762K109m46j494K172q49j123J800
$$ 685 -319 -2124 -137 -945 -625 187 -894 501 877 -885 1224 778 -716 1456 607 -516 1284
262A284j292m43J105j291O05M1j207J548o38j222J855l96o08J976j053J13J088
$$ 1284 -8 -451 654 -637 -32 9 -1198 350 -288 -1510 345 -51 -659 1317 264 377 1465
279A465j407O17K22j412Q03k81j093J169m69n30J009p51L78O42q78Q83J69j056
$$ 1465 58 675 897 -515 288 7 -1086 83 -386 -916 93 -658 -280 362 -516 367 536 -520
297e20J216k11r19J367n41o61R79q74j7M55j050M22K50r73J009p1o62J300m10
$$ -520 696 485 -434 933 392 -269 710 -164 -181 274 -776 -354 -104 -1077 -68 -139 -801 499 89
316H9m03J226o78j48N88p59L66m5o50O41k33o31Q91o26l9O00l09k06N96o44M88
$$ 89 -314 912 234 86 674 -85 281 236 -414 227 -6 -637 254 -372 -411 189 -120 -326 270 -374 114
337A14J62n03O71k15l65P47n32l02P48p37RL30o17L39J63n24O74k17k08P24m53
$$ 114 276 -227 444 229 -136 611 79 -223 525 -212 -203 127 -490 -151 12 -512 162 -55 -263 461 8
358Ho7O14m91k7K94m67J70Q0n43M91j8k37L22l03j27M96k92J20K22l95K65P3l65
$$ 8 -59 555 64 37 331 -136 34 114 -429 62 44 -193 129 -174 -301 195 -97 23 245 -150 115 188 -177
381a77M66j82k87M14k62m1L62m09j41M31n18K84O5k92N65k79p0K89j61k28N09
$$ -177 289 107 -180 234 -28 -69 293 -116 -257 174 -344 -60 5 -287 278 -1 -71 218 57 -171 338
402C38l63r6K16l88K05J75k89K84j04j04K55k17J7L34k83Q1J59l70K41J34l03
$$ 338 -25 -121 95 -293 -88 87 -202 82 -22 -126 129 -88 -71 263 -20 61 220 -150 91 225 -78
423g8K08n6k48K50k14RJ64j64J15k0n6J87K4k34L06j29j58J39N1k36L42k09m8
$$ -78 130 74 -174 76 -138 -129 35 -129 -14 -34 -90 97 121 -113 193 64 -94 45 96 -140 202 -7 -55
446e5J71l14Q8J32j61J99j51r0L74k58m9K45j25L9J70l44J57m0m6J37j28r0J45
$$ -55 116 -198 -110 22 -139 60 -91 -181 193 -65 -114 131 6 45 215 -129 28 -12 -58 79 -49 -139 6
469Fj27k2K11j09K9P2j56J38L4j51J11P4j80K02j56j09J71j14m3J87j24K1N9k27
$$ 6 -121 -143 68 -41 -12 60 -96 42 76 -75 36 110 -70 132 -24 -133 38 -76 -119 68 -56 -35 24 -203
493b03K19p1K9J57l1j09J91j51O3k7j37J09R0j65MJ32j83O9j12M1J65k34N7J24
$$ -203 16 -55 -26 131 100 -9 182 31 94 67 -70 39 129 -36 -32 100 -83 -14 -126 -85 80 -154 -97 27
517B7j04J06J17k08M4L4m5n8N3K4J51k32J21N3j72J02R7j43L4k3j0K0Mj33J38
$$ 27 -77 29 146 -62 -18 16 -29 -87 -34 -10 141 -91 30 83 -89 13 110 -33 1 -22 -32 -12 -8 -141 -3
542cr5J59M2j94J22l7M6p5K74m21K37j73J61j84k1J81J2m1J63j75l38N16l35k24
$$ -3 -98 61 103 -91 31 -6 40 -35 239 -182 55 -118 43 -141 -162 19 31 -10 153 -22 -360 156 -179 -403
566d03K97O5M5l0j90k47O76j42l49k4L07Q8k72L01j67K67j71K45m86N8J88n6o2
$$ -403 -106 -41 4 -26 -216 -463 213 71 -278 -302 5 93 -179 122 -45 222 51 296 -190 -132 56 0 -62
589f2J26M6K23l88K08m8j34j9J68j62K22k75Q7m3k4j1J20o2L7O9m0k02J58l9N9
$$ -62 64 110 333 -55 153 105 -29 -48 120 -42 180 -95 -8 -51 -75 -86 34 -28 9 78 38 -164 -6 -45 14
614A4L1p5n5P6q4Q6P5j40J24m9R7j36J17n9Pml3L5j13J21K8J01j36n5nQ5J2j5
$$ 14 45 -30 -85 -9 -93 -7 68 -72 52 3 100 -36 81 22 29 25 -8 27 -86 35 63 164 28 -27 -32 53 65 50
642E0j19K3O5nk7J3m8J20j62J37j36M4K3Q6j65K20o8k2Q3k96k16J014j409M64
$$ 50 -69 -46 19 14 -13 0 -48 72 -90 47 -89 -45 -22 64 -101 119 51 29 112 -184 -400 614 -795 -331
666c31M95J4j92J38K19l76r7K43J44n88L87l0N92m91j32m9K99m18m8O49k63J97
$$ -331 164 178 -14 124 343 -33 -130 113 257 -331 56 26 618 127 -5 -54 245 -173 -221 428 165 362
688C62m27n62O00K78l19J44j42R4j0nL5r7p1P0n5QJ51m4QJ8j16M8N4J7j03N5J58
$$ 362 -65 -627 -27 251 -68 76 -66 28 18 13 48 -49 -120 -50 -105 -97 54 10 18 36 -80 -32 22 39 -64 -9 149
715A49m5q9P7r8j8O1K3r0Q5m2n7O8p4R1m4L9J8m5R1j13J2Lm7jqJ22j12L5Q7k46
$$ 149 104 15 92 -6 -24 37 60 -30 55 13 -44 24 -50 41 -3 36 54 9 100 -13 -1 2 -45 -46 -54 68 -44 -9 78 -168
745a68J49o9J58L9j09m1qK3J23q4oQ4q4M4j31O9J1j7R7j48K6O5n1q8J66m1O6N
$$ -168 -19 -88 70 109 0 -41 -49 -26 97 13 7 91 7 51 -80 -11 0 -17 80 -68 -42 23 -28 -116 50 9 75 80
773H0j32J5J47rq2j64P7j4J51j00Q6q7P8o0O5K2j32O6N0j18N4Q8l5q7O0l5oN6
$$ 80 -52 -37 110 101 19 -145 -68 -82 69 -31 55 -32 46 -14 51 73 -59 7 57 -61 -7 81 46 -41 19 -16 -22 34
801C4l6k4O1L1n2J4l2j33K08r3J43k14R5j13k1J04J55L7k30L9k1KJ4n1Q8n2j1
$$ 34 -2 -26 35 66 14 28 -4 -137 71 -22 121 -93 2 -111 -132 -28 127 164 -66 -27 -48 -46 -32 -83 5 -47 -58
828e8K60l01J23K9k6j8K4p4J30o4oj0J1m4J5L3KK28k37L80k36j75R8j08K5p1n2
$$ -58 202 -99 24 53 27 9 33 -41 89 25 19 9 20 -24 -9 24 26 254 17 397 161 -14 84 -24 1 -70 -122
855a22%j1M02l4j41L5K15m61J13k48P95K2p32N21m53j20q2K12j55K68J80k51k6
$$ -122 -122 -133 269 235 94 129 344 -117 -4 -252 543 565 -167 354 -99 -219 -301 -89 -244 24 204 -47 -73
878g3J66j46J17l3j34j5J73l6Q1j02J80j61O3n8j4M0n3r5L8J45l5m8o5J55k03
$$ -73 93 -53 64 31 -103 -118 55 19 100 -2 178 17 80 22 8 48 -5 -100 -62 83 48 0 -65 90 -113
903a13J77n7k2m2J7K5p7P3J24r6R5j42k7L0m9Q6k6OL4J7n9J5N2j11J20r6M4KO1
$$ -113 64 7 -15 -57 -40 -15 -92 -19 105 9 104 -38 -65 -35 -84 2 -24 -18 16 33 -26 -11 41 -70 50 -46 -2 0 61
932F1J3j31QJ51l2J5k25J46r4N3J23n0m7o8Q9o3J58o0q2P8ql6j4K3p0n1J17L1
$$ 61 74 -57 -49 102 70 85 -140 6 -88 -35 88 38 -9 -77 12 -51 107 47 -35 43 35 -1 -15 8 -62 -113 4 35
960C5%QpK3j19J9JJ01r3O4n4K1n9R3o3K1j6n1KO9r7J71J5j29PJ2N3j35J20q3R7
$$ 35 35 43 36 59 -60 -41 -40 61 -32 32 -22 -1 -60 33 -30 -9 -25 -76 -74 -5 -102 69 84 -45 -38 -26 27 -108 12 -71 26
991B6p8N9pO0o6q2J13j12J33l3j3J22q1K9n5N0L4j46nO4n6jL2L9j06J05o3qp8
$$ 26 -52 7 0 60 -6 -88 25 -87 46 13 0 122 41 70 15 65 99 -47 -52 12 -44 -45 -13 26 -80 25 -38 -46 -124
1020a24N5N1M8J5j35jN3rL7O1k4N3o2p8j3O3l1j9J08o6Oj25J43L3j07L8j8j8L9
$$ -124 -69 -18 30 45 -90 -91 -38 -47 -10 51 27 80 18 -60 -73 -10 -41 -60 48 -18 -12 -137 6 39 -68 -30 -48 -66 -27
1049b7J7K1O4k4mj3qN3j43J13j3K2p6n1p3O3J17j35P7l6K31k18M5N0j17K28j10
$$ -27 -10 11 75 51 47 34 26 79 -64 49 36 58 -18 -69 -142 -79 38 -97 -20 -56 175 -43 2 52 -65 163 53
1076E3m0Q1r4pJ00q6J01j66P3n9QN7p8N4l9M4N2n6K3J8k2L3J10j94J87j76llL3
$$ 53 13 94 0 -7 93 7 108 -58 15 -44 -36 21 -57 -3 -42 2 54 -2 21 39 17 50 160 -34 153 -23 -26 -29 4
1105DQ1j01M4o6J30j68K12l1j39J9L9l6J32m6j15P8o4R0r0J06q2K0K6j3k26P1
$$ 4 85 -16 28 -38 92 -76 136 105 -34 -15 24 -12 120 74 -41 37 -27 63 -27 79 -3 17 43 30 -196 -125
1131a25JJ37J4mM1o8k9J17j01N2O7j45l4K7ql3J00k6P8j31M1N4m8P4o0j6M4p7
$$ -125 -124 13 27 23 64 -4 -33 84 -17 35 102 -43 -77 -50 -58 -91 9 -17 61 -70 -29 25 -23 51 -9 -25 19 -58
1159e8P8m6J44j64Q4K4j00J7L1J9k0j4oj5pR7j04K4P8Pj28RL5l5J25o7J9j6j02
$$ -58 20 -26 118 -46 38 62 -38 -21 10 29 9 -5 -11 -26 -33 64 -40 -16 62 69 -59 -50 -15 -50 75 8 27 11 -91
1188i1J32n9J21k16J16J7j04K9M8m7J11j47K1Q4n6m8J40m8Q8o4l2m1M8J05j10
$$ -91 41 -18 103 -113 3 20 -84 -55 -7 -54 57 -90 -69 15 -41 -89 51 3 91 27 -5 -46 2 107 -3
1213cL3N0k58J24R5o6P5r0km3J85l37N08l45m2K98k99K32j17q4K3QQ2k1m3j6p1
$$ -3 30 80 -178 -54 41 -25 50 -40 -42 -85 100 -237 271 -74 -116 182 -117 115 -2 -86 -63 -55 27 6 -37 -53 -124
1240a24M3oM9l9K48j10o6QQ2r2l4L3J16r2o2O1o0L3J13j96rJ22k8N8q8o3rJ36
$$ -124 -81 -87 -38 -77 171 61 -5 3 85 -7 -41 -8 108 16 -46 15 -45 -12 101 -95 -104 18 -10 48 -40 -103 -112 24
1268B4J9q2N8n7J50j21KK7K5j44N4l7N0Q1o9rN2J07j47K1p3J75j59J00P0q7O0
$$ 24 43 -39 19 -38 112 -9 -7 20 45 -99 -45 -82 -32 49 -20 -29 23 130 -17 4 -69 106 -53 47 117 30 90
1295I0j05N5rq8J09l4K3m6R3j29%J06j81J07RN7j20J63j53O4n8r8q6K31N0j96
$$ 90 -15 40 31 -57 52 18 41 -5 88 -41 -41 65 -116 -9 0 57 -63 100 -53 11 -47 -145 -231 0 50 -146
1321a46J14j9J01j44J58j44Q0Q2k1k3J4p4J01j8n5L5j15J12j25J96j78O0l6J59
$$ -146 -32 -51 50 -94 64 -80 0 82 61 38 52 -22 79 61 6 41 -74 38 -87 109 -69 -9 -45 114
1345A14J5M12o21j10K09j38K18j41m1M0JJ21p6l1lrj4L5k4N5j18M0O8mn6R2l8
$$ 114 129 541 -80 -190 19 -119 99 -42 -83 -43 -42 79 3 -28 -31 -40 -54 -19 -43 12 -106 -66 2 -2 -58 34 -4
1372dM1n0j0Jm0J14q2k9J35r9M6o7J29k9j01J3M8q5K10k20R9l20K26J29J9k2J01
$$ -4 37 -13 -23 -22 -62 52 -30 -59 76 -23 23 -44 85 56 -45 -32 16 -69 141 -79 20 -300 -74 55 74 52 153
1399A53l21K48k2N83l07n25J29j6o8l02L54j44K19r6Q1qj24J42N4On9L7k3K3M5
$$ 153 -168 80 58 641 334 -191 -62 -78 -146 -448 -94 -238 -19 -115 -34 -42 -166 -24 30 36 -23 14 -9 14 59
1424E9k2p9M3l6lO9o3J40j41KJ4K9q1L8L0J48j18R9j37l1m1Q2K2o4N1p2J46Pj78
$$ 59 37 -42 1 -35 -38 31 -32 108 -33 -31 -17 12 -69 -31 -1 147 29 128 -9 -40 -81 1 23 -41 10 -62 84 91 -87
1453h7J30j33L6k5M7O0j22J19mj0J16j25J29r7m1P1k34j32K77R4j4k10L83l52
$$ -87 43 -90 -54 -79 -32 28 -94 25 21 11 127 2 131 34 -7 64 -170 -302 -25 69 55 -155 228 -124
1477a24r2L25j34k5o3J48o6J5k4J30o2P7j78j8J42j4r4K1j0J1J7NL9j08J4O9M0
$$ -124 -216 109 -25 -50 -113 35 -31 -16 -40 90 28 105 -73 -91 51 37 -57 -36 -46 -35 -18 -13 26 -82 -68 1 41
1504D1n5P6r1M9m6K9lNj5p4R0r8J50q4r9J06K2Q5j95O5N9m2L1l0K6p9Q5Q9j14
$$ 41 -14 62 -29 20 -26 3 0 5 -10 -84 6 -92 58 -26 -125 -19 3 88 -107 -42 17 -25 6 -24 2 -77 8 97 -17
1533a7J5Mp8J47j21N3k1L8O2p2M7l6q4J22m4J13l9J2j0Jj36O6n7J08j75R5j8k3
$$ -17 -2 2 -76 71 -50 3 -18 20 82 10 57 21 -63 59 15 128 89 101 91 92 -44 22 -35 73 -102 -7 -25 -48
1561d8R4o1J5J7Q7k12J34K0j55L6J36j01R3r4l3Q2n8L4J40j08oO5j52LQ5p0N7
$$ -48 46 -15 0 17 104 -108 26 46 -109 -73 63 -38 55 -39 -72 10 -48 -14 126 18 12 77 -75 -72 13 -57 0
1588@j1N8j00J3L8P8m6L9l2rp9k1P8l0M3j3P6p2o7o7J65p1M7O2r2R5j50K15j40
$$ 0 -11 47 -53 -40 -2 76 30 69 37 28 -51 -72 6 -24 19 6 82 10 -57 -124 41 -30 17 79 -13 82 -68 147 7
1617Gj8l9Q2n4J03pn3O9o8J40k15L9Ok8L4n6O7P3j36J66j70j4L9N6l9J6j04J15
$$ 7 -11 -50 32 -22 81 74 21 90 22 162 -53 -14 -8 -36 -2 -58 9 82 -54 112 -58 -72 -33 23 -16 0 -104 11
1645A1Kj2L4j30J0M3R7j25M7n4K4K6j1J40j19mo0J9K3m3O5q9J16j05J2N1k2J54
$$ 11 13 1 35 -95 -85 -42 55 -70 -23 -77 -53 -27 -38 102 -17 -21 -81 -62 -39 -82 -17 -106 10 -95 -83 -32 -54 100
1673A00O7j78j28J99k0q6N3j17K31J8j45L4n8L3j1n1ql4J50p5o8L0N5J1K5p8J35
$$ 100 167 -11 -139 60 40 -46 7 -110 121 139 -6 28 -30 3 -8 -59 -67 -101 49 -26 -94 -64 -9 2 27 -51 84
1700H4j62%J29j82N9L6m5J9L01j31l71J16K09n1k7NL9j8M4k7p8R1J4p5LR1M1j45
$$ 84 -78 -78 51 -131 -72 -36 -81 -62 239 108 -263 -147 62 11 -16 -11 28 10 54 27 -51 40 54 -21 -18 73 114 -31
1728c1k0L0L7k7R0Ko3l9J1N3l9m4P8k4n4Q5p5%%J35o2o3K2l4J0j2o7P9Pk9l2J95
$$ -31 -51 -21 16 -11 79 81 18 -21 -10 43 4 -40 38 14 -40 45 -30 -30 -30 105 43 -20 2 -32 -22 -34 -101 -22 -15 -44 -76 119
1760A19j72J64j5p3o6O2k4Q8j41M1n0n6K51j82K4O6j72O9L0J2Kl0O5n9K2Om5J35
$$ 119 -53 111 96 23 -43 19 -5 83 -58 -17 -67 -123 128 -54 -30 36 -136 -67 -37 -25 -23 -53 12 -47 -25 -19 -64 71
1788G1j10l9Q0mK6N4j64J33qj4K1o9J0M5p3K1J5m9L4J05J8j54L6K3j8L4L6P7j11
$$ 71 -39 -78 2 -2 24 78 -86 47 39 25 46 -23 -13 32 -41 -20 -5 -54 -20 85 103 -51 -15 8 -10 24 60 137 26
1817B6N3j64J22j16J31nj07J20n4J43k57J52n0kQ0p1J10m3J3o6o6J55j75J0R7
$$ 26 79 -85 37 -79 52 47 -60 60 6 149 -108 44 -6 -8 72 1 111 68 81 15 -51 104 -71 -61 36
1842C6K1j32R0K2NM8j26M7m1Mk2l8R5k4l0R2p6L3q9R9N3j53N9N7n8Q5j08Q3n6
$$ 36 57 -75 15 37 42 90 -36 11 -30 -26 -48 -86 9 -15 -45 47 -29 4 -85 14 67 -86 -27 30 -28 57 -51 32 -24
1871b4j5J59q6J09j49O9j05K5q3R3J6j9R2RL2j87J18j18J08j02J7l8J17M0o6L2
$$ -24 -39 120 34 143 -6 63 -42 -17 -100 -7 9 -10 82 91 123 -64 54 -64 44 -58 -41 -79 38 78 12 44
1897D4j0Qn2K1n8OJ7L0R4j19j6Qq9L8P9j20J33J11j42J88k69P1n0j8Q6j4R0j7
$$ 44 34 42 -10 11 -47 -41 -24 6 100 -19 -35 -27 -116 -78 1 -119 14 125 -17 171 -98 -27 -77 -95 -9 -23 67 50
1925E0Lm4o3l1j6L9Q6M27j46q12o4J391p89K63j490J512k96r8o8P74o72M13L08
$$ 50 53 9 -54 -85 -101 -62 24 451 305 -507 -571 820 31 294 -1196 316 20 -78 -146 628 -44 369 677
1948F77j305P05r6j74rJ66q0J77o32J011o00k68P05l25j9K20J06o2p6j31O9p2
$$ 677 -628 77 -19 -193 -202 -36 -116 61 -571 440 -160 -428 277 -48 -67 153 259 197 121 -10 59 -13
1970a3q3J75n1j01R9j4J7l8kL9j02J18j33J87K5r4p4M4%mk4j31J32o0O2P4p1Q2
$$ -13 -96 79 28 -73 26 12 29 -9 -11 28 -74 44 -89 98 123 29 -45 -1 -1 -5 -29 -160 -28 -88 -26 48 -23 59
1998E9K0k8kk0m9k6N0n5R3Kj05J41j14p1J25k0J8l4n8J18j63J53l4m3Lp8K8J06
$$ 59 79 51 49 29 -20 -46 4 -51 42 44 -61 80 -34 -105 20 0 18 -16 -74 44 -119 34 0 -43 -40 -118 -90 16
2026A6J15j85J06m7Kl0O9rj18J86j33R1p4J6r8P5L5jk2J4k7M0L8k2l8j12J48m
$$ 16 131 -54 52 5 7 -23 46 37 -81 105 -28 63 -11 5 -93 -18 17 16 -6 8 -19 21 59 37 -1 -113 35 31
2054C1q8M6j8l6N6N0n2%M5o5LJ08j08R3j1j28Q0j68K46j15J27j32j01K85n6j11
$$ 31 -57 -11 -29 -65 -9 41 -11 -11 34 -31 -28 80 -28 65 54 -74 6 -162 84 -31 96 -36 -137 148 92 -19
2080a9P0j57R3q5J50j8mj03K6J31m8k0l9M6j05k2L0R1n6J79r5O8J0j39N2R4o0
$$ -19 51 -106 -13 -98 52 34 30 -73 -47 84 36 16 -23 23 -82 -104 -74 17 -39 140 45 113 123 -16 36 130 70
2107G0k9P8q6K4Ro2L8o2J07q1LP4q1jp7O9l6J6m7J51q8MN4jJ6l7K8k2K2l4q0J66
$$ 70 41 119 33 57 66 4 42 -20 87 6 9 83 2 1 -76 -7 -43 -27 -74 77 -11 -7 47 46 62 25 53 31 53 19 -61 105
2139A05j75O5K7o4M0J5Q7j06l7kO5m2j1J25q1Q2j82J00JL3J1j4Q5j78J0j9J02
$$ 105 -70 -5 22 -42 -2 13 100 -6 -43 -45 20 -22 -33 92 11 93 -89 11 12 45 56 42 127 -51 -41 -60 42
2166D2pr1R0R6m2j5j25J05j12N4j34K44j08L6p1j0M1P7p9P5Qj06J04NQ7j72K2
$$ 42 35 -56 34 130 88 73 -52 53 -59 -5 -139 105 -3 33 -38 -48 -7 70 -9 66 74 -32 72 77 164 -8 14
2193A4j08O8pN3m7K8mM8p2q5J85k3j07Q4n7R7j09k2J82j05j29J61j18R6Ok8Q6
$$ 14 -94 -26 -33 20 -27 1 -3 45 -27 -112 73 50 -57 27 -30 67 -42 -64 118 13 -116 45 -73 23 29 1 87
2220H7o0j1L5m8l9J0n3R4Q7j06m5LK1j0nj1MK9J9n2j1J4O9k3k9N0L3j5o7O5m3
$$ 87 27 16 51 3 -36 -26 -79 15 102 -4 -49 -46 -25 -35 -40 -51 -47 -18 1 -51 -62 -48 21 -2 -31 19 52 37 -30 35 -8
2251hN7on4p0J14j6M5m0lj27J7J43q8M4%K4j6p0L7K1m5pJ27J5Pj45j8R6M1l4j57
$$ -8 49 43 -11 -81 33 17 62 22 19 -108 -91 52 -36 8 8 32 16 -54 -17 4 -41 -48 79 94 101 -44 -62 34 75 41 -116
2282a16J74j23M4K0L7j27O9K4K0om3M4M3jj7k8N6K9j08l1M4P7j46O7j15J41p8
$$ -116 58 -65 -21 -1 36 -91 -22 2 22 16 -27 17 60 59 42 14 70 99 -9 -40 4 81 -65 2 -113 28 -50
2309e0J04j00KJ03j53P3lp9J25K2po9K6n2%J5P7l2K3k3Q4k13J51k9K9PJJ%Mr3
$$ -50 54 -46 -44 59 -94 -21 -24 -103 22 44 37 -32 -6 -58 -58 -43 34 2 25 2 86 -127 24 -5 24 31 32 33 33 37 -56
2340e6J00K6j01o0J06K29l52O3kn8K30j10Pl7M7K8j60J42k5l3L1j16J39j19K08
$$ -56 44 70 -31 -91 15 244 -108 -45 -47 -105 125 15 22 -15 32 60 -100 42 17 -16 15 -101 38 -81 127
2365A27j63M9n6Ll1J20n6QO7q5J1j61K24r4R1j21J4K00k40K32k43J4M7J50l2N6
$$ 127 -36 13 -43 -40 -71 49 -7 1 68 -17 -6 -167 57 -37 54 -67 -53 147 -93 139 -104 -90 -43 107 75 131
2391A31j69M8Qj2rn4Q2p5J8M1O6j98M5oO2J06j07l1J16j28K7J5O2l9m6Q3rj00
$$ 131 -38 10 18 6 -3 -57 25 -50 -32 9 75 -123 -78 -84 -22 84 -23 -54 62 -66 -39 -24 38 -1 -47 36 27 -73
2419g3N5M6k5J7On9k1Q3n2M1M4n0K8nm7j9Q1m0Pj09J3Nk5J94j67Q6K5k4l3O7J69
$$ -73 -18 28 3 20 26 -33 -54 29 -23 18 62 12 40 35 -12 -31 50 10 17 -92 -79 -74 -99 95 -72 14 39 15 -18 49 218
2450B18j35k0j11l2M5M2O5j05R8k7j09O1pk7m6J62M2o2n9o1J21j6l2mO0p6l7P1
$$ 218 83 63 -48 -80 -35 7 72 -33 65 38 -71 -10 -17 -44 -90 72 114 52 -7 -68 53 37 5 1 61 -15 -52 19
2478A9j14J53r4M6O3l1p6jj4q9J66o7J53r4k5J9Lo6o3L0J4j8J52n6j04K4R1p8
$$ 19 -95 58 -36 10 73 42 -34 -35 -49 -138 28 -39 114 20 -5 14 17 -49 -112 -82 -68 -86 66 10 -94 -70 21 -57
2506e7N1OL3j39J4J53r7Q2j87K58j40J44l7j16Q5j13P2m7J03l6J0j8J1j6k8k9
$$ -57 -6 0 33 -106 -92 61 -36 46 -141 117 -23 121 84 -32 53 -60 12 -35 68 32 42 24 35 19 -9 -38
2532c8p1Q1N1m0O2r7L4Q5n8l8q0K64j95n3N4J3M6j7oj1O2Qq8P6j40J18k8m5L8
$$ -38 -109 -28 23 -17 45 -52 -18 67 9 -29 -109 155 -40 -93 -39 -26 20 3 -3 -14 48 56 -32 44 -96 22 -6 -51 -13
2561a3j8J74j99L7L8o3Q5N8j79L1k0J65k29K34j15J07j39O1L0M2k3r4l8M0J34
$$ -13 -31 143 -56 -19 19 -44 41 99 -80 -49 -69 96 -133 101 -14 93 -46 15 45 87 64 -30 -68 -28 106
2586A06j29J7o3J18k9j27J06O0M8j09O8j38N2OQP9Mq9l7Q3rJ0JOm9m9J03o8L6
$$ 106 -23 -6 -69 49 20 -107 -1 59 107 -2 66 -72 -20 -14 -6 73 77 -12 -49 34 25 35 36 42 -7 -56 47 -21 15
2615A5n9J5JN3R9n8k3KnK8n3j12O8j06R6L2kq0R0pj01O1M3k7J61j49O0o2J15j85
$$ 15 -44 -29 -28 25 124 66 43 45 40 68 15 -97 -29 -135 -39 -7 -9 -89 1 -6 -107 -46 -3 -30 131 -18 42 -20 95 -90
2645i0L7K3Q2j22O4mrj9L4j06J33j00Q0P5n5NJ4m4m0L2l7O2p7J28j52J39n7r8
$$ -90 -53 -30 52 -70 -6 -10 -19 -38 -4 -110 23 -77 3 78 23 28 42 -2 -42 -10 -47 15 -62 66 -86 53 -4 -102
2673a02j6J60j34M1J76j34R9n5j11J45r7N4O4j53N2L5M5N7j42o7J10J3n2N0r6
$$ -102 -118 42 -92 -51 125 -9 90 35 -76 69 -28 26 90 -63 -11 24 69 126 -16 -83 27 40 -12 38 -58
2698e8M4k6J27q9N4j19L8j3J02l4j50O8M5M9k1Q7j42P4j19l2M1L8o9K15j79O6
$$ -58 -14 -40 87 -2 52 -67 -29 -42 60 26 -124 -56 -11 38 17 104 -38 36 -83 -115 -74 -36 -105 110 -69 -3
2724cj1j9km0n0J3R4K1L5qq5l7J45l0L9kn4M8L8m8j04m9J51On5q6K1J1P9q6O4
$$ -3 -14 -33 -35 -75 -125 -112 -18 3 38 30 -55 -92 53 23 62 60 6 54 92 44 -60 -109 42 48 -7 -93 -72 -61 18 -68 -4
2755dl0J1N1JRj4n7K13j67K4j11N3j05J48K1j58Q0p1J11m4J8MJ4K5P1r3mJ6l6
$$ -4 -34 -23 28 29 38 24 -33 180 13 37 -74 -21 -126 22 43 -115 -35 -106 5 -39 -21 -17 -3 22 93 0 -4 12 -24
2784b4J3m8j9O7P8K5j14nQ1J9r5l7J66q9j7l1j6R9k6lo9J22n6Q3j14R4j05K3o7
$$ -24 -11 -59 -78 -11 67 92 -22 -27 54 73 -22 -59 107 18 1 -30 -46 53 27 24 -45 77 21 104 -10 84 -21 2 -65
2813f5K5P6Pp1J24j28N5r6l6J26NL1r6qJ3R8p1N9j17M8R0o7Rn9M1L1pj3k3M5j6
$$ -65 -40 36 43 -28 96 -32 23 -73 -109 17 22 53 -43 -51 -38 60 -11 48 -69 -21 69 2 11 -48 -7 24 17 4 -19 26 10
2844A0Kp7K9n1k3O5n0J14j8KQl0M1n0l6Q6l0N1m5N8J8k4j44Q2n2O9j9J6P0l8j46
$$ 10 12 -65 -36 -87 -110 -45 -95 19 1 3 11 -19 22 -28 -64 22 -8 43 -2 56 74 50 -94 -12 -64 5 -14 2 72 34 -112
2875a12K01oj17O2m1J10o5j5j9K7K3r7L9L3m1O4j6q9Q2L2n7Rj0L5m41M57j55m88
$$ -112 89 83 -34 28 -13 97 32 17 -2 25 48 -49 -10 23 -18 46 30 -59 23 55 -2 7 -3 32 -409 48 -107 -595
2903e95O27J09j65j5P1k2j26N0N6K6O7j1n9J4J53k02J11j45L2n1P0P8q8RoO0j
$$ -595 32 141 -24 -39 32 10 -116 -66 -10 16 83 72 13 27 180 -22 89 -56 -24 -75 -5 73 -15 -6 -12 48 47
2930D7j70O8R9r4J5J12r3j1L1n7K3O5m1p1j8J89j74J0P5k8N3J09q1mj31J05n1
$$ 47 -123 -55 44 -50 -35 77 -16 -27 4 -53 -30 35 -6 -77 -95 94 -80 -70 5 -23 30 139 58 54 -77 28 -23
2957b3J9K6n2k5K5P8l7R9k26J16K0N0n6j6K3P4j4q4k4K4j0kr2J21m8L1PM3o2m4
$$ -23 -4 22 -30 -55 -30 48 11 110 -116 0 20 70 14 -2 21 95 81 -3 -27 -3 -13 -15 -107 14 -34 -3 4 47 -15 -59
2987e9P3j3Q9r4J13k4j63J1K7K1pJ09r0j06K19k1oj1Nn5J0j9J4j29J85m9p5N6
$$ -59 14 1 90 -4 109 85 -78 -67 -40 -19 -26 83 -7 -113 106 85 79 68 73 18 28 9 23 -106 79 30 -45 11
3015A1K1l6p4nP6O5k9K7M9j01j64J17K3N7l8Q3N9j43KJ2K4q8J09j19J13j12M6
$$ 11 32 -4 -78 -83 -7 58 29 56 105 4 -160 -43 -20 37 -1 82 141 -2 0 12 36 -52 57 -62 51 -61 -15
3042a5o4J93m9n1o2L8k2oJ14j82P8J46l1m9qJ9l4j6k4LJ18j00j40Q1J2m3J19l0
$$ -15 -79 114 65 14 -48 -10 -32 -38 76 -106 -28 118 87 38 30 49 15 -1 -25 -22 96 -4 -144 -63 -51 -94 25 -5
3070el6J11l5j12Q6l7Q5J6Ko8J7jM1q9L8n0K8K2O7k34M6J03k3q4P0j4J5J30j28
$$ -5 -41 70 35 -77 9 -28 57 73 75 7 24 23 64 -25 13 -37 -9 13 80 -154 -108 -5 -28 -112 -42 -56 -41 89 -39
3099c9J18p2O3l9Qm5J1m5O2j6J4M4m9k5L0M2j04P4m6l8O8j9Q6q0Q4kNj32M8m4
$$ -39 79 7 70 31 39 -6 5 -40 22 6 20 64 15 -10 20 62 -42 32 -14 -52 16 -3 83 3 87 85 90 -42 6 -38
3129c8Qp9J16o6L7J48r4qR6k4j28J20K3q0M1j01qpMQL0k5J14r1K1o6J01p6N8j6
$$ -38 -30 -109 7 -59 -22 126 32 24 120 96 -32 88 111 31 72 -29 -37 -44 -40 -32 -2 -27 87 -4 17 -49 52 -24 34 18
3159A8M0jl9QPj8m1k1R2mq5O3k1L5Jn8M2P4j6j06M7l4j8L7j9q8P7N8j41R2M6j6
$$ 18 58 57 18 26 33 15 -26 -47 45 41 -44 19 -2 33 34 -24 18 92 76 -30 17 -17 -35 2 -17 -105 -28 30 -111 -19 27 11
3191A1n2M7k7K1o0P3N9j00ln5Q7m8O7j35N9k5J18o3l0J09LK6L2j82P1LlNj05K08
$$ 11 -41 6 -21 0 -60 13 72 -28 -31 -86 1 -47 20 -115 -56 -81 37 -26 -56 53 56 82 114 -68 3 6 3 8 -97 111
3221A11j06J6J3oj9nrm1J32k01J15Lq1N8K3K5n7Q5o8m3L8O8p9P8j54J71q7N0p6
$$ 111 5 21 34 28 9 4 -5 -46 86 -115 0 3 -78 -20 3 28 -29 56 -12 -55 -17 51 -28 50 -104 67 -20 30 -46
3250d6m5J11l3l7l5J74j66J23L8o3K0oK8j54J43j8r6J69r4o2j5NL6j2J78j21N3
$$ -46 -91 20 -13 -50 -85 89 -77 46 84 21 41 35 63 -91 52 34 -62 107 13 -49 -64 -59 -23 -35 143 22 75
3277G5j42Q0j3n5Q9j04K1K78k60O05o81l41P45l89K28j98J62j14Q9j72P4p4J72
$$ 75 -67 13 0 -55 34 -70 -49 229 -31 574 -107 -448 297 -92 136 -62 100 -14 75 -97 -23 -97 75
3300G5j01Qk2L4J35j16p1N4r3K16k10O4J36j39n2P6l1J4L1K2m4l1K9l7lR3J4q0
$$ 75 -26 -18 -40 -6 129 13 -58 -4 -97 119 -91 -27 109 -30 -82 -6 -37 -23 8 30 -14 -45 -16 -53 -56 37 51 -29
3328b9n8R6M7OM3j09J3m1P8j30JN2J26r4N9j61J73m1o8N8r8J38j03R2n4n3k9J61
$$ -29 -87 9 56 62 105 -4 9 -32 46 -84 -83 -31 95 1 60 -101 72 31 -37 21 -77 61 -42 50 -4 -57 -86 75
3356G5n1l0l1P8q8j0q8J80rN1j3j1n9L3j44J52k6Ro9Pj16K26l26M73l17K24m1
$$ 75 24 -6 -37 41 -47 -57 -145 35 26 77 64 53 -6 27 -117 35 9 18 -51 -44 -160 66 -260 213 -104 120 79
3383G9J53k50L77o50L90q8L1m8J1j05K1J23l1qj5O5q3j27K37o6P4o6K0pj90R0
$$ 79 232 -18 359 -291 99 11 42 -6 5 -100 -79 44 13 5 -10 55 -28 -155 82 16 90 24 44 37 -153 -63
3409f3Q5q6Q7qk6j7m6P0M8k1k2J34j76O4L7N2l1j59K5J06K6j07J1k1Q9q0R9n3
$$ -63 22 -64 23 15 -11 -28 -74 -4 44 23 1 135 -41 23 60 112 81 -78 -53 53 79 -28 -17 -38 51 -29 70 17
3437A7or2P1L9l1O6j31J73j52M8k9R1r3N1j25J62J4j88L7J63j25N8l4N4k6%m1
$$ 17 11 -81 -10 29 -2 64 -67 106 -46 2 -27 64 -29 22 -103 59 73 -115 -78 85 -40 18 -16 38 12 12 -29
3464b9KJ74r0Qo8q6J01Q4n1r3J8J16n3o2O8r3N3m3K6p1Q2o7J16p4QO8j03N7j0
$$ -29 -27 147 57 65 -3 -89 12 96 45 -48 -30 86 33 -29 39 -54 -1 -44 -18 -89 -7 -74 42 -32 -24 44 -59 -2 -12
3493a2q5K3K07j66P5m9J8K8O7m8r7k7N4J0RN9q8R4k8r3J14N7j65J7K9K0p6J66
$$ -12 -97 -74 133 -33 42 -7 11 39 106 58 -39 -66 -12 -2 7 66 -22 72 44 -49 65 122 -43 -26 3 23 -53 113
3521A13p2q6l6N1P6k0j03J53j54L8R9j06J52j59l1K9JKP0lQ7j74M4L7K0n2N4J7
$$ 113 41 -45 -81 -30 46 26 -77 76 -78 -40 59 -47 105 -54 -85 -56 -55 -53 17 14 101 -73 -29 8 28 -24 30 47
3549D7RK7p1j9LM1Jj9N0j37R1o7n7J40n7mJ3r4N6N7j1l7rL9j09Q4m4J08Oj27J55
$$ 47 56 83 12 -7 -4 37 38 19 69 -68 23 -44 -101 39 -18 -22 -9 -103 -47 10 -1 -38 -47 -8 -117 -33 -77 31 37 -90 65
3580F5j22lJ80R3k00j4On4J12k0r0O1j1Q9n8l8k8k3Q9P3j08q%K2J07r8O2j25R6
$$ 65 -57 -60 120 213 13 -1 5 -49 63 43 -47 14 3 92 34 -4 -32 -55 34 107 -1 -9 -9 13 120 22 84 -41 55
3609E5j47M8J58J7j44J90j73k7K53k10q9P0J3L8n2j9J39j73L4m3J26m0j0o8R8
$$ 55 -92 -44 114 131 -13 177 4 -23 230 20 -69 1 14 52 0 -19 120 -53 -19 -62 64 24 14 -54 44
3634D4L7j30n0J42j9jO1l6j25Q7L2o2l6R2Nj3M9p6q6J24q6K7N4q1N5k1J00j57
$$ 44 81 -49 -99 43 24 23 84 48 -77 10 42 -20 -56 36 41 28 77 1 -85 39 -47 -20 34 -47 8 -13 87 -70
3662g0ok1R9n8J11L1p6M8%l9p2L5J0P1r6L4j17P1KP2J4J2j39J53k0p9J07o0o7
$$ -70 -76 -97 2 -56 55 86 10 58 58 19 -53 -18 -8 63 -33 1 -116 -45 -43 29 43 55 -84 69 49 -30 77 17 -50
3691e0J61p4r1L9K7k8Jl2P3n5J3L5j01J16k0M1j27qQ8Q6j86J22k4o3O2j07J66
$$ -50 111 37 -54 -15 12 -16 -15 -47 26 -29 -16 19 -82 34 14 55 -72 -80 8 94 -92 30 6 -57 5 -102 64
3718F4j65J20j0P2p1j03J08k7J42k33J37K0j56M4O1qj2k6O8L5j16J1K6l3L0n1
$$ 64 -101 19 9 81 10 -93 15 -12 130 -103 34 54 -102 -58 3 -5 -17 -43 25 60 -56 -45 -19 -52 -22 -73
3744g3P6R3n0j81J58j14OJ27nn1o9j8N7Q0L3j32QP3J2q1lJ99j64J23j21j6L5m6
$$ -73 3 96 46 -135 23 -91 -85 42 37 -14 -83 -101 -44 36 69 -63 -55 18 30 -51 -54 145 -19 104 -17 -33 2 -44
3772d4O7L3M2k14L2O5j5O8o9L8o3M8l1q7J40K8m7J1jn7J45j77J14j48N0J17n3
$$ -44 23 56 98 -116 -84 -19 -34 34 -35 3 -60 -12 -43 -130 10 38 -9 2 1 -56 89 -88 26 -122 -72 45 -8
3799hl9M6l6O1p4K5N8o0K12j60k4N6K5q0K6j13L6J47r5j0J0l7J8J11J4q5m7Q1
$$ -8 -47 -1 -37 24 -50 -25 33 -27 185 25 1 57 82 2 28 -85 -49 98 3 -7 3 -34 -16 95 109 24 -23 58
3827E8r0N5o3k0K1J7O8m5r5M6L7OR1m4j30J22K6j46J82j05N5o5q1k0J61p0j7O1
$$ 58 -32 23 -40 -60 -39 -22 46 1 -94 -48 -11 -5 86 42 -88 34 60 -86 96 -9 46 -19 -100 -120 41 -29 -46 15
3855A5r2J38k5k0k5k8q9J27O3m6m4p7J11k4m1J04j13J35j84J16Jn8J78l9j11J8
$$ 15 -77 61 36 16 -9 -37 -126 1 64 18 -26 -103 8 -16 -57 47 -66 69 -115 1 2 -56 122 83 -28 -10
3881a0lJ4n0P7j2P5n5k4l8l1M9l8rP8l2LN9q5K7j19P9L1n2R5j15J6R8m2k2R0n5
$$ -10 -13 1 -49 28 16 91 36 12 -26 -57 -8 -46 -55 23 -9 -6 53 -32 -5 -124 -45 -14 -66 29 -86 -70 28 -14 -36 54 -1
3912aJ3k3q9j11J89l41O94n49J10K5k65K30M0L31K24l30j93J77j65Q8Pj6l2m2
$$ -1 12 -11 -100 -211 -22 -363 331 -218 -108 -83 -348 -118 -78 253 477 147 -46 131 -34 54 61 45 13 -29
3936b9L9R5j08j07j4J07O9jj35J15L1npp4M3N0O5l5j02J5j5K7L6q9J7m1P8m2n8
$$ -29 10 105 -3 -110 -124 -17 52 51 -84 31 62 57 50 -24 19 69 134 99 -3 12 -3 24 60 -29 -12 -53 25 -17 -75
3965g5J14K7J5j32J21m2M6q9k2m2J85j19N5j03Q0l0M6q0P2j2m8pK2R1j51J02j19
$$ -75 39 66 81 -51 70 28 74 -15 -37 -79 106 -13 42 -61 19 -11 35 -45 27 15 -33 -40 -18 73 -78 24 -95
3992i5J07m9P3ONpj19J37K8m1l2j7K8n6P1o6Q5k4k7l3K1j2J18l2m8K9J7j07L7
$$ -95 12 -37 36 42 47 40 -79 58 86 45 13 -4 24 -32 39 -27 58 34 7 -26 -5 -17 101 69 21 50 67 -40 -3
4021co1O2q9J11M0r2J2M1l5n5J55j49p1J05M3%kr1J59k35N28L8m30n1L5J98k26
$$ -3 -64 -2 -91 20 60 -32 -20 21 -14 -69 86 -63 -134 -29 14 14 12 -79 80 -155 373 411 -19 -70 -35 163 -63
4048f3J65j66LO0J1J7Pj12J0K2qR6m7m1M9J0lJOm1rQ3j35J46p8N4j03J39j23O3
$$ -63 102 -64 -61 -1 10 27 34 -78 -68 -46 -54 42 -5 -46 3 13 10 11 17 -24 -33 50 -85 61 -17 37 -66 73 -50 13
4078A3J12n9L7j02m9J4omM7j3pJ17j61K27j05j0j00R5o6J13M7r3K9Oj21J02rQ2
$$ 13 125 66 103 1 -48 -34 -40 -44 3 -10 -17 100 -61 166 61 51 -49 46 -20 93 140 47 76 82 -39 63 54 136
4106A36j49j4p6N8q1Q9Q3O6q1l4L5j11J46k08J29l7Q2o4pJ41j75J65L0j51M4J17
$$ 136 -13 -27 -103 -45 -126 -37 46 112 31 -3 32 -79 67 -141 -12 -49 33 -31 -38 103 -72 93 123 -28 16 133
4132A33q7O0q9n8NL5J96j73j9l6k5J34k0m3j82K14o7QK13k63Q1o5OK3N6k8j07
$$ 133 46 106 17 -41 -36 -1 195 22 3 -33 -58 76 56 13 -169 45 -22 -14 199 -64 17 -48 -42 -19 37 9 -98
4159i8K18j01K5j16P4p5K3N7MJ03%l6p6R1j21l3O4L6k0k0M4ook3K1O1j34j03J89
$$ -98 120 19 44 -72 2 -73 -50 7 11 114 114 78 2 93 -28 -61 3 39 19 -1 43 37 31 8 29 90 -44 -147 42
4188D2p0k4L3R6r5R7oq1K9k7J9K7l3oP8r6K7p3O8n6k2O4j7l9Q5P2r8O8l4J8o3
$$ 42 -28 -52 -19 77 -18 79 73 -8 21 -6 13 40 7 1 79 -17 10 -63 5 -51 -73 -9 -26 -65 20 92 -6 62 28 46 -17
4219a7P9j28PP9lj16O8Q5L8j06M2n2l6Q2K8m3Ql8P0n0lN2n4L8n2l4lJ4q3J49M0
$$ -17 62 -66 -59 20 17 -99 -31 54 92 -14 28 -24 -60 22 50 7 15 -23 47 -3 -6 46 -8 30 -22 -56 -59 -45 -128 21 61
4250F1j43J23j04n9R5M7J7L4n4L7Q8k00J10n7K9Lmo3M9J3j8K3j7l6M5j18M6J6
$$ 61 -82 41 -63 -122 -27 20 37 71 17 54 142 -58 52 -5 24 27 23 -40 9 22 4 27 10 -26 19 -99 -53 -37
4278c7M5k2K1QJ1j16J25p9L0J1m6K8J64j44l7J28q8R4n7k17J82l0N8k7P5p1j01
$$ -37 8 -14 7 15 26 -90 35 -44 -14 -3 -49 -21 143 -1 -38 90 2 96 39 -178 4 -26 32 5 80 9 -92
4305i2RJ14L4r0J10q5j20K05n9r5OP7lJ0m9J06m7l3M7j54O2P3P0j20O5j9n3p8
$$ -92 -83 31 65 -25 85 0 -120 85 26 -69 -63 14 11 21 -28 78 31 -2 45 -109 -47 26 96 -24 41 22 -31 -109
4333a09P7N6j39P9J40p5j31R0J2J04l9j30L9M5o6P8j45Q7K3J1k9O5m6k93L18K0
$$ -109 -32 24 -115 -36 104 29 -102 -12 0 104 65 -65 -26 19 -47 31 -114 -27 -4 7 -22 43 -3 -296 22 42
4359D2j73J81n4j02On7R0O3P5n8O4j03J17p6K0l7K5J3j06J41Qm8o2M4N8l8l7N5
$$ 42 -131 50 -4 -106 -100 -157 -67 -4 71 13 77 -26 91 15 35 -2 23 36 -70 71 79 31 -31 13 71 33 -4 51
4387E1j06J6L3L7J1m7Nk9M9p9J09m7P0n7j3O9j39J48j00K0j7j20J76M9p1m6n7
$$ 51 -55 -39 -6 31 42 -5 0 -29 20 -59 50 3 73 16 3 72 -67 81 -19 1 -16 -136 40 89 18 -28 -85
4414h5J21l1p6J9m6J99r4O5r9J05n3J8m6L6m5k2J8J17m9j6l9R6n8L2n3p3O6M0
$$ -85 36 5 -71 -52 -98 101 7 72 -27 78 25 43 -3 33 -12 -34 -16 101 52 36 -3 93 35 67 14 -59 7 47
4442D7R9k76K17q7l9k7NLJ03j84J67n6N4K9p3m6K4M9K6l3kM2j7l7J28j19q3J41
$$ 47 146 -130 87 0 -39 -66 -61 -58 45 -139 28 -28 26 55 -18 -64 -40 9 35 2 0 42 25 -12 116 -3 -86 55
4470E5j19J15M3j61l6N2l7J83m3j9l8m6M9J14j95N9J85j09oj6l2j03K1J4M7Pk9
$$ 55 -64 51 94 -67 -103 -51 -88 95 52 33 -5 -51 -2 112 -83 -24 161 52 46 30 -2 -105 -84 -70 -23 -16 -45
4497d5pl2R2o7N2j4pK4jN2j10M8J45k20J00K6j25K14j25J1R0m6o4R9J9l2r1qj0
$$ -45 -52 -84 8 -59 -7 -21 -28 -4 -5 47 -63 -15 130 -90 10 36 -89 125 0 11 101 55 -9 90 109 77 -14 -22 -32
4526c2J2mj2J3M9p2J13o3Q3k1r0P5l4l7r0J38NR1k97l6K90k10J93O1j02j13J25
$$ -32 -20 -24 -36 -23 26 -46 67 4 87 66 -24 51 17 -20 -110 28 33 124 -173 -209 81 -129 64 125 23 -90 35
4553C5k3mj22R8j45J97l1R0O4p7j19J07r2J05m2k8Kp6J44o7M2o9L0l7N1J8p3M3
$$ 35 12 8 -114 -16 -161 36 5 95 159 82 -37 70 -22 83 41 13 15 -61 83 16 58 -11 19 -18 33 51 -22 21
4581B1m5P2k4j39J81j17N0lJ65j23j3n7K6P8r1M9J6l7k7J33l1k13J04L3p9J82
$$ 21 -24 48 24 -115 66 -51 -1 -4 161 38 25 -32 -6 72 -19 30 46 9 -18 115 84 -129 -25 8 -71 111
4607A11J7j20P8q9K9j82M7K21j58Q7m5P2m4k3K%Q6m6j12J01ol7J25r1K9o4kN5
$$ 111 128 8 86 -3 26 -156 -109 112 -46 41 -4 68 24 1 3 3 89 43 -69 32 26 -11 114 23 52 -12 -14 41
4635D1p8k1KM8L1lj4q0J43o1K7m8P9l1k7k5K4kK6J3m1l0n0J53q4J41n4L6m47p10
$$ 41 -37 -58 -56 -8 23 20 6 -74 69 8 35 -13 66 35 8 -17 7 5 31 44 3 -27 -77 76 -8 133 79 115 -332 -1042
4665a042P51K96j0j5n1J50j42J39j10L48l02O8k75Q25o17Rk0m2K17j65J4j5q3
$$ -1042 -291 5 -5 -20 -71 79 -63 76 -34 314 12 80 -195 630 13 22 2 -40 177 12 26 11 -72
4688g2P4R4j13O8K8Jj38J29n0l5L8j27J71j08j1P8o7R3r7J11j09q3J57N2j11P8
$$ -72 2 96 -17 51 79 80 -58 71 21 -14 24 -103 68 -40 -51 27 -40 53 -44 67 -42 -125 32 84 -27 51
4714E1Op9o5J49jq2K7kJ23j85O4M1q5P8Lo7n4N3Q3j26m3N9Q9m2r0J26K5j24J25
$$ 51 57 -22 -87 62 61 -21 6 4 127 -58 6 47 -38 40 43 -24 -78 -25 58 -68 -111 -52 37 -5 -95 31 56 -68 57
4743E7o0N9pj60J78q3j1J8J01j43L9O7j50M7M2K1k5J63k14P2K0Q4j98Q1j9j32
$$ 57 -3 56 49 -111 67 -16 -27 -9 92 -51 -12 55 -95 -48 -6 15 -10 153 -61 11 31 115 -83 -2 -21 -153
4769a53J41j4L7n0M1o5J22r%m7j3m7J30L1j03J4r4J54r0%J7j5r9J17N9j49J08
$$ -153 -12 -26 11 -39 2 -63 59 50 50 3 -10 -57 73 104 1 15 -79 75 -15 -15 2 -13 -112 5 64 -85 23
4796B3p6KJ5RJ6n6N9o1J55k8p1j3O0N6p6n5J7L3lRr3l8j38J69R0ojr9J78j04n
$$ 23 -53 -51 -36 -27 -11 -67 -8 -69 86 58 -13 -26 34 90 14 -41 -24 9 6 15 -78 -116 -254 -85 5 -1 -2 -101 77 -27 -32
4827c2N6rn1l4JJ02Jr6k2O2qr5J01P6n7n7J68n1j06K7O6q5J8N0MP6k4r3o2J35
$$ -32 24 15 -36 -70 -69 33 34 -62 -84 -22 -30 -125 -24 52 -5 -62 106 55 -51 -24 42 -43 -25 25 29 105 81 -12 -74 61
4857F1%q2O1j5j08O7j29J57l3Q0k04R3P5Qj5l1Q6j03m3J60j48pO3J00o9k6M2p5
$$ 61 61 -21 40 25 -83 -16 -145 12 -21 59 -145 -52 23 31 16 -15 71 -32 -75 85 -63 -70 -7 93 24 -2 40 -35
4885c5l0J19L6j50J41n1j2j59J18N2L4l0p6N1Q4j15R5m2J21o1M5o4n9J06j05K
$$ -35 -65 54 90 -60 81 30 18 -141 -23 29 63 33 -43 8 92 -23 72 30 151 90 135 71 12 118 13 15
4911A5K4j9j19QL5M9J02j21r8J64M9p9Ol1j04P7J5L6O8r0L2r2NJ53j00J27l4n
$$ 15 39 20 -99 -91 -56 -7 95 -26 -124 40 89 10 16 -15 -119 -42 -27 9 77 -13 19 -73 -68 85 -15 112 78 73
4939G3j16Q2k6j51M2J50p7n3J83n9j56R5L3J1j03RL6l3m8J65j03K7M8k1L5o6Q3
$$ 73 -43 39 13 -138 -96 54 -23 -76 107 48 -108 -13 20 31 -72 -63 -27 -60 -108 57 -46 -19 29 8 43 -23 60
4966F0j69O2M0N3np7JP2Jq6M7N6n3l8J30j7q5K5O6o3p7J21J8j86Q5l0k2M4n9J44
$$ 60 -109 -47 -7 46 41 -36 -35 37 38 -48 -1 55 2 -36 94 77 -8 17 83 20 -57 64 82 -104 -19 -49 -71 -27 -86 58
4996E8M0o3nq1O8j0n1K5k0%Q5q8M5J4m2J63k03l6M2J01O7j08pJ0JK5m1j5nO0l6
$$ 58 98 35 30 -51 17 7 -44 -19 -39 -39 46 -42 3 17 -25 138 -65 -101 -59 42 109 1 -6 4 5 30 -11 -26 -31 29 -7
5027gOm0M0J7J03k65J60opj6j42J48l3j6l1J02K7Oj25M6mQ3l8m2r5J70p2m2P3
$$ -7 -1 -41 -1 16 119 -146 14 8 1 -15 -157 -9 -42 -58 -89 13 40 46 -79 -33 -37 46 8 -34 -129 41 -31 -73 0
5056@O9j5qO2j11K6LOl5M2j11N5O4j26Q0p8K0J78j24m9l0O3kM0m9M5K6O0l4J5
$$ 0 69 54 46 108 -3 23 26 32 -3 39 -72 -17 47 -79 1 -77 -57 121 -3 -52 -82 -19 -21 19 -30 15 41 101 67 82
5086H2j41J06p5p4Q2P9J4j19o1J33j4M3QOq4P3J8n0J02j92P9r8O3jJ9l4J6K7j2
$$ 82 -59 47 -28 -102 -20 59 73 -46 -107 26 12 55 63 69 -15 58 76 26 128 -64 15 -83 -20 -21 -2 -36 -20 7 -5
5115eN0%J5n7N6j7j3nj9L6l8k6k3J06q1J06j19J23o8k0r3O0J31l1o5l2J08j31
$$ -5 45 45 60 3 59 42 29 24 5 41 3 -23 -46 60 -21 85 -34 89 21 1 -92 -32 99 68 3 -29 79 -52
5143e2L5J14l3j01K3Ml3LL0k3j1rR9j15J51p6Ml4P8r3Oj3L0KJ1OM2n3J8j4R3j17
$$ -52 -17 97 64 -37 -14 -10 -43 -40 -10 -33 -44 -53 46 -69 82 6 10 -24 54 -39 -33 -46 -16 -14 -3 3 45 -8 10 -4 89 -28
5175b8P8o2l4j8J19K1j16Q2r1M6J9N8j07oJ6k2M9l8m0J25k2N1j29J51j04Q4k77
$$ -28 50 -12 -46 -64 55 76 -40 42 -49 -3 16 74 -33 -39 -23 -45 4 -34 -74 51 29 80 -49 102 -2 82 -195
5202a95L19k28J29k58L10j98K79L7k41J73n8P6j91R3l6Km8m0J17k7M1p8L5N9p7
$$ -195 124 -104 25 -233 77 -121 158 195 -46 127 69 145 -46 47 11 13 -35 -75 42 15 56 -22 13 72 -5
5227eO6l3kj9O7k5k9j35J57J0Pr2M0N3J2k46J77j05M5kL0j2R1j32J07L5q0L6k4
$$ -5 61 28 26 7 74 49 20 -115 42 52 59 -33 7 60 72 -174 3 -102 -57 -59 -29 -41 50 -82 25 60 -20 16 -8
5256hQ7n2k3m0J60j34J23l4q6M5m2L0n3O7m4O0N3j36N6Q1k17J26P9j40O5p6N3
$$ -8 79 27 4 -36 124 -10 113 79 -7 38 -4 26 -27 40 -4 56 109 -27 29 110 -107 19 98 -42 23 -53 0
5283@n5Q2k9QK2o6L6K9Q2j49L9k6J9l4M5L1n7m7J16r5N8L3j09N3L6j35MJ8J55
$$ 0 -55 27 -2 6 28 -38 -2 27 109 -40 -1 -27 -8 -42 3 34 -23 -70 46 -49 9 42 -67 -14 22 -113 -109 -91 64
5312F4rj16J11KPo0r1L2J20lk9j08J75j13J16m0N3j43k1J10j59Q8N3m4rrL7p8
$$ 64 55 -61 50 52 59 -1 -92 -60 60 57 28 -80 95 -18 98 58 111 -32 -53 57 -102 -14 39 -5 -14 -23 14 -64
5340f4J21n6p1J34lo0n9pJ16l8j7K2K8p2P2q5q8J39p7J43j64J38p3M0J22j51l3
$$ -64 57 1 -70 64 61 1 -58 -65 51 13 -4 18 46 -26 46 -39 -127 12 -65 78 -86 52 -21 19 141 -10 -43
5367d3P8K9r4J2p8J48M4j74k4P9J11j59M4Q9k49K48j06O5N0q8L4j5Jkj2K0M1o2
$$ -43 35 64 -30 -18 -96 52 96 -78 -102 -23 88 -71 -27 62 -187 61 -45 20 70 -18 16 1 2 0 -12 8 49 -13
5395a3r1J77k7l9m3Q5p3J47j17N2O3j01R7q7Om9K5L33m23J67k12JQ8q5Q6P8p5
$$ -13 -104 73 46 7 -36 49 -24 123 6 58 121 20 117 30 36 -13 12 345 -78 89 -123 -122 -34 -119 -33 45 -30
5422c0JR5K5j27jJ00n6N3m4l3R1m7j47J59mM0m4P1q4L5p7L7J26k6j90N8J30q5
$$ -30 -29 66 91 -36 -37 63 7 60 16 -17 74 27 -120 39 35 75 31 102 18 53 -24 13 139 113 -77 -19 111 26
5450B6n6P6K1j21J57j0p9lM0r6M1j4K0n1J12l9n0m7P7m3P4j23NO0oP5j45J60j13
$$ 26 -30 46 67 -54 103 93 14 11 51 -45 -4 -18 2 -49 63 24 -26 -73 4 -39 35 -88 -83 -23 -29 46 -99 61 -52
5479e2J38m4k9o3J02q5J2J25r9K2M5r6n9J43n3L1r0j2R3K6j57J33m6O0l0J9n7
$$ -52 86 42 13 -50 52 -33 -21 104 5 27 72 -24 -83 60 7 38 -52 -64 29 55 -102 31 -15 45 15 34 -23
5506b3K0N6j1q6L6O3j87J59KJ5o6K3j9L5m5J7pP6P4j45P9j0m6k9j23J74rK5j13
$$ -23 -3 53 42 -44 -8 55 -132 27 29 44 -22 1 -18 17 -28 -11 -18 58 132 -13 66 56 10 -19 -142 32 23 48 -65
5535f5k2O9K9l8J3O3j56J44n4Kk7O1j9rOl6J36j3j54J07Mn2J35j21L1L5j20K0
$$ -65 -87 -18 11 -27 -14 49 -107 37 -17 -15 -42 19 0 -9 -3 -39 97 84 -70 37 41 -11 124 3 34 69 -51 -31
5563c1M1L7p8O7o2M0k7P2P9j48k2R6Qk19Q6j0J20Pn3l3j4l1n0J19K0j76J58N2
$$ -31 10 47 -31 36 -26 14 -13 59 138 -10 -32 64 72 -147 -61 -71 49 56 3 -30 -44 -75 -125 -6 14 -162 -4 48
5591D8p6J32k06R4N4q4P2k1Q4m0j14R8K7%k1j76J80O8j83J67j67K5M3n1J09L0
$$ 48 -28 104 -102 -8 46 -38 34 13 97 57 -57 41 68 68 47 -129 51 119 -64 103 -64 -39 4 -47 62 92
5617I2q4O0ok0p4J04j07N6l4Q1q7O9nJ3j69J16M0k3k4j16J55L1j21m8K14q6N0
$$ 92 8 68 62 42 -32 72 -35 21 -13 68 -19 50 45 58 -111 5 45 22 -2 -118 37 68 -53 -101 113 27 77
5644G7j54J40n6o2P3Q9j79Q5j7j30J87k03J39o6J42m8k6o9j1R8K4M9j10J7J21
$$ 77 -77 63 7 -55 18 107 -72 13 -4 -134 53 -150 -11 -77 65 17 -9 -78 -89 9 33 82 -28 -11 110
5669A10j72L3k2R1r0K3l6K6J0J57l1r2L7P4q1o5l5O5k3J61j71KR8j27K5l3P3J0
$$ 110 -62 -29 -51 40 -50 -27 -63 -37 -27 130 99 7 44 118 37 -28 -63 2 -21 140 -31 -29 69 -58 -33 -66 7 17
5697A7p2R0n5j15K75j67k7O7j3L2m0M2J25j86J1J47j26m5Jk1K7N2N0j16R7m4n0
$$ 17 -55 35 -20 -135 140 -27 -54 13 0 32 -8 34 159 -27 -16 131 5 -40 -39 -60 -33 19 69 -47 50 6 -44
5724d4R6j3j17R8p1M6o0Q2O2j12PQ5n3O0o8nR4n7L7j17MJ2J8J1p8J35j49J45O
$$ -44 52 39 -78 20 -51 -5 -65 17 79 -33 -26 59 6 66 -2 -7 87 30 67 -50 -46 -34 -16 -5 -83 52 -97 48 54
5753E4k31K16%r4N3m2M5k4J20r9L8q9J01L5oK1j26J3oK7Q9N6p9j24p7K15o5j3
$$ 54 -177 39 39 -55 -2 -44 1 -23 97 -2 36 -53 48 83 77 98 -28 -15 -21 6 95 151 72 -52 -129 86 21 8
5781HP4j15K2K00j94k8J36o3m3K0r6M2n1J48l5l8j4O6m4l7J00j6o1On4J9M5P7
$$ 8 82 -33 -11 189 -5 -33 103 40 -3 17 -79 -37 -88 60 25 -13 -27 39 -5 -42 58 42 -19 -13 -67 -48 -3 74
5809G4n3j2Qr8N9q2RJ01j5j01J28oj2J01j17oJ9K1M3j4mPq1M6O2m6r3L9J14p7
$$ 74 21 9 17 -81 -22 -104 -95 6 -9 -110 18 12 0 101 -16 -22 -3 18 61 47 43 50 -31 15 77 31 -62 -23 91 14
5839A4m9M4J9M6m%o9K9kj24J67O0j71J04j80P6P2J18j62l3MJ0J3L7J6q6L6K6J75
$$ 14 -35 9 28 74 70 70 1 30 28 -96 71 131 -40 64 -116 -40 32 150 -12 -45 -41 -31 -18 19 35 -51 -15 11 186
5868A86j07l3k07J93k7J2N5q6L5K4q1p5J20l9p8O7J11m2l3M6R7q7k6J0M6m8m4
$$ 186 79 46 -161 32 5 17 72 -14 21 45 -36 -111 9 -30 -108 -41 70 28 -5 41 138 51 25 35 81 33 -11
5895a1q0J21J7j03J6k2O2n8K8l9P5J3m7kj2Q0p9J3K4n5R9Ok9M5m8q1J13j15K3
$$ -11 -91 30 47 -56 -40 -62 0 -58 -30 -69 6 19 -28 -30 -42 38 -41 -28 -4 -59 40 46 17 62 14 -67 46 -69 -46
5924d6N0L8l3n6L0M7Mp8P0k6mj9O6j4o2M2J10q7P3j42K7L3M4j05j15M20n68P72
$$ -46 4 42 9 -47 -17 30 34 -44 26 0 -4 -23 43 29 -33 9 119 32 105 -37 -10 23 67 -38 -153 267 -301 471
5952D71m30M6j11N4K8j08l0J0J56j18j0J58n2j29J21j2p2J31p2q6m3J50r7J00
$$ 471 41 87 -24 30 58 -50 -80 -70 86 -32 -42 116 64 -65 56 44 -28 103 31 -55 -98 52 -45 55
5976E5o8j2P4p0PO2n9j24J79o5M7J1j04J30p2O4L2j5p2pO3Pp6kq0R0J15n4J4j14
$$ 55 -13 -25 49 -21 -14 48 -11 -135 44 -21 26 37 -67 63 -9 55 87 72 0 -7 56 63 -13 -15 -95 -5 110 56 70 -44
6006d4O7N7o7j05J12l0j1J11p6q1M3J72r9n0oN9ML0r3L7k5J16qj57Q8p5P4l4n5
$$ -44 23 80 13 -92 20 -10 -21 90 14 -67 -24 148 49 -1 -7 52 56 86 -7 30 5 121 113 -44 44 -31 43 9 -46
6035d6J26j02lnj4P9k05J70r2J27o4L1n0j5JP8n9O6k4n1J9l1M5k1M8N6l1j00J72
$$ -46 80 -22 -25 -30 -44 35 -170 0 -92 35 -29 2 -48 -63 -62 16 -43 23 -1 -52 -33 -64 -19 -40 8 64 33 -67 105
6064A05m1L5j57J43o2o8O8m3m2R1j1p7J41l1p1jL0N6n4O1j03J08l8r6L8M2p1J45
$$ 105 64 99 -58 85 23 -45 23 -20 -62 29 18 -59 82 51 -20 -21 9 65 11 72 -31 77 39 -57 -19 23 -48 97
6092I7j35Q9m7RM6O0k12J50j7Rl9n6l8J92l6p9J06j58m0J93p0R6j59P3j9r2J53
$$ 97 -38 51 4 13 59 119 -93 57 40 49 10 -46 -84 108 72 -7 99 -59 -99 94 24 120 -39 34 15 -77 76
6119G6m3o7J8J0n5R4k6n7j0J36k32J48j2K8k3o5J38o6M2j2J07j47k2K06j79O3
$$ 76 33 -34 -16 -6 -61 33 7 -50 -60 76 -156 -8 -20 8 -15 -80 58 -8 34 22 129 -18 -40 166 -13 50
6145E0m4JR0m4m5k9M8Mj10P9N5n5l7J32r1Q5j53M5l9L2O1L1n9J06j68K5J09o9
$$ 50 6 7 97 53 8 -21 27 31 -79 0 55 0 -37 95 4 89 -64 -19 -58 -26 35 66 7 113 -55 -30 79 10
6173A0N0o9M3j7M7p7J51m3k7L2p9K7R0j01j5n9J06o5k8P4m4J0%k3n9N1n2O5M2
$$ 10 60 -9 34 17 64 -13 138 95 68 100 21 48 138 37 22 -37 69 4 -24 50 6 16 16 -7 -66 -15 -67 -2 40
6202D0j1N1p1j0m0k6K03p5p2M7j5M8j23K4n3N9M4l4J69r4OM1%q5mJ26j52J15j19
$$ 40 29 80 9 -1 -41 -67 136 61 -11 36 21 69 -54 -30 -83 -24 20 -14 155 61 67 108 108 23 19 145 -7 108 -11
6231a1J34j83J11p6M0k8m0K8M8k7K6M2qq3k2Q6k9P9p9K5m9P7p1j3l2L1j5J91k47
$$ -11 123 -60 51 -25 15 -13 -53 -25 23 -4 22 64 56 -27 -49 37 8 87 8 33 -16 61 -10 -23 -55 -24 -39 152 -95
6260i5J22R6l9N5j64N8k5p0J21k0j45J69r8Q6k1o1J32k62L11k09O3p2O0M3K9n0
$$ -95 27 123 84 139 -25 33 8 -62 59 39 -106 63 -35 51 30 -31 101 -161 150 -59 4 -68 -8 35 64 14
6286A4pO2j71R2k6R0j7o6N2n6Q1K0j86O9L1M3n9P4o0N0n9P2o3k3oJ2J2n6K35k08
$$ 14 7 69 -102 -10 -36 54 37 -29 23 -33 48 68 -118 -49 -18 25 -34 40 -20 30 -29 43 -20 -43 -49 -37 -25 -81 154 -54
6316e4O6n3J98j42k2rKk8m6J07j46J05J0P5j78J63M3m0p6k5JO6%k2K0k1mk9J3
$$ -54 12 -41 157 15 -7 -16 -14 -42 -88 19 -127 -22 -12 63 -115 48 91 51 -25 -50 -49 17 17 -5 15 -6 -10 -39 -26
6345b6K6m4K0P8M2j02L5k9R4j89M0N9K9l3pK7l8K4k4J1P6r5k0J6J6oK1L5K9j49
$$ -26 0 -44 -24 54 96 -6 29 0 94 -95 -55 4 33 0 -7 20 -18 6 -18 -7 69 -26 -46 -30 -14 -20 1 36 65 -84
6375h4J63k81m2N10l72j0M11m05p1M14l44J04l0J41j12K2l2O0j12J39K4j10Q8
$$ -84 79 -202 -244 266 -106 -116 295 -110 -181 233 -111 -7 -37 104 -8 14 -18 42 -70 69 93 -17 71
6398G1q7pJ6OmJ16o0l2nO0m0p3J59j77j0K00k10N6P1j14mJ6O3k6O4K8o5m1Pj2
$$ 71 -16 -23 -7 -1 -5 111 51 19 14 74 34 -39 120 -57 -67 133 -77 -21 50 -64 -68 -52 11 -15 49 77 12 -29 -22 -34
6428c4L0nR7j29Q6K6r9P7j53l4J41n2J13J8q5M5Q2j4j02J06k21J84j35K2P0p8
$$ -34 -4 -9 88 -41 45 71 -28 49 -104 -138 3 -49 64 82 -3 42 124 110 8 114 -107 77 -58 -36 34 -44
6454d4J03p9rk9M3m3pK6M3j9P1l1r7LN9j22j4L25K33k88q5l43J24K00l57l2J27
$$ -44 59 -20 -29 -58 -15 -58 -65 -39 4 -15 56 25 -72 -69 -10 -132 -146 179 412 124 39 -304 -180 20 -337 -369 -242
6481b42K36Q1l5M0j0o5m0o0R9j9K2l9K1j2L2O5q0l2J33l9j6l7J31o4l5J14k27
$$ -242 -6 75 40 80 70 5 -35 -95 4 -15 7 -32 -11 -23 9 74 -6 -38 95 56 40 3 134 70 35 149 -78
6508g8Q3j7R2l4m9N2K8n4j0n8mJ57p8K6j06J04j2o9L3M9j25lJ52j05P4q8M7n7
$$ -78 5 -12 80 46 -3 49 77 23 13 -45 -49 108 30 56 -50 54 42 -27 6 55 -70 -73 79 -26 48 -40 7 -50
6536e0N8m2P4j4%K5l5oj27K02q8q6J5O1O7L4j36L0P7r9N1N9k3r0L1lo5N8k1kO5
$$ -50 8 -34 40 26 26 51 16 10 -117 85 -3 -89 -74 -13 54 88 -48 -18 59 -40 11 70 47 -43 -12 -15 -80 -22 -43 -45 20
6567B0M1k0K3k4P6j39jJ24j9q8L7k9N7n0rK8r4O4j0R1p2M1o5K3Q5l6n1r5Q9r7
$$ 20 61 41 64 40 116 -23 -24 100 81 -7 30 1 58 8 -1 27 -67 -3 -13 78 6 47 -18 5 90 54 3 -92 -3 -100
6597a00P1K6J8N6MJ9R2k70M3J27p8L8Lp5jK4q1R4O1l9K1j14O0O9j0n7JoQM8j17
$$ -100 -29 -3 15 71 75 94 186 -84 -41 86 8 46 49 -26 -27 -3 -84 10 71 32 53 -61 -1 68 58 1 2 -4 4 52 -65
6628f5M4R0j58J14P4Jj24P9r9k5Q6l3J24j03J28j67M7n6J16j18N0JP2Oq1m8J08
$$ -65 -21 69 -89 25 99 100 -24 55 -44 -69 17 -16 108 5 133 -34 13 -43 73 -45 5 6 78 84 3 -45 63
6655F3j2J1k22J80m8Q5m8p6Q3j40J20j7N2j20K5mp4J73M6j29R9k7j24J35O6r9
$$ 63 51 62 -160 20 -28 57 9 -67 16 -124 -4 -21 31 -89 -64 -68 -142 31 77 -52 47 20 -104 31 97 -2
6681bQ5j12Kl9J08N9j09Q8k0q2LN5J7N8m3J8r2r5J36O7k22J95j62J36p4O6l0m1
$$ -2 83 -29 -27 -66 42 101 -8 80 60 -22 -19 36 53 111 68 86 -6 -101 35 102 -120 75 -87 49 -25 41 11 -30
6709c0N7p1K6o7J01j73L2Q2P1j14J06o7L9l2N4J9k3L9j25J46Nj04j2M0O4o0k2
$$ -30 27 -44 -18 -85 16 -157 -125 -43 28 -86 20 -47 -8 -40 14 33 10 49 -76 70 75 -29 -41 -1 63 3 -19
6736a9l0M2o5O69q69J79N1L0Q4r6N8r0J35n5k2l4m2J52k1j66O3J16k18J96j13
$$ -19 -49 -7 -72 597 -272 -93 -42 -12 72 -24 34 -56 79 24 2 -32 -74 78 57 -109 -46 70 -148 48 -65
6761f5o1P2j6J09j35R1P3j39j7k6R6M0L8r5J1Nj9o0pJ35m0O6o7j5QJ5op8N4J30
$$ -65 -126 -54 -70 39 -96 -5 68 -71 -88 -114 -18 22 60 -35 -24 -19 -38 -98 -105 30 -10 56 -11 -26 -18 -3 -9 -87 -33 97
6791I7j14OR3n5O1k32J21O8q9N3q9Q8k8M2p8J21l7k9N4L3j12k1P7lk6L9lk6J0
$$ 97 -17 -11 82 27 88 -144 -23 45 -44 9 -80 8 -20 22 -56 65 28 -1 53 86 -26 -47 30 27 1 40 37 11 21
6820B1p0J20l6r1L2J6j22J04R6O9j50N2j0o5O6n7J23j38J5kN0n1N3om4N1j6n0
$$ 21 -49 71 35 -56 -24 -8 -130 -26 70 139 -11 41 31 -34 32 -25 98 -40 -25 -27 23 -28 25 19 -25 26 10 -40
6848d0j4J06j43P2P4m3q4R6%m6L9O7p3QJ1r6J10J2r6J35j3j01O0j21Q9pn9LR7
$$ -40 -54 52 -91 -19 55 12 -72 24 24 -22 17 84 11 19 30 -66 44 56 -40 95 82 -19 41 -80 9 2 -57 -54 43
6877D3k5l8P8j23J24mJ3j24J2P8p9R5n8O9o6l7R5K1o1p8Q8N6j31L3P3m8l6L7M
$$ 43 18 -20 58 -65 59 55 68 -56 -44 34 -45 50 -8 61 -5 -42 53 74 13 -65 23 79 -52 -19 54 6 -30 7 11
6906A1J2o5R8r7Q3q2K1J9qM2Jo7n9lQ4n0R7n4j0Q6o3N0n0J07j50p9J38r1Q8rR8
$$ 11 23 -42 56 -41 42 -40 -19 0 -8 34 35 -32 -91 -94 -10 -60 37 -17 -27 59 -4 46 -4 103 -47 -126 12 -79 9 0 98
6937I8n4q5J83n2k4m3N6J5rr7N1L7n8m4J8p4P4l5R6q9k4J03l7q0J55j33J07L0
$$ 98 44 -41 142 90 66 23 79 94 85 -12 39 76 18 -26 -8 -82 -8 -43 53 -36 -60 43 6 -74 81 -52 55 85
6965H5m1k8l9O3j07Q8K8p5n4J33j7j40N8P8J0L3n6j3q0J65j11J06q2j5P5Qj34
$$ 85 44 16 -23 40 -67 21 49 -26 -80 53 36 -104 -46 32 42 75 19 6 -74 91 -20 86 4 -11 64 72 -62
6992f2J79j47l4J37j15K6K7o6k5O6l4M5o7jk6M7m9J73j47K8K1J04q5mN1l4n7P1
$$ -62 117 -30 -64 73 -42 -16 11 -55 -80 -14 -48 -3 -70 -71 -97 -50 -99 74 -73 -45 -24 80 -5 -9 42 8 -49 22
7020B2M3q9L7J1P1j27j07K00o8Rj43J82k8P9j49J8J08p9K3l1N3m8M2j0K7P6j35
$$ 22 65 -24 13 24 95 -32 -139 61 -7 2 -141 41 13 92 -57 -39 69 -10 13 -18 35 -13 29 19 46 122 -13
7047a3loQ6l7n5M1k1J09p8mRn0K7q2J4J91m9k2j8J6l2P9j41j7n9J46j28J95k0
$$ -13 -16 -22 64 27 -28 13 -8 101 23 19 28 -22 5 -77 -63 128 79 57 39 55 23 102 -39 -56 -115 31 -97 98 78
7076G8r3OPN8n2J01q5l5J9j4N4j39J22j10J08q2N3J09o4L3j40P7P1p3j5O2Qj08
$$ 78 -15 -9 -2 56 4 105 20 -15 4 -10 44 -95 27 -83 25 -57 -4 105 41 74 -66 11 82 9 -6 56 64 -44
7104d4m2Q4k9l4R4q4jJ19l5j5K4k11J61P3r1J6k7P3R5k2l2q5J7J2q2K3OO9j02
$$ -44 -86 -2 -31 -65 29 -55 -56 63 28 13 37 -174 -13 60 -31 -15 -42 31 126 104 72 -13 4 16 -66 -43 -37 32 -70
7133g0N7K9l3J16j88m0J01l4N7Q9j12Q5j30J16J6k17K28M3n1j39kJ00q5J78m8
$$ -70 -13 16 -17 99 -89 -129 -28 -62 -5 84 -28 57 -73 43 59 -158 70 113 62 -77 -79 21 -64 114 66
7158F6k50K12n6m1L1N1n7k3J33o1J10k90J60K2Kpk3Lj1k5J46lrj42J9J64k18O3
$$ 66 -184 28 -28 -69 -38 13 -44 -67 66 5 115 -175 -15 7 9 2 -21 -18 -29 -54 92 89 80 -62 -43 121 -97 -34
7186c4L4o2OQ0p1P1n8l5N8P7n0j4n8MK3rJ5O0q6O3p5P6j1O8j39J55p0n8K0L7k8
$$ -34 0 -62 -56 24 -47 24 -34 -69 -11 66 16 2 -56 -52 -29 -38 -23 37 -49 14 -61 15 4 72 -67 88 18 -40 -20 17 -11
7217a1q4N8O5l2O0L2Mr5j04J49r4j5J33k02J86L5m0N1j23o6J17N0p1j7J20j06
$$ -11 -95 -37 28 -4 56 88 92 -3 -107 42 -52 -67 66 -136 50 85 45 96 -27 -93 24 74 3 -14 106 0
7243@p0N6n2R7L6N3j22L6QLo5J50j48K4R7j26mOJ0m7pk1K12j03O4k1l7PL5L5k53
$$ 0 -70 -14 -66 31 67 120 -2 34 42 45 -20 130 -18 6 103 -23 -27 -21 -11 -58 -65 -86 126 23 87 66 29 36 71 106 -147
7274a47J39J00o2o8J4k8M8nM0Nq7K9M9m2J7q5L0M0pL4k7M4p0J11m8n1Q6r2O5k1
$$ -147 -8 92 30 -38 -24 -52 -4 -9 31 36 -51 -22 27 -15 2 -83 -53 -13 -20 14 -13 31 -39 72 24 -27 59 -33 32 11
7304A1K9O1j60k8k3L10O95j259P93n06o13J077k92rj78J81m0K6n5K3k3j2n3oO
$$ 11 40 101 -59 -87 -110 200 895 -364 429 -77 -690 387 95 86 -92 89 49 75 20 43 20 8 -45 -51 -45
7329d5Q6r8N8pK8n2j5M0J6%J3q7Q5j08J38j68J22m0J09j34N4jOPk4L7L8l0m1Q1
$$ -45 41 -57 1 -6 22 -30 -45 -5 11 11 24 -63 22 -86 52 -116 6 -34 75 -59 -5 -6 0 7 -17 20 58 28 -13 68
7359F8J25l7n5r9K8j18N6J41j48N7p2RL5O4j03J56j07N1Ko9N1l8Ln3R2l0O3l6
$$ 68 193 156 101 2 30 -88 -32 109 -39 18 -54 -45 -10 54 -49 107 0 51 53 -16 35 -3 0 -53 39 9 72 36
7387C6j02N5JNk%j03J54n3J14r4J3k2l8J76j65J03r1QM8k7n9J05j44J01q1J06
$$ 36 -66 -11 -10 -5 -7 -7 -110 44 -9 105 11 24 2 -36 140 -25 78 -13 -5 43 16 -43 62 -82 19 -62 44
7414D4k4q6P2M7j22lQ3n3Np1K5J25j16J09l0L2l4P9Kl3r4P2p4R5p1qL2n4P8O7
$$ 44 20 -66 6 53 -69 -72 11 -42 -37 -108 -83 42 -74 35 5 37 3 82 84 51 -43 29 -45 50 -21 -29 3 -51 27 94
7444I4j27P7K1p3p9j7R2J15j0j58k7J06m3qRN0o8J04m3J0j40K02j11MM3p3P8p
$$ 94 -33 44 65 -8 -87 -104 -12 103 93 -65 -92 14 -29 -37 -28 22 -46 58 15 25 -115 87 -24 -20 23 -50 28 21
7472B1RJ5m2q6J0R5l3k5K2K1N2j71J34j5J13k55J23m6R2o5kM4l1R9Kp7rJ15q7
$$ 21 30 45 3 -83 -73 22 -11 -36 -14 7 59 -112 22 7 120 -135 -12 -58 34 -31 -33 11 -20 79 81 4 -5 110 23
7501B3q1P9j4p0j13J47J3j0M4m9Jn4Q9K9m3q3J52o9Lk8R3j01J37j20R0r0M9kk6
$$ 23 -58 21 7 -63 -176 -29 -16 -26 18 -31 -30 -84 5 34 -9 -92 60 -9 -6 -34 59 -42 95 -25 65 -25 24 22 -4
$$ [...]
8191D06
##END NTUPLES=NMR FID
##END=
