##TITLE=1H_DE-80H_X3
 200.13MHz, d2o
 8 sc
 
 19ns.26.2.2025
##JCAMPDX= 6.0         $$ Bruker NMR JCAMP-DX V2.0
##DATA TYPE= NMR FID
##DATA CLASS= NTUPLES
##ORIGIN= UXNMR, Bruker Analytische Messtechnik GmbH
##OWNER= pz
$$ XWIN-NMR		Version 3.5
$$ Thu Jul 23 14:48:45 2026 Russian Standard Time (UT+4h)  Yarkov@DPX200
##.OBSERVE FREQUENCY= 200.1313
##.OBSERVE NUCLEUS= ^1H
##.DELAY= (6, 6)
##.ACQUISITION MODE= SIMULTANEOUS
##.ACQUISITION SCHEME= undefined
##.AVERAGES= 8
##.DIGITISER RES= 18
##SPECTROMETER/DATA SYSTEM= spect
##.PULSE SEQUENCE= zg30
##.SOLVENT NAME= CDCl3
##.SHIFT REFERENCE= (INTERNAL, CDCl3, 0, 14.3821)
##AUDIT TRAIL= $$ (NUMBER, WHEN, WHO, WHERE, WHAT)
$$ ##TITLE= Audit trail, XWIN-NMR		Version 3.5
$$ ##JCAMPDX= 5.01
$$ ##ORIGIN= Bruker BioSpin GmbH
$$ ##OWNER= Yarkov
$$ C:/Bruker/XWIN-NMR/data/yarkov2/nmr/H-C/1/audita.txt
$$ ##AUDIT TRAIL=  $$ (NUMBER, WHEN, WHO, WHERE, WHAT)
(   1,<2026-07-23 14:48:03.31 +0400>,<Yarkov>,<DPX200>,
      <created by zg, POWCHK disabled, PULCHK disabled
       configuration hash MD5:
       00 E9 B6 7A A2 85 ED C7 34 08 36 98 17 FE 4E 26
       data hash MD5: 16K
       6B 55 00 FC 71 9F E3 F1 E7 29 1C 46 7B 09 1F 2E>)
$$ ##END=
$$ 
$$ hash MD5
$$ E4 75 81 9A A4 E2 C0 6F 38 4A DB A2 BB 11 ED AD
##$RELAX= 
##$RELAX= 
##$RELAX= 
##$RELAX= 
##$RELAX= 
##$RELAX= 
$$ Bruker specific parameters
$$ --------------------------
##$DU= <C:/Bruker/XWIN-NMR>
##$EXPNO= 1
##$NAME= <H-C>
##$PROCNO= 1
##$TYPE= <nmr>
##$USER= <yarkov2>
##$AMP= (0..31)
100 100 100 100 100 100 100 100 100 100 100 100 100 100 100 100 100 100 
100 100 100 100 100 100 100 100 100 100 100 100 100 100 
##$AQSEQ= 0
##$AQ_mod= 1
##$AUNM= <au_zg>
##$AUTOPOS= <>
##$BF1= 200.13
##$BF2= 200.13
##$BF3= 200.13
##$BF4= 200.13
##$BF5= 200.13
##$BF6= 200.13
##$BF7= 200.13
##$BF8= 200.13
##$BYTORDA= 1
##$CFDGTYP= 0
##$CFRGTYP= 5
##$CHEMSTR= <none>
##$CNST= (0..31)
1 1 145 1 1 1 1 1 1 1 1 1 1 1 1 1 1 1 1 1 1 1 1 1 1 1 1 1 1 1 1 1 
##$CPDPRG= <>
##$CPDPRG1= <>
##$CPDPRG2= <>
##$CPDPRG3= <>
##$CPDPRG4= <mlev>
##$CPDPRG5= <mlev>
##$CPDPRG6= <mlev>
##$CPDPRG7= <mlev>
##$CPDPRG8= <mlev>
##$CPDPRGB= <>
##$CPDPRGT= <>
##$D= (0..31)
0 0.7 0 0 0 0 0 0 0 0 0 0.03 0 0 0 0 0 0 0 0 0 0 0 0 0 0 0 0 0 0 0 0 
##$DATE= 1784803682
##$DBL= (0..7)
120 120 120 120 120 120 120 120 
##$DBP= (0..7)
150 150 150 150 150 150 150 150 
##$DBP07= 0
##$DBPNAM0= <>
##$DBPNAM1= <>
##$DBPNAM2= <>
##$DBPNAM3= <>
##$DBPNAM4= <>
##$DBPNAM5= <>
##$DBPNAM6= <>
##$DBPNAM7= <>
##$DBPOAL= (0..7)
0.5 0.5 0.5 0.5 0.5 0.5 0.5 0.5 
##$DBPOFFS= (0..7)
0 0 0 0 0 0 0 0 
##$DE= 6
##$DECBNUC= <off>
##$DECIM= 32
##$DECNUC= <off>
##$DECSTAT= 4
##$DIGMOD= 1
##$DIGTYP= 9
##$DL= (0..7)
0 120 120 120 120 120 120 120 
##$DP= (0..7)
150 150 150 150 150 150 150 150 
##$DP07= 0
##$DPNAME0= <>
##$DPNAME1= <>
##$DPNAME2= <>
##$DPNAME3= <>
##$DPNAME4= <>
##$DPNAME5= <>
##$DPNAME6= <>
##$DPNAME7= <>
##$DPOAL= (0..7)
0.5 0.5 0.5 0.5 0.5 0.5 0.5 0.5 
##$DPOFFS= (0..7)
0 0 0 0 0 0 0 0 
##$DQDMODE= 0
##$DR= 18
##$DS= 0
$$ [...]
##$SUBNAM2= <"">
##$SUBNAM3= <"">
##$SUBNAM4= <"">
##$SUBNAM5= <"">
##$SUBNAM6= <"">
##$SUBNAM7= <"">
##$SUBNAM8= <"">
##$SUBNAM9= <"">
##$SW= 18.0517328524113
##$SWIBOX= (0..15)
0 0 2 0 0 0 0 0 0 0 0 0 0 0 0 0 
##$SW_h= 3612.71676300578
##$TD= 16384
##$TD0= 1
##$TE= 0
##$TE2= 300
##$TE3= 300
##$TEG= 300
##$TL= (0..7)
0 120 120 120 120 120 120 120 
##$TP= (0..7)
150 150 150 150 150 150 150 150 
##$TP07= 0
##$TPNAME0= <>
##$TPNAME1= <>
##$TPNAME2= <>
##$TPNAME3= <>
##$TPNAME4= <>
##$TPNAME5= <>
##$TPNAME6= <>
##$TPNAME7= <>
##$TPOAL= (0..7)
0.5 0.5 0.5 0.5 0.5 0.5 0.5 0.5 
##$TPOFFS= (0..7)
0 0 0 0 0 0 0 0 
##$TUNHIN= 0
##$TUNHOUT= 0
##$TUNXOUT= 0
##$USERA1= <user>
##$USERA2= <user>
##$USERA3= <user>
##$USERA4= <user>
##$USERA5= <user>
##$V9= 5
##$VALIST= <valist>
##$VCLIST= <CCCCCCCCCCCCCCC>
##$VD= 0
##$VDLIST= <DDDDDDDDDDDDDDD>
##$VPLIST= <PPPPPPPPPPPPPPP>
##$VTLIST= <TTTTTTTTTTTTTTT>
##$WBST= 1024
##$WBSW= 4
##$XGAIN= (0..3)
0 0 0 0 
##$XL= 0
##$YL= 0
##$YMAX_a= 72073
##$YMIN_a= -99563
##$ZGOPTNS= <>
##$ZL1= 120
##$ZL2= 120
##$ZL3= 120
##$ZL4= 120
##$ABSF1= 10
##$ABSF2= 0
##$ABSG= 5
##$ABSL= 3
##$ALPHA= 0
##$AQORDER= 0
##$ASSFAC= 0
##$ASSFACI= 0
##$ASSFACX= 0
##$ASSWID= 0
##$AUNMP= <proc_1d>
##$AZFE= 0.1
##$AZFW= 0.1
##$BCFW= 1
##$BC_mod= 2
##$BYTORDP= 1
##$COROFFS= 0
##$CY= 83.5205535888672
##$DATMOD= 1
##$DC= 2
##$DFILT= <>
##$DTYPP= 0
##$F1P= 10.8118882576601
##$F2P= -7.23987719738617
##$FCOR= 0.5
##$FTSIZE= 0
##$FT_mod= 4
##$GAMMA= 1
##$GB= 0.15
##$INTBC= 1
##$INTSCL= 1
##$ISEN= 128
##$LB= 0.25
##$LEV0= 0
##$LPBIN= 0
##$MAXI= 10000
##$MC2= 0
##$MEAN= 0
##$ME_mod= 0
##$MI= 1.114404
##$NCOEF= 0
##$NC_proc= 0
##$NLEV= 6
##$NOISF1= 3.799351
##$NOISF2= 2.8
##$NSP= 1
##$NTH_PI= 0
##$NZP= 0
##$OFFSET= 14.38212
##$PC= 1
##$PHC0= -7254.183
##$PHC1= 2.82197
##$PH_mod= 1
##$PKNL= yes
##$PPARMOD= 0
##$PSCAL= 0
##$PSIGN= 0
##$REVERSE= no
##$SF= 200.129724274929
##$SI= 16384
##$SIGF1= 3
##$SIGF2= 2
##$SINO= 400
##$SIOLD= 16384
##$SREGLST= <1H.CDCl3>
##$SSB= 0
##$STSI= 0
##$STSR= 0
##$SW_p= 3205.1282051282
##$SYMM= 0
##$S_DEV= 0
##$TDeff= 0
##$TDoff= 0
##$TI= <>
##$TILT= no
##$TM1= 0
##$TM2= 0
##$TOPLEV= 0
##$USERP1= <user>
##$USERP2= <user>
##$USERP3= <user>
##$USERP4= <user>
##$USERP5= <user>
##$WDW= 1
##$XDIM= 8192
##$YMAX_p= 0
##$YMIN_p= 0
$$ End of Bruker specific parameters
$$ ---------------------------------
##NTUPLES= NMR FID
##VAR_NAME=  TIME,          FID/REAL,        FID/IMAG
##SYMBOL=    X,             R,               I
##VAR_TYPE=  INDEPENDENT,   DEPENDENT,       DEPENDENT
##VAR_FORM=  AFFN,          ASDF,            ASDF
##VAR_DIM=   8192,          8192,            8192
##UNITS=     SECONDS,       ARBITRARY UNITS, ARBITRARY UNITS
##FACTOR=    0.0002768,     1,               1
##FIRST=     0,             0,               0
##LAST=      2.2672688,     0,               0
##MIN=       0,             -99563,          0
##MAX=       2.2672688,     72073,           0
$$ Real data points
##PAGE= N=1
##DATA TABLE= (X++(R..R)), XYDATA
$$ [...]
1411C18K38j321J394l87j135J722j173l77J343j378O25Q77k042J555L11j286J283
1428E67m33p25J515j396r9J659j833N23J029j889J414K28j314J541o01q23J476
1445H39j206j82J280j585P08P47j720J303K43j366J563m40o62J485j178k32J208
1462H05j472P11P61j759J363l0j356J467m53o93J352j157J13J038j457Q23N51
1479F07j475J552q3j434J643p82n56J410j269R8R35j491Q39L73j457J567j45j324
1497i92J704o24o83J230r77J76R52j408R57K63j522J490l46j084J711q03n89J338
1515G93j243K22P89j344J053K14j390J512m94j072J807p81p23J501j038QP11j327
1533h02J070K29j306J539n49j015J521q99m10J221r53J22P64j262R60j1r87J451
$$ y = [318, 556, -765, 629, 242, -893, 829, -344, -721, 622, -756, -131, 746, -1296, 259, 570, -716, 567, 134, -591, 924, -472, -571, 1088, -745, -222, 807, -1082, 332, 560, -754, 787, 186, -637, 839, -367, -549, 731, -854, -146, 601, -1119, 184, 427, -939, 624, 184, -478, 1007, -171, -403, 805, -667, 44, 805, -954, 409, 379, -977, 490, 37, -656, 696, -461, -348, 690, -767, 56, 607, -868, 684, 601, -833, 810, 28, -528, 882, -387, -289, 646, -845, -6, 367, -1090, 477, 332, -992, 712, 88, -595, 635, -342, -166, 786, -622, 335, 598, -924, 566, 220, -864, 847, 44, -545, 793, -450, -228, 561, -783, 270, 484, -906, 606, 112, -960, 847, 66, -657, 844, -194, -186, 525, -802, 268, 497, -809, 730, 181, -834, 687, -212, -622, 599, -354, -232, 532, -730, 230, 219, -768, 683]
1551F83l93r20J567q67n55J226j148K13Q08j187Q57l5j187J330m96o23J426r76
1569b77k85J255j059J96P59r39R21m7j101J343p07o23J279r87l09J137j204K91
1587c57N75j006J041q5p89J285l39p34J353r13j78J033j209M62L54j101Q56j32
1605A16r76J340m87n94Q06r02M15R64j513J201P53j820J756p93l08M12P5r01R98
1624E42j077mR08j002J74J203j523J222o3j117J473p21m07J120q52N7J132j380
1642c15K04P43j292R86j61j008J347m48o08R75r99L99N74q45Q10K43j100J013
1660E18k91p33J224o77n46J208j016j42P31r18O26K04r36J180l04p05J184o90
1678h3k43J094r79O7P69r99N47R9q34R89l61o30J074p07k54R71r69L05O91r71
$$ y = [683, 290, -630, 937, 70, -485, 741, -407, -194, 614, -573, 284, 249, -938, 392, -104, -727, 699, -277, -562, 693, -366, -170, 589, -350, 571, 524, -577, 766, 59, -564, 715, -272, -581, 556, -648, -357, 218, -788, 253, 168, -621, 664, 325, -409, 944, 31, -147, 886, -323, 139, 493, -608, 248, 116, -860, 480, -7, -601, 205, -697, -282, 682, -831, 370, 1123, -697, 1059, 266, -42, 370, 445, -456, 542, -535, -539, 369, -633, -459, 744, -779, 443, 380, -737, 736, 15, -392, 728, -124, -67, 1065, -315, -111, 632, -660, 326, 165, -843, 504, 56, -552, 423, -576, -177, 397, -448, 362, 605, -495, 518, 227, -506, 718, 41, -505, 703, -313, -455, 276, -642, -16, 188, -748, 432, 128, -577, 607, -83, -326, 768, -211, -144, 625, -374, 173, 272, -562, 427, 66, -564, 510, -197, -451, 520, -449, -144, 547, -424]
1698d24N90J66q59J026n34m74J117q00j91R63r66J85O70j010P64j12o76R85l59
1717F1n20J056r06j19J111j206K67P72j040O59J56q67J154m48n27R61p27r8R06
1736F45j213N54M78j038P13P4q43R69l84m50R50q72P9Q44r34M41N11q68O49N1
1756C56p51R24n47l57R05r27K29N92r30L94M24q75Q32j20m77Q97n22l66R32p24
1776a11OO76q99M13K14r43P72r9o56Q12l37k39P08p57K95N82q25N36K25p31P69
1797D11m0o55P37m33k77O79p34M5N36q33O17J31q04R19j01n89R02n35j70Q91r58
1818b61K36N77j008N25K51q02Q07k99n49R11m03l07P52p38O0O23q48N82J60o38
1838c69Q13k87n29Q22m80k38P67q52J89O22r23M30J57n25P92k05p03R49o19J04
$$ y = [-424, 166, 332, -527, 499, -35, -509, 608, -192, -383, 580, -386, -201, 469, -541, 223, 111, -565, 420, 61, -459, 597, -309, -428, 683, -523, -256, 516, -524, 135, 291, -576, 578, 130, -397, 564, -163, -261, 645, -568, -14, 464, -574, 139, 213, -630, 339, -45, -495, 455, -417, -338, 506, -428, 13, 524, -344, 305, 356, -395, 529, -18, -375, 530, -397, -168, 424, -506, -112, 312, -563, 269, 149, -328, 569, 47, -319, 613, -111, -105, 571, -328, 85, 299, -644, 128, 29, -627, 185, -152, -391, 317, -440, -145, 437, -388, 148, 373, -358, 411, 371, -284, 453, 20, -257, 422, -312, -267, 269, -564, 53, 184, -620, 299, 198, -391, 511, -24, -194, 697, -261, -25, 552, -456, 69, 320, -482, 325, 26, -523, 388, -15, -322, 430, -308, -248, 375, -473, 109, 269, -369, 444, 157, -372, 450, -30, -268, 499, -353, -164, 458, -465, -35, 122, -403, 389, 184, -519, 430, -189, -85]
1858h5N79p81J56N11q14O92q2n68O37j33m60Q48o07j32O44o99K22L33p76O43K3
1879A51o73P80j81l54P74o88K7N96o54J22N63p04N03Lo76O46k02l56P07o30K9
1900b17N17o27K91K97o20O91o5o99R07m61j95O84o52l4O41q45L60K50p02O24j26
1921A9m99P07l89j75P05m81N7N14o49L82L16p19N67j32m93O99n51j45N81o33M6
1942b73O72q02M26K33n05M22nm79Q13n10k57P06o62J15M50o57K71L28p50O28k6
1963A38n82P14m24l1O36o50J61M08n83L93J25n36M88j54l84O80n24k24O44n80
1983b85J66M50o46M54R7o44O55j72k81P18p93J31P30n16KL36p80O06j76l94P70
2004D28m69m97Q47n93J90M19n92K00K91n20M56j5m12N10k11l12O13l50n6N64p60
$$ y = [-85, 494, -287, -131, 380, -434, 258, 176, -392, 245, 112, -348, 500, -107, -239, 405, -294, -72, 261, -515, 128, 151, -522, 258, 77, -277, 497, -191, -164, 432, -222, -100, 463, -241, 262, 265, -411, 235, 33, -323, 384, -246, -217, 300, -327, -36, 261, -359, 332, 267, -432, 475, 14, -181, 503, -149, -183, 458, -387, -27, 223, -479, 145, 19, -480, 227, -162, -337, 368, -113, -56, 458, -191, 191, 507, -212, 355, 223, -270, 429, -122, -267, 314, -319, -273, 399, -403, 23, 256, -249, 173, 168, -311, 502, -8, -265, 441, -221, -106, 344, -313, -42, 286, -464, 164, 138, -444, 270, -154, -185, 451, -199, -38, 370, -213, 180, 305, -231, 257, 103, -281, 399, -125, -349, 295, -285, -119, 331, -315, 139, 236, -408, 247, 75, -206, 512, -281, -150, 580, 64, 66, 402, -378, 228, 52, -342, 428, -41, -538, 309, -284, -94, 325, -267, -67, 224, -296, 160, 145, -267, 243, 32, -280, 333, -17, -73, 491, -269]
2025b69L24K42n71M55Kn42O21k75k61M51l17l8M36n68K92L45o61M12J22n29J122
2046G93n44n99P76o53J80L38o53L01K34n05N86k05m82N98j53k32N81m78J31N44
2066E58q87L64K57m80K41J13m81N96m38r9M98m66N9M70o13L38K06o00N87k1l17
2087a15M64l60j30M86n36J21L72o68L37K29o32M79L4n22P08l36r8N13n59J67L86
2108C40m85M05j2m17M12j26k71L91m01j12N56m47O6L05n62L67J56m81N01q3l92
2129b90N77k99j66M88n82K68L27o10L83k6m07L92K3l59N49l73J3L20l56O6K88
2150B26l36K39J04o01O22j94l16N65n08nM47n36K19J69k71K51k6k89N20k80k61
2171b61M62k87p4M72n87K52K81m89K19J14m09M98k14k41N48l27j93O18n50J08
$$ y = [-269, 55, 297, -274, 181, 183, -359, 262, -13, -274, 177, -140, -178, 258, -310, -18, 327, -334, 78, 200, -329, 793, 249, -350, 426, -227, -47, 291, -362, -61, 173, -332, 254, 49, -433, 165, 12, -220, 361, -117, 14, 558, -329, 35, 292, -188, 53, 166, -315, 281, -157, -256, 242, -224, -165, 305, -308, 30, 236, -364, 223, 202, -115, 349, -11, -141, 345, -191, -70, 302, -366, -29, 200, -432, 47, 81, -441, 267, -69, -167, 346, -213, -46, 340, -145, 260, 248, -169, 243, 117, -154, 237, -164, -276, 280, -167, -101, 204, -358, 9, 165, -316, 185, 102, -290, 287, -12, -178, 310, -272, -4, 323, -287, 96, 70, -337, 55, 78, -281, 268, -105, -92, 228, -128, -62, 226, -110, 129, 233, -368, 254, 60, -256, 309, -199, -204, 243, -293, -74, 95, -176, 75, 49, -240, 280, 0, -261, 201, -86, -160, 312, -275, -23, 258, -231, -12, 102, -307, 191, -23, -264, 284, -43, -236, 382, -168, -60]
2191f0K95m08K88L7m11M16j19k63N85m49n2L83m49K11K81m57L43q7m86N74o9l05
2213b02M74m10n6M43n30K79J65l91M05l3m10N13k23j25K70l13N4L10l77J15J87
2234A45m39L73n6l39M03o8k04M07k02j35M44m64J75J09k98K49k7l75N08l16n8
2255a68L35m85K29K92m48K47K35m80M62j87k22M54k88KL37l67O7K88n09K06R1
2276I1l38K79l7k79L66Kk23M15l80J6L28n00K71K29m44L29k0l95M43k40R2J43
2298A48m37K40J79k79J57J21l29L22o6j72L11j92k08M07k79J9K56m52K37J44m32
2319c05M31j61k99N94l60j9K59k99P4K79m01P1J21j81L09m8l83M81j62j34L73
2340B40l46L7L42l86J42R2k81L55j34k17L90l37p6M65l89J13J03k55K37P6k86
$$ y = [-60, 235, -173, 115, 152, -259, 157, 38, -225, 360, -89, -141, 242, -207, 4, 285, -172, 171, 84, -402, 172, 103, -202, 272, -138, -194, 249, -281, -2, 163, -228, 177, 144, -266, 247, 24, -101, 169, -144, -90, 220, -157, -42, 145, -294, 79, 23, -316, 87, 19, -185, 222, 20, -115, 329, -135, 40, 149, -149, 100, 73, -302, 206, -110, -168, 167, -318, -89, 203, -245, 2, 237, -243, 219, 32, -190, 264, -24, -22, 315, -52, 15, 303, -206, 0, 91, -247, 32, -5, -284, 82, 84, -139, 276, -104, -88, 240, -260, 11, 240, -204, 125, 105, -290, 153, -87, 5, 148, -289, -49, 130, -149, 8, 129, -200, 122, 56, -116, 195, 3, -205, 202, -77, -58, 198, -254, -17, 127, -305, 126, -35, -334, 260, -100, -119, 140, -159, -85, 194, -207, -136, -15, -196, 113, 65, -318, 163, 1, -133, 240, -106, -69, 273, -113, 29, 121, -160, 195, 61, -156, 234, -103, -179, 286, -103, 10, 113, -142, 95, 171, -115]
2361a15J33K2q6J83k70m0L66k99o4K51k41J60R4k85K46o0j26K84j19r3K77k95
2383g7PJ85l56K50J48l15K58p7k65L20j97q0M53k82M8K81m28K00J05l36L11j72
2405a9k18L89k19j20K91l34K45J90l32J75M6l14M27j68k89L98l21J53K31k54l9
2426h2J78l29L86o5k62J98nk31M27k15q0J97j20j14q6R0J90M5k71M10k67j17K36
2449A13j96QJ68k71K07J12k94J43M1k16K49k1j13K53k41p4L12l52Q9K36l28K03
2471B8k5p5K28j73k0K19k61J05J04k41J06J49l80L26p9l8J66r4q3J38j87K8J87
2494A28k77J15J79k93J81L2j85K50k12l6K64j77q2K21j68N3J46l04L22j05k19
2515a67L24k83k99N82n72N20L96n97J96P4l35J96j3k04L39k41O4J80k96P3K15
$$ y = [-115, 18, 40, -46, 137, -133, -173, 193, -106, -170, 81, -160, 0, 94, -191, 55, -5, -131, 153, 34, -59, 218, -77, -70, 115, -241, 9, 157, -158, 100, 23, -242, 78, -119, -199, 254, -28, 20, 301, -127, 73, 178, -158, 153, -19, -237, 152, -67, -187, 104, -230, 15, 205, -127, 48, 94, -220, 207, 39, -250, 148, -173, -20, 211, -43, -82, 96, -233, 153, 88, -174, 24, 19, -212, 215, 0, -80, 117, -3, -117, -203, -113, 77, 122, -149, 261, -6, -123, 113, -83, -75, 93, -178, 29, 141, -153, -10, 31, -185, 64, 43, -70, 183, -58, -132, 180, -172, -83, 153, -175, 28, 3, -72, 156, -17, -37, 182, -79, 26, 130, -111, -5, 144, -236, 90, 11, -27, 139, 45, -38, 100, -87, -59, 128, -149, -34, 145, -148, 33, 65, -120, 130, -82, -118, 146, -31, -113, 108, -60, -7, 139, -165, 157, 52, -167, 157, -126, -425, 157, -415, 105, 501, -96, 100, 174, -161, 35, 22, -182, 157, -84, -20, 160, -136, -63, 152]
2536A52j44P2P6l13K33q8r2K79j66j98L02l46R6L07k82J28J2k17L87r3l35K91
2558F1n9j43K54j50M4J16k70P3J55j12M4n8o0L16k14j64L36j69M8J14k63N2J72
2581A23k39J50O2j79O6j04M2J97k80J07J58k50K19l5p9P29j82r35N26j28p0K63
2603A61k36kJ49k00J45K19l39J29o6K1P4o3j30K49j18L9J12l16J62J11k44J16
2625b7O0j03J29j67J02J66j89j92K71k07J00M8j51K53M7k83K59j10r8L23l31P3
2647b7J93l41L11N2k41J19n0j00J49j37m3J83j27K03j0k09K10j31j00J58j38p5
2669a51L70l36Q6J55k37J07M9k52K70L5l56L95q7o3l2l3o9J75m9p9L08k69K26
2692A63j13j25K65j90m7P9j40o1L11k71K41o7j41K23%l10L16j96o7K15p9j41L05
$$ y = [152, 8, 80, 156, -157, 76, -12, -104, 175, 9, -189, 113, -233, -137, 170, -112, 16, 28, -189, 198, 105, -230, 61, 2, -141, 113, -37, 7, 123, -147, -74, 81, -31, 13, -45, -105, 211, -3, -167, 169, 0, 48, 162, -101, -49, 123, -116, 34, 96, -83, -17, -121, -79, 118, -162, -55, 103, -147, 72, 37, -42, 687, 505, -430, 96, -32, -102, 161, -75, -77, 72, -128, 17, 236, -103, 26, -40, -19, 55, -8, -138, 111, -7, 32, 144, -172, -10, 101, -143, -27, 33, -70, 59, -108, -6, 160, -29, -221, 50, -157, -57, -9, -160, 93, 140, -143, 116, 6, -92, 231, -100, -27, 166, -175, 136, 188, -53, 66, 16, -84, 65, -72, -115, 68, -59, 144, 134, -75, 135, 4, -96, 62, -76, -151, 219, -117, -31, 124, -113, -6, 43, -209, 61, 96, -260, 135, 48, -15, -47, -80, -149, 26, -23, -102, 206, -63, 163, 50, -75, 190, 0, -47, 32, -108, -169, 142, -129, 112, 45, -96, 127, 127, -183, 133, -63, -130, 85, 6, -135, 170]
2715A70k27J29l8j89K08o5k04K24j07K7K30k94P5J31j84Q3J07j98J48N8k64L07
2737A27o3p7J77j88j8O1k39J52J63k30K45r6j53J56mq6K30j30j29J97j48N1O9
2760F7j36J99o1k82L15j13j53L14j38j1J53l61K32m0j10J75oj76K83j85K3J91
2782A80k26OK48k83J6J60k19J71l3o7J42j49k1Q5j62J48J10k42J25O6k00L12k38
2805g1n5J44l7q7J54j36K2J91k57J14J17j21J61j25p0J51j13k5J57j24M8J05k57
2828a14J38Pm5J09j70K0J76k12JK19k17M2J69l12L26k5k31J60p8k2L04k99Q4k2
2852Hj19J42o3j24J21O1j49K62j26j34K85j72j8K59l19J20J63l34J52Q1j30J36
2874A02p2j14K32l05O4J57j93P9J21p4J02j83p6L00j08j46K98j22l9J09k14J50
$$ y = [170, -57, 72, 34, -155, 53, -12, -216, 8, -99, -72, 158, -136, -61, 70, -114, -31, 76, -122, 26, 84, -180, 127, 64, -13, 164, -24, -42, 19, -220, -68, 95, -135, 110, 14, -139, 17, 13, -73, 157, 27, -102, 95, -53, -2, 67, -69, 130, 69, -213, 102, -11, -164, 150, 12, 1, 154, -207, 25, -15, -125, 50, 44, -132, 151, -34, -11, 180, -46, -40, 208, -75, -59, 101, -118, 53, 20, -47, 95, -54, -75, 10, -152, -4, 106, -136, -11, 55, -145, 167, -71, -126, 18, -19, -106, 48, -88, -66, 125, -132, -18, 99, -22, 139, 14, -56, 95, -18, -43, 114, -10, 38, 143, -114, 24, 31, -14, 95, -75, -55, 121, -91, -90, 129, -88, -46, 123, -189, 137, 112, -119, 41, -37, -59, 245, -54, 30, 8, -111, 31, -32, -156, -35, 26, -123, 139, 13, -121, 164, -8, -26, 233, -86, 34, 197, -137, 15, 96, -34, 102, 30, -84, 148, -157, -93, 64, -129, -50, 71, -3, 99, -84, -160, 140, 32, -114, 184, 62, 23, 132, -82, 68]
2896F8j01m7J35m0j94K46j59k3K58l13J16L22l86J09R7k52J75J4j03L16k02j49
2918a13K73m35J68J72r9J40Kj81J10K3k55K81k6j09K92k58k7J67j48J06l7k04
2940a58L48j66j95L08k20q4K54k3j30K38k49J06k7j37K34p8j54K42k01l4K07j68
2962h7pK15j91jJ15j92J37N8j80L63k38l2Q5j24K6K04k13J68j4k33K88j02p0J45
2986A20j44n0K59k52M3M7j75K57Mk55J39L8j11R5l5o7K12k02O8O8k41K46M5l15
3010b06L27j43o0J22o6M1J01j81P5L20m20J9L4l0K43n7k30K48j13l2O0q3J9J51
3034A39k46J34J09k98K09p7p0J85m7j42J57q3J46o7k33K87o2n4L7R6q7k4o4J9
3058c6R5k34J88J68k84J67q5o2J67K0j94J40l6%K60l12k2O8o7J46n7j30J52j24
$$ y = [68, -33, -80, 55, 15, -179, 67, -92, -115, 143, -170, -54, 268, -118, -9, 88, -164, 11, 25, -78, 238, 36, -113, 160, -275, -107, 65, -34, 106, 108, -73, 37, 60, -195, 86, 60, -49, 243, -15, -42, 125, -23, 83, 46, -158, 190, 24, -171, 137, -83, -167, 87, 64, -66, 172, -77, 29, 2, -135, 99, 21, -133, 109, -92, -126, 81, -87, -94, 121, -70, -71, 44, -148, -11, 47, -133, 230, -8, -40, 45, -79, -53, 151, -62, 106, 92, -141, 147, 45, -25, 120, -24, -74, 185, -67, -24, 23, -152, 105, 109, -146, -7, 31, -80, 15, -20, -87, 125, -77, -9, 59, -182, 64, 109, -206, 121, -22, -82, 40, -26, 15, 116, -65, 10, 330, -90, -71, -37, -67, 176, 119, -111, 137, 24, -8, 52, -31, -12, 139, -107, 27, 136, -162, 47, -30, -100, 85, 38, -104, 53, -30, 116, 49, -184, 103, 41, -13, 24, 120, 33, 9, -55, -36, 59, -175, 13, 181, -103, 64, -21, -83, 84, 104, -90, 50, 14, 14, 274, -38, -60, 8, -59, 87, 30, -100, 52, -72]
3082g2P9J96k79MJ98j96Q3K8j38J58L1k54K69j37qR1j95M2K79l14O4K50l13L02
3106A68p6j66J45K4nn0m4R6L9k53J28J51k36J93J5l03J91q2L9R1j51J13J0j02
3130f5J34J06k75K23j59j55K97j06j04J82k70Q0K97l27J44J59l60K81J0j67K31
3151A56j88K8J39k46J22lm7Q0L6j55K31j19j25K64j70p3J34j61R8J36k97K26k0
3174D6j79K31Mj76K45j87q1J03r2J14J15j73O5J05k48J63p8m8K35l60R0J21j4
3197AO0p4q1J56lj82J96r4p7K99l11k1J37j01J47o0j07Q0J11k89K79j2k87L20
3221H7j67K8J71k10J81M8k22O4J31k58K35j99R8J41k03K6J64j89N0J61l55L16
3243I8j32o1K57k45P9J66k59O7J52k63J92P0l07K98m5k02J99k44O6J85o5j7J36
$$ y = [-72, 7, 203, -76, -72, 126, -70, 13, 41, -97, 61, 92, -162, 107, -30, -38, 53, -142, -100, 179, -135, -71, 179, -134, 168, 92, -74, 71, 95, 90, 40, -4, 92, 131, -122, 6, 157, -79, 114, 129, -174, 17, -65, -26, 65, -86, 27, 37, -65, 69, 175, -100, 123, -36, -191, 106, 0, -104, 78, -192, -112, 185, -142, 2, 161, -199, 82, 92, -75, 156, -32, -4, 135, -111, 11, 8, -39, 41, 77, -78, 153, 34, -91, 173, 3, -70, 64, -97, 1, 137, -160, 66, 46, -133, 98, 102, -74, 171, -16, -97, 6, -86, 28, 143, -30, 35, 140, -108, 55, -23, -71, 164, -196, -106, 15, 1, 61, -13, -94, 62, 59, -123, 73, -21, -98, 201, -110, -131, 6, -95, 52, -8, -115, -35, 76, -213, 66, 54, -233, 87, -80, -52, 119, -91, 90, 138, -84, -20, 111, -147, 88, -111, -13, 128, -75, -49, 115, -74, -24, 137, -218, 98, -34, -95, 162, -83, -4, 162, -97, -30, 122, -141, 51, 121, -186, 112, 67, -135, 64, -180, -114, 71, 6, -11, 125]
3266A25j86Q7P5j94K24M3k96K65j39j27K43k25K8R3k14J73J71j54k8P5o6J31j86
3289h2o1K49r2mQn6N2j9j22Q3J6j09J79k2j20J46j23N5J41k67K01M1k44K17K3
3314I0k51J78j01J5P4j18N3J24j18R9k1k33L04j01o8J33p9m4R5j31P1J42k14R0
3338a1J72l10K30K0q0K3j17O4J00q9J01j50l4J74K9k39J81j43J28P0k04nK00j66
3362e6l8L19l80K62Nk19K51j76r7K49j65j15K78k23J88N6k84J71L7k58L47j92
3384d0j26K69l3M3n8j33J8R9l03K39J21k77L32j49m2K32k14M5K02l37J07J01k17
3407a21K78q8j50J09Lq1J82n93L90K74n51L64J05l04L18j30J7J63k37J33Q5j96
3429c0p9J94j62J27j5k29L26j16j90K55j34qJ78k36J51P0j68J59j45k23N51k71
$$ y = [125, -61, 26, 101, -93, 131, 174, -122, 143, 4, -123, 120, -105, -77, 16, -198, -25, 146, -8, -36, 39, -27, 104, -82, -143, 106, 14, 10, 18, -38, 14, -5, -127, -44, -28, -137, 42, 20, -100, 46, -77, -22, 119, -148, 53, 94, -150, 67, 90, -161, 17, -84, -69, 5, -113, -60, 64, -54, 45, 24, -209, 95, -6, -74, 59, -20, -64, 31, -100, -29, 113, -101, -11, 161, -149, 81, 101, 21, 44, -73, -9, 91, 2, 103, -47, -81, 93, 122, -117, 64, -79, 49, 119, -85, -90, 110, -56, -94, 225, -155, 107, 112, -107, 144, -32, -129, 120, -45, -160, 118, -105, 83, 139, -145, 26, 63, -195, 152, -40, -166, 103, 70, 113, 55, -78, -60, 39, -264, -25, 96, -181, 151, 2, -40, 192, -22, 23, 225, -112, -5, 96, -121, 157, 69, -81, 28, 31, -50, 132, -461, -71, 203, -348, 16, 121, -183, 135, 5, 22, 185, -52, 81, 166, -30, -109, 85, -77, 50, 35, -194, 132, 16, -174, 81, -53, -61, 117, -119, 32, 102, -66, 93, -52, -275, 276, 5]
3451Ek56L50j29k8K19l33K53l0k32Q3J27l77M17n5m8J72k25J26J75l65L13j48
3473A4qn06L87%q4O4k79L46j58j86j0L20J92M93m03J78L69j095k6j32N99N03l39
3496B39rm85PM25l17P3l94N76n5k6k04N71l01m33J00J42O7o4L38o65O09m2k82
3519a30M10l31m4J59j71K41qk00LJ12k24K71r1m7K06j19K7K20n26O4L48j87R3
3542G6j94J43l62M02k46O83n45j19r5J28J83N9L18l43K20k84k4m42KM22l19N18
3564A81j036O86L82q21K82N23Ln33k82L11M34K2k60L40k2J11p85Q63q99J65O05
3585B70p1K17m86n58P84P0l12J3r6r6J36q5L56j25Mj21R1J9J75j41r7J02k20J69
3609bQ8j68M3P6k13L10r9j22K18q2jJ14k75P6J33j64K5J06r7J27j53j2K18r0p7
$$ y = [5, -251, 99, -30, -58, 161, -172, 81, 51, -181, -98, 29, -348, 69, 14, -34, 138, -87, 39, 214, -151, 162, 14, 6, -500, -113, -113, -197, -133, -412, -66, -224, -410, -420, -100, 92, 585, 182, 360, 729, -366, -392, -524, 75, 578, 239, 230, -255, -248, 177, -140, -67, -461, 115, 60, 34, -170, 401, 100, -333, -233, -91, -24, -88, 250, -415, 194, 152, -130, 280, -51, -95, 64, -107, 134, 126, -74, -71, 41, -183, 88, -3, -50, 156, 37, 64, 284, -242, -178, 170, -17, 76, -118, 25, -337, 65, -181, 502, -43, -162, -257, -129, 54, 113, 431, 88, 308, 24, 0, -442, -440, -18, -337, 181, -855, -169, 213, -608, -326, 197, 200, -333, -615, -304, 130, 152, -108, 232, 210, 321, -464, 399, -500, -335, 270, 199, 416, -70, -628, 156, 226, -86, -73, -169, -265, -129, -214, 142, 17, 21, -100, -9, 10, 185, 44, -53, 49, -171, -2, 86, -82, -39, 37, -176, 134, 35, -87, 131, 49, 48, 162, -113, -37, 96, -68, -43, 63, -34, 93, -60, -72, 146, 56, -21]
3634b1J76l08K14L9j56J16j01o7J67j83J11J82k76O1J51k43J77K5j56J45o1M6
3656C8K8J3m6J24l27P6K21k58R0K02l26J96p0O9Q1j79L3K46k16j5J07k52K39j46
3680g2NJ05n5q3K69l11J85lk4J02J90k93J21j69j63L83j03l62K14J80k13J03O5
3703G1ko5K60m04K34m19K91k48m85K13J309k65n54k56M18l00N90m95M2K8J54j63
3725d6l6J49j93Q0L6q1K5K51j84J37M5k19P0O4n4J34k43K2J89k31J95k4k31J61
3749A6j6j85K28l5k9J59k34M1K03k20K6J75j67M0J08k45K11j2k15K50j78N2N4
3772B7j35O3J20l9j8J49j99K01j66j5J83k16O4J61l34K42j32PJ55k22m1K38r2
3795Ak03L02k66J21J39j61L2j2lK11j90o9J72k7j60J93k12K03J04m46K15J22r1
$$ y = [-21, 155, -153, 61, 100, -56, 60, -41, -108, 59, -124, -13, 169, -107, -46, 105, -138, 39, 64, -92, 53, -8, 38, 66, 79, 33, 157, -170, -94, 127, -131, -41, 161, -165, 31, -39, 30, 111, -68, -35, 211, -5, -20, 87, -165, 74, -72, -67, 38, -17, -100, 169, -142, 43, 40, 16, 118, 308, 15, 136, -33, -196, 187, 84, -278, -64, 116, -97, 6, 71, 69, 4, 264, -140, 94, -325, -34, -282, -767, -554, 755, 490, -64, -320, 98, -202, 388, -107, -65, -37, 117, -46, -82, 67, -126, -46, -10, -91, -66, 185, 1, 138, 183, -36, 34, 98, 44, 178, -65, -43, 146, -85, 110, 86, -145, 16, 0, -185, 43, 8, -21, 138, -96, -55, 148, -72, -46, 129, -38, 2, 110, -135, 76, 64, -151, 99, -79, -27, 27, -108, -45, 75, 36, 18, 167, -32, 169, 3, -12, 171, -45, 19, 180, -154, 88, -44, -37, 118, -104, -145, 93, 1, -202, 100, -166, -45, 94, -67, -35, -47, -50, 161, -29, -98, 74, 47, -113, 80, -132, 71, 175, -271, -56, 66, -25]
3818b5P6m6j04R4o6O1J45k35J40R9j56M8j5o5P7M4j55K61k70J0J30n1m5O6r0Q6
3844A4K6j64K09p1m7J69j07Jm5N1j25J66j10R0pj48K37r3q8Q2p9R1O1j82J26k8
3870B9j49J32L2j35J45j52l7K75k32N6J32j67O1M4j33K65j52k33L13q7j7J96j99
3893a3m6R3n0J03Nj44J94l1r8M1r0q3K61k09J5K32k66J01M3p0Q1k9p2N0lp4Q9
3920C0n9k5J49k20N2J03j77K43k42M8K60k57p1K11j12N0P0k30K11K9j83J80p3
3943a3j02J84j12K4N4l4QJ8j00J88q8r7J52j20n7L21k52N5k8j38K54J8j82J34
3967H7j59j1J34n6j8Q2o0n9K50k73K4J77j74J69m0j67Q4N0j97J29L5n2J67k50
3991a28J21J4r8K2N8r7J36j24j1J75k29J41J80j81Q2Q8k88K17m4j97J79o2n0J99
$$ y = [-25, 51, 5, -99, -5, -71, -10, 135, -100, 40, 139, -17, 31, 16, -49, 28, 72, -83, 178, -92, -82, 48, -3, -48, 18, -72, 14, 40, -124, 85, 14, -33, 136, 29, 30, -15, 36, -89, 77, -33, 57, 50, -98, 139, 46, -42, 40, -39, 52, 113, -69, 57, 29, -120, 12, 44, -91, 54, -98, -135, 140, -92, -36, 96, -71, -10, 34, -99, 166, 14, -219, 94, 7, -10, 186, -13, -59, 34, -16, 87, 92, -52, 142, 111, 13, 54, -36, -119, 142, -67, -52, 180, -86, 15, 58, -12, 69, 40, -32, 18, 15, -59, 30, -29, -54, 95, -125, -73, 30, -147, 96, -146, -98, 162, -95, -166, 45, -67, -17, 53, -177, 34, 63, -120, 60, -13, -115, 69, -43, -19, 35, 1, 9, 27, -73, 115, 27, -70, 82, -38, -95, 226, -26, 29, 1, -137, 117, 135, -47, 87, -72, -83, 51, -5, -23, 59, -1, -60, 190, -83, -59, 118, -56, 113, 73, -94, -10, 40, -157, -28, 7, -45, 122, -128, -7, 7, -91, -69, -11, -108, 28, -96, -107, 68, -161, -20, 160, -21, 61, 149, -139, 78, 34, -163, 16, -46, -96, 103]
4015A03j29K1J12j89K43j28j35Q2l2J9N0m0l1K29k19N2J32k77K32K7j88K07j16
4038B5j04J31j61l8J49p4J59N5k11J08J6j58J43m4N2M6mk13J67k01J02Q4k70L25
4062H4j73O3M1L6j29J46l3j34J58m5o7P6j35J99J19k83Q5m8l0J25j51J23k0j34
4086a27O5J79k32N9Q6j64K11j28L2ll4mQ8l5mP3j23R9J9j53K07j5j26J25j50L2
4112b3O6j02J03qn4Q0n6j40J59k4k9J46k44J11Qj57J95q9k8J22Nj11J81k03J28
4137C6R3k04Q7M0j49J41R4j30J15p0j70J60k4j93K71j90N8J27k03J23k8o4K45
4160A65j91J9O0r2NK25l36R6J12j14J35q4n7J03k3%N4k03jJ74j35o2K49k16J86
4185F9O2j63J48j31l0K01j92J8J10j72J43O8k14J95o4q9K19j92j3J63j26j29K30
$$ y = [103, -26, -5, 107, -82, 161, 33, -102, -20, -52, -33, 17, -23, -54, 175, -44, 8, 140, -137, 95, 122, -66, 141, 25, -79, 52, -109, -147, 2, -72, 87, 142, -69, 39, 55, -103, 40, -4, 48, 94, 90, -123, 44, -157, -55, 29, -241, 84, -89, -26, 15, 51, -78, 68, 35, -99, 59, 14, -53, 23, -112, 87, 206, -77, 8, -40, -70, 55, -96, 27, 7, -127, -62, 117, -115, -56, 30, -134, 77, -51, -19, -22, -56, -60, 28, -7, -11, 62, -61, 38, 57, -96, 111, 96, -30, 95, -55, -23, 43, -59, 44, 36, -18, 62, 6, -134, 25, 1, -28, 118, -126, -15, -7, -164, 31, -58, -86, 36, 41, -70, 111, -92, 36, 129, -75, 12, 52, -97, 44, 138, 8, 123, 53, -117, 43, 19, -174, 97, -93, -35, 92, -111, 12, -16, -80, 165, -26, -7, 53, -39, -34, 191, -145, -49, 63, -51, 84, 0, -57, 46, 23, 23, 77, -126, -127, 47, -88, -150, 99, -117, 69, 131, -32, 116, -15, -45, 156, -36, -18, 92, -80, 63, 131, -83, 112, 48, -41, 178, -14, -27, 136, 10, -119, 111]
4208A11r5NJ40k90J99N0k49K19l4l2m4Lp6K45k73K3J79j99O2J42j38K77j94o1
4232c0J31k06K3K08j38M8Q7k65R1K4J9J50p8j32J10j32J07R7j63MJ86k42N8J93
4256A50k35J56j72m6K59k58N6N0j34P3K49k14N2N6p8J80j81L1J10m4Jk0j4L3r4
4281c4l0J20L2j68J44p4QM8M5l7M3j54J16r3n8J74j45J11O0j12p2K13k48K04M1
4306A34j86J28p2p9J74j02j36J45m6m8J05o2L8J93l62K62j7r9J1L1j41K03j94
4329a20J11nn2j2J72j74J05nj68K67j29j30K25j67P0P7r9N9J17k85J93Nr7P6j9
4354A5j99K48j89J31K4k36K00O4j03J3J02j42J17K8j00O6J1r2J28j21n5J16j68
4377a42J67n4r4J73r8j01J74r4J6P9j19Q2P5j38J10J2j29K09j32j01J14k9N0k5
$$ y = [111, 16, 21, 161, -129, 70, 120, -129, 90, 56, 24, -20, -17, -93, 152, -121, -98, 81, -118, -56, 86, -52, 225, 31, -30, 101, -105, -82, 126, -12, 36, 123, -142, -51, -27, -8, 142, 64, -68, 42, -90, 17, 114, -49, -45, 141, -101, -43, 150, -85, 71, -101, -147, 112, -146, -90, -40, -174, -101, 148, -66, -14, 42, -36, 144, -37, -6, 104, 60, 61, 41, 27, 60, -34, -64, 56, 88, -80, 64, -10, -2, 46, 91, 54, 97, -57, 59, -34, -92, 82, -63, 48, 108, -4, -76, 137, -111, 93, 134, -52, 76, 4, -75, 99, -3, -139, 6, -40, -88, 17, -45, -7, 186, -176, 86, 69, -30, -19, 12, -129, 74, -120, -9, -14, -66, -78, 94, -80, 25, 20, -148, 119, -10, -140, 85, -82, -12, 65, -34, 25, 142, -143, 50, 55, -42, 34, 15, -184, 64, -125, 6, 30, -206, -6, 58, -45, -32, 70, -72, 45, 73, -27, 39, 50, -42, 86, -35, -90, 26, -142, 25, -29, -123, 50, -48, -149, 25, -69, -53, 26, -93, -11, 64, -74, 36, 48, -81, 128, -4, -105, 9, -20, 30, 5]
4401Ek8K7N8j86K13j80P5J90j20j59J13k3l1J03j62J4R9K3Qj05l8K31k53M5J39
4426E8j74K00q9r4J91J3k15R2N9j17J98j23P8L1j80J24L3j75K18r9r5J47j6j97
4450a32K98j06j14K77l08J60J11j56PK2p9J01j35q9P7l7O0J53j88P3J58k38J47
4473F2j06k0K62j52j69J54q3m1K10k21J37k8n5O0Po1J69k36J57J61k08p4J05r8
4497f8K2J54k17J04L7j43J06J7j60J93j12J06Pj07J8R4j98J28k6n0K28r8L8O0
4521A33k34J14K8p6K20j27o7P2m0k1R7o0p2P3j18L6J75l07K43p5kJ02j30L7N0
4546E1n8mJ02j74M2J40j07R7n1j02J85p2j94J95q6j33K39q9K5O2m4N5r5nJ12o2
4572B9m3R1j65k1J83j50L2J40j31P6q8Q1L2j2K4j44k7K3J31j35R2P9q2l8qj46
$$ y = [5, -23, 4, 62, -124, 89, -91, -16, 174, 54, -105, 8, -15, -46, 57, -105, -91, 8, 31, 39, -66, -104, 127, -126, -81, 58, -116, 84, -5, -99, 92, 105, -110, -18, 41, -76, 122, -1, 77, 108, -72, 52, 85, -90, 128, 29, -66, 81, 65, -132, 166, 60, -54, 223, -85, 75, 186, 30, 37, 59, -20, 81, -54, -143, -66, -103, -43, 110, -78, -5, 153, -85, 62, -44, -64, 198, 46, -123, 31, -52, -93, 117, -104, 33, 5, -50, 10, 17, -44, 125, -111, 46, 207, -1, -75, 30, -68, -46, 108, -109, -5, 32, -111, -5, 12, -148, 45, -67, 39, 46, -61, -43, 51, -147, -19, -45, -95, 133, 35, 73, 133, -101, 13, 41, -35, 185, 58, -9, 63, 23, 2, 99, 39, -33, 40, -78, -42, 133, -174, 69, -6, -8, 94, -36, 1, 51, -7, -11, 91, -83, -41, 99, -8, 89, 38, -64, 121, 49, -145, 50, -36, -169, 70, -19, 6, 68, 24, 79, -16, -21, 91, 29, -14, 77, -88, -109, 74, -76, -44, 96, -35, 41, -47, 34, 66, 54, 78, -66, -93, -70, 61, -74, 18, 97, 15, -23, -31, -177]
4598a77K74l7j54J89k02O6K2j67K17Pm8N5n9NJ93j70O1J22k47OJ23j23N0J88k69
4623g5J01q1l2J63r2oR4j47k7K02k19K07Pj69Q3m6r1K22j08MJ56k63M4J60k40
4648a53J35n1L6P6k1n5R8p0j11J80p5Q4Kj00L1l1p8L9K7j10K17m5N6q2l1j6QJ4
4676b6Q3k2Q0n0N9k97K40j19j1K07j26J2M8j20O2M1j85J89j43O7P5r6K7J53j71
4701b3K3L9q5J35l4l2N6j19J9R5J5r1O8j53L6O8r8O6O1j42J12oj0N7j87J46J06
4728A22q6k3J15k06J86q6N5P3k16%O6o3J82j00k7O6j77J51N6m5j20J05k2L1J1
4753D8m9J7Q7j66R1M9j37J43n4j06K25j60MJ43k40J02J08j83P2j8o5J08l0lQ1
4778F7J08j80J98k81M9J37j70P8N6q7j6J29oJ58k19j32J46P0q6J3j32R9K7j3O2
$$ y = [-177, 97, 60, -94, 95, -107, -41, -19, -186, 31, 38, -10, 45, -14, -9, 184, 14, 75, 197, -50, -44, 79, -44, 6, 194, -75, 26, -55, -87, 76, -16, -22, 72, -75, -102, 100, -119, 88, 95, -74, 9, -37, -128, 94, -14, -10, 146, -117, -73, 87, -153, -18, -69, -33, 43, 22, -33, 65, -5, -116, 64, -11, 73, 75, -25, 6, -25, -103, -64, -37, -147, 70, 25, 81, -1, -32, -48, -40, -26, 57, 35, 115, 65, 124, -173, 67, -52, -63, 144, 18, 30, 78, -42, 20, 61, -124, 65, -78, -11, 64, -32, -5, 148, -23, 0, 39, -46, 89, 55, 23, 79, -40, -21, 74, 89, -2, 66, -87, -51, 17, -81, -15, 46, -96, 16, 10, 0, 57, -130, 16, 122, 36, 13, 128, -78, 108, 22, 77, 150, -66, -66, 0, -63, 119, 19, -8, 58, -119, 32, 88, 43, -77, 28, 6, 37, 48, -1, 16, 103, -63, 28, 77, -60, 83, 29, -77, 148, -12, -8, 135, -105, -3, 105, -78, -6, -24, -89, 19, -11, -14, 67, 175, -5, 193, -88, -39, 98, -72, 6, 62, -25, -41, 88, 82, 240, 21, -111, 35, 105, 19, 32, -100, -1, 26, 13, 75]
4803G5j5qk3q6J1K00n6j90M1J1K9J25j70K56l43J06J12j69M2J95k52J26J29k25
4827g9J56j08P5m5k0QJ03l3p6lK9j1m1N6j29J26j06P1Pk7O2n8M1rm7N8J36j63
4855b7Q2m9Jm6m8J1O2m5J19m9r4M7J01j00J13nj52K10k16LK4L3jK5o2J13Mo0o9
4884g5J98k17J96m6r6J08r6R7o6r9J09N7k16K65j88j7J01O5j23J75k94J48P1j58
4908a01O7K39k89RP0l7nJ2l3L1N9l7Ml3Q4k0p8P0Nk8qJ8j12J83j33qJ00j33J83
4937G9Rj9m6j8j8R5p8JJ05j10l1L9j71K20O5k51K17l7j77J76m0l8J49q7Q4n3j36
4964g1n3J81r4J58j26m5R8k3k8J12j76Q8m9knJ80j34J3j00Q8L2o9rJ83l6j06O5
4991G2r6Q7j7j60K17j38QL0p4J00%j38J11Q5k12R5O6q9l7J7J6J00l0o2J13j9J9
$$ y = [75, 60, 52, 29, -57, -46, 154, 98, -92, -51, -40, -11, 114, -56, 200, -143, -37, 75, -94, -52, 143, -109, 17, 146, -79, 77, -31, 44, -1, -21, -13, 90, 57, -19, -22, 7, -4, -45, 11, -118, 8, -98, -27, -20, -47, 15, -43, -2, -11, -58, 0, 136, -27, 55, 6, 7, -39, -87, -76, -14, -59, 60, 11, -83, -36, 65, -35, 78, 73, -79, 131, -85, -82, -58, -25, -26, -1, -63, 50, 54, -6, -75, 123, -94, 102, 56, -40, 68, -28, 69, 3, -96, 13, 70, -146, 119, -69, -86, 15, 80, -43, 132, -162, -14, 57, -101, -34, 205, -84, -75, -5, -42, -47, -35, -68, -37, 22, -15, -11, -44, 40, 20, -58, 12, 17, -11, -19, -1, -113, 70, -63, -71, 29, -104, 79, 88, 69, 23, 5, -13, 82, 4, 5, 110, 0, -31, 8, -163, 57, 122, -129, 88, 51, -126, 50, 10, -28, 121, 34, 118, 65, -71, -124, 57, -37, 121, -5, -50, 48, 25, -3, 109, -67, 21, -28, -30, -35, 145, 11, 24, -76, 12, 44, -25, -34, 149, 113, 7, 72, -24, 63, 46, -114, 103, -35, -27, 3, -71, 29, 29, -109, 2, 87, -125, -30, 36, -53, -90, -73, -57, 43, 13, -49, 64, 45, 64]
5018F4nj64J92j49P4M5j66mJ58k8m0O5l5O6n6l5Q3p2l0J74j73J44n8jJ23j69l5
5045c2N2J7o5O3j17O0J3m0m4J79j20k1j4n9J69n4j2J09o5j19K69k71P1J34j49
5070d6L7J6m5J45q3j09J14q9N2J06n8l3J06j41M9J10k89J90n5p5J70p5j44J40
5094gm3j16J80n7J49o5j51Q4K7j60J87n6K2j9l0Q0J6j21L3O6qn1Q5j26PK7O9R6
5122A18k23J43K2P2j32P7j47J40j38NJ26Kj48K92q1j73R0j79K09j21j37J67Q7
5145G1j13J27p3l5L4r4J0J88j96J15Q2j24J11j21%J06j9q2O2j07J8mk3R4q7N1
5171iJ6n4j00K29k6j26J33p3p2K02r2J2p5r2J54j13L1J36j64j0R1j8k6J89k42
5196i9K9R3j55J91j04J00O5j65l3J36j63J52om6M7M7k17M5J23n6J65j60N2mj19
$$ y = [64, 59, -105, 87, -62, 12, 57, -109, -113, 45, 17, -23, 42, 7, 73, 17, -18, 65, -7, -37, 137, -36, 108, 50, 49, 172, 3, -32, 20, 37, -28, 35, -82, -22, -9, -49, -93, 86, -34, -55, -69, -128, 41, -13, -25, 84, 19, -100, 169, -102, -31, 103, -46, -9, 7, -38, 107, 24, -85, 29, -60, -8, 98, 40, 7, 113, -28, 21, 131, -158, 32, -23, -98, 72, -3, -147, -7, -50, -166, 14, -43, 106, 41, -110, -26, 1, -159, 28, -28, -6, -25, -55, 25, 41, -80, -47, 19, 11, -40, 45, -81, -74, -47, 22, 118, -105, 38, 60, 132, 0, 77, -70, 70, -68, -63, 63, 65, -83, 209, 128, -45, 45, -134, 75, -46, -183, -16, 71, -42, 85, 12, -23, 11, -83, -73, 115, -81, 34, 116, -8, 103, -18, -18, 88, 69, -13, 49, -58, -40, -44, -67, 27, -60, -9, 7, -47, -147, 82, 56, -70, 63, -10, -82, 120, 28, 40, -35, -127, 27, -86, -55, 81, -83, -93, -2, -20, -46, 143, -99, -70, 23, -132, 59, -45, 55, 120, -45, -78, 58, -105, 47, 41, -5, 42, 89, -128, -83, 40, -16, 149, -11, 41, 37, -82]
5221h2J06J25j35m9j46J05J20Pj01O1J2l7J16j02Nk3kL2J9mJ20k3j46J07N5q3
5247E7qL7r0Lo4J19M3o5k3k8P6K4j9K0o4j59J77o6MN2n6q7J46J47j92J11j92R2
5275eO1r9k8J82k32R4O9k34L33M58l68J93k69m9L7K26o48N3j35P66m85J89J01
5298B10K7k5L63l79l29K63J39k29l2j50J82j3j79K89p5Or1j0J3R4r6J8L9p4rN4
5324FRn4qL6J33j14K1L7j79P9R6L0j39J21j05P2r1J6j0j31K47n8p1M9J12k05Q0
5351b1m4k5J97k31N9J41j40O4Q1j09k7O5q5J50j35J15on7j04K34k44k9K19k22
5375a54J74lk02K64l2l7J59j87R3p6m5Q2N8j10L3r2l4K43j30q2K4M2Q6l1q7Q7
5401D3n3k3J01r0j1J47j3r7K9rrK9j7J70j67o9J08%j8L8j05kN3o7N5J05k32P8
$$ y = [-82, 24, 149, 14, -35, -181, -76, 44, 51, -50, 11, 23, -14, 102, 0, 5, -18, -20, 12, 31, 27, 147, 124, -22, 85, 140, 57, 49, 86, -4, -1, -65, 54, 97, 32, 9, -19, 57, 81, 62, 82, 18, -141, 36, -30, -26, 26, -30, -117, 29, 176, -16, 95, -97, -5, 56, -43, -71, 111, -121, -27, 42, -192, 141, 599, 231, 424, 155, 106, 143, 369, -279, -226, -361, 405, -80, 109, 210, 237, 212, 575, 196, -133, 130, 269, 40, 8, -142, 40, 27, -152, 137, 62, 68, -23, -33, -20, 74, -22, -4, 35, -39, -48, 6, 15, -39, -47, -11, 122, 8, 29, 66, -113, -34, 62, 92, -47, 74, -31, 41, -50, -34, -44, -175, 72, 14, -57, -8, 104, -101, -21, -65, -90, 107, -124, -65, 76, -64, 0, 81, -28, -55, 10, -75, 75, -60, 55, 49, -8, -112, 122, -122, -151, 68, -154, 20, 17, -185, 79, 47, 10, 169, -18, 75, -1, -46, 36, 94, -16, 17, -75, -109, 134, 4, -78, -54, -12, 74, 43, -44, 43, -10, -33, 68, -22, -33, 114, 101, 4, 33, 24, 15, 44, 27, 197, 30, -39, 69, 69, 51, 89, -16, -18, 35, -32, 23, 128, -104, -26]
5429b6R0r9K5P3j05J66o7q1nl8M6M8r8Q9k6k6l3J08j00O9K4p7J26k00Q1J76j77
5456c7J38Mj12m3J33Ko3j4L2O4k17J53J03k37P4k9m7Q0j3M5pj6o8R2j05J24N4
5483I0k17J81M0j12K4O5o3kl7o1Q7lo3J37r1N0Nq1J06Mj36Pj1J62J4j60Q3m4o0
5512h6J61p4J8l6j4J03l5o6j3M5Q3n6J2JQjj55J69j59J4J27K0qq0PJ16j22o5K03
5541A17K0j78O8mn5R9j71J03L6m6QN3j50J26o9P6l2N5n4N1p7m1l6N5M2L9m5O7
5569E7Qj42J75r6P6j92J16L5P4j54K3M7J2p1J11km6m5j33J37j43J46K83l99J48
5594B5J13j49J7O5J8K1o9J6n6n2J4P7k35M06k25o8K04j15O3j5J4j39J14%j18O2
5620a2K5l5J99j33j23J08j07J21O8k04R3j14J68o4O3m4N4p1M3Mj84K58j22n8K13
$$ y = [-26, 64, -35, -10, 63, -42, 124, 57, -24, -29, -67, -21, 27, -71, 18, -8, -34, -67, 41, -59, 10, 34, -43, 83, -117, -36, 140, -37, 101, 105, -7, -50, 83, 85, 22, 8, 40, 104, -113, 40, 143, -94, -20, -49, -96, -16, -29, 16, 9, -7, -75, 17, -88, 36, 90, -127, 54, 94, -18, 6, 71, 8, 6, -31, -92, -5, -8, -71, 66, -25, 25, 30, -51, 55, 59, -77, -70, -81, 81, 95, -65, 18, -26, -86, 75, 1, 19, -17, -31, 72, 37, -29, -42, 3, 86, 30, 42, 43, 51, 50, -105, 64, -95, -81, 46, 66, 58, -22, -15, 101, -21, -86, 117, 137, -41, 27, 23, -32, 67, -104, -1, 35, -11, -3, 50, -100, 26, -43, 33, 1, 56, 2, 53, -24, -65, -101, -46, -4, 35, -10, 57, 65, -77, 98, 2, 78, -114, 2, 37, 111, -43, -20, 27, 39, -32, 79, 77, 31, -14, -147, -10, -153, -7, 276, -123, 25, 138, -11, 6, 71, 89, 110, 41, 57, 1, -51, -37, 40, -195, 211, -14, -82, 122, 7, 70, 55, 69, -70, 44, 44, -74, -12, 13, -22, 177, 44, -79, 29, -78, 43, 111, -93, 0, -114, 54, -10, 53, 9, 63, -8, 35, 39, -145, 113, -9, -67, 146]
5645A46j59M1m1K9pp1M2k3P0m8J24j3p8k5o0J06O4k09J18P1j70J68k6pO4j19M8
5672C5K8p6J62j38o4J17n9q6M8J34q8Q0p2j68K17j18R4J6j23J10q5q6J52J0r0
5697e0J24r4P4j04r6Q0R8o5J19j10j4J56r0o8R2n4j2M7o2j1J06k30O9J35n9K8
5723Ip4R2m7M3NQ9k25J31k9j61J44n1O8P5l8o1P1j86J36k4L7O5j78J25J14k04
5749g4j5J35qq2J03j39P8Q1l4o4j7p6K95k82J5R0l8N6L7n7N5Pn2K7l5k8O3j15
5777g4o3K26J6n5on5N8J0j37J59J7j19J45j73l3J48N7j01M7j29J32l7lp6L6%P9
5804F9r4M2p9k8P2R0k29J20K00q5J1j63MQ0J8j19R0k6j0Q7j24J73m5j40K60j77
5830cm8J71qj36J23j26p3N1n1J35J5k00K14n2n6R5n4qO1q4J0l3L3o6R7o8J04n0
$$ y = [146, -13, 28, -13, 16, 9, -62, -20, -43, 27, -21, 103, 90, 12, -13, -73, 33, 97, -112, 6, 77, -93, 75, 49, 42, 106, -13, 35, 63, -13, 149, 11, -53, 64, 5, -81, -33, 101, 13, 93, 21, -147, 70, -48, 46, 62, -61, 49, -36, -122, 30, 40, -50, 74, -20, 54, -50, -146, -66, 32, -33, 86, -24, -38, 118, 28, -40, 52, -2, -14, 33, -29, -40, 66, -164, -95, 40, -19, 9, -65, 27, -20, 23, 28, 117, -108, 23, -6, -167, -23, -74, -6, 69, 31, -30, 41, -145, -9, -33, 4, 69, -109, 16, 130, -74, -89, 46, 38, -44, 59, -80, -2, 79, 45, -19, -36, -112, 183, -99, -84, 6, -32, 24, 61, 4, 59, 66, 14, 41, 6, -22, 41, -74, -137, 89, 105, 50, 44, -11, 47, 57, -80, 79, 96, -23, 122, -51, -84, 64, 121, 20, 67, -62, 70, 33, 30, -46, -10, -10, 69, -25, 17, -62, -90, -18, 72, -157, -37, 163, 78, 89, -74, -70, 10, 28, -91, -1, -27, -37, 50, -74, 99, 54, -86, 174, -3, -51, 120, 112, -24, 99, -27, -100, -49, -100, 35, 50, -150, 64, 12, -44, 51, -3, -11, 50, -34, -24, -57, -24, -90, 7, -61, 43, -7]
5858gj65K64j13p3J65l9o6K0m5J76j13nQ0nj04M3k7kO6j0q5K23j37M6j64n%R0
5886Hj34J25O4m6M9n2pN2k16J69j6p6J03l2J00j36K9pPPmP1p6%K7l1Q5j76Q1k4
5916e6L6M7K3r2N7P6r4j0J00q7P7M8r4L7k6j7O1k06P7N2o7P2l1mm4M8J4J65j20
5945D2j51J99k37K20Oj61N5J22j40J46j81J09j27j4J20JQ0p8n6q6O6rO2q7J02
5970Ck7M7n8k9P0k4M5Jp1L4LnL8j02J7K09j17K6P4k84Q1M7j8P1Oq4J10L9k05J73
6000G0n8n6J37j61L9O1j1q0R7q7Q9M8l1m4Pn7J26j61J21p3n1J09MmM9n6J3No2
6029a7L4o2J1J4N0l9J06p3k0p4N0N2r2J17j04R7j58R8L1o2P3r9L8R7n5K4Qk17
6057a72J61O4j22J06q9N4mM0m9L7j01J16K4j14J4Q8j61K32j13n2J57j46L2NP0
$$ y = [-7, -172, 92, -21, -94, 71, 32, -34, -14, -59, 117, 4, -1, 79, 74, -30, 13, -14, -16, 50, 40, -45, 178, 41, 87, -77, -82, -82, 8, -126, -1, 63, 17, 66, 14, 7, 59, -157, 12, -4, -80, 23, -9, 91, -45, -16, -23, -16, -9, -13, 58, -18, -18, 9, -22, 63, -113, -32, -56, -20, 27, 50, -42, 15, 91, -3, -13, 87, 0, 77, 125, 31, 68, 42, 25, 86, -120, -43, 9, -58, 14, -17, -21, -65, -17, -3, 162, 42, -109, 90, -147, 73, 79, -82, -27, 95, -45, 101, -80, 29, -98, -112, 8, 9, 89, 11, -45, -131, -65, -74, -12, -99, 3, -24, 23, -35, -64, 6, -18, 27, 28, -43, -9, -6, -11, 27, -75, -58, 151, 34, 60, 134, -150, -69, -22, -40, 31, 37, -47, 63, 102, -103, 70, 12, -44, 93, -68, -29, 32, 21, -59, 38, -49, 40, 88, 57, 13, 20, -37, 89, -72, 49, -24, -75, 34, 38, 34, 83, 27, 40, 45, -17, 17, -45, -34, -20, 30, -9, 97, 24, 4, -70, -20, 32, -60, 57, -47, 50, -108, -10, 21, -41, 32, -67, -29, 68, 13, 37, 45, -172, -11, 53, -69, 37, -52, 2, -2, 38, -11, 26, -75, 41, 65, -49, -35, 53, -108, 124, 11, -41, 116, -30, 2, 7, 77]
6082G7j83R7JO3j7j20J55q6k6P2L6k49J13J10Q4l0j67M9J7l8MR1j08J32j00J9
6108dL4n8Q1Lq1J25j58OK2J33j77L3n1J04J41j43q1P7J46j48K0j11J39J3j01R
6134b7P5m0j0k3N5M5j36Q4k4RL2l9j4J1Qk9j9J12o7j8j18J73Q2j32J76j41l6N5
6162D4p5M2%o5M7K8J0l4n3m1J23m5o4O7j5J0K8J3q6J92j34N4J8o1J35j21K2m2
6190cJ3J7K6k1K6K6j78J15R4j43O1Kj64J44K6n1j3Q5k0m4K2k8J12q8J1r1O9N4
6218E9j68L22k02J45j79J08j40J55j62m4N2P6n9N2p7N4J30j39L9n3L7l4n0N8M4
6243B4m2M6j1L7j79K47k59P9J31j34%M3N1mo6j04K36j06POj60K88j04q5L9J2o8
6270g6Q8J2j8L8j28M1J1j8k1L7M0J3LJ7j13J72q6P7n4n9O8rj22J02r2J29jj2o8
$$ y = [77, -106, -9, -8, 55, 38, -82, 73, -13, -39, 33, 69, -180, -67, 43, 127, 97, -70, -21, -4, -42, -38, 53, -55, 77, -23, -4, 30, -28, 53, 56, -25, 100, -58, -52, -30, 103, -74, -41, -92, 12, 153, 10, -71, 6, 152, 4, 24, -87, 52, 65, -36, -27, 48, 8, -2, -25, 30, 75, -61, 23, -1, 8, 40, 1, -13, -2, 6, -23, -42, 70, 3, -15, -133, 40, 122, -10, 166, 25, -11, 44, -31, 11, 11, -54, -7, 21, 31, -3, -56, -97, 26, -19, -83, -16, -31, -21, 7, 20, -66, 126, -8, 46, 64, 3, 138, 17, 39, -3, 10, 27, 53, 32, 58, 84, -94, 21, 115, -28, 33, 35, -129, 15, 41, -10, -23, 62, 42, -2, 20, -8, 104, 16, 27, -64, 5, 59, -109, 213, 11, 156, -23, 85, -55, 100, -62, -106, -54, 22, -37, 15, -62, -8, 122, -17, 22, -31, 6, -28, -78, -20, 24, -18, 28, 17, 54, -125, 122, -137, -58, 73, -61, -61, -18, 33, 29, -37, -141, 95, -11, -4, 2, -158, 130, 26, -59, -20, -8, -76, 12, 24, 6, 44, -84, -43, -32, -50, -71, -34, 6, 19, 22, 39, -74, 98, 12, 89, 35, -24, 44, 35, -87, 15, -77, 52, 51, 39, -29]
6299b9m1Q8K9j59O3J48k26J18L8Mm1o3Q6J40j72k1N9n9L8n7mM5K07k83J52j4n1
6326eJ24r2m4K2n4L5kM2N2j01JN5N9k35J86Rj1l7m3o2J88j44J15j93MJ09Qp1Q9
6355Dk0K4L9l3P1lj06O2M6p2Kr5P1Q8j07J2K2n9J38r1j08L4M1K3J04j00jR3p9
6384@r0L5J68j80kJ52j5j00J17k9j63K7K04j82J64r8l3k5J33j31J51j62K2J30
6408I3q8o5J61J0l3j18M0p5O7n4M5J12o5N6j12j9J44M1k2j71L4k1O5M7j11L9J0
6435A0J3j15P8m6M8j3Q5j26k2R4l0P8l8M5N8k08OK11k09R6L3j41J20N4j31rP0
6462A1M1R9q7k2J2o7j5R3j16M6l0j4J32J7j72K3K5P1k7k6lqL4K4j10N5M1m8J0
6491a1O8q9Q0lp5J04Lj53n6J53k7L6j13J56q8J4Q0m2j02KJ4L6J2K8r5P6m1M8K7
$$ y = [-29, -70, 18, 47, -112, -49, 99, -127, -9, 29, 33, -8, -71, 15, 155, -17, -38, 21, -38, 0, -57, -61, -16, 191, -92, 60, 46, -5, 119, 27, -17, 5, -49, -14, -16, 26, 78, -23, -22, 33, 92, -143, 43, 52, 41, 4, -39, -101, 87, -57, 58, -135, -131, -22, -14, -85, 4, -16, 8, 47, 14, 85, 82, -24, 38, 84, 12, 14, -81, -10, 78, -29, -17, 5, -54, 84, -7, -115, -81, -40, -17, 87, -13, -14, 79, 0, -90, -55, 113, -67, -69, 83, 68, -32, 85, 56, -107, -80, 124, -58, 106, 8, -25, -50, 83, -48, 103, -59, -37, 93, 5, -60, 101, 111, 78, -40, 0, -75, -8, -62, -17, 95, 30, 86, -26, -45, 99, 140, 118, -53, -19, -40, 25, 72, -39, 0, 10, 23, -92, -14, -60, -12, -25, 60, -66, -88, 6, -24, 54, 16, 61, 119, -89, -83, 128, -81, 15, 48, -93, 27, 81, -50, -59, 11, 52, 151, 64, 42, 54, -13, -28, 65, -51, -5, -35, -49, 83, 100, -72, -49, -24, 47, 20, -6, -9, -17, 17, 41, -69, -14, 27, -21, -11, 57, -32, 48, 45, -30, 74, 77, -76, -132, 21, -6, 30, -83, 73, -15, -1, 79, 37, -65, -63, -49, -13, -1, 27, -68, 8, -33, 15, 42]
6520D2j11P7r1O8l7R0j20R6n8p7J83k3r2Q2j9o7J42k08J66K9l2O7m7j19J2l5J9
6547f3J03np8M1m7l2PJ04M8Mo9K6l9L6R1j16M2j99N2J25O3p8K1Oj41J14L4m5P1
6576G6n6n7J77k76J68J8K2k9r3J3J43j01m4N7%k8l3l4J37K0j96K13j71N4K8k1
6602a3j0J65j78M2O3q4np9J62O6q1r7J52j00RL5j11l9J53r7R7r0m7R6J15j76M7
6629eJ14m9r2Q3lp0O3O5j40L8l8R3m1%K0q9o8J06J6j3N9J0j2j23R9l8k7J46l0
6658G4k44K93r5k0k5R4m5O4k69J88P7j42J12j95J38R2l7j3j3j20MM7NJ6Mj16J59
6685C3j3p6J02j66J32jj2J27q3j28K29j51JL4n3j0L4k0M9j8r8m9J61mp9pN9P6
6713F9j27j38M91j82m23L17K5n9M1j2L7r2o8R4J3k1R4j28JP3o0M8p1MJ88k54O8
$$ y = [42, -69, 8, -83, -15, -52, 38, -82, 14, -44, -121, 62, 39, -53, 29, 10, -57, 85, -123, 43, 72, 40, 107, 60, -59, -47, -82, -63, 40, 35, -43, -2, -49, -81, -74, 30, 78, 82, 13, 39, 0, 36, 127, 11, 53, -146, -94, 31, 94, 16, 37, 43, -98, 16, 50, 5, 76, 20, -37, 140, -136, 32, 50, 72, 43, -50, -37, 106, 5, -39, 18, 18, -10, -43, -77, 60, 80, -116, 97, -74, -20, 8, -13, -23, 142, -36, 6, 69, -15, -20, -99, 63, 129, 48, -49, 103, 3, 12, 47, -64, -103, 50, -47, 50, -40, -87, 9, 124, -52, -5, 109, 60, -32, 51, 48, -22, 41, 106, -34, 4, -34, 59, 18, 18, 38, -51, -119, -13, 3, -10, 49, 59, 47, -76, 23, -15, -42, 104, 74, -170, 123, 28, 8, -17, 77, 32, 96, -173, 15, 92, -50, 62, -133, 5, 97, 60, 47, 34, -86, -82, -35, -30, -14, -10, -126, 33, 20, -56, 46, -120, 12, 11, -1, 126, 43, -85, 144, -7, -6, 28, -25, -35, -1, -21, 28, 10, -88, -137, 24, 20, -59, -66, -7, 69, -58, -196, 295, 113, -310, 7, 32, -27, 14, 2, 39, -53, -121, -27, -14, -35, 59, -69, -68, 5, -55, -7, -78, -74, 114, -140, -72]
6740g2J65j37M8K30j93j2m9%L3l7M9K7k4k9j4l9l6J73m8k9l2PJ4q0OJ67j63M2
6768c3J22j17R0j69J21l4J05j70P8K2m3L6Lo6J30k88M53m47O3K98l29J42J2O4
6792D3K3mp9KLJ0%Rq0N5J85k80J07j11P7R7j83L11l3K90l75j04pJ15n1j3K5j2
6820B0j6k2rm7J63j03l7O7lkl2L4L7q4r7J00O8OJ7j91J54J06j61N8m5P7nj21k5
6849i3J63j40P3K8J9r8Q1j28K13j50M0K5o3J6l6l2Q8Mj46K45n9o9O3m0Q7k3j13
6876d5J19j59J46p4j1l0P3q3M6P0K0k26R8L2k5O9j17P4o8J3J63m7j11J05J4j23
6902g7J47r6M1P6j29R0r9J33m2O3r1Pm2J23j14LL1PM0l4Q1j05J2N6j78M8qj46
6930b03J98o0Q8K5l1J71j70l6m3O9N1r9k0L6N3R2p5J9j20rJ04l1K1L1r0Q8k0n8
$$ y = [-72, 93, -44, 4, 234, 41, 29, -20, -20, 13, -24, 25, 52, 28, -1, -15, -54, -90, 83, 35, 6, -26, -19, -5, -85, -79, 88, -75, -33, 89, -28, 62, -107, 14, -20, 85, -85, -7, 15, -28, 8, 11, -55, 75, -213, 240, -207, -144, 154, -175, -33, -21, 43, 66, 62, -17, -15, -12, -2, -2, 7, -73, -18, 167, -113, -6, -117, -40, 57, -126, 185, 152, 442, 67, -37, -44, 71, 20, 7, 32, 20, 4, -18, -27, -74, 89, -14, -51, 16, 13, 11, -21, 13, 50, -34, -131, -31, 37, 43, 60, -131, 23, 129, -32, 26, -19, 58, 53, -68, -93, 70, -70, 3, 31, 50, -48, 33, -95, 118, -32, 8, 33, -30, -14, -50, -82, 6, 10, -136, 109, 50, -19, 44, 4, 91, 68, -45, 74, -85, 61, -13, -24, -54, 19, -64, -18, 52, 72, -154, -56, -24, -49, 20, -97, -23, -91, -78, 85, 38, -73, 32, 46, -77, 70, -26, 15, 91, -38, 52, -47, 86, 44, 107, 16, 23, -19, 104, -10, -7, 24, 31, 71, 37, 118, 13, 25, 81, -97, -49, -57, -203, -5, -65, 23, 48, 17, 188, 18, -18, -61, 8, 59, -40, -60, -24, 29, 121, 46, 65, -55, -64, 40, 9, 30, 61, -29, 59, 39, -19]
6958a9J11l1o8qj11J09J3oL5p5q6K31j19L6q1R4jm4j07J44j11K6J52j36P9k8j14
6985a15O6Q9q1J7n2p9K02qm0N3j38J31l7k4k5Q2j42jJ41p7L9J9r4J14J00k69J99
7012G0m6kl0%O4j7j24K9J6m7J00j12J9R9o5P3j6K0m7N6k7p1N4l3Q1q5m0J6K22
7041A57j62qL4m1Q9j24P8l2j12R6J35k31K21n4K0o7L9n2O0j40J51l0j00J53k14
7066a34R2N6pK2K7j34J5MO3l7J50j9n6j4j31M3l8Q4R0j33R9j9m9J97k16M9Q5j68
7094g9m0K04p5rQ3r8K2%L9Lp4k2J35j10o8M7Ln3k9P2K2O8p5K4m9l7J33J6j17R8
7124C4j50J46o4k2M9j5R1oL1j14k4J18r4J93l58J36P8j07K09l7k32J78j40J06
7148FK5j01J7J25m1RL3j95Q1N6p4Q9q5L1M6p7N1L2N1j20J3O3k4j5l5%Q2q8J23
$$ y = [-19, 92, 61, -7, -15, -126, -17, -4, -10, 25, -50, -136, 95, -24, 12, -69, 25, 24, -20, -127, 17, -94, -68, 84, -52, 27, -1, -115, -49, 40, -41, -24, -76, -155, 47, 39, -1, 52, -86, 45, 8, -16, -41, 41, -101, -102, 39, -38, 1, 20, -74, 40, 140, -129, 70, 24, 22, -8, -8, 56, 39, -85, -56, -40, -87, 13, -99, -80, 19, -46, 27, 11, 31, -16, 40, 13, -58, -4, -37, 44, -41, -81, -65, 157, -5, -13, 21, -20, 69, -55, 23, -9, -121, -25, 110, -121, 100, 46, 66, -1, 38, -14, 46, -94, 57, 27, -73, 80, -134, -42, 14, 7, 29, 56, -78, -63, -59, 4, -33, 117, 98, 42, 28, -103, -60, -98, -14, 76, -57, 42, 23, -26, 171, -45, 4, 89, -79, -119, 85, 10, 1, 84, -14, 8, 8, 47, 50, -24, -46, 89, -21, -89, -42, -39, -92, -121, -49, -27, 41, -34, -10, -59, -96, 37, 53, -64, 34, -116, 30, -34, -56, -7, -22, 69, 63, 94, -20, -44, 74, -20, 173, -185, -49, 29, -78, 131, 94, -138, 40, -100, 6, 31, -70, -53, 72, 31, 40, 73, -122, -41, 15, -59, 30, -55, -24, 22, -55, -4, 28, 79, -41, -28, 35, 11, -4, -39, -39, 43, -45, 78]
7177G8j40J00j9m3K6L1KP1r5q4N1ML2m0q0R5K5Mp9J09m8Q0o3k6P0j51J46Nj3K7
7207G5j28N5O1O5j87Q9mJM4q3K2R1q6Orn3O1N4n3P9j11n0M6L8K2q4N8O3o4r6J9
7238e9J17K0l5l8n7P6mj14O2Rnq0J1J18P0j9p0J01j49R5n6j29R5q0J48l6ko5O5
7267a1o9J55M9k18J12J7Nk4j16Q3M5r5J8M3l4M0K3j58J75J7o8L6p5Q8n8k3J06
7294F3r5P3q8J01j47JJ01K8P0j25L0n4k3R5M3m7n0k4Q1m6p2J5J46j55K6J31j71
7321i3J54Rk32J51P2j47P4Jn6J31j04k9P6M1Ro7l6R4l0M9qr4l8M4j13K05o3R1
7349I1p7j3j86J31P5o4mQ6j18R6n4m2K6j5O7k1K4L5q6MP0J09j04k3m2K03j45j2
7377A1k7J9N1o4p6J49l4j7N1j4o0L8Jj79K67n6j56J63%k06J33l7j1L6j5mO2j50
$$ y = [78, -62, 38, 19, -24, 2, 33, 35, 106, 11, -73, -22, -18, 14, -26, -106, -11, 14, 18, -61, 48, 0, 80, 17, -9, 61, -90, 56, 61, 48, 75, -53, 2, 63, 128, -59, 30, 26, 27, 71, -12, 10, 101, 15, 21, 12, -41, 20, 74, 21, 100, -11, -61, -15, 23, 45, -39, 19, 82, 18, -78, -59, 58, 78, 43, 5, -52, 24, 20, -94, -32, -23, -28, -108, -97, 21, 91, 72, 2, 103, -46, 49, -7, -136, -41, -121, 27, -9, -11, -76, -11, -80, 75, 124, -94, 18, 35, 40, 16, -100, -17, 28, -67, -49, -6, -40, 0, 23, -135, 40, 57, -11, 25, -50, 38, -20, -43, 63, -32, 41, -47, 54, -93, -92, 9, 37, 107, -18, 12, -42, -65, 30, 73, 26, -24, -48, 33, -13, -85, -70, 76, -79, -53, 78, -93, 61, 70, -162, -11, 61, -86, -12, -11, -67, 64, -40, -69, 7, 48, 57, -10, -46, 48, 18, 67, 59, -35, -73, -29, -142, 63, 0, 91, 14, 1, -185, -54, 21, -43, -47, 39, -79, 17, -37, -79, -53, -68, -1, -22, 2, 37, -49, -45, 25, 134, 30, 7, -35, 168, 23, 11, -16, 3, 54, -10, -86, 63, 29, 12, 63, 49, -11, 27, 28, -151, 116, 60, -96, 67, 67, -139, -6, -43, -54, -18, -33, -37, 25, -125]
7405a25J59p4J30o4qo8J35j58l5Q8Q2p0j37Q6P5o6K2n9J41q6O6Kkj04l5J19l8
7432b4K3p4m4M6R1k2r0J82j56M4J09k12J68k4o0j3j52J12O9J9qJ40p5j06j6J08
7458C5k7nk6OJ04j47n9J94j99J28rL6p8q2K59j76J0R9j72R5j26K28p7K8lj37m0
7485a41J77O6j64O0O9m3m6P7q2R8j52R8M6m3P7r0k6rP0j18P3J06k14O4J23j28
7511e2J15j7m4J15j72l0J26j3j12J73j47L9N9o1N3K3l8N0r2K0N1j5q8J2P1kj2
7538A2o7O7M8m5Q1j01LK7m3J7N4q9J06q6M1oo9PR7PnPj07J0P3ko1RoK4K8%L6n5
7572A2j00J10K8l0k9l7P5r8npJ21o0J07j24mQ1k07J97o6%P8k4P2r5n0Q5jJ3R1
7601A33M6k75M6M7M0j4N5m8r5J11j42J06m7J25o2p1J20m1r2J22o9j26K18k3j06
$$ y = [-125, 34, -40, 90, 26, 18, -50, 85, -73, -108, -20, 62, -8, -145, -59, 16, -50, -28, -87, 54, -32, 34, 36, 34, -70, -105, 14, -24, -1, -75, -119, -73, 18, -4, -94, 88, -68, -24, 85, -127, 41, 17, -43, -56, -208, -96, -27, -8, -16, 124, 49, -57, -73, 35, 8, 3, -23, -17, 87, -60, -119, 75, -124, 4, -5, 31, -47, -129, 130, -46, -36, 63, -109, -14, -140, 88, 11, 39, 36, -101, -141, 36, 102, -62, -2, 67, 24, -22, 55, -27, 71, -81, 17, 63, 20, 97, 7, -19, -28, 42, -76, -3, 103, -111, -47, 76, -52, 63, 46, 2, 117, -55, -85, 41, 28, -84, 89, -58, -19, 40, -21, 32, 55, 17, 67, -25, -5, 46, 31, -57, -45, 26, 24, 12, -55, 12, 60, 15, 96, -5, -2, 25, -18, -1, 53, -36, 70, -16, 25, 19, -50, -43, 54, 61, 56, 63, -44, -34, 39, 37, -24, -15, -21, 3, 31, 31, 67, 12, -88, 22, 50, 20, -9, -46, 29, -69, -74, -81, 40, -20, 87, -37, -41, 40, -167, 30, -36, -36, 42, 18, 90, -5, -55, 30, 29, 42, 133, 179, -96, -50, -3, 37, 23, 78, 30, -65, 46, -96, 10, -37, 88, 26, -45, 75, 34, -58, 64, -5, -131, 87, 64, -42]
7626d2J14k12P7J01Oj40J51j08m5K25j62K7J1j04K5J4o1J88q1J9J4M9q4o4O6L1
7652A5m7J6m1J40j43R7q6N7j54K16l06j48K63P9K06k28J27k0j41J29M4p5R9j04
7676ej4j9N2K9M8o7m9k0k6PJ7N2J07j58Q4L1o5L8Rl4j7j25O9J24j70J08P7m9p0
7705c6j7RO8p4pJ43rj13Q4J4j40J1J20j39J40p2J88j4k37K17j42R4m7m3j8J7o7
7732g0m1J05M9J5m0q8J18k8p9K08j41M1j05l0nK04p0J06j69N6Q4m7k2j12O2O1
7758F2j12%J41j15M6l3k0n4K47k49L6R9j23Qm0P7M9L6o7pJ3n7L4N9o4P7K5L3J1
7787A12j30l9N2n2M8n1L8KJ2J51j74J2O4q2MN7p8R4j09L9J0L6m8K4q5N9q2M26
7815C10m5m54L33k57J31m5O6q2rK4N7J2Jj4k1M0j0L0r9J1Q8o2K5MM5j56R6m7L9
$$ y = [-42, 72, -140, -63, 38, 44, -96, 55, -53, -98, 127, -35, -8, 3, -101, -76, -62, -123, 65, -16, 3, 17, 66, -18, -82, -16, 15, -32, -16, -57, 83, -60, 37, -49, 8, -146, 70, -236, -384, -121, -42, 164, -64, 63, 43, -98, 31, 75, 0, 99, -5, -19, -38, 14, 43, 91, 24, -25, -45, -71, -64, -47, 5, 112, -46, 38, 69, 4, 42, 51, 17, 0, -125, -56, 68, -102, 6, 83, 34, -36, -53, -44, 24, -50, -57, 86, 77, -36, 48, 62, -78, -67, 53, -86, 54, -18, 170, 156, -81, 136, -6, 88, 41, -2, -20, -3, -70, -111, -6, 43, 58, 18, -70, 48, 20, -59, 149, 8, 49, -56, -86, -91, 113, 43, 149, -20, 36, 120, 73, 51, -61, 1, 62, -50, -50, 91, -24, 22, -11, -31, -85, 162, -87, -51, 48, -75, -67, -107, -30, 19, 55, -12, -19, -6, -63, -29, 30, -34, 43, 68, 101, 112, -18, -57, -5, -57, -9, -60, -22, -20, -8, 143, -31, -19, 45, -37, -33, 24, -54, 40, -69, -30, -20, 16, -32, -8, -93, -34, -116, 310, 265, -189, 144, -113, 18, -27, 39, -43, -52, -28, 29, 41, 42, 28, 7, 47, 37, 67, -32, -21, 67, 5, 30, 34, 79, -77, 19, -28, 11]
7844A1Np4J25r5j7J02n8k2%K8j76K61j06jk4J3j16J40n5N6P9k43J98q6m3R2m4
7871e0j1J54j37N7K4K8lm8n9M8o9N5r7M8k7J39j8n1K7p7J12M7j62P2J08k45K06
7898G1j89J21J07j65L5MN4n9M4l1rr6O4J50k1m9j9J7m4jL3J7L8m2k8J6O2J5j62
7927f7K5Q6r7K8O9j46P5Ml8L2j25J87P6j05l7K8J06j55J17j9oN9j87Q4k2J43j61
7954d6K8q5Q1K8j16P7J6Q6r7q4J61j5r4N6Q6q2o5P9l0J2m7Q7j24L5Qkk3kR6r6
7984g2J08q3L8K3r4J56q8r2J26L2p6K3J2M2j6j24k5J22j04J54p2o5L5O9PK1r6
8011c9K4Rj31J10R5j28Q2o1K3Q4j43j0J86j21N1j05j72m6M60r0l08M12k15J99
8035A66r5n4Q9Q9m5m9nj26P9k4M4j06k6J09m1j4L2R5j58J7j8J13j52K8L6M8J12
$$ y = [11, 16, -58, 67, -28, -45, 57, -1, -23, -23, 5, -171, 90, -16, -17, -41, -28, -144, -4, -59, -3, 76, -167, 31, -55, -98, -6, -50, -61, 93, -44, 13, 37, 65, 62, 14, -45, 3, -66, -11, -108, -60, -87, 52, 34, -17, 10, -67, 45, 92, -70, 2, 110, -135, 71, -118, 3, 110, -55, -20, -16, 38, -21, 23, -8, -17, -113, -49, 101, 80, 31, 12, 29, -15, -16, 17, 34, 72, 30, 2, 18, 80, 95, -67, -42, 44, -53, -25, 44, -102, -27, -23, -61, -29, -154, 33, 109, 4, -33, -5, 101, -54, 63, 44, 38, 97, -90, -6, -28, 115, -46, -18, -103, -22, 6, -110, -33, -17, 69, -28, -112, 49, 34, -60, -4, 82, 0, -65, 14, -16, -4, -51, 36, -88, -53, -45, -47, -70, -72, 24, -72, 36, -47, -9, 14, -80, 76, -12, -104, 22, 54, -22, 1, 13, 55, 39, -85, -110, 12, -92, 62, -10, -75, -40, 29, 36, 57, -39, -15, -6, -137, -27, 68, -60, 22, -39, -16, 68, -75, -85, 101, -20, 31, -74, -246, -292, 168, 78, -230, 182, -33, 166, 71, 17, 106, 195, 150, 101, 96, -30, 49, 25, 69, -37, -63, 46, 5, -9, 23, 118, -40, -23, -41, 72, -80, -52, -16, 32, 144]
8062A44r4j21m7K40j04p5Q8j40J25m9Q0K7Pj39n1J61j08L21j8j2P79o14n66J69
8086Cm0KR9Qo3J6rp9O6L1O9k59J43R1k07K53j63P1r0R7l2k8L5j09P4L1n0M9j09
8115a00J19j3J0n1j8L6k6K4K8l7O6j4O0q0J36k02Q2p6Q0m2J7N5pO3j47J01p4n7
8143f7n4J63j16N3n3Q0o6O8N6p7LN0j98J14P6q2J15%j11J01nn3L4M8q6k1K3q7
8171i2J23N8j40J6J01jL8j42N9j34K03j33N4M1j7j57J44L4n4k1
$$ y = [144, 50, -71, -118, 122, 18, -57, 31, -109, 16, -33, 47, 74, 81, -58, -109, 52, -56, 265, 247, 235, 1014, 400, -166, 3, -37, -35, 64, 72, 9, 25, 16, -63, 3, 34, 103, -156, -13, 78, -129, 124, -39, 32, -58, 39, 7, -21, 14, -95, -21, 10, -40, 9, -100, 19, 6, 16, -35, -53, -17, -43, -19, 9, -28, 38, 24, 84, 4, 140, -62, 20, -56, 24, -18, -1, 54, 47, 110, -37, 64, -10, -67, -121, 42, -74, -21, -74, 6, -60, 8, 64, -13, -10, 40, -158, -44, 32, -50, 65, 65, -46, 55, 50, -3, 31, 79, -7, -28, -5, -92, 31, 89, -51, -35, 66, 65, 103, -39, 20, -114, 89, -44, 10, 51, 34, -123, 21, 55, 1, -20]
8191b0
$$ Imaginary data points
##PAGE= N=2
##DATA TABLE= (X++(I..I)), XYDATA
0@%%%%%%%%%%%%%%%qJ6j6J6j6K4l2L2m0M8n6O4p2Q8j03J16j32J51j68J85k09K39
37A27k68K99l33L68m08M54n03N58o19O83p52Q29r14J005j106J219j345J487j646
56h65J827k034K273k552K886l296L808m471N369o653Q658j2245K0592p6114l6746
71i9563J31987o600l038L1964J206m1298j1084M663j8877k4331O0062K3225o0468
84a2152M19K0103n5157k146L6321j6017j2805L6223L6759r646k1422L8231Q242
97D6953m6079J5766Q989n5404J1611M6961j3348j8740Q897O207k3133k9692J5627
110b5385K725j7680M2645K2234l3789J9972K6311k3107r02J5809m242j9063j3473
123g945J1968j4644k9600K9016J1655k9189J6707J0922k0825J1304J5177J707
$$ y = [0, 0, 0, 0, 0, 0, 0, 0, 0, 0, 0, 0, 0, 0, 0, 0, -8, 8, -8, 8, -8, 16, -16, 16, -24, 24, -32, 32, -40, 48, -55, 61, -71, 80, -88, 97, -112, 127, -141, 158, -175, 193, -215, 239, -264, 294, -325, 358, -394, 435, -479, 526, -580, 639, -706, 781, -865, 962, -1072, 1201, -1351, 1535, -1761, 2047, -2424, 2945, -3708, 4950, -7295, 13297, -62817, -99563, 32424, 25824, 22786, 54750, 55956, 14658, 3574, 8237, -10640, -34971, 25091, 48316, -12152, -11733, 8370, -46787, -48933, -12612, -28629, -41434, -5211, 31548, 21902, 480, 38711, 46953, 874, 16640, 25629, -29775, -18164, 28797, 15449, -3291, 5606, 11813, -11320, -41012, -25385, -22660, -40340, 2305, 24539, -9250, 10722, 37033, 13926, 13024, 28833, 24591, 5528, -7945, 4023, -10621, -40221, -11205, 450, -28739, -12032, -1110, -21935, -10631, 4546, 6253]
135F253N612K009J1001o700j9795J5483k136k2135J8578J204k2187P339j043q752
149a5269M868k435O758J660q471J8017M510q801K2897K650j4122P507j1006j2707
163c944L349j0287R86L964r233Q553j609r682J6039l96m194J7068n287l077R653
178A1903j0774K955Q390j0352N442r62j1515O538p633o806J0474r717N5J0463
192a539j1808O832J2348p908J1135P017p146P307n745p069N195j2506o82N499
206I30j5713M785P250j2320J0093P693o635Q818j390l204O877q063L143P024j2002
221b714P769N280j5293P619K649j1907O060k644n467M831p675L332O822q150J2276
236B788O517j1272J2690L525j1866P483l245p368L433q868l3K729r684R479L426
$$ y = [6253, 11865, 13874, 24875, 18175, -1620, 13863, 11727, -10408, 8170, 9374, -12813, -5474, -6517, -15269, -10401, -12836, -6078, -4418, -12889, 5128, 9638, 837, 23734, 26384, 12262, 19769, 8763, -3944, -595, -10882, -9896, -5932, -15165, -6612, -8221, -17903, -1864, -2260, -6454, 10614, 5327, 2250, 11903, 1129, 4084, 12474, 2122, 7564, 6602, -4913, 1625, -6008, -12814, -2340, -12057, -12002, -1539, -13347, -6515, 5833, -2075, 9060, 16077, 8931, 16238, 10493, 3424, 8619, -3887, -4569, 930, -14783, -9998, -2748, -15068, -4975, 2718, -3917, 4901, 3511, 307, 7184, -879, 2264, 9288, -2714, 5055, 10335, -4958, 2661, 5310, -6597, -537, -3181, -8648, -3817, -11492, -8160, -1338, -9488, 2788, 9305, -1967, 10723, 14248, 2382, 9865, 6620, -748, 2685, -6183, -6216, -3487, -13171, -3692, -266]
251b66j0262J3692J730r821J0588j964n318P053n978J704M024q709P967J307r960
266d213J0867l035j0974R422m778o204O908n970K159O195n818Q784K031o659J2001
281A0716k576q904R575o058n861O244q139Q07M446p924O677J190o992J0226k932
296D95o149J0547o086l104R104o934K392N501p266O888P58p799P982n075o635
311e381Q220p924l018P958p728L007O355o985P577K540n913Q599l870m105R038
326H370p815k232P407q569K384M358q882N315J1p036P491m173m259Q998n909Q00
342c741Q624o942M943N917p860N935N04p532N333n579m552O357q827j68P713p991
358g866M136N074o545P528J420n885P306l249j938P071p722J457O814r418L573
$$ y = [-266, -10528, 3164, 4894, -4927, 5661, 3697, -1621, 5432, -546, 1158, 5182, -3527, 4440, 5747, -4213, 6654, 3619, -7355, 2067, -2711, -8915, -2007, -7977, -5818, 377, -5441, 3343, 5374, -1285, 10716, 8140, -764, 8811, 2753, -3108, 3136, -5003, -4196, 250, -7674, -997, 193, -6799, 3427, 495, -5654, 4893, -1193, -4297, 4807, -2127, 265, 5766, -1500, 5388, 6146, -1653, 6329, 1254, -5381, 2839, -5085, -8103, -145, -7873, -4866, 1489, -5496, 2081, 4621, -1292, 7307, 3437, -668, 8370, 555, -1677, 5730, -2839, -455, 3903, -4979, 336, 347, -6689, 802, -3371, -7630, 1368, -4541, -3741, 4883, -2059, 2884, 8801, 941, 6876, 7380, -152, 5181, -398, -4950, 1407, -7420, -7588, 125, -7866, -3730, 1344, -5201, 2327, 3747, -2138, 5168, 1919, -19, 7052, -670, 787, 7601, -1817, 1756]
373A756L339r576M785r73p135N748l692j284O932o259M596Q454p576O233N038
388A0386q231N435j093p587M641n368l137M202p561L373M978q749P002M900p754
403d563P273R81n664O235k336j063M852o002L858K795j0071N873J690j0456N916
418f82q72p399O011k124q28N708l056O426L895p172Q250R39r987P359j819q428
434c779N170m145l904L682m162M502K263n916R192L19q241R913q11o264Q223k231
450C811l272L899m358J743j76n911P385l196q874Q892l359o654R771j351j292
465b942O852j900K002P29l537P237l948o920Q477o357p840P882m613l137P136
480h79k263J405J498k812O665k711k828J0613n161m570Q639o499l394O614m575
$$ y = [1756, 5095, -4481, 304, -669, -7804, -2056, -5748, -7032, -100, -6359, -1763, 6691, -885, 5348, 10386, 2155, 7590, 6497, -1090, 3551, -1817, -4954, -752, -8313, -4940, 38, -8711, -1709, 3191, -4563, 2710, 3691, -1973, 4262, 1926, 863, 5715, -287, 3571, 6366, -3705, 2168, 3858, -6598, -682, -1554, -8953, -2942, -5066, -5894, -186, -3242, 3184, 7079, -93, 8157, 9096, -891, 6468, 4649, -3779, 1391, -2754, -6658, -2976, -7138, -2636, -373, -6289, 2903, 3222, -5019, 4894, 4083, -2181, 6042, 3811, 539, 4438, 80, 1823, 1647, -4264, 3121, -75, -8949, -57, -3416, -10070, -299, -1650, -2942, 3910, 2010, 4012, 4741, 1204, 8441, 4493, -2427, 6050, -307, -8147, -265, -4878, -8015, -879, -3142, -1737, -239, -3051, 3614, 903, -1925, 8688, 3527, -1043, 7596, 1097, -2297, 4317, -258]
495b58j60R03m362K952m273l259R080m840j158J0680n401p88P841m560J137L341
511F875l902K244m689m173N223p394j625Q585o705J4P056n919K104M595k724M149
527C714q06j475N223o077n92O690p284P33M928q542Q10K181o379L358L4j525N464
544D55l699J273O915n261L690N638p287L460J160q054K976j482m280M001l939
559d434m10M267n539L417M300n479O148J960o584N903k83l891N323k461r53L161
575D445n854J540J050o585N095l91o710O567j046m309O733q17J83N073l080K360
591D254Q60n445M901j841o266O561l361n986O078k766j574M794k494K123J245
606A083l751N383j779l818Q422l217m394P310l946k782M454l469N22O86l780L455
$$ y = [-258, -418, 485, -3877, -925, -5198, -8457, 623, -4217, -5375, 5305, -96, -884, 6957, 2397, 3534, 6875, 2973, 5217, 528, -3645, 1578, -5816, -7441, 1144, -5561, -5547, 1509, -4410, -2306, 2289, -435, 3714, 2908, 1433, 6656, 579, -13, 6677, -607, 126, 5054, -3488, -2678, -497, -6876, -3518, -3484, -5009, 455, -3244, -1971, 4944, -317, 3373, 9011, 1724, 5184, 6344, -1710, 1266, -216, -4496, -495, -4434, -4844, -577, -6116, -2699, 1601, -3878, 2270, 4230, -2354, 3549, 3266, -625, 4698, 2237, 1284, 4445, -1409, 131, 1181, -5404, -309, -700, -7410, -843, -1889, -6198, 535, -282, -99, 4974, 1894, 4254, 5114, -331, 4570, 2729, -3537, 3024, -337, -6323, -245, -3011, -4585, 209, -2285, -162, 1083, -2668, 2715, 936, -2882, 5540, 2323, -2071, 5239, 1293, -1489, 2965, -504, 18, 704, -3076, 379]
622C79l344l115P904l972k273Q823l946j978N632l304P81J515k965K952l441k731
638c083N944n632j674Q106n262j532N746m491L00K405k380L195j789j241N294
653C906n384m07P368n950l30N423n716p8J903l647K564j278o79M740n010N31O486
670D442o255R10N876n735J050K071m245K346j111j156M318m321Q94M817o861J633
686a327M774o002K112K260m418K832n85j395L926l279J577M033o435J951L497
701C521o715K769K040m670L410o85j945L753k916J389L651n403K602K703o314
716b810K969J412m605M135q20k097L847l077N36L244n096K848K233o172L626P26
732H99m318M592r12j898M463k885K84K750m645K527J346n590L791k9m146M445
$$ y = [379, -2965, -6080, 1824, -2148, -4421, 4402, 456, -1522, 4110, 806, 1587, 3102, 137, 3089, -352, -3083, 2861, -2771, -4445, 3661, -1601, -3133, 2613, -1878, -1578, 827, -1553, 1642, -147, -1388, 3906, -1478, -1885, 5483, -467, -797, 4626, -1090, -1168, 735, -2912, -348, -1626, -2305, 2435, -2575, -2044, 4442, -1813, -903, 4973, -762, 288, 2359, -1886, 460, -651, -1807, 2511, -1810, -916, 3901, -2960, -1327, 3447, -2555, -443, 1817, -2601, 231, -354, -1749, 2177, -1102, 475, 4508, -1927, 24, 3521, -3194, -425, 1615, -3055, 355, -330, -2275, 1478, -1438, -49, 3602, -1801, 801, 3504, -2810, 159, 1571, -3034, 1101, 281, -1816, 2031, -1046, -510, 2734, -2362, 486, 2719, -3453, 173, 899, -3419, 1173, 261, -1637, 2826, -59, 225, 2975, -1670, 857, 2203, -3387, 404, 375, -3771, 674]
748F74j418j739M878k954L09L194m293K612J040m897M101l48l892M560j971j737
764a881M087l278J43K860m280K281Q71m267M411m35k853M822j799j218M301l687
780G8L70K621m554J996K31m357L861j049l063M748k081q99M647l594Q97L191l959
797i16K389P03l832M019j343l072M447k916j137L606m266Q18K499m335K546R58
813A68l260M619r76k086N001k577n14L618m073O97J988m663K060J91l661L729
829B61j668k020M519k581j44L824l584J703K505l984K973M32l124L711j964k033
845a174L770l598p53L078m245J227J856l992L204O36k574M379j265j101M518l229
861G37j14L260m345J192J045m455K775j23l357L757j661j255M027l131M72L343
$$ y = [674, -744, -2483, 2395, -559, -250, 2944, -1349, 1263, 2303, -2594, 1507, 1159, -2733, 1827, -144, -1881, 2206, -1072, -929, 1931, -2349, -68, 803, -3464, 947, 512, -2341, 2481, 682, -536, 3765, 78, 448, 3069, -1485, 511, 742, -3615, 246, -803, -3866, 882, -1199, -2098, 2549, -1045, -148, 3043, -916, 1473, 2176, -1656, 2363, 1020, -2052, 2395, -521, -1658, 1948, -2318, -1500, 999, -3336, -790, 168, -3092, 1527, 551, -1535, 3466, 889, 375, 3993, -80, 617, 2605, -2058, 2, 193, -3468, 261, -1407, -3427, 1092, -1489, -1633, 2191, -1393, 310, 2815, -1169, 1804, 2236, -888, 2823, 859, -1174, 2596, -1002, -1755, 1323, -2922, -1695, 161, -3831, -627, 9, -2565, 1814, 549, -552, 3966, 737, 623, 3883, -462, 730, 1775, -2680, 95, -28, -3385, 372, -1289, -2544, 1483, -1648, -1176, 2167]
877B167l721K162J775l803L480qk933L512j830j528L139l747mK332m176J782J344
894e7l585L726K23k486M299j253q92L559l172L44K247m339J715O76l960L446p65
911b74k837M033j639j108L390k860Q98K461l739K533O95l333L626o86k535L818
927B443k215j314L053l428O01J656l621K268Q23l040L824q00j883M308j994j006
943c25L162l241O98J437l614J911K77l048L474j123j918M042k251o60L447l085
959h17Q64J880l570K599K41k901L322j338j809L734k998m05K952l498J178J581
975A015l304K581N20k577L470j208j386L486k857m7K744l720J151J415l824K600
991E9J31k728L363j000j127L171k659M33K685l482J826J547l811K531J37l001
$$ y = [2167, -1554, 608, 2383, -1420, 2060, 2052, -881, 2631, 801, -727, 2412, -1335, -1339, 993, -3183, -1401, -57, -3642, 84, 307, -2179, 2120, 867, -25, 3534, 362, 706, 2953, -1386, 329, 1005, -2955, 491, -274, -3111, 922, -717, -1825, 1565, -1295, -397, 2064, -1675, 858, 1553, -1780, 1846, 1160, -1375, 2443, 228, -1086, 1967, -1461, -860, 796, -2825, -557, 266, -2774, 1050, 250, -1633, 2675, 681, -325, 2837, -404, 294, 1731, -1883, 28, 305, -2743, 731, -392, -2310, 1732, -519, -1179, 2268, -817, 47, 1927, -1643, 956, 1197, -1704, 1618, 280, -1529, 2205, -793, -1198, 1754, -1744, -566, 1015, -2289, 292, 812, -1765, 1705, 497, -889, 2597, -260, -307, 2437, -1283, -132, 1283, -2541, 59, 190, -2538, 825, -175, -1302, 1869, -790, -357, 2328, -1154, 672, 2219, -1592, 939, 1076, -1925]
1007a925L054j107j292K454k601M56K026l545K462J360l446L256J48k843L171
1022A628p95j304K503k455N65J302l678K185Q19l544L438r9l017L403q74j429
1038a352K638j972J112J350l203K539L40l411L580l06l021L429j542j864K129
1053D46j901O38J315k656K883P3l155L857n31k401L749j215j718K158k107M61
1069a04O40k262K813l64l252L780j307k458L932j520j199K630j827K69P76k009
1085a462K801l44k105L571j631k502L584k150j387K730j918j5R21k178K374m55
1101a66j759L902j498j705L587k492r73K883k205M74J160k219J939r33j995L411
1117A411j683j430L513k669o81K615k388O61J634j769K005n43j725L167j936j062
$$ y = [-1925, 1129, 22, -1270, 1184, -1417, -961, 1065, -2480, -18, 1342, -2104, 1152, 1300, -1543, 1628, 833, -471, 2032, -423, 142, 1444, -2234, -49, 770, -2774, 664, 565, -2452, 951, 77, -1352, 1286, -686, 426, 1776, -1427, 1112, 1452, -1959, 1621, 1315, -1706, 1723, 181, -1683, 446, -1455, -817, 498, -2158, 725, 798, -2357, 1500, 969, -1432, 2317, 1102, -616, 1542, -565, -104, 536, -1726, 1087, 723, -2529, 1251, -56, -2514, 1418, -102, -1301, 1329, -498, -229, 547, -1462, 1339, 995, -1110, 2461, 830, -1672, 1912, -238, -1625, 1105, -813, -828, 93, -2085, 289, -166, -1925, 1977, 479, -1226, 2361, -131, -1104, 1779, -426, 48, 1208, -1011, 928, -5, -2000, 1411, -272, -1702, 1811, -858, -1539, 1076, -1312, -651, 983, -786, 1219, 676, -1049, 2118, 182, -880]
1133h80L261k643m84K254k994M29J420k210K050k79j278K678j723p49L051k439
1149e36K98K372k830R17J095k627J825j51j577K517j804p60K453k680M69K273
1165A254k769J591J041k427K048j23j430K545j540n65K331k814M46J575k977J815
1181AP57k453K054k54j637K504j397k13K306k179N32J508k644J794M34k419K236
1198I30n22j749K263j577n11K299k247P98J490k370J670N56k392K455n95j428
1214i30K366j667m84K077k307O88J249k325J748J47k087K418p25j412K523j671
1230c92j87J882k225J054Q97k210J802Q4k060K156p99j414K383j613k53K093k142
1247i44R61J231k288J907j0j798K110r73j332K339j954k4J653k222J047J118k028
$$ y = [-880, 2381, -262, -746, 1508, -1486, -1057, 363, -1847, 203, -76, -1354, 1324, -399, -1148, 1903, -536, -238, 2134, -696, 221, 1316, -1311, 514, 363, -1214, 1303, -501, -1261, 1192, -1488, -1019, 1254, -1515, 76, 1117, -1310, 738, 615, -815, 1730, 190, -375, 1956, -858, -412, 1163, -1814, 1, 758, -1695, 359, 105, -1532, 972, -425, -638, 1668, -511, 21, 1529, -1115, 679, 1113, -1306, 930, 408, -1341, 922, -655, -1166, 1133, -1114, -316, 1174, -1196, 474, 1030, -1362, 1093, 498, -930, 1436, -231, -715, 1362, -945, -257, 992, -1333, 415, 562, -1525, 893, 168, -1244, 1279, -392, -579, 1303, -922, 132, 1029, -1181, 621, 705, -1355, 801, 2, -1412, 971, -642, -895, 1198, -944, 17, 1248, -1040, 867, 857, -941, 1169, 196, -1136, 1203, -751, -775, 878, -1344, -297, 821, -1207]
1264a207J738R4j632K197j025q65K225j747k06J784k310J020R65k241J546j15
1280B21j729K325j286q09K360j811L85J636k065J431Q54k566K044k88j439J873
1296A136j374p67J890j986J73J421k444K638k52k073K645m94j522J665p1m68J771
1313A888k388O0J376j846J230J63j869J874n99j395K047j096l39J793j703O29
1329a75J467j983J291N73j795J700p42j146K047j647m47J574j984N56J195j853
1345a369J364N38j509J726k65j227J939j222k36J613j988M90J079j908J379k22
1361A82j482J804q87j047K533j676l2J567j748Q50R56j966J657l24j384K393j300
1378I6l06R66m83q04Q41j489J144K39j242J264J48j455J499j82j724L051j598
$$ y = [-1207, 531, 625, -1007, 1190, 165, -700, 1525, -222, -428, 1356, -954, 66, 1031, -1210, 336, 221, -1508, 817, -469, -1278, 1082, -729, -344, 1292, -773, 658, 1512, -1054, 990, 702, -737, 1136, -238, -1005, 885, -1101, -928, 493, -1951, 687, 435, -1638, 1007, 513, -1009, 656, 585, 117, 1888, -500, -440, 936, -910, 320, 483, -1386, 488, -111, -1506, 541, -555, -894, 899, -804, -175, 1292, -691, 600, 1173, -622, 1078, 336, -810, 1237, -410, -857, 717, -1267, -711, 484, -1369, -5, 533, -976, 750, 485, -742, 1197, -25, -261, 1352, -636, -146, 933, -975, 404, 182, -1300, 504, -383, -1430, 1103, -573, -605, 962, -786, 64, 1020, -946, 711, 387, -997, 1396, 96, -210, 756, 273, -531, 310, -1179, -35, 204, -1038, 226, 374, -1081, 418, 236, -1488, 1563, -35]
1395c5k68J489j891R50K91j471J282m43j013J490n65j011J813o78n85J650j898
1412h93R32M54j498J561l14j270J958j200l74J798j451J66J210j613L57P72j488
1429h93J434m77r13J581j065n42J646j518P11J174j848R96L59j543J525m02r66
1446g41J543q87n73J425j368K23J330j817R04O48j493J211l47r61J673j096j21
1463d47J482j515M84J041j824J053N33j504J233m30q73J433j222n7J300j559O91
1480a81R84j663R06N20j328J314l39o57J286j119j84J266j480P72Q33j916J221
1497B35L63j586J280k33o42J304j060r0J222j348O60P44j618J090L86j386J123
1514D44m14o28J306j099P6J104j586Q74M74j497J274L08j522J385l57q66J275
$$ y = [-35, -303, 1186, -705, 245, 536, -935, 347, -96, -1109, 381, -184, -1195, 618, -60, -645, 1005, -893, 39, 493, -1005, 556, 242, -1028, 930, -270, -644, 1154, -297, -131, 1079, -534, -177, 595, -893, 541, 64, -849, 732, -333, -875, 771, -747, -36, 1138, -710, 286, 645, -898, 627, 225, -741, 802, -85, -658, 767, -601, -378, 952, -865, 39, 687, -806, 405, 58, -903, 770, -326, -447, 1035, -480, 4, 1045, -779, 274, 807, -697, 536, 106, -767, 666, -556, -613, 687, -872, -181, 803, -860, 46, 566, -762, 552, 213, -444, 842, -277, -461, 805, -675, 97, 930, -986, 235, 598, -988, 292, 59, -583, 721, -339, -429, 793, -555, 105, 849, -769, 321, 707, -679, 444, 30, -598, 708, -391, -315, 789, -797, 77, 551, -946, 328, 636, -886, 499, 142, -724, 551]
1531E51r49J75J054j367P94M55j622J333J18j421J406m30o09J099j032N6R98j191
1549e82P23L60j385J190K8j363J539l40n24J181r89M4P64j250P73L88j380J294
1567D71k19j242J357l87o69J197q42O5Q42j102P76L84j234J241j71j047J374p48
1585D6o25J178j054L05N63j226Q81J24j183J281k48p42J382o37m52J139r72L35
1603I5P46j202O13K17j550J323n01o38J356j149pJ543j676P59O48j145J414p75
1621G1n65J212j87r21J256q43l18R63q03J89K22j204J053J50j320J357k60o71
1639f19J352j311O36P96j200N88M93j565J329N5r23O92k46o88R91q06q3R33j084
1658f60N17N86j058R83M4r64J188m40p00J083o57JP20j149L27N44j107R35m1r60
$$ y = [551, -398, -223, 831, -536, 258, 713, -909, 424, 542, -879, 527, 97, -512, 587, -445, -389, 609, -582, 141, 501, -884, 306, 334, -1029, 510, 170, -354, 827, -162, -118, 646, -604, 169, 557, -823, 471, 252, -990, 367, -20, -689, 508, -334, -269, 573, -529, 247, 631, -603, 638, 467, -580, 794, 46, -579, 599, -455, -150, 413, -813, 68, 192, -991, 290, 42, -700, 682, 45, -407, 732, -240, 95, 841, -361, 252, 469, -1081, 242, -259, -897, 459, -690, -697, 846, -830, -71, 577, -568, 846, 71, -494, 718, 531, -390, 866, 23, -295, 668, -135, 54, 276, -928, 125, 275, -1045, 312, 52, -619, 733, -578, 58, 854, -346, 242, 735, -830, 499, 554, -369, 323, 77, -611, 380, -426, -509, 424, -660, -143, 443, -615, 368, 412, -552, 636, 196, -504, 579, -78, -77, 643, -506, -179, 365, -742, 193, 152, -808]
1678h08J249m30n18R25n91qQ82r20M21L55j120Q67p3r18J201n91m78J064p52k3
1698b66N64p09M94K90r16R43k34o78R89m79m76J117p90l0P46j088N90K54r57Q92
1718B56j45o92J188o88l09J042q36j0O67r44M75K90r26Q78j11o66J111n48m46
1737d14J047p82J21N87q95M50J57q81R15l46n57J037p29j41R13q24J36P02r33
1756d37O31J27o93Q32j55o63R40o69j40P00q83K88N87r39M88M2p89R80k26n32
1776e11R63n82O1O91q81L63N16r77N40J26r33R44m12n45Q94n06p0Q18q92M39L68
1797D14q34N65L08q47Q49k62n16R08o51j03O62r15L26L59p72O33Kp43P08j16l88
1818d13Q40n91J7P56r29M15L30r14O61J32p93Q00l54l45P65o47l3O28p23M18M11
$$ y = [-808, 441, 11, -507, 418, -173, -181, 701, -219, 202, 557, -563, 304, 231, -687, 514, -77, -555, 509, -243, -266, 298, -411, 83, 373, -543, 400, 166, -512, 477, -2, -478, 639, -151, -181, 565, -523, 67, 321, -636, 256, 111, -581, 607, -81, -390, 652, -184, -194, 473, -471, 4, 294, -632, 246, 135, -531, 580, 32, -414, 633, -149, -28, 559, -336, 114, 271, -610, 305, -41, -598, 439, -290, -431, 482, -342, -206, 496, -437, 194, 321, -372, 460, 305, -358, 582, -87, -227, 473, -410, -122, 465, -474, 14, 56, -733, 247, 21, -511, 452, -130, -69, 622, -259, 104, 620, -357, 183, 309, -624, 320, -92, -637, 257, -249, -319, 499, -393, 46, 414, -420, 145, 453, -394, 455, 193, -323, 585, -66, -169, 493, -422, -96, 263, -509, 124, 126, -617, 91, -25, -413, 427, -164, -147, 609, -320, 95, 425, -489, 172, 304, -489, 311, -43, -388, 377, -270, -303, 325, -398, 20, 431]
1839D31r10O76p7n56P32l05k83P16o53J73N43p87M59K57r09P12Qp04R29n40j73
1860b61P05o21k4O08o73M36J57o69O74k06n42P78l14l54Q60q47J07N99p28L29
1880A4K07p86Q18j66m96Q22m73k81P46o59K94L69q16O25J81p38P84l84m11P43
1900C93n59j98P46p10P7O43q29N24J21o10Q28l47l62Q27n45j58P13o78R7L54p62
1921d35M53J54p10P93l23l47P39n46k43Q51o31J96M26p16N60k1m70N57k54m83
1941d50Q93o12o7N74p80L36M17p14N91p2n58O92k27l53P42n79K6N74n20P2K44
1962B29n99M42N9o77O93j10m00O01m80O0P08q72L50L86p01M96on21P08l28k67
1983b29O56p14J65L98o41K73K91o07N35j41m44Q11l35j12M43l35j08P13j265Q23
$$ y = [431, -479, 197, 120, -436, 296, -9, -292, 424, -229, -56, 487, -300, 159, 416, -493, 219, 227, -477, 452, -88, -261, 444, -177, -201, 407, -266, 170, 327, -342, 332, 126, -416, 362, 48, -306, 554, -293, -186, 413, -315, 14, 221, -565, 253, 87, -409, 413, -60, -341, 405, -254, 40, 409, -407, 218, 399, -339, 445, 61, -350, 393, -166, -364, 382, -328, -251, 392, -437, 87, 208, -402, 426, 79, -283, 544, -1, -159, 554, -124, -27, 327, -435, 18, 172, -538, 255, -68, -415, 324, -222, -465, 386, -245, -49, 377, -339, 221, 200, -270, 287, 33, -450, 443, -169, -236, 338, -442, -106, 311, -403, 188, 116, -442, 250, 23, -330, 412, -167, -141, 433, -87, -15, 229, -370, 72, 131, -546, 147, 37, -363, 238, -242, -182, 526, -346, 4, 390, -311, 185, 179, -342, 366, 38, -229, 427, -287, -122, 276, -365, -92, 199, -408, 127, -14, -458, 353, 18, -94, 349, 14, -94, 619, -646, 177]
2003A77o1o54O03k58j60O00k33k41O40n46K5M13n02K02J06m42N02p7m12N44l61
2024a35k46O92m97J49M18o84L44L83p41K93k3k88N46k24l34O87n43P3K83j99L46
2045C00n55J08M69k17m27P08m97n7N25n65K21L10o41L71J60n77M99k48k57N88
2065B18l32j5N01n38P0M92n85J61J51m90O30k37k38M23m54k4N46o27K43L64o05
2086c46M02R1m11M26kl59N42m26J15K83n41J24L67o01L48K14o12N34k30j94M80
2107B04l70K4M01m69K81K23m30K56J3l74N51k13l98N91m54l0L78n24J75L02m05
2128b68L39J5l50L52j31j32M41l84J06L82o82K93K57m99K55P8l84L95j42j71M58
2149B28m27P4L73n25K77K42n34M54K3l61L69j42k88N46n13J85K81n29L95J51o55
$$ y = [177, 116, -538, 65, -193, -353, 247, 14, -227, 413, -133, -108, 305, -197, 5, 111, -331, 171, 94, -318, 226, -135, -381, 311, -186, -37, 381, -303, 41, 424, -317, -24, -47, -335, 211, -13, -347, 340, -203, -130, 153, -46, 300, -255, -147, 322, 105, -322, 386, -111, -168, 357, -208, 13, 323, -318, 53, 213, -364, 135, -113, -370, 218, -114, -129, 372, -166, -96, 396, -189, -28, 123, -367, 263, 26, -212, 211, -243, -267, 279, -348, -105, 259, -346, 56, 147, -264, 162, 160, -199, 343, -83, 32, 315, -226, -102, 265, -336, 12, 226, -386, 148, -82, -276, 204, -166, -142, 259, -210, 71, 294, -136, 120, 133, -241, 310, 97, -301, 290, -164, -194, 184, -340, -165, 137, -268, 71, 86, -264, 88, -43, -175, 266, -118, -12, 370, -312, -19, 238, -261, -6, 72, -312, 83, -59, -230, 228, -199, -125, 248, -277, 0, 242, -292, 162, 185, -176, 193, 51, -237, 309, -204, -19, 262, -267, 128, 279, -376]
2170c76M53O0l98N36j91k16K36k86J64J69m09K89K60n23K52M6l99M84k08j05M74
2191C12n61K7M23l57J02J80n20N28k7m20L85j9k58N54n59J74J85l00K66O1m10
2212b34L71n3l78M66l46p4M92m16m0M38m40K73Q0l07L98n8l93L56j04j20K65k72
2234i6N0J51l01J83J29l51L90j38l08L97rk00L64l38J39K00m80L46M2l53K34q
2256D3l85N31l60L2K90m21K20J35l05L17O0l58L34m8k38L80k22j34M25m47J92
2277D1O2m39M06N5l91L44j08j89N41l61N6J28k44J89O5k51J56R6m00L90j24j07
2299h5K20l33J55K28l25J36J69l78L41l6k10L16k56k28L54j03K9L17n42K18K16
2320B03l72K13O8m69M76j47j70K36j44o3M02m25J78J84m37M73j70k54L76j32k10
$$ y = [-376, 77, 137, -261, 275, 84, -132, 104, -182, -18, 151, -258, 31, 291, -232, 20, 66, -333, 151, -57, -162, 312, -249, -222, 201, -156, -54, 126, -394, 134, 107, -313, 72, 53, -205, 349, -210, -36, 149, -151, 115, 176, -234, 137, 84, -294, 172, -174, -248, 244, -172, -212, 226, -214, 59, 139, -168, 230, 172, -221, 135, 31, -89, 176, -96, -46, 105, -196, -13, 116, -235, 155, 17, -291, 106, 97, -103, 261, -77, 62, 262, -218, 128, 170, -183, 51, 43, -342, 189, -171, -139, 151, -270, -50, 85, -220, 97, 157, -201, 133, 85, -153, 227, 5, -129, 296, -151, 41, 103, -336, 70, 125, -266, 78, -30, -219, 322, -39, 17, 145, -99, 90, 155, -96, 60, 156, -244, 146, 22, -85, 135, -198, -43, 185, -140, -4, 165, -213, 128, 92, -118, 198, -58, -286, 68, -35, -6, 311, -231, -13, 203, -169, 44, 112, -357, 119, -28, -198, 38, -106, -169, 233, -192, -14, 170, -267, 206, 36, -218, 158, 26, -184]
2341a84L39j54j68M22m18R7K52l43K91o0l59L88j44j70M15k76P5J20k75L23L1
2362B02l93L06N4l32K92j41j56M34l71J8J16j38R2J37k65K59o6k89L77j64l3K69
2384B08k18k6L20k56R4j2k54K79r1k12L35k00j17L25k92l3L14k61M1K27k05K58
2406B24j24k70L32j43j92M77l90j2J97l01K26N0k33K82m2k58L57j97j19L41l22
2427a17J67K29k75K0L3k89L46j31o5K45k57j29L08k41J46J30j37j6K49l56L02
2448A62k9k24L76k55k21L18k44R1K7j66J16J11j97K46Mk80K38m6k1J71j84K8K27
2471B48m36K71p0j93K78q0k03L16j40p1J19j17P7J86l43J31J09j96J51n9j08K22
2493I2j70m8L42l05K08n2k73L20p8j07J65J9k42J93m4q7L05m06J27J75k34J06
$$ y = [-184, 155, 1, -167, 255, -163, -66, 186, -157, 134, 74, -285, 103, -41, -211, 204, -72, 3, 123, -152, 171, 202, -191, 115, 169, -163, 129, -12, -168, 266, -105, -87, 29, -109, -17, 120, -145, 114, 48, -241, 136, -28, -61, 208, -10, -36, 284, 28, 122, 110, -144, 135, 44, -168, 167, -33, -150, 175, -117, -150, 164, -97, -56, 171, -34, 224, 100, -170, 162, 19, -173, 304, -86, -98, 99, -202, 24, 74, -159, 123, 81, -177, 180, -17, -136, 205, -117, 50, 279, 4, 24, 57, -232, 114, -17, -82, 163, -94, -223, 85, -156, -10, 120, -17, -33, 216, -140, 162, 133, -91, 285, 30, -191, 127, -117, -26, 1, -165, -49, 62, -135, 111, 115, -165, 73, 27, 6, 177, -7, 21, 248, -188, 83, 13, -180, 98, 18, -185, 131, -9, -80, 39, -78, -1, 185, -158, -27, 82, -114, 37, -22, -130, 92, -78, -126, 216, -89, 119, 67, -206, 114, 36, -71, 94, 113, -129, 64, 20, -67, 238, -168, -41, 134, -100, 6]
2515FJ48j63l36M58k76j9M54k78ko6p7L68m57K95n9k1J19o2k02K50j21m3J86k08
2539a06O0K00l74L14K0k80K62n8j92K82o1j07M7r0J66Pj27P3N2j80K60r3j89K58
2563A44j46n1J86j84n9K1r4J58O7k11L08q7j96K36k86J65K13j65N9jj20K28j46
2586C9k18M30k53l8J32j34j07K75k83K84K00k44P5p5j98L04p7j43K04j22Oj5j4
2609B8j4J9j62K46j20j21K62k07m4L17j26j92K93j85OO6k47K57M4k36J17q2L3
2632d8J54j44n7K31k39J79N1k14J58nj88K28j60j37M26l10J40N0k49K03k4j63
2654a18K26nk92K74j01j44L31k16j3J51k76Q2K14k89K76J5j99J88j00PJ28k95
2676a56J50L05m20K05m1k61J57R0k16K45j9k38L46k30K9K82l72K04J3k76L74k24
$$ y = [6, 154, -9, -345, 113, -163, -182, 272, -6, -8, -74, -151, 217, -240, 55, -4, -25, 94, 32, -170, 80, -41, -84, 102, -106, -46, 154, -220, 94, 114, -166, 96, 38, -154, 128, 67, -40, 7, -83, 83, 90, -37, 36, 88, -92, 168, 75, -114, 144, -2, -53, 133, -51, -110, -89, -183, -25, 42, -169, 139, 52, -144, 92, -194, -29, 184, 19, 78, 77, -43, 185, 39, -179, 251, -2, -40, 92, -42, -149, 126, -157, 127, 327, 83, 158, 83, -115, 189, 112, -31, 173, 51, 57, 42, 28, 14, 33, -129, 117, -3, -124, 138, -69, -113, 204, 78, -114, 179, -6, 0, 66, -181, 76, 120, -116, 1, -81, -48, 106, -38, -95, 136, -103, 76, 127, -87, 71, 66, -122, 106, -54, -191, 235, -75, 65, 115, -134, 69, 45, -118, 108, 103, -189, 85, -16, -160, 171, -45, -58, 93, -183, -101, 113, -176, 100, 115, -84, 104, 4, 11, 139, -156, -6, 299, -121, 84, 43, -218, -61, 29, -187, 58, 39, -199, 147, -83, -54, 228, -144, 60, 73, -203, 171, -53]
2698e3n4J59Mj46K33l43J13J92k53J72O1k82K81j24j3J89j60o2K82k98J60R7l08
2721a53J90R7l36L55j16k35J60j07K6K26l56K47Q2k53K59o2k48L48m4j58J69j51
2743f0R0M8j99K03k1j18J5R1k20J59Q5k69L14r5n6J85k86K17j5j94O8K03k17J33
2767F1j34j11K54p0j27J78j91P6J21j76K04l3j65J71q5nP6J1J8Mk50J91N2k34
2791a64K38q8j47K22j4k27K80k10Q2J70k58J37J08l07K11N7k45J15J36j04J32
2812A24k64N1J30j47J60K5k22J60J4r7O1j0j0J35j49J6R2j74J17J0j22R0J45k19
2836h4J76n0j53K10j38pJ49j93J36n7j91L71o8j46J28k7n2R3j61N4J23k49J37
2859AK5j67J32O2k79K59n6n8J78k78K54l7m7J75j11j19m3Q4k7J85j78j05K30j97
$$ y = [-53, -107, 52, 56, -90, 143, -200, -87, 105, -148, 24, 85, -197, 84, -40, -53, 136, -24, -86, 196, -102, 58, 155, -153, 37, 134, -202, 153, 37, -198, -38, -145, -119, 107, -249, -2, 80, -173, 86, 24, -224, 124, 80, -78, 91, -60, 30, 78, -121, 82, 61, -57, -42, 49, -171, -12, 73, -196, 118, 23, -33, 152, -134, 83, 68, -126, -58, 145, -72, 61, -73, -184, 70, 0, -127, 51, -140, -64, 57, -119, 85, 52, -113, 58, -27, -32, 44, 55, 73, 77, -173, 18, 70, -164, 74, -14, -161, 61, 47, -180, 100, -110, -28, 142, -116, 21, 129, -178, 33, 90, -155, -40, 96, -8, 124, -140, -89, 41, -106, 54, 79, -143, 17, 31, -66, -5, -15, -25, 110, -39, -23, 69, -105, 12, 22, -100, -10, 135, -84, 92, 42, -111, 99, -39, -46, 103, -90, 46, -11, -202, 169, 101, -45, 83, 56, 4, 97, -64, -10, 113, -136, 1, 26, -141, -9, 53, -226, 33, -23, -81, 97, -181, 73, 36, -11, 164, 53, -66, -109, -25, -52, 133, -45, -150, 80, -117]
2883a17J34Q8k82J19J26k34K28j4j39K45q1j24J93o8j02K04l00J53J05l13L46
2904A67j93m3J93k12O1K56k08qJ61k56R6O4j30J01L8j31K21j96j12L01k47J8J88
2927A29l30K77j96q4K48J23l83L12j21k3K73l18L8J04j40N8P7j96J56j5r9J61
2949E1k24J35J45k56J47J14k23J08J58j68J3J9o0J94j79L9R8k89J12J80j80J18
2971E2n5J08J5j00j77L53k32O3J76k94O1Q0j01J15Kj36J82o9l3qj48oK51k17J3
2996a05J79j27Q0M3k21L07q5k10K74j33m7K22k84JK12j64M6n3p3L24k24n1K33
3019A44k37O3J55j77J8J51j86J81r8n9J17k6j48J87k07J31K21k80o3K68l01J46
3041@L7q1J49j78p5L16k58J47j5k17K33J54k95K24p1k24K12k25J04Q1q9jJ19R
$$ y = [-117, 17, 105, -177, -58, 68, -166, 62, 48, -91, 154, 73, -51, 142, 74, -28, 176, -124, 29, 134, -179, 167, -26, -69, 124, -88, -27, 229, 21, 13, 174, -82, 14, 78, -52, 49, 87, -44, 177, -19, -131, 170, -77, -59, 129, -201, 76, -120, -204, 44, 167, -216, 96, -25, -48, 225, -93, -55, 49, -91, -33, 44, -152, 4, -11, -110, 51, -173, -38, 107, -149, -2, 112, -111, -3, 155, -13, 0, 19, -41, 153, -26, 13, 111, -178, -66, 114, -66, 52, -3, 105, 120, 20, -157, 196, -36, 27, 203, -91, -30, 50, -51, 64, 66, -70, 112, 43, 10, 2, -146, -152, 99, -118, -105, 74, -53, 27, 70, -151, 156, 71, -139, 135, 2, -45, 177, -107, -106, 106, -58, -12, -65, -138, 186, -38, -89, 144, -93, -30, 125, -52, -34, 117, -69, 112, 14, -45, 72, 46, -102, 85, -122, 9, 230, -50, -113, 155, -146, 0, 37, -44, 105, -73, -148, 168, -90, 57, 42, -175, 58, 212, -83, 141, 70, -154, 58, -167, -63, 18, -71, -72, 47, 56]
3065E6o4O9l55M39n8l07L45j68KJ77k72J39K05k81M0L2K8N5k2j58K05j72l9J69
3089F5j99O3K48k98J65P8k50J00M8j60K52j17q8K05j34rJ75k87J72J2j29J40j73
3112a21J6K66k32R8N0j59J41R6l01J99K1k25K17j42p4K39j48o1K03j41oJ49j88
3135a03J25kk21L07j23l9J53j90J57J32k72P2L1j36J41Q3k22K07j64p8L69l10
3157h3J1K14k37J52N5k16J35qj51J43j52O7J81k37J11J07k14M9J08k00J82L2k39
3180a90L38n7k31L49j59j07J64k57K40l4j51J19q6p7J94j8q6J03k39J15K16k82
3202a36R7J53k27K80r6l06L72o6j47K40j62l4J78k34J15O3l58L69K1k98L32j48
3224Hl6J25k14J21Q4k49K11l6k00K85K5j94J90j73l1M5j97J81J24j31P9n0n1K05
$$ y = [56, -8, 61, -294, 145, 87, -220, 125, -43, -41, 136, -136, 3, 208, -73, -33, -1, 27, 82, 60, -98, 107, -65, -104, 65, -134, -71, 177, -121, 44, 122, -128, -28, 20, -140, 112, -5, -93, 112, -22, -31, 144, -143, 29, 41, -88, 52, -121, -105, 161, -71, 27, 77, -82, 59, 155, -146, 53, 74, -151, 66, -76, -150, 89, -59, -120, 83, -58, -64, 85, -103, 22, 20, -201, 106, -17, -56, 97, -93, 64, 196, -76, -4, 27, -109, 32, 115, -107, 100, -64, -142, 227, -83, -72, 142, -95, 57, 112, -104, 31, 23, -128, 15, -137, -70, 111, -126, -15, 92, -122, -73, 35, -165, 17, 49, -190, 148, 91, -140, 209, 50, -57, 107, -150, 90, 56, -95, 24, -62, -139, 55, 37, -49, 54, -185, -70, 146, -136, -39, 114, -113, 167, 71, -235, 137, 71, -76, 164, 2, -32, 146, -88, 27, 90, -268, 101, 122, -176, 156, 8, -28, 97, -117, 4, 88, -161, 50, 14, -186, 99, 124, -70, 120, -53, -84, -39, -236, -55, 69, -62, 17, -33, -84, 121]
3248A21j26o3K50j56o8J88j39j16K10j71N3O7j36N0M9r6J89k66R9K33k28R4nk21
3272a88K38mj16L1k1q4K28k01n1L34l39J37J40j62J56j37r8K56o9j25J87o7l3
3295A2J88k69P6P7k08K19n9p3J22l3j97K38j71J15M9j07oL7j82K34K3k95L64k10
3319e6K1K74l97O6J73k65J23J02j22J07j00l8K05q0j08J31j65N3J92k45J47K9
3341D7j71J79ok8J23j21q2J94j85j9J35k24K66J9k62L27j47m1K3K5k06K84j76
3364d6m1J66j66K64j36j34R0N8j73J86l7q3K61k84J37N2k13J65J1r2K71k30j3
3387A3J80k94M3J81k35J41N8k40J70mj01J29n5n9J69j38N7K03k89qK14k96M01
3410B40j91j78K53l3n08M45n2j54L99l10J54oj98K23n1j69K26p1j10J61Jj57L17
$$ y = [121, -5, -68, 182, 26, -42, 146, 7, -109, 101, -70, -17, 50, -86, -36, 13, -83, 106, -160, -61, 172, -56, 38, 33, -188, 50, 46, -70, -39, -60, -144, 84, -117, -168, 166, -173, -36, 104, -58, 98, -39, -137, 119, 50, -75, 112, 45, 12, 200, -69, 7, 84, -124, 95, 36, -37, 85, 52, -145, 93, -78, 37, 86, -21, -27, 10, -172, 62, 85, -210, 154, -56, -35, 239, -158, -92, 81, -184, -61, 41, -81, 26, -74, -112, 93, 13, -95, 36, -129, -76, 116, -129, 18, 47, -124, 55, 49, 21, 144, 23, -59, 135, -50, -69, 66, -158, 108, 127, -135, 192, 45, 4, 27, 52, -154, 130, -46, -87, 79, -87, 177, 41, -93, -3, 55, -118, 68, 31, -52, 209, -75, 62, 114, -99, 66, 77, -15, 256, 26, 13, 193, -101, -58, 123, -112, 29, 87, -153, 17, 13, -88, 41, -14, -73, 96, -42, 15, 218, -71, -79, 135, -161, 240, 49, -129, 124, 91, -417, 28, -24, -178, 221, -89, 65, 59, -139, 84, 33, -136, 90, 19, -91, 70, 71, -86, 231]
3433B31m35J34J88j57J42j27p0nJ84j96L02l22%L12l82J70K33k57L21k51j73K11
3455E3qr5R7j3j36K06l15K71j4j49n6P5l3L16j50k86O47m47J23l87J37J77K0K31
3479B64j31n49L31J64K43r56M78J84j30M12l07Q38j267j7P19J06p34J29L0N4K45
3500A06k49l41Q66m02MQ5k84L32K61q00L72K7j79N05o96O01q1k86J55J60l20K33
3522F9j39J12M9j12RJ53k07n0L43m04L30N7k29L7j12O2L26j48l15M11n79L1M75
3545A69l8J66l58k19K37j04o3M66m29JR6o03K40L01L5P14l45n48M58m81r4n21
3567i20O90J047q84R6k38j43L03L24n65l25R05O18q65L40n03M19o0m82n7o0N64
3588B04l20k24l3J94m7K80J72l92P0K06m74M15L6j22J87j64r8J87r4q3K45k48
$$ y = [231, -204, -70, 118, -39, 103, -24, -94, -99, 85, -111, 191, -131, -131, 181, -201, -31, 202, -55, 266, 15, -158, 53, 45, -50, 47, 34, -102, 104, -211, 60, 46, -103, -159, -84, -117, 199, 49, -237, 410, -37, 86, -301, -164, 13, 33, 264, 133, -416, -85, 79, 322, -634, -156, 28, -102, 310, 3, 841, -426, -443, 276, 382, -352, -223, -193, -139, 106, -143, -484, 382, -20, -16, 69, -215, 117, 378, -422, -50, -23, -202, 303, -393, 208, 127, -159, -4, 156, -164, 69, -70, 42, 91, -21, -12, 141, -66, -116, 227, -177, 153, 210, -19, 18, -94, -32, 294, 146, -169, 242, -337, -306, 169, 131, 297, -61, -280, -43, -147, -210, 256, -173, -172, -76, -679, -439, -138, -103, 611, 266, -282, 176, -305, -399, -920, -230, 817, -67, 29, -209, -352, -49, 275, -290, -615, 290, 908, 43, 383, -120, 299, 239, -243, -300, -360, 204, -116, -340, -373, -179, -226, 54, 226, -166, -96, 110, -364, 51, 87, -35, 152, -12, -110, 77, -17, -100, 145, -103]
3610a03M6Q9j27J53K5j07P2o2p1J80j50R2J06k08P3P8j40J06J07k73K22q5j01
3633g8N3No5K94m58K03J32j47K32j08j61K03j38K6J59k90J19P1j84J26J1j46K22
3656H1n9j99K98j32j88L30j32q2K03k28J19Q7j80R7n4l2J36M8j85K35j58J4L9
3679E8j71J13J05k21J14l4n6J25k2j42K50j75k28N44l59p6L19l75L04J27k03K27
3701B24m8k8l44K92K2L69o95J09K84J08l90L04l7n39P64m87J1l75O32L81q97L37
3723ck0NJ10j02p6J86j58m1J87j33K7O0j12N4L4j47J59M9j21J45r9p6K40k01p
3748d0J97l01L31j22j44J31j1j26K31j39o0J93k39J15N9k20J75mj15J49q9p1J79
3771G9j47J03Q4k03J33%k33K05J38k72J58l9q5J11K1r2J28j64qK58j84k5J06k54
$$ y = [-103, -57, 32, -95, 58, 83, -24, 48, -14, -85, 95, -55, 37, 143, -65, 8, 86, -54, 52, 159, -114, 108, 23, -78, -25, -20, -85, 209, -249, -46, 86, -61, 171, 63, -98, 105, -33, -7, 152, -138, -19, 52, -132, -6, 5, -141, 81, 22, -177, 121, -11, -199, 131, -1, -83, 120, -108, 11, 98, -82, 15, -39, -71, 65, 113, -72, 163, 5, 19, 58, -113, 0, 105, -116, -2, -36, -92, 33, 11, -131, 119, -56, -284, 260, -99, -175, 144, -231, 73, 200, -3, 224, 176, 148, -196, 96, 118, 487, -208, -99, 185, 293, -97, 207, 170, -369, 395, -92, -81, -456, 176, 557, -340, -3, -23, -18, 92, -10, -86, 100, -58, -99, 88, -45, -18, 42, -70, -16, 18, -129, 30, 79, -42, 103, 4, -72, 168, -33, -40, 157, -144, 187, 65, -79, 52, 41, -85, 146, 7, -53, 140, -99, 16, 75, -145, 30, 26, -89, 60, -29, -100, 79, -68, 35, 119, -84, 49, 49, -184, 21, 159, -113, 45, 6, -79, 32, 53, -39, 89, -75, -83, 175, -9, -34, 72, -182]
3795a82J74J28k22J71j85O2K03k81J29K4j73J74O9j74J33p8RJ8j42K8K39j62j7
3818e5P3o6j5J07j34J23r4m6J72j09K6N1j10L6Lk7J62n9q3J94j11p8N5k6M4N3
3844H6j16m1J83k01J15O0k44J69nq7J43j58R5J07j78M0J40j30K1n6j23J88r0p2
3868a54J45j34J09P5k52J60L4j53K61J0j02P4j83J03J95l38J15R9k28J84j5j60
3890a55J61o6q0K15j01k2R7j09J8J97j97J83r9j25M5kl1J64j33j57L74k51J27
3913E3j7k32J88jl7jKn4J17M7KJ01l42J58J97l85K67Lj41J95j50j5K14k05q1J79
3939F2j20Q6n3r8J77j4j59K15j36m2J79k12M9J66k18N7K4j64K69%j17K43j18k7
3963D9J9r5l1J56k15K01m7j08J39m7pR5j01o1K42k81J45R1j76J0J13j64K20r2
$$ y = [-182, -8, 120, -102, 69, -116, -54, 149, -132, -3, 21, -152, 22, 91, -83, 50, -28, -19, -1, -143, -115, 124, -38, -55, 18, -48, -63, 44, -90, 33, -61, -107, 65, -44, -18, 33, -77, -41, -38, -65, 97, 38, -45, 149, 38, -40, 15, -11, 33, 86, -30, -71, 112, -89, 26, 86, -158, 11, 6, -81, 62, -96, -1, 106, -72, -32, 108, -22, -1, -57, -180, 8, -82, -154, -9, -143, -34, 41, -211, -51, -17, -170, 91, 101, -1, 73, -110, -7, 188, -150, -35, 64, -164, 20, 5, -155, 6, -60, -140, 75, -26, -48, 49, -60, -42, 155, -42, 141, 42, -83, -38, -40, -71, 93, -40, -197, 177, -74, 53, 36, -196, -8, -9, -46, -47, -45, -99, 18, 65, 67, 168, -174, -16, 181, -204, 63, 66, -75, 120, -30, -45, 169, -36, -117, 62, -58, 28, -25, -123, 54, 40, -119, 96, -40, -82, 97, -115, -66, 100, -118, -61, -37, -201, 68, 68, -49, 194, 76, 49, 68, -27, -58, 98, -117, 84, 37, -71, 68, 21, 14, 109, 8, -53, 189, -92, 53, 144, -32, -22, 91, -73, 147, 55]
3987E5j5k3l7oJ43j95P3R7k21J20N3j25J87r4j20K33j41j04J68j21J46P2k99K29
4011G5j5k27K46l5m0O6j9r3J81k06R9N7k38K53j1j12J8kj56K90pj33P3j95J21
4036a0Q1k19J77K2j02J46r2j25J97j05n0J01j74J47J27k01Q1Jj3J65j57n9J38
4059G6m2l5R0k16K47Mj67J20l2j63K18j36n3J53j29K5J39k29J88K5j00J16rj85
4083i5J29qj65K17l6n8J8j13J15L0j30J69r1l4N8Oj3lr9Q2P2j57J12L5o9P7m1
4110Hj45K34j26k9K5n6J08L6k09K05l7j29K55o9j27K01j39j16K23k18J03J00l9
4133E9M2j40l8J38L7j83Q6j18K2K12l24K19J05k46K24m2j25R7Jr2Q2N1r5Q1m6
4158GLJ8n7Q0n5j69J89j2j8J15j17k2J63j38R9L2j91J81p0j08J73j98J4J67j26
$$ y = [55, 40, 17, -20, -26, 117, -78, -5, 92, -129, -9, 44, -81, 106, 12, -108, 125, -16, -120, 48, -73, 73, 145, -154, 75, 60, -167, 79, 44, 4, 70, 51, -42, 139, -67, 32, 89, -149, 104, 93, -19, -1, -3, -159, 131, 124, -9, 64, -131, -10, 71, -148, 29, 51, -51, 95, 3, -122, 75, -30, -80, 21, -153, -6, 121, -80, 1, 2, -11, 154, -3, -62, 76, 34, -1, 89, -127, 120, 124, -43, 77, 45, -118, 100, -36, -89, 64, -65, -40, 99, -130, 58, 83, -17, 99, 90, -95, 34, 26, -139, 78, 42, -16, 2, -111, 4, 34, -96, 73, -18, -52, 6, 12, -1, -4, -103, -21, 51, -106, 6, 41, -28, 49, 8, -137, 97, -29, -58, -33, -89, 19, 55, -154, 51, 14, -115, 140, 71, -56, 145, 6, -110, 113, -105, -2, 98, 59, 101, -39, -77, 61, 98, -85, 1, -117, -95, 117, -207, 12, 117, -129, 95, 53, -72, 25, 26, -66, 16, 67, -28, 53, 7, 10, 28, -29, 51, -4, -173, 16, 4, -14, 101, -16, -38, 125, -13, 86, 118, -73, 108, 38, -70, 103, -95, -81, 86, -40]
4183d0l3J29k04J58j8O0Pj60Q0M5O2j67J75j65l4J77o1m3J07j10m6o2kJ62n1J5
4209a9P3m2J3J38k73J24J91l38J03J69j98J25q1m6R6j00K6J55j81R2O5k87K53
4232E8m6j38P7L0m7Q0j00o9K73k13N8M2n1J17M5j70J00l1o0J71j90JJ26J1ROj97
4259a08L16j01j80J17kj45J64m1j38Q0o3K9O3n9L1K19k40K07j28q1J81k18J2J54
4283F9j67K32j25o9J55l9j73K23q6oJ30j11o3J96k82K50o6k32K82l5j01J37j85
4306f6Q3J19j53J58j1k17J65j64O0Q4j39o1K09k07k9K71k44J57J2j12J59n9q8
4329g3J52j04K3M0l8j42K42j46N2J34l79L57j64M8J43p5j19J38r1o4J67j39K1
4352a7R0k59J67k1o8J26k8m8Q4p9K6L9r7J01mj64L00j16j37K30k10J8J97k00K1
$$ y = [-40, -73, 56, -148, 10, -8, 52, 59, -101, -21, 24, 86, -81, 94, -71, -105, 72, 11, -32, 75, -35, -81, -143, -145, 17, -34, -19, 54, 12, 25, 163, -110, 14, 205, -133, -30, 139, -59, 66, -15, -61, 35, -65, -39, 116, -65, 27, 92, -195, 58, 12, -126, -49, -19, -66, 14, -86, -155, 118, -95, -37, 5, -46, 71, 116, -54, 46, 15, -45, 126, -64, -63, 63, 74, 83, 89, -108, 208, 107, -73, 44, 42, -103, 61, 20, -118, -38, -101, -72, -9, -68, -37, 182, -58, 149, 21, -60, 121, -97, -85, 69, -98, 134, 9, -60, 95, 56, -117, 106, 20, 14, 144, 33, -30, 166, -116, 134, 68, -164, 118, 83, -18, 119, -66, 17, 136, -17, 141, 130, -87, 78, -86, -26, 58, -81, -142, 67, -140, -169, 102, -142, 15, 27, -85, 74, 15, -73, 79, -25, -2, 38, 0, -142, 100, -46, 6, 140, -239, 118, -46, 2, 145, 70, -49, 89, -2, -66, 101, -38, -17, 73, -186, -19, -40, -108, 18, -10, -58, 26, -53, -27, 12, -85, 16, 12, -152, 148, 32, -105, 125, -85, -67, 130, -70, -49]
4377d9K42k51J8M6j16J62m4j31K47j75q3K61j90M3K15k83O6K52l97J74j4oJ05
4400I2j81J44P3j51r7Q3j9R4m3j94K24p6l3J71k26K2J94j44K7O2n6K5J07j88J68
4425G8n3j45K14m9o0J10j87Q9Q8j79J60M0k05K06j67N1J26j34o8J71q6LK7l9O3
4450E4k5m0Q1j30p9K87k19j4M6m5q2K44j78K35j81m5K08j65j3J37j11N3J48k45
4474g9J00J11k08Q2M2j12K23j15j46J62m1qN2j55P3J6m5J7J53j82R1j23qJ57j72
4499a15J61P4j56m4K24k33J23l6p0J36j54O3K00l39J62N7j06J20o9j09K01j17
4521b7n4J10o2K2J08j24LJ02k82J77R3p8J56j57J2oJ9m6K2r3J05m8j33J93L5j10
4547f3J60m5j72J80n0L5q4j88J73J33j93J54J00l01K27J7j70K13k24J00J60l02
$$ y = [-49, 193, -58, -40, 6, -110, 52, 8, -123, 124, -51, -134, 127, -63, -20, 195, -88, -22, 230, -167, 7, -7, -13, 92, -89, 55, 128, -23, -120, -37, -56, 38, -5, -199, 25, -51, -84, 87, -139, -117, 77, -67, -40, 22, -34, -9, 98, -90, 78, 25, -120, 94, 45, -15, 95, -92, -3, 85, -94, 66, 106, -99, 107, -60, -9, 117, -17, -85, 86, 0, 3, 30, -9, 54, 29, -11, 70, -60, -139, 148, -71, -85, -39, -84, -166, 78, -100, 135, -46, -91, 117, -48, -61, 76, -35, 18, 166, -79, 21, 132, -76, 6, 48, -64, 159, 44, -102, 60, 19, 11, 63, -92, -19, -3, -48, -31, 122, -60, 31, -92, -100, 57, -115, 46, 120, -36, -80, 144, -89, 34, -2, -72, 64, -90, -27, 173, -166, -4, 53, -53, 67, -2, -111, 90, -27, -81, 29, -33, -11, 97, -27, -24, 78, -204, -27, 66, -12, 144, -13, -1, -7, 12, -34, -12, -105, 0, -48, -181, 12, 47, -63, 97, 52, -120, 60, 10, 45, -39, -227, -54, 79, -114, 40, 140, -161, 66, 83, -87, 126, -98, 2, 162, -140]
4569a40J43Q1k23O9J56j48J58q7j34J79j36K2j3j00J94q0j26L14j47l1J75j93
4591f7M7R2j00O6L0j03K02q8k1M7n3j58J59q8o8J29Q5lj9j15j3K14j61N8j34L7
4617b5J61q8j50J44k8j18R4PJ19l1l27L03n9j04L28k57O8J44k39P3P3j17O2K9
4641F2r1K24j48K4m1m6J7J35k15o6K43j91R0k7m1K03j36j15J86q8K8J25l19J43
4665d4J4K3L3n0j0N0o3o2K06p0k8J12j40K3J45k03J81m3o4K29l49J7K37k22Q4
4690F%r2J54r1j65K19J05k94K34j35L3J56j26o7K03k39J55L7j20j7O0j73K30m2
4714C1Qk5o0J09Nj14K0Jo9K19j09n6R7Qn8j7j5O6J5j17N9oo5M0No3J84j98O6R4
4744E5k56J26R3o3J24j2q8Q0%j36J86j24KJ56r0l2Q9j15m4P6j84J75K8j8N8j03
$$ y = [-140, 3, 84, -139, -70, 86, -62, 96, 9, -125, 54, -82, -60, -73, -173, 21, -59, -185, 129, -18, -49, 126, -67, -20, 72, -28, 38, 68, -35, 167, 79, 58, 105, 52, -106, 53, -35, -103, 26, 111, 108, 89, -26, -39, 175, 14, 72, -62, -25, 136, 48, -102, 42, 14, -104, -10, -3, 116, 85, -242, 61, 2, -102, 226, -31, 37, 181, -58, 15, 88, -29, 33, 62, -29, 195, 47, 71, 30, -16, 1, 136, -79, -145, 98, -93, -3, -30, -71, 132, -4, -119, 67, -21, 7, 132, -187, -44, -30, -7, 26, -24, -34, 16, -47, -109, 97, 27, -1, 111, -29, -6, 139, -64, 117, 74, 10, 239, -110, -93, 144, -78, 6, 6, -86, 68, -23, -188, 31, 136, -158, 76, -59, -26, 130, 4, -63, 140, -99, 56, 93, -27, -44, 16, -157, 73, 31, 39, 14, -46, 63, 68, -46, -26, -25, -94, 125, 16, -40, 57, 65, 7, -10, -25, 41, 56, -61, -2, -8, -73, -33, -28, -91, 93, -105, -39, 55, -201, -75, 18, -45, 79, 67, -21, 59, 59, -77, 109, -15, -13, 143, 53, 21, 110, -5, -49, 27, -157, 18, 46, 28, 86, -17]
4770a7N4J18k85J52j7p2Q5l7NO1J1j25L3K3n6J34j74R3J0r0Q1K9j38K08j16k6
4796e6J76n0n4L0j6l8N8j73J79m9l6K04k21J32R8j97M9P6j26k7J00j69J29j1r9
4821i1K17j68O9R0j67R7j38Q0J30j26p0K2P7n6J65k10J87o6j15J3J16r1K8O9k1
4846D1J4o2n2R6k9j07K01k21J88j2q7J0k0m8P6j3J1J44j33j2N5r0J51r8o7K2J23
4873H1k49J36O1nK8j51l0K02L5M1p5j64K49j08n2R2k12R1J11n9L1L6n5P6m0j16
4899d6J40L1k01J5l3M1J38j70N4P4j30M0Q5r7R6Nj67OJ90o3O6o3M5M7k13j7Q3
4926d4pJ59o1Q1r5O9j8J7k00P7J30j85R7r3p4J92n9q5K20j83oJ82k02R2N6j46
4952h6O5O3r8J80r0j32K52p4k06J13n9L1L0l6j0K5p3O5l6K6J21j50K3J14m6N0
$$ y = [-17, 37, 155, -130, 22, 5, -67, 18, -19, -14, 47, 58, -67, -34, -11, -67, 67, -107, -14, -4, -94, -13, 16, -122, 86, -30, -56, 120, 70, 16, 46, 30, -8, 50, -123, 56, 7, -29, 175, -46, 86, 184, -13, 36, 112, -14, -41, 59, -110, 19, 8, -91, 126, -42, 27, 117, -50, 47, -91, -11, 119, -7, -77, -55, 22, -34, 131, -79, 108, 42, -73, -60, 56, -35, -7, 62, 41, 55, -7, -59, 37, 8, -99, 102, -119, 69, 57, -30, -20, -40, -88, -12, -25, -14, 130, -3, -15, 40, -50, 101, 3, -64, -42, 81, -168, -32, 29, 24, 52, -99, -129, 73, 108, 149, 74, -90, 159, 51, -1, 91, -121, -30, 81, 22, 53, 89, 34, 110, 70, -46, 94, 125, -76, -61, -94, -53, 85, -85, -31, 43, -87, -47, 38, -59, 37, 42, -125, -119, 71, 8, 74, 11, 56, 103, -110, -127, -44, -51, 108, 47, 128, 33, 102, 84, 101, -99, -22, 108, -77, 20, -73, -147, 45, -14, -99, 121, -62, -68, 114, -88, 4, 60, -86, -21, 42, -56, 124, 34, -98, 154, 80, -126, -13, -72, -41, -11, -47, -57, -32, -105, -40, -76, -50, 71, -79, -56, 58, 12, 62]
4978F2l6j40P2K16j54P8j24pJ50j35r2J55l1m9K4k20K75j3q5P5o0PO5p3L1M1q3
5005e1K8Mm3J08N3k09J51R1j24Q2k28J01J97j62J8n1n0R5n0m8J66j53o3J63j81
5030a56O4j5J17n4J09j50N3M8j31R0Q%O4r9J19m2Om9P2o6N2P1j32J42j28O6p1
5057a2j5l7J01j50J01O6p0J4j8MJ13j42L3J58k55J69j8j25J21Pp0R8o3o8R2n3
5083a9n0R4l9Q0%j56Q8Lo0O6k6J6N5m9m3j3l2J04L3j21J11m7m9J19l2p7K1o9P8
5112a4N6k26J36K8j61K22j1j33O1m3J0P6n5j9M5l4J2N3o7J16j05j00J82j43o0
5137a74K82j88J24k5j01K9Q5r8J39j04n8R8po4Q4q3L2pm1J80j35L9J23j24p9P4
5163Aj34R5M4o0J9l9r6J41O0j10P8J3j17R7mJ8O4q3m7J26j43M8k4N9N9j6n8O9
$$ y = [62, 26, -114, -42, 174, 20, 98, -26, -33, 117, -18, -110, 45, 14, -35, -11, -231, 44, 31, -54, 21, -39, -32, 33, -40, -9, 32, -51, -23, -19, -62, 46, 99, -110, 41, 132, 8, 90, -138, -37, 160, -2, 16, -35, -85, 10, -40, -88, 78, -75, -138, 25, -156, -92, -107, 10, -44, 65, -85, -32, 16, -115, -25, -17, -17, 47, -52, 67, 25, 31, -18, 54, -12, 40, 111, -21, 121, -7, 59, -12, -27, -64, 37, -113, -12, 54, -16, -2, -20, -16, 97, -45, -12, 146, -109, 60, 42, -83, 38, 45, -25, 73, 10, -58, 34, -19, -69, 25, -14, 66, 66, -90, -2, 1, -59, 7, -19, -3, 52, 3, -40, -53, -85, 19, 52, -69, 42, -5, -54, 65, 33, -44, -23, -92, -14, 42, -184, -48, -20, -181, 41, 30, -103, -42, -85, -75, 1, -54, -73, -28, -62, -50, 3, -64, 52, -53, -153, 29, -114, -174, 108, -80, 44, 19, -82, -53, 32, -66, 73, -31, -89, 9, 2, -62, 22, -61, -29, -36, -77, 103, -32, 7, 130, 6, -73, 1, -133, -38, 6, -54, -35, -74, -170, -29, 31, -79, -1, 12, -105, -8, -12, 6, 70, -13, -60, 66, -77, -29, -53, 6, 65, 49, -9, 60]
5191F0n9lJ54k00L1O3j01J2J88k25J16r1j5J24j59P7k4R0on5o1J60l0r8M4K8L7
5218E7nq8o5J71j35K9n2M7K03j09L3j26M7j45J14l8m3J53j67R3J51k47K34j56
5242d4k7J92j00Mk4r8R8J52j50j1L5k6J9m5OJ79k59R1R0r8KN9n7MN6k18K48o3
5270A5k9J13j68J1J03j22m7K15r8O0j84K71m5p7k43K99qM94j88n33P22p94O12
5293C79p97P06k34j50m0O03n32P3k92K57k26N84k14l71K3NK99j57J81j09P1j30
5315g1J4P6L1j09J44k36J58K5j10N3L3j26J38n6n5R6M2J5rp9O8K6j02Q8j4j18
5341g8J01l3m9P4oo9P5N9r1Q5r0o6L6m1J66J8j87J34o6pkP7l3M1l5J56j55o6J37
5370H5j01j30K51k36J25l5O7J6j44l8J60j4j01R8l8J5J59k54PJ33r9Q0n8kR7k9
$$ y = [60, 1, -2, 152, -48, -17, 46, -55, -43, 145, -80, 36, -55, -70, 54, -105, -28, -52, 38, 32, -23, -84, 76, 46, -52, -8, 20, 57, 52, -36, -101, 70, -65, -36, -88, -41, 162, 53, 86, -40, 7, -138, -24, -62, -105, 48, -119, -26, 125, -122, 112, -44, -71, 121, 21, 25, 1, -97, 1, 153, 3, -8, 27, 1, 20, -25, -19, 160, -99, -8, 82, -16, -14, 45, -12, -8, 48, -170, 78, 15, -14, 99, -69, -58, 45, -77, -124, 91, -7, 53, -131, 140, 95, 18, -225, 74, 66, 560, 372, -161, 561, -233, 379, -418, 288, 54, -96, -136, 467, -65, 8, -284, -27, -253, 331, 117, -254, -231, -226, 73, -84, 97, -12, 59, -71, -57, 19, 50, -59, 85, -151, 7, 32, -78, -25, 8, -118, 20, -36, -91, 5, 47, 62, 53, -26, 42, 68, -34, 54, 40, -78, 23, -10, -59, 15, 9, -60, 15, 74, -17, 68, -22, -88, -52, -93, 73, 91, -96, 38, -28, -35, -37, 40, 7, 48, 13, 169, 14, -52, 85, -16, -146, 105, -131, -6, -41, 26, 42, -102, -140, 20, 6, -95, 3, -35, -20, 139, -115, -108, 25, -74, 6, -52, -54, 43, 14]
5396A4m9Qoo9J05K8n9J02m8o9R2o5J78j36L9j13M5l3O4m1J9O6o3r3J08KO7q6K
5425IP4j50l1l31M59n4N0j99L03j34m2R7j6j37J98k87K13Q5k07J14J10j29jj1
5449a7l3J20j16j12J70l8R0K3M3Rj23Np3J13j33J45rj2q4j4Q3j4l9L5J30l50K17
5476A6J6%P5q3k01J97n0Q4J2j21M9j6o8Q2J15j68L0qJ4L4p8J03q4o4J50mn0No
5505a9%m1R8j26J92j94K37j21m7k0L0K3N0J0j36J01J4m2P5j52Q7N5j76O7j4R6
5531D7l0Rn8L1m3k9J90p6PM0j63J34L5n9l5P8j17J19q2L0k0P2p8P3j39j3J55j35
5559e7O5mo9J51n0r3K66l40J93n5q5J73j4k16J00N9j05J55j55MJ19j81J13j4J66
5584A26j23Rj21K08PO8k98K28m8km2Q3r7k0M1j9P5r9O1q7L5Q6k44J05J23Rj00
$$ y = [14, -35, -27, -33, -102, 3, 31, -28, 74, 26, -43, 49, -16, 162, 26, 65, -48, -3, -36, 28, -13, 6, 72, 9, -84, 24, 26, 93, 7, 9, 83, -67, -98, -429, 30, -24, 26, -173, 130, -4, -46, 51, 35, -102, 96, -191, 22, 107, -100, 14, 124, -5, -6, -17, -50, 70, -46, -158, 12, -26, 64, 87, 130, 139, 16, 21, -52, 61, -72, 73, 64, 52, -32, -46, 37, 23, -16, 19, 149, -201, 16, 32, 32, 107, 24, -177, 20, -30, 54, 66, -55, -6, -22, -90, -8, 107, -61, -31, -39, -25, 9, -69, 34, -50, -114, 36, 32, -18, -13, -19, -19, -60, 38, -88, 104, -90, 147, 26, -21, -41, -11, 12, 62, 72, -64, 37, 51, 9, 84, -68, 19, 74, -102, -35, -49, 47, 17, 26, -32, -1, -44, -73, 117, 41, 48, 88, -75, 59, 94, 35, 0, 78, -39, 80, -2, 28, 8, 80, 2, 75, -64, -77, 78, -57, 8, 4, -65, 86, 36, -57, 209, -131, 62, 7, -78, 95, 81, -135, -35, 24, -81, 74, -81, -77, 42, -139, -26, -40, 126, 3, 12, -109, 99, 106, 174, -124, 104, 56, 54, 12, 95, -2, -22, 19, 0, 75, -24, 37, -50, -15, 71, -173, -68, 55, 64, -36]
5611c6l1J6R9j19L5J1o7J30J9q4P2j77J01nM8M2n4L4K3L1oL6j16J06j62N2N9L3
5639I0j29J43m7r9j5R7j37J12j6L5kq8M2M5p4R4J1p8K8K1q1J24j65L2J01j35J57
5666F6oq2Q5m5r1R6r1J04Nl9O8n1L8r0K5p0M2O5r0J46o3j22M9J20j45K12j51J46
5694A31n5k11J42Nl7n1MJ10p0p8K6J04j58Q5k0%J95j31j5kN7P5p3j27J00j8j25
5721a37J68O6k12Q8J2R5m5m1J3L1J1k4Oq0N3Lr7J36o6j02J72j64J62K3j23L6m6
5748f2mJ28j98J40n7mJ09n1n5R7j04L7O8K5J2M6j32J3P3j28R7o1k2N5P7j76J36
5775E9k2J2K5K4r5J82j42q5k1Pj7P3m0J1L4k00J97O1j58J61k7j58R5K7j37J80
5801D6n9m%L8M9Nl8Jrp7J49j38Q1j49k6J02Q9n8k3l3K3Q9o8J17r1J7j9N5p5jO5
$$ y = [-36, -67, -51, 48, -71, -36, -25, -92, 38, 57, -27, 45, -132, -31, -36, 12, 54, 0, 34, 57, 88, 82, 118, 2, 108, -54, -2, 57, 90, -39, 104, 57, -42, -57, 40, -97, 15, -1, 34, 32, -56, -14, 31, -43, 51, 62, -16, 12, 33, -48, 76, -89, -57, 44, -91, 66, 60, -22, 63, 18, -73, 23, -68, 36, 41, 2, 70, 19, 57, -33, -8, -78, -36, 29, -61, 85, 22, -100, -51, 69, -76, 136, -15, 131, 76, -135, 7, 12, -25, -76, -72, 38, -32, -110, -84, 20, -138, -53, -73, -73, 122, -9, -24, -26, 31, 106, 33, -94, 6, -12, -137, 31, 97, -115, -27, -15, 80, 35, -6, 7, 38, 49, 25, 31, -49, 4, 7, -90, 46, -20, -122, 50, -114, 48, 71, -52, -16, -62, -66, 62, -136, 4, -53, -57, 52, 1, -54, 43, -61, -24, 44, 69, 81, 127, -5, 8, 81, -47, 50, -11, -33, 22, 99, -77, 59, 37, 49, 74, 98, 3, 185, 43, -42, -63, -56, -73, 0, -40, -29, 5, -195, 2, 63, -95, 66, 39, -119, -24, 3, -134, 46, -13, -17, -17, 21, 70, 75, 37, 38, 29, -48, 101, -37, 44, -105, -131, -29, 60, 2, -21, -54, -31, 58, -10, 107, 16, 33, 14, 69, -6, -7, 58]
5832E8j74J18j19k6J91o8lN0l3M5J9m9j5N5n0M1m2RKl5N6K9k6O7l7j62R4N8jj1
5862D1m8n9M9q3R7N8l7m5J57j59M3k9j1K5k0J8J5l1Q3qOK9n2q5L2l2M3K6j3l8
5892b8l5rk6P0j03Q6N3k6M8M9j23J01j21P8o0m3L6R5q3K1Q2o6K2O4l5m1j15O2
5920d7J23j03PK0k1l5j1o4K23k28R4J1%j8p7J2J21q6l1J32N4n6m2p7P0O0j05l0
5948a04R1k6p5R5n4J01L7j98K09j8j40J72j53R1J2p9p4R7Q1j45J35r5N7l3m1P2
5974A5j7K9k3n4j1J22K4l9p9l5J18p2n2P9n7L6k0L3l6J48j99P3L6j11Q1l0J6M4
6002A9rK8l2J3m4lN5j8J02j82J60l0m2J1j0K3J3j40RJ73j79rM5m8Q4MJ1J13j41
6031b4pO6p9JR9r8J2K6l8J16m5j53J65j21J45Lq0l4P1j72O8R7j43K12j26ol7Q2
$$ y = [58, -116, 2, -117, -143, 48, -20, -23, 27, -6, 39, 58, 9, -6, 49, -1, 40, -2, 7, 9, -26, 30, 59, 33, 100, 63, -99, -5, 53, 52, 41, -7, -66, -17, -100, -3, 55, 18, -27, 130, -29, 14, -15, -26, -1, -21, -3, 12, -19, 64, 56, 62, 91, 39, -46, -14, -46, -3, 23, 10, -28, -63, -72, -98, -28, -131, -45, 8, -18, 30, 79, -44, 57, -64, 14, -46, -89, -53, 42, -41, -20, 62, -4, 18, 82, 47, 6, -109, -47, 76, -27, -20, 0, -21, -56, -67, -131, 92, -136, -42, -31, -31, -49, -126, -114, 7, -79, -110, 22, 76, 20, -22, -99, -29, 31, -74, -104, -13, -39, -114, -19, -73, 28, 65, -133, 76, 58, -82, 90, -63, 28, 40, -39, -113, -16, 65, -80, 55, -40, 17, -16, -57, 15, -2, 27, 4, -50, -61, 61, 85, 46, -33, -68, 50, -22, -74, 5, -52, -16, -36, -3, -39, 109, -90, -17, 19, -92, -11, -41, -25, 19, 10, 38, 6, 19, -25, -28, 27, 9, 111, -71, 89, 59, 17, 28, 18, 41, 54, -86, -77, 96, -83, -92, -47, -95, -11, -7, 4, 117, -24, -31, 35, -44, -43, 56, -42, -30, -4, -42, 74, 29, -124, 41, -80, 65, 68, -12, -46, 25, -147, -79, 18, -125, 87, -39, -45, -82, 0]
6059@J33p9lk0Q6j66J55n0r2M9q5N0M9j20j3N2q8J73J7j31J71r2k6J2R2n8n2O4
$$ y = [0, 133, 54, 51, 31, 117, -49, 106, 56, -36, 13, -72, -22, 27, -93, -106, -54, -142, 31, 48, -83, 88, -4, -30, -18, 74, 16, -36, 28]
$$ [...]
8191b
##END NTUPLES=NMR FID
##END=
