##TITLE=1H_DE-80H_X3
 200.13MHz, d2o
 8 sc
 
 19ns.26.2.2025
##JCAMPDX= 6.0         $$ Bruker NMR JCAMP-DX V2.0
##DATA TYPE= NMR FID
##DATA CLASS= NTUPLES
##ORIGIN= UXNMR, Bruker Analytische Messtechnik GmbH
##OWNER= pz
$$ XWIN-NMR		Version 3.5
$$ Fri Jul 10 12:01:48 2026 Russian Standard Time (UT+4h)  Yarkov@DPX200
##.OBSERVE FREQUENCY= 200.1313
##.OBSERVE NUCLEUS= ^1H
##.DELAY= (6, 6)
##.ACQUISITION MODE= SIMULTANEOUS
##.ACQUISITION SCHEME= undefined
##.AVERAGES= 8
##.DIGITISER RES= 18
##SPECTROMETER/DATA SYSTEM= spect
##.PULSE SEQUENCE= zg30
##.SOLVENT NAME= DMSO
##.SHIFT REFERENCE= (INTERNAL, DMSO, 0, 14.3821)
##AUDIT TRAIL= $$ (NUMBER, WHEN, WHO, WHERE, WHAT)
$$ ##TITLE= Audit trail, XWIN-NMR		Version 3.5
$$ ##JCAMPDX= 5.01
$$ ##ORIGIN= Bruker BioSpin GmbH
$$ ##OWNER= Yarkov
$$ C:/Bruker/XWIN-NMR/data/yarkov2/nmr/H-C/1/audita.txt
$$ ##AUDIT TRAIL=  $$ (NUMBER, WHEN, WHO, WHERE, WHAT)
(   1,<2026-07-10 12:00:55.28 +0400>,<Yarkov>,<DPX200>,
      <created by zg, POWCHK disabled, PULCHK disabled
       configuration hash MD5:
       00 E9 B6 7A A2 85 ED C7 34 08 36 98 17 FE 4E 26
       data hash MD5: 16K
       68 40 E1 BC 34 72 19 17 F6 BC C3 00 5F 69 70 DF>)
$$ ##END=
$$ 
$$ hash MD5
$$ D8 75 7F 3E C5 6B 91 84 A4 5D 37 A7 33 99 32 10
##$RELAX= 
##$RELAX= 
##$RELAX= 
##$RELAX= 
##$RELAX= 
##$RELAX= 
$$ Bruker specific parameters
$$ --------------------------
##$DU= <C:/Bruker/XWIN-NMR>
##$EXPNO= 1
##$NAME= <H-C>
##$PROCNO= 1
##$TYPE= <nmr>
##$USER= <yarkov2>
##$AMP= (0..31)
100 100 100 100 100 100 100 100 100 100 100 100 100 100 100 100 100 100 
100 100 100 100 100 100 100 100 100 100 100 100 100 100 
##$AQSEQ= 0
##$AQ_mod= 1
##$AUNM= <au_zg>
##$AUTOPOS= <>
##$BF1= 200.13
##$BF2= 200.13
##$BF3= 200.13
##$BF4= 200.13
##$BF5= 200.13
##$BF6= 200.13
##$BF7= 200.13
##$BF8= 200.13
##$BYTORDA= 1
##$CFDGTYP= 0
##$CFRGTYP= 5
##$CHEMSTR= <none>
##$CNST= (0..31)
1 1 145 1 1 1 1 1 1 1 1 1 1 1 1 1 1 1 1 1 1 1 1 1 1 1 1 1 1 1 1 1 
##$CPDPRG= <>
##$CPDPRG1= <>
##$CPDPRG2= <>
##$CPDPRG3= <>
##$CPDPRG4= <mlev>
##$CPDPRG5= <mlev>
##$CPDPRG6= <mlev>
##$CPDPRG7= <mlev>
##$CPDPRG8= <mlev>
##$CPDPRGB= <>
##$CPDPRGT= <>
##$D= (0..31)
0 0.7 0 0 0 0 0 0 0 0 0 0.03 0 0 0 0 0 0 0 0 0 0 0 0 0 0 0 0 0 0 0 0 
##$DATE= 1783670454
##$DBL= (0..7)
120 120 120 120 120 120 120 120 
##$DBP= (0..7)
150 150 150 150 150 150 150 150 
##$DBP07= 0
##$DBPNAM0= <>
##$DBPNAM1= <>
##$DBPNAM2= <>
##$DBPNAM3= <>
##$DBPNAM4= <>
##$DBPNAM5= <>
##$DBPNAM6= <>
##$DBPNAM7= <>
##$DBPOAL= (0..7)
0.5 0.5 0.5 0.5 0.5 0.5 0.5 0.5 
##$DBPOFFS= (0..7)
0 0 0 0 0 0 0 0 
##$DE= 6
##$DECBNUC= <off>
##$DECIM= 32
##$DECNUC= <off>
##$DECSTAT= 4
##$DIGMOD= 1
##$DIGTYP= 9
##$DL= (0..7)
0 120 120 120 120 120 120 120 
##$DP= (0..7)
150 150 150 150 150 150 150 150 
##$DP07= 0
##$DPNAME0= <>
##$DPNAME1= <>
##$DPNAME2= <>
##$DPNAME3= <>
##$DPNAME4= <>
##$DPNAME5= <>
##$DPNAME6= <>
##$DPNAME7= <>
##$DPOAL= (0..7)
0.5 0.5 0.5 0.5 0.5 0.5 0.5 0.5 
##$DPOFFS= (0..7)
0 0 0 0 0 0 0 0 
##$DQDMODE= 0
##$DR= 18
##$DS= 0
$$ [...]
##$SUBNAM2= <"">
##$SUBNAM3= <"">
##$SUBNAM4= <"">
##$SUBNAM5= <"">
##$SUBNAM6= <"">
##$SUBNAM7= <"">
##$SUBNAM8= <"">
##$SUBNAM9= <"">
##$SW= 18.0517328524113
##$SWIBOX= (0..15)
0 0 2 0 0 0 0 0 0 0 0 0 0 0 0 0 
##$SW_h= 3612.71676300578
##$TD= 16384
##$TD0= 1
##$TE= 0
##$TE2= 300
##$TE3= 300
##$TEG= 300
##$TL= (0..7)
0 120 120 120 120 120 120 120 
##$TP= (0..7)
150 150 150 150 150 150 150 150 
##$TP07= 0
##$TPNAME0= <>
##$TPNAME1= <>
##$TPNAME2= <>
##$TPNAME3= <>
##$TPNAME4= <>
##$TPNAME5= <>
##$TPNAME6= <>
##$TPNAME7= <>
##$TPOAL= (0..7)
0.5 0.5 0.5 0.5 0.5 0.5 0.5 0.5 
##$TPOFFS= (0..7)
0 0 0 0 0 0 0 0 
##$TUNHIN= 0
##$TUNHOUT= 0
##$TUNXOUT= 0
##$USERA1= <user>
##$USERA2= <user>
##$USERA3= <user>
##$USERA4= <user>
##$USERA5= <user>
##$V9= 5
##$VALIST= <valist>
##$VCLIST= <CCCCCCCCCCCCCCC>
##$VD= 0
##$VDLIST= <DDDDDDDDDDDDDDD>
##$VPLIST= <PPPPPPPPPPPPPPP>
##$VTLIST= <TTTTTTTTTTTTTTT>
##$WBST= 1024
##$WBSW= 4
##$XGAIN= (0..3)
0 0 0 0 
##$XL= 0
##$YL= 0
##$YMAX_a= 145868
##$YMIN_a= -125239
##$ZGOPTNS= <>
##$ZL1= 120
##$ZL2= 120
##$ZL3= 120
##$ZL4= 120
##$ABSF1= 10
##$ABSF2= 0
##$ABSG= 5
##$ABSL= 3
##$ALPHA= 0
##$AQORDER= 0
##$ASSFAC= 0
##$ASSFACI= 0
##$ASSFACX= 0
##$ASSWID= 0
##$AUNMP= <proc_1d>
##$AZFE= 0.1
##$AZFW= 0.1
##$BCFW= 1
##$BC_mod= 2
##$BYTORDP= 1
##$COROFFS= 0
##$CY= 83.5205535888672
##$DATMOD= 1
##$DC= 2
##$DFILT= <>
##$DTYPP= 0
##$F1P= 10.8118882576601
##$F2P= -7.23987719738617
##$FCOR= 0.5
##$FTSIZE= 0
##$FT_mod= 4
##$GAMMA= 1
##$GB= 0.15
##$INTBC= 1
##$INTSCL= 1
##$ISEN= 128
##$LB= 0.25
##$LEV0= 0
##$LPBIN= 0
##$MAXI= 10000
##$MC2= 0
##$MEAN= 0
##$ME_mod= 0
##$MI= 1.114404
##$NCOEF= 0
##$NC_proc= 0
##$NLEV= 6
##$NOISF1= 3.799351
##$NOISF2= 2.8
##$NSP= 1
##$NTH_PI= 0
##$NZP= 0
##$OFFSET= 14.38212
##$PC= 1
##$PHC0= -7253.948
##$PHC1= 6.42196
##$PH_mod= 1
##$PKNL= yes
##$PPARMOD= 0
##$PSCAL= 0
##$PSIGN= 0
##$REVERSE= no
##$SF= 200.129724274929
##$SI= 16384
##$SIGF1= 3
##$SIGF2= 2
##$SINO= 400
##$SIOLD= 16384
##$SREGLST= <1H.CDCl3>
##$SSB= 0
##$STSI= 0
##$STSR= 0
##$SW_p= 3205.1282051282
##$SYMM= 0
##$S_DEV= 0
##$TDeff= 0
##$TDoff= 0
##$TI= <>
##$TILT= no
##$TM1= 0
##$TM2= 0
##$TOPLEV= 0
##$USERP1= <user>
##$USERP2= <user>
##$USERP3= <user>
##$USERP4= <user>
##$USERP5= <user>
##$WDW= 1
##$XDIM= 8192
##$YMAX_p= 0
##$YMIN_p= 0
$$ End of Bruker specific parameters
$$ ---------------------------------
##NTUPLES= NMR FID
##VAR_NAME=  TIME,          FID/REAL,        FID/IMAG
##SYMBOL=    X,             R,               I
##VAR_TYPE=  INDEPENDENT,   DEPENDENT,       DEPENDENT
##VAR_FORM=  AFFN,          ASDF,            ASDF
##VAR_DIM=   8192,          8192,            8192
##UNITS=     SECONDS,       ARBITRARY UNITS, ARBITRARY UNITS
##FACTOR=    0.0002768,     1,               1
##FIRST=     0,             0,               0
##LAST=      2.2672688,     0,               0
##MIN=       0,             -125239,         0
##MAX=       2.2672688,     145868,          0
$$ Real data points
##PAGE= N=1
##DATA TABLE= (X++(R..R)), XYDATA
$$ plain form
0 0 0 0 0 0 0 0 0 0 0 0 0 0 0 0 0 8 -8 8 -8 8 -16 16 -16 24 -24 31 -32 40 -47 52 -56 65 -76 87 -96 111 -123
37 -123 138 -155 172 -191 212 -236 260 -290 316 -351 387 -427 470 -518 568 -629 693 -768 849
56 849 -942 1052 -1175 1326 -1505 1725 -2003 2368 -2872 3612 -4819 7108 -13080 63759 145868
71 145868 56598 -36421 -125239 -72493 54913 123835 74324 -5007 -74450 -89464 -28225 60659
83 60659 75290 27944 -37275 -86896 -82114 -589 79024 81510 16221 -50601 -76737 -35279 51373
96 51373 99278 54383 -26223 -72016 -60799 1256 69864 71692 6217 -57165 -70619 -38426
108 -38426 19371 64024 44826 -24669 -66887 -50099 -983 51537 69257 26781 -35126 -56186
120 -56186 -26140 23459 57995 48307 -7112 -55692 -49163 -5549 34915 48253 19116 -33738
$$ packed form
0@%%%%%%%%%%%%%%%Qj6J6j6J6k4L2l2M0m8N5o3P2q7R9j08J21j41J63j83K07k34
37a23K61k93L27l63M03m48M96n50O06o67P38q14Q97r88J086j197J322j461J617
56H49j791J994k227K501k831L230l728M371n240O484q431J1927k0188P6839Q2109
71A45868q9270r3019q8818N2746J27406O8922m9511p9331o9443j5014O1239Q8884
83F0659J4631m7346o5219m9621M782Q1525P9613K486o5289o6822k6136M1458Q6652
96E1373M7905m4895q0606m5793J1217O2055O8608J828o5475o3382j3454L2193
108c8426N7797M4653j9198o9495m2218J6788M9116N2520J7720m2476o1907k1060
120e6186L0046M9599L4536r688n5419m8580O529M3614M0464J3338k9137n2854
$$ plain form
132 -33738 -58502 -34540 11431 43225 39963 2624 -38969 -42234 -3712 35886 48016 27587
144 27587 -15894 -45341 -30557 10467 38644 34011 2758 -33218 -44777 -16516 23941 36465
156 36465 16870 -16084 -39716 -30157 6034 34753 34695 10390 -19217 -31933 -13891 21365 37747
169 37747 20911 -9414 -31900 -30176 -1703 26053 26802 4968 -20264 -32151 -19672 9354 29470
182 29470 20475 -5656 -24253 -23904 -2020 25695 31424 11628 -12588 -24217 -15420 6971 24036
195 24036 19218 -3741 -23165 -24708 -8699 15229 24881 8888 -13661 -22583 -15066 3374 20251
208 20251 20778 3230 -15717 -18181 -4108 14144 23769 13829 -8414 -20610 -15300 384 15331
221 15331 16072 992 -16070 -19273 -7140 8893 17633 12641 -4400 -17775 -13476 1302 14335
$$ packed form
132c3738k4764K3962M5971L1794l262l7339m1593l265L8522L9598J2130k0429
144B7587m3481k9447J4784M1024K8177m633l1253l5976j1559K8261M0457J2524
156C6465j9595l2954k3632R559L6191K8719n8k4305k9607j2716J8042L5256J6382
169C7747j6836l0325k2486J724K8473K7756P49k1834k5232j1887J2479K9026K0116
182B9470q995k6131j8597L49K1884K7715N729j9796k4216j1629Q797K2391J7065
195B4036m818k2959j9424j543J6009K3928R652j5993k2549q922P517J8440J6877
208B0251N27j7548j8947k464J4073J8252R625r940k2243j2196N310J5684J4947
221A5331P41j5080j7062l203J2133J6033Q740m992j7041j3375M299J4778J3033
$$ plain form
234 14335 17450 6609 -9120 -15486 -6936 7784 15612 10991 -2914 -16395 -15886 -2384 10045
247 10045 12690 4648 -8334 -14488 -8125 4986 13881 11242 100 -10723 -12494 -1898 10717
260 10717 13327 6079 -4792 -11762 -8633 1463 10167 9302 -815 -10788 -12455 -4879 7175 12033
274 12033 5728 -4057 -10144 -7335 2165 9967 9685 1882 -6670 -8520 -3400 5050 10632 6582 -3919
289 -3919 -10281 -8560 -159 7084 7140 1227 -5937 -8515 -3818 3954 8915 7042 -1315 -7644 -6537 -160
305 -160 7029 8412 2944 -4039 -7213 -4123 2605 6378 4712 -1462 -7659 -7479 -1823 4546 7332 3526
321 3526 -3057 -6268 -3930 2135 6434 4898 -113 -4995 -5671 -1355 4350 6455 3791 -2483 -6382
336 -6382 -4642 20 4037 3907 -374 -4545 -5386 -1963 3718 6024 3611 -1013 -4426 -3620 356 3670
$$ packed form
234A4335L115j0841j5729o366Q550J4720P828m621j3905j3481N09J3502J2429
247A0045K645q042j2982o154O363J3111Q895k639j1142j0823j771J0596J2615
260A0717K610p248j0871o970L129J0096Q704q65j0117r973j667P576J2054M858
274A2033o305r785o087K809R500P802k82p803q552j850N120Q450N582m050j0501
289c919o362J721Q401P243N6n913p164k578M697P772M961j873q357o329J107O377
305a60P189J383n468o983l174L090O728L773j666o174o197J80N656O369K786l806
321C526o583l211K338O065M299j536n011m882o76M316N705K105k664o274l899
336f382J740M662M017j30m281m171q41L423N681K306k413m624l413Q06L976L314
$$ plain form
352 3670 4388 1126 -3124 -4343 -1974 2433 5033 2877 -1497 -4658 -4620 -790 3126 3468 1075 -2230
368 -2230 -3423 -1292 2013 4538 3757 -429 -3500 -3577 -745 2871 3646 1345 -1861 -3623 -1839 1103
384 1103 2834 2370 -489 -3555 -3784 -1383 2007 3791 2091 -1275 -2538 -1333 1296 2844 2145 487
400 487 -2422 -3423 -1142 1508 2733 1650 -958 -2781 -2296 -11 2216 1972 -192 -2144 -2757 -853
416 -853 1793 2539 1966 173 -1723 -1837 198 2266 2187 239 -1624 -2177 -1533 786 2128 1365 -284
433 -284 -1914 -2033 -459 1339 1894 588 -1164 -1688 -909 792 2632 1896 -190 -1286 -1415 -279 1027
450 1027 1469 520 -984 -1908 -1248 31 1379 1637 -67 -1549 -1476 -595 879 1788 927 -538 -1426 -861
468 -861 399 1325 1365 278 -1130 -1293 -649 185 1210 883 -640 -1580 -1106 92 1148 942 201 -707
$$ packed form
352C670P18l262m250j219K369M407K600k156m374l161L8L830L916L42k393l305
368b230j193K131L305K525p81m186l071p7K832L616P75k301l206j762J784K942
384A103J731m64k859l066k29K401L390J784j700l366j263J205K629J548o99j658
400D87k909j001K281K650J225j083k608j823M85K285K227k44k164j952o13J904
416h53K646P46n73j793j896j14K035K068p9j948j863n53O44K319J342p63j649
433b84j630j19J574J798N55j306j752n24P79J701J840p36k086j096j29J136J306
450A027M42r49j504r24O60J279J348K58j704j482P3Q81J474R09q61j465q88N65
468h61J260R26M0j087j408j63O44Q34J025l27j523r40M74J198J056k06p41r08
$$ plain form
486 -707 -1138 -445 465 1207 1259 -67 -1106 -742 40 987 1077 310 -857 -1315 -541 483 731 563 195 -964
506 -964 -1149 -222 497 1073 646 -359 -835 -488 476 1431 915 29 -555 -955 -408 415 583 334 -349 -930
526 -930 -768 32 920 723 -174 -657 -765 -725 420 920 342 -62 -417 -153 136 590 778 226 -818 -867
546 -867 -679 -64 624 267 -342 -542 -370 -5 366 570 269 -507 -709 -135 148 547 959 268 -508 -395
566 -395 11 295 460 24 -545 -890 -387 115 219 450 330 -576 -642 70 374 483 335 -114 -518 -272 542
587 542 625 358 341 -126 -660 -245 72 190 156 -247 -571 -405 77 456 285 -91 -244 -405 -204 453 426 9
609 9 108 -111 -363 -214 382 531 -59 -471 -437 -269 -49 313 106 -65 -146 -291 -56 392 305 269 -61 -146 -93
632 -93 6 457 436 -81 -214 -275 -47 103 30 44 -46 -456 -272 0 144 305 79 -229 -164 -80 215 387 204
$$ packed form
486g07m31O93R10P42N2j326j039L64P82R47R0p67j167m58P74J024K48j68l68j159
506i64j85R27P19N76m27j005m76L47R64R55n16q86n84m00N47Q23J68k49o83n81
526i30J62Q00Q88j97q97m83j08M0J145N00n78m04l55K64K89M54J88n52j044m9
546h67J88O15O88l57o09k00J72L65L71K04l01p76k02N74K83L99M12o91p76J13
566c95M06K84J65m36n69l45N03N02J04K31j20r06o6P12L04J09j48m49m04K46Q14
587E42Q3k67j7m67n34M15L17J18l4m03l24J66M82L79j71l76j53j61K01O57k7m17
609IR9k19k52J49N96J49n90m12L4J68K20L62k07j71q1j45K35M48q7l6l30q5N3
632i3R9M51k1n17j33o1K28J50p3J4r0m10J84K72J44J61k26l08O5Q4K95J72j83
$$ plain form
655 204 84 -135 -48 307 268 76 77 -258 -381 -191 -66 89 185 -150 -372 -186 173 278 -81 -109 -16 -259 -114
678 -114 95 201 208 -29 -176 -164 -55 185 173 -215 -298 -273 -310 68 177 80 64 -38 -74 -1 215 272 170 -191
702 -191 -228 103 141 203 93 -28 -41 -156 -142 107 3 81 -93 -273 -133 -87 216 263 112 -90 145 -68 151
725 151 109 15 -26 -155 -295 27 116 52 59 -154 -117 -183 -46 123 2 -220 -226 -107 13 43 120 179 46 -128 -192
750 -192 -25 63 -26 -51 -135 -177 -100 152 283 -41 -2 -117 -174 -32 -75 83 104 -25 -116 133 286 229 45 -36 -22
775 -22 -127 -70 -9 -8 -71 -45 -146 -68 153 157 160 -55 -49 -80 38 159 267 -161 71 102 11 127 12 36 -45 -226 -214
802 -214 -69 -31 221 -17 -17 -44 16 81 61 102 7 -49 -134 -37 34 50 112 -8 -97 52 -66 -59 85 -172 -256 -106 -102
829 -102 11 -36 143 79 -43 -118 106 23 24 71 -52 91 56 64 77 -49 -59 -59 -204 25 81 18 177 -131 -177 -25
$$ packed form
655B04j20k19Q7L55l9j92Jl35j23J90J25J55R6l35k22J86L59J05l59k8R3k43J45
678a14K09J06Pk37j47J2J09K40j2l88q3K5l7L78J09r7j6j02l6P3K16N7j02l61
702a91l7L31L8O2j10j21j3j15J4K49j04P8j74j80J40M6L03M7j51k02K35k13K19
725A51m2r4m1j29j40L22Q9o4Pk13L7o6J37J69j21k22oJ19J20L0P7N9j33j74o4
750a92J67Q8q9k5q4m2P7K52J31l24L9j15n7J42m3J58K1j29r1K49J53n7j84q1J4
775b2j05N7O1Jo3K6j01P8K21MLk15Ol1J18J21J08m28K32L1r1J16j15K4q1j81J2
802b14J45L8K52k38%k7O0O5k0M1r5n6q5R7P1J6O2j20q9J49j18PJ44k57q4J50M
829a02J13m7J79o4j22p5K24q3JM7j23J43l5QJ3j26j0%j45K29N6o3J59l08m6J52
$$ plain form
855 -25 48 200 26 -139 -3 75 88 195 59 4 -18 -87 -95 -12 -19 46 -16 -124 -4 -47 132 157 10 56 -43 -19 27
882 27 -24 81 163 47 -77 -28 -14 185 104 -213 -237 19 -56 29 -74 -80 98 74 -38 32 88 72 103 -115 29 -25
908 -25 -119 -16 -106 -52 -81 -56 8 15 -99 42 -53 -127 -36 0 -27 84 -56 9 48 164 164 67 43 20 3 -12 0 -28 16
937 16 68 -103 27 -17 4 151 -210 -148 117 44 124 188 -93 -81 90 -7 19 11 -63 92 -33 -59 59 141 -9 46
963 46 -106 -62 -9 -103 -37 13 -64 101 21 13 -55 48 47 -44 -12 51 59 46 99 -118 -97 110 -77 -10 -39 11 -6 -9 -37 90
993 90 113 66 -19 -139 -31 -88 -78 8 85 80 110 12 9 14 -105 7 -80 -81 72 -21 116 -66 -66 -2 -74 22 7 -24 -27 20
1023 20 -8 68 28 -24 -24 -62 -66 40 65 20 12 -108 -159 -17 -21 -46 -30 -35 -13 18 -73 -16 92 -71 -30 -111 56 -88 -114
1052 -114 -19 -22 6 33 -38 7 15 -45 -29 -17 -94 -13 3 45 82 -61 -80 142 -40 68 97 -35 95 -25 16 6 -16
$$ packed form
855b5P3J52j74j65J36P8J3J07j36n5k2o9qQ3pO5o2j08J20m3J79K5j47M6r9K4M6
882B7n1J05Q2j16j24M9J4J99q1l17k4K56p5Q5j03oJ78k4j12P0N6j6L1k18J44n4
908b5r4J03r0N4k9K5O4Pj14J41r5p4R1L6k7J11j40O5L9J16%r7k4k3j7j5J2k8M4
937A6N2j71J30m4K1J47l61O2K65p3Q0O4k81J2J71r7K6qp4J55j25k6J18Q2j50N5
963D6j52M4N3r4O6N0p7J65q0qo8J03jr1L2O3Qj3N3k17K1K07j87O7k9N0j7lk8J27
993I0K3m7q5j20J08n7J0Q6P7nL0r8lNj19J12q7jJ53r3J37j82%O4p2R6j5l1lM7
1023B0k8P6m0n2%l8mJ06K5m5qj20n1J42mk5J6nK2L1r1N7J08j63M1q1J67j44k6
1052a14R5lK8K7p1M5Qo0J6J2p7Q1J6M2L7j43j9K22j82J08K9j32J30j20M1j0k2
$$ plain form
1079 -16 -19 -61 -29 56 1 61 -24 -110 -98 16 22 -115 -21 -78 23 -38 -10 63 70 -68 -60 -90 -106 -16 -10 -32 -11 -45 13 -19 -95
1110 -95 91 20 82 89 68 -187 69 -92 -61 11 -39 -38 -35 -5 37 105 -59 99 -47 86 7 -73 -57 -10 -107 14 10 -69
1138 -69 56 -59 64 -93 -129 95 10 178 18 -21 72 22 79 -4 -99 -123 85 139 -30 41 33 66 -13 -90 63 41
1164 41 -2 -49 80 -73 89 -40 -64 1 -16 12 6 11 -58 89 -26 -1 -27 -47 81 -17 -63 -65 -73 -4 -73 49 2 -101
1192 -101 -1 -117 -128 23 8 -30 -43 66 33 39 17 0 21 -48 -23 -34 -50 67 22 91 28 -73 -111 21 18 103 -67
1219 -67 3 18 16 -46 62 -9 -3 65 -67 -38 3 -8 53 -97 -19 75 -79 93 19 7 -110 4 -41 -20 -40 -24 12 30
1247 30 72 28 16 -149 55 -10 21 116 89 130 -105 -105 -1 -29 -13 66 -41 -14 -11 -24 49 -58 38 -68 -18 8 97 44
1275 44 24 106 65 118 33 72 2 -5 -14 19 -22 -26 36 28 -22 -20 -63 -149 43 -89 -24 -1 -34 -51 29 -47 -24 89 30 -74 -106
$$ packed form
1079a6lm2L2Q5n5O0q5q6J2J14Oj37R4n7J01o1K8P3Pj38Ql0j6R0Ok2K1l4N8l2p6
1110i5J86p1O2Pk1k55K56j61L1P2n0JLL0M2O8j64J58j46J33p9q0J6M7r7J21mp9
1138f9J25j15J23j57l6K24q5J68j60l9R3n0N7q3r5k4K08N4j69P1qL3p9p7J53k2
1164D1m3m7J29j53J62j29k4O5j7K8oNo9J47j15K5k6k0J28r8m6kqO9o9J22m7j03
1192a01J00j16j1J51j5l8j3J09l3Ok2j7K1o9K5j1j6J17m5O9o3j01l8J32lQ5j70
1219f7P0J5ko2J08p1OO8j32K9M1j1O1j50P8R4j54J72p4j2j17J14m5K1k0J6L6J8
1247C0M2m4j2j65K04o5L1R5k7M1k35%J04k8J6P9j07K7Lj3P3j07R6j06N0K6Q9n3
1275D4k0Q2m1N3q5L9p0prL3m1mO2qn0Km3q6J92j32O5K3l3j7Q0p6K3J13n9j04l2
$$ plain form
1306 -106 -5 -141 -65 -42 -108 -18 10 0 113 -15 7 17 -14 14 65 37 60 -57 -11 71 -6 44 -87 34 -46 132
1332 132 -41 68 -57 18 -94 7 34 -105 -26 61 -72 20 60 32 -86 -96 -80 7 37 -1 4 14 -29 -31 -83 -109 100
1359 100 -32 32 46 -8 0 104 -16 -11 -89 14 11 20 -124 -174 7 46 11 -120 43 101 -70 -66 87 20 -38 -20 6
1386 6 -24 -80 17 4 57 -62 13 -55 12 44 43 -8 61 70 -11 62 -63 -3 22 20 4 6 60 46 -60 -30 -84 -13 -115 72
1416 72 -34 -46 -2 21 -105 -2 -4 54 -3 -89 -84 -50 1 24 10 -25 90 9 26 -53 53 59 -79 35 28 -12 -65 -36 -9
1445 -9 -90 -3 -75 71 -8 38 66 -32 -117 -35 -88 -78 30 -61 37 -45 20 -37 20 -50 -26 81 89 -60 8 5 -34 43 -144
1474 -144 45 -77 -12 36 -19 25 -22 -77 163 18 14 96 16 106 -48 114 -39 2 81 -101 -85 -73 135 -86 -21
1499 -21 -72 -87 9 -45 17 17 -8 132 139 10 -111 -17 104 -43 -25 -38 -67 -45 62 42 -23 -56 -29 -41 30 -5 36 15
$$ packed form
1306a06J01j36P6K3o6R0K8j0J13j28K2J0l1K8N1k8K3j17M6Q2p7N0j31J21q0J78
1332A32j73J09j25P5j12J01K7j39P9Q7j33R2M0k8j18j0J6Q7L0l8NJ0m3kn2k6K09
1359A00j32O4J4n4QJ04j20Np8J03lRj44n0J81L9l5j31J63N8j71MJ53o7n8J8K6
1386Fl0n6R7j3N3j19P5o8O7L2jn1O9Rq1P3j25O0K5kj6KN4j4j06L0n4P1j02J87
1416G2j06j2M4K3j26J03kN8n7q6NL4N1K3j4l5J15q1J7p9J06Oj38J14pm0n3K9K7
1445iq1Q7p2J46p9M6K8r8q5Q2n3J0J08r1R8q2O5n7N7p0K4J07Qj49O8ll9P7j87
1474a44J89j22O5M8n5M4m7n5K40j45mQ2q0R0j54J62j53M1P9j82J6J2K08k21O5
1499b1n1j5R6n4O2%k5J40Pj29j21R4J21j47J8j3k9K2J07k0o5l3K7j2P1l5M1k1
$$ plain form
1527 15 36 -64 -14 -79 -13 -7 53 82 -10 -54 -81 -127 47 -8 -57 64 -50 52 -181 77 -30 -22 39 -120 -16 -27
1553 -27 14 25 18 -115 35 17 20 -57 -91 38 12 -79 -58 -12 -5 102 -106 66 37 -52 -5 -7 -11 8 33 -23 -83 7 20 58
1583 58 -71 45 35 -90 5 -52 28 39 48 66 7 61 71 -53 36 -49 4 20 -51 131 -85 -33 6 -41 -52 -61 -39 92
1611 92 -17 -29 -38 20 -76 -51 34 -29 24 -159 23 30 -59 -59 8 19 6 15 -15 -48 -80 -55 27 58 -72 58 10 7 70 15
1641 15 -53 -33 -15 51 45 53 52 -10 -62 44 94 121 33 37 -55 38 104 6 126 60 -68 -13 -39 94 -57 -43 64 19 15 -62
1671 -62 -10 -13 95 -19 -94 -11 -27 22 56 -116 10 -17 -88 -31 23 -1 -58 -77 -10 56 -50 39 89 -20 18 -4 34 -67
1699 -67 1 64 19 -36 -46 -64 4 -76 21 -27 -5 66 -75 42 -32 -92 -70 51 -49 55 -36 -72 81 -49 -38 4 143
1726 143 -36 59 39 59 61 -16 -20 -51 -7 42 -74 -67 8 54 16 69 -1 13 -8 103 59 -63 50 61 23 29 -2 -18 29
$$ packed form
1527A5K1j00N0o5O6OO0K9r2m4k7m6J74n5m9J21j14J02k33K58j07QO1j59J04j1
1553b7M1J1pj33J50j8Lp7l4J29k6r1K1M6PJ07k08J72k9q9M7kmJ9K5n6o0R0J3L8
1583E8j29J16j0j25R5n7Q0J1RJ8n9N4J0j24Q9q5N3J6p1J82k16N2L9m7j1rK2J31
1611I2j09j2rN8r6K5Q5o3N3j83J82Pq9%O7J1j3Rl0l3l2K5Q2L1j30J30m8lO3n5
1641A5o8K0J8O6oQjo2n2J06N0K7q8Mr2R3O6r8J20o6j28N5k6J33j51J4J07m5mp7
1671f2N2lJ08j14p5Q3j6M9L4j72J26k7p1N7N4k4n7j9O7O6j06Q9N0j09L8k2L8j01
1699f7O8O3m5n5j0j8O8q0R7m8K2P1j41J17p4o0K2J21j00J04r1l6J53j30J1M2J39
1726A43j79R5k0K0Kp7ml1M4M9j16PP5M6l8N3p0J4k1J11m4j22J13J1l8Ol1j6M7
$$ plain form
1755 29 -121 -32 85 4 -4 72 -3 9 13 -76 62 126 -143 -81 -31 6 29 -71 -21 55 -9 18 65 -9 -13 86 -38 7 27
1784 27 0 -60 -9 59 31 10 -64 -92 -35 -20 7 -26 -11 47 -50 -63 37 -68 -3 11 -82 -93 -58 70 17 9 -34 -166 18
1813 18 -7 71 46 -14 -1 -25 0 -12 -122 127 8 36 0 -27 26 -2 71 -4 4 -65 -16 102 148 -20 -114 -3 -18 29
1841 29 60 -52 -30 68 -60 -3 -21 -3 -6 70 38 -40 -32 -8 -106 35 23 110 72 -57 51 158 141 -15 -87 46 -38
1868 -38 -19 -89 -66 -85 -31 47 -2 10 -8 -40 -52 -60 7 -11 38 -51 -156 0 72 33 -23 -72 -19 -63 -84 -9 -4 86 50 -24
1898 -24 143 -45 62 76 0 61 -12 59 35 -8 -4 -20 -18 -51 9 21 -40 -7 -82 -33 -129 78 -67 107 17 -21 195 94
1926 94 83 23 -103 63 41 -86 22 54 -77 -66 55 12 -78 34 4 35 -34 5 44 186 101 55 -7 -55 60 21
1952 21 19 -193 -4 -37 55 -35 18 -40 3 211 -66 32 36 -28 -89 -20 -49 -5 68 -57 -49 67 -18 -47 -19 -18 -42 -53 -53 72
$$ packed form
1755B9j50Q9J17q1qP6p5J2Mq9J38O4k69O2N0L7K3j00N0P6o4K7M7p4mR9j24M5K0
1784B7k7o0N1O8k8k1p4k8N7J5K7l3J5N8r7j3J00j05O5J4r3j1L5J28n3qm3j32J84
1813A8k5P8k5o0J3k4K5j2j10K49j19K8l6k7N3k8P3p5Qo9M9J18M6j68r4J11j5M7
1841B9L1j12K2R8j28N7j8J8lP6l2p8QK4r8J41j2Q7l8j29J08J07j7j56p2J33q4
1868c8J9p0K3j9N4P8m9J2j8l2j2qO7j8M9q9j05J56P2l9n6m9N3m4k1P5NR0l6p4
1898b4J67j88J07J4p6O1p3P1k4m3Mj6Kl3O0J2o1L3p5M9r6K07j45J74r0l8K16j01
1926I4j1o0j26J66k2j27J08L2j31J1J21m3r0J12l0L1o9L9L9J42q5m6o2m8J15l9
1952B1kk12J89l3R2r0N3n8M3K08k77R8Mo4o1O9k9M4P3j25QJ16q5k9K8Jk4j1%J25
$$ plain form
1982 72 -89 -23 48 55 0 94 104 -55 53 -42 43 47 -45 17 -34 105 70 21 26 -116 -83 -26 115 -83 -12 -112 -5
2009 -5 17 -19 91 45 123 125 -47 -152 -88 -150 -292 224 18 227 -320 337 191 -18 -179 118 367 95 -98
2032 -98 -267 -36 -285 -5 -1 -206 219 -87 -366 117 -329 516 -113 -78 -334 -126 134 -76 105 -131 -178 -156
2054 -156 192 -134 -462 166 418 406 -54 -300 131 252 355 -83 -488 -16 -89 -55 -410 -43 -117 512 -355
2075 -355 50 502 -312 312 -521 -135 301 -335 -224 -238 119 492 -10 46 237 108 -6 -592 624 -938
2095 -938 157 354 114 1 -353 -392 435 71 -162 183 -87 -147 -80 -58 -80 14 7 -4 18 41 -4 -33 32 -122
2119 -122 -100 84 45 43 23 -24 108 -57 -86 -27 47 15 -32 -9 40 24 24 17 -100 -57 27 40 -102 -46 118 -170 -28
2146 -28 10 -50 25 32 -24 -34 -42 84 -2 40 138 29 -105 -33 -75 -58 7 -68 48 9 -31 -47 -13 62 -18 -11 65 34 5 -55
$$ packed form
1982G2j61O6P1Pn5R4J0j59J08r5Q5Mr2O2n1J39l5m9Nj42L3N7J41j98P1j00J07
2009eK2l6J10m6P8Kj72j05O4o2j42N16k06K09n47O57j46k09j61K97K49k72j93
2032i8j69K31k49K80Mk05M25l06k79M83m46Q45o29L5k56K08K60k10J81k36m7K2
2054a56L48l26l28O28K52j2m60k46M31J21J03m38m05M72p3L4l55L67p4O29q67
2075c55M05M52q14O24q33L86M36o36J11j4L57L73n02N6J91j29j14n86J216j562
2095i38J095J97k40j13l54l9Q27l64k33L45k70o0O7K2k2R4pj1K2K3m5k9O5j54
2119a22K2J84l9kk0m7J32j65k9N9P4l2m7K3M9j6%pj17M3Q4J3j42N6J64k88J42
2146b8L8o0P5Pn6j0qJ26q6M2R8j09j34P2m2J7O5p5J16l9m0j6L4P5q0PP6l1k9o0
$$ plain form
2176 -55 2 -56 -8 15 -48 5 -9 9 19 31 62 -26 -32 99 -74 -29 -27 -50 44 -1 66 40 -52 86 162 -81 -44 36 17
2205 17 -12 -45 103 31 -60 3 -95 73 48 -23 4 63 90 -158 -40 0 -106 -68 50 13 -34 -18 13 136 -55 4
2231 4 60 -12 -154 -10 -1 -45 -35 15 -4 -70 -116 72 1 -50 11 57 -104 -43 -183 -8 17 -60 -2 32 -98 -24 -14 -92
2259 -92 -9 152 140 -17 -30 -5 0 98 8 -21 47 -4 38 -65 -93 -57 3 -145 53 -9 17 64 -49 92 32 78 27
2286 27 -141 -58 16 55 8 -45 37 37 -23 12 59 35 29 -32 89 -50 67 37 3 30 26 -106 -38 22 3 40 -22 4 -113
2315 -113 33 9 186 -63 134 42 45 80 -20 38 -44 -7 -72 -48 -4 31 -81 -111 -41 19 -27 165 27 -58 32 -96
2341 -96 43 43 3 -39 -38 21 -5 74 -44 -163 -1 10 -53 -7 -4 -75 44 -120 -112 135 34 -3 -84 42 -30 -31 -14 -71
2369 -71 42 -26 55 -66 14 20 39 56 37 46 -26 42 42 30 -3 30 -47 28 88 -51 -18 -82 -13 26 44 44 104 -31 16 5
$$ packed form
2176e5N7n8M8K3o3N3j4J8J0J2L1q8oJ31j73M5Kk3R4m5O7k6r2J38P6k43L7Q0j9
2205A7k9l3J48p2r1O3r8J68k5p1K7N9K7k48J18M0j06L8J18l7m7J6L1J23j91N9
2231DN6p2j42J44Rm4J0N0j9o6m6J88p1n1O1M6j61O1j40J75K5p7N8L4j30P4J0p8
2259i2Q3J61j2j57j3K5NR8r0k9O8n1M2j03k8L6O0j48J98o2K6M7j13J41o0M6n1
2286B7j68Q3P4L9m7n3Q2%o0L5M7k4oo1J21j39J17l0l4K7mj32O8O0j9L7o2K6j17
2315a13J46k4J77k49J97r2LL5j00N8q2L7o5K4M4L5j12l0P0O0m6J92j38q5R0j28
2341i6J39%m0m2JN9k6P9j18j19J62J1o3M6Lp1J19j64QK47j01l7q1J26p2jJ7n7
2369g1J13o8Q1j21Q0OJ9J7j9Rp2O8%j2l3L3p7P5O0j39L3o4O9L9J8%O0j35M7j1
$$ plain form
2399 5 -34 -48 84 82 -91 -16 38 -25 57 19 37 120 16 8 161 89 -45 70 -128 85 57 -10 145 31 -32 47 -10
2426 -10 -21 23 -149 21 37 9 -48 -48 68 19 6 -19 32 -63 -18 28 2 -1 -28 55 10 -12 -9 -14 31 67 -5 -15 -17 -91 54
2457 54 -25 13 12 -80 -34 30 -39 23 -42 -52 -13 70 24 36 158 -88 -66 16 -61 -35 -128 -55 3 -28 43 53 -18 -7 71 -32
2487 -32 43 -109 -60 -89 -39 10 34 -61 32 -12 -89 28 -24 -63 40 -17 0 115 47 -80 60 -123 -129 5 -43 36 -38
2514 -38 -26 145 -59 -21 -42 -38 45 39 -44 -64 -95 142 40 -24 12 -38 10 -30 38 29 -85 74 58 -62 49 -22 -32 18
2542 18 33 64 62 -68 -63 -101 -76 -36 -13 -91 30 -2 -6 -82 43 16 -86 40 -52 -104 135 20 25 31 -22 99 105 -4 46
2571 46 -97 -30 -4 33 4 -41 55 -40 -78 45 9 -142 -6 -19 4 -150 -31 58 29 -25 34 -5 -112 -2 27 -77
2597 -77 105 52 22 4 7 -72 -37 60 10 9 47 -28 53 -9 34 -42 70 113 41 83 52 87 16 134 7 8 114 79 -41
$$ packed form
2399El9j4J32kj73P5N4o3Q2l8J8Q3j04qJ53p2j34J15j98K13k8o7J55j14o3P9n7
2426a0j1M4j72J70J6k8n7%J16m9j3k5N1r5M5M6k6lk7Q3m5k2LnM5L6p2j0kp4J45
2457E4p9L8jr2M6O4o9O2o5j0L9Q3m6J2J22k46K2Q2p7K6r3P3N8l1P1J0p1J1P8j03
2487c2P5j52M9k9N0M9K4r5R3m4p7J17n2l9J03n7J7J15o8j27J40j83oJ34m8P9p4
2514c8J2J71k04L8k1MQ3oq3k0l1K37j02o4L6n0M8m0O8rj14J59j6j20J11p1j0N0
2542A8J5L1kj30Nl8K5M0K3p8J21l2mp6J25k7j02J26r2n2K39j15NOn3J21Oj09N0
2571D6j43O7K6L7k9m5R6r5l8J23l6j51J36j3K3j54J19Q9k9n4N9l9j07J10K9j04
2597g7J82n3l0j8Lp9L5R7n0jL8p5Q1o2M3p6J12M3p2M2l1L5p1J18j27JJ06l5j20
$$ plain form
2626 -41 -14 -5 -18 -6 112 50 -93 85 -31 6 62 -59 -119 58 30 -8 48 11 -45 -1 34 70 32 -34 23 26 57 16
2654 16 37 -59 122 114 -42 -40 -69 79 -100 -99 49 -43 5 -19 -126 -87 -67 50 58 -29 35 -49 -27 -39 67 17 42 -42
2682 -42 -39 103 -47 60 53 0 82 -62 -27 19 42 -14 -4 -111 -52 49 -134 146 22 92 167 -10 30 101 3 81
2708 81 80 99 102 74 -87 5 -17 16 -47 159 41 -63 -18 -2 -25 44 -32 -16 152 -24 86 -71 -105 -210 -570 160
2734 160 -221 189 -519 -632 -312 -352 205 -151 30 -5 220 15 -23 72 35 -41 -27 47 108 -30 89 41 79 -40
2758 -40 17 52 59 -66 63 -85 32 -102 73 -15 121 40 -33 -36 -77 84 119 -76 -72 8 13 43 -39 7 -87 -34 79
2785 79 -25 62 -6 -33 48 -71 20 20 48 8 -91 -92 61 54 -3 -27 -8 -24 14 6 -55 26 112 -141 142 59 -61 62 -20
2814 -20 -39 -8 -20 -40 6 45 41 74 44 -59 -44 -48 27 -40 -25 -28 7 -2 30 37 14 -25 -87 107 -32 -65 -6 21 31 -37 6
$$ packed form
2626d1K7Rj3J2J18o2j43J78j16L7N6j21o0J77k8l8N6l7n6M4L5L6l8o6N7LL1m1
2654A6K1r6J81qj56Kk9J48j79JJ48r2M8k4j07L9K0J17Qq7O4q4K2j2J06n0K5q4
2682d2LJ42j50J07pn3Q2j44L5M6K3n6J0j07N9J01j83K80j24P0P5j77M0P1r8P8
2708H1jJ9Lk8j61R2k2L3o3K06j18j04M5J6k3O9p6J6J68j76J10j57l4j05l60P30
2734A60l81M10p08j13L20m0N57l56J81l5K25k05l8R5l7p6J4P4O1j38J19m8L8j19
2758d0N7L5Pj25J29j48J17j34J75q8J36q1p3lm1J61L5j95MQ0NL0q2M6r4N3J13
2785G9j04Q7o8k7Q1j19R1%K8m0r9jJ53pn7k4J9j6L8qo1Q1Q6k53K83q3j20J23q2
2814b0j9L1j2k0M6L9mL3l0j03J5mP5o7J5lL5rL2Pk3l9o2J94j39l3N9K7J0o8M3
$$ plain form
2845 6 -131 25 47 -58 24 45 -6 24 13 26 10 41 -8 -14 48 98 -64 76 -39 -13 4 7 30 -20 13 -66 95 57
2873 57 -65 70 36 65 -56 -93 136 42 19 -35 -30 48 -47 59 0 -79 40 42 86 -79 64 150 -9 -29 -33 84 -30
2900 -30 -70 60 -13 -4 -45 -63 -4 -37 -78 21 -9 -22 37 43 72 -45 166 64 -106 34 -39 -75 3 36 -81 40 -1
2927 -1 -21 -5 -66 -52 -15 108 -7 -112 9 -14 -44 47 -13 20 63 -20 -8 -142 41 33 -43 -65 -28 93 47 -15 60 -97
2955 -97 -54 -154 19 87 10 22 21 24 70 45 101 -39 -60 -55 32 49 55 61 -53 47 -44 -18 22 -13 22 -31 19 94 28 71
2985 71 30 45 33 -9 10 25 -28 -21 40 -21 -92 -156 -98 3 39 -10 11 17 17 54 29 -41 4 26 -32 -96 67 -28 -80 -11 -5
3016 -5 -23 73 68 51 85 57 32 -13 96 -5 -23 -30 38 160 -125 4 -99 -151 -26 55 -20 43 51 -52 -43 20 -123 -13
3044 -13 -54 57 -98 -139 -21 -81 47 -1 22 70 -104 6 -36 -83 -17 11 27 71 21 -61 10 -7 -13 104 74 121 -39
$$ packed form
2845Fj37J56K2j05Q2K1n1L0j1J3j6L1m9oO2N0j62J40j15K6J7LK3n0L3p9J61l8
2873E7j22J35l4K9j21l7K29r4k3n4NP8r5J06n9p9J19KM4j65J43Q6j59k0mJ17j14
2900c0m0J30p3Rm1j8N9l3m1R9l0j3N9OK9j17K11j02j70J40p3l6P8L3j17J21m1
2927ak0J6o1J4L7J23j15j05J21k3l0R1o0L3M3q3J2j34J83qp6k2L7J21m6o2P5j57
2955i7M3j00J73O8p7J2jLM6k5N6j40k1NQ7J7OOj14J00r1K6M0l5L5n3N0P5o6M3
2985G1m1J5j2m2J9J5n3PO1o1p1o4N8J01L6m9K1O%L7k5p0M5K2n8o4J63r5n2O9O
3016ej8R6nj7L4k8k5m5J09j01j8pO8J22k85J29j03n2J25Q1p5O3Qj03RO3j43J10
3044a3m1J11j55m1J18o0J28m8K3M8j74J10m2m7O6K8J6M4n0q2P1j7oJ17l0M7j60
$$ plain form
3071 -39 16 -27 7 35 -65 -11 129 4 23 -30 109 1 -7 -66 73 -77 -45 20 -103 -61 56 -15 3 119 -39
3096 -39 51 146 15 -11 31 -21 148 15 29 -105 -2 38 80 -40 -71 -101 50 54 65 -120 -14 60 49 -25 23 -18
3122 -18 17 172 14 41 105 -125 -3 99 -75 -23 65 -31 -141 44 -3 -7 -19 0 -82 61 37 58 -100 -61 49
3147 49 -42 -135 41 -81 -198 113 71 80 73 71 -5 -84 -54 -40 2 -62 -22 -113 -39 -28 -43 65 -85 -7 117 -75 4 153
3175 153 18 -17 110 42 -6 -28 116 8 120 -9 -59 102 -105 71 -18 45 -141 75 2 141 26 54 12
3198 12 -16 -6 -28 -185 84 134 55 -44 6 15 109 -76 16 -64 -16 -23 7 -2 -68 -91 -48 16 10 60 104 108 21 44 -18 18 -48
3229 -48 -48 10 11 -6 118 -45 75 31 30 -38 22 20 1 59 -14 55 29 -17 -33 -30 -30 -20 -27 -24 -10 -51 116 -9 -24 -25 109 68
3261 68 -72 -61 -35 108 -90 -3 -72 -88 -41 34 17 -36 -87 34 -25 -96 -4 -10 -10 18 -50 82 105 -23 148 -6 6
$$ packed form
3071c9N5m3L4K8j00N4J40j25J9n3J39j08qn9J39j50L2O5j23M2J17p1J8J16j58
3096c9R0R5j31k6M2n2J69j33J4j34J03M0M2j20l1l0J51MJ1j85J06P4j1p4M8m1
3122a8L5J55j58K7O4k30J22J02j74N2Q8r6j10J85m7mj2J9q2J43k4K1j58L9J10
3147D9r1r3J76j22j17L11m2Rpkp6p9L0J4M2o4M0r1P4J1j5J08j50P8J24j92P9J49
3175A53j35l5J27o8m8k2J44j08J12j29n0J61k07J76q9O3j86K16p3J39j15K8m2
3198A2k8J0k2j57K69N0p9r9N0RR4j85R2q0M8pL0ro6k3M3O4oN0M4Mq7K3o2L6o6
3229d8%N8Jj7J24j63J20m4jo8O0kj9N8p3O9k6m6j6L%J0pLJ4m1J67j25j5jJ34m1
3261F8j40J1K6J43j98Q7o9j6M7P5j7n3n1J21n9p1R2o%K8o8J32K3j28J71j54J2
$$ plain form
3288 6 -73 39 -23 58 -3 14 97 75 47 0 -40 69 -35 70 83 32 -42 18 55 97 -45 -20 -25 5 -75 47 45 -52 -28
3317 -28 25 -34 -20 1 -33 31 142 77 -31 -43 -23 23 34 13 -61 15 -157 34 -91 10 25 47 81 -1 -49 -44 -76 -103
3345 -103 -96 -21 -48 -89 5 24 63 -54 -10 -35 -107 -77 -50 45 38 52 -12 -17 37 -43 80 47 47 69 32 64 -30 -35 20 -28 -30 -123
3377 -123 -44 12 -62 -24 27 -37 -16 31 -23 -119 -30 23 26 -95 -11 75 41 -76 32 -39 -145 49 -105 151 45 88
3403 88 -14 13 61 -28 -99 -61 74 4 -78 68 33 31 -42 -63 -36 16 20 154 -22 -32 24 98 7 -95 -9 35 57 -35
3431 -35 27 16 -45 -44 -42 26 -74 97 -24 -45 -87 11 -10 -46 21 -23 -34 -77 -22 -17 165 25 -55 -13 -96 76 -43 22
3459 22 69 -50 -1 -76 17 -62 41 -11 -17 -74 -2 -70 -65 37 -37 27 -31 -40 50 -33 -64 17 49 25 91 125 -3 -72 -65 -22
3489 -22 -3 -21 79 -112 -28 -81 -89 92 49 103 -86 108 -88 -64 -29 -5 70 35 9 16 6 -3 -16 62 25 -23 31 -26 -134
$$ packed form
3288Fp9J12o2Q1o1J7Q3k2k8m7m0J09j04J05J3n1p4O0L7M2j42K5nL0q0J22kr7K4
3317b8N3n9J4K1l4O4J11o5j08j2K0M6J1k1p4P6j72J91j25J01J5K2L4q2m8Nl2k7
3345a03PP5k7m1R4J9L9j17M4k5p2L0K7R5pJ4o4nN4q0J23l3%K2l7L2r4nN5m8kr3
3377a23P9N6p4L8N1o4K1M7n4r6Q9N3Lj21Q4Q6l4j17J08p1j06J94j54K56j06M3
3403H8j02K7M8q9p1L8J35p0q2J46l5kp3k1K7N2MJ34j76j0N6P4r1j02Q6M4K2r2
3431c5O2j1o1JKO8j00J71j21k1m2R8k1l6O7m4j1m3N5NJ82j40q0M2q3J72j19O5
3459B2M7j19M9p5R3p9J03n2on7P2o8NJ02p4O4n8rR0q3l1Q1L2k4O6L4j28o9PM3
3489b2J9j8J00j91Q4n3qJ81m3N4j89J94j96K4L5K4P5l5k6Pj0rj3P8l7m8N4n7j08
$$ plain form
3518 -134 -15 -37 29 -53 -86 -80 45 106 -17 7 -27 -71 -22 13 -135 3 -53 36 -64 52 27 32 -39 -36 61 -53 -17
3545 -17 -31 46 -30 -9 -65 73 -23 10 78 -8 17 35 18 -29 -4 52 38 -9 34 -12 58 -146 59 21 -124 -4 122
3572 122 -71 45 111 -54 24 -18 47 43 -27 -60 63 -100 56 -113 -103 -11 -29 -28 29 -58 75 -5 38 69 -8 33 -105
3599 -105 45 -108 73 -45 -72 -116 -9 -65 46 -18 -113 -32 29 -63 10 -72 18 28 -86 179 -28 -16 -53 111 -74
3624 -74 -85 -15 76 -37 -33 -21 34 5 67 93 -36 63 87 68 12 -28 -39 32 81 26 9 145 39 -21 -3 -20 44 16 -68
3653 -68 -9 9 -99 23 68 19 61 47 47 97 -32 19 -43 -49 -29 -5 -44 -55 -47 71 42 20 64 36 -135 44 10 -33 128
3682 128 -51 -43 35 -3 -2 3 -30 55 28 -27 -41 82 -28 -32 -17 -3 1 -18 42 27 -41 -44 -27 -159 95 33 2 -55 45 37
3712 37 -5 47 -10 68 -110 71 -94 -63 61 105 69 -100 -59 -24 -139 -14 12 37 7 27 63 39 14 8 -90 1 69
$$ packed form
3518a34J19k2O6q2l3OJ25O1j23K4l4m4M9L5j48J38n6Q9j00J16k5Np1LR7j14L6
3545a7j4P7p6K1n6J38r6L3O8q6K5J8j7m7K5N6j4m7M3m6P0k04K05l8j45J20J26
3572A22j93J16O6j65P8m2O5mp0l3J23j63J56j69J0R2j8JN7q7J33q0M3L1p7M1j38
3599a05J50j53J81j18k7m4J07n6J11o4r5Q1O1r2P3q2R0J0j14K65k07J2l7J64j85
3624g4j1P0R1j13MJ2N5k9O2K6j29R9K4j9n6m0j1P1M9n5j7J36j06o0J8j7O4k8q4
3653f8N9J8j08J22M5m9M2j4%N0j29N1o2oK0K4l9j1QJ18k9k2M4k8j71J79l4m3J61
3682A28j79QP8l8JNl3Q5k7n5j4J23j10mJ5J4Mj9O0j5o8lJ7j32K54o2l1n7J00q
3712C7m2N2n7P8j78J81j65L1J24M4l6j69M1L5j15J25K6K5l0K0L6k4k5or8R1O8
$$ plain form
3739 69 -11 186 -18 63 -95 -7 1 -34 -71 10 -19 -8 -25 67 20 -37 6 -100 64 29 9 94 0 46 91 164 -44 30
3767 30 -79 -67 53 -12 49 -11 91 20 -39 -9 -52 68 33 -55 15 -50 66 9 27 33 39 29 49 -11 -46 -79 -71 2 -21
3796 -21 -35 101 -19 -142 -26 -11 -79 78 63 -79 20 -63 -72 89 14 -22 -85 -197 31 107 -43 -22 -38 38 -51 -3
3822 -3 35 11 23 57 26 -23 -4 133 -17 -18 24 -73 -41 -29 -27 -35 -17 -35 51 -56 113 -96 12 4 -60 -98 -62 -14 -55 -75
3852 -75 24 103 -60 50 -15 91 -49 6 58 -34 -41 0 -25 10 -88 -9 14 -50 18 -39 90 5 22 61 -52 39 91 -34
3880 -34 48 51 -116 -4 32 -2 -33 -33 81 33 -41 14 -25 70 -29 49 -62 -47 68 50 -15 -78 -92 39 -8 -152 130
3907 130 11 8 -36 -1 -127 -2 12 78 65 -16 2 8 6 -10 65 -99 103 108 68 14 34 -10 -70 21 -5 57 -54 15 -52
3936 -52 72 98 56 -25 32 93 71 -42 45 4 -49 82 24 73 0 5 89 15 66 -96 115 51 -15 -45 9 -19 81 23
$$ packed form
3739F9q0J97k04Q1j58Q8Ql5l7Q1k9J1j7R2m7n7M3j06J64l5k0Q5r4M6M5P3k08P4
3767C0j09J2J20o5O1o0J02p1n9L0m3J20l5q8P0o5J16n7J8OOj0K0o0l5l3QP3k3
3796b1j4J36j20j23J16J5o8J57j5j42R9q3rJ61p5l6o3j12K28P6j50K1j6P6q9M8
3822cL8k4J2L4l1m9J9J37j50jM2r7L2J2KqJ8j8Q6j07J69k09J08qo4l8L6M8m1k0
3852g5R9P9j63J10o5J06j40N5N2r2pM1k5L5r8P9K3o4O8n7J29q5J7L9j13R1N2j25
3880c4Q2Lj67J12L6l4l1%J14m8p4N5l9R5r9P8j11J5J15j8o5o3j4J31m7j44K82
3907A30j19lm4L5j26J25J4O6j3q1J8Okj6P5j64K02Nm0n4K0m4o0R1k6O2j11O9o7
3936e2J24K6m2q1N7O1k2j13Q7m1n3J31n8M9p3NQ4p4N1j62K11o4o6l0N4k8J00n8
$$ plain form
3964 23 -29 -22 8 77 27 -52 64 9 3 31 -21 59 -75 79 12 -14 6 -115 12 77 44 50 -58 -60 28 -74 -6 42 24
3993 24 -2 71 168 -78 -15 24 -3 33 -83 12 -62 -84 78 27 -71 55 -58 107 -10 -37 -44 -76 -109 68 -55 24
4019 24 -29 -11 11 5 -60 43 -50 78 -16 7 62 -22 -39 50 38 92 41 18 49 11 68 10 26 41 4 22 87 71 -110
4048 -110 -22 -82 7 -21 -9 81 30 74 -66 80 -29 -11 -20 -16 23 11 -14 -7 11 28 -24 -75 18 -74 29 14 51 39 -134
4077 -134 -3 24 -86 49 63 -22 7 37 -51 12 -3 52 75 -67 4 33 4 106 45 -99 -30 -57 7 -12 -18 49 -45
4104 -45 -43 6 58 -83 -37 55 117 -24 -24 36 -2 -119 50 14 44 11 3 34 -89 103 63 52 -72 -46 -51 -18 -46 -10 -38
4133 -38 62 -163 57 -42 121 71 31 -38 84 -31 13 -31 -47 -2 -21 -43 -78 138 48 31 53 95 37 -46 -69 41
4159 41 -22 -83 94 45 89 -64 0 163 -26 55 26 48 -23 66 -13 -3 -38 66 -49 -30 -166 -50 -129 -8 32 64
$$ packed form
3964B3n2PL0O9n0p9J16n5oK8n2Q0j34J54o7k6K0j21J27O5l3Oj08kQ8j02O8M8j8
3993B4k6P3R7k46O3L9k7L6j16R5p4k2J62n1r8J26j13J65j17k7pl2l3J77j23P9
4019B4n3J8K2oo5J03r3J28r4K3N5q4j7Q9j2N4n1k3L1l8N7n8J6J5l7J8O5j6j81
4048a10Q8o0Q9k8J2R0n1M4j40J46j09J8rML9j2k5PJ8J7n2n1R3r2J03j5L7j2j73
4077a34J31K7j10J35J4q5K9L0q8O3j5N5K3j42P1K9k9J02o1j44O9k7O4j9oO7r4
4104d5KM9N2j41M6R2O2j41%O0l8j17J69l6L0l3qL1j23J92m0j1j24K6nL3k8L6k8
4133c8J00k25K20r9J63n0m0o9J22j15M4m4j6M5j9k2l5K16r0j7K2M2n8q3k3J10
4159D1o3o1J77m9M4j53O4J63j89Q1k9K2p1Q9p9J0l5J04j15J9j36J16p9J21M0L2
$$ plain form
4185 64 29 125 -103 -79 -78 -62 99 43 7 19 16 -53 59 20 29 60 76 4 27 -13 47 -70 3 -15 -44 38 39 -65 -80 -46
4215 -46 -71 -80 52 -79 18 17 -59 -29 -32 -75 79 -7 8 -38 -58 -125 -43 14 48 -23 -158 36 -33 22 35 -9 -13 13 38 -25
4245 -25 -21 -13 47 -62 -44 41 16 -21 -29 14 16 -36 -30 -87 -96 -25 39 -67 -21 -68 -43 125 -126 5 12 86 54 61 16 -19 -20 26
4277 26 -131 9 -40 31 -57 20 -71 62 50 24 -6 86 3 38 -38 53 -57 -48 14 80 22 151 50 35 -48 7 54 13
4305 13 -44 18 56 1 13 -4 25 -53 26 123 41 -32 -5 -81 105 -45 106 -24 92 5 -28 -105 7 45 -43 -6 -21
4332 -21 -92 46 67 -25 -73 12 2 -2 144 22 -71 -8 -91 -23 -67 121 -50 35 29 -20 22 -52 13 -38 39 -22 -45 25 33
4361 33 49 -20 -29 -75 -50 -52 -47 39 -18 -149 29 69 51 -69 21 14 41 56 36 -32 -4 32 19 100 -15 -20 34 -15 91 5
4391 5 59 22 21 -17 -8 20 -9 -24 32 41 -59 -87 22 -9 -58 -29 22 -3 101 80 -66 -1 24 -23 -22 4 -78 45 97 -16
$$ packed form
4185F4l5R6k28K4JJ6J61n6l6J2lo9J12l9RL1J6p2K3m0O0j17P3j8k9Q2Jj04j5L4
4215d6k5rJ32j31R7jp6L0lm3J54q6J5m6k0o7Q2N7L4p1j35J94o9N5J3m4mK6K5o3
4245b5MQO0j09J8Q5k5l7qM3Kn2On7rP1O4j06M6m7K5J68k51J31PP4l2Pm5l5jM6
4277B6j57J40m9P1q8P7r1J33j2k6l0R2q3L5p6R1j10RO2O6n8J29j01j5q3N5M7m1
4305A3n7O2L8n5J2j7K9p8P9R7q2p3K7p6J86j50J51j30J16q7l3p7J12L8q8L7j5
4332b1p1J38K1r2m8Q5j0mJ46j22r3O3q3O8m4J88j71Q5om9M2p4O5n1P7o1k3P0Q
4361C3J6o9rm6K5kNQ6n7j31J78M0j8j20R0pK7J5k0o8K8L6j3Q1j15nN4m9J06q6
4391EN4l7jl8RK8k9j5N6Rj00k8J09l1m9K9N1k5J04k1j46O5K5m7JK6q2J23N2j13
$$ plain form
4421 -16 -3 7 86 -97 13 33 37 34 77 2 -87 -42 36 -103 -122 1 18 27 -9 -17 -36 -44 -44 71 78 0 -130 -63 39 -43
4451 -43 -3 19 -20 1 -48 -2 -1 80 -57 100 70 -4 -48 -110 -101 -16 62 -82 -167 111 126 -42 -53 37 25 19 -74 103 -33
4480 -33 -26 36 -43 -45 10 56 54 -28 1 17 -49 34 68 -69 -85 92 -19 7 41 150 -24 8 31 -12 26 -51 96 -5
4508 -5 46 -95 -66 -27 70 -71 9 -52 -66 -111 -20 79 -5 -93 53 8 -37 -78 -34 -28 -20 21 45 35 -46 41 29 -2 9 -57
4538 -57 112 -98 -53 38 3 -46 51 9 53 83 -36 -11 -175 48 8 124 -193 7 -29 -17 2 -98 -65 -37 -26 33
4564 33 -37 14 -43 0 55 115 34 -4 109 -19 -45 -1 42 -8 113 14 -108 -32 85 80 1 -67 64 -75 243 111
4590 111 -208 107 -44 120 -60 -26 -58 -50 -72 22 20 -80 -35 -67 0 -96 -45 -6 -85 -41 24 28 12 48 -2 72 78 -4 87
4619 87 75 56 11 -5 -38 70 38 89 -52 -55 -31 35 -21 63 89 8 -11 23 134 22 -23 -12 -10 6 74 -10 97 -89
$$ packed form
4421a6J3J0P9j83J10K0MlM3p5q9M5P8j39j9J23J7Rl6qj9q%J15Pp8j30O7J02q2
4451d3M0K2l9K1m9M6JQ1j37J57l0p4m4o2RQ5P8j44q5K78J5j68j1R0j2or3J77j36
4480c3PO2p9kN5M6kq2K9J6o6Q3L4j37j6J77j11K6L4J09j74L2K3m3L8p7J47j01
4508eN1j41K9L9R7j41Q0o1j4m5R1R9q4q8J46m5m5m1M4OQM1K4j0q1Q7j2l1J1o6
4538e7J69k10M5R1l5m9R7m2M4L0j19K5j64K23m0J16l17K00l6J2J9j00L3K8J1N9
4564C3p0N1n7M3N5O0q1l8J13j28k6M4M3n0J21r9j22P6J17np9o8J31j39L18j32
4590A11l19L15j51J64j80L4l2Qk2R4kj00M5l2O7r6N1L9p9M4O5Mj6L6n0P4Oq2R1
4619H7j2j9m5j6l3J08l2N1j41lK4O6n6Q4K6q1j9L4J11j12m5J1KJ6O8q4J07j86
$$ plain form
4647 -89 47 38 57 -130 6 140 61 -84 38 13 -33 11 7 60 13 4 80 116 -27 3 -23 93 63 12 -37 -81 21
4674 21 -12 -84 -19 -9 91 -29 7 -35 33 -9 119 -81 -62 -6 -21 22 -47 83 50 -4 70 -51 61 34 71 8 -10
4701 -10 -35 -8 -96 -62 152 -153 -56 -141 -131 -31 -42 5 40 -26 -28 -31 11 123 3 51 49 75 49 -16 11 47 -91 -42 82
4730 82 125 57 52 103 12 -63 -82 -62 -2 -17 -56 -7 44 -62 42 -22 -16 24 -32 -46 112 -67 36 82 -123 54 80 -1
4758 -1 43 -58 -32 93 48 36 -65 46 -1 -37 -2 -131 142 18 -109 64 1 -19 -77 56 -123 -3 -26 -49 -80
4783 -80 73 -65 39 19 24 53 122 -24 -34 -20 -8 48 69 -73 40 -63 -64 31 -122 -35 -24 -56 -24 -101 8 -75 23
4810 23 74 -22 -78 -88 17 -21 -65 -6 164 -33 38 42 72 10 4 62 -5 36 4 17 73 -7 -74 -9 118 -41 74 16
4838 16 42 -94 2 67 39 -59 -73 14 27 24 37 -25 41 18 -33 0 -41 11 11 -26 63 -55 -4 -16 -50 -5 -93 60 -24 -41
$$ packed form
4647h9J36rJ9j87J36J34p9j45J22k5m6M4mN3m7rP6L6j43L0k6J16l0n1m9m4J02
4674B1l3p2O5J0J00j20L6m2O8m2J28k00J9N6j5M3o9J30l3n4P4j21J12k7L7o3j8
4701a0k5K7q8L4K14l05R7q5J0J00j1M7L5o6klM2J12j20M8kK6k6o5K7L6j38M9J24
4730H2M3o8nN1r1p5j9K0O0j5l9M9N1j06J04o4OM0n6j4J58j79J03M6k05J77K6q1
4758aM4j01K6J25m5j2j01J11m7l6L5j29K73j24j27J73o3k0n8J33j79J20k3k3l1
4783h0J53j38J04k0NK9O9j46j0J4J2N6K1j42J13j03jR5j53Q7J1l2L2p7J09q3R8
4810B3N1r6n6j0J05l8m4N9J70j97P1ML0o2oN8o7M1l2J3N6q0o7O5J27j59J15n8
4838A6K6j36R6O5k8r8j4Q7J3lJ3o2O6k3n1L3m1N2%l7Q9j18N1j2l4M5q8J53q4j7
$$ plain form
4868 -41 83 -25 24 -46 -70 -19 -18 -34 -91 113 73 130 -57 -69 16 13 20 33 25 47 77 -5 74 -64 -61 17 0 -53 8 -30
4898 -30 21 -64 -10 180 -12 8 55 45 -31 21 -71 -93 7 -7 125 -17 -85 26 76 21 -44 8 -88 -100 3 -44 70
4925 70 61 -71 20 -22 -92 45 14 -26 89 70 3 -50 0 78 21 41 -23 5 -51 27 -9 46 22 1 -6 -8 134 -89 5
4954 5 -17 -38 7 49 40 39 -13 -56 61 -61 -55 -97 12 11 -59 55 110 -91 141 58 11 -38 1 -21 -79 -50 -10 1 -2 92
4984 92 -35 -100 33 4 -14 -13 -91 -120 71 15 -100 -1 -48 -100 102 9 -4 -30 -53 -21 -45 47 -42 25 -43 31 -36 67
5012 67 25 -5 100 -28 -105 16 32 -41 -24 -50 31 -12 74 -47 124 80 35 10 14 -18 25 -49 -71 -51 20 35 1 70
5040 70 -14 -17 -132 -97 22 76 -65 -11 -5 -20 12 38 -44 42 37 -61 14 -51 -112 99 -19 71 -8 -114 -59 82 78 43 -58
5069 -58 104 -4 61 12 -2 52 90 19 -46 -5 -79 81 -62 33 -23 -30 30 -67 63 -32 -4 6 -43 -6 -93 -5 -59 50
$$ packed form
4868d1J24j08M9p0k4N1Jj6n7K04m0N7j87j2Q5lPJ3qK2L0q2P9j38LP8j7n3O1l8
4898c0N1q5N4J90j92K0M7j0p6N2r2k2J00j4J32j42o8J11N0n5o5N2r6j2J03m7J14
4925G0rj32R1m2p0J37l1m0J15j9o7n3N0P8n7K0o4K8n6P8l6N5k4k1pkJ42k23R4
4954Ek2k1M5M2rjn2m3J17j22Om2J09jp0J14N5k01K32q3m7m9L9k2n8K9M0J1lR4
4984I2j27o5J33k9j8Jp8k9J91n6j15R9m7n2K02r3j3k6k3L2k4R2q9O7o8P4o7J03
5012F7m2l0J05j28p7J21J6p3J7k6Q1m3Q6j21J71m4m5k5Ml2M3p4k2K0P1J5l4O9
5040G0q4lj15L5J19N4j41N4Oj5L2K6q2Q6nr8P5o5o1K11j18R0p9j06N5J41ml5j01
5069e8J62j08O5m9j4N4L8p1o5M1p4J60j43R5n6pO0r7J30r5K8J0m9L7q7Q8n4J09
$$ plain form
5097 50 30 4 -44 15 -23 69 31 -44 -24 -48 -33 -40 -7 -75 57 68 -52 -41 -42 -66 -41 -2 -47 66 87 -15 -9 150 -15
5126 -15 24 74 -10 -54 35 66 -71 41 -75 -3 20 17 15 84 27 -50 -31 -42 8 53 -42 24 99 -90 -120 -31 55 -58 -37
5155 -37 -60 -67 -44 115 -31 8 31 -23 -33 -9 40 -8 81 17 62 -51 5 -53 -36 -83 80 7 65 16 9 24 29 26 35 8 -62
5186 -62 43 -106 -70 -70 -18 -18 71 51 -40 20 -53 -39 -59 -8 60 73 42 -154 63 -7 109 67 25 37 -4 -46 -99 81
5214 81 -10 53 54 -29 11 -29 99 79 -5 16 36 -69 -112 75 -75 3 142 -40 23 122 -43 -13 54 -44 54 -8 -116
5241 -116 27 44 93 -2 156 -217 -27 -21 81 82 -52 -8 -28 -12 -31 -105 21 20 8 10 2 -84 18 70 1 55 53 36 -16
5270 -16 -29 89 7 -47 -20 43 15 10 -101 -23 62 22 56 -60 68 -90 32 -26 107 -8 4 -60 -43 -3 -1 -79 -44
5297 -44 -54 15 -131 -37 134 -106 -19 -58 47 -10 -52 72 -83 -55 26 44 -98 -22 117 41 -78 -10 40 42 35 50 -49
$$ packed form
5097E0k0k6m8N9l8R2l8p5K0k4J5pL3o8J32J1j20J1jk4K5L9m5J13K1j02OJ59j65
5126a5L9N0q4m4Q9L1j37J12j16P2K3lkO9n7p7J9j1N0M5r5O6P5j89l0Q9Q6j13K1
5155c7k3pK3J59j46L9K3n4j0K4M9m8Q9o4M5j13N6n8J7m7J63p3N8m9pJ5NlRk7p0
5186f2J05j49L6%N2%Q9k0r1O0p3J4k0N1O8J3l1j96K17p0J16m2m2J2m1m2n3J80
5214H1r1O3Jq3M0m0J28k0q4K1K0j05m3J87j50P8J39j82O3R9j65L0O7r8R8o2j08
5241a16J43J7M9r5J58l73J90OJ02Jj34M4k0J6j9p4J26jj2Kqq6J02N2o9N4kj7n2
5270a6j3J18q2n4K7O3k8nj11P8Q5m0L4j16J28j58J22n8J33j15J2o4J7M0Kp8L5
5297d4j0O9j46R4J71k40Q7l9J05n7m2J24j55K8Q1J8j42P6J39p6j19O8N0KpJ5r9
$$ plain form
5324 -49 36 -83 -85 -10 -3 -74 -71 -36 -33 -41 24 22 -78 -59 1 -33 19 11 -3 -15 -92 83 -59 55 -43 -95 36 -5 -10 45 32
5355 32 -121 -81 -57 -8 74 112 -26 -11 82 -48 -15 76 52 138 -5 109 -72 -68 38 -59 -44 -13 31 6 -14 -43 -68
5382 -68 95 -68 98 -93 -92 44 -2 -72 -102 43 -58 -30 -9 26 -38 -36 70 7 -66 -21 -72 37 -61 -131 32 -36
5408 -36 17 5 -86 -7 -25 -64 61 -9 1 39 58 24 10 -113 17 39 -34 10 -23 -68 5 -29 22 22 17 81 68 -43 15
5437 15 32 -2 -48 -12 -37 19 -37 -28 -113 -77 73 67 21 6 -19 57 14 -183 -107 -1 -52 -13 134 -64 48 -82 2 -30
5465 -30 -2 42 25 62 -4 8 10 -24 36 86 11 -15 4 3 -83 2 42 -94 -81 15 -60 -51 100 -112 36 78 -64 37 31
5494 31 -28 70 -27 -41 -38 -85 82 1 0 114 -96 44 40 -18 -36 -2 184 13 -8 -14 -68 69 69 23 25 41 44 8 49 -26
5524 -26 -2 -147 15 -70 115 15 33 -12 6 -70 -18 -3 6 4 99 -14 -45 -1 -27 69 -89 -49 -80 10 89 -100 -62 -88
$$ packed form
5324d9Q5j19kP5Pp1LL5LqO5kj00J9O0l4N2qj4j2p7J75j42J14r8n2J31m1nN5j3
5355C2j53M0K4M9Q2L8j38J5R3j30L3R1k4Q6j43J14j81MJ06r7J5L1M4k5k0k9k5
5382f8J63j63J66j91JJ36m6p0l0J45j01K8K1L5o4KJ06o3p3M5n1J09r8p0J63o8
5408c6N3j2r1P9j8l9J25p0J0L8J9l4j4j23J30K2p3M4l3m5P3l4N1%nO4j3j11N8
5437A5J7l4m6L6k5N6n6Rq5L6J50om6j5k5P6m3j97P6J06n1L9J47j98J12j30Q4l2
5465c0K8M4j7L7o6J2Kl4O0N0p5k6J9jq6Q5M0j36J3R6p5RJ51k12J48M2j42J01o
5494C1n9R8r7j4Lm7J67q1jJ14k10J40mn8j8L4J86j71k1on4J37%m6KJ6Ll6M1p5
5524b6K4j45J62q5J85j00J8m5J8p6N2J5RkR5j13l1M4k6R6j58M0l1R0P9j89L8k6
$$ plain form
5552 -88 27 -161 3 53 -5 -57 106 -15 46 -2 -50 -12 79 103 74 11 26 44 -45 -64 -96 90 -325 -49 95 -20
5578 -20 -11 -42 6 124 7 -93 19 -13 -5 -84 -19 -7 16 -28 -27 115 -71 188 53 51 50 -4 -53 -68 18 -85 -63 18
5606 18 45 -43 -33 -58 -35 42 -2 -5 -22 18 -90 -50 -13 27 -12 -57 -60 -64 -9 8 -51 -26 56 -49 -132 17 -42 28 19 20 79
5637 79 37 45 -31 -37 94 29 -76 -66 23 72 -32 -55 0 43 208 89 40 -33 1 -112 25 74 -47 -33 -9 -61 -13
5664 -13 152 57 4 -28 -81 -5 -43 -24 -62 27 -63 39 -64 14 11 -52 -25 -81 -33 -126 55 -34 70 -34 54 -11 58 -36
5692 -36 -28 38 4 32 -2 -48 19 79 -43 6 8 -26 154 -14 -110 41 -65 119 -1 -87 -53 -58 111 -33 -6 41 -48
5719 -48 85 31 -63 -7 -42 47 17 -70 -28 -37 39 77 10 3 36 -64 -13 63 93 -2 -23 -11 -10 54 -24 -61 -120 69 33 -48
5749 -48 122 24 59 69 4 73 126 -41 12 9 33 -57 -49 16 83 -28 -3 -50 -20 26 22 -1 12 142 17 -51 35 -25 60
$$ packed form
5552h8J15j88J64N0n8n2J63j21O1m8m8L8R1K4k9o3J5J8q9j9l2J86m15K76J44j15
5578b0Rl1M8J18j17j00J12l2Qp9O5J2K3m4JJ42j86K59j35kjn4m9j5Q6j03K2Q1
5606A8K7q8J0k5K3P7m4lj7M0j08M0L7M0l9m5lmN5J7n9K5Q2j05q3J49n9P0rJN9
5637G9m2Qp6oJ31o5j05J0Q9M9j04k3N5M3J65j19m9p3L4j13J37M9j21J4K4n2M8
5664a3J65r5n3l2n3P6l8J9l8Q9r0J02j03P8lo3K7n6M8r3J81q9J04j04Q8o5O9r4
5692c6QO6l4K8l4m6O7O0j22M9Kl4J80j68r6J51j06J84j20q6L4nJ69j44K7M7q9
5719d8J33n4r4N6l5Q9l0q7M2rP6L8o7pL3j00N1P6L0r5k1J2JO4p8l7n9J89l6q1
5749d8J70r8L5J0o5O9N3j67N3lK4r0QO5O7j11K5m7L0M6mk3J3J30j25o8Q6o0Q5
$$ plain form
5778 60 -34 -73 41 65 -20 -51 3 66 -132 -10 -50 -33 -63 -45 -35 -30 41 24 -5 -103 32 -59 71 -60 -4 -68 -9 76
5806 76 -9 -142 -27 -17 47 -32 -137 -130 -178 -89 -29 -67 -25 26 61 6 19 -5 -6 -26 -84 76 -126 -57 -16 0 10 -44 -64
5835 -64 99 -24 71 -42 38 -7 -47 -86 -63 -4 75 -10 44 -6 -21 -18 26 8 -86 40 57 11 -60 6 -1 -4 -48 -50 -67 -76 94
5866 94 -124 71 100 4 26 5 88 -35 -34 -32 24 -62 36 8 -2 45 -36 75 45 52 75 -41 21 22 -10 57 -79 6 40
5895 40 8 43 24 33 -25 39 9 -64 -20 -9 -15 45 4 -13 -87 57 160 132 5 -44 79 -73 -29 -51 -70 46 -10 -36
5923 -36 40 31 2 115 65 5 31 -80 23 -55 -46 -8 -84 -43 54 32 -5 4 -19 68 153 -66 8 -92 90 24 -40 -25 -16
5952 -16 42 -4 -82 -130 -31 123 -30 33 32 -29 -31 7 -42 106 103 -65 14 88 35 100 23 43 13 -56 1 59 23 33 1 -34
5982 -34 -28 81 -57 90 -29 50 59 27 -70 -51 29 -50 38 74 111 -16 36 46 94 -49 48 -22 48 59 10 -74 -70 14 -30
$$ packed form
5778F0r4l9J14K4q5l1N4O3j98J22m0J7l0J8J0NP1j7k9r8J35r1J30j31N6o4N9Q5
5806G6q5j33J15J0O4p9j05Pm8Q9O0l8M2N1L5n5J3k4jk0n8J60k02O9M1J6J0n4k0
5835f4J63j23R5j13Q0m5m0l9K3N9P9q5N4n0j5LM4j8r4J26J7m6p1O6plm4kj7rJ70
5866I4k18J95K9r6K2k1Q3j23JKN6q6R8k8j0M7q1J11l0PK3j16O2Jl2O7j36Q5L4
5895D0l2L5j9Rn8O4l0p3M4J1oO0m1j7p4J44J03k8j27m9J23j52M4k2j9J16n6k6
5923c6P6rk9J13n0o0K6j11J03p8RL8p6M1R7k2l7Rk3Q7Q5k19P4j00J82o6o4J5R
5952a6N8m6p8m8R9J54j53O3jo1kL8m9J48lj68P9P4n3O5p7K0l0o9N7N8l6J0l2l5
5982c4OJ09j38J47j19P9Rl2r7J9Q0p9Q8L6L7j27N2J0M8j43R7p0P0J1m9q4MQ4m4
$$ plain form
6011 -30 -12 6 24 -5 50 -21 8 124 -7 99 -37 80 12 -24 53 -12 48 109 43 39 -45 -1 83 -25 -111 7 59
6038 59 3 30 47 -52 -57 17 103 4 80 54 -17 -16 -107 -88 -29 -30 -14 61 -22 92 90 83 103 -106 41 155 27 -53 34 -64
6068 -64 127 -54 91 33 -71 0 -53 -86 14 61 9 8 62 84 -116 -33 -63 -146 54 120 15 -100 -65 5 -29 -34 -59
6095 -59 -23 -7 14 -89 86 58 47 -66 -14 -9 -53 -98 3 -23 -11 7 94 55 -65 -24 57 18 35 52 -52 -42 -43 110
6123 110 -2 -12 -19 9 -2 -63 -52 65 -26 -16 53 -12 -96 26 -20 99 78 -110 -51 -38 11 40 4 75 -32 -53 -44 -12
6151 -12 -81 -15 64 -12 8 -8 67 -73 73 38 39 21 -134 84 -8 -78 17 8 -39 48 47 -109 129 -75 121 -67 -68 -121
6179 -121 -18 -38 -1 -120 23 89 20 -11 5 -34 -46 -16 34 -15 59 40 -97 -20 60 -1 -65 67 -49 -2 60 31 -52
6206 -52 -120 39 -58 -66 72 -44 29 157 39 48 72 -6 16 15 -20 19 -43 -5 39 12 39 -22 48 34 -11 -25 130 -11
$$ packed form
6011c0J8J8J8k9N5p1K9J16j31J06j36J17o8l6P7o5O0O1o6mq4M4Q4j08q6J18N2
6038E9n6K7J7r9nP4Q6r9P6k6p1Jr1J9N9jJ6P5q3J14kpK0k09J47J14j28q0Q7r8
6068f4J91j81J45n8j04P1n3l3J00M7n2jN4K2k00Q3l0q3K00O6j05j15L5P0l4nk5
6095e9L6J6K1j03J75k8j1j13N2Nm4m5J01k6J2J8Q7l9j20M1Q1l9J7J7j04J0jJ53
6123A10j12j0pK8j1o1J1J17r1J0O9o5q4J22m6J19k1j88N9J3M9K9l6P1j07k1RL2
6151a2o9O6P9p6K0j6P5j40J46l5Jj8j55K18r2p0R5rm7Q7jj56K38k04J96j88jn3
6179a21J03k0L7j19J43O6o9l1J6l9j2L0N0m9P4j9j37P7Q0o1o4J32j16M7O2k9q3
6206e2o8J59r7qJ38j16P3J28j18RK4p8K2jl5L9o2L8M4k7K7o1P0j4m5j4J55j41
$$ plain form
6234 -11 -116 -38 -58 -73 -11 5 112 -140 6 44 -6 -35 91 45 35 28 -53 -45 -42 -12 38 72 -38 29 117 58 -20 64 -22
6263 -22 -27 -140 -10 27 18 23 76 -4 15 -25 -34 -90 -77 -3 -49 71 16 -16 -37 19 16 56 74 60 -65 84 39 -16 -77 -50
6293 -50 -32 83 -96 -8 -71 11 40 -7 19 -61 55 -22 15 -22 38 20 5 99 2 62 19 124 2 -51 -131 7 10 154
6321 154 59 -62 33 -83 -24 16 20 2 33 -18 57 132 51 -69 21 20 7 -64 -169 -35 62 -17 50 19 41 -81 58
6348 58 -73 -1 77 -49 8 -29 22 -52 -14 -30 23 -18 -5 58 -19 -54 10 -83 -120 63 -43 -7 -33 -148 -127 10 -109
6375 -109 -55 -23 -99 -154 -31 27 -56 -28 -15 -6 37 23 -46 58 86 53 -6 -13 12 40 76 6 -43 68 -2 51 99 -18 67
6404 67 -26 65 53 -46 -23 34 36 -37 53 21 -101 62 7 36 -28 -125 -38 -1 10 42 55 42 -100 24 1 -16 45 -23 -34
6433 -34 -40 18 21 -37 -43 54 -5 31 86 36 33 34 -40 -4 33 3 19 -59 -39 -53 -1 46 58 -93 -7 -31 -9 34 -70 97 -11
$$ packed form
6234a1j05P8k0j5O2J6J07k52J46L8n0k9J26m6j0pq1QLL0N0L4j10O7Q8n9p8Q4q6
6263b2nj13J30L7rNN3q0J9m0rn6J3P4m6J20n5l2k1N6lM0J8j4j25J49m5n5o1K7
6293e0J8J15j79Q8o3Q2K9m7K6q0J16p7L7l7O0j8j5R4r7O0m3J05j22n3q0J38LJ44
6321A54r5j21R5j16N9M0Mj8L1n1P5P5q1j20R0jj3p1j05J34R7p9O7l1K2j22J39
6348E8j31P2P8j26N7l7N1p4L8j6N3m1J3O3p7l5O4r3l7J83j06L6k6j15K1J37j19
6375a09N4L2p6n5J23N8q3K8J3RM3j4o9J04K8l3n9pK5K8L6p0m9J11p0N3M8j17Q5
6404F7r3R1j2r9K3N7Kp3R0l2j22J63n5K9o4r7Q7L7J1L2J3j3j42J24k3j7O1o8j1
6433c4oN8Ln8oR7n9L6N5n0lJp4L6L7l0J6p8K0j4N2M7J2j51Q6k4K2M3j04J67j08
$$ plain form
6464 -11 11 45 83 5 43 59 116 -28 -77 7 -9 20 -15 -63 18 -23 -43 25 -126 35 -9 70 8 17 24 14 -3 16 4 -11
6494 -11 57 -6 100 34 -67 -11 55 -80 45 -65 35 48 80 72 -84 -61 -6 -59 -2 -20 88 21 82 25 43 -17 39
6521 39 -27 8 -56 -103 24 -11 76 -30 -9 75 93 57 72 29 73 -62 40 36 146 39 55 61 16 -8 97 -14 -53
6548 -53 17 19 28 -123 14 -21 8 -72 17 39 4 50 -25 -41 98 11 -14 -4 58 39 -67 149 -14 19 -92 -29 92
6575 92 -68 8 -79 71 48 0 -49 109 100 -47 -50 67 -41 -28 -20 -9 80 -28 -20 31 -73 80 -23 -1 -27 82 -2
6602 -2 -65 -71 -66 -28 -59 -2 -50 40 113 -46 91 22 29 22 -84 -24 11 61 61 13 -19 21 -2 -33 -68 -61 26 30 -1 38 -25 32 27
6635 27 27 147 -121 -85 -3 11 -81 -77 -87 -12 -6 94 9 41 39 -33 63 46 -53 -91 62 -4 211 -82 -28 218 301 357 -8
6664 -8 189 845 90 704 690 -8 -171 27 -37 -33 6 3 -76 -16 -19 22 -58 -76 26 -10 41 6 -90 -5 59 22 -58 -45
$$ packed form
6464a1K2L4L8p8L8J6N7j44m9Q4j6K9l5m8Q1m1k0O8j51J61m4P9o2RPj0j7J9j2j5
6494a1O8o3J06o6j01N6O6j35J25j10J00J3L2qj56K3N5n3N7j8J08o7O1n7J8o0N6
6521C9o6L5o4m7J27l5Q7j06K1Q4J8l6J5m3M4j35J02mJ10j07J6Om5k4J05j11l9
6548e3P0KRj51J37l5K9q0Q9K2l5M6p5j6J39q7k5J0O2j9j06K16j63L3j11O3J21
6575I2j60P6q7J50k3m8m9J58rj47lJ17j08J3QJ1Q9j08QN1j04J53j03K2k6J09q4
6602bo3oNL8l1N7m8R0P3j59J37o9Ppj06O0L5N0%m8l2M0k3l1l5PQ7Ml1L9o3N7n
6635B7%J20k68L6Q2J4r2Mj0P5OJ00q5L2kp2R6j7r9l8J53o6K15k93N4K46Q3N6l65
6664hJ97O56p55O14j4o98j63J98o4ML9lp9O0lM1q0j8J02l6N1l5r6Q5O4l7q0J3
$$ plain form
6692 -45 -46 95 33 -87 78 -60 23 -7 10 -18 8 106 9 -54 -3 10 57 3 24 -56 95 3 29 3 -2 -21 -9 113
6720 113 -28 -42 43 59 135 -76 95 80 -45 5 54 -3 9 30 -69 6 -43 -53 87 -69 -40 -12 22 33 -95 35
6746 35 -42 39 36 83 20 -8 70 2 -49 -102 -66 21 -36 90 -66 -46 -112 -33 14 -146 59 -31 87 11 -2 -11 -36 61 30
6775 30 4 -48 69 59 -134 16 -171 -36 -43 -140 -4 -38 -29 -40 -24 -125 -54 71 69 -86 45 76 -73 -52 -115 23
6801 23 -50 49 -68 -84 -12 -1 17 40 -2 -92 -5 -57 -120 85 15 -38 -49 22 40 8 24 -48 -17 5 -18 16 -122 78
6829 78 -55 -85 0 -78 47 -100 15 29 -28 63 -60 -46 -26 45 -64 8 -65 -53 65 -14 14 34 -33 11 -8 66 -43
6856 -43 27 -47 94 -28 -27 60 76 -65 10 23 -10 -92 30 -11 -11 -20 -23 75 56 12 -76 -10 -46 -135 7 8 45 -22 20 94
6886 94 30 -44 -40 48 -27 -39 -90 3 37 53 -57 73 -51 -22 -36 -41 -6 -77 -10 45 18 -57 -11 -32 10 -12 53 22 -50 -1
$$ packed form
6692d5jJ41o2j20J65j38Q3l0J7k8K6R8r7o3N1J3M7n4K1q0J51r2K6k6nj9J2J22
6720A13j41j4Q5J6P6k11J71j5j25N0M9n7J2K1r9P5m9j0J40j56K9K8L4J1j28J30
6746C5p7Q1lM7o3k8P8o8n1n3L6Q7n7J26j56K0o6P9M7j60K05r0J18p6j3rk5R7l1
6775C0k6n2J17j0j93J50j87J35pr7J36l4Rj1J6j01P1J25kj55J31L1j49K1o3J38
6801B3p3R9j17j6P2J1J8K3m2r0Q7n2o3K05p0n3j1P1J8l2J6p2L1K2k3L4j38K00
6829G8j33l0Q5p8J25j47J15J4n7R1j23J4K0P1j09P2p3J2J18p9K8K0o7M4j9P4j09
6856d3P0p4J41j22JQ7J6j41P5J3l3q2J22m1%rlR8j9m4q8O6l6q9J42JL7o7M2P4
6886I4o4p4MQ8p5j2n1R3L4J6j10J30j24K9j4nL5p1O7N5k7p5M6k1M2k2O5l1p2M9
$$ plain form
6916 -1 -11 -35 -20 16 60 -41 2 -56 -76 -139 -65 15 17 10 79 -44 17 -27 -58 26 -19 -110 12 37 14 73 93 70 115 26
6946 26 -62 -41 107 60 15 -43 1 59 64 47 -106 -27 53 -118 -4 26 18 3 -15 -58 92 -26 -37 -40 92 -37 22 8
6974 8 -25 -6 -46 15 -52 -29 -131 -23 -62 -41 -5 -83 40 51 -30 -28 -7 6 -39 8 -39 -30 26 43 -112 29 46 -20 -54
7003 -54 48 54 16 79 -30 -5 52 68 -86 -11 -51 16 11 80 -109 -36 8 -46 -37 -5 34 74 -73 -24 27 -24 94 118 -27
7032 -27 1 15 -11 -27 -55 -85 80 88 40 -5 -116 63 -79 45 -1 -21 -14 23 -44 -33 -20 -32 -51 -5 14 63 -35 -65 -105
7061 -105 1 30 -45 -70 -40 81 -31 -42 -102 62 35 -102 29 44 -71 -85 11 -20 -2 44 -71 0 -78 -15 -35 -95
7087 -95 -94 -78 125 44 51 -8 -81 -23 165 -9 38 -80 -92 1 -41 -32 -78 -26 45 -10 16 18 42 -3 -5 -129 15 -21 31 46
7117 46 20 -87 3 -76 10 31 -57 -45 -82 129 -36 46 -130 -73 -10 -40 -88 -17 6 -39 84 37 11 -78 -36 -14 -100 49
$$ packed form
6916aj0k4J5L6M4j01M3n8k0o3P4Q0KpO9j23O1m4l1Q4m5r1J22K5k3N9K0k3M5q9
6946B6q8K1J48m7m5n8M4N8Nj7j53P9Q0j71J14L0qj5j8m3J50j18j1lJ32j29N9j4
6974Hl3J9m0O1o7K3j02J08l9K1L6p8J23J1q1KK1J3m5M7m7RN6J7j55J41J7o6l4
7003e4J02Ol8O3j09K5N7J6j54P5m0O7nO9j89P3M4n4RL2L9M0j47M9N1n1J18K4j45
7032b7K8J4k6j6k8l0J65Qm8m5j11J79j42J24m6k0PL7o7J1J3j2j9M6J9M9r8l0m0
7061a05J06K9p5k5L0J21j12j1o0J64k7j37J31J5j15j4R6l1J8M6j15P1p8O3k0o0
7087i5JJ6K03q1Pn9p3N8J88j74M7j18j2R3m2Rm6N2P1n5K6KK4m5kj24J44l6N2J5
7117D6k6j07R0p9Q6K1q8J2l7K11j65Q2j76N7O3l0m8P1K3m5J23m7k6q9M2K2q6J49
$$ plain form
7145 49 -14 43 39 -71 5 3 -132 50 -14 13 -66 37 43 -105 -33 -57 21 -11 28 -63 9 84 -5 -61 8 -3 -24 -58 32
7174 32 -92 0 12 0 32 -79 -12 -16 -57 -88 -16 -41 -52 -16 -56 118 -4 11 -113 50 -55 -11 36 5 42 -43 -30
7201 -30 -43 -93 41 63 -31 21 53 -78 -121 -21 111 66 14 54 8 77 159 -31 -115 -14 -52 5 -122 -5 44 132
7227 132 11 -109 -1 -2 93 51 -65 -78 -12 -5 -28 94 27 80 -54 26 91 -2 -14 -43 142 -37 7 -12 -52 0 -81
7254 -81 -60 -101 58 41 -97 -49 72 16 -46 -63 -50 38 -58 -29 -102 160 -9 -24 39 -138 17 -11 -25 61 -41 58
7280 58 8 -23 14 -100 -9 84 8 -57 -58 -26 84 -70 -18 -43 -49 -5 74 -106 -24 21 -4 46 17 -11 -29 30 39 57 -25 15
7310 15 -18 -87 -53 60 65 -6 58 -70 18 2 -48 148 -116 -41 44 13 8 3 32 21 -21 -72 9 -108 95 32 99 31 30
7339 30 -31 -95 50 -66 -1 1 -63 110 1 -12 50 -20 -19 85 -4 -87 14 -101 8 -24 43 70 -39 -40 87 -20
$$ packed form
7145D9o3N7mj10P6kj35J82o4K7p9J03Oj48P2k4P8l2L9r1P2P5q9n6O9j1k1l4R0
7174C2j24R2J2j2L2j11O7mm1l1P2k5j1L6m0J74j22J5j24J63j05M4M7l1L7q5J3
7201c0j3n0J34K2r4N2L2j31m3J00J32m5n2M0m6O9Q2j90q4J01l8N7j27J17M9Q8
7227A32j21j20J08jR5m2j16j3O6Pk3J22o7N3j34Q0O5r3j2k9J85j79M4j9m0N2q1
7254h1K1m1J59j7j38M8J21n6o2j7J3Q8r6K9p3K62j69j5O3j77J55k8j4Q6j02R9
7280E8n0l1L7j14R1R3p6o5jL2J10j54N2k5oM4P9j80Q2M5k5N0k9k8j8N9RJ8q2M0
7310A5l3o9L4J13Np1O4j28Q8j6n0J96k64P5Q5l1nnK9j1m2n1Q1j17K03o3O7o8j
7339C0o1o4J45j16O5Ko4J73j09j3O2p0JJ04q9q3J01j15J09l2O7K7j09jJ27j07
$$ plain form
7365 -20 5 133 33 -95 -65 47 51 70 29 74 48 13 42 -30 35 64 -70 -16 -21 -41 -30 -71 -100 -54 -70 22 87 -46
7393 -46 34 -22 -46 30 35 8 73 122 -29 18 -90 -1 81 -98 43 -123 -48 102 -32 53 -35 45 -49 73 -14 46 4
7420 4 17 129 -94 -46 76 65 -69 30 86 1 -4 83 -9 -59 137 99 -33 -31 27 109 2 17 -4 40 -133 5 -49
7447 -49 1 42 5 -11 67 -28 -43 40 -77 0 -102 50 -50 -4 -21 2 86 -12 -63 -119 2 -35 -66 -132 -33 5 95 -149
7475 -149 33 40 -26 -8 -19 -81 48 5 26 29 22 -66 -33 -21 48 -70 63 103 17 43 -12 -32 7 -63 0 -33 -147 -12
7503 -12 -101 48 -71 29 -69 -31 -85 -61 144 11 -27 -10 -39 22 -10 35 10 70 20 106 -33 -70 35 14 82 -138
7529 -138 -22 5 155 61 -10 -86 40 -56 16 -35 26 82 47 -47 -34 2 -31 67 57 -9 -50 -218 7 49 -73 37
7555 37 -52 19 -39 19 -104 -23 87 85 38 48 17 66 -33 8 -90 61 109 41 28 -85 69 -105 -78 -57 -15 -45 -69 -133
$$ packed form
7365b0K5J28j00j28L0J12MJ9m1M5k6l5K9p2O5K9j34N4nk0J1m1k9M6j6R2O5j33
7393d6Q0n6k4P6Nk7O5M9j51M7j08Q9Q2j79J41j66P5J50j34Q5q8Q0r4J22q7O0m2
7420DJ3J12k23M8J22j1j34R9N6q5nQ7r2n0J96l8j32KN8Q2j07J5k1M4j73J38n4
7447d9N0M1l7j6P8r5j5Q3j17P7j02J52j00M6j7K3Q4r8n1n6J21l7l1o6R9L8R0k44
7475a49J82Po6J8j1o2J29m3K1Lpq8L3J2O9j18J33M0q6K6n5k0L9p0O3l3j14J35
7503a2q9J49j19J00r8L8n4K4K05j33l8J7k9O1l2M5k5O0n0Q6j39l7J05k1O8k20
7529a38J16K7J50r4p1p6J26r6P2n1O1N6l5r4J3L6l3R8j0o6m1j68K25M2j22J10
7555C7q9P1n8N8j23Q1J10km7J0l1M9r9M1r8J51M8o8j3j13J54j74K7K1M2l0k4o4
$$ plain form
7583 -133 0 -73 -55 11 -10 -37 35 -33 8 -93 -94 39 10 60 -3 66 14 -95 2 -57 -48 105 1 12 -74 -165 37
7610 37 -1 -77 64 -55 9 -72 -19 92 40 -87 -21 56 -6 154 -43 24 -17 -62 28 46 88 20 -47 -62 15 46 -26
7637 -26 33 -23 -26 -59 -34 -45 -43 84 -38 -1 -49 51 4 3 -82 111 44 -2 -13 65 -98 -30 28 62 9 -140 99 -163
7665 -163 -2 -52 41 59 67 49 5 12 20 95 -40 -51 -70 32 74 -95 129 98 48 -13 -24 -30 5 -8 45 16 63 50 -13
7694 -13 71 9 24 -61 32 36 46 -3 -39 36 74 -8 18 38 1 -9 39 115 52 -9 -6 124 -118 29 -43 -2 -9 2 -62 -31
7724 -31 -93 -37 -17 90 -21 -130 -42 -23 4 3 -36 -47 -14 129 -52 -61 6 -56 99 30 -2 85 93 20 40 -75 91 19
7752 19 -2 45 3 32 -47 35 33 41 0 11 -78 -15 62 -15 14 19 -44 -57 19 -33 4 -98 84 99 1 -58 85 117 -38 31
7782 31 -59 -12 -37 127 41 -85 -13 -59 -60 17 65 -65 -35 27 27 4 -18 -104 -44 52 22 163 36 -55 -27 -47 62 85
$$ packed form
7583a33J33p3J8O6k1k7P2o8M1j01jJ33k9N0o3O9n2j09R7n9RJ53j04J1q6r1K02
7610C7l8p6J41j19O4q1N3J11n2j27O6P7o2J60j97O7m1m5R0J8M2o8o7j5P7L1p2
7637b6N9n6ll3K5j1KJ27j22L7m8J00m7jq5J93o7m6j1P8j63O8N8L4n3j49K39k62
7665a63J61n0R3J8Qj8m4PQP5j35j1j9J02M2j69K24l1n0o1j1oL5j3N3k9M7j3o3
7694a3Q4o2J5q5R3MJ0m9l6P5L8q2K6K0l7j0M8P6o3o1LJ30k42J47p2M1pJ1o4L1
7724c1o2N6K0J07j11j09Q8J9K7jl9j1L3J43j81rO7o2J55o9l2Q7Qp3K0j15J66p2
7752A9k1M7m2K9p9Q2kQm1J1q9O3P7p7K9No3j3P6n2L7j02J82J5r8n9J43L2j55O9
7782C1r0M7k5J64q6j26P2m6jP7M8j30L0O2%k3k2q6O0R6l0J41j27r1K8k0J09K3
$$ plain form
7810 85 15 3 19 -63 96 -18 15 -44 24 -32 -5 -66 68 122 -7 -58 16 -74 -54 59 32 76 -56 -65 80 25 -22
7837 -22 16 -72 130 74 144 0 -80 -3 -8 -53 78 -8 4 52 -58 -126 20 55 9 -30 23 -50 -40 2 55 21 2 -17
7865 -17 74 25 44 87 -74 -33 -72 6 108 -32 -13 56 68 88 -6 19 77 79 81 -20 12 -33 76 74 -3 40 -127 -32 0
7894 0 -25 -11 -44 -21 -31 5 102 -95 -32 -22 58 -22 -63 68 115 36 15 -11 -32 -144 14 -52 2 107 47 -15 130 134
7922 134 145 18 -29 39 14 -44 30 40 56 95 69 15 -26 -13 -77 12 8 4 32 -40 47 25 -61 36 119 -75 -61 18 16 140
7952 140 -80 94 38 14 -47 38 116 38 3 96 -67 37 60 -91 42 107 67 29 -95 74 -51 -50 107 30 -1
7977 -1 -8 -89 40 0 -30 151 -24 -8 50 16 -183 -25 -22 58 5 67 56 36 -49 12 43 -29 74 -59 40 49 26 -69 57
8006 57 -37 14 -81 26 32 -75 83 31 84 39 160 4 -51 -22 -74 -14 128 -9 -78 -9 67 -17 -7 -32 -29 -35 25 67
$$ packed form
7810H5p0j2J6q2J59j14L3n9O8n6K7o1J34N4j29n1P4r0K0J13k7M4j32rJ45n5m7
7837b2L8q8K02n6P0j44q0P7nm5J31q6J2M8j10o8J46L5m6l9N3p3J0M2N3l4j9j9
7865a7R1m9J9M3j61M1l9P8J02j40J9O9J2K0r4K5N8KKj01L2m5J09kp7M3j67R5L2
7894@k5J4l3K3j0L6R7j97O3J0Q0q0m1J31M7p9k1k6k1j12J58o6N4J05o0o2J45M
7922A34J1j27m7O8k5n8P4J0J6L9k6n4m1J3o4Q9mmK8p2Q7k2q6R7Q3j94J4P9kJ24
7952A40k20J74n6k4o1Q5P8p8l5R3j63J04K3j51J33O5m0l8j24J69j25JJ57p7l1
7977apq1J29m0l0J81j75J6N8l4j99J58LQ0n3O2j1k0q5O1L1p2J03j33R9Rk3r5J26
8006E7r4N1r5J07Oj07J58n2N3m5J21j56n5K9n2O0J42j37o9O9P6q4J0k5LoO0M2
$$ plain form
8034 67 20 32 26 4 46 133 57 43 -6 -71 -38 32 43 -124 -13 -17 28 42 16 -26 -31 -3 59 -5 50 0 -20 35 -132 15
8064 15 5 -7 -63 -16 14 29 61 -68 -85 -47 65 0 69 10 -54 -23 -45 7 33 -23 25 24 -13 76 19 32 -55 -25 21 51
8094 51 -72 2 19 15 -53 3 -62 -29 -51 -103 -50 -41 12 -72 -35 52 93 -33 -8 49 -53 -2 71 17 -80 -3 -69 -134 54
8123 54 70 -36 -23 34 14 -138 89 2 13 18 -26 -14 -33 58 35 -75 1 90 -43 91 87 48 50 -35 32 -48 60 5
8151 5 -65 72 39 46 16 -5 -33 -25 49 -18 5 21 29 8 -19 14 -6 10 -56 -4 -55 -33 72 -30 -110 -41 -70 10 34 -46 11
8182 11 -84 62 -66 54 92 -70 -30 -34 -117
$$ packed form
8034F7m7J2ok2M2Q7p6j4m9o5L3P0J1j67J11mM5J4k6m2nK8O2o4N5n0k0N5j67J47
8064A5j0j2n6M7L0J5L2j29j7L8J12o5O9n9o4L1k2N2K6n6M8jl7Q9n7J3q7L0M6L0
8094E1j23P4J7mo8N6o5L3k2n2N3RN3q4L7Q7M1j26K5N7j02N1P3n4r7P7o6o5J88
8123E4J6j06J3N7k0j52K27q7J1Nm4J2j9R1k3j10P6Q9j33J34ml9Kq5O7q0J08n5
8151Ep0J37l3Pl0k1k8QP4o7K3J6Qk1k7L3k0J6o6N2n1K2J05j02q0O9k9Q0K4q0N7
8182A1r5J46j28J20L8j62M0mq3
8191a17
$$ Imaginary data points
##PAGE= N=2
##DATA TABLE= (X++(I..I)), XYDATA
$$ plain form
0 0 0 0 0 0 0 0 0 0 0 0 0 0 0 0 8 -8 8 -8 8 -16 16 -16 24 -24 32 -38 40 -48 56 -64 72 -86 96 -111 121 -137
36 -137 154 -176 193 -216 241 -270 297 -329 366 -403 446 -491 542 -596 655 -723 799 -879 972
55 972 -1076 1195 -1331 1488 -1676 1899 -2175 2520 -2973 3591 -4490 5924 -8578 15148 -68324
70 -68324 -38915 144909 112578 -2773 -93336 -88302 -25028 81108 116435 55612 -33542 -67306
82 -67306 -63057 -7889 67448 86407 18638 -56112 -84969 -52510 21673 83544 59496 -27410
94 -27410 -86604 -68917 -6791 61369 85372 33847 -44233 -66031 -26760 33294 74992 60588
106 60588 -11682 -73323 -63011 -3922 43416 56432 25432 -37981 -72308 -40480 17324 52748
118 52748 46341 -599 -53155 -57298 -6325 47348 61032 34317 -16699 -54090 -36564 15950
$$ packed form
0@%%%%%%%%%%%%%%Qj6J6j6J6k4L2l2M0m8N6p0P8q8J04j20J36j58J82k07K32k58
36a37K91l30L69m09M57n11N67o26O95p69Q49r37J033j138J251j378J522j678J851
55I72k048K271k526K819l164L575m074M695n493O564q081J0414j4502K3726q3472
70f8324K9409J83824l2331j15351r0563N034O3274J06136L5327o0823q9154l3764
82f7306M249N5168P5337J8959o7769p4750k8857L2459P4183O1871k4048q6906
94b7410n9194J7687O2126O8160K4003n1525p8080k1798L9271O0054M1698j4404
106F0588p2270o1641J0312N9089M7338J3016l1000o3413l4327L1828N7804L5424
118E2748o407m6940n2556m143N0973N3673J3684k6715n1016l7391J7526N2514
$$ plain form
130 15950 48244 39554 681 -42966 -54687 -20601 27511 45407 23723 -15832 -47355 -41501
142 -41501 3798 42907 40921 8808 -26910 -40054 -15297 28290 48807 27751 -11032 -36222
154 -36222 -34439 -4590 30343 34044 5328 -27475 -40370 -22247 14744 37502 24797 -8337
166 -8337 -30464 -27219 -3047 27576 37373 14667 -15726 -28572 -17727 10569 33135 25501 -5347
179 -5347 -30010 -29355 -8754 16059 27291 11789 -16264 -28533 -18365 4821 26427 26342 2811
192 2811 -21056 -23923 -5397 18132 28170 16113 -9606 -24417 -16942 1196 17513 20556 2622
205 2622 -20457 -25954 -10538 10500 21052 14217 -5134 -20996 -16953 2408 18283 20948 7793
218 7793 -12487 -19741 -7942 10165 19573 13551 -3579 -18794 -18531 -2401 12865 14831 5159 -9959
$$ packed form
130A5950L2294q690l8873m3647j1721L4086M8112J7896k1684l9555l1523N854
142d1501M5299L9109j986l2113l5718j3144K4757M3587K0517k1056l8783k5190
154c6222J783K9849L4933L701k8716l2803j2895J8123L6991K2758j2705l3134
166h337k2127L245K4172L0623R797k2706l0393j2846J0845K8296K2566p634l0848
179e347k4663O55K0601K4813J1232j5502k8053j2269J0168K3186K1606q5k3531
192B811k3867k867J8526K3529J0038j2057k5719j4811P475J8138J6317L043j7934
205B622k3079n497J5416K1038J0552o835j9351j5862M043J9361J5875K665j3155
218G793k0280p254J1799J8107R408o022j7130j5215K63J6130J5266J966r672j5118
$$ plain form
232 -9959 -18994 -10666 6794 17341 13876 -34 -13200 -14631 -2512 12977 16945 7507 -5779
245 -5779 -14632 -10761 3477 14018 11304 -1365 -13694 -15375 -5416 7960 13714 6743 -4757 -11271
259 -11271 -9277 1429 12852 12976 2314 -9401 -12365 -4298 7152 12842 8037 -3855 -11392 -9607
273 -9607 -1102 8076 9451 709 -8921 -11904 -5493 5284 11607 8680 -1177 -9297 -7558 740 7583
288 7583 8996 3277 -5528 -9571 -5709 3476 9809 7328 -1502 -9038 -9100 -1946 5280 7178 2804 -4514
304 -4514 -7990 -4320 3223 9013 8074 824 -6032 -7475 -2196 5164 7375 3349 -3129 -7386 -4872
319 -4872 1606 6081 5664 4 -6244 -7415 -3168 3408 6944 4172 -1688 -5327 -4145 1598 6121
334 6121 5690 1396 -4499 -6461 -2795 2577 5656 3557 -1779 -5192 -4709 -700 3859 4586 1041 -3682
$$ packed form
232i959r035Q328J7460J0547l465j3910j3166j431J2119J5489L968r438j3286
245e779q853L871J4238J0541k714j2669j2329j681R959J3376N754o971j1500o514
259a1271J994J0706J1423J24j0662j1715k964Q067J1450N690m805j1892p537J785
273i607Q505R178J375q742r630k983O411J0777O323k927r857q120J739Q298O843
288G583J413n719q805m043L862R185O333k481q830p536o2P154P226J898m374p318
304d514l476L670P543N790r39p250o856j443N279P360K211m026o478m257K514
319d872O478M475m17n660o248j171M247O576L536k772n860l639J182N743M523
334F121m31m294n895j962L666N372L079k099n336l413M83M009M559P27l545m723
$$ plain form
350 -3682 -5744 -2682 2689 5618 4323 -45 -3876 -3656 -260 3386 4517 1353 -2894 -4718 -2958
365 -2958 1418 4418 3426 -450 -4402 -4406 -613 2687 3786 1843 -1781 -3412 -1860 1432 4279 3797
381 3797 502 -2872 -4024 -1291 2493 3422 1586 -1684 -3754 -2243 563 2493 2794 246 -2620 -3633
397 -3633 -1643 2184 3773 1985 -567 -2404 -2019 647 2753 2651 406 -2500 -3029 -1422 916 2670
413 2670 1860 -806 -2645 -2708 -377 2314 2290 123 -1703 -2209 -961 1009 2578 2593 24 -1942 -1885 -419
431 -419 1560 2268 468 -1580 -2616 -1576 619 2256 1870 -116 -2015 -1821 -230 1085 1870 1234 -909
448 -909 -1606 -875 814 2396 1816 263 -1475 -1903 -545 856 1162 810 -860 -1862 -1164 174 1381
465 1381 1585 431 -1050 -1783 -742 976 1457 962 -139 -1504 -872 649 1386 1285 512 -886 -1737
$$ packed form
350c682k062L062N371K929j295m368l831K20L396L646J131l164m247j824J760
365b958M376L000r92l876l952mL793L300J099j943l624j631J552L292K847m82
381C797l295l374j152K733L784R29j836l270k070J511K806J930L01k548k866j013
397c633J990L827J589j788k552j837L85K666K106j02k245k906n29J607K338J754
413B670q10k666j839o3K331K691k4k167j826n06J248J970J569J5k569j966N7J466
431d19J979P08j800k048j036J040K195J637l86j986j899J94J591J315P85o36k143
448i09o97P31J689J582n80j553j738m28J358J401L06l52j670j002O98J338J207
465A381K04j154j481p33J041J718M81m95j101j365O32J521P37j01p73j398q51
$$ plain form
482 -1737 -1121 187 1189 611 -395 -1366 -1281 376 1292 1133 445 -798 -1257 -625 457 1081 928 97
500 97 -623 -843 -239 1269 1180 88 -846 -1436 -915 85 782 695 -15 -745 -579 -82 705 1361 559 -498
520 -498 -864 -583 413 1237 786 62 -499 -637 -189 205 712 443 -705 -937 -407 -124 556 1072 290 -627
540 -627 -729 -29 759 600 484 -153 -645 -542 85 565 702 177 -717 -863 -536 288 472 172 -117 -678
560 -678 -781 255 647 303 247 -126 -501 -244 316 632 493 76 -303 -663 -211 622 241 -349 -430 -588 -559
581 -559 203 537 385 19 -214 -267 -192 553 704 134 -234 -241 -81 267 672 354 33 -327 -518 -347 -127 305
603 305 180 -375 -334 -260 120 611 578 9 -334 -284 -30 174 233 422 32 -377 -179 95 372 289 -86 -448
625 -448 -487 -527 -67 188 -20 -137 -262 -11 299 161 326 220 -129 -351 -191 56 301 65 31 -59 -206 26
$$ packed form
482a737O16J308J002n78j006r71Q5J657R16j59o88j243m59O32J082O24j53q31
500I7p20k20O04J508q9j092r34n90N21J000O97q7p10p30J66M97P87O56q02j057
520d98l66K81R96Q24m51p24n61j38M48L94N07k69j148k32N30K83O80N16p82r17
540f27j02P00P88j59j16o37m92J03O27M80J37n25q94j46L27Q24J84l00k89n61
560f78j03J036L92l44n6l73l75K57N60L16j39m17l79l60M52Q33l81n90q1j58K9
581e59P62L34j52l66k33n3P5P45J51n70l68pJ60L48M05l18l21l60j91J71K20M32
603C05j25n55M1P4L80M91l3n69l43N0K54K04N9J89l90m09J98K74K77q3l75l62
625d48l9m0M60K55k08j17j25K51L10j38J65j06l49k22J60K47K45k36l4r0j47K32
$$ plain form
647 26 196 -39 -87 -187 -359 -244 147 171 260 48 42 -106 47 332 279 -16 -152 -269 -51 211 253 24 -131
670 -131 -84 -99 -332 18 238 3 -148 -68 -132 89 360 244 153 16 -65 74 18 101 125 -174 -267 -99 -105 111
694 111 225 -142 -209 -177 -45 174 64 -12 -43 -224 -9 62 98 279 48 -118 -75 6 169 67 4 -133 -132 -167
718 -167 18 -34 -90 -30 -21 -61 42 8 208 236 -11 119 -91 94 157 148 -96 -35 -93 181 7 -75 54 119 -108
743 -108 -227 67 171 131 19 58 69 -95 97 157 27 -118 -144 28 6 -114 -15 126 -215 -177 -80 -45 250 -16
767 -16 -129 -57 -55 84 3 -43 162 129 -29 23 72 107 224 54 -218 -92 -36 43 -76 -116 81 -107 11 85 35
792 35 78 135 -40 -26 37 2 176 112 -10 4 -13 109 174 -70 -50 -83 -229 -21 -93 109 139 34 -9 0 82 28 -23
819 -23 -12 -14 5 40 49 -61 -89 42 -20 -114 -92 -66 -45 -148 -185 -79 -96 -60 -1 -3 2 110 -67 47 -31 -88 -22 -110 -59
$$ packed form
647B6J70k35m8j00j72J15L91K4Q9k12oj48J53K85n3k95j36j17K18K62M2k29j55
670a31M7j5k33L50K20k35j51Q0o4K21K71j16r1j37q1J39n6Q3K4k99r3J68oK16
694A11J14l67o7L2J32K19j10p6l1j81K15P1L6J81k31j66M3Q1J63j02o3j37Jl5
718a67J85n2n6O0Rm0J03l4K00K8k47J30k10J85O3rk44O1n8K74j74q2J29O5k27
743a08j19K94J04m0j12L9J1j64J92O0j30j45k6J72k2j20R9J41l41L8R7L5K95k66
767a6j13P2KJ39q1m6K05l3j58N2M9L5J17j70k72J26N6P9j19m0J97j88J18P4n0
792C5M3N7j75J4O3l5J74o4j22J4j7J22O5k44K0l3j46K08p2K02L0j05m3RQ2n4n1
819b3J1kJ9L5Rj10k8J31o2r4K2K6K1j03l7J06j7L6N9kNJ08j77J14p8n7O6q8N1
$$ plain form
848 -59 -34 -96 93 86 -84 9 -32 12 127 -71 9 60 -37 97 -3 -11 106 98 14 35 69 38 110 -109 -54 -14 48 -20
876 -20 -89 -41 -14 -48 43 -6 17 85 45 -96 -6 -26 145 147 4 5 118 15 69 -47 -56 91 -124 -170 36 7 -47 -20
904 -20 -233 2 -32 -76 87 43 7 -45 -25 -5 -51 -52 20 128 -107 7 -64 -128 50 -144 -121 17 -17 56 -15 -81 77
931 77 33 78 145 -22 91 30 -219 40 121 -7 -27 72 -36 123 -26 -38 58 -189 -107 28 82 85 36 -2 73 -64
957 -64 -78 82 122 89 41 -88 -12 134 -83 -58 58 -134 38 -59 -57 46 -61 -60 -24 -209 95 100 -41 -8 -103 92
983 92 77 71 -26 -48 -6 50 -27 -128 62 -37 -60 154 -88 -107 25 83 2 -13 -111 2 74 -10 53 35 -8 -39 -60 22
1011 22 17 -63 -106 -137 -18 80 63 7 -9 -50 -1 -14 -20 70 28 -29 -12 -131 142 147 -38 23 90 -149 142 -88 -122 -55
1039 -55 -139 -65 130 -130 -56 17 35 -63 35 5 -17 -45 -69 -84 11 -67 22 -21 -59 66 -73 43 -113 40 69 27 -78
$$ packed form
848e9K5o2J89pj70R3m1M4J15j98Q0N1r7J34j00qJ17qq4K1L4l1P2k19N5M0O2o8
876b0o9M8K7l4R1m9K3O8m0j41R0k0J71Kj43JJ13j03N4j16rJ47k15m6K06k9n4K7
904b0k13K35l4m4J63m4l6n2K0K0m6jP2J08k35J14p1o4J78j94K3J38l4P3p1o6J58
931G7m4M5O7j67J13o1k49K59Q1j28k0R9j08J59j49j2R6k47Q2J35N4Lm9l8P5j37
957f4j4J60M0l3m8j29P6J46k17K5J16j92J72r7KJ03j07JL6j85L04Nj41L3r5J95
983I2j5or7k2M2N6p7j01J90r9k3K14k42j9J32N8q1j5r8J13P2q4O3j8m3l1k1Q2
1011B2nq0m3l1J19R8j7n6j6m1M9j3oR0m2n7J7j19K73Nj85O1O7k39K91k30l4O7
1039e5q4P4J95k60P4P3J8r8R8l0k2k8k4j5R5p8Q9m3l8J25j39J16j56J53K9m2j05
$$ plain form
1066 -78 -177 -49 100 -34 14 6 -60 -5 51 82 29 87 76 34 -54 -178 69 7 9 26 -21 54 7 10 -33 5 -36 14 23 123
1096 123 26 20 -6 69 52 11 148 -5 -13 -16 -22 -27 -51 -23 -90 -49 29 -56 30 -13 59 49 -36 -64 2 5 -72 -58 95 51 -23
1127 -23 33 90 -3 81 -81 -57 4 -8 28 -59 -1 -22 34 98 -43 23 54 -118 7 -15 -23 -18 15 7 -31 -14 -2 31 73 -3
1157 -3 -11 51 -16 -14 51 -34 26 -117 17 -30 -67 -46 -48 -2 40 -68 -47 -18 -13 65 -30 1 -96 -77 -18 -29 -23 13 46 43 39 -64
1189 -64 62 -1 -39 65 -47 -146 -103 -84 22 -49 13 30 78 154 17 -54 64 44 24 36 -39 -175 34 82 -33 -51
1215 -51 78 -33 8 -31 -40 6 -41 -47 42 -16 83 1 35 30 -104 -128 -11 -38 73 99 -30 -12 -58 -57 124 13 -20 41
1243 41 79 28 3 10 44 -41 -84 -48 26 -7 -19 -19 -19 -77 72 68 91 -36 -45 -37 32 7 -109 -68 98 -31 -33 41 -84 44
1273 44 -8 36 32 -61 28 -47 -60 -26 -80 -66 -60 -38 -91 57 -17 73 -65 -4 8 -2 39 -148 -36 92 42 41 -42 20 40
$$ packed form
1066g8r9J28J49j34M8qo6N5N6L1n3N8j1m2q8j24K47o2KJ7m7P5m7Lm3L8m1N0RJ00
1096A23r7ok6P5j7m1J37j53qlonk4K8o7M1P8q5Q6m3P2j0q5k8O6Lp7J4J53m4p4
1127b3N6N7r3Q4j62K4O1j2L6q7N8k1N6O4j41O6L1j72J25k2qNL3ql8J7J2L3M2p6
1157cqO2o7KO5q5O0j43J34m7l7K1kM6M2j08K1K9NP8r5L1r7J9N9j1OL6L3lmj03
1189f4J26o3l8J04j12r9M3J9J06p1O2J7M8P6j37p1J18k0k0J2p5j36K09M8j15j8
1215e1J29j11M1l9rM6m7oQ9n8R9q2L4nj34k4J17k7J11K6j29J8m6JJ81j11l3O1
1243D1L8n1k5PL4q5m3L6P4l3j2%%n8J49mK3j27rQO9k5j16M1J66j29kP4j25J28
1273D4n2M4mr3Q9p5j3L4n4J4OK2n3J48p4R0j38O1J2j0M1j87J12J28n0jq3O2K0
$$ plain form
1302 40 -33 51 -52 -9 -29 -80 66 -68 -167 -60 -26 32 7 13 43 -137 -5 38 35 2 -97 32 -6 -19 33 30 23 101 41
1331 41 -62 -34 22 -76 8 0 -47 -7 144 -5 -96 -89 -34 -2 -53 -119 -77 -101 21 -15 58 -19 -72 -5 75 -14 -48 10 -43
1360 -43 100 -29 21 -12 -62 -17 -121 105 46 -1 25 -70 -36 -17 4 -135 -14 8 40 -86 61 -80 -24 37 -36 18
1386 18 -11 -8 -21 -60 34 63 16 -20 -18 -124 -19 66 22 -23 -55 66 2 83 21 37 33 -25 5 -64 -42 -18 66 64 84 44 -16
1417 -16 45 171 -44 55 49 24 99 113 -82 84 -126 -133 23 5 86 60 40 -18 -53 -34 164 43 -15 -48 51 20 -73
1444 -73 -16 44 42 24 90 0 -102 77 -84 85 -60 -84 -145 -22 -20 13 -53 73 19 21 68 -133 -44 34 -38 -78 -54 -44
1472 -44 26 63 6 -53 -50 185 -15 -52 -65 -98 -12 -87 26 78 61 39 63 -38 69 -5 -10 -29 -39 10 -43 -143 -33 101
1500 101 -69 88 2 -29 -18 -91 70 -17 -45 6 -28 -8 29 -33 41 -89 -84 -83 58 -8 -56 -92 11 59 -26 21 25 23 37
$$ packed form
1302D0p3Q4j03M3k0n1J46j34r9J07L4N8k5OL0j80J32M3ll3r9J29l8j3N2lpP8o0
1331D1j03K8N6r8Q4qm7M0J51j49r1PN5L2n1o6M2k4J22l6P3p7n3O7Q0q9l4N8n3
1360d3J43j29N0l3n0M5j04K26n9m7K6r5L4J9K1j39J21K2L2j26J47j41N6O1p3N4
1386A8k9Lj3l9R4K9m7l6Kj06J05Q5m4m5l2J21o4Q1o2J6mn8L0o9K2K4Q4kK0m0o0
1417a6O1J26k15R9ok5P5J4j95J66k10pJ56j8Q1k6k0n8l5J9J98j21n8l3R9l1r3
1444g3N7O0kj8O6r0j02J79j61J69j45k4o1J23KL3o6J26n4KM7k01Q9P8p2m0K4J0
1472d4P0L7n7n9LK35k00l7j3l3Q6p5J13N2j7k2K4j01J07p4nj9j0M9n3j00J10J34
1500A01j70J57q6l1J1p3J61q7k8N1l4K0L7o2P4j30NJJ41o6m8l6J03M8q5M7MkJ4
$$ plain form
1529 37 37 32 -14 -8 3 50 57 -53 62 -22 -32 73 -18 9 -40 23 -73 -13 14 -17 84 -52 -13 -153 -73 0 4 -13 78 -62
1559 -62 65 -63 17 27 25 17 17 55 -49 16 -44 -46 -52 -15 35 52 -32 110 15 3 100 54 37 157 -8 -60 38 -24 25 40
1589 40 -43 6 -23 -28 62 -35 -34 -32 9 -73 -65 2 77 -92 -46 15 20 32 37 141 -3 -45 51 63 2 -109 45 86 27 65 -21
1620 -21 57 55 -6 147 59 6 63 15 3 -28 -9 -61 44 22 29 2 33 -117 67 2 -69 16 -29 55 -35 -20 33 -45 -42 34
1650 34 8 -53 33 9 -59 109 81 64 -41 8 38 -83 36 -15 -46 -102 -66 -6 -14 36 17 -40 11 -2 -15 21 76 -67
1678 -67 -13 64 6 -10 -9 -52 -30 -29 120 22 29 38 -7 -13 -67 141 13 96 31 82 -6 44 63 55 21 -75 2 -33 -57 -6 -22 -4
1710 -4 23 -78 39 67 -68 105 -125 15 -18 -35 -11 -13 52 69 27 37 33 -6 1 41 52 -67 66 25 36 75 17 6
1738 6 23 -20 76 -11 -27 -16 16 -71 48 -2 39 60 7 -53 -49 -43 -18 -6 118 -53 -37 53 9 64 26 21 -53 46 47 14 32
$$ packed form
1529C7%nm6OJ1M7Pj10J15q4j0J05r1K7m9O3r6O0K7l1J01j36L9j40Q0P3Mj7R1j40
1559f2J27j28Q0J0kq%L8j04O5o0koL7N0J7q4J42r5j2R7m6j7J20j65n2R8o2M9J5
1589D0q3M9k9nR0r7JKM1q2QO7P5j69M6O1NJ2NJ04j44m2R6J2o1j11J54M1n9L8q6
1620b1P8ko1J53q8n3N7m8j2l1J9n2J05k2Pk7L1j50J84o5p1Q5m5Q4r0J5N3p8LP6
1650C4k6o1Q6k4o8J68k8j7j05M9L0j21J19n1l1n6L6O0qN0j9n7N1j3j3L6N5j43
1678f7N4P7n8j6Jm3K2JJ49r8PRm5on4K08j28Q3o5N1q8N0J9ql4r6P7l5k4N1j6J8
1710dK7j01J17K8j35J73k30J40l3j7K4kO5J7m2J0ml9PM0J1j19J33m1J1L9n8j1
1738FJ7m3R6q7j6J1L2q7J19n0M1K1n3o0MOK5J2J24j71J6R0m4N5l8np4R9Jl3J8
$$ plain form
1769 32 5 -82 17 -26 17 51 44 -150 -28 29 97 -6 72 -39 -87 10 -91 54 98 -146 96 56 -53 101 -64
1794 -64 -103 74 -45 50 12 7 155 -36 -64 -19 -53 -111 84 60 33 136 67 17 -7 -28 -129 -94 -87 -127 34 -154 -21
1821 -21 -65 78 49 36 133 13 -13 18 12 30 -4 -46 -15 -50 -153 -6 -12 -79 19 -91 69 113 -52 11 -64 20 -101
1848 -101 57 -98 -20 -16 2 -6 33 14 -88 -56 -94 111 7 80 -47 2 104 20 68 -5 -15 37 47 154 22 -39
1874 -39 70 87 -9 -13 74 -90 90 -32 -44 121 -73 -18 -37 -71 19 -77 87 -47 65 0 -56 -66 -55 -36 113 -48
1900 -48 71 21 -86 76 -90 74 -23 81 75 64 22 42 64 -70 13 -111 22 155 -25 99 -97 47 -52 33
1924 33 21 45 48 -30 25 101 90 -114 35 7 -70 85 -120 -66 8 32 -29 -54 143 110 63 -38 69 -74 67 -102
1950 -102 17 6 39 -104 8 41 -78 51 22 94 36 14 -3 17 -24 -28 42 -6 -49 -153 -131 -89 -28 -78 -56 -187 -11
$$ packed form
1769C2k7q7R9m3M3L4pj94J22N7O8j03P8j11m8R7j01J45M4k44K42m0j09J54j65
1794f4l9J77j19R5l8nJ48j91k8M5l4n8J95k4k7J03o9n0k4k1j01L5Pm0J61j88J33
1821b1m4J43k9j3R7j20k6L1oJ8l4m2L1l5j03J47oo7R8j10J60M4j65O3p5Q4j21
1848a01J58j55P8MJ8qL9j9j02L2l8K05j04P3j27M9J02q4M8p3j0N2J0J07j32o1
1874c9J09J7r6mQ7j64J80j22j2J65j94N5j9l4R0r6J64j34J12o5n6j0J1J9J49j61
1900d8J19n0j07J62j66J64r7J04oj1m2K0K2j34Q3j24J33J33j80J24j96J44r9Q5
1924C3j2K4Lp8N5P6j1k04J49k8p7J55k05N4P4K4o1k5J97l3m7j01J07j43J41j69
1950a02J19j1L3j43J12L3j19J29k9P2n8k2j7K0m1mP0m8m3j04K2M2O1n0K2j31J76
$$ plain form
1977 -11 -85 -81 -110 -72 34 -80 19 -83 -98 -69 -59 -78 25 8 -16 -64 -132 62 -79 4 -49 32 44 62 -120 -164 34
2004 34 -2 -5 -58 -48 -117 31 -153 -115 1 99 -1 -206 -95 162 77 -85 0 31 -18 0 96 -70 -67 -176 -11 -314
2030 -314 291 -57 192 -522 -363 -557 163 294 -428 -42 132 -109 -561 269 -122 -228 151 -180 -171 -127 -40
2051 -40 -533 66 -305 -157 -324 -354 -410 126 317 115 95 264 60 143 -213 -383 -578 -15 -300 -143 -166 723
2073 723 -304 -249 -162 -590 -759 107 -685 214 -204 177 758 -321 -81 -126 -183 184 -292 111 21 156 -502
2094 -502 -346 -466 -434 -161 477 -452 72 3 -354 -651 342 -261 445 257 -126 39 -2 -44 -58 -26 -42 148
2116 148 41 30 -64 81 -28 57 89 -68 23 122 30 -76 -48 -32 -23 -42 47 -82 -6 -60 71 -38 -99 82 23 185
2142 185 -9 30 23 24 0 -96 -45 115 -17 -44 -86 70 -35 32 -29 26 -13 -52 -100 -37 -15 57 11 75 49 2 127 -110
$$ packed form
1977a1p4Mk9L8J06j14R9j02j5K9J0j9J03j7k4m8o8J94j41Q3n3Q1J2J8j82m4J98
2004C4l6ln3J0o9J48j84L8J16R8j00k05J11K57q5j62Q5L1m9J8R6j66Lj09J65l03
2030c14O05l48K49p14J59j94P20J31p22L86J74k41m52Q30l91j06L79l31RM4Q7
2051d0m93N99l71J48j67l0n6N36J91k02k0J69k04Q3l56j70j95N63k85J57k3Q89
2073G23j027N5Q7m28j69Q66p92Q99m18L81N81j079K40m5n7L67m76M03r0J35o58
2094e02J56j20L2K73O38r29N24o9l57k97R93o03P06j88l83J65m1m2j4L2j6J90
2116A48j07j1r4J45j09Q5L2j57R1R9r2j06K8J6Rj9Q9j29P6n4J31j09o1J81n9J62
2142A85j94L9pJk4r6N1J60j32k7m2J56j05O7o1N5l9l9m8O3K2P2m6O4k6m7J25k37
$$ plain form
2170 -110 10 -111 8 148 -64 -65 23 -47 -32 -39 -83 22 18 -8 3 -100 108 60 -14 71 9 -89 -39 26 81 38 -14
2197 -14 11 -67 9 87 28 43 77 50 -78 49 -48 -100 -86 2 19 171 2 -177 -20 24 -114 -66 -59 -32 -45 -108 47
2224 47 -1 -14 -64 8 -55 -67 -13 -76 -37 -137 -127 -49 36 -21 80 -97 -66 -40 -13 47 131 111 5 -74 -5 -30 92 -94
2252 -94 60 -82 24 -91 -11 23 -84 -26 -88 -50 -9 -32 -154 24 -54 -9 72 0 23 66 38 79 4 -71 9 -89 -56
2279 -56 71 16 -19 -13 7 -107 15 -1 44 -27 -46 22 47 45 -140 -74 -10 -37 -13 -10 -24 25 -25 -36 -80 -37 148 -29 -79
2308 -79 7 -62 126 -137 -50 -51 46 54 31 -26 17 -162 -33 25 -100 -27 39 70 -58 65 -75 56 70 -11 89 -7
2334 -7 27 -117 59 -34 -53 -29 53 27 97 -91 74 -123 12 26 13 59 60 -18 -42 -72 99 -94 33 -106 149 78
2360 78 -34 -66 26 -7 14 -33 18 -13 -43 36 -50 -58 -46 -37 -87 6 53 28 -17 -37 95 71 -119 -92 63 74 -81 -15 -83
$$ packed form
2170a10J20j21J19J40k12jQ8p0J5pm4J05mk6J1j03K08m8p4Q5o2r8N0O5N5m3n2
2197a4K5p8P6P8n9J5L4k7j28J27r7n2J4Q8J7J52j69j79J57M4j38M8PK7j3o3J55
2224D7m8j3n0P2o3j2N4o3L9j00J0P8Q5n7J01j77L1K6K7O0Q4k0j06p9O9k5J22j86
2252i4J54j42J06j15Q0L4j07N8o2L8M1k3j22J78p8M5Q1p2K3M3k8M1p5p5Q0r8L3
2279e6J27n5l5OK0j14J22j6M5p1j9O8K5kj85O6O4k7K4Lj4M9n0j1m4M3J85j77n0
2308g9Q6o9J88k63Q7jR7Qk3n7M3j79J29N8j25P3O6L1j28J23j40J31J4q1J00r6
2334gL4j44J76r3j9K4Q2k6P0j88J65j97J35J4j3M6Jp8k4l0J71j93J27j39K55p1
2360G8j12l2R2l3K1m7N1l1l0P9q6qJ2Rn0R3M7k5m5k0J32k4j90K7J55J1j55O6o8
$$ plain form
2389 -83 6 -61 -51 21 59 143 46 15 109 -15 86 6 -41 67 105 101 -27 86 20 52 77 16 47 9 -35 -45 -14 90
2417 90 17 82 57 -10 9 27 -59 95 17 -33 -45 -4 54 -86 77 -75 -163 -78 14 -25 -45 -33 -48 -36 -43 -29 9 -43 -34
2446 -34 43 70 0 57 -34 -6 -83 -8 39 38 74 54 56 88 45 44 -27 53 -12 86 41 -14 -6 161 56 6 -23 -21 0 89 92 80
2478 80 -54 14 57 21 81 45 -43 13 -2 122 28 15 -56 -26 -5 125 7 -25 17 95 -67 8 46 -114 17 -97
2504 -97 5 29 -4 -51 -7 -50 -55 -118 -123 -66 -64 67 -32 84 24 99 52 78 -61 19 52 49 -23 -66 -59 102 -35 -29 -84 38
2534 38 -196 -34 60 -108 43 -20 40 39 -36 51 15 -84 10 -40 106 45 34 113 -63 17 7 50 54 12 100 52 19 1
2562 1 -31 -77 71 -13 -35 -17 4 35 23 -92 15 -136 32 -44 -48 139 15 148 -48 33 77 9 122 -26 8 -40
2588 -40 12 102 35 -57 -1 -20 6 91 128 7 -77 99 -43 -77 99 33 -141 -67 30 12 -10 -97 1 -83 -117 -71 107
$$ packed form
2389h3Q9o7J0P2L8Q4r7l1R4j24J01q0m7J08L8mj28J13o6L2K5o1L1l8m4j0L1J04
2417I0p3O5k5o7J9J8q6J54p8n0j2M1N8j40J63j52q8Q5R2l9k0J2j5J2pJ4L8n2R
2446c4P7K7p0N7r1K8p7P5M7jL6k0KL2m3jp1Q0o5R8m5n5QJ67j05n0k9KK1Q9Lj2
2478H0j34O8M3l6O0l6q8N6j5J24r4j3p1L0K1J30j18l2M2P8j62P5L8j60J31j14
2504i7J02K4l3m7M4m3no3nN7KJ31r9J16o0P5m7K6j39Q0L3lp2m3PJ61j37On5J22
2534C8k34J62R4j68J51o3O0jp5Q7l6r9R4n0J46o1j1P9j76Q0j0M3Mm2Q8m8l3j8
2562Al2m6J48q4k2J8K1L1j2j15J07j51J68p6mJ87j24J33j96Q1M4o8J13j48L4m8
2588d0N2R0o7r2N6j9K6Q5L7j21q4J76j42l4J76o6j74P4R7j8k2q7R8q4l4M6J78
$$ plain form
2615 107 40 -57 69 93 -49 46 -22 -4 49 25 58 -3 60 22 51 -23 -53 -160 4 81 -59 -2 52 156 -3 -26
2641 -26 -30 -63 -75 -16 -6 -21 54 129 -65 36 -23 14 68 -4 -58 -28 -57 22 -40 99 -61 113 27 10 104 36 -18 27
2669 27 64 -25 -2 36 12 -81 83 -57 36 -53 13 -9 76 -86 -27 48 -55 -69 -47 -29 32 23 60 -44 49 161 63 7
2697 7 10 -6 -116 0 79 32 -26 -18 -19 17 19 76 -59 63 -111 -31 -51 7 136 -66 -47 89 26 -32 -84 -41 55 40 -43
2726 -43 48 2 215 -10 -252 -228 376 -280 -68 107 128 -29 451 357 -153 19 -4 49 -69 76 -28 14 -1
2749 -1 -11 19 -28 61 122 -50 74 78 72 -16 10 73 60 -17 -19 -21 49 0 -25 -40 60 -28 -17 -26 -47 16 -67 48 90 18 33
2780 33 116 -56 -155 90 49 -13 67 -43 104 -61 -4 -84 -33 -71 20 -75 -99 72 -8 4 -49 -83 -1 69 -99 -19 31
2807 31 217 -23 39 -90 -55 46 -13 51 -32 -12 -85 -87 -5 0 -62 55 14 -93 116 -37 84 119 7 0 10 -29 -13
$$ packed form
2615A07o7r7J26K4j42R5o8J8N3k4L3o1O3l8K9p4l0j07J64P7j40N7N4J04j59k3
2641b6ml3j2N9J0j5P5P5j94J01n9L7N4p2n4L0k9P9o2J39j60J74q6j7R4o8n4M5
2669B7L7q9K3L8k4r3J64j40R3q9O6k2Q5j62N9P5j03j4K2J8O1rL7j04R3J12r8n6
2697GLj6j10J16P9m7n8QjL6KN7j35J22j74Q0k0N8J29k02J9J36o3n8n2M3R6j5q3
2726d3R1m6K13k25k42K4O04o56K12J75K1j57M80r4n10J72k3N3j18J45j04M2j5
2749aj0L0m7Q9O1j72J24Moq8K6O3j3p7kkP0m9k5j5J00q8J1rk1O3q3J15M2p2J5
2780C3Q3j72r9K45m1o2Q0j10J47j65N7q0N1l8R1r5k4J71q0J2n3l4Q2P0j68Q0N0
2807C1J86k40O2j29L5J01n9O4q3K0p3kQ2No2J17m1j07K09j53J21L5j12pJ0l9J6
$$ plain form
2834 -13 7 42 68 -91 58 77 33 -55 158 51 74 -23 -26 -24 -84 8 29 133 29 -20 -114 49 59 16 12 13 -23 -1 26
2863 26 59 65 -13 -77 13 -14 -45 -20 73 -27 -57 -83 -11 28 -69 -7 74 23 39 14 -31 -50 131 12 14 -95 -8 -3 95 57
2893 57 4 -2 -28 -43 -37 -114 36 -84 -25 54 42 19 -65 -48 -88 18 62 -2 -77 17 64 28 -9 -389 96 -22 -1 17
2921 17 -43 85 106 -2 19 39 -86 10 37 -77 24 60 -18 -52 91 -94 37 -44 -126 87 -32 29 2 -142 -126
2946 -126 4 18 37 8 48 8 -67 -1 109 -19 -70 -45 -27 -18 -3 -33 -37 2 -73 22 13 73 -2 14 3 55 -35 155 5
2975 5 -54 70 25 -88 -8 -71 -17 -29 -14 -76 -75 -81 -57 -48 -94 -5 -16 31 -51 6 -1 -48 -48 -1 -41 30 36 -2 35 -13 69 42 -48
3008 -48 57 33 18 -9 101 -41 -50 35 -43 -53 31 -9 -106 -46 -98 4 -57 46 11 -14 14 -45 -40 -3 1 -33 -89 19 113
3037 113 4 25 -72 -143 21 -38 51 -1 91 -33 -62 56 -8 -69 -133 -49 -6 -12 -5 110 41 101 -16 35 59 72 97 53
$$ packed form
2834a3K0L5K6j59J49J9m4q8K13j07K3r7lKo0R2K1J04j04m9r4J63J0m3mJl6K2K7
2863B6L3Op8o4R0k7l1K5R3j00l0k6P2L9r7O2Q1n1J6k5m5j9J81j19Kj09Q7NR8l8
2893E7n3ok6j5Op7J50j20N9P9j2k3q4J7m0J06M4o4p5R4M7l6l7l80M85j18K1J8
2921A7o0J28K1j08K1K0j25R6K7j14J01L6p8l4J43j85J31q1q2K13j19O1k7j44J6
2946a26J30J4J9k9M0m0p5O6J10j28n1K5J8RJ5l0mL9p5R5rO0p5J6j1N2r0J90j50
2975En9J24m5j13Q0o3N4j2J5o2JoK4Rm6Q9j1M7q2N7pm7%M7m0P1Ol8L7m8Q2k7r0
3008d8J05k4j5k7J10j42rQ5p8j0Q4m0r7O0n2J02o1J03l5k5K8n9NL7Ml4n6J08R4
3037A13j09K1r7p1J64n9Q9n2R2j24k9J18o4o1o4Q4M3oPJ15o9O0j17N1K4J3K5m4
$$ plain form
3065 53 -42 -85 34 33 48 87 100 32 -64 -46 -65 11 -84 -3 7 -13 -130 48 77 -90 5 -27 12 -24 31 -13 97 4
3093 4 118 -16 14 -94 28 3 18 -46 55 15 27 4 5 7 -13 64 -12 -64 -4 -27 62 -161 39 -74 -42 -13 81 88
3121 88 11 25 -23 26 110 18 -28 -54 -61 -12 -47 70 -16 35 -59 3 38 -45 -121 -11 -67 -44 20 84 -5 0 25 24 108 -17
3151 -17 -123 14 -8 75 12 35 21 110 -71 -48 -69 -102 -42 21 27 -87 23 -14 -58 -24 -42 -20 67 -95 29 94 -64
3178 -64 13 32 49 -48 -89 23 29 16 -24 -56 92 -20 -9 -18 -14 -110 57 -51 -53 -36 0 48 -44 -35 -6 -44 -70 12 38 51
3208 51 -43 -46 -25 -26 -22 -44 -26 102 102 72 -13 4 -80 -44 24 21 131 -20 -35 -38 -65 -28 0 -64 -13 -50 12 -29 -115 11 9 -46
3240 -46 -77 -12 -101 -46 8 -43 -57 30 -38 25 -69 11 -29 10 -35 -28 8 88 1 50 -35 2 -94 -27 -48 50 18 -53 -15 -59 17
3271 17 46 -38 8 -52 -125 162 -54 -24 -107 -13 -56 -15 -39 -28 -14 -198 11 110 16 91 -21 18 -41 -87 -36 -86 51
$$ packed form
3065E3r5m3J19jJ5L9J3o8r6J8j9P6r5Q1J0k0j17J78K9j67R5l2L9l6N5m4J10r3
3093DJ14j34L0j08J22k5J5o4J01m0J2k3JKk0P7p6n2O0k3Q9k23K00j13L2K9R4P
3121H8p7J4m8M9Q4r2m6k6pM9l5J17q6N1r4O2L5q3p6J10n6K3O4O4q9NK5jQ4j25
3151a7j06J37k2Q3o3K3j4Q9j81K3k1l3O0O3Oj14J10l7m4L4j8K2Q7j62J24O5j58
3178f4P7J9J7r7m1J12Oj3m0l2J48j12J1rMr6J67j08kJ7L6M8r2RK9l8k6Q2K6J3
3208E1r4lK1jMk2J8J28%l0q5J7q4L6O8lJ10j51j5lk7L7K8o4N1l7O2m1q6J26kn5
3240d6l1O5q9N5N4n1j4Q7o8O3r4Q0m0L9m5PL6Q0q7M9q5L7r6O7k1R8l2p1L8m4P6
3271A7K9q4M6o0p3K87k16L0q3R4m3M1k4J1J4j84K09R9r4P5j12L9n9m6N1n0J37
$$ plain form
3298 51 -100 34 18 20 -8 1 31 10 37 42 -46 103 57 -28 -32 41 -32 -63 31 11 -29 44 41 -74 6 49 -155 -104 18 -135
3328 -135 -77 42 10 -152 13 -15 -84 -42 162 -84 -52 -40 -12 -41 -30 -22 -3 59 85 -192 54 109 -58 17 23 7 17
3355 17 49 14 -29 -9 59 9 50 -51 30 -50 7 29 44 31 81 22 24 27 -75 58 97 41 15 73 19 -18 39 4 -121
3384 -121 91 7 -50 -78 -47 -62 20 -11 -2 28 -94 17 -44 43 -37 14 -71 -22 14 -50 -37 -1 32 10 100 37 86 -42
3412 -42 39 -103 93 76 -74 -36 16 52 39 -76 16 -106 94 -53 57 -23 13 13 9 -36 -73 64 -45 7 -98 -43
3438 -43 -36 37 106 -31 42 3 32 15 -14 15 -23 41 -102 -19 16 -36 32 103 29 -95 33 -44 46 -74 -117 2 45 19
3466 19 -106 24 -78 23 79 10 -53 -104 102 7 -16 -27 -54 135 -36 3 -120 -21 136 -26 -14 -69 -73 29 77
3491 77 13 99 92 61 4 -3 47 -7 5 -33 -57 -18 23 94 37 111 -25 -31 6 43 -60 -38 -5 31 76 -1 66 13 9 9 -45 -130
$$ packed form
3298E1j51J34j6Kk8RL0k1K7Nq8J49m6q5mP3p3l1R4k0m0P3lj15Q0M3k04N1J22j53
3328a35N8J19l2j62J65k8o9M2K04k46L2J2K8k9J1QJ9O2K6k77K46N5j67P5Oj6J0
3355A7L2l5m3K0O8n0M1j01Q1q0N7K2J5j3N0n9KLj02J33L9n6k6N8n4l7N7l5j25
3384a21K12q4n7k8L1j5Q2l1RL0j22J11o1Q7q0N1q5M9L6o4J3L6L3k2R0o3M9j28
3412d2Q1j42J96j7j50L8N2L6j3j15R2j22K00j47J10q0L6%mm5l7J37j09N2j05N5
3438d3PP3O9j37P3l9K9j7k9K9l8O4j43Q3L5n2O8P1p4j24J28p7R0j20m3J19M3k6
3466A9j25J30j02J01N6o9o3n1K06r5k3j1k7J89j71L9j23R9J57j62J2n5mJ02M8
3491G7o4Q6pl1n7pN0n4J2l8k4L9M1P1n7P4j36oL7L7j03K2L3L6M5p7O7n3m%n4q5
$$ plain form
3523 -130 -40 -15 26 4 28 -4 45 34 140 5 -106 94 116 63 67 19 -58 -13 155 -89 60 -29 -21 21 0 -29 56
3550 56 37 12 -18 -71 51 2 70 -35 -60 25 -7 -33 70 39 102 40 86 -74 -96 -99 -42 -9 43 17 -59 71 34 -60
3578 -60 -8 24 -13 20 -82 -29 -61 49 -42 -52 116 59 -55 20 -24 -3 -23 -42 24 56 -17 -42 -11 55 -17 115 -73
3605 -73 -80 -81 113 -58 15 -35 -133 -106 36 13 -43 -41 65 65 -73 29 31 10 -107 21 -27 72 -15 32 109 -82 42 -54
3633 -54 -28 26 -67 -53 -6 -63 16 146 54 -60 0 -142 -82 -51 33 -12 1 -118 -101 -31 -99 59 19 80 0 36 22 29
3661 29 -32 -10 -14 54 39 63 1 32 -23 32 36 -66 -46 -46 21 -14 8 19 -49 27 -7 -13 12 5 15 -71 -14 -121 97 -39 5
3692 5 44 68 52 -39 13 64 -19 -102 65 -61 58 -51 21 18 -10 8 80 1 114 114 56 -40 -38 56 70 16 -60 68 64 -124
3722 -124 39 63 56 100 -37 32 54 16 58 75 -13 67 51 23 -29 112 -18 35 3 -17 85 -61 43 -66 3 -57
$$ packed form
3523a30R0K5M1k2K4l2M9j1J06j35j11K00K2n3Mm8p7M5J68k44J49q9QM2k1k9Q5
3550E6j9k5l0n3J22m9O8j05k5Q5l2k6J03l1O3o2M6j60k2lN7L3N2k6p6J30l7r4
3578f0N2L2l7L3j02N3l2J10r1j0J68n7j14P5m4K1k0j9O6L2p3k5L1O6p2J32j88
3605g3pjJ94j71P3n0r8K7J42k3n6KJ06%j38J02Kk1j17J28m8R9q7M7P7j91J24r6
3633e4K6N4r3J4M7n7P9J30r2j14O0j42O0L1Q4m5J3j19J7P0o8J58m0O1q0L6j4P
3661B9o1K2mO8j5K4o2L1n5N5Mj02K0%O7l5K2J1o8P6l4oK5pJ0q6N7j07K18j36M4
3692EL9K4j6r1N2N1q3q3J67j26J19j09P2lk8J8P2p9J13%n8r6KR4J4n4p6J28mj88
3722a24J63K4pM4j37O9K2l8M2J7q8Q0j6k8n2J41j30N3l2k0J02j46J04j09O9o0
$$ plain form
3748 -57 -36 32 -98 -13 55 -87 81 -40 73 -17 9 84 -47 -4 -30 -59 83 -23 101 27 41 -1 12 -45 36 30
3774 30 -80 23 95 -11 32 4 -21 -62 -81 -147 33 46 -109 -18 10 2 58 8 84 4 -25 42 156 58 18 76 89 23
3802 23 53 17 58 -10 73 43 -23 -33 21 -6 -73 -2 0 70 3 106 -46 36 -52 -64 -64 -54 -67 37 14 0 17 14 -52 -52 -59
3833 -59 11 37 -101 19 -100 75 -6 18 94 62 -36 22 9 56 59 -25 39 3 43 41 62 60 -15 -11 -20 -22 -36 -42 42 -84 4
3864 4 -13 77 -68 -88 -37 6 -87 10 117 71 2 -100 128 58 25 -79 -33 -18 -61 5 2 34 -10 93 -26 107 -72
3891 -72 -13 27 -35 37 -43 -27 38 -8 -34 -48 90 39 -29 -15 -12 -24 50 54 -14 7 -46 -3 -111 6 12 -25 -88 16 -2 -6
3921 -6 82 -34 113 -1 -109 -108 -55 88 53 54 72 8 -26 -5 -41 -44 67 38 21 -65 -96 38 -107 179 -3 100 -16
3948 -16 -60 -23 17 21 -48 56 -5 -28 -49 28 -88 51 65 12 73 -73 -84 14 -11 3 49 55 -34 -41 7 -9 -52 -7 40 -9
$$ packed form
3748e7K1O8j30Q5O8j42J68j21J13r0K6P5j31M3k6k9J42j06J24p4J4m2J3n7Q1o
3774C0j10J03P2j06M3k8k5m1j9o6J80J3j55R1K8qN6n0P6q0k9O7J14r8m0N8J3o6
3802B3L0l6M1o8Q3l0o6j0N4k7o7P1KP0o7J03j52Q2q8j2%J0j3J04k3j4J7lo6%p
3833e9P0K6j38J20j19J75q1K4P6l2r8N8j3M7Lq4O4l6M0kK1kp5Mrkj4oQ4j26Q8
3864Dj7R0j45k0N1M3r3R7J07m6o9j02K28p0l3j04M6J5m3O6lL2m4J03j19J33j79
3891g2N9M0o2P2q0J6O5m6k6j4J38n1o8J4Lj2P4Mo8K1n3M3j08J17Ol7o3J04j8m
3921fQ8j16J47j14j08JN3J43l5JJ8o4l4K1l6lJ11k9j7q6l1J34j45K86j82J03j16
3948a6m4L7M0Mo9J04o1k3k1P7j16J39J4n3O1j46j1R8k5J4M6Oq9pM8j6m3M5M7m9
$$ plain form
3978 -9 -27 12 111 -27 -20 37 5 -16 -58 8 -52 -33 -31 41 -11 -23 61 -8 -71 35 57 -29 -112 -7 77 -72 -91 -15 59 -47
4008 -47 101 9 41 54 83 24 -61 -54 -51 -54 0 83 24 32 79 -12 39 55 138 130 -3 -24 71 99 -35 78 113 34 -126 -18
4038 -18 44 2 7 -11 52 35 -10 -17 36 3 16 -17 20 109 84 17 9 -77 19 44 -66 21 11 51 22 37 -20 -3 -21 -38 -50
4069 -50 28 -30 -14 -98 -56 46 11 -55 -93 41 -25 -178 -68 -21 3 39 -61 55 24 -9 21 14 37 61 48 -17 81 -49
4097 -49 38 -65 -4 35 86 -138 -20 -107 -122 -3 82 37 29 -20 45 -2 -24 17 -34 36 2 -15 8 26 -130 20 7 88
4125 88 -20 -111 -44 14 -23 -31 10 -22 -16 -9 63 -33 -26 37 126 -49 -141 131 56 56 -74 -69 -63 -17 -31 -34 -89 47 84 -88 -92 21
4157 21 78 -60 -78 -8 3 11 -33 21 -2 -73 -62 11 6 -9 92 -112 -21 88 -60 97 3 -19 25 -20 73 -144 20
4184 20 -61 -126 -26 99 -12 190 132 -125 95 -38 -5 -52 -12 -41 47 -62 89 93 77 -13 -102 -134 67 145 -5
$$ packed form
3978ij8L9R9j38PN7l2k1m2O6o0J9KP2n2j2Q4o9o3J06K2q6q3J05Q4j49j9P6P4j06
4008d7J48r2L2J3K9n9q5PLlN4Q3n9QM7r1N1J6Q3qj33k1R5K8j34J13L5p9j60J08
4038a8O2m2Nj8O3j7m5pN3l3J3l3L7Q9k5o7qq6R6K5j10Q7j0M0k9J5n7J7j8j7j2
4069e0P8n8J6q4M2J02l5o6l8J34o6j53J10M7K4L6j00J16l1l3L0pK3K4j3o5R8j30
4097d9Q7j03O1L9N1k24J18q7j5J19Q5m5qm9O5m7k2M1n1P0l4j7K3J8j56J50j3Q1
4125H8j08r1O7N8l7qM1l2OPP2r6PO3Q9j75r2K72p5%j30NOM6j4ln5J36L7j72mJ13
4157B1N7j38j8P0J1Qm4N4k3p1J1P3nj5J01k04R1J09j48J57r4k2M4m5R3k17J64
4184B0q1o5J00J25j11K02n8k57K20j33L3m7M0k9Q8j09J51Mj6r0q9l2K01P8j50
$$ plain form
4209 -5 -28 62 94 7 -43 63 -44 -2 -5 -6 -3 -71 79 34 -43 4 -9 51 91 70 45 -24 3 26 21 -47 -58 11 -85 77 4
4240 4 44 75 12 -82 -2 -1 -61 8 26 -156 -65 -12 87 71 70 11 100 61 -98 -39 54 7 -52 -132 -9 90 152 40 -7 27
4270 27 71 6 174 51 -11 75 -93 36 98 -75 33 -21 93 4 -59 15 91 -70 -44 -93 86 81 26 -92 19
4295 19 -26 70 67 -60 -12 -50 124 -34 133 43 4 -100 54 -61 22 87 -16 20 -12 39 35 -79 22 4 32 -63
4321 -63 -12 47 -97 15 122 -29 3 -34 59 -43 88 -31 -29 -43 104 -43 33 -16 83 -8 67 10 -64 -4 112 60
4347 60 -40 82 -67 59 50 85 -17 0 -13 147 16 18 86 40 26 80 -36 34 -22 -21 -33 100 -72 146 113 38
4373 38 -27 -65 28 -71 -119 72 93 -63 8 146 102 50 29 -35 29 129 53 31 79 -71 31 -56 13 -4 -89 75 86
4400 86 29 -65 16 -46 -30 37 41 -14 -35 -10 -94 19 64 -51 -57 65 21 -25 -93 2 -78 2 74 -60 -65 -84 56 -15 -5
$$ packed form
4209ek3R0L2q7n0J06j07M2ljLo8J50m5p7M7j3O0M0k1k5o9K7K3no8j1O9r6J62p3
4240DM0L1o3r4Q0Jo0O9J8j82R1N3R9j6jn9Q9l9j59N9R3m7n9q0J23R9O2j12m7L4
4270B7M4o5J68j23o2Q6j68J29O2j73J08n4J14q9o3P4P6j61K6m9J79nn5j18J11
4295A9m5R6lj27M8l8J74j58J67r0l9j04J54j15Q3O5j03L6l2N1mj14J01j8K8r5
4321f3N1N9j44J12J07j51L2l7R3j02J31j19Kj4J47j47P6m9R9r1P5n7p4O0J16n2
4347F0j00J22j49J26rL5j02J7j3J60j31KO8m6j4N4j16P0n6Jj2J33j72K18l3p5
4373C8o5l8R3r9m8J91K1j56P1J38m4n2k1o4O4J00p6k2M8j50J02q7O9j7q5J64J1
4400H6n7r4Q1o2J6O7Mn5k1K5q4J13M5j15oJ22m4m6o8R5q0Q0P2j34nj9J40p1J0
$$ plain form
4429 -5 50 -29 77 -25 -118 -51 -98 45 -41 89 2 44 -39 20 -76 -47 -57 0 36 -33 -71 -112 71 45 -30 -28 -92 -84 149
4458 149 -5 -4 3 -57 23 60 61 60 120 -28 25 12 84 -4 13 49 47 104 -18 -19 -47 -4 49 92 8 -56 -46 16 -38 -112 2
4489 2 130 -79 63 106 -15 -60 -135 -24 8 34 -3 24 -35 -94 -83 36 27 -33 -18 67 8 -26 140 -31 -31 -116 -43 -140
4517 -140 -27 -32 28 31 13 65 91 83 -104 81 -82 9 -82 146 -2 31 -47 -32 -6 57 -54 -25 -40 -24 58 8 -50 -52
4545 -52 37 71 -54 64 65 -45 29 -45 -106 -1 20 -76 -61 96 10 110 26 183 10 70 19 34 -5 -45 37 -66
4571 -66 72 -2 7 28 -10 128 -13 -56 109 -37 -19 -2 46 -36 113 -56 50 -42 -337 56 -17 -58 -47 -58 -89 66
4597 66 -69 10 29 -1 56 -88 -6 -31 -71 -83 87 -43 -30 62 -58 19 9 65 -64 -41 -66 77 -56 -100 36 -32
4623 -32 -25 22 58 88 0 -10 -143 -47 61 86 19 -75 25 3 24 -54 31 46 -44 43 27 -11 -22 -48 20 -1 2 112 32
$$ packed form
4429eN5p9J06j02r3O7m7J43q6J30q7M2q3N9r6K9j0N7L6o9l8m1J83k6p5Ko4QK33
4458A49j54JPo0Q0L7JjO0j48N3j3P2q8J7L6kN7j22jk8M3N3M3q4o4J0O2n4p4J14
4489BJ28k09J42M3j21m5p5J11L2K6l7K7n9n9J1J19ro0J5Q5n9l4J66j71%q5P3r7
4517a40J13nO0Lj8N2K6qj87J85j63R1r1K28j48L3p8J5K6O3j11K9j5J6Q2n0n8k
4545e2Q9L4j25J18Jj10P4p4o1J05K1r6J5J57q6J00q4J57j73O0n1J5l9m0Q2j03
4571f6J38p4RK1l8J38j41m3J65j46J8J7M8q2J49j69J06r2k95L93p3m1J1j1l1J55
4597F6j35P9J9l0N7j44Q2k5m0j2J70j30J3R2j20P7j0N6j29K3k5J43j33m4J36o8
4623c2PM7L6L0q8j0j33R6J08K5o7r4J00k2K1p8Q5J5r0Q7j6l8j1k6O8k1LJ10q0
$$ plain form
4652 32 -25 -59 -1 -40 -55 63 85 -42 -88 -54 -11 73 -88 25 42 59 -1 -87 -62 16 -109 -95 67 50 -63 -86 -13
4679 -13 -30 -38 9 85 71 24 -53 -14 21 -47 -43 9 -59 -17 -9 -48 -1 -77 -7 53 14 8 96 71 -86 130 102 -72 -60 -83 20
4710 20 -105 28 -59 5 -5 -12 -65 13 -46 6 10 3 98 -43 -23 -37 -117 -18 113 22 -20 38 -129 -2 -46 52 4 18 78
4739 78 12 107 -120 -115 16 -24 -57 -101 -100 3 -10 6 19 -32 -14 -33 -68 -55 -43 -97 -2 -36 -87 -26 53 19 41 -141 -13
4768 -13 4 -2 27 -74 -27 -44 108 116 53 -22 -82 2 23 -3 -43 -21 -28 1 -14 -138 17 16 3 -36 -8 60 31 -63 -131 -61
4798 -61 68 19 -22 136 27 -41 -34 -78 118 33 56 98 -89 53 -61 -3 -56 41 54 2 -21 -30 72 -65 -114 -42 -23
4825 -23 24 -67 107 48 -10 29 -12 40 51 -141 -48 -9 15 112 -13 -19 6 -26 -29 11 28 -110 99 -100 -136 -30 52 139
4853 139 26 -62 79 76 61 76 25 -14 92 -109 -31 131 -41 15 22 -26 3 -170 -97 11 73 84 18 6 17 22 60
$$ packed form
4652C2n7l4N8l9j5J18K2j27m6L4M3Q4j61J13J7J7o0q6K5P8j25J4J62j7j13k3P3
4679a3j7qM7P6j4m7p7L9L5o8MN2o8M2Ql9M7p6P0O0l9oQ8k5j57K16k8j74J2k3J03
4710B0j25J33q7O4j0pn3P8n9N2MpR5j41K0j4q0R9J31r1m2N8j67J27m4R8m8J4O0
4739G8o6R5k27NJ31m0l3m4JJ03j3J6J3n1J8j9l5J3J2n4R5l4n1O1P9l4K2j82J28
4768a3J7oK9j01M7j7J52Qo3p5o0Q4K1k6m0K2pK9j5j24J55jj3l9K8O8k9r4o8P0
4798f1J29m9m1J58j09o8Pm4J96q5K3M2j87J42j14N8n3R7J3n2k3rJ02j37m9P2J9
4825b3M7r1J74n9n8L9m1N2J1j92R3L9K4R7j25oK5l2lM0J7j38K09j99l6J06Q2Q7
4853A39j13q8J41lj5J5n1l9J06k01P8J62j72N6Pm8K9j73P3J08O2J1o6j2J1NL8
$$ plain form
4880 60 43 119 93 20 -4 -15 -122 -143 57 37 149 57 -63 108 -20 -4 -12 -29 25 -5 31 -51 -41 -4 -27 86 31
4907 31 -89 -5 -75 65 27 61 19 -2 61 68 -49 35 -8 -25 -55 -5 -45 -89 10 -32 -51 -20 -84 -101 63 -54 82 8
4935 8 -9 -65 -50 19 20 87 18 -90 35 44 -21 -106 -25 43 -22 40 65 3 39 157 24 15 -38 -36 75 18 76 -28 43 8
4965 8 46 -92 -52 82 -47 40 80 99 132 73 -100 31 -99 4 12 94 50 -21 45 15 14 49 10 11 -18 -71 -83 -60 -39
4994 -39 32 -97 80 -22 9 -33 -98 3 9 117 119 26 -110 -74 76 -41 54 -42 -54 42 24 29 -40 10 26 81 11 44
5022 44 57 -77 11 84 0 -39 68 29 31 86 -94 3 -13 69 39 32 23 -65 41 29 137 78 -82 -62 2 -119 122 -60
5050 -60 -50 -1 47 85 60 81 32 -40 49 40 -35 -47 -40 -37 -51 3 68 45 105 -66 -39 53 -39 -55 69 23 22 12 -32 -16 -72
5081 -72 159 78 0 0 -55 4 106 -116 16 -68 -87 -20 53 91 54 26 4 -37 -1 67 -105 51 -33 -6 46 -111 -138
$$ packed form
4880F0j7P6k6p3k4j1j07k1K00k0J12r2j20J71j28J6qj7N4l0L6q2J0L7k3J13n5
4907C1j20Q4p0J40l8L4m2k1O3Pj17Q4m3j7l0N0m0m4R9m2j9L1o4j7J64j17J36p4
4935Hj7n6J5O9JO7o9j08J25Ro5q5Q1O8o5O2K5o2L6J18j33rn3KJ11n7N8j04P1l5
4965HL8j38M0J34j29Q7M0J9L3n9j73J31j30J03QQ2m4p1O6l0jL5l9Jk9n3j2K3K1
4994c9P1j29J77j02L1m2o5J01OJ08Kr3j36L6J50j17R5r6j2R6j8No9N0J6N5p0L3
5022D4J3j34Q8P3q4l9J07l9KN5j80R7j6Q2l0prq8J06j2J08n9j60K0O4j21K41j82
5050f0J0M9M8L8k5K1m9p2Q9rp5j2PLj4N4O5k3O0j71K7R2r2j6J24m6jj0m4J6n6
5081g2K31q1p8%n5N9J02k22J32q4j9O7P3L8l7k8k2m1L6O8j72J56q4K7N2j57k7
$$ plain form
5108 -138 52 63 -35 -71 -64 -48 -46 84 30 -94 -36 26 28 2 17 -45 82 110 -87 -5 28 -60 10 -40 -47 -3 -63 47 1
5137 1 138 -5 -60 24 87 102 -12 22 -19 7 -1 3 1 82 -38 28 76 -4 74 20 46 -105 -81 23 3 -16 64 23 -61
5166 -61 -18 -7 83 -54 -52 -20 -65 -109 30 -35 -35 -1 33 -42 27 -72 92 4 -53 20 74 -18 71 106 10 8 84 37 28 -29 -83
5197 -83 49 -94 58 -24 -22 -75 48 -139 33 31 -80 -31 -110 87 -1 94 49 -4 26 77 13 10 57 43 21 52 38 45
5225 45 -5 -24 28 106 1 36 39 104 -25 28 26 -37 42 -12 -14 -33 31 -42 22 -3 1 -12 42 96 -75 -61 67 82 32 23 -1
5256 -1 -1 -16 62 28 63 12 89 44 99 -24 44 38 -160 -13 -52 -22 -36 -31 3 -119 -10 -8 -45 -64 95 80 -9 71 41 -43
5286 -43 -13 -31 8 -68 85 -32 21 -19 41 34 -17 -41 -8 -24 15 -34 -50 26 -12 -32 98 73 -7 37 45 128 10 122 70
5315 70 62 -8 12 -50 26 -21 -115 51 -64 2 45 95 94 57 -19 93 -44 -71 -12 45 -20 32 -24 -68 -51 39 -57 -45 19
$$ packed form
5108a38J90J1r8l6PJ6KJ30n4j24N8O2Kk6J5o2J27K8j97Q2L3q8P0n0pM4o0J10m6
5137AJ37j43n5Q4O3J5j14L4m1K6qMkQ1j20O6M8q0P8n4K6j51K4J04k0j9Q0m1q4
5166f1M3J1R0j37KL2m5m4J39o5%L4L4p5O9r9J64q8n7P3N4r2Q9L5r6kP6m7rn7n4
5197h3J32j43J52q2Kn3J23j87J72kj11M9p9J97q8R5m5n3L0N1o4lM7j4k2L1j4P
5225D5n0j9N2P8j05L5LO5j29N3ko3P9n4kj9O4p3O4k5Mj3N4N4j71J4J28J5n0rk4
5256a%j5P8l4L5n1P7m5N5j23O8oj98J47l9L0j4NL4j22J09Kl7j9J59j5q9Q0l0q4
5286d3L0j8L9p6J53j17N3m0O0pn1k4L3j6L9m9j6P6l8k0J30k5q0M4QQ3j18J12n2
5315G0qp0K0o2P6m7r4J66j15O6M3N0jl7p6J12j37k7N9N7o5N2n6m4J7R0r6J2O4
$$ plain form
5344 19 46 -15 17 48 -16 -4 -2 43 -122 -42 43 -46 -5 30 49 -68 -24 101 -30 -100 23 -36 33 -93 -45 -87 -113 -69
5372 -69 18 50 -132 -36 -8 -56 -27 30 34 15 -39 64 26 2 -39 109 174 -49 -23 -36 45 18 -28 -77 24 41 23 112
5400 112 -50 -28 -72 16 -100 73 107 -1 -90 -64 9 1 -19 25 -53 -69 0 23 -97 -10 -67 -37 -48 -79 26 -25 22
5427 22 31 57 4 -7 18 -18 -9 18 11 -70 -11 72 30 -60 -65 -79 98 -59 145 24 -56 17 -54 -128 -97 -25 -20 57 -102 -72
5457 -72 -56 -3 -17 -40 27 6 58 26 43 28 -18 33 25 -148 -95 -86 22 13 -99 -6 11 54 -84 -98 -3 -57 167 -53 81
5486 81 93 -34 18 -17 34 -36 23 5 127 -10 -40 -57 60 -52 -32 -45 21 -13 56 -35 54 -48 25 12 -33 45 5
5513 5 -102 -37 -38 -93 19 -114 40 60 -41 34 -65 4 25 76 -25 -25 26 80 -54 -46 -121 17 -24 -51 45 -24 103 -34
5541 -34 46 -8 -7 66 50 -23 -40 -2 24 47 61 -31 -13 5 8 -46 6 18 -16 -13 -88 3 -4 -16 -55 44 -78 -23 115 59 81
$$ packed form
5344A9K7o1L2L1o4J2KM5j65Q0Q5q9M1L5J9j17M4J25j31p0J23n9O9j26M8m2k6M4
5372f9Q7L2j82R6K8m8K9N7Mj9n4J03l8k4m1J48O5k23K6j3Q1k7m6m9J01J7j8Q9
5400A12j62K2m4Q8j16J73L4j08q9K6P3qk0M4p8j6O9K3j20Q7n7L0j1l1J05n1M7
5427B2RK6n3j1K5l6RK7pq1N9Q3m2r0nj4J77j57K04j21q0P3p1p4L1P2NP7j59L0
5457g2J6N3j4k3O7k1N2l2J7j5m6N1qj73N3RJ08rj12R3J7M3j38j4R5n4K24k20J34
5486H1J2j27N2l5N1p0N9j8J22j37l0j7J17j12K0j3O6l4O9r1Q9j02P3j3m5P8m0
5513Ej07O5jn5J12j33J54K0j01P5r9O9K1N1j01%N1N4j34Qp5J38m1k7R6o9J27j37
5541c4Q0n4JP3j6p3j7L8K6K3J4r2J8J8Ln4N2J2l4Lp5R1pj2l9R9j22N5J38n6K2
$$ plain form
5572 81 -8 28 120 29 43 122 54 39 -85 -14 -14 23 -95 0 6 0 -23 -5 45 -25 4 -73 19 35 19 -39 -10 60 -43 16
5602 16 -89 -79 -15 7 8 107 7 -33 -45 72 99 34 -78 44 25 58 24 45 -15 -90 10 140 -21 25 67 -16 11
5629 11 79 5 -16 -22 -64 -93 26 93 -14 17 56 -28 0 187 -11 28 41 27 95 -21 15 -9 12 119 -66 7 75
5656 75 -65 13 -6 -68 -49 116 -39 -4 3 -2 -65 20 28 14 43 -94 104 -76 87 2 -20 -67 -19 -54 73 8 -105
5683 -105 38 -50 100 103 41 37 67 48 79 -8 -40 49 -58 -57 -58 -23 14 -22 41 40 -8 -1 -39 -3 1 -15 -55 -31 97 67 -57
5714 -57 -50 110 -85 64 9 45 -61 -26 46 10 71 -12 -18 -4 -5 33 -17 -69 48 -71 -49 -3 -13 3 -57 -8 55 -16 -4
5743 -4 23 -67 -20 -71 24 -52 -15 -53 23 -32 -18 -5 37 -4 85 40 33 -2 34 -89 -94 -42 -68 60 -10 3 -91 58 60 6 25
5774 25 -18 -99 51 -53 -51 79 29 46 -106 -101 39 -4 -21 40 -10 20 -2 -28 65 42 -14 80 -105 -59 110 61 -6 21
$$ packed form
5572H1q9L6R2r1J4P9o8j5j24P1%L7j18R5Ook3J8N0p0K9p7R2J6j6n8K9P0j03N9
5602A6j05J0O4K2JR9j00m0j2J17K7o5j12J22j9L3l4K1o0p5J00J30j61M6M2q3K7
5629A1O8p4k1om2k9J19O7j07L1L9q4K8J87j98L9J3j4O8j16L6k4K1J07j85P3O8
5656G5j40P8j9o2J9J65j55L5Pno3Q5Qj4K9j37J98j80J63q5k2m7M8l5J27o5j13
5683a05J43q8J50Lo2mL0j9L1q7l2Q9j07JjL5L7l6O3jm8Pl8L6Mj6m0K4J28l0j24
5714e7PJ60j95J49n5L6j06L5P2l6O1q3oJ4jL8n0n2J17j19K2M6j0J6o0M9O3p1J2
5743dK7r0M7n1R5p6L7l8P6n5J4J3M2m1Q9m5pl5L6j23nN2k6J28p0J3r4J49Kn4J9
5774B5m3q1J50j04KJ30n0J7j52NJ40m3j7O1n0L0k2k6R3k3n6R4j85M6J69m9o7K7
$$ plain form
5802 21 62 -81 -65 -18 46 -163 7 3 33 94 -23 72 -179 16 -54 -23 17 -75 13 83 -42 110 -37 4 82 42
5828 42 72 59 -27 -92 89 16 -125 97 -23 -50 -55 23 -52 -104 100 -97 -8 8 -85 3 -113 36 -54 -2 81 5 21
5855 21 -50 65 -51 -9 -44 -59 -61 -42 67 -83 11 -37 60 42 8 -30 -17 -43 70 25 -16 -46 9 -34 92 88 -61 -54
5883 -54 -20 -13 -55 8 -24 -22 -46 -38 -30 -102 73 17 -72 17 2 52 17 -125 29 19 -4 -63 -22 12 104 -9 -54 -72 -37 52
5913 52 -36 38 -102 45 -59 -76 -45 -63 49 -32 -15 10 -45 -93 -53 4 42 22 -11 -153 55 -42 -7 45 -31 -61 6
5940 6 -46 -13 -36 -38 52 -79 2 43 -9 -100 -29 -36 -101 29 57 -164 -45 18 42 14 29 -29 64 -89 6 43 -42 36 19
5969 19 43 -69 6 32 -86 18 -85 49 38 -54 -9 -47 -44 -35 43 -46 -12 -30 -42 11 -44 -9 42 59 -10 34 -71 -44
5997 -44 -10 12 7 126 41 128 15 55 -15 -13 -64 -49 72 -99 -66 -26 31 4 60 75 -22 24 87 -31 -6 -67 -74 -72 -74 35
$$ packed form
5802B1M1j43J6M7O4k09J70mL0O1j17R5k51J95p0L1M0r2Q8P0j25J52j47M1P8m0
5828D2L0j3q6o5J81p3j41K22j20k7nP8p5n2K04j97Q9J6r3Q8j16J49r0N2Q3p6J6
5855B1p1J15j16M2l5j5kJ9J09j50R4m8R7j8l4l8J3k6J13m5m1l0N5m3J26mj49P
5883e4L4Pm2O3l2Kk4QQp2J75n6q9Q9j5N0l5j42J54j0k3n9M1L4R2j13m5j8L5Q9
5913E2q8P4j40J47j04j7L1j8J12q1J7K5n5m8M0N7L8k0l3j42K08r7L5N2p6l0O7
5940Fn2L3k3kR0j31Q1M1n2r1P1po5J30K8k21J19O3K4k8J5n8R3j53R5L7q5P8j7
5969A9K4j12P5K6j18J04j03J34j1r2M5l8LRP8q9L4j8j2N3n5L5N1J7o9M4j05K7
5997d4L4K2nJ19q5Q7j13M0p0Kn1J5J21j71L3M0N7k7N6J5r7M6O3j18K5o1pKkJ09
$$ plain form
6027 35 -127 38 10 -31 -37 88 59 16 10 36 55 -77 99 -100 7 3 -43 41 -92 102 -21 -36 36 0 24 55 -10
6054 -10 -57 28 21 30 20 4 3 -67 69 59 25 67 -18 -27 -101 30 -17 3 25 53 90 -47 -9 19 -75 -73 48 58 50 26 -70
6085 -70 -4 -10 -43 -8 -61 108 35 -26 -8 39 -46 -24 -59 -22 -22 -9 -70 -84 -216 -91 49 36 29 -29 106 -52 25 3 94
6114 94 60 -57 -13 57 24 -16 -104 7 -3 66 92 -20 -29 0 54 35 -99 -15 64 154 127 50 -67 32 45 -113 25
$$ packed form
6027C5j62J65k8m1oJ25k9m3oK6J9j32J76j99J07mm6Q4j33J94j23j5P2l6K4L1o5
6054a0m7Q5pRj0j6jp0J36j0l4M2q5rp4J31m7K0K2K8L7j37L8K8r4KJ21J0qk4r6
6085g0O6ol3L5n3J69p3o1J8M7q5K2l5L7%J3o1j4j32J25J40j3pn8J35j58P7k2R1
6114I4l4j17M4P0l3m0q8J11j0O9K6j12rK9N4j9j34Q4P9R0k7p7j17R9J3j58J38
$$ [...]
8191d7
##END NTUPLES=NMR FID
##END=
