##TITLE=1H_DE-80H_X3
 200.13MHz, d2o
 8 sc
 
 19ns.26.2.2025
##JCAMPDX= 6.0         $$ Bruker NMR JCAMP-DX V2.0
##DATA TYPE= NMR FID
##DATA CLASS= NTUPLES
##ORIGIN= UXNMR, Bruker Analytische Messtechnik GmbH
##OWNER= pz
$$ XWIN-NMR		Version 3.5
$$ Fri Jul 10 12:07:31 2026 Russian Standard Time (UT+4h)  Yarkov@DPX200
##.OBSERVE FREQUENCY= 200.1313
##.OBSERVE NUCLEUS= ^1H
##.DELAY= (6, 6)
##.ACQUISITION MODE= SIMULTANEOUS
##.ACQUISITION SCHEME= undefined
##.AVERAGES= 8
##.DIGITISER RES= 18
##SPECTROMETER/DATA SYSTEM= spect
##.PULSE SEQUENCE= zg30
##.SOLVENT NAME= DMSO
##.SHIFT REFERENCE= (INTERNAL, DMSO, 0, 14.3821)
##AUDIT TRAIL= $$ (NUMBER, WHEN, WHO, WHERE, WHAT)
$$ ##TITLE= Audit trail, XWIN-NMR		Version 3.5
$$ ##JCAMPDX= 5.01
$$ ##ORIGIN= Bruker BioSpin GmbH
$$ ##OWNER= Yarkov
$$ C:/Bruker/XWIN-NMR/data/yarkov2/nmr/H-C/1/audita.txt
$$ ##AUDIT TRAIL=  $$ (NUMBER, WHEN, WHO, WHERE, WHAT)
(   1,<2026-07-10 12:06:41.35 +0400>,<Yarkov>,<DPX200>,
      <created by zg, POWCHK disabled, PULCHK disabled
       configuration hash MD5:
       00 E9 B6 7A A2 85 ED C7 34 08 36 98 17 FE 4E 26
       data hash MD5: 16K
       91 58 09 D8 7E AD DA C9 F7 75 A7 D1 1B 26 74 0E>)
$$ ##END=
$$ 
$$ hash MD5
$$ 69 69 F6 20 90 3A 70 42 E4 D8 8D 2B 16 22 A4 77
##$RELAX= 
##$RELAX= 
##$RELAX= 
##$RELAX= 
##$RELAX= 
##$RELAX= 
$$ Bruker specific parameters
$$ --------------------------
##$DU= <C:/Bruker/XWIN-NMR>
##$EXPNO= 1
##$NAME= <H-C>
##$PROCNO= 1
##$TYPE= <nmr>
##$USER= <yarkov2>
##$AMP= (0..31)
100 100 100 100 100 100 100 100 100 100 100 100 100 100 100 100 100 100 
100 100 100 100 100 100 100 100 100 100 100 100 100 100 
##$AQSEQ= 0
##$AQ_mod= 1
##$AUNM= <au_zg>
##$AUTOPOS= <>
##$BF1= 200.13
##$BF2= 200.13
##$BF3= 200.13
##$BF4= 200.13
##$BF5= 200.13
##$BF6= 200.13
##$BF7= 200.13
##$BF8= 200.13
##$BYTORDA= 1
##$CFDGTYP= 0
##$CFRGTYP= 5
##$CHEMSTR= <none>
##$CNST= (0..31)
1 1 145 1 1 1 1 1 1 1 1 1 1 1 1 1 1 1 1 1 1 1 1 1 1 1 1 1 1 1 1 1 
##$CPDPRG= <>
##$CPDPRG1= <>
##$CPDPRG2= <>
##$CPDPRG3= <>
##$CPDPRG4= <mlev>
##$CPDPRG5= <mlev>
##$CPDPRG6= <mlev>
##$CPDPRG7= <mlev>
##$CPDPRG8= <mlev>
##$CPDPRGB= <>
##$CPDPRGT= <>
##$D= (0..31)
0 0.7 0 0 0 0 0 0 0 0 0 0.03 0 0 0 0 0 0 0 0 0 0 0 0 0 0 0 0 0 0 0 0 
##$DATE= 1783670800
##$DBL= (0..7)
120 120 120 120 120 120 120 120 
##$DBP= (0..7)
150 150 150 150 150 150 150 150 
##$DBP07= 0
##$DBPNAM0= <>
##$DBPNAM1= <>
##$DBPNAM2= <>
##$DBPNAM3= <>
##$DBPNAM4= <>
##$DBPNAM5= <>
##$DBPNAM6= <>
##$DBPNAM7= <>
##$DBPOAL= (0..7)
0.5 0.5 0.5 0.5 0.5 0.5 0.5 0.5 
##$DBPOFFS= (0..7)
0 0 0 0 0 0 0 0 
##$DE= 6
##$DECBNUC= <off>
##$DECIM= 32
##$DECNUC= <off>
##$DECSTAT= 4
##$DIGMOD= 1
##$DIGTYP= 9
##$DL= (0..7)
0 120 120 120 120 120 120 120 
##$DP= (0..7)
150 150 150 150 150 150 150 150 
##$DP07= 0
##$DPNAME0= <>
##$DPNAME1= <>
##$DPNAME2= <>
##$DPNAME3= <>
##$DPNAME4= <>
##$DPNAME5= <>
##$DPNAME6= <>
##$DPNAME7= <>
##$DPOAL= (0..7)
0.5 0.5 0.5 0.5 0.5 0.5 0.5 0.5 
##$DPOFFS= (0..7)
0 0 0 0 0 0 0 0 
##$DQDMODE= 0
##$DR= 18
##$DS= 0
$$ [...]
##$SUBNAM2= <"">
##$SUBNAM3= <"">
##$SUBNAM4= <"">
##$SUBNAM5= <"">
##$SUBNAM6= <"">
##$SUBNAM7= <"">
##$SUBNAM8= <"">
##$SUBNAM9= <"">
##$SW= 18.0517328524113
##$SWIBOX= (0..15)
0 0 2 0 0 0 0 0 0 0 0 0 0 0 0 0 
##$SW_h= 3612.71676300578
##$TD= 16384
##$TD0= 1
##$TE= 0
##$TE2= 300
##$TE3= 300
##$TEG= 300
##$TL= (0..7)
0 120 120 120 120 120 120 120 
##$TP= (0..7)
150 150 150 150 150 150 150 150 
##$TP07= 0
##$TPNAME0= <>
##$TPNAME1= <>
##$TPNAME2= <>
##$TPNAME3= <>
##$TPNAME4= <>
##$TPNAME5= <>
##$TPNAME6= <>
##$TPNAME7= <>
##$TPOAL= (0..7)
0.5 0.5 0.5 0.5 0.5 0.5 0.5 0.5 
##$TPOFFS= (0..7)
0 0 0 0 0 0 0 0 
##$TUNHIN= 0
##$TUNHOUT= 0
##$TUNXOUT= 0
##$USERA1= <user>
##$USERA2= <user>
##$USERA3= <user>
##$USERA4= <user>
##$USERA5= <user>
##$V9= 5
##$VALIST= <valist>
##$VCLIST= <CCCCCCCCCCCCCCC>
##$VD= 0
##$VDLIST= <DDDDDDDDDDDDDDD>
##$VPLIST= <PPPPPPPPPPPPPPP>
##$VTLIST= <TTTTTTTTTTTTTTT>
##$WBST= 1024
##$WBSW= 4
##$XGAIN= (0..3)
0 0 0 0 
##$XL= 0
##$YL= 0
##$YMAX_a= 139369
##$YMIN_a= -116674
##$ZGOPTNS= <>
##$ZL1= 120
##$ZL2= 120
##$ZL3= 120
##$ZL4= 120
##$ABSF1= 10
##$ABSF2= 0
##$ABSG= 5
##$ABSL= 3
##$ALPHA= 0
##$AQORDER= 0
##$ASSFAC= 0
##$ASSFACI= 0
##$ASSFACX= 0
##$ASSWID= 0
##$AUNMP= <proc_1d>
##$AZFE= 0.1
##$AZFW= 0.1
##$BCFW= 1
##$BC_mod= 2
##$BYTORDP= 1
##$COROFFS= 0
##$CY= 83.5205535888672
##$DATMOD= 1
##$DC= 2
##$DFILT= <>
##$DTYPP= 0
##$F1P= 10.8118882576601
##$F2P= -7.23987719738617
##$FCOR= 0.5
##$FTSIZE= 0
##$FT_mod= 4
##$GAMMA= 1
##$GB= 0.15
##$INTBC= 1
##$INTSCL= 1
##$ISEN= 128
##$LB= 0.25
##$LEV0= 0
##$LPBIN= 0
##$MAXI= 10000
##$MC2= 0
##$MEAN= 0
##$ME_mod= 0
##$MI= 1.114404
##$NCOEF= 0
##$NC_proc= 0
##$NLEV= 6
##$NOISF1= 3.799351
##$NOISF2= 2.8
##$NSP= 1
##$NTH_PI= 0
##$NZP= 0
##$OFFSET= 14.38212
##$PC= 1
##$PHC0= -7258.148
##$PHC1= 6.42196
##$PH_mod= 1
##$PKNL= yes
##$PPARMOD= 0
##$PSCAL= 0
##$PSIGN= 0
##$REVERSE= no
##$SF= 200.129724274929
##$SI= 16384
##$SIGF1= 3
##$SIGF2= 2
##$SINO= 400
##$SIOLD= 16384
##$SREGLST= <1H.CDCl3>
##$SSB= 0
##$STSI= 0
##$STSR= 0
##$SW_p= 3205.1282051282
##$SYMM= 0
##$S_DEV= 0
##$TDeff= 0
##$TDoff= 0
##$TI= <>
##$TILT= no
##$TM1= 0
##$TM2= 0
##$TOPLEV= 0
##$USERP1= <user>
##$USERP2= <user>
##$USERP3= <user>
##$USERP4= <user>
##$USERP5= <user>
##$WDW= 1
##$XDIM= 8192
##$YMAX_p= 0
##$YMIN_p= 0
$$ End of Bruker specific parameters
$$ ---------------------------------
##NTUPLES= NMR FID
##VAR_NAME=  TIME,          FID/REAL,        FID/IMAG
##SYMBOL=    X,             R,               I
##VAR_TYPE=  INDEPENDENT,   DEPENDENT,       DEPENDENT
##VAR_FORM=  AFFN,          ASDF,            ASDF
##VAR_DIM=   8192,          8192,            8192
##UNITS=     SECONDS,       ARBITRARY UNITS, ARBITRARY UNITS
##FACTOR=    0.0002768,     1,               1
##FIRST=     0,             0,               0
##LAST=      2.2672688,     0,               0
##MIN=       0,             -116674,         0
##MAX=       2.2672688,     139369,          0
$$ Real data points
##PAGE= N=1
##DATA TABLE= (X++(R..R)), XYDATA
0 0 0 0 0 0 0 0 0 0 0 0 0 0 0 0 0 1 -8 8 -8 8 -8 16 -16 16 -24 24 -32 36 -40 48 -56 64 -72 80 -88 103 -112
37 -112 128 -143 159 -176 196 -218 242 -266 294 -325 358 -395 435 -479 527 -582 645 -710 786
56 786 -874 970 -1089 1223 -1387 1587 -1840 2170 -2619 3276 -4331 6296 -11282 53054 100089
71 100089 74378 68185 -47476 -116674 -87147 -30157 11334 88740 115765 48028 -22635 -46170
83 -46170 -96204 -109771 -25768 57045 72326 77941 52828 -28876 -89967 -72685 -36294 -1086
95 -1086 68750 117147 68839 -3173 -42794 -82850 -90995 -23958 45270 65400 67476 49007 -22759
108 -22759 -91383 -82592 -38749 -6859 47365 91316 60262 2330 -30935 -59534 -65994 -18122
120 -18122 42637 62508 56863 41500 -10399 -67008 -65339 -35032 -12191 28685 65060 49066
132 49066 5619 -27210 -49991 -57949 -27991 23778 49683 52025 46531 8236 -43742 -54696 -33901
145 -33901 -8656 25180 53564 46550 9599 -23194 -43411 -55307 -34571 14481 41369 40590 32441
158 32441 5010 -31558 -44740 -32401 -8405 21656 48191 46586 14210 -14339 -30370 -43363
170 -43363 -31929 3447 28609 36454 29456 2885 -28241 -40817 -30346 -10712 10988 36019
182 36019 41278 17029 -8825 -25068 -33760 -22617 2887 24236 33777 27866 8668 -17269 -35402
195 -35402 -30841 -13738 5952 26780 31558 16153 -3273 -21371 -30684 -21778 -238 21101 29794
208 29794 24304 10970 -10969 -27732 -24615 -11813 4710 21826 26127 16203 -982 -18888 -26809
221 -26809 -22369 -6832 13163 22843 21056 11583 -6723 -21097 -22303 -13061 4324 19760 23156
234 23156 15945 607 -13777 -20926 -20550 -7691 10853 19071 17694 8791 -5806 -16334 -19606 -13769
248 -13769 297 13315 20831 17601 3101 -9460 -15560 -15964 -6568 6410 15744 18918 10117 -4506
262 -4506 -14521 -17710 -11198 -417 8992 15952 14052 3668 -6981 -15304 -14962 -5149 4441 12293
276 12293 15925 10229 366 -9686 -15528 -11887 -2694 7628 14247 10891 3769 -4116 -13455 -14348 -7046
291 -7046 2137 10674 12659 7752 435 -8239 -12012 -9018 -2912 6360 12243 10382 5514 -2612 -10461
306 -10461 -11591 -7365 457 8320 10399 8457 1972 -6996 -10788 -9308 -3781 5144 10141 9454 5192
321 5192 -2123 -7147 -8558 -6613 692 7481 9095 7406 1409 -5160 -7963 -8450 -4489 2591 7165
336 7165 9041 5801 -1521 -6660 -8670 -6590 -366 4101 7560 8203 2722 -3714 -7338 -7250 -2243 2255
352 2255 4930 6832 4500 -493 -5036 -8340 -5869 -514 2932 6164 6340 2710 -1553 -5901 -7148
367 -7148 -3968 559 5641 7546 4150 889 -2769 -6112 -4843 -1547 2374 5712 5015 2118 -1769
382 -1769 -5266 -4844 -2857 -413 4002 5840 4158 1729 -2898 -5341 -4376 -2137 1667 4726 4954 3900
398 3900 -489 -4380 -4343 -3400 -891 3201 4416 3231 325 -2884 -3852 -3937 -2422 1510 3664 4089 3083
415 3083 -807 -2991 -2887 -3475 -1172 2219 3873 3935 1303 -1588 -3461 -4252 -1952 971 1876 3442 3084
432 3084 -361 -2512 -3116 -2717 -170 1863 3133 3033 1274 149 -2041 -3825 -1720 657 2110 3691
448 3691 2473 -76 -1387 -3051 -3266 -1928 1029 3890 2771 704 50 -2079 -3024 -1066 176 1467
464 1467 2788 1846 -55 -1740 -2146 -1428 -1377 365 2240 1396 910 707 -2199 -3319 -2007 -500 1102
481 1102 1907 2360 1771 -686 -1641 -1573 -1724 537 2324 1279 875 357 -1420 -2269 -1765 48 1157 1396
499 1396 2366 1080 -1754 -1628 -1335 -1826 -77 2235 2394 1697 674 -260 -1992 -1966 794 844 86 1612
517 1612 763 -1374 -1639 -1201 -841 147 1068 1180 365 412 279 -1810 -1969 138 186 584 2191 1409 -439
536 -439 -1060 -1071 -1253 -1267 707 2146 332 -410 -246 -1498 -1445 78 355 729 1309 1209 42 -1252 -559
555 -559 126 -471 615 1538 567 408 159 -1325 -1525 -713 286 573 604 1179 512 -1255 -749 -413 -650 644
575 644 1488 789 168 -56 -19 -626 -762 486 632 150 905 158 -1258 -940 -463 -603 -122 746 1260 355
595 355 -473 -208 -988 -835 673 478 55 762 482 -453 -538 -312 -229 -277 364 782 -294 -236 323 -980 -1207
616 -1207 133 458 715 1010 754 -21 -845 -335 12 -527 719 1455 32 -447 -234 -708 -337 149 220
635 220 238 191 335 -319 -923 -6 58 -203 568 927 174 376 94 -530 -934 -480 591 316 -118 446 -24
656 -24 -801 -333 -182 -245 216 389 115 -303 -394 147 -326 -284 386 328 577 795 -100 -484 -71 -397 91 694
678 694 210 551 -203 -143 0 -595 -171 619 145 -86 174 80 -79 -322 74 332 171 445 460 -113 97
699 97 56 -751 -453 -29 135 379 248 128 -48 -433 -6 13 -184 414 329 -251 -30 -124 -175 113 70 -34 -34
722 -34 -51 164 -210 -620 -140 -227 -144 361 100 310 371 -182 -243 -206 -56 509 195 -24 179 -51 -104 -151 -102 271
746 271 235 54 81 -129 -87 62 -145 -34 87 108 348 370 -190 -199 -186 -85 118 -198 131 349 -174 -124 -228
769 -228 -187 116 150 -143 -104 -168 -55 138 -323 50 243 -69 84 144 -102 60 -98 -211 69 -81 90 264
791 264 -118 -126 -144 -253 90 -93 -124 94 75 -22 -68 -193 379 138 -39 102 110 -106 54 -128 -154 -112 -105 98 219
816 219 -60 179 63 -164 -116 -197 -40 223 52 -85 12 -101 113 47 -118 177 47 56 -5 -262 -127 51 -96
839 -96 -212 29 79 246 28 -119 -39 -176 -29 -5 -91 165 24 -131 -37 5 -112 81 30 -8 -182 -107 51 29
863 29 -191 27 -75 87 152 55 66 190 -114 -175 41 -92 314 61 -2 -70 -178 6 173 79 81 30 -54 -63 -32
888 -32 -77 90 33 -39 16 15 13 203 -73 -67 -109 -94 80 -3 -117 -107 -122 10 -7 -78 125 127 -18 48 -64 -151 148 -6
916 -6 20 63 -96 158 26 -53 64 -18 -143 -93 -65 59 228 163 -168 -30 50 44 89 38 42 -60 -28 37 -63 115
942 115 73 26 5 -17 -129 29 -27 -171 86 -75 124 18 -127 38 83 -97 40 -26 34 9 -43 -69 54 -25
966 -25 -38 35 -81 -40 -143 -30 56 -92 67 133 -58 -50 -55 -106 73 44 -56 -63 61 -21 132 -64 -84 26 -53 35
992 35 -84 3 115 65 -62 -83 -54 87 11 -216 33 17 -66 21 -34 -106 98 -55 -42 44 -45 151 21 -132 -33
1017 -33 -15 -31 87 -51 -56 -94 -82 -44 -63 -68 2 -35 -45 -24 -83 -27 176 -46 33 -1 59 70 -39 51 -22 -68 -40 125
1045 125 -81 19 28 21 -98 46 -61 -11 -74 80 -17 -6 14 86 25 62 110 2 -98 -105 20 25 -121 1 128 -63
1071 -63 -51 134 -8 -70 -3 -97 -53 -93 -20 58 -63 -26 -144 -68 -1 -41 -117 -62 -45 171 3 15 96 55 -80 -6 -23
1098 -23 -94 52 83 -56 139 15 18 8 32 4 4 -24 103 -89 -9 6 -95 11 96 53 109 98 15 -142 -78 96
1124 96 170 -27 -114 73 2 -44 40 17 -4 5 24 -83 -102 -51 78 -50 69 -143 -49 46 -48 -68 55 68 13 8 -29
1151 -29 -10 -120 -51 -76 -89 -47 36 -105 -20 -57 -39 -14 68 -17 -27 -66 9 176 -177 -102 44 -49 -33 136 -51 -1 1
1178 1 6 9 -6 2 61 1 -1 47 -12 -64 23 8 -28 39 -13 42 49 -38 160 -94 0 121 -113 18 11 3 25 41 29 -43 42 -86
1210 -86 40 -54 -145 89 -1 -38 39 70 54 37 33 -49 -5 28 -2 4 24 -25 -15 17 5 45 -4 -20 52 -52 37 50 43 -117
1240 -117 23 73 42 95 -58 113 71 -71 60 98 -44 68 102 -61 -59 -20 77 -78 73 62 54 9 97 -60 -61 -52
1266 -52 -64 -127 -41 -19 -101 19 14 36 -26 18 -24 34 43 -77 0 99 -12 22 44 4 1 11 -5 -136 -63 -14 41 30 5 17
1296 17 -141 62 31 7 7 203 34 -81 4 -45 -24 36 -10 -76 -47 70 104 15 126 46 43 2 80 -39 27 -6 1 -83
1324 -83 86 -79 12 -71 85 52 -129 66 29 -75 31 -18 -149 120 63 12 32 -6 -83 1 -82 25 24 61 2 -23
1350 -23 -134 -126 -62 60 -52 -35 -24 -116 -57 105 -23 92 -52 -6 5 71 -7 64 23 -75 48 -6 104 57 -93 -45
1376 -45 75 -128 65 55 -131 60 -134 -303 108 57 45 6 -39 -21 26 -46 11 -24 16 57 1 6 14 -89 -6 41 43
1403 43 -32 -36 -71 0 13 -20 -34 -26 24 -104 24 -55 -42 -88 -89 95 43 27 -50 55 -24 -18 -125 89 -61 94 48 -56
1431 -56 78 -3 37 50 56 -56 -54 -10 -68 -55 -6 -12 34 -22 -31 64 -5 -127 -54 46 29 46 -35 -40 -3 -33 72 -51 -15 10
1461 10 -82 127 -70 39 3 -88 83 -9 44 -26 -13 -40 -36 -49 80 56 100 81 44 -29 -18 216 -28 -35 6 -5 -12 -42
1489 -42 29 -137 -111 -153 -58 1 19 135 43 46 4 -88 -8 2 -44 -29 -37 58 -139 106 -14 -113 -82 27 -29 5 48 11
1517 11 -37 -46 -55 -59 -13 22 112 0 19 -128 12 -15 30 43 -10 10 10 44 -16 4 -41 -81 -16 105 -15 176 8 -3 51
1546 51 62 39 -40 93 29 88 -12 10 73 10 -64 -133 -87 8 10 49 -2 9 -18 -54 -1 -16 34 -81 23 0 104 78
1574 78 1 77 55 81 6 -79 38 -118 -1 106 -61 -28 -31 -21 41 35 67 70 2 119 -15 -111 -135 24 -107 -104 -32 33
1602 33 39 73 -67 -64 84 33 15 -56 -32 -2 -78 152 64 13 70 78 26 36 77 -33 72 -100 43 18 126 -8 -122
1629 -122 -4 48 3 58 68 -70 -19 -6 70 41 34 12 37 -85 -34 -4 69 74 -88 76 -2 129 87 106 148 -5 -148
1656 -148 17 62 -8 -28 39 -73 -67 -64 88 -58 -28 -100 43 138 1 -43 -120 224 160 27 -236 -515 -376 146 40
1681 40 -362 -201 -682 -357 -149 -559 11 182 -45 -132 -24 -15 -88 -8 -26 -9 -61 11 22 -34 74 -42 36 3 27
1706 27 128 138 1 -40 45 46 -17 57 -114 26 -68 -37 68 -104 29 -36 -3 -34 9 -13 2 66 -97 -74 53 1
1732 1 9 18 -49 6 -11 -4 -25 19 138 32 -14 -95 31 73 63 -30 33 34 2 -18 -81 56 -39 -39 -43 130 23 63 47 -88
1762 -88 28 -3 -60 -61 -58 78 -4 90 -23 56 -57 -111 -7 101 -38 7 -67 -16 61 -88 73 78 46 110 -167 14
1788 14 53 -1 12 35 -26 -7 23 -57 -47 -45 -23 -25 -50 12 -115 -10 -35 -64 29 61 33 38 1 -5 -19 32 34 26 101 -8 -27 -8
1820 -8 -76 -14 7 -128 17 -11 81 31 144 -3 -54 128 40 -40 58 -12 -32 87 -175 -34 60 24 -45 8 17 -104 -81
1847 -81 8 18 89 15 -36 -7 -18 11 -92 -12 13 -83 55 22 30 48 20 -78 38 -135 -53 46 -30 -43 -67 114 19 -45
1875 -45 4 162 5 -13 82 77 58 -41 20 161 -66 -36 64 -50 -5 124 -42 41 2 -58 -55 -33 34 79 37 25 -80
1902 -80 100 53 -65 39 32 -91 37 -28 -29 -15 29 -107 67 26 -75 -9 9 18 34 -11 -91 -6 -32 15 -22 -41 -35 -62
1930 -62 156 56 41 6 -3 31 -28 -99 -82 58 -153 35 5 32 -11 96 -60 -48 -36 31 -61 44 -9 47 -86 19
1956 19 67 9 4 -104 -62 40 -1 21 42 122 -32 20 -88 102 1 -77 -5 75 123 -90 50 -78 201 20 47
1981 47 20 5 82 -116 47 26 -75 17 58 95 65 44 -54 18 -31 30 -46 -71 -32 37 40 -94 -84 -37 -74 53 61 -95
2009 -95 34 53 44 -10 150 105 -131 32 28 104 -24 -66 -49 -89 45 49 -2 -3 -14 -38 -67 -17 -49 116 25 -124 114 -98
2037 -98 102 71 -53 76 30 -8 19 39 28 -136 62 -163 -21 178 -46 31 -66 34 -24 92 27 43 -35 204
2061 204 -158 -33 99 5 -116 73 256 -139 -235 69 68 196 37 -164 -3 -3 41 40 -17 -130 -56 -96 170 118
2085 118 380 -230 73 74 -209 71 3 228 -124 208 -53 -159 111 -133 129 -36 85 -322 140 282 -19
2106 -19 53 222 -86 -15 -29 -15 807 -373 -464 -188 78 120 -173 -309 326 278 -143 -263 -82 -78 -194 310 -197
2129 -197 190 214 242 296 -378 186 -77 -135 -24 -37 281 223 -632 18 -723 -51 246 118 -259 -81 260 -36
2151 -36 -19 -28 -26 -90 -165 14 -109 -174 -12 -103 -302 -857 606 211 -698 -4 -126 -15 -49 247 287 330 -459 -240
2175 -240 -96 -273 283 698 181 337 -402 440 -256 241 103 -641 -8 -240 221 -351 -179 17 -350 -271
2195 -271 -22 99 -62 312 358 -127 142 -61 -6 -125 601 359 -334 -59 107 120 -4 -90 243 -288 139
2216 139 222 -88 9 -151 288 166 171 -36 -88 -189 582 -409 41 220 -149 -200 -101 -96 118 218 156 30 -551
2239 -551 -151 -170 -651 -129 266 -114 -184 114 205 -249 136 236 198 19 -173 -199 -22 -4 -300 -49 106 -176
2261 -176 125 81 -161 74 43 197 -231 -54 1 -151 20 -123 -114 144 -140 38 -15 76 56 103 60 -87 -69 -171
2285 -171 -98 -29 87 -124 39 2 37 16 58 11 -62 -2 23 46 -90 -71 3 62 3 22 -46 -14 97 -59 7 27 32
2312 32 174 -19 99 -22 122 -14 -42 33 -2 30 -119 91 33 39 16 -27 121 53 5 -98 -47 -18 5 29 88 60
2338 60 -48 -7 29 51 29 45 107 -108 116 81 -52 -12 -42 -31 -17 32 -10 -1 -21 69 -9 -59 5 19 -80 -95 -31 34 -42
2367 -42 -17 123 21 -82 -100 27 -49 12 -110 -124 80 33 -80 64 -159 28 26 131 127 46 45 -58 33 -35 120
2392 120 -29 -33 -83 82 -26 -30 -38 80 -30 -100 149 68 -11 -21 -40 62 82 -15 -45 15 -56 16 -25 -55 -59 -46 3 -13
2420 -13 35 27 50 -79 98 -38 -24 71 -35 75 -40 25 65 23 -8 -7 28 81 -116 -92 39 93 -68 41 -24 98
2446 98 -135 -9 33 -107 -49 -66 -6 -28 103 -67 82 83 4 50 1 -21 -64 7 48 -4 0 148 -83 -60 82 -8 88
2473 88 57 -102 5 495 -86 -20 -65 -1 -57 -112 -58 -22 -46 -28 -65 62 27 25 -32 -25 -58 97 -61 -92 -75 27 10
2500 10 1 -19 8 66 -12 91 88 168 -11 68 1 62 -4 50 61 26 -16 56 34 -71 17 -134 5 162 79 62 51 -6
2528 -6 45 -2 62 -23 25 -34 -44 73 -46 -17 -18 -54 12 22 50 -30 78 -16 -7 60 -17 -31 22 34 -50 -70 4 -63 9 47
2558 47 -10 81 137 11 -24 123 -19 -22 -41 -16 -68 89 -20 39 42 9 -16 -82 -149 122 -75 -15 39 8 -68 65 70 -6
2586 -6 10 55 53 -30 46 45 46 -14 -32 12 -20 81 55 16 61 33 -70 54 -78 -7 101 -22 -22 -111 -17 36 69 5 45 -54
2616 -54 -47 -66 -20 17 -30 160 21 24 -2 -22 -38 39 92 75 -3 23 64 135 18 -85 -48 -35 52 -2 -7 -9 -33 1 -44 59
2646 59 18 127 -2 -74 119 -45 56 -9 -61 -11 75 48 -28 49 -123 -55 -14 76 -88 -10 -11 -87 -17 40 -73 28
2672 28 50 -22 76 -22 -23 51 -6 18 -26 36 -7 93 -46 87 -84 -7 63 -47 -124 18 -19 5 13 34 -3 53 27 -5
2700 -5 -59 -50 -57 28 -3 -18 1 15 51 62 6 6 78 -87 -16 -79 -14 -10 69 -65 -5 -26 118 39 59 -120 -1 35 -3 12
2730 12 -35 -49 56 -1 18 -21 -58 -36 80 -29 -121 -82 -86 -40 -6 -94 -66 40 -50 -102 48 -24 -93 -10 -57 -63 8 -66 85
2759 85 -58 10 62 -64 -30 -2 -54 102 42 67 -6 -83 76 -69 -62 -19 -123 20 -102 -45 55 -66 -15 108 -78
2784 -78 -22 -53 -3 165 -49 41 -68 22 62 -87 -1 -27 -9 15 30 42 -1 -93 76 -67 82 39 -21 -109 47 61
2810 61 -10 24 47 22 -85 42 51 -39 -21 29 35 -11 52 128 -29 57 -44 -72 -99 35 52 41 45 -28 92 -35 -55 21
2838 21 -49 4 53 49 21 -11 68 133 122 55 16 -141 -72 127 -79 8 45 12 -3 -80 47 -8 -40 -75 6 46 51 -20 41
2867 41 -47 20 -152 62 -114 -44 -46 -91 -94 12 -29 -95 33 -2 -69 17 15 -36 58 -52 15 71 30 148 127 -5 23 -54
2895 -54 101 60 7 -8 -1 43 -36 -55 -28 -17 36 56 -48 32 -11 -2 57 -52 -8 40 -76 -33 -107 -49 10 22 29 27 -8 -5 -59
2926 -59 52 -45 42 23 -2 -54 22 79 -135 -14 4 2 55 2 -44 95 -5 24 -48 9 -57 -84 87 -48 50 37 -1
2953 -1 37 100 -29 12 -127 -76 -73 -23 83 -120 -44 -2 -122 -3 -7 141 18 9 -21 -22 -94 -27 67 -14 111 -8 25 14
2981 14 63 -28 -54 -21 -47 -98 23 -6 -38 27 83 23 -16 -52 -7 -19 -32 50 -18 -37 -23 109 2 -64 -9 7 23 18 -33
3010 -33 83 -12 -21 29 -78 128 -13 75 14 115 19 -9 -31 133 -33 -31 72 52 76 -87 -98 103 -43 123 24
3035 24 -57 20 4 58 23 -45 60 -75 -57 54 107 55 35 27 -114 51 -16 37 55 8 30 0 27 -8 -26 41 -38 -6
3063 -6 66 75 54 79 -1 52 -89 -8 73 56 -52 56 18 81 38 4 59 -34 -5 27 -35 -111 -66 -46 113 -1 27 -24 16
3092 16 -134 80 -101 81 -85 -70 -4 23 94 -38 23 -38 -105 -5 122 3 -59 -22 -14 -34 -71 26 54 -17 -16 97
3118 97 -79 -10 -14 83 55 -125 -39 -72 -22 90 49 5 4 -128 100 -3 -10 -75 -50 -116 24 -14 29 4 7 112 3 57
3146 57 50 -87 -19 -32 61 -13 46 45 46 -80 -33 -94 -20 -3 -66 8 37 -51 92 -37 -106 -8 -60 80 22 59 -17 -4 46
3175 46 14 -63 19 84 117 45 46 34 -27 23 2 70 -11 83 23 16 -44 -68 -50 -62 -2 32 2 -2 57 55 74 -12 29 18 16 9 -22
3208 -22 20 27 -38 111 -44 2 -17 80 32 -52 -44 56 4 2 38 -51 57 12 63 92 -35 -59 -121 59 75 -26 95 -1
3236 -1 22 -75 130 -117 -8 61 24 52 -89 -26 92 -91 -29 -44 2 -14 -49 -46 22 67 77 42 24 -27 72 -91 48
3263 48 -48 52 64 -19 -32 90 126 -123 5 29 47 66 -4 0 -2 105 130 25 -43 62 5 0 57 -70 -63 -2 41 -56
3291 -56 64 -55 -3 -8 13 14 46 -74 -129 -38 35 -88 -3 -10 -116 -28 -30 -2 -32 -29 109 2 52 99 -18 4 -21 10 -66
3320 -66 103 -27 -37 -46 -42 -2 -19 63 -23 -75 -24 -1 22 47 22 5 -82 38 -11 -17 9 10 16 -9 -68 -54 96 96 -42 30 27
3351 27 42 -2 8 16 -35 -21 -55 -50 55 -60 56 -249 406 206 -52 295 -192 186 -89 30 -10 86 -121 -13
3375 -13 -22 -45 47 -58 47 83 -35 9 -82 -11 -66 58 -41 54 -22 -40 17 27 116 110 2 -12 72 53 103 12 23 -30 7
3404 7 -59 -124 -49 54 119 83 32 0 43 21 -144 -85 3 118 -72 -62 -60 -7 84 14 51 30 -32 26 -136 -43 -59 31 -67
3433 -67 24 -35 -50 -15 92 12 -26 -28 42 -52 -59 -140 -5 -107 121 12 30 43 25 -71 -53 61 -50 45 21 -4 55 86
3461 86 -37 3 -74 -34 -43 -27 14 -20 -70 -105 29 9 10 49 -36 80 -71 37 21 29 104 -113 -10 -41 28 -23 6 43
3489 43 -41 -93 -3 -12 75 28 65 5 65 27 74 67 4 11 -149 66 -15 33 -3 -110 -121 -35 20 18 -18 -127 -11 41 121 8
3519 8 -74 76 12 37 -33 -75 -31 57 -31 -10 -6 -55 19 -60 -81 -13 6 58 -19 -20 -13 -73 -23 -62 -9 -123 -37 -5 57 -23 31
3550 31 6 -89 39 36 101 -71 -18 89 -4 -43 89 56 0 49 18 45 50 0 -14 30 22 -75 -6 -18 -38 22 80 -49 -83
3579 -83 -28 -30 -33 -31 -10 -141 97 -17 6 7 -8 22 38 25 -8 -6 -97 17 -56 -48 53 56 58 -28 62 7 64 -92 110 -72
3609 -72 -46 48 -49 48 62 -12 -10 46 -7 30 -26 -66 99 -136 16 8 79 -16 95 52 -79 59 20 -282 85 33 360
3636 360 139 104 -153 -264 361 81 20 45 -59 3 70 -470 50 -132 -105 -512 -144 -257 -500 -516 -77 -374
3658 -374 -223 -69 59 -71 -61 -38 60 -53 32 -42 -12 -13 -109 -22 -6 -78 12 -80 -65 -2 -31 -45 163 -104 19 4
3684 4 -51 78 -18 -16 -20 95 8 141 -64 50 44 51 68 -63 -4 68 -6 78 67 115 -59 10 62 -8 34 47 54 -59 37
3713 37 -46 84 -16 95 -41 -28 -22 -45 99 -11 -19 34 -32 83 31 -29 -11 -6 -38 -117 -21 -27 -30 -33 -57 -120 -11 19 -18
3742 -18 26 -46 1 32 9 -5 -45 45 -42 7 -33 40 -19 -92 -25 114 4 -46 -70 9 49 -78 -70 96 104 -38 165 140
3770 140 14 -57 40 18 34 22 29 -39 -10 31 57 74 -63 -4 153 107 33 -70 63 -29 -29 -79 -16 7 -38 -76 46 -22
3798 -22 77 -46 45 -89 -45 -36 104 -65 -24 77 13 31 51 -5 55 103 -21 21 -30 68 120 -55 -71 20 14 41 -36 -7
3826 -7 64 66 -24 14 -56 0 49 68 -4 2 92 -73 8 -59 21 9 -32 15 12 -71 -21 -11 -1 22 -135 -17 170 40 3 -10
3856 -10 -54 35 20 47 102 -130 -88 8 28 5 -51 31 91 10 73 -63 107 171 8 -105 -51 -83 -33 -61 55 -45 -53
3883 -53 39 66 8 -4 20 -1 -22 -48 -1 6 -76 -20 70 117 -36 115 -15 -88 -52 -10 24 -66 -27 -120 -113 -4 -28 -54 119
3912 119 -70 -21 13 -65 -13 -5 -30 59 -5 22 -7 0 30 44 -14 28 -17 26 44 -44 -82 28 26 -3 -23 14 4 -6 -41 -30
3942 -30 -15 -19 -48 -149 -48 -14 -63 38 5 -166 14 -39 -92 96 -47 114 49 -11 78 66 -44 -74 -149 -58 -100 22
3968 22 67 -15 -44 61 -57 -9 -19 -85 -70 -70 -17 42 89 1 -13 70 -14 -12 32 -6 -13 -6 -71 -25 75 1 -154 43 3 65
3998 65 -78 -6 -29 -130 -67 8 74 34 73 79 1 79 54 -33 9 -35 20 -21 22 -12 -50 28 12 12 37 -60 26 -46 98 10
4028 10 -63 59 -75 37 -59 -23 -5 30 10 -34 -32 -36 -52 -18 -2 -35 32 56 -138 -90 -41 -62 37 -9 -71 -85 -58 -77 -31
4057 -31 -16 -4 -28 -54 -80 -12 59 59 46 100 6 -52 64 116 114 10 -31 -101 -51 47 -71 -99 -4 12 -29 21 -24 13 56 27
4087 27 -40 -73 -8 -2 -62 -31 81 -103 -11 -2 -6 -59 -43 55 -26 -9 92 -70 127 158 -86 -70 9 29 9 28 2 66 -72
4116 -72 -23 -49 -40 26 -20 39 47 29 11 3 -1 83 -124 54 27 -62 20 -80 -95 -61 71 17 47 -71 16 -68 20 -3 82 -24
4146 -24 -9 37 51 -9 6 -37 150 50 70 74 28 75 5 46 72 98 -74 63 -26 -75 -64 -43 -73 81 112 -12 0 76
4174 76 -21 -64 -46 93 -46 38 51 -9 8 28 -102 -18 -22 25 -60 1 32 33 106 -3 34 -133 -25 59 22 -103 -17 62
4202 62 111 -90 -49 35 -26 84 -110 -69 56 -50 -48 42 -12 20 -33 -66 -111 58 -71 20 -37 37 20 41 -62 56
4228 56 96 -14 -21 -17 31 -42 -95 18 -104 -13 44 -11 -44 17 -2 -28 65 84 113 49 119 94 16 -29 -32 37 -34 -49 39 -46
4258 -46 -21 39 105 -33 26 73 -43 48 -49 114 -25 40 -8 22 -39 -13 49 17 145 -44 43 -29 50 -4 -28 33 24 10
4286 10 -76 -45 20 -35 -62 -55 -10 -56 -34 -74 -12 22 132 62 -106 -84 -41 -99 34 3 -22 166 -4 -22 -18 -1 22 48 -2
4315 -2 -70 103 48 -30 52 -103 34 20 56 72 -102 1 -63 28 9 -66 64 -10 -11 35 -25 67 -27 -2 -29 -101 18 -2
4343 -2 -33 -121 -11 -76 26 -83 17 -5 23 -70 -89 -4 200 10 -53 6 74 44 47 2 -39 -70 -43 43 -41 88 -68
4370 -68 -23 0 43 -9 -107 -45 39 29 9 18 6 -44 3 114 -117 -21 18 -74 -115 -65 139 -104 -21 45 98 -34 -48 62
4398 62 88 4 7 -10 11 175 -62 -50 0 22 157 -20 13 4 8 -51 12 21 -53 124 -74 -26 121 -39 106 18 -31 78
4426 78 -25 -15 -146 25 17 57 -43 11 -123 59 -9 -61 101 -46 -6 25 -47 19 -47 3 26 2 88 67 -70 -52
4452 -52 105 -57 50 -40 -61 -54 -73 108 -6 44 -25 -9 -83 -78 -87 -105 2 64 185 -18 -10 -24 -16 12 78 -33 -93 118
4480 118 -16 -44 -105 25 -36 -63 5 -36 28 -23 -119 -86 -2 28 94 -46 -29 -53 -30 1 -25 44 0 108 58 71 13 33
4508 33 -17 14 -76 -40 0 -26 37 43 63 3 -110 3 -42 -89 -128 58 22 -122 1 70 4 -69 -55 7 94 -22 73 31
4536 31 -10 28 -21 3 -45 -31 42 -45 -10 -92 -45 16 -50 -22 63 -52 -139 62 -58 25 44 -91 -51 -38 97 -62 -21
4563 -21 131 -21 13 -60 88 53 -100 65 -25 61 -92 89 19 -30 27 -45 17 -21 -45 9 22 -4 113 -23 30 125
4589 125 -56 25 -41 -3 -79 -50 -54 29 7 -10 47 58 85 66 6 -1 104 -24 68 3 58 -50 77 -26 90 77 -78
4616 -78 61 3 9 31 56 14 22 87 -69 41 -45 36 -39 -10 42 114 -75 22 18 -50 85 -53 -82 -57 -134 -47 1 -17 -14
4645 -14 -3 29 -113 16 32 -91 -53 132 6 103 -90 35 61 10 -98 -25 30 -6 75 -16 -1 -37 77 19 51 -7
4671 -7 -32 -84 -76 -70 45 -49 63 115 -31 -40 10 120 47 -4 69 105 66 18 -43 -43 -37 -12 -45 68 -36 -19 53 213 34
4700 34 5 40 -2 -17 2 -30 -1 21 38 -39 21 28 -23 -97 -28 33 65 90 -93 -5 39 33 36 37 29 -6 73 -72 59 -83 -39
4731 -39 -31 -21 -88 -66 21 -31 -61 55 35 86 50 -18 82 -156 65 -29 77 -65 9 -114 -19 48 94 67 -107 68
4757 68 -12 -61 -33 23 -4 -93 1 27 13 77 -37 125 0 -6 85 -101 57 90 -107 -59 25 -110 4 41 -2 50 -36
4784 -36 45 9 58 73 0 -8 43 -4 -13 -92 37 -122 66 65 -26 -13 11 -16 -36 -35 27 53 95 33 77 78 15 2 -75 100 -55
4815 -55 30 58 -83 21 116 -23 71 4 74 3 37 61 31 44 9 41 4 -126 44 12 93 64 -39 -37 -83 -75 44 61
4843 61 -193 10 60 20 -86 -14 72 76 57 174 -35 48 -3 22 74 -1 31 112 52 42 33 91 4 -32 123 -107 18
4870 18 0 24 20 -55 97 59 50 -31 -74 4 71 -56 87 -25 39 -13 60 12 -68 112 63 -16 -112 -79 19 -47 -59 72
4898 72 27 -27 -29 20 46 -11 -6 81 58 -9 -93 -83 -70 -38 -37 65 66 -28 -13 81 20 19 29 50 -34 -29 -13 106 -5 -72 77
4929 77 27 -13 36 -26 7 -49 -47 33 98 -103 9 26 49 -31 -64 9 8 42 51 -80 30 6 1 -40 97 65 -8 -15 38 -37
4959 -37 -147 -44 4 -19 -139 -26 23 52 -49 15 1 -19 -17 -105 26 -59 -143 -78 34 -6 -52 63 -18 44 1 -10 -17
4986 -17 -47 72 -31 15 27 -40 29 101 53 37 -9 26 6 131 44 24 -43 -11 -112 57 -28 17 -28 -106 -12 -109 52
5013 52 57 -13 47 -73 36 -57 -38 -21 81 60 -4 40 18 -82 13 68 -72 88 21 -56 -9 22 -35 0 -54 -51 63 -31
5041 -31 -48 19 146 -47 -21 -63 -20 46 -87 72 -43 59 7 -8 81 88 116 -41 -53 3 -85 94 137 -49 4 33
5067 33 71 88 5 71 -31 5 60 43 19 -78 33 54 -77 -30 109 24 -29 -45 85 -44 -47 17 66 35 -102 -65 -73 0
5095 0 23 -28 -8 114 -22 -106 -31 16 -54 110 -66 -65 -103 67 -15 88 4 -97 158 113 77 -18 5 59 -13 -30 -47
5122 -47 94 38 38 -57 -79 -25 -103 -20 8 64 -82 -23 -32 81 -31 -33 37 -9 -56 76 1 -87 69 39 86 72 -7 -45 1
5151 1 77 46 25 -16 0 -1 72 -26 32 104 21 -17 11 -14 -11 23 28 121 -75 10 13 -31 12 -42 -16 -146 -23 101 -68 -22
5181 -22 -82 -11 -124 31 -11 -28 50 -63 -11 -4 -62 -74 48 -39 -12 45 66 -19 0 -16 37 119 -23 0 32 29 112 -38
5209 -38 53 -53 -132 64 -61 90 77 -44 -34 26 -85 41 61 -116 47 77 54 -82 12 47 -41 -36 -74 45 -76
5234 -76 8 -114 -99 40 72 18 -8 -27 4 38 38 40 27 30 -15 40 27 106 79 8 -100 2 121 -36 -9 -36 -16 8 80
5263 80 -21 55 -16 -23 -11 67 -33 25 -23 -113 6 -36 14 48 -31 -159 -56 -31 61 -27 -38 -25 -58 16 31 40 -65 -65 39
5292 39 43 14 10 25 -48 14 -15 2 -20 -3 -73 11 -21 0 -4 -51 4 -14 36 -69 -32 -36 34 130 -46 -52 18 -81 -45 -19 40 -13
5324 -13 36 122 151 83 28 29 -53 99 -43 93 -45 -26 124 -99 -46 71 26 -15 -60 -102 -122 44 44 46 -34 -18 20 -3
5352 -3 -53 -120 -46 19 -26 -62 0 -130 26 -17 52 56 11 -11 -125 -59 48 58 60 -61 -30 -33 2 36 35 -14 -13 -29 -38 -41 55 -33
5384 -33 -125 -30 -93 83 69 -49 -41 -13 -57 -72 -82 -29 -77 -71 -19 66 47 77 -103 -134 -90 173 47 -16 -72 -20 -40 -63 10
5413 10 -67 -37 -69 8 55 -10 60 -36 -34 -36 -11 0 21 89 30 -43 -100 -89 130 44 -127 80 -27 -54 75 -35 52 3
5441 3 -12 69 -8 -2 -1 13 -4 32 59 95 39 88 -16 -34 70 53 32 140 31 -14 83 21 -36 59 74 59 -55 36 -1
5470 -1 -33 41 -15 37 -10 46 -11 23 24 40 51 5 -15 -45 -2 26 -21 36 -4 22 28 -110 90 6 10 45 -34 2 32 1 -114
5501 -114 -101 15 57 59 17 3 -133 -37 -29 -3 -54 -48 108 -11 -77 64 46 -24 19 -50 52 -35 -124 -84 0 -85 -8 49
5529 49 -55 -101 8 -12 81 143 135 31 -35 112 9 -81 -38 63 16 -15 -94 66 48 -52 27 -49 -94 -141 63 -3
5555 -3 -53 -71 -102 -75 -1 129 -42 -26 37 22 -1 -22 -123 53 34 13 88 4 -65 82 -16 9 -64 9 -70 -26 25 66
5583 66 39 -92 5 -6 45 61 -57 -79 -33 -99 46 17 15 -40 65 -29 -71 -31 84 -50 19 9 -91 47 -29 -34 53
5610 53 45 -7 -121 37 58 84 -91 -1 57 104 171 59 -9 48 99 -45 39 31 65 -16 -23 6 -44 37 20 19 -29 -47 7 -17
5640 -17 -18 17 19 48 -40 -75 -82 71 -107 0 53 -60 43 21 -17 -16 138 -47 -36 31 110 92 7 1 107 61 3 45 -57
5669 -57 70 159 -42 98 113 64 -49 32 1 -12 18 -75 -14 63 -23 -20 -92 -19 -40 111 -48 99 131 -91 -4 34 -96
5696 -96 4 -11 -46 -16 33 37 -71 -122 -24 -91 2 0 -27 -35 1 10 37 50 -86 -51 70 74 -25 110 -28 -78 -79 -45 -119 -31
5726 -31 17 -12 -32 -29 3 -20 6 18 -106 40 -39 39 2 65 53 -27 84 59 -2 -143 -110 47 49 -12 -124 24 -63 -31
5754 -31 -41 23 39 9 36 -32 58 11 97 64 56 60 2 -14 -53 96 0 25 -31 12 -118 92 -31 58 -122 109 -91 72
5782 72 -148 307 -507 122 168 -296 308 -139 84 -87 68 0 49 14 -10 -22 18 -44 -71 24 15 -101 31 -57 42
5807 42 -111 103 -39 -30 -22 108 -78 49 -163 62 53 102 43 -59 -29 0 117 -33 -36 -30 119 75 -37 -69 -110 40
5833 40 -31 80 80 10 18 29 15 -43 97 50 -33 -20 129 -10 -2 -61 30 -22 1 -16 25 -83 -14 10 -107 54 101 104 50
5862 50 -14 35 42 -29 -129 -35 37 -14 -123 2 102 85 31 -27 85 38 39 4 39 93 9 -32 93 -72 4 -15 32 12
5890 12 -23 -55 31 -34 -71 -51 -13 -19 -26 7 -12 -67 -12 35 -43 -22 41 -13 98 -69 10 -57 -2 -41 28 69 50 -4 -65 -51
5920 -51 47 -26 14 115 -35 71 -23 49 -56 -25 -26 18 92 19 54 3 20 -98 19 56 42 -37 -38 -51 -19 1 54 -64
5948 -64 -6 32 -96 96 19 -95 44 -39 -4 -4 38 40 99 -123 16 -63 -29 -1 -5 106 -113 64 92 75 19 2 -85
5975 -85 45 -52 1 32 17 13 -26 -22 -29 27 -30 -84 -73 69 50 43 -11 -50 53 66 -3 -81 118 -55 -74 -62 136 52 -6
6004 -6 54 -33 69 -98 36 -32 45 10 -59 -4 -24 -19 8 -72 38 -90 -66 -116 -42 -89 -26 -27 -5 0 123 -93 -87 48 -104
6033 -104 77 -19 33 41 -11 0 -22 45 -2 81 -4 23 -35 44 40 -3 150 -37 78 -2 10 21 21 32 16 -35 9 -15 -32
6062 -32 -2 -14 -39 -11 51 25 44 6 9 -66 87 -49 -37 0 -20 -4 -46 29 126 28 -62 -27 -100 -34 61 1 -18 -78 93
6091 93 31 -49 -89 89 27 23 -75 -47 -15 -29 -81 6 -5 -114 123 -32 12 -84 -95 7 2 -25 18 175 -75 43 83
6118 83 79 62 43 -31 42 -18 19 25 -156 -18 -72 -20 26 43 12 -10 104 -19 16 0 25 6 148 23 -11 35 126 3
6146 3 -36 22 -14 -54 -75 23 -151 59 -41 -160 4 14 -19 -61 -50 98 55 -31 -8 50 131 -16 43 -81 100 146
6172 146 40 75 26 66 -8 18 110 43 60 0 33 22 -13 -159 -75 -52 -92 73 -14 -91 -10 43 45 -80 -132 -70 -31 -31 -50
6201 -50 -37 -4 45 47 -85 -74 -10 92 -5 5 11 27 4 -66 9 -28 -21 14 31 -57 22 89 60 52 -1 -54 -86 -126 12 73 -98
6232 -98 -11 127 -40 -28 -161 -18 -86 96 14 106 31 -34 20 25 -9 5 -100 -93 53 33 93 21 -71 -9 32 -38 -8 -94
6260 -94 -37 -6 58 -67 -104 -31 102 -43 77 58 -2 39 43 -84 -59 -18 10 -7 55 48 -25 -99 40 83 -35 -24 60 -54
6288 -54 70 -4 -113 -23 19 -14 2 7 -38 -84 -60 -32 -103 57 -24 -31 39 128 67 2 -18 28 -38 -15 29 -38 -12 -68 -34 -119
6318 -119 -52 -10 36 -52 -41 1 -6 27 53 84 61 -45 28 -84 -66 -22 -25 70 -32 18 -19 16 -66 -4 -7 -24 73 105 6 42
6348 42 18 65 79 -33 -53 -22 -81 107 -55 -109 -7 -64 -4 54 -47 25 49 -69 65 -106 58 -45 70 39 -9
6373 -9 64 -27 58 17 -50 -1 6 32 -6 -26 2 76 29 98 32 39 -48 -63 -1 51 -5 -57 66 -45 -111 -39 36 -18 -87 -84 16
6404 16 11 -72 -31 -28 -44 -16 -61 45 7 -16 67 69 -11 56 35 70 -124 69 -33 99 12 57 95 80 -12 61 -21 -167 22
6433 22 -49 -80 37 87 138 -4 -105 -41 -64 90 13 -75 -38 -56 -39 87 110 12 30 79 21 -71 -73 12 -11 -33 -49 -2
6461 -2 31 -89 -33 49 -5 34 -69 -17 18 -85 30 -76 28 -4 75 25 9 2 -18 41 -10 -45 -26 119 -24 -123 6
6488 6 105 28 106 64 95 44 -98 11 -3 -31 -41 -38 27 93 -86 -91 -31 16 -63 -100 40 21 13 41 103 41 -29 17 -40 -43 -69
6519 -69 -94 29 -60 -14 40 43 -119 -132 116 45 -49 -26 11 -89 -57 -48 -28 4 -33 37 4 -27 23 26 -41 37 -11 96 -39
6548 -39 43 -71 -25 -26 146 -24 86 -78 108 -40 392 103 206 -196 37 -464 356 -365 -395 101 -376 230
6570 230 -188 115 -147 175 47 93 -139 -80 1 93 -112 -65 -56 -69 -54 -38 65 8 -50 104 -90 34 -56 62
6594 62 -63 4 -18 80 60 23 16 17 -52 34 3 69 56 -122 -13 22 18 31 18 61 12 34 -63 -15 -52 -13 95 -28 -169
6623 -169 25 1 -41 7 -15 -40 100 -20 -55 13 -117 19 -93 -102 7 -41 15 76 -35 16 -30 -28 56 35 -26 -81 -64
6650 -64 118 -25 -28 103 -44 -141 34 -43 69 83 -64 -49 29 1 40 65 -37 23 -10 -21 32 -20 -79 -1 -48 18 76
6677 76 4 -16 -52 -73 -142 26 0 21 79 -35 -52 -76 18 -123 -10 94 2 -1 45 -9 -56 -86 -74 70 -45 98 -25
6704 -25 20 -48 46 21 -1 66 98 -32 50 30 74 16 -109 -31 51 -7 -11 20 -39 -80 -50 -135 -10 -3 -30 -17 -59 77 40
6733 40 -117 17 -50 35 -100 12 -119 -54 -48 -90 73 -67 -56 -41 -46 4 -7 -7 68 39 37 -22 5 -14 1 -16 -58 -23 -30
6762 -30 -27 89 -142 -28 112 -85 15 -91 -112 0 48 -113 -131 99 -62 -20 -21 0 -20 -82 -22 -7 -2 -31 18 -66
6788 -66 -20 -31 58 -27 -45 -44 -10 -7 78 54 28 -49 -49 -70 106 30 -38 -21 28 11 -150 13 -42 -174 44 -13 136 53 7
6817 7 64 -53 -10 -14 21 52 -100 40 54 45 31 -30 -132 -99 202 87 7 137 87 -33 -44 -8 32 -125 -63 95 78
6844 78 -36 43 96 16 38 77 -195 -65 16 101 13 105 69 39 -27 7 -93 75 -98 8 -96 -60 -29 -50 13 -24
6870 -24 -26 38 -37 45 -121 10 -77 -31 86 3 38 32 150 -50 -5 44 48 0 -61 -28 -93 -40 -3 39 -1 -16 0 -85 47
6899 47 -5 -20 -76 10 17 -137 31 -19 17 -137 -44 -109 17 58 -32 18 -50 41 10 -69 69 -36 83 95 18 67 -31
6926 -31 3 3 -11 -17 12 25 -71 33 65 11 -55 -66 35 46 128 23 -27 145 86 -35 -128 10 3 -7 3 15 110 1
6954 1 -21 -30 53 66 15 -26 -114 -32 33 -67 -90 34 -46 -95 3 -142 35 -79 31 -35 53 -78 50 -58 -10 -45 -64
6981 -64 -51 -22 89 -44 43 39 -104 -50 -32 -71 -67 -118 -37 -16 55 -25 74 -95 -17 -23 31 -3 -37 -12 -75 98 -13 -63 34
7010 34 -33 -27 55 -6 18 12 4 6 -38 190 60 -27 60 37 -80 44 22 -90 30 57 -95 13 -3 48 -49 -17 40 -41
7038 -41 23 25 69 -57 48 44 -25 27 -25 28 109 6 -52 76 -10 63 22 5 -29 113 -29 0 141 -22 -46 4 -125
7065 -125 -48 16 3 1 31 36 16 -151 -102 -20 80 109 35 76 46 -62 -76 33 -60 21 -6 -127 11 -64 -7 -56 7 62
7093 62 28 10 -6 32 22 53 -69 19 -9 12 59 32 4 -120 -16 108 -25 -60 3 -3 81 25 -76 -54 33 36 -62 -55 -80
7122 -80 13 -89 -50 9 62 7 -3 -78 12 -48 -35 3 -27 -4 -105 -2 -35 48 2 -44 -18 -30 79 88 -26 -41 23 -20
7150 -20 8 45 -15 -48 76 80 58 -33 3 25 15 -37 -26 -61 -106 -69 45 34 -35 100 68 -45 -75 90 58 67 -49 118
7178 118 -118 -57 -26 32 57 -72 34 -61 -116 -25 38 -23 55 17 5 110 1 69 -72 44 -145 41 24 33 76 54
7204 54 89 -46 24 -145 14 -31 36 14 15 -41 2 -61 26 63 -135 -14 65 -32 81 -53 153 -32 29 19 72 25
7230 25 -56 -58 13 24 -19 -46 -29 8 -5 16 12 57 -24 48 -39 -40 -18 -32 -87 6 -52 58 76 43 27 -54 -46 -98 -108 -33 98
7261 98 21 71 69 130 -8 76 45 25 -29 25 10 -7 37 -68 38 -45 4 107 21 1 -47 -44 -2 88 -115 -61 -68 9 38
7290 38 -28 -14 64 -39 34 5 52 -37 61 -5 -176 -18 -43 -8 -90 -17 159 73 32 73 78 25 32 -45 27 -62 87 43 23
7319 23 -13 27 -23 -25 -65 104 -10 -3 118 -16 -20 33 13 -46 41 -103 26 -81 20 16 -60 75 -15 55 0 -19 -11 58
7347 58 -24 154 -10 85 -38 -54 45 51 0 -35 14 -11 -59 106 -48 -11 -49 15 102 60 57 -66 17 26 113 59 35 -11 72
7376 72 -88 -18 2 -135 -109 -102 54 74 -64 -8 40 -19 -40 10 25 -35 -53 -3 5 27 -35 38 19 39 -23 -42 -4 -46 72
7405 72 -27 81 -98 41 -67 -19 65 129 104 -72 -80 17 46 62 -1 15 63 -8 -229 7 77 49 -65 118 22 45
7431 45 -34 -103 56 65 76 -110 73 13 92 42 91 -110 -87 73 8 -14 -42 -44 34 21 -10 -62 24 -98 -39 6 52 35
7459 35 -61 53 -60 42 -8 60 -10 -123 -72 113 1 68 45 61 139 -66 8 -25 48 34 -7 -12 -2 -20 10 -6 -64
7486 -64 -121 -64 23 39 -65 87 34 7 40 -82 29 -40 -16 -57 -4 10 52 -29 114 27 159 67 -35 -26 -32 -35 -2 12
7514 12 -10 75 11 -11 -67 21 61 -48 16 79 119 24 -28 79 -99 123 47 38 -42 -1 -16 -51 -83 119 52 56 25 -32 -24
7543 -24 -5 -14 30 55 7 51 34 -28 20 -86 -73 28 -47 -71 -24 5 -12 13 54 22 142 49 45 100 -64 -13 -223 -54
7571 -54 -21 -16 -36 -106 -67 -7 -40 -6 18 -3 35 -80 10 -86 -17 -18 123 -29 56 21 -36 -54 70 117 155 116 -75 -102 -7
7600 -7 11 27 -116 -105 24 10 75 67 -89 -7 23 -44 54 71 77 -73 21 -87 -6 31 18 19 27 -49 -22 9 -66 -57 55 106
7630 106 98 29 -27 40 31 -104 -46 6 128 -38 -41 32 21 -122 28 -58 -36 101 66 -5 54 -160 84 23 26 8 78 55
7658 55 75 27 -61 -48 6 0 -36 -3 77 -117 84 -2 4 14 -10 5 -19 -130 -15 -21 32 -11 -68 -78 -102 5 2 -41 -36 -34 -24
7689 -24 -94 -55 -46 -103 -6 -119 -60 -8 103 -35 108 -30 -48 35 -2 91 -19 24 -35 -102 9 -57 -13 12 -11 -14 -13 -34
7717 -34 78 -30 -96 58 35 -12 20 38 114 -2 109 -16 -8 -36 -94 -8 -42 29 -21 40 -59 -146 -58 72 -15 -56 -23
7744 -23 63 24 -22 89 -12 28 -140 -43 -19 -98 22 -91 35 -51 -15 38 46 49 81 -88 36 -7 47 -88 34 15
7770 15 -78 -80 -28 91 169 -34 24 17 -72 17 -128 90 59 139 -15 -83 129 -45 -54 -78 3 -32 -127 -59 -180 39 11
7797 11 -74 80 -58 65 -2 79 -304 190 -122 -123 -332 250 317 -179 110 256 44 245 -501 -80 -99 -529 219
7820 219 28 -398 432 -225 634 139 -414 159 -332 211 -113 68 15 72 -68 91 83 33 -90 -65 -93 17
7842 17 123 32 12 -54 -19 83 -86 -71 -81 14 5 8 61 47 48 18 35 58 -77 -1 162 -74 36 45 -81 80 -80
7869 -80 31 29 96 64 11 -9 -11 -66 23 49 -8 14 -101 -13 3 -6 16 85 1 132 -57 31 102 -74 -32 -67 40 -6 0
7898 0 51 84 -37 76 -21 -39 -17 -26 86 -55 -68 -25 -41 -21 48 -86 14 -23 13 7 -36 56 3 -21 18 22 -81 -33 -36
7927 -36 -28 28 92 -117 -56 -86 -35 -86 76 114 26 99 23 -1 -46 -15 -78 -14 86 38 78 -77 8 -80 -41 -96 61 -67
7955 -67 -41 10 -94 -29 50 39 12 -89 31 -25 91 -53 48 -38 -28 -78 47 -14 -89 26 -17 -67 18 -45 -16 -13 -119
7982 -119 -83 -14 37 96 -53 10 -87 -43 -111 -47 -21 -61 -30 -7 -20 -115 -97 -22 -52 -59 -91 20 -75 -29 40 69 -40 25 11
8011 11 60 60 132 42 110 51 -12 -101 96 48 -9 -52 62 160 -103 -13 -10 -21 -87 30 80 52 -23 31 -57 -65 -75 -22 55 -186
8041 -186 -97 -54 -46 0 -22 93 -55 52 -61 -111 38 79 30 10 82 -70 10 55 -122 55 -2 118 -28 19 16 46
8067 46 72 -61 -37 -46 96 -324 -128 1 -24 86 -15 -34 69 -24 -40 -93 -68 -33 47 -45 -24 10 96 -76 -115 5
8093 5 -43 103 9 11 22 -76 -162 75 12 107 73 37 20 -53 -9 -153 -42 -125 -1 -45 70 -9 1 16 13 -27 -43 -46 -47 -40
8123 -40 85 18 -65 72 12 51 0 -59 48 66 -20 -8 20 74 -40 127 -62 -113 48 65 -68 82 -54 107 -11
8148 -11 -46 -77 -92 -24 -58 44 48 110 -50 88 81 -33 18 -98 95 -108 141 37 -7 35 -38 15 -45 59 30 -10
8174 -10 -71 34 81 -18 34 -1 11 48 -14 49 -14 21 119 16 0 2 149
8191A49
$$ Imaginary data points
##PAGE= N=2
##DATA TABLE= (X++(I..I)), XYDATA
0 0 0 0 0 0 0 0 0 0 0 0 0 0 0 0 8 -8 8 -8 8 -16 16 -16 24 -24 32 -32 40 -48 56 -62 72 -80 88 -104 113 -128
36 -128 144 -161 182 -201 225 -249 278 -306 339 -375 415 -456 503 -554 610 -671 742 -817 905
55 905 -1001 1113 -1240 1388 -1563 1773 -2032 2358 -2789 3379 -4242 5632 -8243 14858 -69295
70 -69295 -82969 93094 117092 89212 57068 -6318 -107364 -108304 -43484 14356 74118 139369
82 139369 92367 -20990 -76191 -88560 -100526 -38945 58950 93722 72861 44774 -20874 -100542
94 -100542 -103683 -35774 10726 49742 98484 81864 5566 -40039 -60384 -72557 -32466 44515
106 44515 74956 54775 35869 -128 -69333 -91271 -45026 -4402 29076 72262 66948 9913
118 9913 -34909 -54173 -64479 -39524 26077 68589 62169 47149 14170 -48756 -75054 -43597
130 -43597 -7449 24208 56874 56305 13133 -32178 -52503 -58114 -39061 15007 53720 48670 33867
143 33867 10144 -32564 -54966 -36881 -4590 24710 50222 54555 20271 -21354 -37784 -45257
155 -45257 -40050 -1466 36573 43182 31312 6978 -26991 -46596 -35619 -8826 14693 37816
167 37816 49359 24482 -12638 -30469 -36675 -28057 1595 28314 36667 30078 10145 -20208 -43956
180 -43956 -38860 -13606 7310 26830 38406 23067 -4019 -24013 -33566 -25570 -1726 23405 34632
193 34632 27100 10318 -11727 -31727 -31021 -13590 5213 23886 31132 17923 -3132 -21097 -30077
206 -30077 -25666 -8284 15931 29750 25739 14038 -4860 -23838 -25958 -13754 3670 20844 26503
219 26503 18503 1269 -16879 -24750 -21497 -8662 11650 22907 20261 10437 -6162 -19948 -22227
232 -22227 -15305 156 16630 24118 20566 4857 -11625 -18070 -18899 -10562 6236 17925 19813 10966
246 10966 -4914 -16683 -20094 -13824 -298 10640 17293 17013 4571 -9678 -17049 -16825 -6442 6176
260 6176 14401 18056 12697 624 -11412 -18717 -14641 -2726 7511 14817 14017 5129 -4348 -13484
274 -13484 -16196 -7657 3513 12331 15348 9329 29 -8755 -13561 -10316 -3049 6683 15238 13432 5092
289 5092 -3175 -11338 -13994 -9383 -1093 8716 12817 9517 2617 -6941 -12131 -9818 -4341 4685 11777
304 11777 10467 5225 -2282 -9433 -10706 -7230 139 8482 10202 7816 2151 -6239 -10261 -9697 -5818
319 -5818 2224 8579 10109 6999 -1038 -7308 -8632 -7399 -1201 5728 8923 8973 3253 -4523 -7919 -7961
335 -7961 -3565 3093 6464 7732 5495 -772 -5685 -8725 -7343 -581 4611 6919 7451 3753 -1224
350 -1224 -6017 -8683 -4934 1484 5624 7693 5062 771 -3096 -7113 -6552 -1560 2795 5933 5718 1544
366 1544 -2331 -5769 -6384 -3449 -277 4017 7233 4958 1185 -2583 -6073 -5361 -2682 1224 5172 5642
382 5642 3745 145 -4959 -5739 -3271 -658 3457 4989 3543 1219 -2554 -4951 -4191 -1969 2320 4694
398 4694 4330 3712 607 -3786 -4452 -3619 -1344 2213 4328 4619 2309 -1877 -3813 -4061 -2781 791 2675
415 2675 3607 3560 -213 -3699 -3692 -2761 -340 2358 3649 3972 1450 -1232 -2813 -4530 -2924 854 1986
432 1986 3035 3206 478 -1789 -3464 -3585 -1561 833 3343 3488 723 -634 -1703 -3226 -1443 693
448 693 1917 3530 2753 38 -1867 -2764 -1858 -1418 -538 2599 3372 1419 464 -1541 -3165 -2094 -413
465 -413 1044 2676 2801 1794 -904 -2608 -1785 -1304 244 3060 2359 361 -66 -1572 -2656 -2331 -470
482 -470 1763 1911 1629 1292 -1124 -1833 -1398 -1890 -414 2092 2368 1338 353 -701 -1712 -2258 -421 1061
500 1061 374 1308 1290 -1336 -2227 -1118 -936 -220 1272 2133 1452 104 231 -932 -2662 -686 1373 876
518 876 1553 1775 26 -1153 -1685 -1406 -710 719 2304 707 -763 -122 -1146 -2021 220 1272 813
535 813 1375 1435 221 -1386 -1073 146 -631 -292 1734 1281 10 49 -1055 -1833 -988 116 638 527 709
554 709 676 -1238 -1570 -365 -286 596 1857 743 327 34 -588 -1087 -1200 170 961 195 443 675 -1026
573 -1026 -1079 -362 -760 -149 1065 1358 778 -466 -438 -349 -958 466 1166 464 847 763 -554 -1151 -782 -166
593 -166 -55 -90 1010 557 -370 112 -606 -1275 138 984 604 703 589 -176 -939 -855 38 -106 487 1340 83
614 83 -986 -362 -563 -894 -47 422 287 208 218 132 -777 -539 560 -256 -206 839 614 218 43 -545 -535
635 -535 -232 278 600 91 376 308 -983 -758 16 -199 422 862 310 -128 -108 140 -237 -665 424 804
655 804 63 359 329 -513 -433 -142 -328 -69 245 617 96 -706 -294 -255 -235 396 374 193 434 109 -345 -269
677 -269 -230 -42 -207 -8 487 -47 -407 89 -562 -810 -7 293 267 151 118 -36 -340 -372 122 72 514 729
699 729 -93 -236 60 -175 -65 116 85 262 31 -66 -146 -500 0 34 -300 118 527 245 227 -175 -370 -124
721 -124 -24 344 351 -75 43 -40 -382 -131 -196 -15 298 94 -204 -15 -179 97 -11 -391 243 257 145 213
743 213 -111 -84 -6 -194 13 292 60 220 30 -383 -176 -230 -42 284 -55 13 123 -19 98 -90 -88 434
765 434 2 32 239 -30 126 -37 -320 -177 88 192 300 -51 -111 -50 -263 -300 65 195 305 120 -143 4
787 4 -61 -25 271 -83 34 234 -40 65 23 -359 -160 23 -195 29 -23 16 197 -398 -205 65 22 254 21
810 21 1 46 -87 38 41 -121 -41 162 -223 -100 15 -233 61 -25 -111 113 118 251 38 -198 129 -30 -71 195
834 195 107 213 267 -72 -129 20 -59 107 61 -198 90 -7 -124 -14 12 -61 73 -100 60 43 -126 -14 -16 -133
858 -133 -142 100 265 147 -180 -198 17 -180 34 37 -53 202 15 -188 -35 -100 52 4 -216 63 116 -19 43 43
882 43 -98 165 13 15 69 -101 11 16 -133 -40 27 -3 262 31 29 84 -99 1 12 -25 114 -9 -136 76 -119
907 -119 -8 72 -122 -121 193 -32 83 9 -119 14 43 -22 123 -40 13 -13 -92 -37 74 -38 53 -19 -237 4
931 4 -18 -34 -18 -184 26 53 -115 78 -49 -140 103 -161 -96 -25 37 108 65 -75 39 -5 -70 109 85 46 147 -80
957 -80 -68 -59 54 109 -22 -54 147 106 14 121 -32 -157 -21 14 152 9 -94 222 -16 -235 149 73 -14 -63
981 -63 -163 25 47 -94 45 -107 -196 -82 -172 91 39 -64 124 -28 -105 -35 54 19 112 -125 -74 -10 -94 34 59
1006 59 -15 59 -4 -14 -73 -140 91 74 -92 73 22 50 111 -17 -17 68 -10 -33 129 -27 -130 -16 -61 11 4 109 122
1033 122 86 -124 -60 -77 88 89 -129 149 4 -161 55 -27 -198 107 11 -47 22 -2 71 -145 -112 64 -129 -41
1057 -41 233 -44 -21 42 -64 7 78 -80 183 -23 3 198 -47 42 85 63 -47 -4 -141 20 -40 70 -7 -116
1081 -116 42 138 -27 96 28 -113 -22 20 -51 -8 -68 -46 99 -47 -85 28 -15 84 94 -62 -53 144 26 47 -13
1106 -13 -139 -69 -50 99 3 29 64 -101 -92 8 -10 -21 -11 48 -104 -1 1 49 -36 -152 84 -100 -49 148 -36 42
1132 42 98 50 48 34 64 41 39 -99 -84 -104 -13 27 -31 77 -10 -83 -123 -5 -22 69 -139 -31 -22 -47 151 3 4 -7 -57
1161 -57 -11 -24 28 32 -22 -12 -79 -10 -46 52 -72 23 40 91 35 -1 -118 -145 -24 -40 0 -21 55 128 -23 -82 17 2 91
1190 91 72 75 22 -6 -20 155 -23 -1 -15 -37 1 71 95 84 71 -63 -104 -12 19 72 -59 -181 42 -45 102 77 48
1217 48 47 70 -56 0 10 -33 103 -57 -16 44 10 -13 -27 -59 -52 -88 -74 -91 -66 -28 -86 -131 37 -2 -69 -75 53 -47 -40
1246 -40 85 94 31 1 49 -45 46 73 -14 -45 -27 72 -1 40 23 11 -63 45 -1 -85 -18 51 -16 -18 37 18 17 48 15 81 -106
1277 -106 -67 119 -37 8 10 87 56 -6 -6 55 -1 -60 -59 -25 135 -95 14 -12 19 51 15 -57 -10 -38 -1 -27 -11 -15 -5
1306 -5 -5 -173 17 37 27 59 -35 -88 47 25 -44 -32 -29 -8 -19 101 -129 -71 -34 -88 6 17 19 87 57 76 -26 71 0
1335 0 -20 38 -20 17 38 21 -21 -35 -57 -5 74 -44 -104 46 -76 -44 3 -66 73 -70 -30 -13 59 -97 12 47 9
1362 9 51 -48 19 -69 -52 -74 46 -69 -46 99 27 -70 -15 61 -37 -44 116 -21 46 65 39 21 -6 16 -124 -63 -75 -28
1390 -28 -114 -51 -90 63 22 -10 -1 27 -5 -4 51 3 -5 69 12 -38 -35 -14 -14 -83 0 54 97 8 45 -131 -19 91 2 20 -148
1421 -148 -50 55 69 1 139 -64 123 38 -162 -115 152 22 -95 -50 -24 56 133 -53 90 -21 10 33 -43 78
1445 78 4 -45 10 -5 -75 8 -83 -75 16 -45 43 33 66 13 -31 44 -34 -18 -4 34 -12 -22 -28 53 48 -6 115 -16 -8 -36 -62
1476 -62 -59 62 49 -10 57 29 -19 -52 97 -95 23 77 -16 -70 109 90 -104 94 -26 57 -26 24 -100 50 101 -11
1502 -11 38 26 38 -32 -91 22 38 50 -123 60 0 16 -38 107 89 91 9 -11 33 -66 -85 -147 -46 -33 -34 19 -52 36 -59
1531 -59 35 74 -15 4 40 43 0 82 0 14 -16 19 -47 99 -37 106 16 -123 -75 -47 40 -105 -94 -86 -25 -74 51 -9
1559 -9 -33 -24 -5 61 44 37 8 -76 -9 -39 -68 -8 112 16 -54 25 69 14 1 44 17 33 55 11 54 -12 49 66 -20 -21 0 -16
1591 -16 74 -19 43 162 -36 -44 14 9 36 -10 30 61 55 -97 14 77 99 -181 12 0 -36 -99 -57 -11 54 -38 49 1 55
1620 55 -49 61 -6 -63 -14 -15 -12 -99 59 -7 -149 60 -37 52 24 25 43 -160 -136 57 -43 33 -91 -83 -7 3 -32 138
1648 138 -81 79 130 25 52 10 -56 67 3 50 -45 -40 -48 -79 -59 -31 77 6 -14 25 76 28 58 -44 35 70 77 120
1676 120 -37 -194 -203 281 -355 -28 35 -15 179 -35 117 327 204 7 44 -51 0 -180 131 24 22 -14 -53 -65
1700 -65 -32 8 -6 12 -10 -25 25 -30 -39 41 30 -1 -48 96 5 110 90 113 61 25 -102 133 12 -50 -106 -6 -79 -12
1728 -12 -11 28 -3 -53 22 23 11 -79 -42 -74 15 25 -54 41 -11 -79 -138 -40 95 3 53 42 21 17 15 -43 -160 -15 71 -9 -40
1759 -40 55 16 58 122 2 -67 0 -21 19 42 -151 81 73 -15 49 -32 -31 47 -127 18 1 -37 19 142 82 -48 -25 63
1787 63 -24 29 97 39 -39 123 50 59 -124 82 64 -65 104 -4 82 90 -8 41 8 85 64 -28 56 -102 59 34 43 13
1815 13 11 -101 -88 13 -31 -74 -31 3 126 93 -30 67 30 -3 12 -96 -82 -35 60 -37 28 80 11 1 -71 -40 -61 -57 30
1844 30 19 5 -65 75 30 -108 45 -30 -39 56 3 -44 50 53 11 -22 30 25 -23 -73 22 48 -91 77 -10 27 35 24 -3 140
1874 140 49 46 -150 -67 -89 28 53 -6 81 4 3 25 8 105 8 23 11 4 53 -102 -37 -241 -89 -78 4 23 51 122 78
1903 78 -24 -20 -95 -2 -17 70 72 -45 46 -73 -28 -1 54 167 -42 -14 105 31 -19 48 -35 6 -73 135 -155 -85 21
1930 21 6 -32 56 -91 10 -28 -90 -53 45 -4 -36 65 6 -9 45 27 -53 -8 -2 -68 -58 -70 3 37 -48 -27 -3 64 -27
1959 -27 -16 -57 -9 65 -32 96 1 -15 44 29 6 -35 98 -40 17 -71 -13 -18 -84 -3 -19 -3 -47 41 -36 -56 -53 -66 -62 78
1989 78 55 -96 61 50 39 -7 43 -36 103 113 6 -96 69 -15 57 -54 11 61 -53 28 118 -26 74 21 62
2014 62 2 19 -117 99 5 -10 4 77 87 22 68 99 61 111 177 -23 13 -5 -7 0 -37 -26 -32 40 40 72 -22 -66 -106 125
2044 125 7 -80 -149 71 -216 -41 30 -9 -142 -54 -73 13 45 -90 -25 210 44 -122 23 65 78 131 47 -116
2068 -116 40 -123 20 -164 92 -234 -111 -145 13 13 -167 9 -26 -118 -335 -27 85 187 176 -486 75 -433
2090 -433 -199 82 -206 -116 387 387 -69 146 -217 44 -60 -418 43 -162 115 -22 -365 87 -279 -29 -119
2111 -119 -996 -466 38 -182 -243 90 -498 329 66 -108 -560 -347 -61 92 -219 207 250 170 242 -455 52
2132 52 102 502 134 420 373 -525 66 -211 -145 285 -99 -438 -582 317 208 -485 -165 355 -236 359 309 -129
2154 -129 313 -77 -59 117 -82 357 -165 -278 114 -133 176 147 128 386 -45 117 99 336 89 146 268 329
2176 329 -179 -619 -385 -50 -200 -501 39 98 -240 -469 282 177 18 -397 -89 120 -480 -31 296 272 110
2197 110 32 -277 656 142 125 162 210 178 -82 82 -103 -200 257 59 -507 117 -533 39 452 -87 -392 20
2219 20 -212 -86 -122 -130 16 -14 76 49 -42 -580 195 68 372 263 -25 -201 227 729 -135 204 98 -11 114
2242 114 35 89 -215 134 -265 -172 -433 -15 267 -61 -72 93 -245 45 -51 -34 -281 114 36 48 -222 28 110
2265 110 -107 14 88 52 -21 -9 34 43 -74 -114 47 -143 -56 19 -59 26 -89 -57 -18 66 9 22 65 50 -70 -21 -19
2292 -19 -19 166 -7 -79 -15 23 15 -72 36 -61 3 53 25 25 -31 -34 34 -3 6 -138 -101 -58 -4 -94 70 68 -87 70 -78
2321 -78 -50 21 15 49 -27 -81 17 -33 115 64 -34 -29 -67 -49 76 79 -124 -1 27 -64 61 -79 79 16 35 69 -23 -13
2349 -13 -50 60 21 48 -64 44 80 60 -73 -14 -16 35 -118 -163 57 -68 -28 -8 -38 -100 -48 79 32 47 16 44 20
2376 20 9 20 87 7 146 -19 4 -10 -87 -2 -35 22 -95 101 -23 4 -1 -13 -51 -41 -11 -18 -66 10 -33 27 56 -23 -72
2405 -72 30 -6 33 28 43 -24 -60 70 -20 94 -65 -51 -60 45 35 -55 -13 38 57 26 181 100 -3 11 -48 -51 -28 -5
2433 -5 -5 -17 -92 12 -125 -21 42 -68 -16 20 93 -50 -72 15 -69 31 -27 59 -47 -45 41 -53 0 -105 -83 10 24 -103
2461 -103 5 -82 -12 -15 -49 40 32 -6 -49 -30 12 -39 90 104 7 -520 28 -62 -71 65 -35 12 8 119 -37 53 -79
2488 -79 -30 79 -39 -11 3 -40 -60 29 16 -13 -4 2 80 -96 75 26 65 -20 150 14 81 -5 46 146 70 24 -93
2515 -93 3 42 45 -58 -2 -8 -72 -55 -20 -45 23 -85 -65 61 3 -80 -105 -11 109 95 25 6 -36 44 -8 -68 -37 -6 59
2544 59 7 -4 46 89 44 -121 96 14 51 -101 20 7 100 28 -42 -46 -13 -79 28 78 9 31 -85 -99 -69 24 67 -40
2572 -40 90 -62 17 -11 125 77 16 -69 35 -14 -9 27 -106 -99 -53 97 19 92 -41 -1 -58 164 -29 -62 -60 -21 -14 -51
2600 -51 -129 -25 -32 54 60 26 9 -9 56 41 5 -24 61 -34 18 59 16 -1 -32 -82 -70 -46 44 -96 -8 -5 31 -9 40 -18 39
2631 39 2 -32 12 -135 23 -70 2 62 -42 26 -45 59 115 6 45 124 136 38 22 -59 -9 6 148 27 62 -77
2657 -77 68 62 -32 -85 -51 41 -5 -35 -41 -58 -16 -20 -149 7 65 86 21 21 14 -29 -203 -50 66 23 7 -101 1 27 -49
2686 -49 20 50 -62 73 -71 -62 3 67 108 -18 -42 -46 81 -41 24 -35 -68 -90 -46 9 -76 15 22 -4 44 -69 -24 36
2714 36 82 -66 26 53 77 -79 -59 105 -86 90 -77 -33 99 70 17 -8 -99 141 125 -28 -72 40 9 -88 29
2739 29 84 14 22 -24 -33 -53 -23 87 -94 -11 -59 51 -70 113 -19 34 -86 -1 40 33 83 -20 -42 -96 23 -2 114
2766 114 34 49 -47 54 -122 -68 -18 -43 -53 45 15 -21 -40 -91 -21 6 112 -14 -28 -103 -61 -83 57 -168 -27 -76
2792 -76 107 -61 65 -108 75 14 -27 -23 24 -68 -65 8 26 10 4 50 -114 86 86 -16 0 26 -169 76 -35 -14 45
2819 45 174 -51 -6 -52 12 -17 105 105 -61 23 -10 -34 -79 -65 93 37 -78 73 40 -17 -41 68 4 -5 -71 -131 -91
2846 -91 46 -65 37 -34 59 -9 -50 71 27 -14 -73 71 -21 -51 -89 -35 3 69 -72 69 -13 23 -35 -28 -103 24 55
2873 55 -56 -13 -6 59 -70 -20 -10 99 -21 20 54 91 15 20 -35 -10 4 -55 -44 -21 -8 59 51 -73 -51 78 46 30 85
2902 85 22 103 -106 -45 -24 -56 1 7 -10 -139 131 92 101 7 44 -51 35 4 -54 -16 -16 55 -108 0 -15 65 -13 -61 -11
2931 -11 -58 45 25 82 62 20 73 -23 -43 -104 107 25 45 74 -75 -31 -121 30 -141 10 -1 -50 10 108 35 52 40
2958 40 -67 57 -108 87 18 89 136 -26 54 63 -40 -98 53 53 32 33 8 34 -1 -108 42 -30 59 -74 53 37
2984 37 -28 -67 -9 -21 -128 103 47 -13 53 -86 57 57 -4 7 -88 10 -143 69 -97 -5 58 44 -35 55 32 26 -75
3011 -75 33 -3 -44 -17 39 -25 51 90 -90 68 -71 -123 -160 54 26 -52 -13 -117 1 -27 -47 -92 21 60 -97 -103
3037 -103 -45 113 8 -3 48 -59 9 43 -69 -50 -40 -6 -62 26 8 -71 -81 65 90 -34 4 -171 0 -151 84
3062 84 119 -94 37 46 33 -115 -44 -11 -14 -92 -5 -42 -60 -80 -11 -23 46 -36 -27 38 -13 -117 50 19 -66 43 61 131 27
3091 27 90 -34 111 25 0 -143 -48 -22 -35 -16 -35 80 95 3 51 53 -36 55 -19 74 -22 50 -59 -19 4 23 -18 76
3119 76 45 4 -14 38 -16 29 108 69 -12 -96 -13 -12 81 -168 16 80 39 88 -55 -5 -66 -96 -6 -14 1 30 114 -16 -47
3148 -47 -4 -25 -172 -7 87 -72 -111 6 74 -21 20 -26 -1 10 8 9 62 40 -103 -16 -62 -14 67 -70 -39 -15 34 43 27
3177 27 -44 2 -69 -29 -6 27 -89 -72 12 -12 5 14 -32 -38 -29 70 -36 -70 -62 36 -64 -39 33 -18 65 49 -12 -67 -40 91
3207 91 41 68 -21 -43 -34 -1 -34 108 -74 71 -68 50 43 21 23 65 10 -9 -111 -84 48 103 -22 63 88 49 48 -69
3235 -69 -177 79 -22 25 41 -38 -39 -60 -69 26 -37 -64 -33 -77 -29 33 94 16 30 144 89 79 -91 -13 -73 -16 -6 -44 5
3264 5 -32 -10 71 -32 -127 63 35 -24 79 32 -69 52 5 27 -76 69 -5 -10 25 30 -9 11 -33 17 -7 15 2 16
3292 16 4 -100 -4 112 -49 86 -37 -45 24 -20 -6 1 -58 45 -40 46 -7 16 -28 51 -77 -52 -13 -13 8 -6 -72 -16
3320 -16 31 58 31 -77 -74 -113 -33 -19 -33 -83 -4 -79 25 3 -45 24 -134 12 -44 -47 6 49 23 -129 -18 -138 -24
3347 -24 -38 -92 -44 -98 80 74 66 -36 89 -24 -27 -1 83 -98 197 451 -58 -142 -51 28 36 -36 -75 75 67 2 9 -7 82
3376 82 -20 -48 -84 -10 -10 -29 65 18 -25 -87 -117 -57 18 -29 -15 75 9 5 2 -27 79 37 27 94 -1 42 21 -29 -72 -28 49
3407 49 -86 109 -75 69 -5 -44 16 30 -23 -62 44 43 121 21 112 12 -52 3 -52 15 -52 -135 23 -36 19 46 -124
3434 -124 -145 54 43 22 -46 -17 91 40 69 31 -68 76 56 79 80 60 -33 -91 8 -40 20 -30 -21 15 -26 -40 -11 110 87
3463 87 -53 42 -11 -28 40 65 -33 54 61 -54 -25 -121 -28 69 -22 -27 41 38 58 71 62 -8 -88 -38 42 13 -5 126 32 104 -54
3494 -54 60 -20 -54 20 -19 5 32 4 -108 -39 -93 -78 64 -26 23 -59 76 123 -8 -92 16 8 5 167 -38 -137 41
3521 41 42 -26 100 -133 80 47 -40 -36 47 -17 -36 15 -25 -57 -29 33 128 93 20 47 -2 38 -7 20 138 6 5 20 -14
3550 -14 -45 18 65 47 29 15 6 22 -18 5 11 -10 54 13 -87 110 -107 44 111 -20 -12 -61 37 -68 -23 80 -62 -169
3578 -169 -89 76 -22 89 63 40 12 95 25 10 82 7 47 -14 60 72 -52 -58 -17 44 -13 55 63 15 31 -74 68 44
3606 44 -68 27 -48 -57 -22 -23 38 -121 39 -45 -30 38 81 -102 -30 -101 -28 -21 12 93 28 -147 13 -4 31 -158 -76 40
3634 40 90 -220 -163 175 295 -155 -213 -34 -78 -626 315 95 334 206 342 -151 253 363 -766 273 160
3655 160 -74 299 -181 -321 -54 -139 68 3 -121 12 -27 -16 -34 35 -12 28 37 34 17 -3 -139 -71 -58 72 -148
3680 -148 91 28 87 77 14 -60 -15 24 -9 75 -31 2 -14 49 -4 44 -82 35 -1 20 -156 99 -13 20 64 -28
3706 -28 -5 106 38 107 -133 126 36 36 -15 -30 79 41 -21 96 101 -2 45 84 -27 -63 -30 154 -3 68 25 13 40
3733 40 -61 -23 -26 98 -73 97 -23 76 -17 -80 -25 -4 -85 4 102 -64 20 21 47 6 80 -49 -13 2 -26 -75 -63 -11
3761 -11 -58 -67 86 -120 -38 9 21 62 26 -7 27 -55 53 53 8 -1 12 -4 62 58 -62 -76 12 -69 82 -5 -70 -21 -24 -92
3791 -92 -132 22 -49 42 -12 -88 -13 -13 125 -20 -48 -81 29 102 -51 -24 29 54 50 39 -1 -50 -67 15 17 78 -68 -55 -50
3820 -50 48 2 14 46 66 62 -70 -54 -80 -64 -63 -47 47 -58 7 5 31 37 -81 17 80 45 93 -19 39 24 23 18 -58 93 -65
3851 -65 -67 -19 121 -11 -30 55 -101 -10 31 28 -82 36 21 60 -37 25 -28 -87 -72 -53 -25 12 8 50 25 25 -124 -56 4
3880 4 26 35 0 100 -21 63 -32 -4 -73 -42 7 -105 -72 -3 39 -19 31 93 58 13 2 -45 -84 -40 70 -8 16 6 -30
3909 -30 -20 107 -19 31 46 -37 -66 -51 55 7 -65 -36 -9 -127 2 25 17 -5 54 26 15 -40 17 -69 -79 27 54 9
3937 9 -25 2 -93 -53 41 -17 83 -16 5 -34 -19 -40 25 77 -20 32 21 125 -41 -164 83 122 17 5 -78 33 -51
3964 -51 87 -42 13 40 45 -30 -53 -78 61 54 -40 41 -73 9 6 -56 -14 106 44 -66 71 -20 17 -53 -68 -38 -43 19 0
3993 0 -85 -70 -94 10 64 -9 -55 -64 -5 47 -14 -58 26 -28 -100 73 -19 40 -44 26 8 36 -114 20 -30 51 41 29 56
4022 56 -26 55 25 0 -28 59 -44 87 57 -55 -34 25 -47 28 163 28 -136 34 -22 27 -126 25 96 -112 -16
4047 -16 -37 -70 20 -68 -26 67 -58 -1 -23 -23 57 -90 -1 -17 -79 25 -29 84 -52 34 193 -51 -36 -157 -34 29
4073 29 -153 42 -35 54 -69 35 -34 -30 0 -10 -122 -15 96 -38 23 -156 43 63 -8 -17 -3 -85 -68 60 20 -56
4099 -56 -70 71 29 2 -38 18 -74 -65 -72 -130 118 3 64 -15 7 -20 -27 -8 -80 -122 -26 32 24 -97 34 -42 16 -47 -68 6
4129 6 169 39 48 33 -29 -4 -111 -144 85 18 -85 41 4 11 -17 13 12 79 -12 31 85 -27 80 26 16 -81 12 -73
4157 -73 31 -119 62 -20 6 -52 -43 -5 2 -37 -44 -25 -4 -74 29 -7 30 -20 -15 -38 13 -43 111 -19 -127 19 28 45 -69
4186 -69 21 -22 -21 6 -103 106 56 -87 -26 -8 36 -109 7 -42 -55 -1 29 105 5 24 -46 -12 -27 -83 -83 28 26 17 50
4215 50 26 62 11 -95 -14 -63 9 62 9 -42 145 -54 24 -66 80 79 -23 70 -71 -61 -21 -79 8 77 -14 1 -75 -77
4243 -77 -41 72 -42 -21 89 -42 61 -88 -90 47 -33 -39 19 -52 -100 30 52 -19 -39 -49 -2 -7 23 -44 42 -63 -40
4270 -40 24 -35 23 36 -17 -64 -39 95 -46 39 38 -32 -33 78 81 4 -33 -89 100 58 0 16 -41 38 -49 64 -82 39
4298 39 -10 -48 -41 86 -58 46 -61 -20 -43 14 -56 65 55 45 3 -9 6 -26 -121 -6 6 4 -68 29 10 -85 84 107
4326 107 -3 -4 -25 -44 7 -64 53 9 -52 -15 57 -42 -4 -48 11 73 -42 82 65 3 11 5 -11 -28 29 -33 -47 40 48 27
4356 27 -22 -10 -20 -137 -60 -89 25 -20 20 -44 28 51 -21 -101 13 -22 44 -52 -37 -19 36 -12 -102 -39 31 45 -48 -81 34
4385 34 21 140 -77 -9 78 -89 15 -50 26 18 48 -50 38 -105 24 -21 -48 -93 28 -31 -35 64 -7 -41 50 -54 -66
4412 -66 13 -59 72 126 -85 -42 5 -14 -59 1 -72 -119 11 -20 -107 -80 -62 -46 -70 -44 -75 95 60 73 -29 -75 66
4439 66 19 -35 26 -14 -62 -15 64 54 -29 78 -59 -30 -127 -32 21 -114 -36 -21 39 -70 -23 -48 13 -5 21 13 -9 -27 -60
4468 -60 -34 14 76 -65 133 18 -53 13 -54 -24 -56 -23 -51 -31 -13 -2 137 -53 -45 -51 -24 9 156 -13 96 94 60 -39
4496 -39 27 -41 88 69 14 -7 -99 -17 76 14 -34 -20 86 45 23 -39 -76 16 -15 -10 -15 21 -17 -13 -2 85 -53 -75 24 -41
4526 -41 -88 38 -100 82 89 -45 -61 -10 -48 -13 -37 73 42 49 -81 -38 66 6 -27 31 40 -6 -78 25 -74 9 -12 65
4554 65 -25 48 -89 -7 21 11 -46 55 82 42 55 -81 27 6 -6 -1 0 -33 38 -43 11 31 2 21 113 12 -98 89
4582 89 -61 39 -70 92 -49 86 -39 -15 -127 -17 64 15 11 -231 79 -35 101 34 59 76 14 -52 10 -89
4606 -89 -61 -22 -16 -37 -14 49 48 -7 -27 -59 137 3 -7 -52 -22 71 82 96 -33 -36 42 -158 68 -16 -121 -57 -2 -12 -44
4635 -44 21 61 70 -33 -48 44 13 -88 -41 8 -56 -38 82 -7 -33 -90 77 32 60 -81 -29 25 18 -21 -31 34 -55 -88 -28
4664 -28 -12 29 -39 -63 21 -31 0 -18 -214 10 -15 39 26 -31 14 38 137 4 22 92 70 41 61 -150 25 82 -21
4691 -21 94 -40 -29 110 31 -26 -175 157 123 125 -91 -19 -25 29 157 -44 -29 23 -42 10 -32 116 -92 -91 18 -13
4717 -13 52 -106 77 -9 -22 -18 48 -41 101 -8 -30 74 24 39 -102 53 -131 -44 64 54 -63 6 15 -90 -8 -84
4743 -84 -29 12 -202 -23 69 28 60 -6 70 45 -5 -122 42 -10 -45 -20 19 -99 -69 -8 26 -12 -40 4 23 0 18 -105
4771 -105 -34 -119 43 56 11 92 -23 -14 94 -56 -101 17 25 -46 20 56 23 89 17 28 -32 44 -51 -33 -20 54 -40 -68
4799 -68 61 29 5 -39 108 78 -39 91 -19 -74 -24 6 -51 -3 3 -27 -65 30 46 -21 -25 8 77 1 -17 -60 -146 -35
4827 -35 1 141 -50 61 89 -35 73 10 8 -112 -48 -37 32 4 -62 112 16 9 -66 -25 -102 25 39 -3 -36 -39 90
4854 90 -18 64 96 20 7 -35 119 230 3 118 53 5 21 -6 16 -5 -75 -63 42 60 120 87 94 -24 70 132 43
4881 43 24 53 19 -88 97 -95 60 -46 -18 2 -51 -59 78 79 -76 -88 68 -20 36 162 -4 -97 -9 69 1 21
4907 21 24 9 -30 17 6 -87 30 -38 -54 -37 49 -143 -1 -19 -18 82 -40 -135 -13 14 -7 -12 43 17 -15 32 39 69 -49
4936 -49 -184 121 45 25 82 0 188 25 21 57 -19 -72 -9 16 47 -56 -49 -53 85 -84 -128 -60 96 -58 -33 -22 41
4963 41 -50 -58 -43 -24 66 -3 -32 0 -9 -14 125 -10 15 18 -38 -50 -13 36 51 -107 -18 -58 72 -3 46 -99 -11 0 45 63
4993 63 5 4 -54 -39 -29 54 41 -29 -25 9 -54 15 -94 -3 36 -64 -16 72 -15 -61 -17 34 46 49 -2 -16 -4 41 11 -44 -70
5024 -70 -25 141 106 91 45 54 47 20 -63 -68 -11 -6 33 -66 58 104 -39 31 -42 -14 -29 -77 87 -47 -59 -21 -18 49 -75 24
5054 24 69 -87 96 23 50 84 -67 51 115 -56 29 36 -7 -6 -57 -22 -33 99 68 4 -101 -57 -30 38 24 -88 -129
5081 -129 8 23 26 53 36 -36 -26 18 -39 111 11 -32 26 29 -142 7 -28 3 36 -7 107 60 -7 -11 38 -3 -122 22
5109 22 13 -31 -63 -15 -11 -21 21 32 82 -38 8 126 22 -20 14 -50 30 -35 23 18 82 -26 -54 12 24 87 36 30 4 32
5139 32 -30 -20 41 -58 38 10 78 8 -67 -11 -111 -11 -68 48 -40 24 57 55 15 -40 23 -39 -17 -132 -59 79 47 63
5167 63 64 52 50 -64 107 25 8 -4 45 108 -26 9 -103 -58 -22 -22 49 32 106 -104 -69 74 -125 -43 30 46 -21 -9
5195 -9 16 51 34 121 -6 -40 -62 132 64 42 -28 -54 -69 -58 18 -42 12 -6 0 -21 -39 -63 26 -51 132 -60 70 -39
5223 -39 -13 70 -8 46 -51 -142 70 92 39 -1 13 51 34 -111 0 95 78 59 32 107 131 -26 -22 41 -18 13 46 -37 -102
5252 -102 -10 -26 91 -67 37 -68 -50 125 20 75 39 15 17 7 -90 50 25 74 87 -2 49 -6 -44 -6 64 -29 -67
5279 -67 105 47 -1 -100 -46 106 29 -51 -3 105 146 -3 -22 33 -52 27 -69 95 27 -38 175 -16 45 7 -66 -58 60
5306 60 43 30 56 -76 71 -25 -15 56 13 -98 -47 -21 42 3 -133 29 31 -17 -45 27 -43 -80 -8 104 27 -44 102
5333 102 -6 94 -69 -9 -125 -49 -58 107 49 56 90 -89 141 6 -86 -17 19 39 -26 93 -13 5 25 97 -29
5358 -29 9 76 -57 28 -8 24 11 -91 -80 -34 -80 109 -23 -9 20 0 -160 5 42 -68 -30 19 9 -17 122 -32
5384 -32 -46 38 -20 0 116 -86 -92 2 -41 77 18 9 -66 62 71 11 23 -53 138 -64 51 -115 -11 -50 -3 -18 42
5411 42 37 50 -50 -41 84 -74 5 -34 -17 67 154 100 -134 1 93 72 14 -48 -62 47 11 38 122 13 4 -28 -35 25 50
5440 50 -28 -12 112 -83 126 -5 18 58 -27 -50 32 -57 10 -19 38 72 28 49 44 128 54 61 44 24 65 87 27 -84 -1
5469 -1 -1 87 67 20 0 -60 61 93 -7 -110 45 -38 56 -52 48 -121 114 -23 7 47 -83 -32 -38 -61 40 105
5495 105 200 4 10 54 48 23 -71 14 35 -55 -6 -25 -5 -59 -135 40 -106 57 -33 -150 -12 -68 -52 -105 17 -33 -96
5522 -96 -4 3 36 -101 -57 77 -37 52 30 28 -123 97 -67 -22 2 55 -47 70 80 -21 -24 -67 -126 -33 1 19 18 -33
5550 -33 -49 75 -20 -101 -85 -11 -100 -59 12 40 114 -21 -53 -45 -89 72 -2 47 40 -31 112 78 35 58 111 60 -47 -73 113
5579 113 -61 18 -4 50 -5 5 77 63 48 -110 19 -43 -61 6 50 -24 -49 -31 -16 73 -78 168 -39 27 2 -24 59
5606 59 7 -17 7 -51 -24 72 -30 36 -31 34 23 -70 -31 -17 -22 0 13 74 -69 -4 44 -5 -22 23 -27 -25 50 33 63 -3
5636 -3 -40 52 -69 -62 -56 138 94 -52 -71 10 37 21 25 -20 -11 82 44 63 41 81 -113 -98 -60 1 22 61 -53 107 29 21
5666 21 80 -9 -110 4 -84 -21 74 -1 -111 -83 47 29 -39 -27 -5 190 15 -7 -56 79 -51 -53 -56 -79 8 -43 -63
5693 -63 -32 18 108 -51 27 -24 2 61 4 65 51 13 -62 37 -16 -14 -83 95 16 -119 -58 -13 64 -67 14 -46 -30 -47 -32
5722 -32 44 -117 -129 -9 -9 -19 74 -24 150 -91 -107 -58 -81 -44 104 32 -37 -6 72 35 -93 -8 8 8 19 -122 4
5749 4 10 53 -42 19 85 51 2 -3 34 -91 -42 -13 92 -50 -8 19 29 5 -71 -79 21 82 -3 -128 21 6 62 -103 -51
5778 -51 -57 12 -24 85 41 284 -315 -17 135 -141 91 -15 -16 -35 42 6 -83 -36 -27 10 -3 104 31 -38 33 -65 28
5805 28 2 -51 -11 -23 53 29 45 -33 41 66 11 -15 46 5 126 73 22 -26 42 57 20 105 -27 -29 -2 -66 -44 -47 121 128
5835 128 -19 -5 81 69 -6 128 46 3 7 32 -36 99 -28 -123 61 -78 21 30 60 -54 -66 9 43 -23 22 -93 -65
5862 -65 23 -61 45 -64 25 -7 -12 -40 -4 -31 -6 17 -45 -5 -91 -122 -11 25 73 16 103 -15 -3 -19 102 -20 -17 25
5890 25 -8 43 -105 -19 -128 2 80 69 22 -48 -13 -47 -76 28 19 4 31 13 -19 103 -18 27 46 26 93 73 -98
5917 -98 -69 -41 -109 32 22 -13 67 15 -39 -33 -111 -23 126 69 -39 -77 -6 66 18 43 72 -4 -48 51 42 -3 -168 -105 -120
5946 -120 -74 20 -14 -22 6 49 -17 2 34 -42 -55 -41 99 2 -26 56 -37 -83 -132 53 -32 6 -22 -40 35 49 -13 -86 103
5975 103 29 -7 39 40 -33 -45 24 20 43 -66 44 -37 -95 -118 -65 72 3 31 15 29 -84 -106 -14 47 127 -16 77 117
6003 117 -15 -52 -13 50 -122 58 -30 39 85 39 -61 -28 73 -48 132 -43 115 -72 72 37 -60 -41 32 -24
6027 -24 -132 34 34 8 -68 43 -50 -25 -34 -60 -14 59 25 -25 41 125 49 57 -92 43 -7 6 37 15 -16 78 100 -15 -31
6056 -31 38 78 53 60 64 -176 -58 -26 -1 27 22 97 26 -59 81 84 7 64 31 -28 13 78 -5 -1 69 40 -17 -76 79 10 -14
6087 -14 -79 36 -22 -20 41 -90 -21 -10 31 40 -131 -19 -16 7 59 -44 20 -5 48 -115 -55 -83 71 86 -79 -13 -43 15
6115 15 18 100 -9 18 -30 -6 -23 34 -19 47 -6 24 -6 75 -59 -73 10 14 10 28 10 -124 57 31 60 -6 -20 99 -68
6144 -68 29 141 37 -30 -40 18 114 -17 16 3 22 -15 29 45 -47 -8 -97 58 -27 130 -6 -22 -94 37 3 -70 40
6171 40 -42 -99 -76 83 -75 -10 41 -18 36 -7 81 76 -34 48 4 26 4 60 73 -23 64 -90 17 66 -75 35 14
6198 14 -10 -59 -32 -127 84 -90 -5 23 33 -103 40 26 -16 -13 20 -14 -24 108 -28 -102 13 -22 -31 75 -103 -11 15
6225 15 -45 16 83 -4 56 -46 -129 -26 49 26 -6 -39 -16 47 42 25 11 46 4 12 -35 -20 6 -72 95 -62 -48 -46 16 34
6255 34 107 -81 -63 6 -135 -93 -104 -54 52 -8 -4 -93 11 -16 7 -42 -34 -45 -43 55 -69 -87 -45 -10 14 -20 -30 23 -92
6284 -92 37 -103 -42 54 -45 101 17 49 -4 -8 67 43 -23 121 22 -28 73 0 -31 58 -30 -52 86 -65 20 -85 84
6311 84 -5 -28 -25 -69 -79 -71 -79 -24 95 77 68 -25 -168 82 -10 41 21 -74 -7 -58 77 46 38 -45 -33 -32 43 20 -27 0 -20
6342 -20 109 -125 68 40 -10 -24 67 -16 -25 -56 -47 13 7 96 35 -103 -90 26 -22 47 -120 31 113 119 47 75 -40 2
6370 2 114 17 -11 1 6 40 63 -4 -5 -12 -85 -120 52 -31 83 -51 -56 40 -68 55 19 -76 -15 -14 61 -26 9 17 89 -54
6400 -54 11 -65 -40 36 -25 22 71 23 -9 -114 -142 47 65 30 -34 10 -19 -30 -67 59 -74 -29 -32 -39 33 -47 114 14
6428 14 -3 102 0 27 -7 61 -86 -48 15 -90 4 -144 22 -44 101 -86 16 55 -42 19 -70 70 -35 74
6452 74 -18 -66 -110 -45 5 -64 -48 -4 19 3 -17 -134 4 -68 -2 42 -49 16 26 11 -31 -48 77 48 12 -28 80 55
6480 55 28 37 41 -6 21 -30 -92 4 -70 12 63 80 59 -75 -32 3 9 30 -10 -27 -125 2 4 -60 62 -43 -8 18 -25 -25 -4
6511 -4 -43 -112 1 40 -37 -106 58 19 23 83 -89 40 -1 -19 7 79 77 4 -5 -53 64 -13 -129 -75 91 62 56 86 44
6540 44 4 38 2 35 -149 53 -7 -71 152 -83 29 48 106 -45 -2 68 -33 -32 -372 -256 89 352 103 101 54
6565 54 -230 -45 -650 -121 -149 67 67 98 19 4 -32 -8 128 3 -112 67 29 -62 67 -66 -17 8 -46 -17 41
6590 41 104 -130 45 -65 -38 -97 20 -24 2 -90 3 165 81 17 -94 13 -33 86 -10 73 -45 -13 72 4 -85 0
6616 0 -41 -61 -187 41 11 9 -98 57 123 -51 -53 -18 15 16 -21 -53 0 15 -30 50 82 -11 37 -86 -57 17 1 30 -2
6645 -2 6 -27 52 -20 69 19 36 46 39 -29 -15 -21 -36 63 -71 -5 135 -72 -97 82 65 18 -136 -23 12 -3 -119 -62 73
6674 73 -43 -158 -6 -59 19 -11 -87 35 58 -72 25 28 -24 -3 -76 115 -149 -51 -12 34 38 -35 -24 20 -27 12 -3 14
6702 14 59 -35 -75 -27 4 -33 11 -13 42 63 6 -69 -69 -98 -38 13 -34 -52 -110 -110 59 -81 126 -90 55 0 37 -21 -16
6731 -16 -34 -19 13 -83 76 -106 14 61 -74 -29 -78 -30 2 -45 -45 -21 67 -13 60 -33 -151 -118 -45 25 4 22 -65 -108
6759 -108 26 27 -54 -63 -8 35 31 54 113 64 -3 85 112 55 7 -55 -61 55 6 -34 -79 -59 -47 40 18 -42 65 -7 17 33
6789 33 -34 1 82 -125 -43 71 -49 53 60 -7 70 -21 10 -15 27 -13 -10 -32 -1 -57 73 -15 -9 -17 -26 -113 81 -45 34
6818 34 -21 26 -98 80 -95 75 -12 -60 -35 3 -6 36 178 -44 24 -161 38 -142 -122 -98 -82 -92 27 0 44 14
6844 14 12 18 -13 -34 116 -15 -65 -8 -6 -87 65 23 -192 60 -56 28 -58 -55 30 -39 -120 15 9 -102 -52 -21 -46 -8 102
6873 102 12 96 63 -66 -88 70 39 21 -31 41 -43 71 -43 -31 41 35 -14 35 -67 1 12 44 13 -90 36 42 -59
6900 -59 15 19 28 30 -74 27 85 32 66 -64 -88 40 20 -129 -6 -14 52 -32 18 4 6 24 -85 -82 181 28 6 -76 -56
6929 -56 -56 58 63 50 -24 77 -4 108 23 -20 40 -3 70 47 13 64 58 12 14 -90 -29 -47 53 13 49 77 -51 -53 149
6958 149 -34 8 24 49 36 6 -3 27 44 10 -20 -23 -77 0 -59 31 -17 18 -18 81 49 2 -57 73 -44 0 -29 7 50
6987 50 84 15 72 -48 -40 29 93 13 12 -75 64 -26 17 -35 -33 -1 124 52 45 -58 22 4 8 60 9 55 26 57 -60 102
7017 102 -38 42 55 -12 25 -61 -76 -174 104 -45 3 -55 -109 69 27 35 -10 -25 53 36 46 -14 -3 -3 -11 11 34 -62 -104
7046 -104 -2 94 -64 85 37 -8 26 23 22 70 -5 -36 -16 41 -39 49 43 -30 19 30 72 -2 -7 -69 122 118 37 -22 9 -1
7076 -1 -3 65 25 44 -80 46 -158 46 -22 43 171 3 -51 8 -7 24 -24 -42 -1 38 -33 -12 142 18 -36 18 -59
7103 -59 -45 65 -56 72 -84 32 -128 -52 63 14 1 -74 -84 12 -20 -34 -15 -1 -49 6 -9 63 -41 -129 102 24
7129 24 36 70 0 47 -35 -112 -60 -8 -16 91 -63 44 -32 -75 -52 -42 35 0 86 -67 12 -28 9 48 -131 -21 56 -22
7157 -22 -94 -53 50 -27 -23 -46 10 45 31 -26 58 -21 77 15 38 -25 88 -78 -42 -52 70 -49 -27 64 132 100 -122 -82
7185 -82 29 -29 -57 102 -15 -37 38 -92 31 -44 13 -3 39 -89 24 -55 41 66 56 -87 9 97 -84 17 -77
7210 -77 124 3 -58 -40 3 11 55 24 -26 87 72 -27 10 -74 25 63 -11 83 -122 -77 103 -77 -18 -81 -19 11 0 6
7238 6 -7 -20 24 58 -11 25 -128 31 -9 -125 28 -29 -11 -20 -9 -65 15 -90 11 -69 23 -13 -1 -5 11 -8 -13 -77 11
7267 11 -97 74 -59 -48 23 45 -11 52 -111 -8 3 -102 14 -46 -170 45 79 -49 23 10 99 -7 -20 -48 55
7292 55 17 0 35 -67 -3 -16 -31 20 -115 -41 71 -33 28 -65 -21 -41 69 43 36 -46 -39 9 -32 45 3 -95 34 -55
7320 -55 -11 -15 36 -133 7 27 -31 17 78 54 -17 104 130 -76 -41 54 -47 19 -37 5 72 -4 -73 8 21 -4 37 -114
7348 -114 1 -29 -61 -60 -8 75 -85 18 -44 -89 -17 51 2 -18 -130 -77 -19 3 -86 -139 -3 107 1 13 -15 66 43
7375 43 21 -52 42 -12 5 -40 -20 10 0 66 -14 -33 -29 -39 1 24 5 40 -16 51 58 -57 -54 -20 -87 24 -37 -97 -23 21 -93
7406 -93 10 129 55 27 -13 -92 48 23 -18 -95 -58 67 4 81 17 -45 57 18 -64 64 7 20 21 -34 12 -18 -3 80
7434 80 3 52 -104 115 79 -13 81 -12 -104 -48 -83 -91 -36 -12 44 74 -21 -41 63 -52 95 -12 30 100 -143 141 -68
7461 -68 34 52 -72 68 -57 138 42 -43 -61 11 24 -54 -56 -97 -16 70 -100 62 -70 -68 -44 47 -106 -8 37 76 37
7488 37 7 -131 -8 58 143 -61 12 -50 -12 -85 -59 35 -28 9 16 88 -52 22 -101 -72 -13 -9 39 13 70 1 -17 -42 28
7517 28 -1 -77 67 -8 22 58 32 18 -29 -25 1 -88 -86 16 -91 -10 30 -20 -19 -61 66 -23 55 18 -4 27 -44 142 -58
7546 -58 -17 -21 -71 27 143 36 -49 22 -43 -16 94 9 -6 -39 49 22 56 113 108 -40 -38 51 13 -45 -30 -100 -50 -78 46
7575 46 42 69 64 -89 -47 -78 -107 -85 35 -42 3 -11 17 9 41 13 57 -62 -2 23 -34 -6 15 28 71 -90 -47 -8 -55 -112
7605 -112 68 51 14 15 -17 -25 -45 -24 109 47 -24 69 12 25 -46 21 -26 -28 32 -70 -10 106 80 -49 20 -32 -59 101
7633 101 -3 -9 7 -82 39 -2 -34 59 111 -36 -19 -35 37 101 14 -27 -51 25 -92 11 22 21 27 15 -94 77 80 -115
7661 -115 -12 27 45 -65 -18 -11 37 -48 -21 -6 -97 58 -28 62 -23 -55 101 -60 5 -10 -35 -17 -84 2 -108 72 -29
7688 -29 61 15 -9 123 -9 -13 -82 -88 94 -33 38 -74 19 70 71 -54 -62 -109 33 28 97 45 61 -87 11 -3 68 56 11
7717 11 25 -29 -62 -106 -4 41 -43 91 150 -3 29 63 4 25 -13 -64 -81 37 -7 53 -20 16 12 -46 -58 -37 -49 -43 19
7746 19 -15 60 13 -44 55 83 -39 59 27 23 0 2 4 0 33 -22 -106 -92 -169 -15 -68 -9 1 33 115 1 67 -36 -15 95
7776 95 81 59 4 2 -51 -43 53 -95 40 -11 10 52 35 63 -2 75 106 27 72 -44 75 72 -45 160 -193 -1 111
7803 111 3 -83 -194 298 -353 -9 40 330 43 207 100 -68 168 -132 -418 146 12 -212 456 155 -527
7824 -527 -257 242 -166 -179 -807 -289 219 -76 41 6 41 -14 -42 44 2 -106 29 3 138 -6 128 64 -64
7847 -64 38 31 -59 15 -73 86 -65 -24 50 -6 66 -47 -56 -4 12 17 97 118 -122 -54 -75 20 12 -46 9 -23 -19 60 44 48 -37
7878 -37 -1 64 -63 30 -45 -25 42 -16 -23 6 -113 -1 -7 -3 49 94 -24 7 -62 74 31 22 -55 -72 35 -63 79 136 49
7907 49 -80 87 26 56 42 -35 58 44 -9 -68 4 121 28 21 67 48 -14 43 60 -19 89 82 -36 -4 21 -97 3 -9
7935 -9 39 13 119 2 -80 21 6 -4 10 -38 111 -65 -68 -30 -99 6 -92 77 -52 62 -116 33 58 53 117 61
7961 61 -17 -46 33 -63 35 21 64 51 -30 -24 18 -47 -28 -53 -61 6 120 -32 -73 71 38 54 -69 -14 34 -62 -71 3 42 -100
7991 -100 20 -16 -19 -31 0 51 7 -22 29 28 -8 10 -13 -68 -63 6 26 -40 -72 20 -70 66 -47 4 4 -19 82 96 -78
8020 -78 -1 45 40 6 -30 31 -36 56 -76 26 -81 -17 -77 -40 11 -28 -108 10 -4 33 -20 -5 6 85 -11 -63 -10 -85 27
8049 27 71 38 -14 -151 1 41 -90 27 -71 41 9 34 118 -123 72 -27 -5 -99 -10 -29 -40 -30 70 -95 -144 -14
8075 -14 -82 24 35 -38 85 -50 -18 42 15 -98 -38 -57 -17 55 12 -37 96 -88 -84 45 19 58 27 56 32 -8 -63
8102 -63 73 121 58 -95 -18 65 15 -22 152 61 -52 -36 104 27 -31 -27 -20 33 -13 -11 7 -49 31 -36 -25 101 -22 -31 -88
8131 -88 30 13 -53 -51 13 -23 54 50 -30 44 -98 -60 151 31 -71 -70 37 23 -88 -73 -3 45 18 -26 104 37 -38 -72
8159 -72 -10 46 44 -10 62 -19 -64 60 -74 -44 -65 31 18 97 28 20 -41 -3 15 132 -15 9 -75 49 8 29 -17 -115 37
8188 37 -10 -17 -45
8191d5
##END NTUPLES=NMR FID
##END=
