##TITLE=1H_DE-80H_X3
 200.13MHz, d2o
 8 sc
 
 19ns.26.2.2025
##JCAMPDX= 6.0         $$ Bruker NMR JCAMP-DX V2.0
##DATA TYPE= NMR FID
##DATA CLASS= NTUPLES
##ORIGIN= UXNMR, Bruker Analytische Messtechnik GmbH
##OWNER= pz
$$ XWIN-NMR		Version 3.5
$$ Tue Jun  2 16:38:05 2026 Russian Standard Time (UT+4h)  Yarkov@DPX200
##.OBSERVE FREQUENCY= 200.1313
##.OBSERVE NUCLEUS= ^1H
##.DELAY= (6, 6)
##.ACQUISITION MODE= SIMULTANEOUS
##.ACQUISITION SCHEME= undefined
##.AVERAGES= 8
##.DIGITISER RES= 18
##SPECTROMETER/DATA SYSTEM= spect
##.PULSE SEQUENCE= zg30
##.SOLVENT NAME= DMSO
##.SHIFT REFERENCE= (INTERNAL, DMSO, 0, 14.3821)
##AUDIT TRAIL= $$ (NUMBER, WHEN, WHO, WHERE, WHAT)
$$ ##TITLE= Audit trail, XWIN-NMR		Version 3.5
$$ ##JCAMPDX= 5.01
$$ ##ORIGIN= Bruker BioSpin GmbH
$$ ##OWNER= Yarkov
$$ C:/Bruker/XWIN-NMR/data/yarkov2/nmr/H-C/1/audita.txt
$$ ##AUDIT TRAIL=  $$ (NUMBER, WHEN, WHO, WHERE, WHAT)
(   1,<2026-06-02 16:37:11.06 +0400>,<Yarkov>,<DPX200>,
      <created by zg, POWCHK disabled, PULCHK disabled
       configuration hash MD5:
       00 E9 B6 7A A2 85 ED C7 34 08 36 98 17 FE 4E 26
       data hash MD5: 16K
       A0 5B 64 44 74 13 35 03 07 49 8B 75 A6 A6 84 26>)
$$ ##END=
$$ 
$$ hash MD5
$$ 25 D3 94 7A 23 12 72 F0 3D 5D 6C 5A 44 D5 46 35
##$RELAX= 
##$RELAX= 
##$RELAX= 
##$RELAX= 
##$RELAX= 
##$RELAX= 
$$ Bruker specific parameters
$$ --------------------------
##$DU= <C:/Bruker/XWIN-NMR>
##$EXPNO= 1
##$NAME= <H-C>
##$PROCNO= 1
##$TYPE= <nmr>
##$USER= <yarkov2>
##$AMP= (0..31)
100 100 100 100 100 100 100 100 100 100 100 100 100 100 100 100 100 100 
100 100 100 100 100 100 100 100 100 100 100 100 100 100 
##$AQSEQ= 0
##$AQ_mod= 1
##$AUNM= <au_zg>
##$AUTOPOS= <>
##$BF1= 200.13
##$BF2= 200.13
##$BF3= 200.13
##$BF4= 200.13
##$BF5= 200.13
##$BF6= 200.13
##$BF7= 200.13
##$BF8= 200.13
##$BYTORDA= 1
##$CFDGTYP= 0
##$CFRGTYP= 5
##$CHEMSTR= <none>
##$CNST= (0..31)
1 1 145 1 1 1 1 1 1 1 1 1 1 1 1 1 1 1 1 1 1 1 1 1 1 1 1 1 1 1 1 1 
##$CPDPRG= <>
##$CPDPRG1= <>
##$CPDPRG2= <>
##$CPDPRG3= <>
##$CPDPRG4= <mlev>
##$CPDPRG5= <mlev>
##$CPDPRG6= <mlev>
##$CPDPRG7= <mlev>
##$CPDPRG8= <mlev>
##$CPDPRGB= <>
##$CPDPRGT= <>
##$D= (0..31)
0 0.7 0 0 0 0 0 0 0 0 0 0.03 0 0 0 0 0 0 0 0 0 0 0 0 0 0 0 0 0 0 0 0 
##$DATE= 1780403830
##$DBL= (0..7)
120 120 120 120 120 120 120 120 
##$DBP= (0..7)
150 150 150 150 150 150 150 150 
##$DBP07= 0
##$DBPNAM0= <>
##$DBPNAM1= <>
##$DBPNAM2= <>
##$DBPNAM3= <>
##$DBPNAM4= <>
##$DBPNAM5= <>
##$DBPNAM6= <>
##$DBPNAM7= <>
##$DBPOAL= (0..7)
0.5 0.5 0.5 0.5 0.5 0.5 0.5 0.5 
##$DBPOFFS= (0..7)
0 0 0 0 0 0 0 0 
##$DE= 6
##$DECBNUC= <off>
##$DECIM= 32
##$DECNUC= <off>
##$DECSTAT= 4
##$DIGMOD= 1
##$DIGTYP= 9
##$DL= (0..7)
0 120 120 120 120 120 120 120 
##$DP= (0..7)
150 150 150 150 150 150 150 150 
##$DP07= 0
##$DPNAME0= <>
##$DPNAME1= <>
##$DPNAME2= <>
##$DPNAME3= <>
##$DPNAME4= <>
##$DPNAME5= <>
##$DPNAME6= <>
##$DPNAME7= <>
##$DPOAL= (0..7)
0.5 0.5 0.5 0.5 0.5 0.5 0.5 0.5 
##$DPOFFS= (0..7)
0 0 0 0 0 0 0 0 
##$DQDMODE= 0
##$DR= 18
##$DS= 0
$$ [...]
##$SUBNAM2= <"">
##$SUBNAM3= <"">
##$SUBNAM4= <"">
##$SUBNAM5= <"">
##$SUBNAM6= <"">
##$SUBNAM7= <"">
##$SUBNAM8= <"">
##$SUBNAM9= <"">
##$SW= 18.0517328524113
##$SWIBOX= (0..15)
0 0 2 0 0 0 0 0 0 0 0 0 0 0 0 0 
##$SW_h= 3612.71676300578
##$TD= 16384
##$TD0= 1
##$TE= 0
##$TE2= 300
##$TE3= 300
##$TEG= 300
##$TL= (0..7)
0 120 120 120 120 120 120 120 
##$TP= (0..7)
150 150 150 150 150 150 150 150 
##$TP07= 0
##$TPNAME0= <>
##$TPNAME1= <>
##$TPNAME2= <>
##$TPNAME3= <>
##$TPNAME4= <>
##$TPNAME5= <>
##$TPNAME6= <>
##$TPNAME7= <>
##$TPOAL= (0..7)
0.5 0.5 0.5 0.5 0.5 0.5 0.5 0.5 
##$TPOFFS= (0..7)
0 0 0 0 0 0 0 0 
##$TUNHIN= 0
##$TUNHOUT= 0
##$TUNXOUT= 0
##$USERA1= <user>
##$USERA2= <user>
##$USERA3= <user>
##$USERA4= <user>
##$USERA5= <user>
##$V9= 5
##$VALIST= <valist>
##$VCLIST= <CCCCCCCCCCCCCCC>
##$VD= 0
##$VDLIST= <DDDDDDDDDDDDDDD>
##$VPLIST= <PPPPPPPPPPPPPPP>
##$VTLIST= <TTTTTTTTTTTTTTT>
##$WBST= 1024
##$WBSW= 4
##$XGAIN= (0..3)
0 0 0 0 
##$XL= 0
##$YL= 0
##$YMAX_a= 241790
##$YMIN_a= -161837
##$ZGOPTNS= <>
##$ZL1= 120
##$ZL2= 120
##$ZL3= 120
##$ZL4= 120
##$ABSF1= 10
##$ABSF2= 0
##$ABSG= 5
##$ABSL= 3
##$ALPHA= 0
##$AQORDER= 0
##$ASSFAC= 0
##$ASSFACI= 0
##$ASSFACX= 0
##$ASSWID= 0
##$AUNMP= <proc_1d>
##$AZFE= 0.1
##$AZFW= 0.1
##$BCFW= 1
##$BC_mod= 2
##$BYTORDP= 1
##$COROFFS= 0
##$CY= 83.5205535888672
##$DATMOD= 1
##$DC= 2
##$DFILT= <>
##$DTYPP= 0
##$F1P= 10.8118882576601
##$F2P= -7.23987719738617
##$FCOR= 0.5
##$FTSIZE= 0
##$FT_mod= 4
##$GAMMA= 1
##$GB= 0.15
##$INTBC= 1
##$INTSCL= 1
##$ISEN= 128
##$LB= 0.25
##$LEV0= 0
##$LPBIN= 0
##$MAXI= 10000
##$MC2= 0
##$MEAN= 0
##$ME_mod= 0
##$MI= 1.114404
##$NCOEF= 0
##$NC_proc= 0
##$NLEV= 6
##$NOISF1= 3.799351
##$NOISF2= 2.8
##$NSP= 1
##$NTH_PI= 0
##$NZP= 0
##$OFFSET= 14.38212
##$PC= 1
##$PHC0= -6382.496
##$PHC1= 21.22195
##$PH_mod= 1
##$PKNL= yes
##$PPARMOD= 0
##$PSCAL= 0
##$PSIGN= 0
##$REVERSE= no
##$SF= 200.129724274929
##$SI= 16384
##$SIGF1= 3
##$SIGF2= 2
##$SINO= 400
##$SIOLD= 16384
##$SREGLST= <1H.CDCl3>
##$SSB= 0
##$STSI= 0
##$STSR= 0
##$SW_p= 3205.1282051282
##$SYMM= 0
##$S_DEV= 0
##$TDeff= 0
##$TDoff= 0
##$TI= <>
##$TILT= no
##$TM1= 0
##$TM2= 0
##$TOPLEV= 0
##$USERP1= <user>
##$USERP2= <user>
##$USERP3= <user>
##$USERP4= <user>
##$USERP5= <user>
##$WDW= 1
##$XDIM= 8192
##$YMAX_p= 0
##$YMIN_p= 0
$$ End of Bruker specific parameters
$$ ---------------------------------
##NTUPLES= NMR FID
##VAR_NAME=  TIME,          FID/REAL,        FID/IMAG
##SYMBOL=    X,             R,               I
##VAR_TYPE=  INDEPENDENT,   DEPENDENT,       DEPENDENT
##VAR_FORM=  AFFN,          ASDF,            ASDF
##VAR_DIM=   8192,          8192,            8192
##UNITS=     SECONDS,       ARBITRARY UNITS, ARBITRARY UNITS
##FACTOR=    0.0002768,     1,               1
##FIRST=     0,             0,               0
##LAST=      2.2672688,     0,               0
##MIN=       0,             -161837,         0
##MAX=       2.2672688,     241790,          0
$$ Real data points
##PAGE= N=1
##DATA TABLE= (X++(R..R)), XYDATA
0@%%%%%%%%%%%%%%%%Qj6J6j6J6j6K4l2L2l8M6n1N9p0Q1r2J05j19J34j51J71j94
$$ 0 0 0 0 0 0 0 0 0 0 0 0 0 0 0 0 0 8 -8 8 -8 8 -8 16 -16 16 -22 24 -27 32 -38 43 -49 56 -63 71 -80 91 -103
38a03K17k41K67k97L32l69M08m50M97n50O08o71P40q13Q94r87J089j204J334j482
$$ -103 114 -127 140 -157 175 -194 214 -236 261 -289 319 -352 388 -425 469 -518 571 -633 701 -781
58g81J651j847K081k361K705l140L712m503N673p624J1711l7074L7673l9954j29759
$$ -781 870 -977 1104 -1257 1448 -1692 2020 -2483 3190 -4434 7277 -29797 7876 -32078 -161837
73a61837J8496M7709o04l0588j1992K196L2312J2477l0013j3601N5211L5212k8537
$$ -161837 -143341 -95632 -96236 -126824 -138816 -136620 -104308 -91831 -121844 -135445 -80234 -45022 -73559
86g3559l0574P796K8301K0278k8915l6494J7447L8292o797k6128J7834N6511J0766
$$ -73559 -104133 -96337 -68036 -47758 -76673 -113167 -95720 -57428 -64225 -90353 -72519 -16008 -5242
99e242m4880q029N5667M1357j1735k7589J4701M6799K4315j3895k5831Q675L8660
$$ -5242 -50122 -58151 -2484 38873 27138 -451 14250 61049 85364 71469 45638 54313 92973
112I2973n220m7364k34M8031J3628m0616l8249J7974M6103j210m5394j3438L6615
$$ 92973 87753 40389 40155 88186 101814 61198 22949 40923 87026 85816 40422 26984 63599
125F3599K0683l0353k5104J6615J4412j6897k6112q647K0005J8471k4022m0884
$$ 63599 84282 53929 28825 45440 59852 42955 16843 8196 28201 46672 22650 -18234
137a8234n033K9043Q695l6696k8175K1693K3519k1172l1006Q600L1731l233l9021
$$ -18234 -23267 5776 14471 -22225 -50400 -28707 -5188 -26360 -57366 -48766 -17035 -20268 -59289
150e9289j3429K8532K4260j4481l1480N07L0105J0999j5486r539J0411J8451k14
$$ -59289 -72718 -44186 -19926 -34407 -65887 -65380 -35275 -24276 -39762 -49301 -38890 -20439 -20653
163b0653k0206k016L1576K2031k3514k9299K2356M0605p630l3073j261K7284J3896
$$ -20653 -40859 -42875 -11299 10732 -12782 -42081 -19725 20880 13250 -19823 -21084 6200 20096
176B0096j4417j1270J7688K1589n262k0133j147K6463J8326j5419k1910N015K3880
$$ 20096 5679 -5591 12097 33686 28424 8291 7144 33607 51933 36514 14604 19619 43499
189D3499Q971k1287j8231J3922J6052j3823k2971L864K3307k260l0935r282K2155
$$ 43499 52470 31183 12952 26874 42926 29103 6132 9996 33303 31043 108 -9174 12981
202A2981J4715j1622j9809j708J5560O587j1297j3479K897J4711m979k4778m369
$$ 12981 27696 16074 -3735 -5443 10117 16704 5407 -8072 -5175 9536 4557 -20221 -24590
215b4590K2034Q124k3639k3769J3193K7333o356k6946k760K0412Q128j5388q408
$$ -24590 -2556 5568 -18071 -41840 -28647 -1314 -7670 -34616 -37376 -16964 -8836 -24224 -32632
228c2632J6714J4177p969j2480R53J4904J0799r258j5556Q18J6478J0897j2089
$$ -32632 -15918 -1741 -9710 -22190 -21237 -6333 4466 -4792 -20348 -19530 -3052 7845 -4244
241d244j3284J1726J5514p989j4687O614K1707K829k0183n698J9788J4563q325
$$ -4244 -17528 -5802 9712 1723 -12964 -6350 15357 18186 -1997 -7695 12093 26656 18331
254A8331j6048J226J5253L066r593m752N915Q394l873j5723j988J6306O999j6173
$$ 18331 2283 3509 18762 21828 12235 7483 13398 21792 17919 2196 208 16514 23513 7340
268G340j6187R828K0597l926j8517k054J1777K925j1225p853Q444Q479p134j1418
$$ 7340 -8847 981 21578 17652 -865 -2919 8858 11783 558 -7295 1149 9628 2494 -8924
282h924j427R967P272q748j2862P8J0192N424q660r705P900J0275p858j1924N261
$$ -8924 -10351 -384 6888 -1860 -14722 -14644 -4452 972 -7688 -17393 -9493 782 -7076 -19000 -13739
297a3739J6034l28j7692l874J5347P944p128r386P74Q517K904m595j577M701O673
$$ -13739 2295 1967 -15725 -19599 -4252 3692 -3436 -12822 -12048 -3531 -627 -5222 -6799 -2098 4575
312D575j722r505J76J1902M971r556j0167O148J4689m4j1706q30R407K350q688
$$ 4575 2853 -6652 -6476 5426 10397 841 -9326 -3178 11511 11467 -239 -1069 8338 10688 2000
327B000n015Q903O936o130p685J588Q013O255n375r661J5P181L767o856o228N469
$$ 2000 -3015 5888 12824 6694 -991 597 8610 14865 9490 -171 -156 7025 10792 3936 -2292 3177
343C177N839o540p717L328Q873o33j1401m205Q897N576l698n692o89M152O76k855
$$ 3177 9016 2476 -5241 -1913 6960 6327 -5074 -9279 -382 5194 1496 -4196 -4885 -733 -57 -2912
359b912j338J701L167r55p408j251R131M010r065q905N213J0758k488q655J948
$$ -2912 -4250 -2549 618 -337 -7745 -8996 135 4145 -4920 -13825 -8612 2146 -342 -8997 -7049
374g049P736j02o201j399P260M189n170m352K272M689L453k062m982j933L325
$$ -7049 687 585 -5616 -7015 245 4434 -736 -5088 -2816 1873 5326 3264 -1718 -3651 -326
389c26M126j765n293K712O161l134o069K552Q311m5q932k778Q016M554k970l329
$$ -326 3800 2035 -3258 -546 5615 2481 -3588 -1036 7275 7230 -1702 -4480 3536 8090 5120 1791
405A791Q56K712j243l272J22K102J76k419l523Q92N569J751m869n352J629N938
$$ 1791 2647 5359 4116 844 966 3068 3244 825 -2698 -1806 3763 5514 645 -4707 -3078 2860
421B860l21n657Q09M678n70m219o58M421K066m556l190L86K305L053r40m245j161
$$ 2860 2539 -3118 -2309 2369 1799 -2420 -3078 1343 3409 -1147 -4337 -3951 -1646 1407 467 -3778 -4939
438d939K345K341j411k663K492L377k925l384L151N028o26o556k125N291K776
$$ -4939 -2594 -253 -1664 -4327 -1835 1542 -1383 -4767 -1616 3412 2786 -3770 -5895 -604 2172
453B172k193r67J211R47j442r63J724O70p18l27j416J0M354K697k921m584N35
$$ 2172 -21 -988 223 1170 -272 -1235 489 1159 441 114 -1302 -1292 3062 5759 2838 -1746 -1211
470a211M457k57l960Q17K975q27k650k98L362J620l428k800R27K557J650l83j649
$$ -1211 3246 2989 -971 -154 2821 1994 -656 -954 2408 4028 600 -2200 -1273 1284 2934 2551 902
487I02j039j3J198J65j701J13J698k086k312K113L274n87m386j114K768R56o10
$$ 902 -137 -150 1048 1213 -488 -375 1323 -763 -3075 -962 2312 1725 -2661 -3775 -1007 -51 -661
504f61k44L72K68n5q08J302J016p74j008j931l77L275J901k487l182P94L181m12
$$ -661 -905 -533 -265 -320 -1128 174 1190 416 -592 -2523 -2900 375 2276 -211 -3393 -2599 582 170
522A70k767J515K574j532j809J415K529P2k391o63Q10j62J169J788q45k062m91
$$ 170 -2597 -1082 1492 -40 -1849 -434 2095 2167 -224 -887 -77 -239 930 2718 1873 -189 -680
539f80J038P79j348o87J341o32j581J467L176K90l694j290L235N59k305L42J368
$$ -680 358 1137 -211 -898 443 -189 -1770 -303 2873 3163 -531 -1821 1414 1973 -332 10 1378
556A378l26j714k41J906P19r80p96r38p59J590J502p18j827l88J600Q83j213K67
$$ 1378 1052 -662 -903 1003 1722 742 -54 -992 -1751 -161 1341 623 -1204 -1592 8 891 -322 -55
574e5M90j092p85M38J445M82j355j034N22J73L15J036Q9q10r75Q27J260r14m12
$$ -55 435 -657 -1442 -1004 441 923 -432 -1466 -944 -771 -456 580 669 -141 -1116 -289 971 57 -355
593c55J006j294j712J578K545k87k440o99J648L46j086N97P32p71m79N07J821
$$ -355 651 -643 -2355 -777 1768 1481 -959 -1658 -10 336 -750 -153 579 -192 -671 -164 1657
610A657J16j271J18m3r28L40J347k07j405q79J118N45r02J54P32j281r00Q53J724
$$ 1657 1773 502 620 577 -351 -11 1336 1129 -276 -1155 -37 508 -394 -240 492 -789 -1689 -836 888
629H88P59j213o23O57J43j24M92k78r01n57M58J083l41q91M34m94j246J85J352
$$ 888 1647 434 -189 468 611 487 979 701 -200 -757 -299 784 443 -448 -14 -508 -1754 -1569 -217
648b17N16q51p62R98M88k18R86L2r79o94O85Q43J8o07m6n61p53P90Q31n98o66
$$ -217 299 -552 -1314 -316 172 -46 940 972 -7 -701 -16 827 845 238 192 -369 -1122 -332 499 -99 -765
669g65j43N43K34q2M88L62j103o58J029J072L30o58k0K41q26j99J046J10j539
$$ -765 -908 -365 -131 -213 275 637 -466 -1124 -95 977 1307 649 629 870 44 -155 891 1001 -538
688e38j004J133J137n65l81R41n26j617N71J613Q9j242l06J056L56o68P99L33
$$ -538 -1542 -409 728 163 -218 723 197 -1420 -849 764 853 -389 -695 361 717 49 848 1181
706A181q30j180J78J245J75q70k55M07n89k86Q85K03n33o91K58J056o6oJ87n01
$$ 1181 351 -829 -651 594 769 -101 -356 51 -538 -824 61 264 -269 -960 -702 354 288 282 469 -32
726c2n77L36P04K34l65l76M68n53L9P43q8p32o53K22Q13l3k47M96j26j242M20
$$ -32 -609 -273 431 665 300 -76 392 -161 -122 621 533 -199 -852 -630 183 150 -97 399 273 -969 -549
747e49R93J62p87k61N82J51m78P12P08j202p69K83R27K6m93Q5K75r25O8Q62K5
$$ -549 444 606 -181 -442 140 291 -187 525 1233 31 -738 -455 472 498 5 90 365 -560 -492 370 395
768C95n76q10M28P50Nj5L99k78p77J21O53K99n12m51M19j12k66P53L64p37q30
$$ 395 -181 -991 -563 187 192 177 576 298 -479 -358 295 594 82 -369 50 -62 -328 425 789 52 -778
789g78J83M83K1k41M26Q0r16M84O07J76m23l74M7K73l8M98K94p94l88L4N19J3
$$ -778 -595 -112 -91 -332 94 174 -742 -258 349 525 102 -272 -225 48 10 508 802 8 -380 -346 173 186
811A86j67k00J13k47p5N45J5k19j66k53K06K39L38N75n86o29L09K50K88m26l12
$$ 186 19 -181 -68 -315 -390 155 170 -49 -215 -468 -262 -23 315 890 304 -325 -16 234 522 96 -216
832b16K13j87O3O95R7j038k14J44M25m04l2Q59k8n43lP50o6m38l45K58J46j69
$$ -216 -3 -190 -127 568 665 -373 -587 -443 -18 -422 -454 405 377 -166 -169 581 515 77 -268 -10 136 -33
854c3L90M03m83r93K14N48J55m55o9L08r5k94M70O00m13m44r0N13j7l92O90j52
$$ -33 357 760 277 -716 -502 46 201 -254 -323 -15 -110 -404 66 666 253 -191 -281 232 215 -177 513 361
876C61n30k37L42N09l24m53N1k12J8M43L55m82l02J78K10PK53K35j60n37K37J67
$$ 361 -169 -406 -64 445 121 -332 -281 -493 -475 -32 323 -159 -461 -283 -73 -66 187 422 262 -275 -38 129
898A29K07l04k02n4k4j45L74O52m08n72P6K92L9j11j61K64j86q0N09M01n31k98
$$ 129 336 32 -170 -224 -248 -393 -19 633 225 -347 -271 21 60 -51 -212 52 -134 -214 295 696 165 -133
920a33o2M18k79n3J84Q0l85j02L41M01k70k14q9L4j72L44K87p2l07k6J18L3j62
$$ -133 -195 223 -56 -109 75 155 -230 -332 9 410 140 -74 -163 -129 -301 43 330 258 -49 -75 43 76 -86
943h6K18l5l43j57M92K29q1j64j9p6p5J5O06j93l43j02K25K3q3r4L3l74K64R2
$$ -86 132 97 -246 -403 89 318 237 73 54 -22 -97 -82 524 331 -12 -114 111 134 51 -43 -10 -384 -120 -28
967b8K06j08kn2j56J25OJ57Rl40Q4J97K57p7n04K35j67j80L10K05j84J54k48o6
$$ -28 178 70 68 16 -140 -15 -9 148 157 -183 -99 98 355 278 -226 9 -158 -338 -28 177 -7 147 -101 -167
991a67O0O9J54J30n49Q7M13J2o7j80M1N9n42L10M36l14k27%K43J45j20k6K60j07
$$ -167 -107 -38 116 246 -303 -216 197 209 142 -38 3 62 -480 -170 266 -48 -275 -275 -32 113 -7 -33 227 120
1015A20n43M39L82k54k25M9K04k25j40L59P5n88Q1K79K3J83l02kO5K8j53K59n2
$$ 120 -423 16 398 144 -81 -32 172 -53 -193 166 241 -347 -266 13 36 219 -83 -85 -20 8 -145 114 62
1038F2o4R4k33K02j09N6J41n06n0M23n6j5J54k5j1k77J39J43J3j45O1M9J05R1
$$ 62 -2 92 -141 61 -48 8 149 -357 -407 16 -40 -55 99 74 63 -214 -75 68 81 -64 -3 46 151 242
1062B42R3j86j31j75K46q1j04m3P4J6j32K0M11l9l73J04N9K33q5j71K15L3l44
$$ 242 335 149 18 -157 89 8 -96 -139 -65 -49 -181 -161 250 211 -162 -58 1 234 149 -22 193 226 -118
1085a18Q9r1L59k73r2J17J1k7m2K32j50m43N15k2j02J34m4R6j47o2K03L5k75j17
$$ -118 -29 -120 239 -34 -126 -9 2 -25 -67 165 15 -428 87 65 -37 97 53 149 2 -60 143 178 -97 -214
1109b14J29l6L17j33j7J76l92J11JJ87k4j34n3l5M1J26J01l16J2J38m4L14k00
$$ -214 -85 -121 196 63 46 222 -170 -59 -58 129 105 -29 -82 -117 -76 50 151 -165 -153 -15 -59 255 55
1132E5J21j84k3p3J14k0j20J07J49k67J61J45K2j42k26L21k6Nj84p4M4J10pJ69
$$ 55 176 -8 -31 -104 10 -10 -130 -23 126 -141 20 165 187 45 -181 140 114 119 -65 -139 -95 15 8 177
1156A77J46m63OJ02%j29R2L13k47p2o7J15J32j74J05m0j71J46M43j94l89N5R4
$$ 177 323 -140 -134 -32 -32 -161 -69 244 -3 -75 -142 -27 105 -69 36 -4 -175 -29 414 220 -169 -114 -20
1179b0J08j10K59l0m3j12N2qN3k36j06J57j60J08J60q9j13r2J47j5R5r5J14n0
$$ -20 88 -22 237 207 164 52 104 96 149 -87 -193 -36 -196 -88 72 -17 -130 -222 -75 -90 5 -90 24 -26
1203b6o5j1K65Jj93L9J6R0r1N1J7n1k57J63R6l5rj05j3L3P2J26n2k24O1K59j0
$$ -26 -91 -102 163 164 -29 10 26 116 25 76 93 42 -215 -52 44 9 0 -105 -118 -85 -13 113 61 -163 -102 157 147
1230A47j61j32J67J14j73J21L9j3p8n2lm0K0J20N0R2k95LK01k5j39j37J08l2j3
$$ 147 -14 -146 21 135 -38 83 122 109 31 -21 -24 -64 -44 76 126 218 -77 -74 127 102 -37 -174 -66 -98 -111
1255a11K03O8j48p2O4l5NL7N9J81m49N9L41j45r0r0N2L1R3l4J42p8p5Jm6R1o7
$$ -111 92 160 12 -60 4 -31 -26 11 70 251 -198 -139 202 57 -33 -123 -71 -40 53 19 161 83 8 9 -37 54 -13
1282a3J5rJ05k49R0P3j50J69p3J29k58J70P7n3l12K75J2p0J96j57r9L51k17J38
$$ -13 2 -7 98 -151 -61 12 -138 31 -42 87 -171 -1 76 23 -289 -14 -2 -72 124 -33 -132 219 2 140
1306A40k41J82m8n4N8J07k53J27om9J72j38Q6k70K27m4r4L5J76M8j38r7Q8j8o
$$ 140 -101 81 33 -21 37 144 -109 18 12 -37 135 -3 83 -187 40 -4 -98 -63 113 161 23 -74 14 -4 -10
1331a0j4k9j69J24n7K46o7L3O8k54Q4J4L3p3K23j25j27rJ38m0j46J20nK03j25
$$ -10 -24 -53 -222 -98 -155 91 24 57 125 -129 -45 -31 2 -71 152 27 -100 -109 29 -11 -157 -37 -42 161 36
1356C6q4Q9N2j13o8p1K43j77J24m4R3j69K6MJ40q6j5R6m9p0L5m1P4j89K44j91
$$ 36 -48 41 93 -20 -88 -159 84 -93 31 -13 80 -89 -63 -59 81 -5 -20 76 27 -43 -8 -49 25 -164 80 -111
1382a11K60j84j61J98n5J53k87K97j91J44K0r4J05j5j11j10J92j2k4J13J35k73
$$ -111 149 -35 -196 2 -53 100 -187 110 -81 63 83 -11 94 79 -32 -142 50 38 14 127 262 -11
1404a1p9N8P9k7Q5k4j02L3r0J16o9R7j44j2O6J58n8m8m2K8j9j4Q2N4k63J88p8
$$ -11 -90 -32 47 20 105 81 -21 12 -78 38 -31 66 -78 -90 -24 134 76 28 -14 14 -5 -19 63 117 -146 42 -36
1431c6m8mJ24k90J15K80j22J01k8j17K32j95J20k0j87m8K19k6j3l7k36J1J99J05
$$ -36 -84 -88 36 -254 -139 141 19 120 92 -25 207 12 132 112 -75 -123 96 70 57 20 -216 -205 -6 99
1455I9j15n4j3K23j75m4N1p8Q8j55R8P2kK3K3P8n8r7j70K09K9K6q4p4o9J28J89
$$ 99 -16 -70 -83 140 -35 -79 -28 -106 -18 -173 -75 -3 -5 18 41 119 61 -36 -206 3 32 58 -26 -100 -169 -41 148
1482A48j79J08m7j83K78j83K21r1j25L7q2J40o2j8J1p7L5L4k8M6J08mj4L8n6k4
$$ 148 -31 77 30 -153 125 -58 163 72 -53 -16 -98 42 -20 -38 -27 -104 -69 -35 -63 -17 91 87 73 111 55 31
1508C1j39M2N0j19Q9P5P5j48o4P7L0j37K36j56RJ05m6n4j69K94J3r4R2j69j28
$$ 31 -108 -66 -16 -135 -46 29 104 -44 -108 -31 -1 -138 98 -58 -49 56 10 -44 -213 81 94 0 92 -77 -205
1533b05Q3L17p5j15J0j16rP2N45q24N62k29K84o6l90J17q6J55N0k10J49n0ok8
$$ -205 -122 195 120 5 15 -101 -110 -38 507 -317 245 16 300 234 -156 -39 -125 30 80 -130 19 -31 -37 -65
1557f5N9J6M1q3K6J3J21j84j3J00p2J93k55J80q3M4j88K52k24J70j72J40l3l3
$$ -65 -6 10 51 -32 -6 7 128 -56 -69 31 -41 152 -103 77 -6 38 -150 102 -122 48 -124 16 -17 -50
1581e0j6J05L6J9j19N4P0J78l48K3J44j27J40j23K6q4L7o3K11o4O6l00J52J29
$$ -50 -66 39 75 94 -25 29 99 277 -71 -48 96 -31 109 -14 12 -72 -35 -98 113 49 115 -185 -33 96
1605I6L9j97J62K2k18L2J27J11j29K7j61J60M7O6j67k33K93l2n7o3p0J91m1K0
$$ 96 135 -62 100 122 -96 -64 63 174 45 72 -89 71 118 184 17 -216 77 45 -12 -75 -145 46 5 25
1629B5j22J32M9j03L2K4K7j91K16J3j54J88k3j87N4j2J66j77r0P5K7J20n4K0q1
$$ 25 -97 35 84 -19 13 37 64 -127 89 102 -52 136 113 -74 -20 -32 134 -43 -133 -58 -31 89 35 55 -26
1654b6N9n7P5j55J69j55n3K46m3j47O2J78o5j38o6n5M9Q3K2P5O5j78m8M6J03o
$$ -26 33 -24 51 -104 65 -90 -143 103 60 -87 -25 153 88 -50 -116 -171 -122 -39 -17 58 123 -55 -103 -57 46 40
1680D0k37P1J90rMjj79J75r7K5L0J73j33p8Q0R0j63j17P3N7q3J41j6j40J99j16
$$ 40 -197 -126 64 55 59 58 -121 54 -43 -18 12 185 52 -26 54 144 -19 -136 -63 -6 -89 52 36 -104 95 -21
1706b1LL3J7O6j78J01j33J33j3k40K58K0q5j9J56jj71R7j01J58kj60N0j10K10
$$ -21 -18 15 32 98 -80 21 -112 21 8 -232 26 46 -39 -58 98 97 -74 23 -78 80 78 -82 -32 -142 68
1731F8j63k1J73j01K43j58J69k36o3J22o5qJ61j63j8J40j18J49K7j85j48K93j96
$$ 68 -95 -116 57 -44 199 41 210 -26 -89 33 -32 -40 121 -42 -60 80 -38 111 138 -47 -195 98 -98
1754i8L7J32l7j43Q8l1J10k20J04PK48k48J26r3Q3j14J70j82M4O3J4q7oJ1j04
$$ -98 -61 71 34 -109 -21 -52 58 -162 -58 -51 197 -51 75 -18 65 -49 121 -61 -17 46 60 -27 -33 -22 -126
1779a26J57K9r1rP7j17J20l0P5j90J72j11j57L04l9j23R7J08k04O2q7j73L72Q0
$$ -126 31 60 -31 -40 37 -80 40 10 85 -105 67 -44 -201 103 64 -59 38 146 -58 4 -83 -256 116 196
1803A96l06J92j43K19j14l3J01j52m1k2K0J67M4j07J19j89kQ1j1j01R4j8J35k91
$$ 196 -110 82 -61 158 44 11 112 -40 -81 -103 -83 84 128 21 140 -49 -51 30 19 -82 12 -6 129 -162
1827a62J83Kk8p7j03J48O0o7M4P6j18n1j1M3N9l2k2J27j40pJ08K00l38J80k47
$$ -162 21 23 -5 -82 -185 -37 23 -44 0 76 -42 -93 -104 -61 -2 -34 -56 71 -69 -76 32 232 -106 74 -173
1852a73lM0K96j07j03J09L4j09r2J02J5N4rJ12k09J1O6n0j00K13j97K56p5ll8
$$ -173 -176 -136 160 53 -50 59 93 -16 -108 -6 9 63 54 166 -43 -32 34 -16 -116 97 -100 156 81 78 40
1877D0j93m8K84Lj20M9J22k46L7K51O3l17K61L7l9j31K96m52J23k98m92O10L50
$$ 40 -153 -201 83 86 -34 15 137 -109 -72 179 242 -75 186 223 184 53 349 -103 20 -278 -770 -160 190
1900A90K21l48K47l74K14K48n59L37l57k05R13n84rK11k47J30K62J75j034M56
$$ 190 411 63 310 -64 150 398 -161 176 -181 -386 527 -57 -66 145 -102 28 290 465 -569 -113
1920a13j21K29J8K41j10j43J42O3J17n44l5K06J48L83q82K09J75j53K03J07L2
$$ -113 -234 -5 13 254 144 1 143 206 323 -221 -256 -50 98 481 -401 -192 -17 -170 33 140 172
1941A72k67M30J21K24m30j64J36j07p5L0j03j02O6K07j24n3K05N21q06N7M62Q7
$$ 172 -95 335 456 680 250 86 222 115 40 70 -33 -135 -69 138 14 -39 166 687 -119 -62 400 487
1963D87n18O8L64n48O91l81m54J51k2j64M8j31O65l68K25k68j32L46K7J26L16
$$ 487 -31 37 401 -147 544 163 -291 -140 -162 -326 -278 -409 256 -112 113 -155 -287 59 86 212 528
1984E28l85k59K25j04J6M19k68k65K52k4Rk86l14R33j081M23M78m53q4J55j66
$$ 528 143 -116 109 5 21 440 172 -93 159 135 144 -142 -456 477 -604 -181 297 -156 -240 -85 -251
2005b51L06J0l05l0J45J47om47M47j43K26J93k55J42p7l12N9m9J88J03K3k31P7
$$ -251 55 65 -240 -270 -125 22 16 -431 16 -127 99 292 37 179 102 -210 -151 -200 -12 91 114 -117 -40
2028d0Q6p0p7L4J78J83l35L15k29k85K41k2K9k04K67k3M9j21J08j45J03K70l71
$$ -40 46 -24 -101 -67 111 294 -41 274 45 -240 1 -21 8 -196 71 48 97 -24 84 -61 42 312 -59
2051e9j04J53k8J11k22K65l27L28M1m0j56L0j70J31K60j56J16k03k7N4m1K10j26
$$ -59 -163 -10 -38 73 -149 116 -211 117 158 118 -38 -8 -178 -47 213 57 173 -30 -57 -3 -44 166 40
2074D0k12J08R6q1O4J09j59l8J93k68L04j28k3J09k02J58Mo9N4n3RQ3Ro7M8j4
$$ 40 -172 -64 32 -49 15 124 -35 -73 120 -148 156 28 5 114 -88 70 74 5 59 6 15 98 107 40 88 74
2100G4k31J60p4K28j83r0J19r9J11k4o7J89k06Q2M1N8mL4j95O4k6L8Q7j97J83
$$ 74 -157 3 -71 157 -26 -116 3 -96 15 -9 -76 113 -93 -11 30 88 84 118 -77 -13 -39 -1 86 -111 72
2125G2j91K60K2j20l8r4K77j83l1j7j32J66k6n2N3P9M7j21kJ19k5j72J51J61j72
$$ 72 -119 141 163 43 5 -89 188 5 -26 -43 -175 -9 -35 -87 -34 45 92 -29 -31 88 63 -109 42 203 31
2150C1j01k5L0R7n3K16j44k39L01m1q6l4p3J25r3k0J38O0j47O1k8J75j5M1k66
$$ 31 -70 -95 -65 32 -21 195 51 -188 113 72 -14 -48 -121 4 -89 -109 29 89 -58 3 -25 150 135 176 -90
2175i0L9R3K1K3j01R8j57J11J28k39j02R5n7O9J30m3k12K95j45Kj01J03m2j7N5
$$ -90 -51 42 63 86 -15 83 -74 37 165 -74 -176 -81 -138 -69 61 18 -194 101 -44 -42 -143 -40 -82 -99 -44
2200d4P7m9j14J75J37j81k2K3K0N6j08P9j16J44L0j86J29q4J71n1L9j34R8j9L2
$$ -44 33 -16 -130 45 182 1 -21 2 22 78 -30 49 -67 77 107 -79 50 -34 137 86 125 -9 89 70 102
2225A02j56oJ3m8O2J13k95P2P1J28j89K26K3j14J59j51RQO9j7r7M1K26j65o0m
$$ 102 -54 -60 -47 -95 -33 80 -215 -143 -72 56 -133 93 116 2 161 10 19 27 96 79 -18 23 249 84 24 20
2251B0j51J63p4o7J07J31m5Pm1m9jJ11p1j08k2K24l54K05k9J60Rj70Jm7J65Kn2
$$ 20 -131 32 -42 -109 -2 129 84 91 50 1 0 111 40 -68 -90 134 -220 -15 -44 116 125 -45 -44 -91 74 76 24
2278B4P3K1j67Q1KJ51j76J04j60O9N6o8P4P0p7NQ6qj58J26o4j97J18j7Q8o7J00
$$ 24 97 118 -49 32 34 185 9 113 -47 22 78 10 84 154 77 82 168 160 2 128 64 -133 -15 -32 56 -11 89
2305H9L4m1n1j13J04R7j66K23k24k5Q6K5Q4q5l6q7J84j23P6k9n2m1M2J13J1r5
$$ 89 123 82 31 -82 22 119 -47 176 -48 -73 13 38 122 37 1 -86 98 -25 51 22 -30 -71 -29 84 95 0
2331@l7nR7k2L7r0K46l06j39L07o2Op0R5O0k22j43K69qQj1R4J8j33J88k10L7j51
$$ 0 -37 -42 55 33 70 -20 226 -80 -219 88 26 32 -38 57 117 -105 -248 21 13 21 10 104 122 -11 177 -33 4 -147
2359a47j1J41j05K8O1NJ8j24J97j09j15K01o8K1N5L9o9Q1n8m0M0N1j64O5J11k00
$$ -147 -158 -17 -122 -94 -33 -28 -10 -134 63 -46 -161 40 -28 -7 48 87 18 99 41 1 41 92 -72 -7 104 -96
2385i6P6j33R9R8J1j05J5j07K97l23K65j30o0M70o00K65q7P8l64K89p5J08o58
$$ -96 -20 -153 -54 44 55 -50 -35 -142 155 -168 97 -33 -93 377 -223 42 -45 33 -331 -42 -117 -9 -667
2408f67k33Q41N2J67k64Q4k03j71P87q12J25M61K3J64o24n87Q57J59n13N46nj42
$$ -667 -900 -59 -7 160 -104 -20 -223 -394 393 -419 -294 167 190 354 -270 -857 0 159 -354 192 187 45
2430D5L32o73L02q6J08j36K42j83o6J33J12j34n6O0K0j8J6O6k21J23OM8J9Mj26
$$ 45 377 -296 6 -80 28 -108 134 -49 -115 18 130 -4 -60 0 20 2 18 84 -137 -14 -8 40 59 63 -63
2455f3J10q4P6o7J06o2K9JJ7j10J5M5N2n8j03J14J12j06p5O5K07j84lj06J51j5
$$ -63 47 -37 39 -28 78 16 45 46 63 -47 -32 13 65 7 -96 18 130 24 -51 14 221 37 34 -72 79 64
2481F4j30M7J21j31Q6j9j2j29J73j41J26k25J47R4l6M5j49J97j72n8K5J86j85
$$ 64 -66 -19 102 -29 57 38 26 -103 70 -71 55 -170 -23 71 35 80 -69 128 -44 -102 -77 109 -76
2504g6J07j1P5j19R2J7m8o5j31J75o2q1M3k4K72j20r1K9J56n6j22P2j07J13j77
$$ -76 31 20 95 -24 68 85 37 -28 -159 16 -46 -127 -84 -108 164 44 -47 -18 138 82 -40 32 -75 38 -139
2529a39K86j82J27L9L0j81J4m6J76j26Q9n6J45j45LJ43j85N9o3K3l0K6O7J10k05
$$ -139 147 -35 92 131 161 -20 -6 -52 124 -2 87 31 176 31 34 177 -8 51 -12 11 -19 7 74 184 -21
2554b1k7O2j03J48J17k44knl6O1K07k49K67j60j40J22n8K23k40J37j82K19j1r6
$$ -21 -48 14 -89 59 176 -68 -70 -75 -111 -50 157 -92 175 15 -125 -3 -61 162 -78 59 -123 96 85 -11
2578a1kl6n8l1J76N7k38J37j35k6N8OJ89p0j10J23Q4j05J09j87N7j30K58r5l2
$$ -11 -13 -49 -107 -138 38 95 -143 -6 -141 -167 -109 -103 86 16 -94 29 113 8 117 -70 -13 -143 115 20 -12
2603a2M5j17J88j83K53j22m5q4K3O3j10J12l5q0q6K44j08J03J4j03J25l8j06K30
$$ -12 33 -84 104 -79 174 52 7 -77 -54 9 -101 11 -24 -104 -190 54 -54 49 63 -40 85 47 -59 171
2627A71j73K3j21J48p4L9kJ5mmJ33k87J82N0Lm9n6m3R6j26J21J4j94RJ06k1o4
$$ 171 -2 21 -100 48 -26 13 11 26 22 18 151 -136 46 96 99 50 -6 -49 47 -79 42 56 -138 -129 -23 -44 -108
2654a08J82L6j01o9j7J65M4j1j03j1R3j42j2J17Ml7n6J1M9J39k82j5J85P8j27
$$ -108 74 110 9 -60 -77 88 132 121 18 7 100 -42 -54 63 67 30 -26 -15 34 173 -109 -124 61 139 12
2679A2J2Q3k4j19l3L1J22j28J46q1j82J28J4m5P5N4p5j03j0K2J10mo4J42j75K9
$$ 12 24 107 83 -36 -69 -38 84 -44 102 21 -161 -33 -19 -64 11 65 -10 -113 -123 -101 9 5 -59 83 -92 -63
2705f3J56j8l2n1Jn3kL4J54k7k59K03L6K2k47o5K72n8n3P0n8K0J35j66J0k44M34
$$ -63 93 75 43 -8 -7 -60 -62 -28 126 99 -160 43 79 101 -146 -211 61 3 -50 20 -38 -18 117 -49 -39 -283 151
2732A51j74k3O6q2j19J64J12o2N0r5J4J24j10l23K73j44j0J25N2O0N1j98L1J7
$$ 151 -23 -46 20 -62 -181 -17 95 33 83 -12 2 126 16 -307 -34 -178 -188 -63 -11 49 100 -98 -67 -50
2756e0J4K39j39r3PK1L2j5Q6k22K12j76N7O0q2P6j13J71j27j5j1R8p8kj2J00m0
$$ -50 -36 203 64 -29 -22 -1 31 16 102 -120 92 -84 -27 33 -49 27 -86 85 -42 -57 -68 30 -48 -50 -62 38 -2
2783bj4j61J20P1q0Q7M4j05Q3R1p6j36P5l5J00j08k7j3N3k21K45N2j82R1J52m8
$$ -2 -16 -177 -57 14 -66 21 65 -40 43 134 58 -78 -3 -38 62 -46 -73 -86 -33 -254 -9 43 -139 -48 104 56
2809E6M8j18m3Q7j25K47j96K7q8J50j12J04j32K2O2J74j11J9l3L7k2j0q2k1J22
$$ 56 104 -14 -57 30 -95 152 -44 -17 -105 45 -67 37 -95 -73 -11 163 52 71 38 75 53 43 -39 -60 62
2834F2k9k34K60Jp8J25k5j17J50j41J95k24J45j69Q4jm5j41J30O7j62J19j05K74
$$ 62 33 -201 59 60 -18 107 82 -35 115 -26 169 -55 90 -79 5 4 -41 -182 -52 15 -147 -28 -133 141
2858A41j41P2o7q1r8J58J90j33L2k25L71K1o3j26K4m4j01O7Q0j40R8P7k60K13
$$ 141 0 72 5 -76 -174 -16 174 41 73 -152 219 240 177 51 75 31 -70 -3 77 -63 35 112 -148 65
2882F5l1r6N7j9k4mJ47rn6r4J92r7j99N5n1J97k9J1p5j10O5J7J99q1k5l6J78j69
$$ 65 34 -62 -5 -24 -48 -52 95 86 30 -64 128 31 -168 -113 -164 33 4 15 -60 -170 -105 -88 111 30 5 -31 147 -22
2910b2j03J04j1l5J8O8L2o9L6K0j8r0M1J63n4l7Q4l0o7L6j11M0J2j2p6O1N0j03
$$ -22 -125 -21 -32 -67 -49 19 51 -18 18 38 20 -70 -29 134 80 43 127 97 30 66 -45 -5 7 -5 -81 -20 30 -73
2938g3j0K24k04J02J8m4j7r9J33j55J12L44l34J3Q5N7l9J5j62O9q6J46r2j24J40
$$ -73 -83 141 -63 39 57 13 -4 -103 30 -125 -13 331 -3 10 95 152 113 128 -34 35 -51 95 3 -121 19
2963A9J48j85m3N1R4j3j6j67K8k9K34j90K9lJ55m4q2j60M6K56m5j88K78p8o4j39
$$ 19 167 -18 -61 -10 84 71 55 -112 -84 -113 121 -69 -40 -43 112 68 -14 -174 -128 128 83 -105 173 95 31 -108
2989a08l1n0K41k14M46j43k44Q7J80m29K22ML50n15K66N93j089Q6J20M79l47K17
$$ -108 -139 -189 52 -162 284 141 -103 -16 164 -265 -43 -39 311 -204 62 655 -434 -348 -228 251 -96 121
3011A21l71J55N91n70j1j28n03K88Q20p44L49k28J45P7j49R7j50M01l11K84Q1
$$ 121 -250 -95 496 -74 -85 -213 -716 -428 392 -352 -3 -231 -86 -9 -158 -61 -211 190 -121 163 244
3032B44m59O9J50o0J36j73K59k64K41r7j0O0q5o3K06j91J82j25P0m3Q5k55p2M08
$$ 244 -215 -146 4 -56 80 -93 166 -98 143 46 36 96 11 -52 154 -37 145 20 90 47 132 -123 -195 213
3056B13k40JJ6k4n3J10K40k67k3J30k5k8j55J08Pr4N5r4J95j65J65j0q3L9r3K03
$$ 213 -27 -26 -10 -34 -87 23 263 -4 -27 103 78 50 -105 3 10 -84 -29 -123 72 -93 72 62 -21 18 -75 128
3082A28K6k42O4J80k54J33m9k8J4J66P1j56j0l1J22k53K2JK20j19j18J73j06j6
$$ 128 154 -88 -24 156 -98 35 -14 -42 -28 138 209 53 43 12 134 -119 -97 -96 124 5 -113 60 -46 -62
3106f2K75p7q7n1j31R3P4k05J34L9J51j56M0k7M7q3l9O8Lm7m0K9mk08K50l4K42
$$ -62 213 136 49 -2 -133 -40 34 -171 -37 2 153 -3 37 10 57 -26 -65 3 6 -41 -81 -52 -56 -264 -14 -48 194
3133A94l9j5lj12j20M2J32k0J45l39mK38j78J95k86J29N7R0j14Q9j49K81J0j88
$$ 194 155 140 137 25 -95 -53 79 59 204 -135 -139 99 -79 116 -170 -41 16 106 -8 81 -68 213 223 35
3157C5J08Mk09R2Q9k03o3j28J03J98M3Q7j39%j23M1Q3l1m8Q3k6p3J17J11k14l6
$$ 35 143 147 -62 30 119 -84 -147 -275 -172 26 69 156 17 17 -106 -65 18 -13 -61 22 -4 -77 40 151 -63 -99
3183i9MJ05l3Q5q0k4J96k88J49o9L7N4j42L0K38p4o1p4m0J31n7p0Q7l6MJ03j34
$$ -99 -95 10 -23 62 -18 -42 154 -134 15 -54 -17 37 -105 -75 163 89 28 -46 -86 45 -12 -82 5 -31 -27 76 -58
3210e8J17o3J05j5p6L3k6k21K13q1J69j62P6P8r5j66J77RMJ06j68J15l5R3k18
$$ -58 59 -4 101 86 10 43 17 -204 9 -72 97 -65 11 89 -6 -172 5 14 18 124 -44 71 36 129 -89
3235h9P5Q6k5j26J12j54J89rn2L0J12j65L9o4n9J43l1r3P0o6L9J05J6j74Q6p1
$$ -89 -14 72 47 -79 33 -121 68 59 7 37 149 -16 23 -41 -100 43 12 -81 -11 -77 -38 67 83 -91 -5 -76
3261g6M4K3J2K9k1l0l7L0j02K22j19r3O7J2r6J43m9n7R0Q4J9j30N7L1J6k25J85
$$ -76 -32 -9 3 32 11 -19 -56 -26 -128 94 -25 -118 -51 -39 -135 8 -41 -98 -8 76 95 -35 22 53 69 -156 29
3288B9o6OJ15j05k19J84J86k78N5Q9M8P6j55QN1q1J68j37R8j14J64L11l47n9l5
$$ 29 -37 -31 84 -21 -240 -56 130 -148 -93 -4 44 120 -35 -27 24 -57 111 -26 72 -42 122 433 86 27 -8
3313hl2J08k29K08p3m4K0R0k63K9K09l8Q1j22J97j82J2M7p9k2J33K5j08Q0Q2K0
$$ -8 -40 68 -161 47 -26 -70 -50 40 -223 -194 15 -23 58 -64 133 -49 -37 10 -69 -91 42 67 -41 39 121 141
3339A41p2n2M9k4n6o7J02J44o9j30p7lP5K0J85j24j2O6Lj35pO8j79J23L5J29j59
$$ 141 69 17 66 42 -14 -81 21 165 96 -34 -111 -114 -39 -19 166 42 30 96 99 -36 -43 25 -154 -31 4 133 -26
3366b6o3J06j65J13l7O9J2j00J24rkj18R5Q7j65P5K29k38k6O0j86J31J87j40j38
$$ -26 -89 17 -148 -35 -72 -3 9 -91 33 24 22 -96 -1 86 -79 -4 225 -13 -39 21 -165 -34 153 13 -125
3391a25N1R4L4P8p1J7j35J18j14K1J89j31p1m6J59l1J4j59P1j5N8L7p3N0j64L10
$$ -125 -74 20 54 132 61 78 -57 61 -53 -32 157 26 -45 -91 68 37 51 -108 -37 -52 6 43 -30 20 -144 166
3417A66k48j10K13o8J27R0mk87M2K20j15q9N7K7J48j68p0L4m5R7N3L5n3j52J26
$$ 166 -82 -192 21 -47 80 170 166 -121 -79 141 26 -63 -6 21 169 1 -69 -35 -80 17 70 105 52 -100 26
3442B6j77N5J83p7j49K37k23n4K84j7L1j53K3K4J87j18N1l15K07j05K07r5kM5
$$ 26 -151 -96 87 10 -139 98 -125 -179 105 88 119 -34 -11 13 200 82 133 -182 25 -80 127 32 30 75
3466G5MMq4k11L39k81J04j7J46nJ3j25r1P6l7O7j71L37j95o0PJ90l21K38J8j11
$$ 75 79 83 -1 -212 127 -154 -50 -67 79 74 87 -38 -129 -53 -90 -23 -194 143 -52 -112 -105 85 -236 2 20 -91
3492i1J11p0N2j71J76M8j3l0j55J52q4J48m4l9J25k9L9j20kJ77k40j63K07J5J43
$$ -91 20 -50 2 -169 7 55 42 12 -143 9 -75 73 29 -10 115 86 125 5 3 180 -60 -223 -16 -1 142
3517A42j83q3J00k7j13N4O2m4J48j36K12k22J36j00j00L05j30m2k0J44q2j39J94
$$ 142 -41 -124 -24 -51 -164 -110 -48 -92 56 -80 132 -90 46 -54 -154 151 21 -21 -41 103 21 -118 76
3540G6j31j5j5Q2q7J56Q5j71J38r7j21J52k2J74k09o1N3Q4m2L0m5q6k3Q7O0r1
$$ 76 -55 -70 -85 -3 -90 66 151 -20 118 21 -100 52 30 204 -5 -66 -13 71 29 59 14 -72 -95 -8 52 -39
3566c9m3R9J27L0j68J0k11K87j3j11J14j56K16q0q5m0R6j72J19KP8k64J69Q2p0
$$ -39 -82 17 144 174 6 16 -195 92 79 -32 82 -74 142 62 -23 -63 33 -139 -20 -18 60 -204 -35 47 -23
3591b3P3k6j28Q0P0r0l0J53j31P2Nl1Mk3m7R5N9o7m2m2J65j64J00o5L0q0J51o5
$$ -23 50 24 -104 -24 46 -44 -74 79 -52 20 25 -6 -2 -25 -72 23 82 15 -27 -69 96 -68 32 -33 -3 -83 68 3
3619CLl0o2J69q6P6j02R1j64Q4P8l6P6j63p1K11j05N4j9r3O8%M6j85q0J40K57
$$ 3 6 -24 -86 83 -3 73 -29 62 -102 -18 60 24 100 -63 -134 77 -28 26 7 -86 -18 -18 28 -157 -237 -97 160
3646A60q1j80O2J49r2n4j6q1J69j5K22j75J7o5j26J94m6N5Kj24j77J67J96j97
$$ 160 79 -101 -39 110 18 -36 -52 -133 36 21 243 68 85 20 -106 88 42 97 99 -25 -202 -35 161 -36
3670c6L5J04j1k2n7K0J7j39O3J13k1j12m1q7J78p0J28M7l5q0N5q9l4l2P3J37j32
$$ -36 -1 103 92 70 13 33 50 -89 -26 87 66 -46 -87 -174 4 -66 62 109 74 -6 49 -40 -74 -106 -33 104 -28
3697b8R9n9j59J47j56O5R6j27m0L7J18q0j1M0m4J41j51J17L1Lrq5K8O6k32K29
$$ -28 71 12 -147 0 -156 -91 5 -122 -162 -125 -7 -87 -98 -58 -102 39 -112 5 36 39 30 -55 -27 39 -193 36
3723C6j13J08J05j69j9L0l7K5k2m1O4q1K08j45L23l12L9l1J55q1nr6J71rp2q0
$$ 36 -77 31 136 -33 -52 -22 -59 -34 -56 -97 -33 -114 94 -51 272 -40 -1 -32 123 42 37 -59 112 103 31 -49
3749d9o1J07j5m5M3q1M6M2n8Q2o7N3R7j79M3N0k8J40l8k23N4q9J20N7n1j32L24
$$ -49 -110 -3 -18 -63 -20 -101 -55 -13 -71 11 -56 -3 94 -85 -42 8 -20 120 82 -141 -87 -176 -56 1 -50 -182 142
3776A42k07L7j0J93j69j47J1L5J11J02r6J35k63K0K70j24m5l6O3j12L7N6R5j64
$$ 142 -65 -28 -38 155 -14 -161 -150 -115 -4 98 2 137 -126 -106 164 40 -5 -41 22 -90 -53 3 98 -66
3800f6J59j70J26k5m3l9J0l0K09j8j36l9L5k56L12r7P4j7j12N7J97j66J28j71
$$ -66 93 -77 49 24 -19 -58 -48 -78 131 113 -23 -62 -27 -283 29 -68 6 -11 -123 -66 131 -35 93 -78
3824g8K47q2k71J90Q9Q6m64j91M26k15K87O25m80j65k41L70j00k69K13mm4J57
$$ -78 169 87 -184 6 95 181 -283 -474 -48 -263 24 649 169 4 -237 133 33 -236 -23 -27 -71 86
3846H6j61j15L96j18j59J60J5j57J20j47K25q5l2NJP3j30J57j95L8j5P4j7Kj38
$$ 86 -75 -190 206 88 -71 89 104 -53 67 -80 145 60 28 33 34 107 -23 134 -61 -23 -38 36 19 21 -117
3871a17J33j53K20r8l4o2J54K8l3q1J79j16Pp7KP2j24PK27M1k64N1M9j1Rn8O8
$$ -117 16 -137 83 -15 -49 -111 43 71 38 -43 136 20 27 -50 -48 24 -100 -93 134 175 -89 -38 11 0 9 -49 19
3898A9j02J30J62k41P0k6n9J34q2L9J8J9j3k5O8O3k21M5nm2J38j03P2J9j79K65
$$ 19 -83 47 209 -32 38 12 -47 87 5 44 62 81 68 43 111 174 -47 -2 -7 -49 89 -14 58 77 -102 163
3924A63k23R7J01k36J41jO8k25K15l7lq6J2N3P7j23r3K9oJ61j74O1J04j04j6j2
$$ 163 -60 37 138 -98 43 42 110 -115 100 63 60 -26 -14 39 116 -7 -100 -71 -77 84 -90 -29 75 -29 -45 -57
3950e7J61r2r5J71k14M0p1J58J8j02J27k22K60q0j04O8J90k09J34Q3l94o0K77
$$ -57 104 12 -83 88 -126 -86 -157 1 19 -83 44 -178 82 2 -102 -34 156 -53 81 164 -230 -290 -13
3973a3r5J71l48M11J14j13o0k36K50k02P3l5O1Q4k30K79j80q6K99m34J94j69J61
$$ -13 -108 63 -285 126 240 127 67 -169 81 -121 -48 -83 -22 62 -168 111 -69 -155 144 -290 -96 -265 -104
3996a04r1M6K08J39j72m91K14L78r8j77k13L13Q6j66J68p8k55N41ql09mk33M31
$$ -104 -195 -149 59 198 26 -465 -251 127 29 -148 -361 -48 38 -128 40 -38 -293 248 240 -69 -73 -306 125
4019A25m6K3p3P2n9N8O2J41q23O90K11m44Q5k19J40oN8M16j43m91J25k41N19q3
$$ 125 79 102 29 101 42 100 162 303 -520 170 381 -63 22 -197 -57 -63 -5 411 268 -223 -98 -339 180 97
4043I7m55O32o10L78j47K33P3n47M07l1k17l4j7N64k96k12k66L53K2L26j14j44
$$ 97 -358 274 -336 42 -105 128 201 -346 61 30 -187 -221 -238 326 30 -182 -448 -95 -73 253 139 -5
4065eJL2j24J33j04J26j80R4j5L4J94j45r5O1R4k08J40l8P3r1L1N3o8q4P2k01
$$ -5 -4 28 -96 37 -67 59 -121 -27 -42 -8 186 41 -54 7 101 -107 33 -5 68 -23 8 61 -7 -91 -19 -220
4091b20L31o3k07J16K94n57K91j04J82k6m2o4J2LL2M3k7J7RJ5M1q7o5L01j74l3
$$ -220 111 48 -159 -43 251 -306 -15 -119 63 37 -5 -69 -57 -54 -22 21 -6 11 20 35 76 -11 -76 225 51 18
4117A8j48K09L5j14n4R3J4j87k8L29k58M1O7Nm1KJ72l6L9j21n6J43j35J45l4r9
$$ 18 -130 79 114 0 -54 39 53 -134 -162 167 -91 -50 17 22 -19 -17 155 119 158 37 -19 124 -11 134 100 1
4143AJ0n3J7J43k48N3J01J28j68j4j2M3p6J15j51J67j0l4r8P0N3J77k98N8Q3p8
$$ 1 11 -42 -25 118 -130 -77 24 152 -16 -30 -42 1 -75 40 -111 56 46 12 -86 -16 37 214 -84 -26 57 -21
4169b1P9k52K19L4j3O8np3O9m7n6n5K49k17J07RM7j51l6O2j0q9Q1J2j54J12j7
$$ -21 58 -194 25 59 46 114 109 36 105 58 2 -53 196 -21 86 95 142 -9 -45 17 7 -82 -1 11 -143 -31 -48
4196d8m9J64p1j57J31J8N9j14J5J45k08J53J12n1j68J04Q0j46j4%J6lL6r2J33
$$ -48 -97 67 -4 -161 -30 -12 47 -67 -52 93 -115 38 150 99 -69 35 115 -31 -45 -45 -29 -32 4 -88 45
4221D5j56J28K9J32k84M8J58j76Q7l0M5m6Rp9J51M3j8j41J17l2N2r9O9n9p7J18
$$ 45 -111 17 46 178 -106 -58 100 -76 11 -19 26 -20 -11 -90 61 104 86 -55 62 30 82 -17 52 -7 -84 34
4247C4j19J85j9k82K48J29j83K7k48J61J79n7K5j58P9j39J81j59P8J14q5nJ46
$$ 34 -85 100 81 -201 47 176 -7 20 -228 -67 112 55 80 -78 1 -138 43 -116 -38 76 -9 -14 132
4270A32q9J06J01k44k29M4J97o1Q0M2k02j0M6rJ03P3k3M2j12J1R6l22J88J06j05
$$ 132 43 149 250 6 -223 -179 18 -43 37 79 -123 -133 -87 -96 7 80 57 99 -13 -2 94 -228 -40 66 -39
4295c9M9o9k9J23j27O3MJ18p1j07R9J45j03o3n2N5J21j1j74J92p3q0q0P5K27k29
$$ -39 10 -59 -88 35 -92 -29 -25 93 22 -85 14 159 56 -7 -59 -4 117 106 -68 124 51 -29 -109 -34 193 -36
4321c6J13l2m9R8r1j78O5J39p4K6p7LQ6p9N3K60k58J17j96J83j58J06q1J0J26
$$ -36 77 45 -4 94 3 -175 -110 29 -45 -19 -96 -93 -7 -86 -33 227 -31 86 -110 73 -85 21 -60 -50 76
4346G6m6j16J34L1j30J84j63J47l37K32K26j25j80j17K42j44K86k55K04o2j13
$$ 76 30 -86 48 79 -51 133 -30 117 -220 12 238 113 -67 -184 58 -86 200 -55 149 87 -26
4367b6J62k44JO6j16J2J36N7kLp6lr9J36j81J4N19n07K40J4q2p0L8M8n0j64J57
$$ -26 136 -108 -107 -41 -157 -145 -9 48 46 49 -27 -30 -129 7 -174 -160 359 -148 92 106 24 -46 -8 40 -10 -174 -17
4394a7m2M1P1k1m0K3q4K77k53n0P5K05j82m2M0k9J56p3o9j37L00o3l23J66l4Q6
$$ -17 -59 -18 53 32 -8 15 -69 208 -45 -95 -20 185 3 -39 1 -28 128 55 -14 -151 149 86 -237 -71 -105 -19
4420a9k1j5j0J77j78J33op3O2l05K54p9J66k27J23oK26k38k8R2o6L9K7J31j36
$$ -19 -40 -55 -65 112 -66 67 61 -12 50 -255 -1 -80 86 -141 -18 -24 202 -36 -64 28 -38 1 28 159 23
4445B3p9j0p6L19K6n7m3J31j89j5k37K64J04k98q4N06n55J80M80o17N11m8k12
$$ 23 -56 -66 -142 177 203 146 103 234 45 30 -207 57 161 -137 -221 285 -270 -90 390 -227 284 236 24
4468B4j90L29m87L84k07P38K67j715R31q3J47l18K89M90o13O3L89n97J95l7L44
$$ 24 -166 163 -324 60 -147 591 858 -857 74 -9 138 -180 109 599 -14 49 438 -159 36 -1 343
4489C43l7n77J05M02J16q4Nk64M98o21m93P20j16l32M46l8K69n05M30n26K98L8
$$ 343 306 -271 -166 236 352 268 273 9 507 -114 -607 113 -3 -335 111 73 342 -163 267 -259 39 77
4511G7K15n96K63k7R1O1p2J58o7K8J23k57L9j85K29J61k16k41J44J92l65M91K70
$$ 77 292 -304 -41 -68 23 84 12 170 103 131 254 -3 36 -149 80 241 25 -216 -72 120 -245 246 516
4534E16j21p42L25j85N55j35J39J22j16p4q28L76O25o54P02n03l12K05M4k55M80
$$ 516 395 -347 -22 -207 348 213 352 474 358 284 -544 -168 457 -197 505 2 -310 -105 -61 -316 164
4555A64j77K84j20L3R8r71R08p46O69m84j06O7N00L35m69k56Q63q84R9K6J64K08
$$ 164 -13 271 151 184 282 -689 219 -527 142 -342 -448 -381 119 454 -15 -271 592 -292 -193 -167 -3 205
4577B05l20O12m05J1K8j92N6L4K12j67M6k94j51L00j12N21n20L03k57M17n50L13
$$ 205 -115 497 92 103 131 -61 -5 29 241 74 120 -174 -325 -25 -137 384 -136 167 -90 327 -223 90
4599I0Rj26M0m03P04q17O13l5K86N9q43L48k54%L26L55j16k38o3l34J37N78p06
$$ 90 99 -27 13 -390 314 -503 110 75 361 420 -423 -75 -329 -329 -3 352 236 -2 -65 -399 -262 316 -390
4622c90J70N69P6j21j09O40q05p9Q24p72J90j08l06M76l57N0%K5j38K76K28l58
$$ -390 -220 349 425 304 195 835 30 -49 775 3 193 85 -221 255 -102 -52 -52 -27 -165 111 339 -19
4644a9m10k01l8J175p09M7O76j52p27M9M63m4m72L88j10l78N31k38M84m0k51k03
$$ -19 -429 -630 -668 507 -202 -155 521 369 -358 -309 154 110 -362 26 -84 -462 69 -169 315 275 24 -179
4666a79J02j24l18M02j27J0O14M4l14J8m15L46M68n80j06R21p2p76M3j60K22K36
$$ -179 -77 -201 -519 -117 -244 -234 380 424 110 128 -287 59 527 -53 -159 762 690 -86 -43 -203 19 255
4688B55r3l63M79j12M28r17K39J9K31j92M42n42N52j010N42M02r62M31n2M17o76
$$ 255 162 -201 278 166 594 -323 -84 -65 166 -26 416 -126 426 -584 -42 360 -602 -171 -223 194 -482
4709d82N84k71K45l87K32m9J07J42k95j52M93P3j91j35o1N06o96L00O5n2l28O4
$$ -482 102 -169 76 -311 -79 -128 -21 121 -174 -326 167 240 49 -86 -147 359 -337 -37 28 -24 -352 -288
4731b88J11m46L58J021r68L51J0m96J33k32O36l85q4k90N19J89j68j3M03j134
$$ -288 -177 -623 -265 756 -212 139 149 -347 -214 -446 190 -195 -279 -569 -50 139 -29 -42 361 -773
4751g73L82M57o99N77j75J64j94l00N90j65J2Q1k93K78j77K32J79K04q93J16J78
$$ -773 -391 66 -633 -56 -231 -67 -261 -561 29 -136 -124 -43 -336 -58 -235 -3 176 380 -513 -397 -219
4772b19L11k65j1K37l96M12l49J11J38M55j143O77o6J94j0J95j80k93M11j92M
$$ -219 92 -173 -184 53 -343 69 -280 -169 -31 424 -719 -42 -108 86 76 271 91 -202 209 17 21
4793B1O7Jj42l56L67M34l83L38l30J94R8l67J05M3p64P25J18j51m05K17mJ52L59
$$ 21 88 89 -53 -409 -42 392 9 347 17 211 309 -58 47 90 -674 51 169 18 -387 -170 -174 -22 337
4816C37l53j13K51k2r7k18K20j22R3J67r1q4J01P5P9k43j2K16k97jo2R0J65j89
$$ 337 -16 -129 122 100 3 -215 5 -117 -24 143 52 -32 69 144 223 -20 -32 184 -113 -114 -176 -86 79 -110
4840a10J92j85j54L6J0P1K53j13o5O5k35J68j0oK46k45J94j00k9J22jj71K75j29
$$ -110 82 -103 -257 -221 -211 -140 113 0 -65 0 -235 -67 -77 -83 163 -82 112 12 -17 105 104 -67 208 79
4864G9j81R2O8mj1l3k38L12J55k28L4N5j53m4o6K19m32M34k03K8K24k39J84j8
$$ 79 -102 -10 58 54 43 10 -228 84 239 11 45 100 -53 -97 -163 56 -376 58 -145 -117 107 -132 52 34
4888C4j59L4j1j49K5K9K00j39k5L3N03k54M2j33j85k11M17m57L33p0Q8J23K5J89
$$ 34 -125 -91 -102 -251 -226 -197 3 -136 -161 -128 375 121 163 30 -155 -366 51 -406 -73 -143 -55 68 93 282
4912B82o00M70j0L9q1l68J34o6n6J51K87k15J49l9qMK9j47J07P2o1j95O5J24M7
$$ 282 -318 152 142 181 100 -268 -134 -200 -256 -105 182 -33 116 77 69 73 102 -45 62 134 73 -122 -57 67 114
4937A14r3r1N0k2J46L2k43l6M3J73j61R2j4K37j20k4j35k1J47k02J35j50P6j9
$$ 114 21 -70 -20 -42 104 136 -107 -143 -100 73 -88 4 -10 227 107 83 -52 -73 74 -128 7 -143 -67 -86
4961h6J9J26j04J11j66o5o7L96k74K75k16k5J99j35k6m1R5M7k53K24jo3J9rJ18
$$ -86 -67 59 -45 66 -100 -165 -232 164 -110 165 -51 -76 123 -12 -38 -79 16 63 -190 34 33 -30 -11 -20 98
4986I8j95J18n0m2J4J34Rj42J25K4j45N3j7j08L1Q5Rm4j00J70q3K2K4R2m3K7J03
$$ 98 -97 21 -29 -71 -57 77 86 -56 69 93 -52 1 -16 -124 -93 -8 1 -43 -143 27 -56 -34 -10 82 39 66 169
5013A69k8j40l1R2J4k35O0J46q8J5N5k15Q7J84q5P5n4m3q1K46k52K30k17K00j23
$$ 169 141 1 -30 62 76 -159 -99 47 -41 -26 29 -186 -99 85 0 75 21 -22 -103 143 -109 121 -96 104 -19
5038a9j1J03Q7k18o5K58p3l7j46L8L35j44j17p1N8M4q1M2l2j3n6j20K99k25J86
$$ -19 -30 73 160 -58 -123 135 62 25 -121 -83 252 108 -9 -80 -22 22 -59 -17 -49 -62 -118 -238 61 -164 22
5063B2L6R3k27j2J35j53J29j94K70m1J1q9P6j91J63Q1p5j46Q6P0m6Ml7J08k01
$$ 22 58 151 -76 -88 47 -106 23 -171 99 58 69 -20 56 -135 28 109 34 -112 -26 44 -2 2 -35 73 -128
5088a28R2j2O4L5j08J6N1J16k6m8l8r9K3RJ73j13m6J0J76j42J20k2p6J27lj61
$$ -128 -36 -48 16 51 -57 -41 10 126 100 52 14 -85 -62 -53 120 7 -39 -29 147 5 125 103 27 154 151 -10
5114a0N8m5r6K56q3j19RR6J46l56M4N5k8O5o2J99J9j04r9J9J41j33M%PJ14q8j11
$$ -10 48 3 -93 163 80 -39 -30 66 212 -144 -100 -45 -73 -8 -70 129 148 44 -55 -36 105 -28 -24 -24 -17 97 9 -102
5142a02N1l9J42j21J16q3k8K48m8j29o1J20j41Mp4R3J30o0L8p1J68k46J52r3J21
$$ -102 -51 -90 52 -69 47 -36 -64 184 136 7 -54 66 -75 -71 -145 -52 78 18 56 -15 153 -93 59 -34 87
5167H7l2j03R7o0k7J64m2j16L6J9m8Q5j18R2m3n5K40l45J12R3n3J43k06N2Q2J1
$$ 87 55 -48 49 -11 -38 126 84 -32 4 23 -25 60 -58 34 -9 -64 176 -169 -57 36 -17 126 -80 -28 54 65
5193F5j89K44n1j33nP0o0Q3N2o5P3p3p0n9J09r2n0K86l14J09l6R5q0J21r6P6k1
$$ 65 -124 120 69 -64 -69 1 -59 24 76 11 84 11 -59 -118 -9 -101 -151 135 -179 -70 -106 -11 -91 30 -66 10 -11
5220a1J90j79J7n4P8k04N4J45p5r3J81r0J23j19j9N6J67j70J4n6J32M1l56L13
$$ -11 179 0 17 -37 41 -163 -109 36 -39 -132 49 -41 82 -37 -56 0 167 -3 11 -45 87 128 -228 85
5244H5j27jn2O0m6J27J6k1m9m6l1q1J03N0n2J08o9J59j86qm4nO7k2J04Kj9j65
$$ 85 -42 -43 -95 -35 -81 46 62 41 -8 -54 -85 -166 -63 -13 -65 43 -26 133 -53 -61 -105 -110 -43 -65 39 41 22 -143
5272a43K5L1J30l3j03Q6L6lp3P8j46J40m2LL2j03R2R5j13O4m1k2q3J62j64J06
$$ -143 -118 -87 43 10 -93 -7 29 26 -47 31 -115 25 -17 -14 18 -85 7 102 -11 53 12 -10 -93 69 -95 11
5298A1O8J1m8M3j71N2k3j9K8L8j2K0J19p4J62k50k7J10n8o2Q4L9p6j8p7K61l02
$$ 11 79 90 42 85 -86 -34 -57 -76 -48 -10 -22 -2 117 43 205 -45 -72 38 -20 -82 2 41 -35 -53 -130 131 -171
5325a71J53J01k89L01r9M1M6j53K64k46j4j7R2p1j07K92Q5j48k28K61p1P7j95
$$ -171 -18 83 -206 95 -4 37 83 -70 194 -52 -66 -83 9 -62 -169 123 208 60 -168 93 22 99 -96
5348i6No2R3K7L9J9Nj4j21J78P7j27K46m33K54j58P1No4N7J6j6R8p7j08K01j19
$$ -96 -91 -153 -60 -33 6 25 30 16 -105 73 150 23 269 -164 90 -68 3 8 -56 1 17 1 99 22 -86 115 -4
5375djl8m6J27l4k35J31J28Nn6n0L6J09K6j27n5R3m6P3J32k33Kk9M3k7OO5o2J80
$$ -4 -5 -43 -89 38 4 -231 -100 28 33 -23 -73 -37 72 98 -29 -84 9 -37 36 168 -65 -63 -92 -49 -76 -70 -5 -67 113
5404A13j9N1j58K4q5j1M6nJ28p5k1j01J88j57n4J23q0R2j07Q9K6J0J45k38k5J50
$$ 113 94 145 -13 11 -74 -85 -39 -44 84 9 -12 -113 75 -82 -136 -13 -93 -1 -108 -19 7 17 162 -76 -101 49
5430D9o0L3J0O6nr6q0K4q4O3k8J11J27k41J95j48Q7j89J6K65l7l9jN1q3M6J0j02
$$ 49 -11 22 32 98 93 -3 -83 -59 -143 -80 -108 3 130 -111 84 -64 23 -166 -150 115 78 39 38 89 6 52 62 -40
5458d0J21Q3k15j27R7J06J9o3P2j0p3O0Qp8P1n9o5J27j5O0r5j04Q5r2rJ01M6J0
$$ -40 81 164 -51 -178 -81 25 44 -19 53 43 -30 30 38 -40 31 -28 -93 34 19 79 -16 -120 -35 -127 -136 -35 11 21
5486B1Q2j90J56j23Q7j05J33j35N8Q9p1O2j42J5m5R4R0j28J39n0K2o5k7N4k35
$$ 21 103 -87 69 -54 33 -72 61 -74 -16 73 2 64 -78 -63 -108 -14 76 -52 87 37 59 -6 -33 21 -214
5511b14R5K05j65m9J5J40l81N8J78J66o8n2K8r6J53o7r4J86l6n9n1j9M3r8L88
$$ -214 -119 86 -79 -128 -113 27 -354 -296 -118 48 -20 -72 -44 -140 13 -54 -148 38 2 -57 -108 -127 -84 -182 206
5536B06k64m6J67J4k1k2J0M1j05R8Q0j83P2j4R0j91J87j23J7L8k6K4j92J58K1
$$ 206 -58 -104 63 77 56 34 44 85 -20 78 158 -25 47 33 123 -68 119 -4 13 51 25 49 -143 15 36
5561C6O0k45L11k14rJ57j27j08J09M3L2o0q8j24J42J92p2N0j26N1J1O3j31K75
$$ 36 96 -149 162 -52 -61 96 -31 -139 -30 13 45 -15 -103 -227 -85 107 35 85 -41 10 21 84 -47 228
5585B28j19n7J2q7J67k85J85j4J40k53r8J05l6K80j13j47%K93j18Lj21j52M09
$$ 228 109 52 64 -23 144 -141 44 30 170 -83 -181 -76 -112 168 55 -92 -92 201 83 86 -35 -187 222
5608B22j00j14N7Q3k28O1QP8n5m1L3k0O5p3R1k1RP0k92K26o9L7P6r6m4m3J21P0
$$ 222 122 8 65 148 -80 -19 -11 67 12 -29 4 -16 49 -24 67 46 55 125 -167 59 -10 27 103 7 -37 -80 41 111
5636A11j37mO3Oj62L1J43J0Q5j03KM2j69l8R0k1J05J44k91N3r9J00J87l6o8l8
$$ 111 -26 -30 33 39 -123 -92 51 61 146 43 45 87 -82 -120 -30 -51 54 198 -93 -40 -139 -39 148 112 44 6
5662Fm7J02n4l6n4L3J7J05r4j22J87J1j17J24K3k26J31q8J9J5K5j6J60j56R5L6
$$ 6 -41 61 7 -29 -83 -50 -33 72 -22 -144 43 54 -63 61 84 -142 -11 -99 -80 -65 -40 -56 104 -52 43 79
5688G9l7L4rnj16N7q3o0J86Rk22J19rN1j55J82J33j15N8m1n8J29m5J02k04n4J1
$$ 79 42 76 67 62 -54 3 -80 -140 46 55 -167 -48 -57 -6 -161 21 154 39 97 56 -2 127 82 184 -20 -74 -63
5715f3o5J18o5j06J99n8Q0K5m0j12J00r7P6K2pk7p0M8R5k4O1P6k20k1QO0k6J22
$$ -63 -128 -10 -75 -181 18 -40 40 65 25 -87 13 -84 -8 14 7 -20 -90 -42 53 29 90 166 -54 -75 -67 -7 -33 89
5743H9j44K2N2P5j14k9J02j19O6PN9o1R6l56K57RJ57k06J34k23J81r2j6J67n5
$$ 89 -55 -33 19 94 -20 -49 53 -66 0 7 66 5 101 -255 2 11 168 -38 96 -127 54 -38 -54 113 58
5768E8j8k22K7R9P3n3Q9nl7l1%n3n4q2K23J6m8ok0N7J03Ln0j46J60l5p5k4K9L02
$$ 58 40 -182 -155 -56 17 -36 53 48 11 -20 -20 -73 -127 -209 14 30 -18 -24 -44 13 116 119 69 -77 83 48 -27 -51 -22 280
5798B80l17j51K86n76K24L64J14l3n84Q15n28J38J52K7l2q2J97l71P5j06J18N1
$$ 280 -37 -188 98 -478 -254 110 224 191 -393 422 -106 32 184 211 179 97 294 -77 -2 -108 10 61
5820F1l3r5M0n2O8n6N8L1j08oN0p4J02l9MK1l7j20K61P2r1k0k4J53j6j45N9j90
$$ 61 28 -67 -27 -79 -11 -67 -9 22 -86 -92 -42 -116 -14 -53 -49 -28 -65 -185 76 148 57 37 13 166 150 5 64 -126
5848a26J33N4o0J19q3l6JM8p7prJ22j01J0o9J37j35J27n8K0J6p5pJ05q4r3J05
$$ -126 7 61 1 120 37 1 2 50 -27 -34 -43 79 -22 -12 -81 56 -79 48 -10 10 26 -49 -56 49 -35 -128 -23
5875b3l4N1J5k2k1R3j70J78j45j7Pl7K05j79O8lR6j20J19k58K31J3J3p4L0Rqm6
$$ -23 -57 -6 9 -13 -34 59 -111 67 -78 -95 -88 -125 80 -99 -31 -34 62 -58 61 -197 34 47 60 -14 16 25 17 -29
5903b9k5P4O9nl9j27q0J24j0m1l9o1K11O7n4j11Q5J49k35J05L2m0O6j56p7K35
$$ -29 -54 20 89 84 45 -82 -162 -38 -48 -89 -128 -189 22 89 35 -76 9 158 -77 28 60 20 86 -70 -147 88
5929H8k01J46j12l3j9Q8L2J36n1j1j34J19Np3j9K4M8o2j2l8J39q2N3j85J43O5
$$ 88 -113 33 -79 -112 -131 -43 -11 125 74 63 -71 48 53 -20 -39 -15 33 -29 -41 -79 60 -22 31 -154 -11 54
5955E4j9k0j32p5J81r9J55Mo7m0J00n6q7k2jJ33Qk07Q9L35k9j74l1j42K05p5J64
$$ 54 35 15 -117 -192 -11 -110 45 49 -18 -58 42 -14 -101 -123 -124 9 17 -190 -101 234 205 31 0 -142 63 -12 152
5982A52q5Kj95J52p1N3P7j2j89M9M2R8j70J78r6j07kJ33j25J06%j46K24j32O6
$$ 152 67 69 -126 26 -45 8 85 73 -116 -67 -25 73 -97 81 -15 -122 -124 9 -116 -10 -10 -156 68 -64 2
6007BK5R9k5j16j7j10L4R4J6N4k72K56m5N3j48K58j12k35R3pJ80L8m2p6n0n5O8
$$ 2 27 126 101 -15 -32 -142 -108 -14 2 56 -216 40 -5 48 -100 158 46 -189 -96 -103 77 115 73 -3 -53 -108 -40
6034d0j06l0Q0K1N7J39r0j00k2J1P4k1OM5r4N4j1P1m2m8J31L1Q5j49j10J80J0
$$ -40 -146 -176 -96 -75 -18 121 31 -69 -91 -80 -6 -27 -21 24 -70 -16 -27 44 2 -46 85 116 201 52 -58 122 132
6061A32q4j3q6J64j03j04N6P3O0j57M8j15N8%O7j43K93k45m0J54o2J51L5k03K22
$$ 132 48 35 -51 113 10 -94 -38 35 95 -62 -14 -129 -71 -71 -4 -147 146 -99 -139 15 -47 104 139 -64 158
6086A58k81M7J11l6O6L0j76J02l3K33j02j51j5j80L09n4Qj67J03J71l21J02j77
$$ 158 -123 -76 35 -1 65 95 -81 21 -12 221 119 -32 -47 -227 82 28 36 -131 -28 143 -178 -76 -253
6109b53J29R9M1p5m2J72r6r7P4Q0j38J77p2l6k3M3k31K12K24j35k69L19l6j68
$$ -253 -124 -25 16 -59 -101 71 -25 -122 -48 32 -106 71 -1 -37 -60 -17 -248 -36 188 53 -216 103 67 -101
6133a01J23j51J52j46J82N6k36k0J26J88j18j0j12R1k8O9j21K4O9J56k14j00n4
$$ -101 22 -129 23 -123 59 115 -121 -141 -15 173 55 45 -67 24 -4 65 -56 -32 37 193 -21 -121 -175
6156a75L14q4r0K5j13q3J19J46M4j44j4J66m0r4m6M5J2j33J1J97J5l4nJ95k25
$$ -175 139 55 -35 -10 -123 -206 -87 59 103 -41 -55 111 71 -23 -69 -24 -12 -145 -134 63 78 44 39 234 9
6181Io5R1q8O2J25k17J14n9N7o4J92n22K38J57K7J81l60j6M49k72j03O9J55q8
$$ 9 -56 35 -53 9 134 -83 31 -28 29 -35 157 -365 -127 30 57 238 -122 -138 311 39 -64 5 160 72
6205G2K00k24J70k93M6K40k72J92j56Q1J00o6K2j07j93K43J4j63k8N0K21j7m5
$$ 72 272 48 218 -75 -29 211 -61 131 -25 56 156 90 112 5 -188 55 69 -94 -122 -72 149 132 87
6228H7l2J53j24O8p5j54J13q1J0J8r0J83j80R0M0K5j06O1q1Q3O2q5l00J75K2J40
$$ 87 55 208 84 152 77 -77 36 -45 -35 -17 -107 76 -104 -14 26 51 -55 6 -75 8 70 -15 -315 -140 -118 22
6254B2J50Q2j11j50m7PN6j7oMJ6l8NK2N1r9o2O9J78q3r3nR2p1M8l4O7p6q5O1j51
$$ 22 172 254 143 -7 -54 -47 9 -8 -14 -10 6 -32 -27 -5 46 -53 -115 -46 132 49 -44 -49 43 -28 20 -14 53 -23 -108 -47 -198
6285a98K52o7j00J57k4j92K60j84L0J47j48Q1j33J21J56k14J00k20J02J93l52
$$ -198 54 -13 -113 44 20 -172 88 -96 -66 81 -67 14 -119 2 158 -56 44 -176 -74 119 -233
6306b33J95K7K63j91Q2j5j9k86J95j44Q6l6M3o4O2J26o9j51R6p0Mk5J12QP2K0
$$ -233 -38 -11 252 61 143 128 109 -177 18 -126 -40 -76 -33 -97 -35 91 22 -129 -33 -103 -99 -124 -12 -4 68 88
6332H8k21R9Q9r3Q1p4J45n2j26m9L4p7J37O0P6j21R7J2l74J61R9j30J64M4K8j20
$$ 88 -133 -34 55 -38 43 -31 114 62 -64 -113 -79 -156 -19 41 117 -4 93 105 -269 -108 -9 -139 25 69 97 -23
6358b3O5l9P4j74O0o8rO7O4O2j61J3j4K13j80L0pk1J27k30J07JO3J8P3j4j50K41
$$ -23 42 3 77 -97 -37 -105 -114 -47 17 79 -82 -69 -83 130 -50 -20 -27 -48 79 -151 -44 -43 20 38 111 97 -53 188
6386A88j50J20r4o8J77k38j16J30J53j34k2jN0J17j57mp3J13J9J80k23l7M5j48
$$ 188 38 158 64 -4 173 -65 -181 -51 102 -32 -54 -55 -5 112 -45 -49 -122 -9 10 190 -33 -70 -25 -173
6410a73J01m4J30J91l14J63pJl1l2J65k33o4J90orm7j21K15j96M9J48m9M8Q1j71
$$ -173 -72 -116 14 205 -109 54 47 48 17 -15 150 -83 -147 43 37 28 -19 -140 75 -121 -72 76 27 75 156 -15
6436a5qP7q3m7Q8Q9j40KL8M4Rk55L08j2q1o8j8j5R7M8L7n9j13J77j5r8J43l02
$$ -15 -23 54 -29 -76 12 101 -39 -37 1 45 54 -201 107 95 14 -54 -72 -87 10 58 95 36 -77 100 85 -13 130 -172
6464a72K80j99J48n0j06K35k21J52q5p4lJ52K9r8N9Q1j16l1J15n2j15q1O5J46
$$ -172 108 -91 57 7 -99 136 -85 67 -18 -92 -95 57 86 -12 47 128 12 -19 96 44 -71 -152 -87 59
6488E9k0m7%J78l61mN56n72J68m5L59o20R42j001J316r29n12O44m85O32j59l34
$$ 59 39 -8 -8 170 -191 -195 361 -211 -43 -88 271 -349 593 -408 908 -21 -533 111 -374 258 99 -235
6510b35J70j68j56N16J46j67j16R0m8L2qL5O9J4k13R3q9R4jk11J79r9q7J18ml2
$$ -235 -65 -233 -389 127 273 106 -10 80 32 64 56 91 160 174 -39 54 -35 59 58 -153 26 -73 -160 -42 -46 -78
6536g8m7J7J05J37l92O3J48k4J32q6k54N01k11J7P7J6M6r2m37j6K16L18l91K51
$$ -78 -125 -108 -3 134 -258 -195 -47 -71 61 -25 -279 222 11 28 105 121 167 75 -362 -378 -162 156 -235 16
6560A6j95Q3n1K56J65j65Q8m14N83j014M69q5m67P16l48P28l01l91M70j51Qn85
$$ 16 -179 -96 -147 109 274 109 197 -217 366 -648 -179 -264 -731 -15 -363 365 64 -327 143 -8 0 -585
6582e85j82O23K8j94M05l18m2j58Q27l57j44N5n8K01l5k37n6M09J16j04l55k28
$$ -585 -767 -144 -116 -310 95 -223 -265 -423 404 47 -97 -42 -100 101 66 -171 -227 182 298 194 -161 -389
6604c89J86J70P0k15K90j16L9R0j94K3J35p2p8J43j82q3R3M1o8l1J53Kk02J63
$$ -389 -203 -33 37 -178 112 -4 35 125 -69 -46 89 17 -61 82 -100 -183 -90 -49 -117 -148 5 7 -195 -32
6628c2j00PJ3J23O0j08n3M2l3K4J09K2r5J11j48J50K3m9j26rJ9J03P3l4k91L18
$$ -32 -132 -125 -112 11 71 -37 -90 -48 -81 -57 52 74 -21 90 -58 92 115 66 -60 -69 -50 53 126 92 -199 119
6654A19j62ON7r9j8O4K6p9j19J09J92k04P0J33j99K6P4J44k63J74P8j91j29K92
$$ 119 -43 -37 20 -79 -97 -33 -7 -86 -205 -96 96 -108 -38 95 -104 -78 -4 140 -123 51 129 -62 -191 101
6678A01p6q6J2J18k06Q9M6R6j07o4p6J39L2l3K01k85O0jj2L4N3p0J4R3J8K2j08
$$ 101 25 -61 -49 69 -137 -48 -2 94 -13 -77 -153 -14 18 -15 186 -99 -39 -40 -52 -18 35 -35 -21 72 90 112 4
6705DL2m2j40K43j85n9K41j02J89k79JJ12J09j97J45p1K7N4o0L1k8j60J10j80
$$ 4 36 -6 -146 97 -88 -147 94 -8 181 -98 -97 15 124 -73 72 1 28 82 22 53 25 -135 -25 -205
6729b05M26m37j40N83j26j16m7j67O9L31l0k66j36L58k61M36n97M02j61Q3L11
$$ -205 221 -216 -356 227 101 -15 -62 -229 -160 171 141 -125 -261 97 -164 272 -325 77 -84 -1 310
6750C10J69q55L08k75L19k8O5J69k54n55R60k21J98o52M64J22m17P03j040K25
$$ 310 479 -376 -68 -343 -24 -52 13 182 -72 -627 333 112 310 -342 122 244 -173 530 -510 -285
6770b85L83m19N46M24r67P17j150M26K93N53r76L87N80n6n58N22l33j94K72k52
$$ -285 98 -321 225 649 -318 399 -751 -325 -32 521 -455 -68 512 456 -102 420 87 -107 165 -87
6790h7R8J19m28J23O53p08J92L62n17O24k8j64N2K21r56O94j8j143Q03P3M9k02
$$ -87 11 130 -298 -175 478 -230 -38 324 -193 431 403 239 291 512 -444 250 232 -911 -108 -35 14 -188
6812a88R4K03M86m06J41m50m62O74J89L9n11o5N21o60K22R6J61j13O0n4J05k25
$$ -188 -94 109 595 189 330 -120 -582 92 281 320 -191 -256 265 -395 -173 -77 84 -29 31 -23 82 -143
6834a43J94L0j10L0J71j58P0q4L9k7j8R6j34L3J42j11j02p6J93J00q2K5o3m2K54
$$ -143 51 81 -29 1 172 14 84 0 39 12 -6 90 -44 -11 131 20 -82 -158 35 135 53 78 15 -27 227
6859B27l02J35m7p4J67r3n1J94k12K48m25K08m7K5M5Nn4J18j91K90k43J34L9j87
$$ 227 -75 60 13 -61 106 13 -38 156 -56 192 -233 -25 -72 -47 -2 3 -51 67 -124 166 -77 57 96 -91
6883i1j0J1O9J76j46N8j8j8q2J44O2o7j57J66Ok23M0J69k3n9j7j31J45J43k94
$$ -91 -101 -90 -21 155 9 67 49 31 -51 93 155 88 -69 97 103 -120 -80 89 66 7 -10 -141 4 147 -147
6908a47R1m3n1K94o6r4M0p2k28J38J31o5K8J14r4K25j49q4P5o7K05j98J32j99
$$ -147 -56 -99 -150 144 78 -16 24 -48 -276 -138 -7 -72 -44 70 -24 201 52 -32 43 -24 181 -17 115 -84
6932h4R5p3J44n7j0l8p5J25J00j68M1K4r2J29q6P9j94K0L30j18j10J02O4j51j4
$$ -84 11 -62 82 25 15 -23 -98 27 127 -41 0 24 -68 61 -25 54 -140 -120 210 92 -18 84 148 -3 -17
6957a7J02o6L2j76J01J80j56rq2N9L4J38j20j14J20N5m0n4q2J20r0J33n7O1o6
$$ -17 85 19 51 -125 -24 156 0 -9 -91 -32 2 140 20 -94 26 81 41 -13 -95 25 -65 68 11 72 6
6982Flk3j13J15M8Nk4j68K35Qok6N4r0p1n9J98J2j96lj23K59j20J62n5J05q2j28
$$ 6 3 -20 -133 -18 30 35 11 -157 78 86 80 54 108 18 -53 -112 86 98 -98 -101 -224 35 -85 77 22 127 45 -83
7010h3K37j45j05M1J01k4j18K47nl36L60k9q5j92J84p4P4l7J02k4p0Q0q9k0Q9
$$ -83 154 9 -96 -55 46 22 -96 151 146 -190 170 141 56 -136 48 -26 48 11 113 89 19 99 10 -10 79
7035G9q0j27J47m1l2J0M3j1K3R6p0K4j86Q6K7O8k19J82j09R4K1Kk09L50l35K95
$$ 79 -1 -128 19 -22 -54 -44 -1 -12 11 107 37 61 -125 -39 -12 56 -163 19 -90 4 25 27 -182 168 -167 128
7061A28j28n4N7o1Q3j27Q1j7oK2k3J55j05n0J83J15j43k16J92j44p5R4j6R0j46
$$ 128 0 -54 3 -58 25 -102 -21 -38 -44 -22 -45 110 5 -45 138 253 110 -106 86 -58 -133 -39 -55 35 -111
7086a11P4k15Q2J14J10p6j11Q3N9m4p3R3n0J40%j13Q1J7k56J88L2j04J47j45J19
$$ -111 -37 -252 -170 -56 54 -22 -133 -50 9 -35 -108 -15 -65 75 75 -38 43 60 -196 -8 24 -80 67 -78 41
7111D1P1j89J09o4O6j38R2J45p5O6k02P1mP5j28m9j0K63Q3k89m4J75j04L7j08
$$ 41 112 -77 32 -32 34 -104 -12 133 58 124 -78 -7 -11 64 -64 -113 -123 140 223 -66 -110 65 -39 -2 -110
7136a10Q3qj35R2JK01pj38Q0j23J48j87J96j06R2k58L39j75P5K5q2O5q7O0j09
$$ -110 -27 -35 -170 -78 -77 124 117 -21 59 -64 84 -103 93 -13 79 -179 160 -15 60 85 3 68 -19 41 -68
7161f8O8M0j02J82k18K23p3o9N7K0j18r4K35l2o2J61j73N0q0N0JO2q9J33r4N0
$$ -68 0 40 -62 120 -98 125 52 -17 40 60 -58 -152 83 51 -11 150 -23 27 -53 -3 -2 60 -29 104 10 60
7187F0l8M3j24Q5K20k01k01J16k3mK3J19o6j00N4J57k37k1L8J66rk20J71J65j58
$$ 60 22 65 -59 26 246 45 -156 -40 -63 -67 -44 75 9 -91 -37 120 -117 -138 -100 66 57 -163 8 173 15
7212A5j38J98l19K31J10j52J16O7j76l6M5PO9j78K21k27O2J8plK6P0j79K98l14
$$ 15 -123 75 -244 -13 97 -55 61 128 -48 -84 -39 -32 37 -141 80 -147 -85 -67 -74 -77 -51 19 -160 138 -176
7237a76K72k65J30q6J80j96J25J01j18K29j80r6J26J20k86J37m4m1Q3Q5l1k25
$$ -176 96 -169 -39 -125 55 -141 -16 85 -33 196 16 -80 46 166 -120 17 -27 -68 15 100 69 -156
7259a56J84j62R2K53j39p7k1Q3n2j0K7j45M35l18l8n9J06R6k1J14l31L36n03K49
$$ -156 28 -134 -42 211 72 -5 -26 57 5 -5 22 -123 312 -6 -44 -103 3 99 78 192 -139 197 -306 -57
7283e7K25k59p8K86j50k34J95J47k05q8j54K6K88L33k17J00K07j23k34J18m38
$$ -57 168 -91 -169 117 -33 -267 -72 75 -130 -218 -372 -346 -58 275 58 158 365 242 8 126 -312
7304c12K13N45m16O30o37j66K57M99o71k23m15J008P8n72j35K13M65l99N54r26
$$ -312 -99 446 30 660 23 -143 114 613 -58 -281 -696 312 390 -182 -317 -104 361 -38 516 -410
7324d10J70Qk57O71k95j1J62l91J17K17K0k11L08l03j68N57k27J27J76k90k34
$$ -410 -240 -232 -489 182 -113 -124 38 -353 -236 -19 1 -210 98 -205 -373 184 -43 84 260 -30 -264
7345b64j16L59q6M45j25J15n49L03op2l6k05M33K53n66L85k7l82K52q1J50k96
$$ -264 -380 -21 -107 338 213 328 -221 82 76 4 -32 -237 196 449 -117 268 241 -141 111 30 180 -116
7367a16J75k38L04j52R2J08N0R5k48k34Q8K08l7j69l14L52J04J0k36J27K64l43
$$ -116 59 -179 125 -27 65 173 223 318 70 -164 -76 132 95 -74 -388 -36 68 78 -158 -31 233 -110
7389a10K34k26N8J34Q5l71m6R6l20N70o6J40l14K96n87K83J60r0k7M07m76O42
$$ -110 124 -102 -44 90 175 -196 -242 -146 -466 104 38 178 -136 160 -427 -144 16 -74 -101 306 -170 472
7411D72n18K1j1J55j03k52L03j79J17M7J42l09K70j69j24K39O2j46j50o2N8M5
$$ 472 -46 -25 -36 119 16 -236 67 -112 5 52 194 -115 155 -14 -138 101 163 17 -133 -195 -137 -92
7433i2K00j58j03J78J57l94K03J11k95J60L2J1Q1k24R3M1p3L5k53L29J08n24L73
$$ -92 108 -50 -153 25 182 -212 -9 102 -193 -33 -1 10 91 -133 -40 1 -72 -37 -290 39 147 -377 -4
7456dP1J98k74j64L07J84o19J93N0L80m13L30j74j3l79O9L18j52M9KJ67j83J70
$$ -4 67 265 -9 -173 134 318 -301 -108 -58 322 -91 239 65 52 -327 -258 60 -92 -43 -41 126 -57 113
7479A13n6P5l0Q7l79L62l50N8K63n36L72J21j44j10K82L4m2m0k9n2k16J50m34
$$ 113 57 132 102 189 -190 172 -178 -120 143 -393 -21 100 -44 -154 128 162 120 80 51 -1 -217 -67 -501
7502e01N19O35p78l43L62O71k12j11l8J63l96j71q8J06j5J90Qj6Q3Q4P4o58M55
$$ -501 18 653 -125 -468 -106 565 353 242 204 367 -29 -200 -288 -182 -197 -7 1 -15 68 152 226 -432 23
7525B3n6L38n82KN8j61L68K80m57j1K35R8l07M05m57L12L41l55k45Q8M82n74j33
$$ 23 -33 305 -277 -275 -217 -378 -10 270 -187 -198 37 135 -172 233 -224 88 429 74 -171 -83 399 -175 -308
7548c08J6k8J43R4L16j83j01L6Q2K9k45m5L08L06n79J66N42o39N83j96l04l56
$$ -308 -292 -320 -177 -83 233 50 -51 -15 67 96 -149 -194 114 420 -159 7 549 -90 493 297 -7 -363
7570c63L19M13j74o56L91K15o02N41m37L52k63N94m01J33j99n26M65l92J335n64
$$ -363 -44 369 195 -461 -70 145 -457 84 -353 -1 -264 330 -71 62 -137 -663 -198 -590 745 181
7590A81m90K87j65q8K57K99o07M62L93n01k53N18j29l90L74j0L9k13l05K54K42
$$ 181 -309 -22 -187 -275 -18 281 -326 136 529 28 -225 293 164 -226 148 138 177 -36 -341 -87 155
7611A55j71k33O19NJ87j05p79N87l31R5k7j73R7k27J62L53j82R9l29M16m92J44
$$ 155 -16 -249 370 375 562 457 -322 265 -66 29 2 -171 -74 -301 -139 214 32 131 -198 218 -274 -130
7633a30K3K59k86n1M31l70P8K29m8j70j41L79m06K05l00N4J30K63r6j3j01n1K55
$$ -130 -107 152 -134 -185 246 -124 -46 183 135 -35 -176 203 -203 2 -298 -244 -114 149 53 40 -61 -112 143
7656A43k53M86k56j13p2j01J86L27l93K6M23m32m0K17l01K6P9K67j39Q5m35l46
$$ 143 -110 376 120 7 -65 -166 20 347 -46 -20 403 -29 -69 148 -153 -127 -48 219 80 165 -270 -616
7678f16O29L68n07j28L13Q1q9m2R7k66l0K84R9o0j62j33M53m95m2M17k81L50n03
$$ -616 13 381 -126 -254 59 140 51 9 106 -160 -190 94 193 133 -29 -162 291 -204 -246 171 -110 240 -263
7701b63J75K71l0n92P68j43M3j36j14l5n5J15Kl7k32L42j59rJ26jl57L55J68k4
$$ -263 -88 183 153 -439 329 186 229 93 -21 -56 -111 4 6 -31 -263 79 -80 -89 37 36 -321 34 202 178
7725A78k08n8j24K93K30k4l49J58P7j48N4m07M35k62M98k72j64P6N2J22m15J54
$$ 178 -30 -88 -212 81 311 287 -62 96 173 25 79 -328 107 -155 343 71 -93 -17 35 157 -258 -104
7747a04j41O17k98O3k77J67j11J82j27P0j80J09N83l46k41p0K00k00q5LO0nP9
$$ -104 -245 372 74 137 -140 27 -84 98 -29 41 -139 -30 553 207 -34 -104 96 -104 -189 -186 -126 -131 -52
7770e2R9J08K0m03L90k89N7L8K8l5K11J2r1j03KK21j00k32L86l39j9M33l85L05
$$ -52 47 155 175 -228 162 -127 -70 -32 -4 -39 172 184 93 -10 -8 213 113 -119 267 -72 -91 342 -43 262
7794B62j96K74n08q7L04l9J62j32m4L1K11k39j02J80j49j29K81l1k01K63L6k66
$$ 262 66 340 -168 -255 49 10 172 40 -4 27 238 -1 -103 77 -72 -201 80 49 -152 111 147 -119
7816a19K49k66J27n2K43k12K7J88m4j54J56j38m9M0J1j48P3P7r4L19n6Q4k82R0
$$ -119 130 -136 -9 -61 182 -30 -3 185 141 -13 143 5 -44 -4 7 -141 -68 9 -85 234 178 262 -20 70
7840G0k03L0j49K64j08J07L4j47j49J75j4K00K5j04K30J39l44l27K27p4J59J69
$$ 70 -133 -103 -252 12 -96 11 45 -102 -251 -76 -90 110 135 31 261 400 56 -271 -44 -118 41 210
7862B10M7J26l65l19J26j41J20PM9P1J73j84J67j48J44j37p0j68L35K71l03m2
$$ 210 257 383 18 -301 -175 -316 -196 -189 -140 -69 104 -80 87 -61 83 -54 -124 -292 43 314 11 -31
7884c1O4R1l86J19K04j7N6j45L1O9k21J01J38Lj77m5r7J12J44J41k62L8Q1N9j12
$$ -31 33 124 -262 -143 61 44 100 -45 -14 55 -166 -65 73 76 -101 -146 -243 -131 13 154 -108 -70 11 70 -42
7909d2J29j61j03K63qL3k88R9J21j6j41J95j29J53p3Q6n2M7k02Q4J9j25R8n8J34
$$ -42 87 -74 -177 86 78 111 -177 -78 43 27 -114 81 -48 105 32 118 66 113 -89 -5 14 -111 -13 -71 63
7934F3P3j31Nk8J04j33Q6l3J19j36O3nLL7k31J12J32j94J34j60N6J11j06O4k14
$$ 63 136 5 10 -18 86 -47 39 6 125 -11 52 47 50 87 -144 -32 100 -94 40 -120 -64 47 -59 5 -209
7959b09L49j86%L6o8Q1j59K56k03J48n0Q2l63j35L39K2K12l47L69l50K71n2k8
$$ -209 140 -46 -46 -10 -78 3 -156 100 -103 45 -5 77 -286 -421 -82 -60 152 -195 174 -176 95 43 15
7982A5j65K44J72k86M0j04k35k74L31nN71n7k20j80K7k32k54Q27r06Q97p0k17
$$ 15 -150 94 266 -20 20 -84 -319 -593 -262 -267 304 247 27 -153 -126 -358 -612 215 -691 206 136 -81
8004h1N9J0R2j52R9j2O7m51K79J22j53K7O6J72J29l50l4K28j48q9o2J37N0J0j28
$$ -81 -22 -12 80 -72 27 15 82 -369 -90 32 -121 -94 -28 144 273 -77 -111 117 -31 -120 -182 -45 5 15 -113
8029a13K40P6k01Q0j36R7m5PO3j82J17j9j07J95j10m6J65kj38J36j01k70N22k72
$$ -113 127 203 2 82 -54 43 -2 5 68 -114 3 -16 -123 72 -38 -84 81 79 -59 77 -24 -294 228 -44
8053d4M18j90N6j51q0J9J80m39K57J93l30N1PR2n7KM6j2K59k90O7R3k01LJ39p6
$$ -44 374 184 240 89 9 28 208 -231 26 219 -111 -60 -53 39 -18 -16 30 18 277 -13 54 147 -54 -51 88 12
8079A2J1RJ1J15j44n3M2qk3K31j64M9L9j47K3%K3j49J62m9J18k38K13j55J4J16
$$ 12 23 32 43 158 14 -39 3 -5 -28 203 39 88 127 -20 3 3 26 -123 39 -10 108 -130 83 -72 -58 58
8105E8J4k58L34j55J04K0l90O19m46r3L04j72l31M21N9l63O96k59j60J00k20Q4
$$ 58 72 -186 148 -7 97 117 -273 346 -100 -193 111 -61 -392 29 88 -275 421 162 2 102 -118 -34
8127c4j50K63j24J62j15M9O2q3r5R6j58K08j03m8P3O3j62L62m61l2L32O3k52J33
$$ -34 -184 79 -45 117 2 51 113 30 -65 31 -127 81 -22 -70 3 66 -96 266 -195 -227 105 168 -84 49
8151D9O5k20K73j25J9j16o0o5J07J03j1j09J97n0P3j90j42L35J12m52M16j44q7
$$ 49 114 -106 167 42 61 -55 -115 -180 -73 30 19 -90 107 57 130 -60 -202 133 245 -207 209 65 -22
8174b2O9K8k42L02n02L45m7J8N4M41o99j79P09k92K04j60j19
$$ -22 47 75 -167 135 -367 -22 -69 -51 3 444 -255 -434 275 -17 187 27 -92
8191i2
$$ Imaginary data points
##PAGE= N=2
##DATA TABLE= (X++(I..I)), XYDATA
0@%%%%%%%%%%%%qJ6j6J6k4L2l2M0m9N7p2Q8j04J20j36J60j84K08k40K75l15L58
$$ 0 0 0 0 0 0 0 0 0 0 0 0 0 -8 8 -8 8 -16 16 -16 24 -25 32 -40 48 -56 64 -72 88 -96 112 -128 147 -168 190
34A90m04M55n11N74o41P14p97Q87r85J092j207J335j476J627j792J975k176K395
$$ 190 -214 241 -270 304 -337 377 -420 467 -518 574 -633 702 -774 853 -939 1036 -1140 1255
52A255k639K913l218L559l947M391m905N509o230P106q201R614j1516J4233j8461
$$ 1255 -1384 1529 -1689 1870 -2077 2314 -2591 2918 -3312 3794 -4407 5207 -6309 7924 -10537
67a0537K6004m3593J62518J07398j90029L4733M4811j5696o8449j1780o172J7667
$$ -10537 15467 -28126 134392 241790 51761 86494 131305 115609 47160 35380 29208 46875
79D6875j3369l7737k7717M0166J3645m3508l6088K4962K8018Q598l5400l5138
$$ 46875 33506 -4231 -31948 8218 21863 -21645 -57733 -32771 -4753 3845 -31555 -66693
91f6693J1962K9166k4291l8885M147L5210j3065n7981j5843M7253J9906l6385
$$ -66693 -54731 -25565 -49856 -88741 -84594 -49384 -62449 -120430 -136273 -89020 -69114 -105499
103a05499l2944K0321M8220J7489j8514j4672J9923M1137O93l5889R768N5152
$$ -105499 -138443 -118122 -69902 -52413 -70927 -85599 -65676 -24539 -23846 -59735 -49967 5185
115E185J1714l8339j9578L4964M6789o608m5145n442M2805K1613k7142j6698L0170
$$ 5185 16899 -21440 -41018 -6054 40735 34127 -11018 -16460 26345 47958 20816 4118 34288
128C4288K6447j1460j4698P924K4898J4532k2194k9882J0628L6522P393l4415
$$ 34288 60735 49275 34577 42501 67399 81931 59737 29855 40483 77005 84398 49983
140D9983k2833K4872K1532k6002l1397J0947K7769q786l8832q793L0010J3942
$$ 49983 27150 52022 73554 47552 16155 27102 54871 46085 7253 -1540 28470 42412
152D2412k7558l4671R20K7369K953k6328j4071R011J0296q499k2397l198K5493
$$ 42412 14854 -19817 -18897 8472 11425 -14903 -28974 -19963 -9667 -18166 -40563 -43761 -18268
165a8268J1234k8443k6245K4020L6772j5025l8781J885K9587P773k0108j3192
$$ -18268 -7034 -35477 -61722 -37702 -930 -15955 -54736 -52851 -23264 -15491 -35599 -48791
177d8791J6426J7766j0929j9754M467K6434J2878j8984j7696J5423K8814P307
$$ -48791 -32365 -14599 -25528 -45282 -40815 -14381 -1503 -20487 -38183 -22760 6054 13361
189A3361j7968j0099K1774K1174j1782j7828R892K3908l244k7989k670K8105J2597
$$ 13361 -4607 -14706 7068 28242 16460 -1368 8524 32432 29188 1199 -1471 26634 39231
202C9231j7226j8287M474J8277M932j3470q882Q567J5361k560j9154J113K3396
$$ 39231 22005 3718 8192 26469 31401 17931 9049 17616 32977 30417 11263 12376 35772
215C5772L928k5954j8272J6356K3772j2895l0716j018K0475K576k0591j1184J4004
$$ 35772 39700 13746 -4526 11830 35602 22707 -8009 -9027 11448 14024 -6567 -17751 -3747
228c747R502j4258j3487N246J4419N140j2840j4314M468J5663M730j4843j2782
$$ -3747 5755 -8503 -21990 -16744 -2325 2815 -10025 -24339 -19871 -4208 522 -14321 -27103
241b7103J1708J4440j0456j5155O608J6537k794k1493l492K2197J2049j1983j3537
$$ -27103 -15395 -955 -11411 -26566 -19958 -3421 -6215 -27708 -31200 -9003 3046 -8937 -22474
254b2474O536J7097K767j1310k462Q851P791k596j0334K771J7016M567j6731j2015
$$ -22474 -15938 1159 3926 -7384 -9846 -995 6796 4200 -6134 -3363 13653 18220 1489 -10526
268a0526J3097J9533n891j8934J714J5843L169j0671n763R263Q056q183r400L548
$$ -10526 2571 22104 16213 -2721 -1007 14836 18005 7334 1571 10834 18890 10707 1307 4855
282D855J1553M855j0214j1738K900J0455J444j0484r104P696J0159p767j1347
$$ 4855 16408 21263 11049 -689 2211 12666 14110 3626 -5478 2218 12377 4610 -6737
295f737N817J2749m521j8661l302J6478N997j1205q980L074Q826R25p587l241
$$ -6737 -920 11829 7308 -11353 -14655 1823 7820 -3385 -12365 -9291 -465 460 -7127 -10368
309a0368L622L646l056p954J685J1994K369j0986p684P636J3352k670j3253J51
$$ -10368 -6746 -3100 -6156 -14110 -12425 -431 1938 -9048 -16732 -9096 4256 1586 -11667 -11516
323a1516J1202K591q268l692Q908N979p847p369N058R212M077o524p477L232R326
$$ -11516 -314 2277 -5991 -9683 -775 5204 -2643 -10012 -4954 4258 8335 1811 -5666 -2434 6892
338F892J905o762m915O649O956n860n895N653Q259k870j1247k533R807M714o455
$$ 6892 8797 2035 -2880 3769 10725 4865 -1030 4623 12882 10012 -1235 -3768 6039 10753 4298
353D298n678J277N461J259l636j308J895J174j760n325M74Q887K227r763o804
$$ 4298 -1380 -103 5358 6617 2981 1673 3568 4742 2982 -2343 -1869 7018 9245 -518 -7322
368g322O248R048m470j1122J444P643j286o495n15O674K729p528m421L935N141
$$ -7322 -1074 7974 3504 -7618 -6174 1469 183 -6312 -6827 -153 2576 -4952 -9373 -5438 -297
383b97J073k873l685Q06M405L013k627n344J409N468l128n721L537P423j024r072
$$ -297 776 -2097 -5782 -4976 -571 2442 -185 -5529 -4120 1348 -1780 -7501 -3964 3459 2435 -6637
399f637j411Q839L598n192l347K238M036L22k166J077K668n70k540k016J719N266
$$ -6637 -8048 791 4389 -803 -4150 -1912 2124 2446 280 1357 4025 3455 915 -1101 618 5884
415E884K93n132l621K805N693j323o643J23M945l76l344P07M902J348m775l551
$$ 5884 6177 1045 -2576 229 5922 4599 -2044 -1921 3024 2648 -696 11 4913 6261 1486 -2065
431b065K038K616J118k020l804J64L468K000k296l476J164K341l273l290L459
$$ -2065 -27 2589 3707 1687 -2117 -1953 1515 3515 1219 -2257 -1093 1248 -2025 -5315 -1856
446a856M617j222n876q00O180K017m268k174J556R35p61o23J900O31j705r57p21
$$ -1856 2761 1539 -4337 -5137 1043 3060 -1208 -3382 -1826 -891 -1652 -2275 -375 256 -1449 -2406 -3127
463c127R1L571J751l540l056K304M816l25m370J26L070q07k501Q45L496J336l797
$$ -3127 -3036 535 2286 -1254 -4310 -2006 2810 2485 -1885 -1759 1311 504 -1997 -1152 2344 3680 -117
480a17k608K076K407m4j265j586R8J826J740N97j790m71J239j315k249K680K647
$$ -117 -2725 -649 1758 1714 449 -1137 -1039 787 2527 3124 1334 863 2102 787 -1462 1218 3865
497C865j135l998n01L433P91k413j189K66M52Q1J67R73J244j260j420p34K72K489
$$ 3865 2730 -1268 -1769 1664 2455 42 -1147 -881 -429 -348 -181 792 2036 776 -644 -1378 -1106 1383
515A383J112k727k604J776L281o61l554K73K241j916k228J735K264k4k238k33
$$ 1383 2495 -232 -2836 -1060 2221 1560 -1994 -1721 520 -1396 -3624 -1889 375 351 -1887 -2120
531b120J895j6M29J195j342j705J26J801J399j450j219J371m60j607J166K343
$$ -2120 -225 -241 188 1383 41 -1664 -1538 263 1662 212 -1007 364 -96 -1703 -537 1806
547A806n05l371n88L637J052k524m07J802k39j470N36K033Q02j486j048k21l65
$$ 1806 1301 -2070 -2658 979 2031 -493 -900 902 663 -807 -271 1762 2564 1078 30 -191 -556
564e56J230J118j454j677L96K049J131j623m46M80r21q56P98J373j36j222p00
$$ -556 674 1792 338 -1339 -943 1106 2237 614 168 648 -273 -1129 -331 1042 906 -316 -1016
581a016J010L94k25L69m17j234o15J182J291l49q83Q40m78j345J401K252j372
$$ -1016 -6 388 163 532 115 -1119 -1734 -552 739 390 -493 347 -131 -1476 -75 2177 805
598H05k620k14K245O98j441J81L00p15o00M00J181J52j333J17J014j55K95J160
$$ 805 -1815 -2029 216 914 -527 -346 -46 -761 -1361 -961 220 372 -961 -844 170 15 310 1470
616A470m93j319o86J383J076j055l31R38j080j459J210R06p6j420o69J367O50
$$ 1470 977 -342 -1028 355 1431 376 45 983 -97 -1556 -346 560 484 -936 -1605 -238 412
633D12r5N36l08p28j22O67J155m4j238N97j07r71L35P70l47j583o80J114O64n01
$$ 412 317 853 545 -183 -305 362 1517 1473 235 832 725 -246 89 859 512 -1071 -1751 -637 27 -474
653d74O13L14j339l81R47Q39K6o69n2L91oR52M47j002j283j78M49M20m69n4O34
$$ -474 139 453 -886 -1267 -320 519 545 -124 -176 215 209 1161 1608 606 -677 -855 -406 14 -455 -509 125
674A25r82n35J226Q19n26p80k38P63L08J5J056J56j599n16J022R75p26j040Q86
$$ 125 -857 -1392 -166 653 127 -653 -891 -128 180 195 1251 1407 -192 -708 314 1289 563 -477 409
693D09o3j189K45J617l22j674m31J168O89n76L46Q34p11j106P00J174r7j223j28
$$ 409 346 -843 -598 1019 697 -977 -1408 -240 449 -127 219 1053 342 -764 -64 1110 1013 -210 -338
712c38O16j91Q2O85J01j042q07L24P21M1o29L99j79n09O14O93l1p13o33K95N36
$$ -338 278 87 169 854 955 -87 -894 -570 151 192 -437 -38 -217 -726 -112 581 550 -163 -796 -501 35
733C5p1R21J5j058l10K02P30k08p21L02n6n72N17J071k05j178n19R19K32n51Q47
$$ 35 -36 885 900 -158 -468 -266 464 256 -465 -163 -219 -791 -274 797 592 -586 -1105 -186 46 -505 342
754C42K51p39m87O69R44j97j060j71N36m11J69J034p6o20q34K33R29m28k50K58
$$ 342 593 -146 -633 36 980 783 -277 -448 88 -323 -154 880 804 184 -650 -417 512 84 -166 92
774I2k19n53L53O98K89p64n64O98J24j97N09M11p55m45J50P24j80q05K72j1m00
$$ 92 -127 -680 -327 371 660 -104 -668 30 154 -43 466 877 122 -323 -173 551 371 -434 -162 -173 -573
795e73M46N18J67n61o07O6M06o7J37K21k61l01N64N61j04n46m83J52N7j36N10
$$ -573 -127 391 558 -3 -610 -544 -138 -205 -68 153 -108 -409 155 716 612 66 -417 -265 -208 -344 166
816A66K11m20k36j29K71Q6k02K53k98n76O96N69J29l23m61K04J95j94O53j30o09
$$ 166 377 -43 -279 -408 -137 -51 -253 0 -298 -874 -178 391 520 197 -264 -60 135 -59 594 464 -145
837a45k70N56K86n29l19M65m9q84K29J010J01m26m27M02K09m43N41O18q76o14
$$ -145 -415 141 427 -102 -421 44 -5 -889 -660 350 451 25 -402 0 209 -234 307 925 49 -565
857e65N45Q04j43p58j51M13n10j07M96K98m55l74J67N21L3o12M65N1n58N1R88
$$ -565 -20 784 641 -117 -268 145 -365 -472 24 322 -133 -507 -340 181 214 -398 67 118 -440 -389 599
878E99J60l02p14J51Jj17L56q4j91k10J70J83K21m70K90r4m43J48M15L11l26j51
$$ 599 759 457 -257 -106 -105 -222 134 50 -141 -351 -181 2 223 -247 43 -51 -494 -346 69 380 54 -97
900i7J59K1j51K36K72j47q12K17M68R3l22J7K14m02m8M52K86n64k46K74K57k6
$$ -97 62 83 -68 168 440 293 -519 -302 166 259 -63 -46 168 -234 -282 170 456 -108 -354 -80 177 151
922A51o7J25j55n58K82L87K94k79l29P4J64l79J78K75l57m7q6N13K51k81k9j05
$$ 151 84 209 54 -504 -222 165 459 180 -149 -75 89 -290 -112 163 -194 -241 -327 186 437 156 127 22
944B2k98n9L00K30j92j38J42J46k62J27K72k50j67k59N42J31q9o3j42j47p0L27
$$ 22 -276 -335 -35 195 3 -135 7 153 -109 18 290 40 -127 -386 156 287 198 135 -7 -154 -224 103
966A03J82k85j69J51o4J63j35K13l2l64n8M45m%k48J52K0j26L76R6l55k71k14
$$ 103 285 0 -169 -18 -82 81 -54 159 127 -237 -295 150 146 146 -102 50 70 -56 320 416 61 -210 -424
989d24L60Q9K63k74J01k38j95O28j25j25l22J56L56j52p2L87j26n75J56L40J36
$$ -424 -64 25 288 14 115 -123 -318 310 185 60 -262 -106 250 98 26 413 287 -288 -132 208 344
1010C44k80o7k3m3l12L46K35l28j70K85N3P5j04K79K4n37j6K18K04j38l57L62
$$ 344 64 -3 -26 -69 -381 -35 200 -128 -298 -13 40 115 11 290 314 -223 -239 -21 183 45 -312 50
1032E0K1j42q2K15K1l47P9L2J78j43J92J81m13N5M54j7l86J03n7M6k10Q6L43j52
$$ 50 71 -71 -153 62 83 -264 -185 -153 25 -118 74 255 -158 -103 351 334 -52 51 -6 40 -170 -84 259 107
1056A07k97j18K33J66j73J71j0r6r3Q8M39m11q9J8J97j88j4K08J4l72p0M70k43
$$ 107 -190 -308 -75 91 -82 89 79 -17 -110 -22 417 6 -83 -65 132 -56 -70 138 152 -220 -290 180 -63
1079f3O9j88J30J41k06K11J74M3l52k08J79J80J0j8Qk67J4J20N8L8j63K7k2l7
$$ -63 6 -182 -52 89 -117 94 268 311 -41 -249 -70 110 120 102 110 -157 -143 -23 35 73 -90 -63 -85 -122
1103a22J47%J31k40q3L0J86R0q2J35p3q9J60Lj26k08q3J35Q3LQ1J84l72o5K56
$$ -122 25 25 156 -84 -167 -137 49 139 57 192 119 30 190 193 67 -141 -224 -89 -6 -3 78 262 -110 -175 81
1128H1prj28p9P5m7J19K63p9j24k2j24P2m4J69j0j92n6K04K00k45o3O7Q4k81J20
$$ 81 74 65 -63 -142 -67 -114 5 268 189 65 43 -81 -9 -53 116 106 -86 -142 62 262 17 -46 21 105 -176 -56
1154e6L63k83j90J09j11M5J75j46J55O4l04K29J17j22j23j27J78O7R1j89L44q9
$$ -56 307 24 -166 -57 -168 -123 52 -94 61 125 -179 50 167 45 -78 -205 -27 40 131 -58 286 197
1176A97l32K23rj32Q9k02K17k41J40N7J62j06j3m5l8Nk0J50k87J27J19oJ2K7R4
$$ 197 -135 88 79 -53 36 -166 51 -190 -50 7 169 63 50 5 -33 -28 -48 102 -185 -58 61 55 67 94 188
1201A88m28J29J0K98r5k18M6J81k80K33n1P4K6k39R5K69j64p4q5M4J62k73L52
$$ 188 -240 -111 -101 197 102 -116 -70 111 -169 64 13 87 113 -126 -31 238 74 0 -85 -41 121 -152 200
1224B00Rj24k82K40O1n0k52J04P1q9N7P6Q6l5r0K18j30j66n3K30j8j18N6J38r2
$$ 200 209 85 -197 43 104 54 -198 -94 -23 -112 -55 21 107 72 -18 200 70 -96 -149 81 63 -55 1 139 47
1249D7l6k9n5M2L5k1M0R9o5L4r1OQ5kj32o8o0L48r2p7oJ9l9l0O1J50l12l1J37
$$ 47 11 -18 -73 -31 4 -17 23 122 57 91 0 6 91 89 -43 -111 -171 177 85 8 2 21 -18 -48 13 163 -149 -180 -43
1278d3m5J56J17j88M2j82K49j40O5n7K69l16L1J45M0L5k19J5p1J58n4J38n2p9
$$ -43 -88 68 185 -3 39 -143 106 -34 31 -26 243 -73 -42 103 143 178 -41 -26 -97 61 7 145 93 14
1302A4q5j6m4J37l9o9Q2j7J36J31k51Q9j76k7J20J82l55K96j11j08P6J04P4m6
$$ 14 -71 -87 -131 6 -33 -102 -20 -37 99 230 -21 68 -108 -135 -15 167 -188 108 -3 -111 -35 69 143 97
1326I7r9J10k4j13K05j31j83O8O8p0Q5l2O4n1q2R4O7q1k6r4k3J40nJ49j82K12
$$ 97 -2 108 84 -29 176 45 -138 -70 -2 -72 13 -19 45 -6 -88 6 73 -8 -34 -128 -151 -11 -16 133 -49 163
1352A63l30J13P3O2q8m7k2Q2L6J31j36jj09n1K13k3j83J73K7O7k18Q4K6n6N1j27
$$ 163 -167 -54 19 81 -7 -54 -76 6 42 173 37 36 -73 -124 89 66 -117 56 83 150 -68 16 42 -14 37 -90
1378i0PK66j84p7J33j51K16j40K3J3P0pQ7j87l0J13K36l11P4J69k04p6o6J57j13
$$ -90 -83 183 -1 -78 55 -96 120 -20 3 16 86 79 166 -21 -51 62 298 -13 61 230 26 -50 -116 41 -72
1403g2O7Q7j73Q0Mr0J74mJ08j80Jm3jN3L9J22j32P5q8p1J44j85J22P0m13K92J9
$$ -72 -5 82 -91 -11 -7 -97 77 73 181 1 2 -41 -42 11 50 172 40 115 27 -44 100 -85 37 107 -306 -14 5
1430El2j1R0j67K90l10J8J65M8j08n4K5K36k64K01j12j42J95j18O9q2j45K08M9
$$ 5 -27 -38 52 -115 175 -135 -117 48 96 -12 -66 -41 195 -69 132 20 -122 73 -45 24 -58 -203 5 54
1454E4qp4O7j03j44L25j28p4P9j8q6L27j75Mp0k3J97j15j21J96l68L00n0J68j98
$$ 54 46 -28 39 -64 -208 117 -11 -85 -6 -24 -110 217 42 46 -24 -47 150 35 -86 110 -258 42 -8 160 -38
1479c8J60k14J88j1r3NMN3O9r8k42J93rO5q3L6P7j80o8J79J06q2q5j6R4Nl1R7
$$ -38 122 -92 96 85 -8 -3 1 54 123 25 -217 -24 -33 32 -51 -15 62 -118 -186 -7 99 17 -68 -84 10 15 -16 81
1507H1q0j04J93j28N1K7j26O7J34J21k38p1J4P0J36l0q1p1j5k5J42m5l7J42q7
$$ 81 1 -103 90 -38 13 40 -86 -19 115 236 -2 -73 -59 11 147 117 36 -35 -50 -75 67 22 -15 127 40
1532D0r9J0O0j26Q5l6J39j54M11K22m99j06J61op9j4j15K34k07j40K01J4k2QK8
$$ 40 -59 -49 11 -115 -30 -66 73 -81 330 552 53 -53 108 102 23 9 -106 128 -79 -219 -18 -4 -26 -18 10
1557A0j45J29J41j63p1J15k1M7j37J01j9j88J79p1J09J04o0r4n1J03Q9K4k63R8
$$ 10 -135 -6 135 -28 -99 16 -5 42 -95 6 -13 -201 -22 -93 16 120 60 -34 -85 18 107 131 -132 -34
1581c4j2N7J16p7j17J91j67kJ3Ok1R8p4l7J03jL0r4L6L2k84K56m4j15l5J66J04
$$ -34 -46 11 127 50 -67 124 -43 -45 -32 -26 -47 51 -23 -60 43 42 72 -22 14 46 -238 18 -26 -141 -176 -10 94
1608I4r5p7J11p8J84q3o0k11J83q8J88K0J78j51o3j76L2J20P2p8k85J86M3Q0Q2
$$ 94 -1 -78 33 -45 139 56 -4 -215 -32 -120 68 88 266 115 52 -124 -92 28 100 22 -263 -77 -34 46 128
1633A28j20K4L1k76K03J06j84PO2R7o5J0l2p1n0L08j47j79J37n1N5O1Q4j42KL0
$$ 128 8 32 63 -213 -10 96 -88 -81 -19 78 13 23 -9 -80 -130 178 31 -148 -11 -62 -7 54 138 -4 -2 28
1659B8j0l0O8rr6l7P7K60j08o9q7K6J25j30N8m6k2L4j66K28L2j83J39M7lk72J98
$$ 28 18 -12 56 47 -49 -86 -9 251 143 74 -13 13 138 8 66 20 -2 32 -134 94 126 -57 82 129 126 -146 52
1686E2p6J11m2L6r9j36J38K28K0k91J77l7q2q3J38J4q9mP0j41N9J5P0N7q6r5R2
$$ 52 -24 87 45 81 -18 -154 -16 212 232 -59 118 81 -1 -84 54 68 -21 -25 45 -96 -37 -22 48 105 19 -76 16
1713A6j6P4N9kj81K19l02K41j27m0J29m4KmNk6m4K90j48j57nll3J3l7K41N5k49
$$ 16 0 74 133 131 -50 169 -133 108 -19 -59 70 26 28 24 29 3 -41 249 101 -56 -61 -64 -97 -84 -121 120 175 -74
1741g4k7J63j43J8J64k14R6Q3j75J82j72K13k18p3J79K9O2m8j86l7J63L2n3o7
$$ -74 -101 62 -81 -63 101 -113 -17 66 -109 73 -99 114 -104 -177 2 31 93 45 -141 -178 -15 17 -36 -103
1765a03R2Pl9J45Q5j98OJ3r1P9O8j22P7o2O2l5J8l5P4Q7j26j2N6O7j94p1m2K57
$$ -103 -11 -4 -43 102 187 -11 -5 8 -83 -4 64 -58 19 -43 19 -16 2 -33 41 128 2 -10 46 113 -81 -152 -194 63
1793F3q4p1j1J01K4j65P7O3J1R0j25j19J54P0N1k40k5Q4J55qj44K31k76J3m5O1
$$ 63 -21 -92 -103 -2 22 -143 -66 -3 8 98 -27 -146 8 78 129 -111 -136 -52 103 95 -49 182 -94 -81 -126 -65
1819f5k5J86J4p9J97j45j80Q0K1k3PPj5m0Q5k5q1m7K37o6j00J21n5K6K0n2p6n7
$$ -65 -90 96 110 31 228 83 -97 -17 4 -19 -12 -5 -20 -60 25 0 -81 -128 109 43 -57 64 9 35 55 3 -73 -130
1847a30Q6J54k84K39q8J84k07m9P8o8J32p6Ol7K12q9K2k47J30M7k2N4NM8k39J12
$$ -130 -44 110 -174 65 -23 161 -46 -95 -17 -85 47 -29 -23 -60 152 63 85 -162 -32 15 -7 47 52 100 -139 -27
1873b7k2j5K1Q9j10O6N8N7j44Q2m14q6J84M23K52m14N9m74M51P0j67J78q4M08
$$ -27 -49 -64 -43 46 -64 2 60 117 -27 55 -359 -445 -261 162 414 0 59 -415 36 106 -61 117 33 441
1897D41o0o25R5L49L49m00j83Q8l25K03l68M58J02n3J18j25l49L70L93l31j63
$$ 441 381 -244 -149 200 549 149 -34 54 -271 -68 -436 22 124 71 189 64 -285 85 478 147 -16
1918a6j28J96J85j1K3m17n15R06rm15J84Q0l34M08l2M18m93P9j24n97M31N67k69
$$ -16 -144 52 237 226 249 -168 -683 223 214 -201 -17 63 -271 137 105 523 30 109 -15 -612 -181 386 117
1941A17l96R8L29n60L29M31o04L27Q9l12m0O70m91l27oO04M7l90m95J233q48l50
$$ 117 -279 -181 148 -412 -83 348 -256 71 160 -152 -192 478 -13 -340 -346 258 305 -85 -580 653 -195 -545
1963e45O37O63q68n5M71m20K25l81K04K7k21N72m25L83k44j78O3k77M78k02J13
$$ -545 92 755 -113 -168 303 -117 108 -273 -69 -42 -263 309 -116 267 23 -155 -92 -369 109 -93 20
1984B0j02K45jk68rQ1K08k91J68k38N84p8k56l35J93J12N6n7J30j82m17N17k17
$$ 20 -82 163 162 -106 -115 -34 174 -117 51 -187 397 319 63 -272 -79 33 89 32 162 -20 -437 80 -137
2007a37j16K83l12M61j40k25K34J19j88j7j20mm5M0R4K35R2m12J51j00j87M24
$$ -137 -253 30 -282 179 39 -186 48 167 -21 -38 -158 -162 -207 -167 -73 162 254 -158 -7 -107 -294 130
2029A30m1k15K05m5M0rr3Mk8r9L76m44K06J36K2k82J17J62R2m00N3J85j70J32
$$ 130 89 -126 79 34 74 65 -28 -24 -52 -151 225 -219 -13 123 145 -137 -20 142 234 -166 -113 72 -98 34
2053C4o2j37J48O8l44K95j85J22O5J01Lj10l9N9P1m4o5J28j50R0j79K06N4j18
$$ 34 -28 -165 -17 51 -293 2 -183 -61 4 105 108 -2 -41 18 89 45 -20 108 -42 48 -131 75 129 11
2077A1or7N6L5L3L7m4J92j34o2j22K08r4m6P9K1J06j37r6R0l2o2K0r5K74k60N6
$$ 11 5 -92 -36 -1 32 69 25 217 83 21 -101 107 13 -33 46 67 173 36 -60 30 -2 -64 -44 -139 135 -125 -69
2104f9R7J5J05l5j10J5N0L7j06M2Q3P6k15l1Pj1O2P7j00J71p4mr9K7RN9j51N7
$$ -69 28 43 148 113 3 18 68 105 -1 41 124 200 -15 -46 -39 -50 12 89 -11 160 86 82 -17 10 19 78 -73 -16
2132a6P4j84Q1o5nO7r6M1K38k19J44j1j27Q1K7P2j53N9j58J24J29L9k35N7J86
$$ -16 58 -126 -45 -110 -115 -48 -144 -103 135 -84 60 49 -78 3 30 102 -51 8 -150 -26 103 142 -93 -36 150
2157A50K3j85J66k04J34j41k3k7K25J8j39K05j13j02K5Q2k80J77%o1L2K38j72
$$ 150 173 -12 154 -50 84 -57 -80 -107 118 136 -3 202 89 -13 12 94 -186 -9 -9 -70 -38 200 28
2180B8k6k9m3P7J33k59J61j99O2R4K9r5o5O0N4n0L9M2K0k0K28l40P5M7jok4J5
$$ 28 2 -27 -70 7 140 -119 42 -157 -95 -1 28 -67 -132 -72 -18 -68 -29 13 33 13 241 -99 -24 23 22 16 -8 7
2208Gn1O9j7L3j27K56k54J64q0J22j9k16K17j17j37J74j38R8L9J0k13J02J56n2
$$ 7 -44 25 8 41 -86 170 -84 80 0 122 103 -113 104 -13 -150 24 -114 -16 23 33 -180 -78 78 26
2232B6j19J49k8J21O0l12L14k36J6P4r7qj36M8J41o6M9M2l09K38J35j18J48k52
$$ 26 -93 56 28 149 209 -103 211 -25 -9 65 -32 -40 -176 -128 13 -53 -4 38 -271 -33 102 -16 132 -120
2256a20K04o3q8P0j55K24j95L8KMJ28r2J25j92O7Q0K2m9l2J02k46R3J39r2K2K03
$$ -120 84 21 -67 3 -152 72 -123 -85 -83 -79 49 -43 82 -110 -43 37 59 10 -22 80 -166 -73 66 -26 -4 199
2282A99k44N7%O6j19L0NL1k18J64n0J98j78R5Q2q9M0m2k25K89j58N6k7K05k24
$$ 199 -45 12 12 78 -41 -11 -6 25 -193 -29 -79 119 -59 36 118 29 69 27 -198 91 -67 -11 -38 167 -57
2307e7l1K02j54p8N6P2O2r4L5K0nj34j23K96n9P4j36p3J40j01J20j05J07n2J00
$$ -57 -88 114 -40 -118 -62 10 72 -22 13 33 28 -106 -229 67 8 82 -54 -127 13 -88 32 -73 34 -18 82
2332H2p9J4n6J06o4j8O7K4j37J76k6k17P5LJ34k2j07n6J86mp7j4L7nJ42j58J25
$$ 82 3 17 -39 67 3 -15 52 76 -61 115 89 -128 -53 -50 84 62 -45 -101 85 81 4 -10 27 22 164 6 131
2359A31j79J85r8j09l4J29k44K76P7j47l2J00jmJ3j71J28j27J30j9j15J83P0j65
$$ 131 -48 137 39 -70 -104 25 -219 57 134 -13 -45 55 54 50 63 -108 20 -107 23 4 -111 72 142 -23
2383b3J09M1j94k1K15l92M80k97O4K05k04k75K91mJ45J42n61k5o0L91N66m75o10
$$ -23 86 127 -67 -88 127 -265 215 -82 -18 187 -17 -292 -1 -5 140 282 -279 -304 -364 27 593 118 -492
2406d92O61o64N44O47m69k54J22l0L91k04m50P66l31l08j57K70J90j82K33M96
$$ -492 169 -495 49 696 227 -27 95 65 456 252 -198 568 237 -71 -228 42 232 50 283 779
2426G79q12N43o55K7O2Q1j8r0K42l28J59j77N3L35j10p3j4o6J28nl9k3m8j9J83
$$ 779 -33 510 -145 -118 -56 25 7 -83 159 -169 -10 -187 -134 201 91 18 4 -62 66 61 22 -1 -49 -68 115
2451A15j24p7P3K1j8J21j49J91j61J65k52J56M1k63J45K5M3o4P8pM3j37n5P1K5
$$ 115 -9 -86 -13 8 -10 111 -38 153 -8 157 -95 61 102 -161 -16 9 52 -12 66 59 102 -35 -90 -19 6
2476Fj6k9J07N9j76K25j55r7J27j8j76O0J1L5R7l0l3K09rj69K2L7q5k35K00O3
$$ 6 -10 -39 68 127 -49 176 21 -76 51 33 -143 -83 -72 -37 60 30 -3 206 197 28 50 87 2 -233 -33 30
2502C0p4j09J67Q5J8j00Pn9J15p4l4J05j71L9Q0J5j30P1K1j04P1K12j42q7j8Q6
$$ 30 -44 -153 14 99 117 17 24 -35 80 6 -28 77 -94 -55 25 40 -90 -19 2 -102 -31 181 39 -48 -66 20
2528B0j27R1pN9J3J2q9k3P6M2J29k51M1j71K21O9j38M1Q8j82P3j02J00M8n7M0
$$ 20 -107 -16 -23 36 49 61 -28 -51 25 67 196 -55 -14 -185 36 105 -33 8 96 -86 -13 -115 -15 33 -24 16
2554A6j29lK61k51P4J4m7K8J28j21N3q8l1p5K40K2l1l5j06J8Q8j17J78j91K02
$$ 16 -113 -116 145 -106 -32 -18 -65 -37 91 -30 23 -65 -96 -171 69 91 60 25 -81 -63 25 -92 86 -105 97
2579I7j36l6Q5q4J02P5j03j13K07p3n3P1n0k5L8n4Jj25J26O8m9N1M6M2o9M0k33
$$ 97 -39 -75 10 -74 28 103 0 -113 94 21 -32 39 -11 -36 2 -52 -51 -176 -50 18 -31 20 66 108 39 79 -154
2606a54J31J07l05K24mk8l9K3m7J00J04rk12p3J95Q7O5k02O8M9Q7J0k29J59l64
$$ -154 -23 84 -221 3 -1 -29 -68 -45 -92 8 112 103 -109 -182 13 100 165 -37 31 80 167 177 -52 107 -257
2631b57J61M3K30j92LM1k37K17m6Q8r7K5J76j91M6q2J85N3k00K02j74J6j37J72
$$ -257 -96 -53 177 -15 -12 29 -208 9 -37 51 -46 -21 155 -36 10 -72 113 166 -34 168 -6 10 -127 45
2655D5J49l21J07r2K76q0j10nJ08o9J14lj68K5J8kR5L0j3Nj57J6j51K65N7k93
$$ 45 194 -127 -20 -112 164 84 -26 -31 77 8 122 119 -49 -24 -6 -8 87 117 104 109 -48 -32 -183 82 139 -154
2681a54J72K39l04M3l1R3j09O4P9q8j51J70k0j89K30j13P6Pn3nk5J9J02%k8oJ35
$$ -154 18 257 -47 -4 -35 58 -51 13 92 4 -147 23 3 -186 44 -69 7 14 -39 -44 -69 -50 52 52 24 18 153
2708A53j81J66k78K41j28j16O0o5J93j42l2K67j46Q4jj32Jl9J46l3On2J09m7j52
$$ 153 -28 138 -140 101 -27 -143 -83 -148 45 -97 -129 138 -8 76 75 -57 -56 -95 51 18 24 -28 81 34 -118
2733a18O4J22k25J66j20Q5K2K6j73k53L78N5J29j66l7P7j5r8J10J4k3Jk2M4O9
$$ -118 -54 68 -157 9 -111 -26 -4 22 -151 -404 -26 29 158 -8 -45 32 17 -81 29 43 20 21 -1 43 112
2758A12j43O9N0m3M3j45q0J28j44K38q8m1P9j1j26L8n3Q3j36J11L4J05j1p7r8
$$ 112 -31 38 88 45 88 -57 -137 -9 -153 85 -3 -44 35 24 -102 -64 -117 -34 -170 -59 -25 80 69 -8 -106
2783a06m6l5K25J88k18R1p7r2N8Q7j14k2N5kQ9k07J15J98j98q3J36lj35R2L3j78
$$ -106 -152 -187 38 226 8 99 22 -70 -12 75 -39 -61 -6 -8 81 -126 -11 187 -11 -94 42 39 -96 -4 29 -149
2809a49J24LK05qj47O7p3q5O7j18J20p6Q3j53K02J8l8j2J29J2k34o3J67O1pj77
$$ -149 -25 -22 183 175 28 95 22 -63 4 -114 6 -70 13 -140 62 80 42 30 159 171 -63 -126 41 102 95 -82
2835h2q3K79rq2Q4o9j42J07R6m3m3J29p3N6j8KL9k39P7j13O4Q9J07q0p6R0j29
$$ -82 -165 114 105 23 107 38 -104 3 99 56 13 142 69 125 107 109 148 -91 -14 -127 -63 26 133 53 -23 67 -62
2862f2o4K01O7j70N2q4Q3J04j73J32j94J27J34k70K40j62n0Q1o9O6k9o1Nk8O7
$$ -62 -126 75 142 -28 24 -60 23 127 -46 86 -108 19 153 -117 123 -39 -89 -8 -77 -11 -40 -101 -96 -124 -57
2887e7j5J47j21R7n5j09J52m4k1N3j84J10O7kkK07k00k77L85l3q6j33J54j24o5
$$ -57 -72 75 -46 51 -4 -113 39 -5 -26 27 -157 -47 20 18 16 223 23 -254 131 98 12 -121 33 -91 -156
2912a56J70J51k82K55J06j89JM5q1rm7Q7k30K70nk63K05J4j01J39j83Q4r9J12
$$ -156 14 165 -117 138 244 55 56 101 20 11 -36 51 -179 91 86 -177 28 42 -59 80 -103 -19 -118 -6
2936fj4j4L1R4k0N8k3k7n2J39j07J17j96mn6j00K6J91L4m8m6L0N0j70K26k31L79
$$ -6 -20 -34 -3 91 71 129 106 79 27 166 59 176 -20 -24 -80 -180 -154 37 71 23 -23 7 57 -113 113 -118 261
2963B61m18K52k0M3P8j33k57Q9J21PJ34k32K29l44Q2J01M6q7K04k74k5L09l65
$$ 261 -157 95 75 118 196 63 -194 -105 16 23 157 -75 154 -190 -108 -7 39 -48 156 -118 -143 166 -199
2986a99n3Q0R8L29k13l99M98k73L47l66J17j9O40l38k50O4R5j61L21j9j47o06
$$ -199 -252 -172 -74 255 42 -357 141 -132 215 -151 -34 -53 587 249 -1 63 158 -3 318 299 152 -454
3008d54N62P9o41R79p18l09P67R5l91J61q9m03K27K29J68n13K26k50O95j57l18
$$ -454 108 187 -454 525 -193 -502 265 360 -31 130 41 -362 -135 94 262 -251 -25 -275 420 263 -55
3029e5J96l00L22r7m52M74m4l38O0J92j78J34kJ15k84L39l13J90qJ6K5o1K8Q0
$$ -55 141 -159 163 66 -386 88 44 -294 -234 -42 -220 -86 -88 27 -257 82 -231 -41 -49 -33 -8 -69 -41 39
3053C9n5J27r6j53J00L3Oq3k7K04Q2l0j23j97J38p4k9P7O1P0N6k43K78k87K02
$$ 39 -16 111 15 -138 -38 -5 1 -82 -109 95 177 147 24 -173 -35 -109 -138 -61 0 70 126 -117 161 -126 76
3078G6l5j90l2K90o9J44j61k25J52jJ46P4o3k78R1J42p5Q2J7P2k32o0K20kk34
$$ 76 41 -149 -181 109 40 184 23 -202 -50 -51 95 169 106 -172 -81 61 -14 68 85 157 -75 -135 85 83 -151
3103a51P1Q8OOL4ko5k9L43k22j22Nj68J35j5J59Q4k71L30j99R6l8j88J71j79N6
$$ -151 -80 8 14 20 54 52 -13 -42 301 79 -43 -38 -206 -71 -86 73 157 -114 216 17 113 75 -113 58 -121 -65
3129f5k1R5l3R3j33j41K40P3r3O0o6jM5k43J40M6J00j47N4K79j41j97J16j40J12
$$ -65 -86 9 -24 69 -64 -205 35 108 15 75 9 8 53 -190 -50 -4 96 -51 3 282 141 -56 60 -80 32
3154C2k10J67j75J36q1P4J17j59J54j73K49j48N9j00L7P2r1J0K36k08m7m3Q1j9
$$ 32 -178 -11 -186 -50 -131 -57 60 -99 55 -118 131 -17 42 -58 -21 51 -40 -30 206 -2 -49 -92 -11 -30
3178c0L4M5R1j98P1M0o2q3L23l71J34l6L9N1m5J20k85J43p9O2m9o6L9J63l0p7
$$ -30 4 49 140 -58 13 53 -9 -92 231 -140 -6 -42 -3 48 3 123 -162 -19 -98 -36 -85 -151 -112 51 21 -56
3204e6pK09k04P5O4N1j16n5Q5r5J1R0j67M8lM5J05j9j09K6j37J29k8J17L2j76
$$ -56 -63 146 -58 17 81 132 16 -39 46 -49 -38 52 -115 -67 -70 -25 80 61 -48 -22 -159 -30 -58 59 91 -85
3230h5Q1K5mj17J44j88J86P7k52K7O9J10N1k23J15j82M4J25j62M23k31j25J26
$$ -85 -4 21 17 -100 44 -144 42 119 -133 -106 -37 73 124 -99 16 -166 -122 3 -159 264 33 -92 34
3253C4j12J4o0K7L5N3Q9q6p9J17j43J55j49q4K48Nm2M9j34R7k17L24j2Pj89R5
$$ 34 -78 -64 -124 -97 -62 -9 80 -6 -85 32 -111 44 -105 -189 59 64 22 71 -63 34 -183 141 129 136 -53 42
3279D2K37k52n8Q6k0j74R3K1qJ32j10o2M4L1N5N6k34K13nj22N1r3K6n0l4P5J34
$$ 42 279 27 -31 55 35 -139 -46 -25 -33 99 -11 -73 -29 2 57 113 -121 92 87 -35 16 -77 -51 -101 -135 -60 74
3306G4r2m5k20M39P8l06P5K16k51L8Q3Pk57Q4J89j50N1l9l4p1K26j73j52J92Q3
$$ 74 -18 -63 -283 156 234 -72 3 219 -32 6 89 96 -161 -77 112 -38 13 -26 -60 -131 95 -78 -230 -38 45
3331D5j34J04J46k35K4K3O9p9J12n7j85J73j5J9j00J13j6j71L44j86m9K7o1Q4
$$ 45 -89 15 161 -74 -50 -27 42 -37 75 18 -167 6 -9 10 -90 23 7 -164 180 -6 -55 -28 -89 -5
3355ej7J35k01J59o3M9k5M5m1L0o9r1K33j51ko9J47J9p4P4j3k02R1J06j72K81
$$ -5 -22 113 -88 71 8 57 32 77 36 66 -3 -94 139 -12 -14 -83 64 83 9 83 70 -132 -41 65 -107 174
3381A74k28l7j10O8J79LnJ30l81J49n0P2l6l3K02k52K08j8l4J35j39P5j34O7N0
$$ 174 -54 -91 -201 -133 46 49 44 174 -207 -58 -108 -36 -72 -105 97 -155 53 35 1 136 -3 72 -62 5 55
3406E5k14K82r7p9M0m7Q2N7Ok9J71k39Jj08K05j67N8J7J4R5q2J11n7j34J30Pj5
$$ 55 -159 123 26 -53 -13 -60 22 79 85 56 227 -12 -11 -119 86 -81 -23 -6 8 103 21 132 75 -59 71 78 63
3433F3p2P1j44J07k0p5R8m0j69M17k1j37j18o3j2N8J03m5m8j38J81J2l0L0l7l
$$ 63 -9 62 -82 25 5 -70 28 -12 -181 236 215 78 -40 -103 -115 -57 46 1 -47 -185 -4 8 -22 8 -29 -32
3459c2j42J86K5r5K16j18j70J47m0J64m6k6m2m3j50J26j04Q5j0r0K10j68K60k39
$$ -32 -174 12 37 -58 158 40 -130 17 -23 141 95 69 27 -16 -166 -40 -144 -59 -69 -159 51 -117 143 -96
3483i6K18j42k0J6K0N5k69J29J38j56J12J34j25j22n4J00J23j43J57k6r1K3J78
$$ -96 122 -20 -40 -24 -4 51 -218 -89 49 -107 5 139 14 -108 -162 -62 61 -82 75 49 -42 -19 159
3506A59m7k85J98J00l9j05kM7j18Q8K5R1Q2j76RK2l2m9P7P7l5j16N5k8njK9N4
$$ 159 112 -173 25 125 86 -19 -21 26 -92 -4 21 112 194 18 27 49 17 -32 45 122 87 -29 26 -2 -7 -8 21 75
3534G5Q4k06J10j32J82r5n0r0J48j43J11j23J09n3J52o2m7N8q6L7j53L26O1j9
$$ 75 159 -47 63 -69 113 18 -32 -122 26 -117 -6 -129 -20 -73 79 17 -30 28 -58 -21 -174 152 213 194
3558A94j47K4K4k1L8j58J06r2N2L3r6J4p0k4J22j53J33M6j13rOK96k23l0L4m9
$$ 194 47 71 95 74 112 -46 60 -32 20 53 -43 -29 -99 -123 -1 -154 -21 25 -88 -97 -91 205 -18 -48 -14 -63
3584f3K7L9j4J31j47j5j85J69K4R8l0j2J76l72J81m8J15N0j16N2P1l6j74O4r5
$$ -63 -36 3 -11 120 -27 -42 -227 -58 -34 64 34 22 198 -174 7 -41 74 124 8 60 131 95 -79 -15 -110
3609a10J29j49K35k56J18j8K29j01q3L3j39L2n5m0L00j83o9%J26J65j18J1n6J8
$$ -110 19 -130 105 -151 -33 -51 178 77 -6 27 -112 -80 -135 -175 125 -58 -127 -127 -1 164 46 57 1 19
3633A9K7J96k88L0J36k02J58j02J06Qo9J40j94R4J27l62J87J4P7k32mJ82k8J5
$$ 19 46 242 -46 -16 120 -82 76 -26 80 88 19 159 -35 59 186 -176 11 25 102 -130 -134 48 20 35
3657C5m0O2m6k2j4Q3Q4k14J33r0J14k01K03q5m5O9j36J78j70J18j30%K45k14M1
$$ 35 -5 57 11 -11 -25 58 142 -72 61 -29 85 -116 87 2 -43 26 -110 68 -102 16 -114 -114 131 -83 -42
3682d2Q4j92L39n9k70P4Q4r5k4J44r4J11Qo4m3K1J5k35L02r2k1k1J85J4k04R2
$$ -42 42 -150 189 130 -140 -66 18 -77 -101 43 -51 60 68 4 -39 -18 -3 -238 64 -28 -49 -70 115 129 -75 17
3708A7K4j21R4P0j8M8R3k92Q5J25j79L0j03J33J57l6r2J49j91J09j66J54j60k07
$$ 17 41 -80 14 84 66 114 207 -85 0 125 -54 -24 -127 6 163 127 35 184 -7 102 -64 90 -70 -277
3732b77J89J79j37j01Q2r2J16l9N8l6Q6q7J17j39J5J59K0p6P9j72J0J03l1n4l6
$$ -277 -88 91 -46 -147 -65 -157 -41 -80 -22 -58 28 -59 58 -81 -66 93 113 37 116 -56 -46 57 26 -28 -64
3757f4O3k3l0O7p0J7lp9R3R4j07K9R7O1q0k13L10mj47Mk12K31Q9Lm2o1oj00m4
$$ -64 -1 -24 -54 13 -57 -40 -43 -122 -29 65 -42 -13 84 145 65 -148 162 158 11 15 -197 34 123 126 84 23 17 -83 -127
3786a27K56k30J02J8J9R7Lj42J46k7o4k1p9m9k6K20J47k38k2n6N4j45J41k2J05
$$ -127 129 -101 1 19 38 135 138 -4 142 115 51 30 -49 -98 -124 96 243 5 -17 -73 -19 -164 -23 -45 60
3811F0J7j28J26p5%q9r9L08k08K07p6m3K21k23Kn2J02R8O0r3m30L19k61J11L5
$$ 60 77 -51 75 0 0 -89 -188 120 -88 119 43 0 221 -2 0 -52 50 148 208 115 -315 4 -257 -146 -111
3836a11lo1j6K83m61L90j29q7L30j08K4j36K00j95M5j6J92r0Q1k12L7R5j15J37
$$ -111 -114 -175 -191 92 -369 21 -108 -195 135 27 51 -85 115 -80 -35 -51 141 51 132 -80 -43 52 -63 74
3860G4N8k46J77j63J25r1J11o3m8N7K2j60J72P6j28J33j40m5J57q3J15j66J78
$$ 74 132 -114 63 -100 25 -66 45 -18 -66 -9 13 -147 25 101 -27 106 -34 -79 78 -5 110 -56 122
3883A22r8L2j13M7J7k1jk5O7j64K29o8q9Nl0J17J05j44p0o6M8K2J7r3K78o6j30
$$ 122 24 56 -57 -10 7 -14 -15 -40 27 -137 92 24 -65 -60 -90 27 132 -12 -82 -148 -100 -78 -61 -154 124 58 -72
3910g2O8j3o0P9K33l00J26J8j89J67o2q2J3m5P6j6O6Q2lj91L5o6J40J31j0j9k7
$$ -72 -4 -17 -77 2 235 -65 61 79 -110 57 -5 -87 -74 -119 -43 -59 7 89 86 -105 -70 -136 4 135 125 106 79
3937G9j14K1P4j01kj51K55L5k76N9K05L7j58l0l5J07j38K76p9m7j64J01R1j87
$$ 79 -35 -14 60 -41 -43 -194 61 96 -180 -121 84 121 -37 -67 -102 5 -133 143 64 17 -147 -46 45 -142
3961a42J76k50M5K90k25K44k6N8k34J16k48J45J33o0j83M45l68J19m2n0K8R1j9
$$ -142 34 -216 -171 119 -106 138 112 170 -64 52 -196 -51 82 22 -161 284 -84 35 -7 -57 -29 62 43
3984D3r3N4O7k85J84Jj11M40K5l25m14M71o8N85m94J51j60J07k83j49O24k45K03
$$ 43 -50 4 71 -214 -30 -29 -140 300 325 0 -414 57 -11 574 80 231 71 178 -105 -254 370 125 328
4007C28m29J50J58j7j32l0K84o60Q93p12J75j57K49O3M07o49p3N69l58Lj84m22
$$ 328 -101 49 207 190 58 28 312 -348 545 -167 8 -149 100 163 570 -79 -152 417 59 62 -122 -544
4029e44P51k06L34J27R7n85k42M40k37n9L86l02J44Kj34L02m41o6J23J55k00j08
$$ -544 207 1 335 462 559 -26 -268 172 -65 -124 262 -40 104 106 -28 274 -167 -233 -110 45 -155 -263
4051b63L5L65j16l13L29K59k19o87M71M3L44l84J05m9j2J99j95J62j60O0PM1J90
$$ -263 -228 137 21 -292 37 296 77 -610 -139 -96 248 -136 -31 -80 -92 107 -88 74 -86 -26 -19 22 212
4074B12k04j80L51k61O8J44l6mj76K13k77J82o6J00k27P9K28o7N1j53k37P0L31
$$ 212 8 -172 179 -82 -14 130 94 90 -86 127 -150 32 -34 66 -161 -82 146 79 130 -23 -260 -190 141
4097A41j03r5j55J31K56l40J41K3j54K43j67J4J02q0q8K11r5p6J11k3m4LK42j23
$$ 141 38 -57 -212 -81 175 -165 -24 -1 -155 88 -79 -65 37 -43 -131 80 -15 -91 20 -3 -47 -44 198 75
4121G5k12K10J30j33j67K12k52J42K3m4j4M4p6j7nJ20q4Kk4J89k22rJ37J04l54
$$ 75 -137 73 203 70 -97 115 -137 5 28 -16 -30 14 -62 -79 -84 36 -48 -46 -70 119 -103 -112 25 129 -225
4146b25J25J98j45n4J21J6k30J55p9M4l3QJ32J4K0q1L9Ok3k0k9J71k27Q0k3Q5
$$ -225 -100 98 -47 -101 20 36 -194 -39 -118 -74 -107 -99 33 47 67 -14 25 31 8 -12 -41 130 -97 -17 -40 45
4172D5j39P1N0J02l57J38J12n6L7j7Qj59K93l16J99n0QR5qk19O1O5J0J10j7j02
$$ 45 -94 -23 27 129 -228 -90 22 -34 3 -14 -6 -165 128 -188 11 -39 -31 64 56 -163 -102 -37 -27 83 66 -36
4198c6L7k8M4j33J40j94J02Nl8rN8m4r2L21j69P9N6j80J55rm7n7Ol0P5j38K38
$$ -36 1 -27 17 -116 24 -170 -68 -63 -101 -110 -52 -96 -188 133 -36 43 99 -81 74 65 18 -39 -33 -63 12 -126 112
4225A12l1o8p8P1j14J12j10O6o8J0K49j54q9N7k6J81o9L6j00j4j1K0Q4q2O3L6
$$ 112 81 13 -65 6 -108 4 -106 -40 -108 -98 151 -3 -92 -35 -61 120 51 87 -13 -27 -38 -18 66 -16 47 83
4251H3j23j9J15k82R0J96P3j66J4P0j35K22J4k18K8M2LJn6oJ79j57m7P8M3j41
$$ 83 -40 -59 56 -226 -136 60 133 -33 -19 51 -84 138 152 -66 -38 4 7 8 -48 -54 125 -32 -79 -1 42 -99
4277i9k3k8R6Q8J4Q1j27j58K97k25m5J00J62mk44J70l0M1lK6o0k7O8k01K18j20
$$ -99 -122 -150 -54 34 48 129 2 -156 141 -84 -129 -29 133 129 -115 55 25 66 63 89 29 2 70 -131 87 -33
4303c3o1J06k1J03k85J92J03P6j94O7%J16j46K6p4J80q6o2j08K71m3j73M0J47
$$ -33 -94 12 -9 94 -191 1 104 180 -14 53 53 169 23 49 -25 155 69 7 -101 170 127 -46 -6 141
4327A41Q0k86n8J39q4n2mR1K5J45k24pJ55j14J14k90K76Oj02L1J51j05R0k03K48
$$ 141 221 -65 -123 16 -68 -120 -124 -33 -8 137 -87 -94 61 -53 61 -229 47 53 -49 -18 133 28 118 -85 163
4352A63j26k31K77j63K47P5j73m4M5O6j01j38J9J08o2J14j70J43Q5l22K42r8J30
$$ 163 37 -194 83 -80 167 242 69 25 70 136 35 -103 -84 24 -38 76 -94 49 134 -188 54 -44 86
4375H6o0k05J8J48k19R3J03L3N0j6J6m3k04L85l06L8m2J19n6J01J6j21J47p1K2
$$ 86 26 -179 -161 -13 -232 -139 -36 -3 47 31 47 4 -200 185 -121 -83 -125 -6 -62 39 55 -66 81 10 32
4400C2J3j72J16r4Q8k3R4k6q4P1J48p0j22p4J80k09P8L9j48K30n4k06J10J01j57
$$ 32 45 -127 -11 -105 -17 -40 54 28 -56 15 163 93 -29 -103 77 -132 -54 -15 -163 67 13 -193 -83 18 -139
4425a39J59L1q0j00O6N4m5J2J7O6mM7k73O4J52m8P3r9J3j14O4q9N1J33k62L31
$$ -139 20 51 -29 -129 -63 -9 -54 -42 -25 41 37 84 -189 -125 27 -21 52 -47 -34 -148 -84 -173 -122 11 -251 80
4451H0j25L37m59j65M18m99N54l5k30L1RK14M9l23J00L33p6p9o52J599j274L81
$$ 80 -45 292 -167 -332 86 -413 141 106 -124 -93 -84 130 179 -144 -44 289 213 134 -518 1081 -193 188
4473A88k37k7J98J19m43K81J35O8oj54L46n56j83J7L11l73K68J58o41L44J25N7
$$ 188 -49 -76 122 241 -202 79 214 282 276 122 468 -88 -271 -254 57 -316 -48 110 -531 -187 -62 -5
4495en84Q47m67L82l36j47L17m1k0O2J69m25k68K78M7j22L61K4l99M29n7Q7j20
$$ -5 -589 258 -209 173 -163 -310 7 -34 -54 8 177 -248 -516 -238 -191 -313 48 72 -327 102 45 132 12
4518A2k51L37k9k26J08j19Q4n34L56P8J81J41j39k24L79j79j70L66l84O36q54
$$ 12 -239 98 69 -157 -49 -168 -84 -618 -262 -184 -3 138 -1 -225 154 -25 -195 171 -213 423 -431
4539d31L21J92k1L12m90o04P46K32o31O8N02K0K50K10o69J91l55N07p91N20R8
$$ -431 -110 82 61 373 -117 -721 25 257 -374 -306 196 216 466 676 7 198 -157 350 -441 79 177
4560A77l52j25O42j15k09k35p8m14J477j025M30P6o25R41p83J34j04J98j53q7
$$ 177 -175 -300 342 227 18 -217 -295 -709 768 -257 173 249 -376 565 -218 -84 -188 10 -143 -230
4580b30j06K86M68m43k27R7M72q6q08M61j83Q8O5j96K05j38K43K70j05k66k26
$$ -230 -336 -50 418 -25 -252 -155 317 231 -577 -116 -299 -211 -146 -342 -137 -275 -32 238 133 -133 -359
4601c59j73M63k07L92j19J76n1J14n30j59R7O24k43q66Q74J50o70R33l85k88J75
$$ -359 -532 -69 -276 116 -3 173 122 236 -294 -453 -356 268 25 -841 33 183 -487 446 61 -227 -52
$$ [...]
8191g7
##END NTUPLES=NMR FID
##END=
