##TITLE=1H_DE-80H_X3
 200.13MHz, d2o
 8 sc
 
 19ns.26.2.2025
##JCAMPDX= 6.0         $$ Bruker NMR JCAMP-DX V2.0
##DATA TYPE= NMR FID
##DATA CLASS= NTUPLES
##ORIGIN= UXNMR, Bruker Analytische Messtechnik GmbH
##OWNER= pz
$$ XWIN-NMR		Version 3.5
$$ Tue Jun  2 17:08:24 2026 Russian Standard Time (UT+4h)  Yarkov@DPX200
##.OBSERVE FREQUENCY= 200.1313
##.OBSERVE NUCLEUS= ^1H
##.DELAY= (6, 6)
##.ACQUISITION MODE= SIMULTANEOUS
##.ACQUISITION SCHEME= undefined
##.AVERAGES= 8
##.DIGITISER RES= 18
##SPECTROMETER/DATA SYSTEM= spect
##.PULSE SEQUENCE= zg30
##.SOLVENT NAME= DMSO
##.SHIFT REFERENCE= (INTERNAL, DMSO, 0, 14.3821)
##AUDIT TRAIL= $$ (NUMBER, WHEN, WHO, WHERE, WHAT)
$$ ##TITLE= Audit trail, XWIN-NMR		Version 3.5
$$ ##JCAMPDX= 5.01
$$ ##ORIGIN= Bruker BioSpin GmbH
$$ ##OWNER= Yarkov
$$ C:/Bruker/XWIN-NMR/data/yarkov2/nmr/H-C/1/audita.txt
$$ ##AUDIT TRAIL=  $$ (NUMBER, WHEN, WHO, WHERE, WHAT)
(   1,<2026-06-02 17:06:42.39 +0400>,<Yarkov>,<DPX200>,
      <created by zg, POWCHK disabled, PULCHK disabled
       configuration hash MD5:
       00 E9 B6 7A A2 85 ED C7 34 08 36 98 17 FE 4E 26
       data hash MD5: 16K
       41 5D 95 E0 1A 2A DF 51 9B 32 91 C4 C5 9C 5C 60>)
$$ ##END=
$$ 
$$ hash MD5
$$ DD 20 F0 16 F7 C9 C5 EA 92 04 C1 93 8C 4C FA 05
##$RELAX= 
##$RELAX= 
##$RELAX= 
##$RELAX= 
##$RELAX= 
##$RELAX= 
$$ Bruker specific parameters
$$ --------------------------
##$DU= <C:/Bruker/XWIN-NMR>
##$EXPNO= 1
##$NAME= <H-C>
##$PROCNO= 1
##$TYPE= <nmr>
##$USER= <yarkov2>
##$AMP= (0..31)
100 100 100 100 100 100 100 100 100 100 100 100 100 100 100 100 100 100 
100 100 100 100 100 100 100 100 100 100 100 100 100 100 
##$AQSEQ= 0
##$AQ_mod= 1
##$AUNM= <au_zg>
##$AUTOPOS= <>
##$BF1= 200.13
##$BF2= 200.13
##$BF3= 200.13
##$BF4= 200.13
##$BF5= 200.13
##$BF6= 200.13
##$BF7= 200.13
##$BF8= 200.13
##$BYTORDA= 1
##$CFDGTYP= 0
##$CFRGTYP= 5
##$CHEMSTR= <none>
##$CNST= (0..31)
1 1 145 1 1 1 1 1 1 1 1 1 1 1 1 1 1 1 1 1 1 1 1 1 1 1 1 1 1 1 1 1 
##$CPDPRG= <>
##$CPDPRG1= <>
##$CPDPRG2= <>
##$CPDPRG3= <>
##$CPDPRG4= <mlev>
##$CPDPRG5= <mlev>
##$CPDPRG6= <mlev>
##$CPDPRG7= <mlev>
##$CPDPRG8= <mlev>
##$CPDPRGB= <>
##$CPDPRGT= <>
##$D= (0..31)
0 0.7 0 0 0 0 0 0 0 0 0 0.03 0 0 0 0 0 0 0 0 0 0 0 0 0 0 0 0 0 0 0 0 
##$DATE= 1780405601
##$DBL= (0..7)
120 120 120 120 120 120 120 120 
##$DBP= (0..7)
150 150 150 150 150 150 150 150 
##$DBP07= 0
##$DBPNAM0= <>
##$DBPNAM1= <>
##$DBPNAM2= <>
##$DBPNAM3= <>
##$DBPNAM4= <>
##$DBPNAM5= <>
##$DBPNAM6= <>
##$DBPNAM7= <>
##$DBPOAL= (0..7)
0.5 0.5 0.5 0.5 0.5 0.5 0.5 0.5 
##$DBPOFFS= (0..7)
0 0 0 0 0 0 0 0 
##$DE= 6
##$DECBNUC= <off>
##$DECIM= 32
##$DECNUC= <off>
##$DECSTAT= 4
##$DIGMOD= 1
##$DIGTYP= 9
##$DL= (0..7)
0 120 120 120 120 120 120 120 
##$DP= (0..7)
150 150 150 150 150 150 150 150 
##$DP07= 0
##$DPNAME0= <>
##$DPNAME1= <>
##$DPNAME2= <>
##$DPNAME3= <>
##$DPNAME4= <>
##$DPNAME5= <>
##$DPNAME6= <>
##$DPNAME7= <>
##$DPOAL= (0..7)
0.5 0.5 0.5 0.5 0.5 0.5 0.5 0.5 
##$DPOFFS= (0..7)
0 0 0 0 0 0 0 0 
##$DQDMODE= 0
##$DR= 18
##$DS= 0
$$ [...]
##$SUBNAM2= <"">
##$SUBNAM3= <"">
##$SUBNAM4= <"">
##$SUBNAM5= <"">
##$SUBNAM6= <"">
##$SUBNAM7= <"">
##$SUBNAM8= <"">
##$SUBNAM9= <"">
##$SW= 18.0517328524113
##$SWIBOX= (0..15)
0 0 2 0 0 0 0 0 0 0 0 0 0 0 0 0 
##$SW_h= 3612.71676300578
##$TD= 16384
##$TD0= 1
##$TE= 0
##$TE2= 300
##$TE3= 300
##$TEG= 300
##$TL= (0..7)
0 120 120 120 120 120 120 120 
##$TP= (0..7)
150 150 150 150 150 150 150 150 
##$TP07= 0
##$TPNAME0= <>
##$TPNAME1= <>
##$TPNAME2= <>
##$TPNAME3= <>
##$TPNAME4= <>
##$TPNAME5= <>
##$TPNAME6= <>
##$TPNAME7= <>
##$TPOAL= (0..7)
0.5 0.5 0.5 0.5 0.5 0.5 0.5 0.5 
##$TPOFFS= (0..7)
0 0 0 0 0 0 0 0 
##$TUNHIN= 0
##$TUNHOUT= 0
##$TUNXOUT= 0
##$USERA1= <user>
##$USERA2= <user>
##$USERA3= <user>
##$USERA4= <user>
##$USERA5= <user>
##$V9= 5
##$VALIST= <valist>
##$VCLIST= <CCCCCCCCCCCCCCC>
##$VD= 0
##$VDLIST= <DDDDDDDDDDDDDDD>
##$VPLIST= <PPPPPPPPPPPPPPP>
##$VTLIST= <TTTTTTTTTTTTTTT>
##$WBST= 1024
##$WBSW= 4
##$XGAIN= (0..3)
0 0 0 0 
##$XL= 0
##$YL= 0
##$YMAX_a= 212340
##$YMIN_a= -161679
##$ZGOPTNS= <>
##$ZL1= 120
##$ZL2= 120
##$ZL3= 120
##$ZL4= 120
##$ABSF1= 10
##$ABSF2= 0
##$ABSG= 5
##$ABSL= 3
##$ALPHA= 0
##$AQORDER= 0
##$ASSFAC= 0
##$ASSFACI= 0
##$ASSFACX= 0
##$ASSWID= 0
##$AUNMP= <proc_1d>
##$AZFE= 0.1
##$AZFW= 0.1
##$BCFW= 1
##$BC_mod= 2
##$BYTORDP= 1
##$COROFFS= 0
##$CY= 83.5205535888672
##$DATMOD= 1
##$DC= 2
##$DFILT= <>
##$DTYPP= 0
##$F1P= 10.8118882576601
##$F2P= -7.23987719738617
##$FCOR= 0.5
##$FTSIZE= 0
##$FT_mod= 4
##$GAMMA= 1
##$GB= 0.15
##$INTBC= 1
##$INTSCL= 1
##$ISEN= 128
##$LB= 0.25
##$LEV0= 0
##$LPBIN= 0
##$MAXI= 10000
##$MC2= 0
##$MEAN= 0
##$ME_mod= 0
##$MI= 1.114404
##$NCOEF= 0
##$NC_proc= 0
##$NLEV= 6
##$NOISF1= 3.799351
##$NOISF2= 2.8
##$NSP= 1
##$NTH_PI= 0
##$NZP= 0
##$OFFSET= 14.38212
##$PC= 1
##$PHC0= -6382.496
##$PHC1= 21.22195
##$PH_mod= 1
##$PKNL= yes
##$PPARMOD= 0
##$PSCAL= 0
##$PSIGN= 0
##$REVERSE= no
##$SF= 200.129724274929
##$SI= 16384
##$SIGF1= 3
##$SIGF2= 2
##$SINO= 400
##$SIOLD= 16384
##$SREGLST= <1H.CDCl3>
##$SSB= 0
##$STSI= 0
##$STSR= 0
##$SW_p= 3205.1282051282
##$SYMM= 0
##$S_DEV= 0
##$TDeff= 0
##$TDoff= 0
##$TI= <>
##$TILT= no
##$TM1= 0
##$TM2= 0
##$TOPLEV= 0
##$USERP1= <user>
##$USERP2= <user>
##$USERP3= <user>
##$USERP4= <user>
##$USERP5= <user>
##$WDW= 1
##$XDIM= 8192
##$YMAX_p= 0
##$YMIN_p= 0
$$ End of Bruker specific parameters
$$ ---------------------------------
##NTUPLES= NMR FID
##VAR_NAME=  TIME,          FID/REAL,        FID/IMAG
##SYMBOL=    X,             R,               I
##VAR_TYPE=  INDEPENDENT,   DEPENDENT,       DEPENDENT
##VAR_FORM=  AFFN,          ASDF,            ASDF
##VAR_DIM=   8192,          8192,            8192
##UNITS=     SECONDS,       ARBITRARY UNITS, ARBITRARY UNITS
##FACTOR=    0.0002768,     1,               1
##FIRST=     0,             0,               0
##LAST=      2.2672688,     0,               0
##MIN=       0,             -161679,         0
##MAX=       2.2672688,     212340,          0
$$ Real data points
##PAGE= N=1
##DATA TABLE= (X++(R..R)), XYDATA
0@%%%%%%%%%%%%%%%%%nJ3j6J6j6J6k4L2l2L9m7N3o1P0q1R1j04J18j32J49j70J91
39A00k13K37k62K91l24L61l99M41m87N36n92O53p19P91q71R61j062J176j304J450
59G64j620J818k057K350k711L177l807M710o119Q747k1892P1465p5835j40669
73a61679N3229M9231n258j5319k0756J841O7173J4783n0305J620O0074J8098j7296
86d564j1634P639K0910J0075k3716j1063K3357J6132j4316j1155N340J3002N092
99B5099j0277j1604P008R572p166j2610K63N786R83o642p293J494O641j860p471
114h077k55N440J054k585j954J504L802J932k767j540L529K643k050j750R57J483
130A366K11j183r28P89J503l67j358l3R86K50o82o70K8M49J86n46n86L33K78j70
$$ y = [0, 0, 0, 0, 0, 0, 0, 0, 0, 0, 0, 0, 0, 0, 0, 0, 0, 0, -5, 8, -8, 8, -8, 8, -16, 16, -16, 23, -24, 29, -32, 38, -43, 48, -56, 62, -70, 79, -91, 100, -113, 124, -138, 153, -171, 190, -209, 232, -255, 281, -311, 342, -377, 414, -457, 504, -558, 618, -686, 764, -856, 962, -1095, 1255, -1456, 1721, -2086, 2624, -3495, 5252, -16640, 54825, -21010, -161679, -108450, -59219, -64477, -79796, -100552, -98711, -31538, -16755, -67060, -65440, -5366, 12732, -4564, -16198, -8559, 12351, 22426, -1290, -12353, 11004, 27136, 12820, 1665, 7005, 20007, 25099, 14822, 3218, 10226, 19798, 12632, 22, 285, 6071, 7054, 412, -6881, -5387, 1254, -606, -8077, -8332, -2892, -1838, -4423, -6377, -4873, -1071, 861, -1906, -3446, 83, 2726, 676, -1074, -117, 1366, 1577, 394, -534, 255, 1758, 1391, 33, 0, 986, 1236, 554, -116, -88, 361, 547, 1, -585, -252, 26, -144]
150a44l85j89L08M47l26j23j5M63n9j16j64L93L14k51j45k15K30K56l28j10J29
171c0J21J18k88R6j32L69l16R5qJ35j90J22P4j58l8q4m3J94L2j69m0J17K5K0J97
196B19j08j2j05J16k43K79k30J09J1Kn5q1J26j20R5Rj63J57J71j50J15j15J15
219A42j21m5l6O5q6K41n3k00J65p1J05jj32J54j55k62L26N3j26N4J54j33n0Ok0
244b6j4J18j27q0N0J6J6R6j14N4K12j94l8J06J7j9j67O8L4O7q7m9j9O6J62j90
270d2J89j65K6M3l0m3J4L3m8n3r1K52j45Oj9o3K91k32rr8K13Mj58K29k52O8J45
297F5j10L9J90j77NMj21P0M5O9j18J81j86mj19L03j39l6J8j01K35j21J31k24J87
322H6M0k06M9J44k43J09l1J01K5lj15lq5K00m4q2q1n8J16J35j77Q2l7J28j8q3
$$ y = [-144, -529, -718, -410, 37, -289, -412, -427, 36, -23, -139, -303, 90, 404, 153, 8, -207, 23, 279, -49, -159, -30, 91, 209, -79, 17, -115, 254, -62, 33, 25, 160, -30, 92, 166, 8, -30, -114, -157, 37, 69, -100, -140, -23, 2, 22, 219, 111, 99, -6, 110, -133, 146, -84, 25, 36, 38, -17, -98, 28, -92, 3, 12, -151, 6, 177, 27, 142, 27, 142, 21, -24, -60, 5, -81, 160, 107, -93, 72, 1, 106, 105, -27, 127, -28, -290, 36, 89, -37, 17, 171, 38, -12, -6, -26, -40, 78, -49, -129, -79, -63, -47, 49, -65, -11, 201, 7, -31, 75, 92, 73, -94, -26, 8, 75, -12, -61, -80, -14, 148, -42, 147, -18, 8, 51, 21, -22, -8, 25, -23, -76, -167, 85, -60, -54, -73, -136, 155, -77, -86, -184, 29, 33, -125, 104, -148, -80, 65, -45, -6, 184, 7, 12, 16, -105, -35, 10, 79, -39, 142, -44, -48, -167, 136, -3, -39, -21, -122, 113, -8, 123, -101, 86, 126, -80, -31, 113, -130, -21, -52, 49, 74, 71, -44, -47, -132, 68, 24, -58, -139, -197, -81, 54, -123, -41, -78, 50, 32, -51]
348e1J43k7k14J2J48N5j57R3Q1p4q7Q9j4l2o6O4O8k22J60J3M9oP8r0o9k0P7j01
376a00Q3O6n0M1R5m2k07J91L3J2k2j76R5n1l4P5j08K13j15n2J4N5j11R1qO7j02
403d7m7J15o1M8J23J3j07o3M3J9k5p0P2N3j8j30NJ16qJ4J4K2K3l6k08J11k7J6
431d0P6j66N3K6o6K51j21p5kj34K65j40n3Q8J73q9k16R6K7J88L4k52J4J45L4m5
457G1j07j0j0J28p6L6k0N2j09K2K8j04J75m6j11K23j50L4j5p2Q0j6j4l1Q1Lj3
484B9M5p6j92K39k5M7r6J04j18n9K80l32K5N4L7LJ68k46J98j38J5O5p0P2J0O1
510A00j13J97j29j35N8r6n6J62J31j64JJ36k13R8K22Mk60N6Q0O9k59K33r1J06
534A37k11jkO1j10J09j13K71j95l7O8L2Mn5J06o9R4o5j21K19q6l2q7O4j7J5K16
$$ y = [-51, 92, 65, -149, -137, 11, 66, -91, 2, 83, 9, -78, 11, -3, -35, -101, -37, 31, -191, -31, -18, 31, 25, 103, 13, -56, -76, 1, -100, -17, 49, -1, 40, 135, 93, -114, 77, 110, 122, 100, -76, 19, -32, -66, 9, -99, 114, -1, -53, -39, 16, -95, -4, -12, 55, -47, -94, 21, -40, 8, 131, 144, 37, -26, 17, 36, 11, -59, 13, 66, 48, -82, -77, 39, 31, 45, 59, 81, 104, 68, -140, -29, -56, -40, 36, -130, -77, -51, -117, 134, 13, -62, -64, -198, 67, -73, -126, -38, 135, 46, -170, -74, -47, 141, 175, -77, -63, 82, 116, 71, -36, -46, -56, 72, -4, 32, 12, 64, -45, -23, 5, -99, 76, 30, -81, 142, -8, 26, 11, -61, 19, 3, -11, -42, 39, 42, 29, 74, -2, -194, 45, 20, 67, -29, 75, -43, -102, 178, -154, -129, -75, -38, -35, 133, -113, 85, -53, -38, 27, -43, 29, 39, 100, -13, 184, 55, -80, -22, -118, -174, -12, 119, -45, -44, 92, -121, -23, 199, 203, -57, -1, 79, 148, -111, 122, 31, 137, -74, -75, -77, -16, -126, -17, -130, 141, -54, -91, -23, 9, 13, -42, 64, -5, 89, 24, -97, 122, 36, 4, -83, -19, -36, -21, 195]
561A95j36n7j43L83j75j59n3J57r4P8r8J59j15R3J24k71J65p8m1P1l9J15m1j1
585B9k7K4j09n2J83o1o3J7J94k62R0M9m5j28J24q9Q8J81j94K09k08j7j4K0J59
610I8j09n1J30j20P8j12J66R1k95J38M4o3M9q4N4o8j53K24l0l4m1J86j48J9j6
635d7J60k62K28n3q4K69k76R5K5K22m40J30L4j20M5J7J26n0Lj30K57k04Q4j66
659a37K52J72j34l52J42l4OJ47j03JN2J12k48L8J59p2j00J2L4m1L2J27j03p7Q4
684c1j14N2J62o5J94k29p4J70j40P8r4R7O0k19m1K73n0j61J25L1O8m2N4j32j52
709a80Q0N2j4J31j34J06q5J51j84N1J31n0j28j20J09j27K44j4r5M4j51K52j17
732d8J23k9j93J56R1k13j04J61K40k01J79j37J24k24M8R2p6K2m0p1o7M38k53k0
$$ y = [195, 59, 2, -141, 242, 67, -92, -145, 12, -82, -4, -102, 57, -58, 35, 159, -112, 53, -25, -66, 5, -34, 81, 40, 29, 2, 26, -83, -135, 48, -13, -76, -59, 135, -127, -37, 12, -33, -161, -37, -126, -38, 143, -51, 158, -50, -67, -81, -61, 98, -11, -62, 68, -52, 26, -86, 80, 171, -124, 14, 58, -5, 44, -40, 14, -54, -207, 17, -13, -47, -88, 98, -50, -31, -47, 113, -149, 79, 26, -58, 211, -65, 30, 55, 277, -163, -33, 1, -119, -74, -57, 69, 19, 22, -108, 149, -55, 29, -137, 115, 287, 153, -199, -57, -91, -85, 62, -41, -40, 12, 124, -124, -86, 73, 1, -99, -87, -53, -94, -62, 65, -38, -115, -31, -145, -93, 69, 4, 198, -31, -105, 65, -75, 3, -91, 6, 66, -153, -194, 79, 29, -132, -7, 24, 92, 50, 104, -28, -180, -100, -48, -62, 69, -65, 41, -44, 107, -77, -26, 105, 55, -73, -193, -84, -211, 33, 19, -76, -32, -183, 69, -48, 75, 46, -147, 9, 100, -113, -217, -56, 184, -17, 162, 25, 149, -75, -27, 65, -11, 11, -29, -100, -167, 271, 18, -2]
756bJ56o7n2N1j11Q5j01J6n2kK14j22Q9j27J04o3p0J0j33L27l15K37j31R7k68
781b30J82J3j13L74k56j41J06J99k22K69k98J26j1r7k0K02j69j35K40nj34J12
803hKj9J25M4j53nm8o2J71l24J95M8j20J02j8L0L4J35Kj93m4N6Q0M3j18Nn9k9
831a28J36J0j19R3J67j19k3p7J67m8r6m6J53J6Lj72J18q1QK33k4M8k46m8pp2J30
858b4N0n8J16o5N8r1p1j1O9r0R8kj16O6J7Q2R7p4k2r6K9L6P2k20L4m8J4J62r5
887h3m7J59K9mj32P4qo6J19n8J43k72K56q5k5N6Qj59l1Q2R0J20k31M1PN0r2l2
915i1J07p5j28K77j9o6j81M8J45jK28k32J34j31N2j1n9P7o6J22j44m7J28o0l9
940c2N4j72K64j32k1K1Mk6Q2j12J33k53J00n3K08O4l26J56j7Kj46K20J45j78J25
$$ y = [-2, 154, 87, 35, 86, -25, 60, -41, -25, -77, -79, 135, 13, 102, -25, 79, 16, -54, -44, -177, 150, -165, 72, -59, 38, -230, -48, -35, -148, 226, -30, -171, -65, 134, -88, 181, -117, 9, -2, -99, -119, 83, -86, -221, 19, 14, -120, -8, -6, -25, 100, 144, -9, -14, -62, -124, 47, -277, -82, -34, -154, -52, -70, -40, -6, 129, 131, -62, -106, -50, 30, 73, -45, -40, -99, -128, 8, 18, -101, -8, 159, 40, 17, -60, 107, 59, -37, -83, 70, 86, 89, -83, 35, -46, -38, 195, 171, 219, -27, -75, -82, -154, -24, 26, -32, 84, 19, 77, -14, -85, -96, -27, -117, -19, -21, -137, -71, -54, 28, 125, 51, 29, -67, -38, -2, 70, -150, -116, -164, -150, 12, -83, -130, 29, 58, 54, -78, -4, -12, -78, 41, -17, 126, -146, 110, 25, 0, 56, 64, -95, -126, -44, 46, 166, -65, -24, -17, 33, -59, -91, 16, -59, -187, 90, 71, 5, -176, -128, 17, 16, 244, 12, 146, 15, 67, 56, -3, 74, 8, 130, -14, -61, 67, 7, -32, 22, -150, 114, -18, -39, -18, -14, -40, 42, -70, 63, -190, -90, -143, 65, 129, -197, -41, -58, -56, -202, 18, 163, -15, 110]
965A10m3lm6l0R9k32O3n5R5j02R5O1J26j95n6L7N5J02j60K32j75R5j17j81K30
990Eo3K07j55j05J32r1N4R5r8j61K19O6j96J83oj94K0J43p5P6l6m9Ok4K21l06
1016a32R6J73k73J2K31k39J49J33o2j02J03k7N2k37j6oO3K21m4j13J07k3j40n
1040g9P7K3r3R0R1k85J80J22j61K9m3L5J60n8j62P3M2N4N5L2j82Oj2k1j49J54
1066b2j8j82J72M1j80J39kN7q8M4j36K45m3o1L2Pj42J67J15m2o2j11R5j48J71
1091D8j14M2L4q9m5M9N2M4kJ2O6j88K03q7j06J08k27L15j37M1j82K12m7N7j4k49
1117b04J46J52j77l5J51M5j01M7M7R5j47j04J04N7j57J22qj62k2K44j22o9L2J66
1141A00p6J37j59OM2j75K44j95j4J60j36jJ67j94L3K23j76k38K92k0qR0j21k2
$$ y = [110, 67, 64, 18, -12, 87, -145, -82, -137, -42, -144, -49, 12, 138, -57, -113, -76, -21, 81, -79, 153, -22, 73, -44, -225, 5, -58, 149, -6, -111, 21, -70, -16, 79, -19, -180, 39, 105, -91, 92, 86, -108, -88, 55, -20, 56, 20, -29, -23, -47, 174, -132, -36, 137, -136, -124, 107, -132, 17, 150, 88, -14, 89, 62, 114, -123, -139, -145, -82, 139, 95, -18, 89, 66, -74, -79, -2, 21, -72, 18, 109, -176, 4, 126, -35, -6, -49, -14, 146, 88, -74, -1, 41, 95, 150, 182, 0, 6, -6, -27, -176, -22, -40, -222, -50, -9, -189, -50, -52, 5, -83, -39, -175, 70, 27, -34, -2, 5, -137, 30, 145, 103, 41, -70, 25, -123, 48, -66, -24, 10, -79, -124, -75, -23, 21, 19, 31, 97, -91, 112, 25, -81, 27, -200, 115, -22, 19, -163, 49, 2, 59, 45, -204, -58, 94, -83, -118, 33, 78, -23, 24, 71, 166, 19, -85, 19, 76, -81, 41, 33, -129, -151, 93, -29, -98, -66, 100, 24, 161, 2, 8, 50, -125, 119, -76, -90, 70, -66, -67, 100, -94, -61, 162, -14, -252, 40, 20, 12, 102, -19, -41]
1165d1J6J62k62J01N3k00R9O9Q6j16O6Q6m2j01O3Q5k32J28j30J43j51J04K6p1
1189e9N9J06j56J91j49k65K65n9O5J15n2m6J02Rk70J6j7R7k2J6o1O9J34k5j91
1214a28J50K8n4j1j79K55k03R6R3m4j16J32k7J45O5k00r1r0J58J9q6O3P2oj30
1239h9j0J39p2P7l8OQ0K1k06J66k3J7o2M0m3M4o3Oj22K49k04KJ60j70P1P9oK7
1267G6n3r4K20p1o2K30j98k36L28j32o9J26j59l0L5J47k1j55J14J2J35j15O9r2
1291EM2L6j10o2J70rq4J4n5O9K9r3J4n9R7O5m6J25k00K9J12l1R8j31p6rR8n2j51
1320a65J35j48K37j88j7J08o1O6JJ8j23N0o4o4J31J66M2k47K23k36J01N8m9n2
1344g8L17m07Q5J79j99O7r9K08j11M3q5J80p2q8J44l47K25J02Ro2Pj14N2J37k31
$$ y = [-41, -25, 137, -125, -24, 29, -171, -72, -3, 83, -33, 33, 119, 77, -24, 39, 124, -108, 20, -110, 33, -118, -14, 12, -59, 0, 106, -50, 141, -8, -273, -8, -67, -2, 113, 61, 15, 117, 126, -144, -128, -145, -48, -70, -54, -115, -46, 88, 63, -128, 22, 50, -4, -15, -194, 61, -142, -46, 47, 3, -113, 19, -8, 137, 202, 2, -89, -179, -21, -2, -88, -25, 47, 41, -89, -99, 40, -32, 45, 7, 13, 93, 114, -92, 74, 51, 68, 6, 46, 3, 47, -16, -10, -132, 117, -87, -85, 75, -95, -24, 55, 49, 76, 23, -71, 149, 78, 16, 246, 48, -188, 140, 8, -61, 65, -94, -124, -89, 58, 37, -118, -4, 8, 143, 28, 97, 5, 47, 83, -27, -89, 81, 72, -12, 2, -53, 16, 45, -48, -34, -93, 4, 69, 23, 148, -52, -23, 89, 58, 156, 25, -51, -60, 38, -14, -165, -30, -178, 59, -129, -146, -38, -99, -33, -32, -14, -137, -87, -151, -215, -84, 82, 124, -123, 100, -136, -35, 23, -26, -78, 239, -168, -83, 96, -103, -36, -135, 73, -38, 5, -80, 100, 28, -60, 84, -263, -38, 64, 73, 11, 18, -96, -44, 93, -138]
1369a38J13J72k58J21m2P8Q5k20J6p3M2Q9k6LP4j09O1R3q7o9K54k58RJ54m2Rk34
1396a83J44J0J47k20J45r2J16j08K8r6P5p2jJ01J93j58J4J16j84k0J06p5j17J96
1420F5o1%j54J65O1j29Q4j40J06NK5o8J9L6J11j20j19J49J56k80K8nK67k82J90
1445A09m7k29L23j87L3O6P3j13M1j13J2p8J37%j4k02L49j06R5o2j10j86J91Q3
1469F5m2o4j09K17j83K17o8r2K4j11j26K06J40j89J62Nn1k9j8J3l2J15m7j55J71
1494A9j18J60j04J38r6j14K89k47K19j18j97N9L3Q5m2K10q8o1j97M9J73j47K38
1517A43o5q0K4O2j4j5R4k47n1M9j21Q8K03N2l35L38n7j76J00J03p8j90J05Q6j01
1542h3R8p5R0k79K75j61L1J33k90K76k4M0p9P9j45J82o4j17l8J47j18J1J18K40
$$ y = [-138, -25, 147, -111, 10, -32, 46, 131, -89, -73, -146, -104, -15, -41, -38, 36, -73, -12, 81, -6, -75, 179, -79, -70, 84, 42, 51, -183, -39, -29, 118, -102, 43, -49, 67, -41, -13, -109, -34, -106, -107, -6, 187, 29, 43, 159, -25, -45, 61, -14, -131, 65, 4, 4, -150, 15, 76, -53, 31, -109, -3, 2, 27, -41, -22, 14, 125, 5, -114, 35, 191, -89, -61, -66, 201, -81, 109, 62, -167, 156, -31, 2, 68, 141, 28, 69, -44, -32, -110, 27, 27, 13, -189, 160, 54, 149, 87, -23, -209, -18, 65, 23, -41, -150, 67, -116, 101, 33, -59, -35, -146, -272, -66, 74, -115, 47, 52, 1, -28, -46, -33, -65, 50, 3, -152, 19, -99, 61, -43, 95, -1, -115, 174, -73, 146, 28, -169, -110, -77, 8, -34, 176, 88, 27, -170, -121, 52, -95, 143, 78, -2, 22, 84, 70, 55, 149, -98, -149, -100, -221, -133, 70, 122, -213, 125, 68, -108, -8, 95, 17, -173, -68, 18, -83, 15, -60, 30, -249, 26, -135, -104, 29, -261, 15, -9, 31, -48, 31, -114, 68, 4, -113, -151, -4, -122, -111, 7, 247]
1566B47l26P6l8J51p6j14l8J26k4M2n9J03l8k1j8Mp2O3J57O8L9l81J21L1r3k5
1592i5L6J1J17j63L0J19o3j38M1Q7O4j31J01l0m1O5j58K5P9J20k47K32kq9M1J88
1618A99k01l13K77J65J9j59j6j14K34k18J77p7q3l8j9J40J10k3k03K08j04J45
1640A06L5j24pQ6J33j21j40k8qM8J06j54o8J33q9R2rJ83j55J5j67J58L9j43p2
1665a51j4J81J19l6p2O3pk42K13o5j36J60J35k36nP3P6k2J36k15n8J25J3N0j3
1690G2L0k8j65L3K20j00m0q0J14P6k00j57L5J65Ro4K3R1J47k29n2J64j0K1O8j77
1716c4j60O3J14o4J42j27N4k3J39j35M5r2o8K68k3j59M8L5j27O4p9N3J04j60K04
1741H2j62O6JJ89q5j21l5P3m2Po4M2l4K06j15p9n3N3J0j9K9O0J01k10J24j73J67
$$ y = [247, -79, -3, -41, 110, 34, -80, -118, 8, -16, 26, -33, 70, 32, 11, -7, -3, -75, -12, 145, 213, 252, -129, -8, 23, -70, -95, -59, -48, 69, -94, -64, 55, -8, -146, -105, -18, 46, -85, 16, -14, -55, 10, -148, -123, -44, 76, -171, 61, 59, -30, 11, 199, -2, -315, -38, 127, 146, -13, -29, -143, 91, -127, 50, -27, -110, -148, -167, -27, 83, 60, -143, 65, -39, 106, 141, 17, 10, 96, 229, 108, -32, -60, -68, -20, 86, -68, -136, -3, -92, 0, -9, 174, 19, 34, -133, 25, 64, -79, -151, -165, 16, 135, 99, 27, 90, 83, -159, 54, -11, -147, 13, 148, -88, -93, -20, 56, 34, 170, -45, -103, 22, 35, 85, 72, 102, 74, -91, -58, 162, 62, 22, -58, 56, 132, -68, -225, -190, -25, -16, -80, -57, 34, 181, -48, -100, 64, 54, 75, 143, -34, -194, -131, -17, -81, 61, -66, -12, -35, 104, -31, 14, -78, -146, 122, 99, -60, -12, 23, -104, -40, -119, -66, 38, -122, 82, -80, -14, -13, 176, 91, -30, -65, 8, -34, -27, -91, -49, -83, 123, 8, -71, -124, -71, -61, -80, -51, 9, 110, -100, 24, -149, 18]
1768A8j55J50O8L0l45R0K04m3j0o3p8K19P1l26J29P6mJ13j99O4p4RJ08p5J28j08
1794cO7j04L9Pj29J56N0L4j34m4J41j86J31L6l0j75J23J20q0m2J6J2R4J7j38J13
1820I1j83o5K42p5J5Q1k31Q7nJ57l4j93J41l2r0J62j05kL7j16J05j59J83O3j03
1845b9j9L3q7J01L7q6N4M6k00Q3p9J27m7%K8J08o8R2o3J68k80kL7N4M6Ro0j41
1873a38K05o1q8R4R4q2%ol4Q2n8j19K87k48J84k43K73j22j3J06L6j06Qj99J29
1898a9K27k18k1J0J43Kk51J91q2m0k1J04j01m5Q3m3L9J61j7k61K26k58J87M8L2
1923G6k0l5J69k23qN0o6j25J89m3q8K5j46K17jJ46r3L6k4m2q1Qj8J53l5j20J70
1950G1n7o4j31K08L4p5M6k2r6R7n6M9N6j4R6j49p2J60m3j1M2j69N8k5KO9m8j24
$$ y = [18, -137, 13, 81, 111, -234, -144, 60, 17, 7, -56, -134, 85, 156, -170, -41, 35, 31, 144, -55, 9, -65, -56, 52, -23, 105, -3, 64, -40, -1, 6, -123, 33, 83, 117, -17, -61, 80, -106, 25, 61, 31, -144, -21, 99, 19, -23, -7, 5, 99, 116, -22, 91, -92, -157, 85, 10, 25, 106, -125, -38, -43, 114, 80, -113, 28, -4, -94, 68, -37, -39, -2, -118, -13, -172, 11, 74, -29, -48, -15, -102, -1, 36, -50, 4, 50, -150, -67, -146, -19, -66, -66, -38, 70, 2, 94, 31, 199, -81, -83, -46, 8, 54, 63, 3, -138, 67, 6, -82, 12, 106, 24, 24, 18, -16, 66, 8, -111, 176, -72, 112, -131, 142, 20, 7, 113, 149, 43, 51, -148, -19, 208, -10, -31, -21, 122, 124, -127, 64, -18, -58, -79, 25, -76, -121, -38, -81, -42, 119, 102, -159, 67, -191, -4, 44, 76, 56, 21, 190, -33, -41, 9, -57, -182, 7, -36, -124, -99, -245, -28, -29, 117, 24, 60, 36, -6, -87, -79, -97, 56, 21, -99, 71, 14, -50, -181, 27, 61, -14, 32, 10, -86, 11, -45, 4, 60, 46, 142, -7, -79, 81, 38, 27, 69, -100, -42, -67, -65, 4, -44, -168]
1978a68J74Q6k11N4N4p7rJ56j99J71P7j39j0R4Rn3J02p7J8j01k8J64r2m0J70r7
2004B8j29M5Q2l4K18k35K2k9n7k8J34l7N9o3J67L5n5j95N2k3Qk8k5J36o0K7j24
2031a09O3km0J64j42p0O9q6j4R4n0J05P7p6q5O3J51j61L1L4j63J83j19jJ60K2
2057I8m7r6K11k00R3k2n7K1n4Pl6J46q8Lk7r1J78p1R5j75K5m5K08J6j74J36q8
2084c4L9p1J27n8j01Q9j0o9O4P6%P7k93K25j19q0J70l2p8NM4j48j2J80L2Lq2R4
2112C8j23RJ28J0M7j45J26m5j3j3o3Q7R7j47J29j96J59q3mkk1l3o4J50J15j32
2138A1JM9p5j09P9j08L51l05k9R9J7q0J71j63J12k9K6j9L5kr3J33OP2n2m9q5N6
2166B0m8J71K9q9j43N6J02j89j7P8q5K51j49N2QJ7j13J56q0p9Q7p7J60j51M7J0
$$ y = [-168, 6, 92, -119, -65, -11, -88, -97, 59, -140, 31, 108, -31, -41, 53, 62, 9, 111, 34, 52, -49, -77, 87, -5, -45, 125, 28, -101, -56, 26, -8, 210, -25, -3, -32, -89, -117, 17, -20, 39, -24, 143, 178, 123, -72, -20, -43, -35, -63, -88, 48, -12, 15, -109, -46, -48, -88, 76, -66, -136, -67, -153, -167, -73, -123, -18, 59, -17, -102, -39, 112, -49, -18, 16, -147, 36, -83, -84, 76, 98, 51, -45, 166, -34, 59, 37, -20, 1, -53, -46, -82, 64, -24, -21, -48, -139, 39, -32, 63, -112, -87, -132, 76, 92, -82, 54, -34, 5, -66, 61, 3, -98, -9, -19, -88, -24, 52, 52, 129, -164, 61, -58, -138, 32, 0, -78, -73, -29, -177, -189, -9, 23, 26, -56, 38, -85, -76, 52, 62, 109, -36, 90, 45, 32, 19, -44, 43, 140, -7, 122, -74, 85, 2, -2, -4, -25, -58, -122, 28, 143, 11, 12, 61, -14, -123, -44, -152, 199, -106, -135, -36, -19, -99, 72, -91, 21, -8, 18, -1, 34, 32, -61, 72, 78, 150, 98, 49, -36, 20, -28, 143, 172, 83, -60, -4, 98, -91, -108, -30, -115, 136, -13, 39, 47, 64, -49, 107, 27, -52, 35, -42, 118, -33, 14, 24]
2192B4m2Q2r3r9Q1O7j45P8K14l12R8M5M5qj84K84j55K10l32K16k07K44j43N3L6
2217E7J50n0L2j38N1n4L8j64K03j56N3oN4j28j66J56J81j77R6L9l6k5J22j38n8
2242f4k1K41j95J79n5j20Q3L0o8L2r4R1j73O0Q8jq4R2r5q4K62j62j0J94k38J83
2268G1l5j9o8M6n3q9K23o2R1p3O6k9l3Q1jl5j25MJ81pj38K6Rl5o1n5K53k92K66
2297A07j27J91l41J33J70j83o4J63m1j07O9j58M88l82J20kk39LK14k9O3J02q7
2320F3n3r6O9k2j5J50o4M4n5j7l0kl2N0j11M1J79l7P2k22J27j54R8k13K82N0n7
2347D5j63l5J15n3qO4r4N0K12k70J98M6o0j89M2j04k2J71J61j17O3j22j34K29
2371B5L3%j57J54N0m1j07N8mj43j6K25j18q1Q7L4o8K49k42J30q1k5J3q5K05L8
$$ y = [24, -18, 64, -29, -128, -47, 20, -125, -47, 167, -145, -47, -2, 43, 35, -149, 135, -20, 190, -142, 74, -133, 111, -32, 21, 57, 207, 157, 189, 51, 102, 48, 86, -78, 125, -31, 22, 16, 70, -58, -224, -68, 113, -64, 32, 71, 35, 10, 132, -6, -64, -85, 156, -39, 140, 85, -35, 48, 78, 10, 42, -52, 39, -134, -74, 14, 13, -71, 21, -74, -158, 104, -58, -68, 126, -112, 71, 36, 17, -51, -5, -58, -147, 76, 14, 105, 32, 98, 69, 36, 117, 116, 81, -44, -40, 141, 134, -4, 22, 31, -4, -65, -120, 133, -159, 107, -20, 171, -170, -37, 133, -50, -114, 49, 8, -99, -30, -188, 300, -82, 38, 36, -203, -200, 14, -15, 48, 150, 63, 10, -86, -17, -39, -54, 96, 32, 76, 21, 4, -26, -28, -60, -10, -121, -80, 99, 62, 134, -88, 39, -115, -17, -230, 52, 102, 45, -118, -153, -38, -91, -99, -35, -129, -79, 133, -137, 61, 107, 47, -142, -100, -204, -226, -55, 106, -11, 52, -70, -204, 25, 58, 58, -99, 55, 105, 64, -43, 15, 11, -132, -148, 77, -41, -122, -35, -1, -69, 180, -62, 68, -13, -38, -25, -110, 95, 133]
2397A33o4l0K7n3O2j05R2q4J9j60Q3j3J25n2J66k18J76m5Rq5K4P6j72K58m35K20
2423d6J73k47L32j25k96L14j11pK8l3Pj1K6q7J34j98K32M0o4k47K18O7K1k24J79
2448G5o1J04m7M3j50r9J88j8j9k34J43K6M0q2L4M9L1N6Nk05J53o4R5n8J03nj95
2475i2J48q3P2j31r3J19R2j38M3O6j79%K07m3rj92L96l9j32l9K2j28J39j00l1
2500a25K19j96R5K38l28J19K22l50J22k6P2Q0o0j4m9j60J55O9k53K24o5N9j9k6
2524CK05l16j66K24QJ15j95J70k5J7m1l4J8q9JJ03n9J01kPj10p8K14n7K38k33
2550A9j1RJ76k02Q5k55K10oJ32o6k47R6m9K15m8j32M0n5Q8O8j84R2m0q4J50p7
2576g6J32j10J21j4k1O8j79q0J02K4Q0q0Q1l3o2J26j38k3O6J11j79J2Q1r3r9L
$$ y = [133, 69, 39, 66, 13, 75, -30, 62, -22, -3, -163, -80, -93, 32, -20, 146, -72, 104, 59, 68, -17, 7, 83, -89, 169, -266, -46, 127, -120, 212, 87, -209, 105, -6, -13, 15, -18, -11, -22, 4, -83, 51, -147, 85, 125, 61, -186, 32, 99, 120, -104, 75, 14, 118, 71, 114, -36, -135, 53, 35, 16, -218, -75, -49, -9, -91, -57, -8, 23, 79, 84, -121, 32, -32, 63, 5, 108, 103, -92, 56, -27, 45, -86, -179, -60, 32, -106, -63, 3, -176, -176, 31, -12, -21, -213, 183, 144, 12, -27, -5, -133, 6, -94, -125, 94, -102, -7, 231, -97, 22, 244, -106, 16, -10, 62, 142, 82, 68, 19, -141, 14, 83, -170, 54, -11, 48, 29, 3, 208, -108, -274, -50, -42, 73, -122, 48, 23, 40, -1, -35, -17, -106, -105, -2, -61, 40, 38, 45, -65, -143, 71, 14, 252, 19, 8, 17, 193, -9, 76, -179, 31, 25, 157, 91, -156, -60, -109, 106, 58, -74, -34, -89, -1, 67, -117, -25, -65, -149, 1, -76, 56, -54, 67, 53, 32, 100, -79, -159, -57, -33, 47, -33, 48, 15, -47, 79, -59, -82, -16, 95, -84, -72, 9, -84, -183, -180]
2602a80J80o4%p1PL8J54j24K8Mn4l7J75j36J21j07j9J6K34j70N6M9l71J91m3K09
2628H6n6N2r7P1j66PK13k09j91L48k65M25j16j32J20j9l0j9j0j27R0K53k22k45
2652b39L29j41J71o4p7o6J63K4k2r0R8M2l8j98R5J1j20J38R8k16P9J54rj80L1
2677b7Np8J53Pr0n1R1n2n9Q1k27J09J91j84J13Q0J5k20J13K9k9O3O2j76J28R1
2703A38q5Q7j60Ll8K07q3q2N8j57P9P8r3P3p9J44j02R3J4M1j79K1n9j49K04k3
2729d9LK4M1l9R7r5R4%n2j28J11J20m9o9J51j60q3%J25n1n6Q7J62k24m8j08J46
2756e0mj03J28n1K6J16j30J04j50O7J78r1n4J43j59PJ6J05m1j87K07M5j43km8
2781g1OJ56j18j02J54R8k44K72o5k2q0J5J04j28J0J10K5j41L2j69kJ43J27jQ1
$$ y = [-180, 0, -64, -64, -135, -128, -90, 64, -60, -32, -28, -82, -119, 56, -80, 41, -66, -85, -69, 165, -5, 51, 100, -271, -80, -123, 86, 30, 82, -15, 56, -110, -103, 110, -99, -290, 58, -207, 218, 102, -30, 90, 71, 41, 22, 12, -115, -25, 228, 6, -239, 90, -51, 120, 56, -21, -87, 76, 100, 78, -12, 86, 128, 90, -108, -13, -2, -122, 16, 114, -102, -23, 131, 122, -58, -27, -22, -100, 53, 60, -30, -81, 10, -42, -101, -20, -247, -138, 53, -131, -18, 62, 77, -143, -30, -1, -30, 33, 95, -81, 47, 138, 53, 140, -20, -17, -55, 152, 69, -13, 45, -112, -33, 45, -48, 25, -54, 90, -12, 81, 95, 136, -43, -22, -81, -230, -26, -49, -46, -22, 19, -20, 77, -18, 76, 76, 24, -104, 7, 127, 78, 9, 160, 0, -83, -83, 42, -9, -65, 22, 184, -40, -88, -196, -50, -54, -157, -29, -80, -54, 62, -68, 36, -114, -47, 131, 40, -14, 129, -30, -23, -7, 98, 57, -130, 77, 122, -21, -23, -71, -65, 91, -27, -129, 25, 123, -121, 151, 86, 64, -16, -1, 103, -25, -15, 95, 120, -21, 11, -158, -160, -17, 110, 109, 190]
2806A90k29r1N3j28J36QR5j4P3j69K09j73m2M3N4R4j83K63k2o2j54l8J46L6n5
2831D0m4J09q2J7k5j05R3q0L8J13q1j52L05k22J17j55J02J12j04m4M3J61j36j47
2855a27O5M5J76j33q3J89k43K1Q5R4k4q6L7K21o8k20jrk9k4J57m6l4P4RN4j58
2882e8J84m3p9P2j16K7p8K22k17K44j82p5J08j39N2J13q4J32j57N8Q3M5q2j52
2906a22J59qp2M8J27p4P5j21m9J14Mq9K2q3j3J50j74J5J40lrj58J14oJ29p2J76
2933B20k27p8O9P0K9j21q4M5R7m2p9O7K15l28J87M7p9k8J0K9r4J76oj55JJ62o9
2960C4l8Mj82J61M9M0rj59R9j68R5J9RJ08J3j75P3J18k47L11j65P4l9j23J34j31
2986i5j1K05l3k27J99j53N9J72k64P6m4J36M1jQ3k00KP6j45J30J9OrJ22k24J7
$$ y = [190, -39, -130, -77, -205, -69, -61, 34, 20, 93, -76, 133, -40, -82, -39, 15, 109, -74, 189, 167, 105, -49, -87, 59, 95, 40, -4, 105, 23, 40, 15, -90, 3, -77, -39, 74, -7, -159, 146, -76, 41, -114, -12, 100, -4, -48, -5, 156, 20, -127, -62, -17, 159, 26, -57, 132, -111, -90, -5, 89, 65, -21, 16, 237, 169, -51, -52, -61, -90, -114, 43, -3, -37, 37, 46, 100, -58, 126, 83, 4, 76, -40, -13, -91, 131, -86, 158, -24, -99, 9, -130, -78, 35, -49, 83, -74, -16, 67, 112, 30, -122, 37, 29, -43, 5, 132, 58, 133, 12, -37, 77, 81, -8, 14, -69, -82, 68, -106, -91, 49, 46, 37, -121, -7, -13, 116, 44, 220, -7, -85, -16, 54, 83, -38, -122, -77, 20, -22, -101, -34, 181, -147, 40, 87, 8, -20, -10, 19, -75, 101, 95, -60, -59, 103, 34, -4, 0, -182, -21, 28, 68, 59, -100, -1, -169, -74, -55, -46, 62, 75, -100, -27, 91, -156, 155, -10, 64, 25, -98, 36, -95, -106, 99, 66, -161, 38, -115, -56, 116, -148, -72, -116, 20, 61, 60, 143, -57, -55, 21, -124, 6, 25, 31, 22, 144, -80, -63]
3012f3P2L9j62J41j73N6L8J52j0q0M0r5K10m0K2n7q4M2r1L6k7N4j17J62j41l5
3038a11J40l8P8K9p1M8Q4j82N0j45P5M2j2K7l9J50j69N2j82J23M5J43j1m9k4l02
3064b49J97m1j4n5K40M6lp0Q3j63j57J46J41p7q3J55Oj37L4P0r2K69k63J08K4
3089A15n7p5j59J19k5J64j02J5J18j51Q8j31K38m80L36j9Q4K2jj07J01p8p6Lj2
3114g0P5j18O4R5o1R9j62ll9O6n2j4J96m7Jq5JqP7k9J06p1j00J03Pkj12J6Jl3
3144i9J54r6m6K2J8K8n1J87j30K17j52j73O0J68j43P3l14K75Rq5K0O0m9L0%J75
3170A58k07L8q8K09k28R9l4O3L4J08j70K0J7n8R8o8O0j16K8J6L9n0N1j2P4l0l3
3197A8J8J2j14K3k1M7l0J59k16J16j97J54O6k59K77J66j07j12J37n7j23o9p3K15
$$ y = [-63, 9, 48, -114, 27, -146, -90, -52, 100, 90, 10, 50, -45, 165, 125, 147, 90, 6, 48, -43, -7, -34, 20, -97, 65, -76, -111, 29, -9, 69, 98, 27, 75, 159, -23, 27, -118, -43, -1, -13, 14, -25, 125, -44, 8, -174, -51, -6, 137, 126, 77, 53, -249, -52, -93, -107, -162, 78, 124, 121, 51, 134, -29, -186, -40, 101, 24, -59, 96, 102, -35, -1, 69, -23, 246, -17, 91, 115, 58, -17, -176, -57, -82, 82, -20, -5, 113, -38, 50, -81, 157, -323, 13, -6, 78, 100, 99, -8, 93, 15, -61, -58, -70, 5, -113, -49, 46, -15, 84, -78, -81, -120, -54, -106, -120, 76, 29, 30, -55, -54, -62, 15, -14, 92, 21, -79, 24, 31, 29, -83, -67, -66, -99, 55, -41, -87, -65, -47, -19, -70, 117, -13, 204, 52, -121, -61, 107, -36, 37, -277, -2, 7, -78, -58, 2, -47, -17, -17, 158, -49, -11, -99, 110, -118, -19, -53, 10, 44, 152, -18, 2, 19, -39, 59, -9, 51, -65, -37, -21, 18, -32, 19, 7, 81, 51, 18, 36, 48, -66, -43, -64, -17, -47, 112, -104, 12, -185, -31, 35, -224, 53, 219, 112, 0, 137, 80, -43, -112, -185, 30]
3221C0Q3J32nk33j23J70J8ORj81j6K19k00J57j5P0k1k9j27J77P7k20J02k06K60
3246A34l27J13J71j64N9m5R5l8n2k6K4J47q1O9r0M4q0l9L4jM3j59J76R5k69J24
3272d3M0j23J24j6k2J0j9m7K01j78K07j94R1O1j53K4J06k4j15N8o3K4J40J4Oj47
3298c8K10j66L1j63R5mR2m1l0l7K9P0p3j5J7O9m3p5NJ13j07Q0K3j65J17K0p9p0
3326a35Q1J20R4q1j52J58n0nm6O5p7J09j63J46j35jK17k05r5J81p4J64j07j43
3350a34J30K10k31m9Q4j75J52n6q5J49Q4j77P7j5Mj4K40r5j68J09M0n1O4K5j05
3375A3j04J59M1k28P5o7J48n2P8j05m9J63k50J39J77k19qM2K1J87k04J03o9j05
3399a14P4j04P8J53j0j00p4M3P7o4j7J36p9J8q1R9k8N1Q7No0m3j20J26k13MJ49
$$ y = [30, 113, 245, 240, 7, -116, 54, 72, 78, 87, -94, -110, 109, -91, 66, 51, 121, 100, 71, -56, 121, 198, -22, 80, -126, 134, -193, -80, 91, -73, -14, -59, 36, -2, -54, -80, -56, 91, 10, 79, -11, 33, -47, -86, -52, -53, -10, -169, 7, 102, -167, -43, -3, -126, -2, -18, -40, -30, -49, -96, 105, -73, 134, -60, 31, 92, -61, -37, 69, 45, -70, -12, -75, -51, 89, 103, 109, -38, 172, 6, 37, -126, -31, -35, 57, 16, -14, -51, -22, 48, -25, -40, -23, 46, 3, -72, -67, 46, -61, 19, 42, -123, -6, 14, -65, -135, -54, 66, 160, 79, -73, 85, 35, 30, -16, 49, -28, 81, -82, 64, -71, -72, 145, -60, -155, 26, -48, 116, 9, -134, -4, 206, -25, -74, 10, -165, -13, -69, -154, -5, 79, -98, -21, -36, -32, -46, 194, 99, -69, 40, 80, 29, 93, 118, 13, -91, 68, 109, -119, -44, -111, 37, -15, 63, -42, -91, 72, -178, -39, 138, -81, -89, -47, -26, 161, -43, 60, -9, -114, -40, -144, -66, 87, 77, -23, -97, -54, 23, -41, -58, 78, -1, 17, -64, 35, 7, 58, 145, 150, 90, 47, -73, 53, -160, -156, -7]
3426gm3J30p7J27j11k3J6j61K63j12j55m0J42J48j90J14L2n9n4L5k4J9l9o4P9
3451e4O3n2J12j02J72q3p0r5Q6N1Q2k17K3J7K03j60O3qJ10p4j54ON6Nj6m1Q7M0
3479E0Pj67J83o6n6l2J46o3L2k9j37J02J53j03N5p8M7J23l43L37l41L08l53J98
3503b7r9K98j27o1K4oO6m4j81J29KJ07j58J50Q4j41o1nK6J13j45j09J22j12J35
3528b0o2j5J11j59K60k63K05j14P2j39k3J81R6j36q7P0R3j62J09r2P5J69j98j59
3552a88L64k8j61m9p8L04q5j12j67J78L0R3q1lk26K90p3J80j97J5p4J23j05P5
3576B5Ml60M85j17J3m9O1l4K1j1r2P7l8N4j1k8j5J46k04J72j87J05J9n4Ro0K9
3603d0P7Qq0K03p1j80J46j20n4M0M3Q8j35J25N9j44M3j30L9o9J15j12J8K16J5
$$ y = [-7, -50, 80, 3, 130, 19, -4, 12, -149, 114, 2, -153, -193, -51, 97, -93, 21, 53, -6, -60, -25, -49, -30, -69, -133, -54, 9, -43, 69, -33, 139, 56, -14, -109, -23, 28, 110, -107, -84, -67, 136, -24, 39, 31, 141, 67, -87, -81, -25, -20, -36, -77, 10, 50, 57, -110, 73, 7, -49, -81, 65, 2, 34, 5, -132, -30, 123, 20, 75, -3, 44, 167, -176, 161, -180, 128, -225, -27, -126, 172, 45, -16, 8, 2, 68, 24, -157, -28, -26, 81, -77, 73, 157, 16, -45, -50, -24, 89, -56, -165, -43, -155, -20, -82, -97, 14, -145, 115, -148, 57, -57, 15, -124, -147, 34, 130, -6, -93, -23, 70, -92, 17, -75, 0, 169, -29, -188, 176, 148, -13, -62, -140, 164, 79, -33, -200, -22, 8, 101, 20, 17, -209, 81, 8, 188, -9, 6, -68, 55, -50, 25, 29, -331, 154, 37, 50, 1, 62, 28, 49, 38, -54, 23, -15, 39, 28, 0, -15, 131, -73, 99, -88, 17, 36, -18, -9, -69, -40, 37, 45, -35, 168, 97, -83, 63, -57, -111, -71, -28, 60, -75, 50, 109, -35, 8, -122, -83, -152, -37, -149, -131, 85, 100]
3628A00j70l0J44r8J57K4k45L07j78j24J11nj02M6K9K4L0jK9M2lk03K15k78K45
3653F6j38J88k01j7J90j25J91j62Q0j22K2M9R8k7j59J15j2P8j16J33j1k05J18
3676C3J49j63jM6l1r3l7P5L6j86J47J62j92J50n5j29n6J20J94o3Qk7k83L06mj89
3702h3J72l2j82J33j46%K63m0r2J26k98L53j53jj57R4q6M0j38J19K30j28J37k52
3726a21O8K33l39J75L8j09O0m5J8kn6J04n3M7q6k0J16L2j10J59j30K1Om2j30Q8
3752g8M2K5J4l8j3k9J87j23LN2q8J03j36j9J12q8J9knN8J09n9l2o4m1K50n7n3
3780D9n4L7j87J73m8k5p5J12o5n5p0K39m2MJ21j00p6R9p5k7j0J1J24r8n6J06M7
3807E9j63J83k05Q8J7K13j88m7P6M8j63J05j6l1J37p0P5r5l6Qq3K21j53J53o0
$$ y = [100, -70, -100, 44, -54, 103, 127, -118, 189, 11, -113, -2, -7, -109, -63, -34, -10, 20, 19, 48, 90, 87, -116, 99, -179, 66, -72, 116, -85, -102, 88, -37, 154, -8, 72, -50, -28, 21, 119, 92, -67, 48, 36, 114, -2, 131, 120, -85, 33, 182, 19, 18, 64, 33, -60, -97, -22, 14, -172, -25, 137, -55, 95, 40, -89, -145, -25, 169, 106, 114, 87, -196, 110, 106, -83, 89, 57, -125, 8, -138, -138, 125, 85, -7, 119, -179, 174, 21, 20, -137, -43, -129, -89, -227, -108, 122, -6, 131, -121, -53, 180, -159, 16, 54, -55, 5, -40, -22, -24, -80, 24, -29, 18, -68, -88, 28, 60, -50, 109, -21, 0, 6, -36, -166, -78, -36, -11, 3, -35, -48, -77, 110, -13, -10, 42, -46, 57, -79, -98, 14, -74, -55, -57, -62, -4, 105, 46, 14, -50, -91, 159, 102, 49, -5, 32, -155, 18, -30, -55, -130, -18, -83, -138, -208, 31, -11, -7, 114, 14, -62, 37, -38, -65, -75, -64, 60, -38, -94, 12, 59, -104, 79, -126, -38, -21, 192, 4, -43, 33, 81, -82, 23, 7, -24, 113, 43, 118, 23, -13, -5, -88, 133, -20, 133, 73]
3832G3o1Q3j40J24j34N8J22r4L2J24k79K10k47J74n8l5j30K32k39J02j8L35k34
3855@j17K1p5K58l6Oj72J03o1L6j20J02QoJ10P3q7L3j22q4K3j2M9M1J73j79LQ6
3883E4o3Nj26K22k0K1K11l10M0p7N8o2p2J06lm6o8k3J29J2M5P8j33N7l7j3l1R3
3911D7q8K25l05K1O6J63p3r0l2J35O0n9K7j64M8J00r7Q5j01rr3K21k34K61l6n4
3937B4r7K8K8j78L26k57K40l75J84O3KJ18j26P6N4K2J2j25%k02J07J34j08J08
3961E8j95K59j41J29k46P8k2J78O5l18K50k16K21J1L8j71m9R4Q5j17q5J35Q8j79
3985e0o7K20j31P4P4k78J17J81k18K0L4P9r0J5L0O7j8k63J98j65J79k1O6k8J25
4010A50j57j25K84k75K47j1q4l6j2Oq8J51j41J64k3l4j9k0n9kJ62l23K15J25j44
$$ y = [73, 12, 95, -45, 79, -55, 3, 125, 31, 63, 187, -92, 118, -129, 45, -13, -48, -178, 54, -185, -83, -101, 234, 0, -117, -96, -171, 87, 51, 57, -115, -12, -73, -37, -157, -55, -47, -53, 57, 130, 43, 76, -46, -130, -107, -119, -70, -29, 144, -35, -32, 54, -9, -4, -130, 92, 72, 93, 304, -6, 34, -43, 15, -47, -119, -13, -16, -62, -130, -153, -24, -12, 33, 111, -22, 35, -2, -15, -46, 47, -41, 184, -121, -100, -34, 129, 56, -34, -66, 69, 129, 70, 97, -67, -19, 81, -16, 69, -32, -41, -134, 87, -147, 114, 78, 24, -73, -45, -17, -195, 131, -126, 114, -261, -77, -14, -12, 106, -20, 56, 110, 132, 144, 19, 19, -183, -76, 58, -50, 58, -137, 122, -19, 110, -136, -58, -80, 98, 163, -155, 95, -121, 100, 111, 149, -22, -71, 23, 108, -9, -94, 41, 129, -50, -117, 103, -28, 46, 120, -158, -41, 140, -78, -58, -24, 55, -35, -20, 10, 77, 59, -204, -6, -171, 8, -13, 53, 25, 150, -7, -132, 152, -123, 124, 113, 29, -7, -19, -13, -101, 50, -91, 73, 50, 16, -3, -23, -82, -84, 78, -245, -30, 95, -49]
4035d9Q3r6L9J19j77L3O4m0L1J16j81K2J88oj86R7l3j23J83k97J35K9R6j45J04
4060Fq0N9J89l20J49n5K9j07J90j14J38j48J52p8P2j65R9r2J58j45N8Nj21M9l4
4085a06q1J83r9J30NP7j67J27j4o2J3kJ03k50l0J09J3J79k65J57P1n6K2m3MR6
4111A14k20M5O8n3J1N5K57l01N4O8j27m4k0J31n2j32K59k39J93j12L2j33K21J6
4135I1j6r1nK0k9L0K5q5J0l0nJ68q4J37j29o5N1r9J23J23Jj50rJ07q7k60J60N0
4163d8j3N1o5P3j62K25j57M2N1oL3K9J3r5m6J04j41J6KL20l47PO1k06J53J76m8
4190B2Pj18n5K35j64k8q5O2K08l00O7K0J76q3k7N9o5J80N2k41K24l4j47K4J04
4215I3J58j61j7j06n9j1J79p7P9q4J76j10k06l1N2L1J42n3j67P5J75j20j9nP1
$$ y = [-49, 34, -62, -23, 96, -81, -48, 16, -24, 7, 123, -58, -36, 152, 146, -40, 57, 24, -99, 84, -213, -78, -49, 47, -98, 6, -74, -15, 174, -146, 3, -52, -23, -130, 60, -54, 84, -64, 88, 10, 82, -83, 16, -76, 82, -63, -5, 0, -121, -72, -106, -187, -4, -103, 27, 32, 109, -58, 69, 55, -7, 6, 4, 107, -143, -173, -64, -51, 128, -137, 20, 91, 35, 57, 14, 18, 114, -106, -61, 7, -46, -35, 20, 277, -24, 30, 98, -29, -73, -93, 38, -14, -146, 113, -126, 67, -45, -13, -146, 75, 91, 75, -16, -21, -1, -30, 0, 25, -60, -50, -80, -85, 83, -1, 136, 7, -58, -7, -106, 17, 140, 141, -9, -18, 89, 2, -258, -98, -48, -61, -10, -75, -2, -164, 61, -96, -54, -3, -9, 24, 53, 66, -29, -75, 29, -112, -96, -94, 226, -121, -114, -53, -259, -106, 70, 22, 29, -89, -144, 91, -73, -101, -186, -124, 84, -216, -149, -129, 47, -36, -63, -4, -69, 111, 163, -78, 146, 112, -35, -11, 93, 251, 90, 73, -33, -92, -103, 76, -1, 78, -6, 170, 60, -146, -177, -125, -94, 48, -5, -172, -97, 78, -42, -61, -66, 5]
4240Ej67J48l3O0K3j26K5P2l1M8o2P2r4o3nK43n0rpj14J40Moj73M0J82p1J4j48
4269h3q2K14j42O8o3j7L1P3N4k8J1k44J08J40q4K67k21j42K69j67LlQ5J0j02J23
4295G8j46j42K49O3j96J4J05J9M9L3k50J41q7ML7J50pj46J01o8R4l6p7m2l4J76
4321H2K20l21p0k9K68k16K5m5j7RJ13o3J50j28P7M7j94J44K0j18PL0P6L6K3J0
4347A36q3j04%k6Ko0p6L01o1j21J47j5j04R2N8M1o5Lj18Q0j80J02J38p9q3R7R
4374C1k3l5J37J20j19l4j10J07Nj34N3Ok6k1R1K1K1k05J40M4j97O2j28P2J35j66
4400a53L9J34N2j7j5Q1j14m8P8k37K88j46m8O7o0P7R5K5k85K01J14Q2l42L6R9
4425CJ88j98O7J22j53J43j10k17J46O5j22O1n7P0R3m6r2L20l43n5O4o8jo3M4J52
$$ y = [5, -162, -14, -47, 13, 36, -90, -65, 7, -24, 24, -38, 34, -60, -123, -128, 115, 65, 56, 49, -65, 75, 79, 73, -100, -60, 122, 51, 65, -83, -165, 49, -93, -25, -88, -105, -74, -1, 53, 25, 36, -208, -100, 40, -44, 223, 2, -140, 129, -38, -35, -38, 47, 57, -45, 78, -68, -210, 39, 102, -94, -80, 25, 44, 93, 126, -124, 17, -70, -66, -29, 121, 114, -32, 69, 1, 95, 59, -18, -60, -94, 82, 302, -19, -89, -118, 150, -66, -41, -86, -103, -94, 19, -44, 106, -22, 55, 102, -92, 52, 72, -46, -39, -9, 67, 103, 126, 136, 53, -51, -51, -77, -75, -135, -211, 90, 29, -92, 55, 40, -64, 28, 86, 127, 62, 65, -53, 27, -153, -51, 87, 8, -75, 22, 31, 8, -27, 110, 230, 111, 77, -33, 74, 79, -55, -2, 4, -22, -43, 48, 69, 90, -115, 25, 69, -128, -66, -194, -122, 13, -153, -114, 20, 72, 55, 40, 121, 7, -41, 37, -200, 88, -58, -106, -39, -99, -22, 73, 98, -187, 14, 128, 210, -132, -96, 3, 191, -7, 60, 182, 29, 172, 62, -155, -9, 56, -66, -5, -62, 8, 101, 55, -37, 283, -60, -115, -51, -119, -120, -183, -139, 13]
4451A3j0p0J85Q7k94Q0J57k38O6K20k60J6n9J47q3J38k09J44Q0Rj43P0O2k18P9
4476c1%m8Q0L6q1R4k9n3J76k22n5K32j25J69o7j27M8j7N3n9K1J20q8M3j40O3l9
4503d6L0J30j63O4J29j0o8r7n8J78m7j01P3JK0O3KMj08o2J17j41J58k27K0QL13
4530A82n2m4p6j26l8J03R4J00j46j66K70o1j12J05l8J4QJ52k69N1J00O2j60J83
4554A36j86J10j3m6r5LJ17J92k20J97q6p2j12j2m1Q7K3O4p6J65j79K04k64P9l
4579b8M1j14rJ76j03L0J53k15J32l1P3M5j60K26j29r7J59n7o2k6p0J57j32J06
4603F5n0J23j18j94J68K1j07N3l3k4lJ68j87K02j35L7j25k7R8nJ84m9k03L01j65
4628eK22j36O8k73K09j72m5R3J03M5j02l3N5j39Q1L4M2j66J18nq2K81k53Q6o6
$$ y = [13, 3, -67, 118, 205, -89, -9, 148, -90, -24, 196, -64, -48, -107, 40, -43, 95, -114, 30, 110, 119, -24, 46, 108, -110, -31, -31, -79, 1, 37, -44, 50, 21, -32, 144, -78, -133, 99, -26, 143, 76, -51, -3, -20, 33, -26, -5, 115, 27, 70, -70, -7, -46, -16, 114, -49, 15, 144, 134, 66, -31, -89, 89, 42, -59, 14, 15, 35, 98, 100, 104, -4, -66, 51, -90, 68, -159, -139, -131, 182, 130, 86, 10, -116, -154, -51, 43, 143, -3, -169, 101, 40, -72, 33, -5, 9, 17, 169, -100, -49, 51, 113, -47, 136, -50, 60, 47, 1, -94, -91, 26, 218, -2, 195, 109, 37, -75, -87, -128, -41, -18, 46, -30, 135, -44, 160, -104, -25, -28, 13, -101, -110, 66, -37, -7, 146, -69, 63, 32, 105, 150, -10, 216, 87, -10, 149, 92, 30, 4, -66, 91, -41, 65, 15, 138, 20, -174, -6, 15, -92, -39, -72, -96, -99, 69, -118, 84, -51, -14, -139, -166, -68, -73, 111, 62, -141, 160, -5, 217, 81, 149, -124, 85, -87, -132, -39, 64, 109, 7, -26, 29, -110, -29, 5, 47, -119, -1, -6, -88, 193, -60, 26, -40]
4653d0J17r9j02J37L3%l0j20N2J82m54M60k87J60k19N0J23m1K74j22l5P9j27j15
4677a24J27O1Q2k47N7K60J56Q9n01R7L68q12L30P38m73m30K23nK7n2%k09J77q1
4701a42J57K1l13P8qL40j03L20m85K30M1m33J51L82j15Mj4k05J53Q8j34p2p6P6
4725e9M4l8RJ44j60j14M80m68m6K90k13K0J81J81l98J67L2J71k12q5O9O6K74l72
4749c7k07K89l9R1k82L70k4J89n47j78M94l19K08j4o00P51j12o40Q89k23J73M02
4771F34q23J63k67j87R49n40l05Q9L17l38M26l61J9L48j35Q40o76l06K79J2m43
4792c05N96l11J76k00n5Q1N16l77m64O86l99N53m91k53J37K06p9K12o30M89K89
4813C77k74l98M66n11K90j82N69m60J95k02J71L47q9j1R7j59m73p0L01j8m09Q98
$$ y = [-40, 77, -22, -124, 13, 46, 46, 16, -104, -52, 130, -324, 136, -151, 9, -210, -160, -37, -78, 196, 74, 39, 118, -9, -124, 3, 64, 146, -101, -44, 216, 372, 461, -40, 57, 425, -387, -57, 681, 208, -222, 1, -4, 23, -29, -29, -238, -61, -142, 15, 36, -277, -199, -207, 133, 30, 350, -135, 95, 136, -297, -146, 236, 121, 125, 111, -94, 59, 147, 13, -59, -135, -59, -15, -53, -44, 100, -60, -174, 306, -162, -208, 82, -131, -111, 70, 251, -147, 20, 52, 223, 11, -74, -5, 61, 335, -37, -244, 45, 6, 97, -185, 185, 161, 350, -197, -375, 119, -200, 8, -6, -606, 145, 33, -607, 282, 59, 232, 634, -189, -26, -293, -480, 469, -71, -376, -287, 30, -308, 118, -243, -224, 124, -11, 829, 153, -153, 126, 138, -305, 291, -20, 156, -44, -99, -18, 498, 121, -343, 343, -56, 497, 6, -247, -110, 96, 17, 229, -401, 88, 377, 103, -295, 171, -340, -50, -232, 337, -123, 72, -130, 41, 388, 299, 288, 385, 226, -247, -317, -16, -34, -443, 455]
4835D55q09N05R7m2k50k07M11k06j53K22L4q5k13L89n1k53K61j09P1q9J67j21
4857B4j30J03M7j77J61j03o7J88L2k22J70j4J9L1j9k0r4J64j25J6J8l0P1n4R6
4882H5j39l1J87o0RL6j08o9k7K00j65J44n6R9n6m1o7j20P5M9O0O5l0j10L5P9j87
4909a43J04j20K62j02o1m2qJ37jO1k12Q4J39j75K27k57R8j05N8J46j31J99m5k24
4933a11J22o6O3j34l8K0NK21K3j17q5Q3n4j11Q2o2J97n7Q3j82Q6J50j29J36p9
4958D6j88M4Q6j05N9N9J37q5n1OLl8K6n3J1j50L63j55mJ58j86j11pJ00j25K83
4984A23n1nj00l9OM0j64J81J73k90J15N4P9p6j23jJ40Rj64J08p8K0O7J07k08J35
5010E8n9J17j92J35l61L71n0o9J01j57K2kR9k44M02k60k2M6J37p9j69K59k43K29
$$ y = [455, -354, 151, 248, 206, -44, -251, 160, -46, -199, 23, 57, -28, -241, 148, 97, -156, 105, -4, 67, -22, 145, 24, -106, -3, 44, -133, 28, -75, -142, 46, 78, -144, 26, 12, 31, 62, 43, 23, -71, 93, -32, -16, 2, -28, 43, -11, 85, -54, -85, 102, 42, 51, 87, -21, -90, -117, 83, -82, 62, 6, 105, 49, 8, -59, -179, -104, -55, 5, 70, 40, -70, -35, 44, -143, -39, -159, 103, 1, -60, -102, -110, 27, 26, 87, -125, -41, 98, -77, 150, -107, -9, -114, -56, 90, -41, 158, 113, -111, 11, -55, 8, -126, -164, -144, -139, 82, 105, -12, -97, -14, -68, -179, -97, -159, 38, -19, 64, -118, -32, 118, -11, 125, 46, -142, -98, -12, -117, -58, 1, 138, 53, 2, 8, 11, -27, -1, -54, -43, -193, 170, 15, 11, 169, -17, -128, -135, -35, -160, 123, 72, 67, -33, -72, -66, -26, -190, -9, 164, -126, -11, 43, 122, 46, -77, -78, 62, 71, -93, 15, -63, -43, 24, 131, -77, 58, -1, 116, -76, 59, -302, 69, 19, -50, 51, -106, -84, -86, 13, -231, 171, -89, -111, -65, 72, -7, -176, 83, -160, 69]
5034F9o9m0L5J60k07j84J45J34R8k61R5L9N1q1J67r0j87J75j57J30J12j57L6q3
5058g0O4Q7J0j35j4J29j81J90%k2m0R9k55J02L8J47j27j79J07J79l50J64J19N6
5082A18n5j26L5M5n9K42l7l91J99J10n1J47k01l9K3K7P1k28J94q3MJ8J24j25l3
5107g1n5K4J1J29j72J04j06N9j6P7l6R4J2J4l55J31K13o5l5j9J13r6N3q1J41O4
5133A32oj34R6j86J33lO0J77k36K8j71K26or8q4Nj7k7J07J09o3j32N2J95j80r1
5159a14J41J24k02Qk9q2K23o9J53k18J1J25j55M9J56r1K31k30q7R1l8j16J44j19
5183i4L2M6J05o1P1m3j43J24j51K30k10J89k06K0K55j19j62J07p2MR6q1r3L4P7
5208d5L1j37J30N5J22n3k9j08k7N9J7M4k58K09l1l1J71K3r6j72J43L1j09L0J30
$$ y = [69, 0, -40, -5, 155, -52, -236, -91, 43, 141, -120, -25, 14, 65, -16, 151, 61, -126, 49, -108, 22, 134, -23, 13, -70, -6, 81, 91, -44, -58, 71, -110, 80, 80, 58, 18, 117, -138, -36, 2, 149, 22, -157, -50, 129, -221, -57, 62, 118, 63, -63, -28, 17, -42, 200, 163, -228, -29, 81, 30, 177, -24, -63, -40, -13, 58, -170, 24, -59, -55, -37, 87, -38, -71, -126, -102, -91, 38, -134, -30, -136, -77, -93, -16, -52, 42, 54, 68, -287, -156, 57, -8, -43, -62, 51, -45, 8, -73, 68, 132, 126, -8, 88, -98, 35, 32, 92, 269, 33, 61, -110, 116, 110, 12, -72, -67, -84, -111, -4, 105, 42, -90, -38, 157, -23, -114, 27, 151, -51, -43, -72, -154, 69, 0, 153, -65, -54, 71, -84, -35, 121, 30, 261, 31, -56, 35, -3, -119, 25, -94, -62, -16, 89, 28, 99, 56, -87, 37, -114, 116, -94, 95, -111, -91, 164, 45, -117, -10, -82, -78, 18, -63, -156, -122, -45, -14, -151, -21, 34, 156, 103, 74, -34, -61, -2, 15, 59, -199, 10, -21, -52, 119, 142, 46, -126, 17, 48, -61, -31, 99]
5233I9j88J51j07k7Nj14Q6P7J04J07j21Q4k32%J81j3j81R3q6R5K7l7n3j47K24
5258B7k30J65m6K22j82Q5j06L6J36o8j03LP8o1M9L2n6N5j70p6J46J57o8J08j33
5283@J53j06r7L9J4jJ4r6M2l1L8l1K85j57l1m8M6k1n6q8J36Q4J8p3j92L10j18
5310C3Rm4J62n4j72M6oO7Lk07K79j19O5j21J4Q8r6O8j29J1L5J97j18N1j44K37
5336A55j23j02j33K10N2J43k14o8n7J08N5J8p1j07K85j22J0Jk66J20J50M3l9j00
5360e2J02j37m3J90o4J22k7k99K17r2R4p3Q7l1j59l9K03M6l2Pj10Q2L7L8j58R9
5386HM5M9n6L2j07J77o8K6j34J75k03J29j30J05m9j4J06j83J90p5q6J35k04J24
5410hK08j01n8o5j08J70l8k8j65J62Q5j22K09p7j15q7R6J9p0O0J19r4N7q3J43
$$ y = [99, -89, 62, -45, -72, -67, -181, -95, -18, 86, 193, 72, 156, -76, -76, 105, 92, -89, 4, -82, 13, 40, 3, -50, -197, 27, -203, -38, -84, 138, -44, 41, -65, -29, 107, 39, -64, -61, 17, -44, 5, 37, -19, 36, -134, -210, -64, 93, 25, 133, 0, 153, 47, -50, -11, 3, 2, 16, -80, -38, -69, -31, -62, 223, 66, 35, -13, 33, 12, -44, -132, 4, 88, 106, 33, -159, 151, 33, 42, -2, 160, 106, -66, -20, -26, 41, 44, -163, 116, -3, 62, -59, -45, 43, -53, 15, -114, -103, -68, 129, 11, 62, -82, 155, 32, -70, -203, 7, 59, 202, -12, -80, -137, -29, 26, 44, -27, -134, 151, 29, 39, 40, -226, -106, 44, 87, 48, -52, 50, -87, -130, 60, -4, 118, 91, -208, 9, -83, 11, -62, 25, -6, -165, -204, -1, 45, 13, 20, -90, -8, 29, 67, -91, 8, 53, 102, 46, 78, -29, 148, 80, 106, -28, 147, -56, 73, -57, 48, -1, -15, 91, -92, 98, 23, -63, 72, -132, -8, 200, 99, 41, -24, -132, 38, 0, -28, -193, -31, 54, -68, 141, 64, -51, -138, -42, -23, -93, -33, 86, -8, 49, -34, 109]
5435A09N6j23p4k6M7Q3j4J31l4o3r2O8j71J74N5o3j17k40L74j93J71J0o0j26K18
5460A00J2j32l9q0P7O7j43J45k4R7j97J35r7O1l9K10j16r4O0j5k0J11p0o7q9J37
5486a0L7O0j33n5q3J14N8j21J71m6J31o9n3J8n7p0O8k2p7K95j23k78K31j06J63
5511D3Mj16Q5j1l6qJ6j22J65K2o4L9j36J23j52J78m2J9N2k05J31J27k05J1L6k9
5537g5j5J77j50J54J3o4j08p9K49j34M1J77k28P7l5L6M6m7q0K1Q0m8R5j60L0J37
5563A10O7l53K72p4r6K5Q5QM2k2j38Q7p8J15k10P4J50j04Kj1MJ13l8nL7J5K7o5
5591C9j96J14M9l6j23R0j19J62j2K4J02nKj72M2p9J87j27J17j21J77J1l03L15
5615A38j4K0j92P5L3j38J3K5J57j06M9o4n2J52k34J35l0lo7Q4jJ12j55J43l3l7
$$ y = [109, 165, 42, -32, -58, -11, 72, 58, 189, 155, 92, 0, 68, -103, 71, 126, 63, -54, -294, 80, -113, 58, 68, 8, -118, 100, 112, -20, -59, -139, -62, 5, -138, 7, -17, 80, -117, 18, -79, -18, -57, 153, 37, -57, 3, -12, -32, 79, 9, -58, -147, -10, 27, 87, -46, -101, -184, -70, -12, -133, 38, -8, 123, 54, 1, 19, -38, -108, -40, -62, -139, 156, 33, -245, -14, -120, 43, 47, -69, 16, 5, -31, -39, -23, -145, 20, 42, -22, 17, -119, 4, -148, 30, -12, 7, 59, -146, -15, 112, -93, -82, -46, -75, -90, 87, -63, 91, 104, 40, -68, -147, 102, -32, 9, 186, -42, 35, 0, 36, 82, 35, -45, -24, 56, 8, 103, -57, -27, 110, 177, -176, 96, 22, -74, -49, 36, 44, 86, 64, -74, 13, -65, 50, -160, -86, 64, -40, -38, -49, -45, 68, 30, 25, 62, 77, 104, 39, -157, -43, 6, -30, -153, -63, -182, -20, -32, -8, 94, 89, 91, -81, -39, -118, 69, -58, 59, -62, 115, 126, -177, 138, 124, 144, -48, 27, 60, -78, -65, -40, 117, 11, 60, -4, -56, 96, -138, -3, -33, -36, -103, -19, -20, 92, -63, 80, 47, 10]
5641A0j10J30j14J22j8k06J77j6r0J26p3J95l06J85Lj04K98l95J60l7m1K34p6
5664E4L7j75p0J61p4J55j21j33J99K0p5J08j26j49L11j91J30K0j93J53k4L0N6
5687A03r8R3q3JJ16k38L02l55J30k3L6o9r3L7K73j28L0j39P4J32j23j5O9R2j19
5712EJ4j56J95j87J7J20q7J3Q3K5N6o4j30Q3M2j67K70k42J09J24j74J93l4j47
5736c9R2Jk7k4J22j39r4Q8N3k6J24k39K26M1j23M8k4j44l7O3m4J29J2m0L0J65
5762A94r8M2k69K6K02j10m7K49k30m2K63j94q1J26M2Q2k18J1O5J49j43J81k17
5785a7J19r7j37J60%J97l60J04j7R0j89J10p5J53j16R7k8oM8Q9j04p1M7N2m6n
5811bp5J27L0n1n5p9Q2P6Kj20O9l7P0J07k23J31J11j71o0J03j34Q5R0j04R1N8
$$ y = [10, -100, 30, -84, 38, 20, -186, -9, -25, -115, 11, -62, 133, -173, 12, 15, -89, 209, -186, -26, -63, -104, 130, 54, 91, -84, -154, 7, -67, 88, -33, -166, 33, 53, -22, 86, -40, -189, 122, -69, 61, 81, -112, 41, 17, 47, 103, 5, 98, 15, 16, 132, -106, 196, -159, -29, -52, -16, -85, -178, -141, 132, 4, 34, -105, -31, 101, -22, -37, 32, 124, 5, 19, -137, 58, -129, -112, 8, -79, -66, 17, 42, 98, 34, -96, -13, 29, -138, 132, -110, -1, 123, -51, 142, 108, -39, 53, 54, 27, 3, 125, -14, -108, -20, 33, 7, 131, -108, 118, 159, 36, 84, 60, -84, -121, -58, -102, 27, 39, -1, 29, 194, 96, 138, -131, -105, 97, -13, -60, 189, -41, -83, 180, -14, -95, 31, 73, 155, -63, -52, 13, 162, 19, 200, -17, 102, 5, -132, 28, 28, 225, -135, -31, -48, 42, -147, -37, -112, 41, -75, 22, -6, -12, 36, 125, 21, -50, -3, 49, 3, -2, -77, 50, 80, 29, -26, -105, -23, 53, 55, -65, 4, -33, 37, 144, -79, 52, 163, -8, -68, 35, -99, -14, 76, -28, 63, 121]
5837A21J1k02K0QJ06j45J08O7k40J25O0M0j38r8R6M6j23j5J10J55n3r3J6k8r9
5862a45J01Q6j56J82j33R8j26joJ08m9J56k14j9P3L0J42k53K15r4J54m10K08Q4
5886C1j54J00k3Q7N6j19Q1j02P3Qj3k8J6j2M6o9j77J82p9K07j24Q0r1o7J56o0
5912En7N9K02l60J47N0N9j05J99k1q7o6p1J2Q0oJ2O1m9k44K3J28Q2O5k61J72k9
5939@J6K3J08q9m4kNj17M8K7l5K25l26K85J9r1l1j93K35or2kJ1J4LK9r9Q8k2M4
5969C1o0p4r6L31r0O5m5q5K05k2k55J42j7Nm0N6n5Pp6Q0Np1K06j96P1j18Q9N6
5997D9j17J63k8m8L0m9J39j04K04k02n5Nj1Q1q2j68R1R4n0Q7O0j34j5J44q4J22
6023A22J4j75j8P8r4P5k01J96N2j48K4Ql5J30J12l0q8J2j4j19J15l1%m3K26j63
$$ y = [121, 132, -70, -50, -42, 64, -81, 27, 94, -146, -21, 39, 79, -59, -157, -61, -15, -138, -153, -43, 112, 59, -34, -18, -46, -145, -44, 42, -114, 68, -65, 33, -93, -94, -100, 8, -41, 115, -99, -118, -45, -15, 127, -126, 89, -5, 149, -261, -53, 31, -123, -23, -46, 41, 97, -22, 59, -43, 30, 38, 25, -3, 13, 1, 47, -22, -199, -17, -96, 111, -13, 67, -24, -91, 65, 5, -52, 7, 209, -151, -4, 46, 105, 0, 199, 178, 91, 25, -46, -34, 46, 40, 52, 113, 64, -180, -157, -29, 53, 118, -143, 29, 0, 16, 39, 147, 58, 14, 12, 17, -100, -52, -25, -60, 165, -161, 124, 143, 52, 21, -172, 63, 57, -35, -37, -26, -12, -9, 20, -79, 9, -13, 31, -29, -103, -199, 132, 42, 107, 62, -23, 182, 160, -95, 47, 30, 35, -5, 51, -4, 3, -73, 7, 12, -59, 147, -49, 22, -96, -7, 49, -68, 95, 67, 19, 49, 0, 139, 35, 239, 37, -18, -13, -24, 57, -25, -193, -102, -8, -58, 29, 89, -45, -60, 84, 0, 122, 136, -39, -57, 21, -73, 2, -199, -3, 49, -99, -75, -67, -102, 28, 140, 110, 22, 34, 20, -99, 16, -15, -15, -58, 168, 5]
6049EN8j15J45j04J51k8l88K50k0m2Q5nK3l0P7ML5j7j32R3j70J57j60J98j21k0
6075g1r0J43R4k48J70o0J43k03M4J36o0M1q2j61J66j0n4P5P0J6j18K55q3k19R6
6100a0J52k58k3Q0K3N9j1j28J09o9P7L8K3j6j54J11rN9j18K4n9n1J17K6L6l9O1
6127E0m0l2N8j83P7J18J55j01j15J43l1j45j5P1J1o8J5n4P6R2p3J17j23O3k01
6152a35J11O9j22Q7R8k00J51l2L6N2j21K09k78R3j96J74Lj9N3j40k2J82Rj38J28
6177E2O1p6K7R3k08RqQ2n3K0j7K19k15Q0j4P3j08K42l14P5j47P8P3j37J04P6Q
6204G5L6l6m4n6mn3k1K04o8rj24N8m8rK10j7q4O0p7K24j43m5k9j19L19J01k13
6231H8r3J1q5P4j09K38n1j07J0L4k16J56m4J49j36K15j07l2r4K2K37j84m5j2N2
$$ y = [5, 63, -52, 93, -11, 140, 112, -276, -26, -46, -88, -3, -8, 15, -15, 62, 66, 101, 84, -48, 45, -125, 32, -128, 70, -51, -71, -161, -18, 76, -172, -2, -62, 81, -122, -78, 58, -2, 39, -43, -204, -38, -48, -102, -27, 43, 59, -59, 196, 113, -106, -10, 142, -116, -139, -59, -36, 23, 12, -116, -7, -76, 1, 39, 62, 46, -108, 3, -6, 53, -65, -41, -100, -151, -34, -8, 28, -11, 50, 10, -22, 36, -147, -70, 48, 203, 102, -13, 130, 99, -46, -61, 10, 21, -47, -32, -86, -10, 82, 9, 126, 3, 66, -135, -24, 45, -77, 10, 108, -92, 59, 27, 63, 115, -6, 203, -75, 18, -178, -4, -1, -20, 33, -107, -129, 53, 62, -76, 52, 113, 37, 64, 157, -51, -42, -50, 32, -21, -1, -18, 201, -14, 66, 52, 125, 17, 259, -55, 20, -127, -49, 24, -113, -9, 67, 75, 111, 75, 31, -25, -29, -82, -103, 101, 33, 24, -100, -42, -90, -99, 111, 94, 10, 70, -7, 217, 74, 29, 0, -119, 200, 301, 88, -5, 6, -79, -5, -114, 124, 73, -34, -24, 10, -206, -50, -94, 55, -81, 134, 27, -5, -99, -77, 160, -24, -69, -81, -29]
6256b9q2J06r6J28J26k47O3O8L5R8j48J17j33j07J28m3l1m6J15k2Q7j47J3Q5M6
6281H4j23N7M1P0k26P1Q7o8q0K2j3K0m8J55j83L1J20o3k1J37O2j06j31r6K62N6
6307A17K1k34J88p7rj13J32KJ11k6j2l24O3L51j64j63J64m5K0J41j46J15q7J90
6331B15k16N0r8KRm1L1P8L4j03L8L2j0j52L6J29J0r7j06J99j04O4j04L7J50M0
6357A23l7j57o0J87q0K2j5n7M7jR5L2k04K28o0Kj07K5R7j27L9J19j48J21r3j44
6383a53K6K09j42j15J30Q6j46J82j07J74j49q5R5o5O3M2J22l83K93o1J4l3j38
6406a41N1L0J52J4j19J13k2j97Q3J62l3N7r6K1k40R1J37Rn3r4J38k84K12m7K79
6431B23r8q1o4Q7J47j52j71p6J72Ml8R1L6j69J63m2j10j25J20N7L3j50o2K75j28
$$ y = [-29, -111, -5, -101, 27, 153, -94, -31, 37, 72, 170, 22, 139, 6, -101, 27, -16, -47, -93, 22, 0, 87, -60, -47, 38, 84, -39, 18, 59, 129, -97, -26, 61, -7, -87, -65, -78, -58, -106, 49, -134, -103, 17, -46, -67, 70, 132, 26, -105, -201, 61, 117, 138, -96, 92, 15, 6, -107, 25, 27, 138, 112, 100, -224, -161, 190, 26, -137, 27, -18, 2, 143, -3, 112, 25, 215, -1, 49, -49, -47, -38, -79, -48, 30, 64, -39, -1, 31, 21, -131, -95, 34, 44, -53, -159, 40, -64, 0, -104, -67, 83, 123, 86, -71, -131, 56, -24, -2, -17, -74, -27, -28, 67, 99, -105, 123, 63, 65, -42, -17, 80, -47, -8, 111, -37, 84, -9, -153, -127, 82, -60, -175, -45, 41, -105, 77, -30, 144, -5, -90, 5, -60, 3, 45, 167, -216, 77, 16, 30, -3, -141, -90, -60, 92, 106, -13, 100, 78, -119, -36, 126, 93, 150, 54, 75, -165, -74, 63, 72, 19, -75, 63, -221, -9, -56, 223, 125, 44, -20, 67, 214, 62, -109, -185, -13, -9, -47, 44, 80, -89, 74, 32, -78, -203, -83, -26, 7, -143, -205, 70, -58]
6456e8R1j4qk6K6n1KK1q8N6K2J46k08n0R6j36P5L4pL5qJ48k24l4J93j25J88m8
6484D8Q7p8M4m7m6P8j15L0J19o5p4J00j40k08K62j28J81j6j74K1J02LJ53k16k1
6509a00K26p2r4J47l6M3l8l8j09M9L7m2O5j66N5Q2j31j03L22o6r1j59K22jJ04
6534A06j16j30JJ23M4OQ5k62J47m2R4L1J21p4j93J01l2L2J10k26J81j32K1j23
6558a27N5K04k16P3N0j5j03Q4O1l0k7j8j15J31j28J59J2k3N1L8r6n7o3K60j44
6583A6M4j07Q6J15j81p5J85j20J9o1J60j36J09j81R8M8j31L7J19j40J87o8J42
6606A65l90K44N9j28R9j35J1P0KM4j57j1J75j05J34k06J01j0N3J62q6j70L5o2
6630a06M1M5M1m6L8M4qj14J60j26J06K3j57J36j37K7rJ84l4r6Pm1j66K43j35J14
$$ y = [-58, 33, 19, 11, -15, 11, -40, -38, -17, -105, -49, -27, 119, -89, -139, -43, -179, -104, -70, -77, -42, -50, 98, -126, -160, 33, -92, 96, 48, 135, 57, 101, 54, 8, 86, -29, 1, 120, 55, -19, 81, -59, -267, -5, -133, 48, 32, -142, -121, -19, -16, 137, -79, -100, 126, 54, -40, 107, 71, 114, 76, 38, -71, -22, 15, -27, 38, -128, -73, 9, -122, -225, 97, 31, -60, -219, 3, 2, 106, -10, -140, -139, -16, 28, 34, 119, -143, 4, -38, 56, 87, 208, 134, -59, 42, 10, 42, 152, -74, 107, -25, -4, -127, -72, 132, -84, -11, 39, 24, -79, 5, 66, 36, 9, -9, -124, 7, -121, 38, 50, 27, 78, 116, 20, -37, -100, 160, 16, 60, -47, 39, 154, -27, -102, 83, -37, -18, -79, 81, -55, 54, -127, -29, 19, -112, -75, 44, -96, 91, 23, 165, -225, 19, 78, -50, 49, -86, -75, -5, -3, 41, -116, -127, 48, -57, 77, -129, -28, -38, 15, 177, 91, -79, -44, -106, -65, -20, 21, -25, 13, 57, 49, -65, 95, -31, 75, 98, -59, 77, -60, -33, -42, 142, 108, 12, 19, -22, -188, 55, -80, 34]
6656C4OK9k29N3O5m4J66k7m7j29K29j81M6R2j35M9j17L41j74j06N3p6J7J40q1
6681b6J23j01j65L0R3J36j12q1K44q9N5k52K05K1k30J63K28j31l4L4J1k69J99
6704E2j24J13p3P1n9L3P0j18K11k72Q6p5J91p8K4J7j39P9J82j68J36j2Qk53l0
6729a28K39m6j82J83p3M1m2l1M5J18j46m4J16m9j07Q6j6P2P9o0p6N3K8J9j66J62
6755G5k6n0J41k8q6N4n9j6qM9J18n6J4k45k1J98l7p1K66k1j53n9J67p2j30O0L7
6782D1L2Kk0k11J70M1pj53K73k52K33l8j46q1J21n4J61j43K3l6K5n0O6J16k68
6807a55J52q2J08M5p5r0j94J99K10q2j0k4l0j27K26n3j51J03L0K4q9R0M1M1l5
6832G2Rj98J5k8O6K28k48K21l14J24J27j70J44J4rj68K46l5p0M8K8j59J63O8k00
$$ y = [34, 40, 69, -160, -107, -42, -86, 80, 53, 6, -123, 106, -75, -29, 63, -72, -23, -140, 201, 27, -79, -26, -102, -85, 55, -26, 97, -4, -169, -139, -46, 90, -22, -103, 141, 52, 107, -145, 60, 81, -149, 14, 242, 111, 77, 111, 122, -147, 52, -72, 41, -32, 39, -20, 13, 83, -35, 176, -96, -10, -85, 106, 28, 52, 69, -70, 9, 191, 23, 159, 147, 155, -98, -128, 111, 65, -117, 66, -7, 34, -8, -39, 6, 124, -22, -66, 50, 1, -106, -20, -36, 36, 115, 55, -21, 32, 60, 79, -87, 75, 49, -1, 140, 112, 26, 80, 21, 5, -3, 46, 164, 108, 122, -123, -144, 54, 17, -54, 212, 191, 38, -21, 146, 74, -56, 4, 41, 73, 75, 55, -156, 14, 55, 48, -105, 168, -84, 149, 111, -35, -116, 5, -49, 112, -31, -8, -44, -19, -69, -3, 113, -155, -3, -85, 23, 68, -7, -97, -291, -92, 118, 36, 26, 2, -28, -155, 71, 18, -133, -30, 0, 24, -65, 25, 66, 107, 72, 81, -117, -102, -130, -64, 164, -84, 137, -177, -53, 74, -96, 48, 62, 53, -115, 131, 96, 26, 74, 102, -57, 106, 174, -26]
6857b6l6J70j50q7jJ69p0J55q2j99N6J23m7J5R3L6j18J17j45J44l6j46J28j65
6881a02L02j87r7J17o9oO0l1R1j10m1n5kJ9K01j50P6N9j11J43r8L7j96J65p2J42
6907H5j48p9J13L9k2j80K18j57J82j30P9j09m2J68k8m1J54K4j58J25J27k66J00
6930E4j64J35k76M30j34KP7j27j18K39k80J43j6mJ16O9j08j02J56r5K02l09L39
6953B29k55L3j37K13j88J13K2k28K30j76O1N2j44J75j44J60Pj44R0%M4N1M4q1
6977B7J66j07j51J59o3o4P3n7j95L41j07N1lj58P0R5n3o2J10k2j60m6K20j69J59
7002E4l4J50j22o0k1L2J42j06k5j3J47k07K4J6J65j04o0L1j21K73k31J86n9j94
7026a37J24kj42J81m1L8j15J27N8j65J31o2R2k03J61j2m9O0j72o6K56k13J29R7
$$ y = [-26, -62, 108, -42, -129, -130, 39, -31, 124, 42, -157, -101, 22, -25, -10, 83, 119, 1, 118, -27, 117, 81, -65, 63, -102, 200, 13, -84, 33, -36, -42, 18, -13, 78, -32, -73, -128, -130, -111, 90, -60, 16, 75, -36, 107, 9, 46, -150, 15, -57, 85, -63, -142, -29, 10, -12, -192, 26, -131, 51, -79, 0, -109, -151, 17, -11, -52, 102, 126, -32, 93, 220, -46, 54, -110, 25, -251, 179, 45, 47, 124, -3, -121, 118, -162, -19, -35, -39, 77, 146, 38, -64, 92, -3, 199, -110, 229, -26, 7, -130, 83, -105, 8, 30, -198, 32, -144, -83, -31, -175, 0, -144, 16, 23, -121, -31, -31, 13, 64, 108, 27, 193, 86, -65, 94, 31, -33, 40, -17, -212, 129, 22, 73, 70, -88, -18, 77, 24, -38, 72, 50, -110, -156, 64, -105, 54, 20, 170, 48, -12, -33, -1, 141, 35, 10, -3, 144, -63, -39, -23, 142, 38, -22, 9, -112, 161, -70, 116, 57, -137, -13, -15, -157, 24, -17, 21, -94, 33, 91, -74, 57, -5, 87, -116, 45, 33, -16, 44, -128, -194, 62, -151, -22, 75]
7050G5k2N4j37n2J07k87L91k00N1L3p0k8J64J28j36j29lP6j50K08k44J74%J17
7074A20l26K20j15P8K5J15p7oJ10j64p0J08j92R0O2Qj0M4o2J7K8o0M1j08K84j73
7100a3m8J15r1l3J38n2k5j2J67k72L23k37J34r3Qq3J7r5M1L5J81j44J23o1j25
7125a02o8J70K5j98OJ80k6M5j08j5j79L02J1n2l7r5J57J44k63Q0R6j01R8k03L8
7150i5J69k46J30J20j37M1J29M6j87L3jQ2k59L47n1j92K69q5k64PJ65q7K5k7J40
7175G2j40%Q8J4k08J8J55J2J75m05M55l18o9J16ML1k3q1J22J3J9Q7q0n3j82J51
7201b7J49k72K5MM4o4N3K71l10NK26k16L7J02L2r1K0M6N2o4%k13J98J31j43O7
7227F2n5L3j13n2J13j07J72n9L4q6J0P2j01J14r3P8j29J09j48K82q8k5r0rQ2n
$$ y = [75, 53, 107, -30, -82, 25, -262, 129, -71, -20, 13, -57, -85, 79, 207, 71, -58, -61, 15, -135, 73, -171, 3, 3, 120, -206, 14, -101, -23, 2, 117, 40, 34, 144, -20, -90, 18, -174, -84, -22, -14, -24, 20, -42, -25, 3, -57, -16, -124, 160, -13, -61, 54, -37, -70, 68, 16, -9, -21, 146, -126, 197, -40, 94, 1, 9, -74, -57, -152, -111, -76, 105, -39, 84, 23, -102, -170, 0, 25, -173, -167, 13, -13, 32, -76, -91, -270, 32, 43, -9, -46, -141, 16, 160, -103, -23, 73, -28, 70, -133, -95, 74, -172, -42, 78, -59, -18, 111, 157, -30, 3, 2, 84, -175, 172, 121, -71, 198, 113, -151, -144, 21, -66, -41, -68, 72, -68, -68, 20, 34, -174, -156, -1, 11, 186, -219, 236, -82, -151, -35, -31, 0, -23, -104, 18, 31, 50, 137, 57, 4, -178, -27, 122, -150, -125, -121, -77, -141, -88, 183, -127, -122, 104, -112, -75, 27, 59, -32, -12, 34, 86, 22, 22, -191, 7, 138, -5, 62, 7, 40, -73, -125, -12, -119, 53, -6, 28, -58, -48, 24, -77, 37, -56, 22, -107, 2, -146, 136, 48, 23, -67, -76, 6, 1]
7253AP6K3j58p9K97j63J29j40q4J26L2o0O4j06M2n6lJ5k9k1M1L4n5J06k1r2K45
7280A64k9k36J01J8J52j44q5J89j85k7K38j80P4j28Q8J12k81J23j07O3J42p8m7
7303f3J30k23K81qj30Q6j28Kl5j0J49M0r0J2KJ6k78K38k8J83j81q3J27j92K36
7328E3n0M1k1j86J06k4J22k62J72N8j4L7J25l13J01O4j54J90r2j05K57q3j2j01
7352i1R8L6m6Q2j89J05n4J5P2RL2k9J1p6M9j58L93k67l6J98l24q6L33r3oM9k4
7379CK1K6l4O5k44j5K55p0n3L6J5J12j96J35l2o6oP4j0K7%j04N0l6R0M9n5j33
7407i6Q3m2j5P9P3L8l7O6k97J67j01L9J46l27L13r7Pj58K07Q5q2mQ7k46M7kK60
7434A93k35n9J46J86k70K13m3J1k56J11o0J12lp4J63j21J03j08kk0J06n0R6r6
$$ y = [1, 77, 100, -58, -137, 160, -3, 126, -14, -98, 28, 60, 0, 64, -42, 0, -56, -59, -44, -73, -94, -53, -19, -74, 32, 11, -81, 164, 135, -101, 0, 18, 170, 26, -59, 130, -55, -82, 156, -24, 50, -78, 10, 122, -159, -36, -143, -80, 62, -16, -63, 67, -156, 125, 117, -13, 73, -55, -53, -88, -98, 51, 91, 1, 13, 15, 31, -247, -9, -37, 146, -35, -118, 9, -183, 53, 3, 44, 23, -163, -57, -81, 41, -221, -49, 9, -5, 32, 157, -156, -55, 9, -145, 45, -47, -152, 105, 22, 10, -91, 7, 43, -3, 79, -110, -5, -59, -44, 28, 37, 69, 40, 51, -25, 24, -134, 259, -8, -44, 154, -170, -256, 77, -16, -22, 27, 3, 24, 50, 16, 81, -163, -178, 77, 7, -46, -10, 5, 117, -79, 56, 24, -42, -48, 26, 16, 43, 43, -61, -11, -47, 43, 92, 37, -96, -13, -55, -70, 9, 82, 120, 83, 149, -148, 19, -82, -43, 103, -224, 89, -8, -1, -159, 48, 133, 51, 47, 134, -112, -65, -67, 193, -42, -101, 45, 231, -39, 174, 131, 142, -114, -3, -63, 49, 46, -28, 135, 14, 117, 9, 7, -13, 93, 43, 139, 43]
7458D3oj22J53n4j8q6J7n8K40l8j3Pp0l7M9j3K7j53R3k7P4j16k8J71m6R4j85J24
7486B2j37k2P7L5J65j53M9k43K7J37J4l5J05j35J34n8q1P3J07K1q1j0l8o0j65
7511b52J98Q8r4N9q2J2O4j24J99l5j77K46k55R9k8K24p2ON9j31K0m2j20J12M4
7536A8J7j34J02m8m3N0P4n3KK0J40k69Q2K11j04n6j36J87n2N2p2J7r1j6K4M2n4
7563i0K06j9j23p3K38l54K12k6J2k07J24K21k15O9k4N1p0q8J22N8n5k7J35n3p3
7588d9j26J84P1j31M9j44J31m4Q6M1J51k88O8k0J36mk76Q9J55P0j14o6J32m1j18
7613e8J31o0k2l5P8p5l2J94j98o0J63Q4k25J81L0k7O5p0o6M8o0o0J19q8r0J13
7639b0J10m5j32J28J28j42R2o7nr3M9K5RPPm6Q0j71O7j49R5kJ17k7M5j03J8M0
$$ y = [43, 37, -85, 68, 14, -4, -90, -73, -131, 109, 71, 58, 65, -5, -42, 7, -6, 21, -132, -39, -66, 8, -108, -136, 35, -11, 83, -102, 22, -115, -137, -60, -25, 140, -13, 36, -207, -180, -43, -29, -64, 41, -94, 40, -18, -99, -26, 81, 102, 21, 11, -27, -87, -252, -54, 34, -60, -1, -83, -71, -7, -131, 68, 33, -144, 102, -153, -54, -82, 142, 70, 76, 135, 4, 24, -18, -138, -26, 18, 35, -99, 3, -45, -88, -38, 36, -17, -15, 5, 145, -124, -42, 169, 65, 9, -127, 60, 8, 60, -12, 5, -86, -102, -78, -36, -90, 116, 97, -26, -99, 139, -215, -3, -29, -17, -224, -100, 121, -94, -25, -49, 2, -68, -156, -34, 24, -31, -58, 77, 24, -49, -175, 9, 80, -51, -2, -146, -15, -59, 27, 68, 219, -69, -1, -21, 115, 111, -165, -76, 79, 149, 35, -31, 101, 60, -58, 73, 13, -9, -44, 34, -41, -73, 121, -77, -137, 26, 110, -115, 66, 96, 69, 134, 64, -2, 46, -14, -74, 45, -43, -133, -20, 90, 45, -87, 41, 169, 27, 119, 52, 47, -46, 3, 28, 37, 44, 51, 5, 85, -86, -19, -168, -73, -75, 42, 15, 60, -43, -25, 15]
7667A5O2k8j98M8K7L6M5j40M8M0j34J41M0Q9P4L0k06l6J2J52j39K00j76p9J1K3
7693d3J0p0N7O4J33j88J7p2M1M2J64j87m4Q3N9k0m9k6k1J33j05J49j52R2j19J52
7719A00k87J92P8KL5l8j30jn8O0qN3j11J51ol0m9k4J50l01L08m0R3k56M8P9Q6
7746I6K9j65K0O7j58J11m1j1K30j45j41P4mQ4m8J7Q4j04r8K10jk32N6J89J1j88
7772e8J27Pj95J26j04o0J81J30q2K8j05L5j68J55j37J55j12J22N0J7q2q8Q3l7
7796a2q0L5O3J65k02j0o3J69n6j30J76j50K38l02o7L77k24J24q3o6O1J31j67M3
7820c0J46j93n6O2K4r9j38M66k73K48k46J36j16J01Mk9j37K71j86P0N1J08k99
7843a15J44O9k05Q7L7n6j14J27n4J41r1j22M9J08O5K2ok90K87L9r7q6J01l5j97
$$ y = [15, 77, 49, -149, -101, -74, -38, 7, -133, -85, -45, -179, -38, 2, 91, 165, 195, -11, -47, -35, 117, -22, 178, 2, -77, -66, -43, -33, -103, -46, 18, 151, -37, -20, -92, -51, -9, 155, -32, -76, 7, 66, 46, -3, -29, -50, 83, -22, 127, -25, 67, -52, 100, -187, 5, 83, 85, 120, 82, -48, -49, -107, -47, -55, -2, -113, 38, 32, 2, -47, -71, 79, -222, 86, 46, 139, -117, -69, 10, 96, 125, -40, -20, 47, -111, 0, -41, -52, 178, 33, -108, -34, -38, 46, -2, 15, 99, -5, -103, 107, 106, -126, -70, 119, 130, -58, 69, 76, -119, 7, -97, -157, 24, 154, 72, 100, -5, 30, -138, 17, -120, 35, -77, 45, 95, 112, 30, -58, 25, -12, -92, -57, 6, 171, -31, -41, -104, 65, 9, -121, 55, -95, 143, -159, -226, 151, -73, 51, -32, -98, -37, 94, -73, -30, 116, -77, -133, -71, -47, -146, -284, 182, -91, 157, -89, 47, -69, 32, 36, 7, -130, 141, -45, 25, 76, 184, -115, 29, 98, -107, -20, 17, -39, -153, -26, -80, 61, -30, -152, -103, 5, 70, 92, 86, -204, 83, 122, 25, -61, 40, 5, -192]
7868a92Q0rL0K04j27Q3J75k79o1O2Q7k8j04J74k53M4J38N5l9j81J41J2O4j97O8
7893e3%J80J2m5L4n1r4K1kk5L2m5p3R7O9K1K9L6k27J44q5Q3J1n1l5K7M6o3n0J43
7923H6K6j34J3M8n0o2J60j76K17Lk61Q1J24N6k51R5j61J34pQ9k6%Q3r5K8q0J31
7950G1q6J2L2K9r8N3K0P8R7l02j08K56J64k35kR0j37J09J69k34n4M0Mk8kK1jj38
7978a80R1N8O6J0M0j41K07k22N3N3j70M09k91O8K0j33J12j9n3%P6m1o6j01J04
8003e0R4j38L2RJ65%k6k08L1N2O8o0j3J33j57k2k0J18k1L3r7L1k1j49K36k5O2
8030E7L9j58Q9j9K0j81J61P4J9L1j6p8l9oQ0j22q6Q5J68k02O6p3m1J10j8n1%K2
8058f9R5J50j67R4o6Q0m5R5j30K2k09J56J03N4k00J04o4j0M9K1q0J38J06m42K60
$$ y = [-192, -112, -121, -91, 113, -14, 69, 244, -35, -96, -34, 53, 25, -79, 95, -158, -114, 24, 79, 40, -141, 0, 12, 76, -121, -53, -53, 127, 139, 94, 128, 77, -17, 4, 2, -23, 9, -36, -109, -12, 57, 78, 107, 143, -84, 60, -25, 58, 69, 18, -17, 10, 56, -7, -57, 86, 112, -22, -9, 39, -11, -73, 87, -89, 128, 131, -130, -49, 75, 131, -120, -25, -186, -52, -59, 30, 4, 4, 87, -8, 20, -60, 71, -15, -3, 29, 58, -40, 13, 33, 111, 208, -94, -202, 54, 218, -17, -19, 71, -66, 43, 212, -22, -76, -36, -32, -60, -62, -41, -42, -180, -89, -31, 35, 45, 85, -56, 151, -71, -18, 35, -135, 274, -17, 51, 71, -62, 50, 31, -22, -22, 54, 13, -53, -154, -50, 44, -94, -62, -53, 112, 112, 86, -122, -91, -39, 29, -31, -44, 89, -68, -90, -110, 8, -13, 20, -77, -46, -67, -216, 20, -5, 57, 96, -62, 27, 8, 28, -153, 8, 82, 101, 132, 116, 38, -1, -7, 73, -49, -135, -50, 118, -84, -18, -91, -132, -22, -40, -91, -91, -69, 26, 176, 9, 103, 37, 117, 72, 167, 37, 59, -150, 6, 109, 163, -37, 67, 3, -7, 42, 63, -17, 121, 227, -215, 45]
8083D5l0j69K14k17P6J22N9j8j84J08m2or9J35j14J67qP7k84L96j90q1L26k87
8107dk29J67N6P0k9m2j21J70j35K00j28L0j09j0J33k03K87J01j51j27K24j70R4
8130G4l4j25N8jL8j6m5Q1J2knj18J77q9oQ3k6j16J83j94J48j18j15Q4N7K7N0k31
8158a69J45M4k04J42j9M3k1J14l3r0j07P0J30j0q1R9r5J6Q1p7n7J6o8P1J38j85
8184a07L9L1J19l02K31o2o1
$$ y = [45, 15, -154, 60, -157, -81, 41, 100, 82, -102, 6, -36, -42, -141, -6, -120, 47, 39, 116, -168, 228, 38, -43, 283, -4, -233, -66, -10, 60, 31, -11, -132, 38, -97, 103, -25, 5, -104, -114, 19, -184, 103, 204, 53, -74, 150, -20, 74, 40, -85, -27, -28, 10, -6, -51, 30, 42, 40, 35, -83, 94, 5, -1, 82, 56, -60, 123, -71, 77, -41, -156, -72, -15, 12, 62, -169, -24, 20, -184, -42, -61, -18, -39, 75, 42, -48, -155, -85, 45, 35, -46, 53, -42, -26, 55, -22, -79, -63, -131, -60, 78, -107, -68, -37, 82, -220, 11, -51, -112]
8191a12
$$ Imaginary data points
##PAGE= N=2
##DATA TABLE= (X++(I..I)), XYDATA
0@%%%%%%%%%%%Qj6J6j6J6k4L2m0M8n6P2q0Q8j08J32j52J76k05K34k69L04l44L92
34B08m44N00n60O29p05P86q75R75j084J199j327J468j620J788j970K169k390K633
52A380k901L198l532L911m336M821n385O046o834P793q990J0536j2614J5571k0156
67a1492K8286m7036J71846P0736k24229P1041M5052l9398o6199j4322j6618M4014
79A1681r060n9920j2804O2733L867l4302j4676J8132J6088O970k2155n767K4762
92a4451J7612j8534r106J1851J5530J351p993p294J1247J1910m709r653N843R410
106A3014J638o341m218K398O062l115q963r16N094n66n029k411R70K467M70l610
122c056j839L358K399k689j797J847J579K91j205o94J284J335n21j351K61J294
$$ y = [0, 0, 0, 0, 0, 0, 0, 0, 0, 0, 0, 0, 8, -8, 8, -8, 8, -16, 16, -24, 24, -32, 40, -40, 48, -60, 72, -80, 96, -109, 125, -144, 160, -184, 208, -236, 264, -296, 333, -372, 414, -461, 514, -570, 629, -698, 770, -850, 938, -1032, 1137, -1253, 1380, -1521, 1677, -1855, 2056, -2280, 2541, -2844, 3202, -3632, 4161, -4829, 5707, -6907, 8664, -11492, 16794, -30242, 141604, 212340, -11889, 59152, 104204, 64806, -1393, -15715, -32333, 11681, 2621, -57299, -70103, -7370, -3503, -37805, -52481, -34349, -18261, -11291, -33446, -39213, -14451, 3161, -15373, -24479, -12628, 2902, 4253, -3740, -11034, 213, 12123, 7414, -2239, 3604, 13014, 14652, 8311, 4093, 6491, 12553, 9438, 475, -441, 4653, 4087, -942, -3353, -2383, 84, 554, -3056, -4895, -1537, 862, -1827, -3624, -1777, -198, 93, -1112, -1806, -522, 813, 292, -1059, -798, 496]
138D96K34o66k08J7R28N8p85p6M34N25m90n40pL75O4m78j72J62J79r5k27o0K97
161c5M1r4j96J32J50R3k54n3J55J26Q4j84n1J16K24k43K6J26j28N9lj98N2K8j46
186a73K37j66qL15l79Q7J93o8k05K8J57r8K28k74O8rj0J08q1J08kp9N3M3j67K77
212A83n5K0k27K00k55J63M3m2M2r9j6j22K49j24K8k4J10q0J54k51K06j43q7O8
236e9J5o2L1J14j12Q0K1Q4j67M9k6Q0J00j88P7j39L3P9p1O6j48L17k86Q5Q9q9
262b7P5j13j6J08j19K04j85J21j13J05Q7j75o9J13rN1o8J43k88K70O5k18R9j27
286h6J31p6N5r1N7J55j70L0R9n9r7O9j73J19o9PJ12J6Kj35NJ02K7K5j46K24l7
313I6j38J4J23k07R5K9j41L4J06o9RQ2j17J26J29k05J85j16L1L1J9j94P9J10r7
$$ y = [496, 730, 64, -144, -127, 801, 859, 74, -2, 432, 957, 467, -73, -80, 295, 359, -119, -291, -129, 50, -45, -272, -332, -35, 6, -88, -284, -152, -2, 91, -163, -216, -61, 65, 149, -35, -86, 30, 254, 11, 37, 163, 35, 94, 91, -107, -55, -27, -173, 64, -102, -110, 205, -174, -87, 106, 38, -167, -139, 18, -80, 148, -126, -58, -67, -77, 31, -50, 58, 56, -23, 30, 73, -94, 183, 128, 148, -79, 121, -134, 29, 72, 30, 72, -27, -43, -165, 84, -40, -12, -36, 74, -6, 148, -103, 103, -40, -127, -59, -44, -106, -75, 39, -73, 7, 28, 112, -55, -6, -32, 48, 148, -40, 37, -102, -69, 10, -61, 5, -143, 174, -112, -27, 62, -27, 48, -65, -81, 27, -92, 112, -73, 48, -65, 40, 127, -48, -117, -4, -13, 38, -30, 113, -175, 95, 160, -58, 41, -86, 45, -31, 24, -67, -10, 145, -25, 5, 104, 45, -52, 17, -156, -37, -106, -99, 13, 29, 31, -104, -99, 3, 30, 55, -91, 133, 96, -42, -28, 95, -112, -17, 12, -129, -95, 11, -58, -49, 33, -84, 42, 171, -34, 151, 35, 66, 97, 116, -78, 1, 111, 14]
338A4R9qn8j19N0J07Kj65J8J70J25k60p0q3K17k1l2j20P8J07j32K40k21J51j69
363h0j79L36qJ0j95J74r1Q3j39N1J4M7J41k03J3k8m4J08q8J18j58K06J44k53R6
388G5L3k21l2J40k9M6J93j91j83J88l2O3j9M8m5j47J52j81K50j06K6R6j03r6J11
413C6j02J53k6j3K6p3n5P7n1k2J82j5j33p5J26Q7p2p1Q3Q9k46N7J16Nl0j88N6
440g9J27P3k03P0k8j3q1J71OJ36r0k00L0J85p0q5J87r1N4j61k9K13k02k3L9o0
466a24N1J53p6n3J59o3j43P9K2Q3mj81R4o9K08o9O2j25P5k5k15J54k1L3M3j3j5
493B0k2J34j29Kj29Q8K1l2J13o5Q6j0qj6K0k03J01Q5r0J00j23L5J25j17pM3r4
520g2LR2j5j24M3P8p7npJ3R9j8O4mk35R5L2Q1l2m5R8j47J24j22J19L2l21K19J87
$$ y = [14, 113, 105, 47, -72, -22, 85, 87, -78, -60, 110, 235, -25, -95, -178, 39, 18, -14, -134, -56, 51, -81, 159, -62, 89, -80, -259, 77, 69, 79, -116, 58, -33, 50, -89, -38, -24, 23, 164, -39, -26, -54, -98, 10, -78, 40, -118, 88, 232, -21, 75, 108, -113, -145, -5, -34, 12, 205, 14, -169, 19, -13, 50, 31, 79, 34, -113, 39, -142, 108, 2, 28, 124, 21, -75, 36, -66, 87, 61, 48, 74, 1, -54, 23, -28, -50, 132, 117, -16, -91, 35, 122, 50, -21, 62, 151, -95, -38, 78, 83, 53, -135, -79, 48, 121, -82, -12, -40, -53, -134, 37, 43, 179, 89, -111, -81, 104, 34, -51, 136, 45, 99, -62, -91, 122, -80, -103, -64, -124, -73, 80, 4, -49, 110, 47, -96, -17, 5, 88, 84, -97, -3, -72, 136, 67, 129, 4, 79, 54, -161, -7, -28, 5, 48, 35, 20, -2, 132, 3, 5, -124, -36, -15, -47, 66, 1, 87, 77, 69, 53, 73, -130, -29, 56, -34, 66, -57, -22, 103, -14, -21, 22, -72, -69, 23, 8, -116, -73, 5, -72, -77, -84, -71, 28, 10, 74, 70, -165, -70, -38, 43, 11, -34, 64, -83, 41, -81, 38, 70, -251, -32, 155]
549A55k27Q0k8o2L9R0L1j04p2M0J78j57p8jP7N7j0l7L1Pl5O3j85J44J67l46K88
576A05k02J75l8m9j14J00M7N0j29K1J35k61j0J43J41j89L30n00J99J23L1L0k04
599f6L4l0Q7N4j93K09J6j44J60l33J85j14N9J42k9j34l9QL05q1j2j07K17k05K6
624A5K0N5r8n2K43l20K25O0j79O3L8j8m6L5J24j51p4J94j20j43jK6K02M9j65p4
650i2J98j69JK51l67K81j77o5K54j55J37Mp9J07j17r1N7l6Q9l3p2J12Q2j58l2
675g0P9k11J56K35k06J51Mj54O1j50J72p2P9k01J6J53q9Q2N4j7o1R9j50KJ15J9
701I6j74K29p3O8k30O9j7N1j49J19N9Nj16K0J49N3k72P3K5j19J13J44Qn0m8n4
727b1k1m3Q1J16r8J0J26m8k1j08J03j15q5J88j41K08j73J18j30Pr0J60j39J46
$$ y = [155, -72, 8, -20, -82, -43, 47, 78, -26, -98, -58, 120, -37, -115, -116, -39, 18, 8, -29, 2, 9, -26, 37, -148, -4, 163, -183, 105, -97, 78, 40, -9, -123, -23, 24, 74, -55, -34, 101, -160, -170, -27, 114, -75, 255, -245, -46, 77, 108, 138, -66, -32, -62, 25, 79, -114, 95, 111, -33, 127, -206, -21, -135, -76, 66, 37, -97, -136, -128, 177, 96, 84, -23, 194, -11, 15, 35, 90, -8, -60, 183, -137, 88, 148, -31, 32, 70, 52, 6, 41, 165, 14, -60, 134, 14, -129, -130, -104, 98, 147, -18, -92, 106, -63, -62, 189, -178, 103, -74, -139, 115, -40, 97, 101, 22, 129, 12, -79, -22, -58, 31, -2, -74, 38, 120, -38, -70, 9, -202, -46, 189, -17, 134, 138, -16, 45, -105, 67, -5, 74, -127, -111, 42, -47, 35, 89, 72, 11, 110, -40, -38, 77, 96, -78, 151, 78, 146, -84, -15, -32, 19, -130, -11, 48, 53, -63, -43, 106, 159, -113, -40, -15, -134, -21, 123, 131, 81, 33, -21, -42, -85, -4, 112, 14, 24, 150, 102, 81, -27, 76, -39, -124, 64, -77, 131, -42, 76, -54, -47, -137, 23, -116, 30]
751C0J4J2r3Q0J18k10Q0Jj92J75K07k45k6J04j07M3J3P7j56J30j07P6O8j83Q3
776hQn6R9J33j89O0o8l6J1K29j82J40k50Q9M0Q3L7j05J20m5j15J33n0q4O0j03
802d9J12n1Q9R7k28R4r7j28M73l83o3J71m6q2J9J29jpk12J61o2J65q0j18J30J02
828A35k17J63j09J50k45N6jK61j76m7R6j29jJ76j43o2O6j4O6k8O0N0l7k44J84
853A0J6nn7m7K01l9j10q9M3K18j47k9L4m6Oj6J0L7op9j75M13j82P3j01J82j0j74
881f9L7R8j61l8J32n3J22j22o7J98j24o1J74o9k2p0l8K92q7n1j55J2K91j84O8
906E3qk2r9J16p4J61q1m7Q5j10j02J4N7J84j19M0o2kq3j7J48q1Q7j77J18Q6j27
933f2J13j19M9L5m4J40rj01k3kK56k56J12j07J18mj15o4K10k02J87k49rL6J71
$$ y = [30, 44, 56, -37, 43, 161, -49, 31, 32, -160, 15, 222, -23, -49, 55, -52, -9, 4, 81, -75, 55, -52, 24, 92, -91, -8, 0, -56, 43, 176, -13, 47, -21, -57, -46, 183, 1, 141, -109, -20, 20, 103, 140, 35, 155, 110, -5, 128, 78, -6, 54, -49, 63, 12, 101, 198, -30, 64, -33, -161, 312, -71, -134, 37, -9, -91, -72, 57, 56, 49, -163, -2, -64, 101, 21, -97, 33, 135, -82, 81, -28, 122, -123, -67, -68, 193, 17, -30, 66, -63, -64, 112, -31, -93, -27, -41, 25, -3, 57, 107, 70, -174, 10, 26, 21, -36, -83, 118, 79, -31, -120, -77, 141, -6, -35, -1, -47, -41, -57, -47, -10, -16, -95, -270, 143, -39, 34, -67, 115, 105, -69, -32, 66, -95, -133, -1, -54, 68, -54, -121, 77, -47, -108, 66, -3, -25, -95, -133, 159, 72, 21, -134, -122, 169, -15, 53, 45, 23, -76, 40, -34, 127, 46, -1, 84, -26, -128, -114, -57, 127, 8, 48, -14, -16, -99, -116, 32, -49, 38, -139, -21, 65, -62, 51, -68, -19, 16, -28, 112, 103, 2, -21, -23, 233, -23, 89, -18, 100, 96, -19, -83, 127, -75, 112, -137, -146, -110, 61]
958F1p0J01l5j70J76j07J3o1j45R2K12j17P7J52l18m6K29o0m9R6j43J55J68j42
982F9j76R9P5Q3m9k04J12j63RJ9O6o5J40j40N2r8N4Q8k3j5n0l5J96j00L9l2L5
1009a4j9J5M2o2M8L9J22j69M5N8j07J02k43J07O9o6J27J02k86K50J7n7o3O4j12
1034IJ23k94J79k10R9K60o1n9K2j93M0Q9o3J31o3J31j69R0j57L8M5P9m1j37L10
1059A98k35O2r8J15R5m6j97K51k15l9J6OJ39J36k76J8Q6m0l7J92r0J23j92pp1
1084a06J60j41k1J26K%j04J13p5j25P5J8R1l2J4R3j71J18m0M4j66J68l4o8l6J41
1110D4Q7j42n5J86j27j02P7q5jQ0J87j99P1n1LN2j58J42O7k6k0l5P4j86K20m2
1136F1j39R1j0N3O2j66P8k3lJ8J7o2L7J5R6k31J47J0k9L0j37nJ40j9j40P5K20
$$ y = [61, -9, 92, 57, -113, 63, -44, -31, -92, -237, -145, 67, -50, 27, 179, -139, -185, 44, -16, -65, 31, -112, 43, 211, 69, -107, -8, 67, 150, 101, -103, 9, -154, -145, -126, -60, -125, 15, -125, -73, -171, -117, -29, -52, -67, -117, -152, 44, -56, -17, -49, -14, -33, -18, 24, -38, 10, 49, 171, 2, 47, 105, -2, 100, -143, -36, 33, -33, 94, 196, -90, 160, 177, 120, 57, 121, 9, 132, -162, 17, -193, -94, 166, 105, 46, 68, -125, -85, 4, -59, 72, 9, 140, -29, 61, -96, -58, -13, 66, 25, -112, 198, -37, 25, -73, 42, 137, 91, -106, 145, -70, -109, -93, -87, 52, 188, -88, -70, 16, -24, -61, 131, 41, 164, -28, -35, -106, 54, -87, -108, 18, 20, 20, -84, 29, -46, -171, -96, -78, 13, -19, -5, 88, -83, 35, -5, 39, -127, 41, 7, -61, -97, 44, 131, -11, -66, 120, -7, -109, -32, -117, -118, -38, 149, -50, 21, -30, -27, 25, -133, 9, 76, 50, 30, -5, 69, -117, 103, 61, -78, 13, 3, 56, 118, -48, 30, 7, 4, 22, 39, -23, 14, 29, 125, -106, 41, 51, 22, 52, -85, -90, 50, 31, -109, -34, 186]
1163A86k59l8J28K7m3R1m5n8J7M8J40j07j06nQ8j13L7o2J55p8j3J88m20J99M4
1188Ao0K23j09n9n8j2J06n6J89k69N5J26j08J16j11n5N9pn3K4R9kj32J94p2l9
1214a0K7J0R5r6k09K43o2k6J29j26J3J5J68j84l6p2J5J48j47J4l6J15Q4R4l26
1239a60K66k56J68m6J6%k3J58q5o6j02J34n9jM0O8k07J4J91m2j02Q0n1K6J42n4
1265D9o8L3M4NM8j41QM4j8J53n8j39M6O0l29N9P9J46R9j31Q1k54L80k15N0J4j19
1292g4Q4J83j46o2N2n1O1k08L14k73L9P6J99k74J46k3J56k69J66N2j8r6L0J5j35
1317e6J6L9q0j01L60p1R1l54J91l8k9O0om4m6j5O2K38l46J54l5l2J02k15J67j4
1343bn9J11k93K50J28j62k7N2O4n6j98K95r2j69P8J6J25r4J36M6k29NmJ07l2n4
$$ y = [186, -73, -111, 17, 44, 1, 92, 47, -11, 6, 54, 194, 87, -19, -24, 64, -49, -12, -74, 81, 3, -10, 178, -242, -43, 1, -59, 164, 55, -4, -62, -74, 32, -24, 165, -104, -49, 77, -31, 85, -26, -81, -22, -29, -82, -58, 41, 39, -93, 101, 29, -10, 17, 27, 122, 26, -183, 60, -2, -28, 101, -25, -12, 3, 171, -13, -49, -121, -106, 42, -105, -91, -127, -12, 72, 166, -160, 106, -150, 18, -28, -12, -12, -35, 123, 38, -28, -130, 4, -55, -56, -16, 52, -155, -141, 50, 8, -94, -14, -65, -39, 103, 49, -19, 14, 58, 63, 111, -30, -22, 22, 4, 157, 99, -40, 6, 66, -263, -204, -125, 21, 120, -11, 70, -184, 196, -19, 31, 45, -74, 10, 193, 47, -15, 37, -14, 47, -161, 153, -120, -81, -5, 194, -80, 66, 43, 199, -70, 96, 148, 130, 34, 64, 79, -56, -40, -1, -81, -182, 178, 107, 198, -156, 35, -3, -32, 28, 22, -22, -68, -83, -21, 217, -129, 25, -10, -42, 60, -155, 12, -2, -61, 50, -243, 7, 135, -27, -54, -2, 62, 6, -192, 103, 11, -158, -80, -64, 61, -33, 103, 149, -80, -75, -79, 28, -4, -58]
1369e8k2O5l8J16q0k3L8N0l5q5mJ44p2l6m0K82j83r3K32k24j57J62O8O0m5r5J66
1396I3Mk94K53q0O5j20M5r2J56o9nM0p5K59l20KJ84N7k25l7R4P5j25M9NJ23n3
1423IJ47k02O8J6r5N9pq4p2N6L05k97J42L1k26J68p6nQ9j46K01p1q8K59j74m6
1449c9J7J12j62J98j46q2L2K01k22J96k38J98j06M8k34J93J55j94K26Pj47M1p1
1472a7M4L0m6P3n8o3l2N8l4k8m8P2K6q5q8P8J07PP0k19K95k65M1J67j10j00L5
1499i0J13R2k12Q0m8m9Q1Q2k19K01O4j17K5j47O5l2J99j01J43j01n8j4R7r7QQ5
1525E0j31N3n7J86j66J06l6k69K22K47j49j27J8J31k02J91l3j34M6K36k66o3K66
1548A19k45O8n6J26N6k3K1j49J06J12n2k29Q5L6%j41K48j33P8j4N6J3j41Q0M4
$$ y = [-58, -80, -15, -53, 63, -17, -40, -2, 48, 13, -72, -76, 68, -4, -40, -80, 202, 19, -74, 158, -66, -223, -61, 7, 67, 22, -73, 93, 97, -197, 56, -24, 41, -79, -34, -126, 30, -39, -44, -4, -79, 180, -140, -138, 46, 103, -122, -159, -65, 10, -115, -66, -61, 62, 9, 156, -46, 22, 38, -57, 2, -5, -89, -161, -105, 200, -97, 45, 76, -150, 18, -58, -63, 26, -120, 81, 10, -78, 181, 7, -39, -22, 90, -72, 126, -20, -102, -70, 131, -91, 105, -133, 65, -41, 7, -227, -34, 121, -73, 153, 160, 13, 54, -17, 27, 57, 11, 84, 26, -37, -69, -11, -45, -73, -121, -49, -23, -108, -196, -118, -11, -4, 66, -153, 142, -123, -82, 85, -25, -125, -90, 23, 115, -97, -17, -65, -114, -33, 49, -170, 31, 95, -22, 3, -144, -79, -111, 88, -13, 130, 29, -29, -43, 54, -43, -35, 50, -81, -28, -85, 101, -65, 41, 5, -264, -42, 205, 56, -71, -53, 78, -124, 67, 34, -100, -54, 182, -84, -147, 119, -126, -58, -114, 12, 68, 45, 66, -83, 23, 135, 83, -146, -61, -25, -25, -166, 82, -51, 27, 13, 69, 82, -59, 21, 65]
1573F5Nj62J06k5L0p6R7K9j47L22k13j54R5l0m0J57o6P2j87R9K4q0J05J18j1q9
1599D4m4r3J50n8M9j1J59k28m1RO9k42P5J98n5J28j14L4j32J18M8k70J20p3J53
1624gk0J8r4J92j09J28j25k2J11M3O9j40r1J46j19nO3j15J21j85K50k41K32pj44
1649e1J02m4o8J08%j22L2n1K82j73k5j47K07J52j00J5r6k2P8m4rkj05ON6j9J43
1676A03k16RJ04R8j43J51J7j78J84m9j46L9J29K1k6j59J77j92m2K5L03k51Pp2
1700a07J13R3j34K7j07J75j11K9J78k86J3K53j66J00j61M0P8j68K55r5n2J23j97
1723a07K43j88lJ07j34k6J30j06J38j45k9J31J65lk52k9M3J85p6k24K9J10Q4m4
1747aJ3n1K68j97o3jn3O9j37q3K61J18j26O6j49J64j89O0n1J30r2J27p8j28j06
$$ y = [65, 70, -92, 14, -11, 19, -57, 40, 69, -78, 244, 31, -123, -28, -58, -98, 59, -7, 65, -122, -23, 1, -79, 26, 144, 133, 44, 0, -93, 57, -1, 48, 37, 196, -32, -73, -64, 5, -237, -162, 36, -19, 109, -5, 29, -103, 15, 63, -207, -87, -160, -7, -27, -9, -103, 89, -20, 108, -17, -39, 72, 115, 184, 44, -47, 99, -20, -25, 38, -77, 44, -141, 109, -132, 100, 93, -51, 51, 7, -61, 47, 47, -75, -43, -94, 188, 15, -10, -157, 50, 202, 102, 117, 21, -1, 77, 33, 24, 22, -83, -77, -21, -40, 103, -113, -104, 0, 98, -45, 106, 123, -55, 129, 80, -66, -27, 102, 123, 97, -62, 115, -77, -119, -94, 209, -42, -35, -107, 6, 99, -35, -8, -115, 60, -51, -22, 156, -130, -117, 136, -30, 70, -91, -51, 27, -141, 114, 19, -33, 90, -107, 136, -52, -55, 52, -82, -108, 22, -84, 54, -91, -120, 11, 176, 173, -79, -108, -65, 120, 44, -180, -151, -41, 43, -1, 12, -39, 229, 32, -31, -32, -85, -16, -153, -236, 25, 143, 17, 83, -66, 98, -91, -31, -82, 48, -44, 83, 5, -123, -229]
1772b29L20j26J9k2p3K37j74j73K13m%N0j02k4o2M0J24j60K29k8O9ro1j27J94
1797A21k95J50P0J3R4k19J83j37O6O5k38Q8M0J34j79P2k0j0m0O3L4N9k51l3J27
1822d3J75J1j57j48J78j0o9j2J49k69K00r0N5j05J96m8K4J51k15J17n2J77k09
1845Fr0M7L0j27J43M0k4QL2p4P9j41K08q5j91K42o2J7p2k9L6nJ25J4j26J06k14
1872a07Q9M9R2r6l9j09J94K7j61K2P8J3J18m5j56P1P4Q6l5k16j26J11j4k9K49
1897A40k41J03N8j25L8K7L1pj33J07oP7j82L08k34k0N7k3J0J05J8j8o2m9j54Q6
1923h9K6M1L7m7O3k5q0O1J95k70pL3J07K8J1p7n9R4K36k22O1o5l6J0K1n9O6j76
1951a22L3R1J2j30R3K29l33R1n9K60l54K20%n5O3j4J04l42R5O2n4J65j02j16L09
$$ y = [-229, 91, -35, -16, -38, -111, 126, -48, -221, -8, -12, -12, 38, -64, -88, -150, -110, 14, -146, 83, 55, 124, 115, 54, -73, 121, -174, -24, 46, 59, 153, -66, 117, -20, 46, 111, -127, -39, 1, 135, -44, 28, 8, -2, -42, 21, 55, 114, -137, -170, -43, 132, 143, -14, -162, 16, 6, -63, -75, 74, -195, 5, -85, -30, -135, 61, 13, 37, 188, -27, 90, 38, 215, 6, -84, -37, -7, -134, 9, 49, 25, 33, 65, -9, 70, -71, 137, 52, -139, 103, 41, 58, -14, -43, -7, -12, 113, 127, 1, 107, -107, -18, 31, 123, 27, -12, -121, 73, 100, -61, -39, 39, 52, 170, 125, -31, 40, 114, 200, 165, -51, -177, -66, -80, -109, 140, -101, 2, 60, -65, -27, 0, 31, 24, -109, -2, -8, 69, -113, 195, -39, -59, -2, -25, -15, 90, 108, 90, 28, -21, -175, -89, -63, -22, 15, -32, 31, 6, -74, -13, 182, -88, -95, -62, 45, 73, 84, 7, -52, 42, 278, 56, 117, 52, 16, 26, 47, -12, 54, -122, -89, 2, 14, -116, -23, 206, -127, -36, -95, 165, -189, 31, 31, -24, 39, 25, 129, -213, -118, -56, -110, 55, -47, -163, 146]
1976A46j09P8k62J56j0J21p0J4L3j06o8K4QK04l48K11k4P7j01onR5MJ31j08k45
2002a60J27K14m9j18L4n1Jj8p2O1m5n5K89k31P4J01M7k29Q4R7n0l3l4j05J0K41
2028A30J79j08j87l5o7K92k65J44k3L5o3Ll2J35J66l43K04k86J37K3n7R9j28q9
2052a36J33k6J19j29J34j27j00J68k09J09J46j14k9J14n6P3K9q7j3k28K50P5j35
2075c9p4J46R8j74J78k80J49M3K6M2n5m0j42J56Np1Q8o2k6p9J10k5R9k85J11J02
2101Aj39K45k41j15L19N5k79K86pk0j05LQ8j13q3K66j49j4r0L3J16L8j79K65n9
2126A22q7j3K2j24Q0Q9j57J42O0q5j48J45N5j10p6K47k18M0M6n0P2N1p2k38K12
2151EJ32k79M7J28p5R4O3k44KJ50j06P2o5O7rJ49m0j86J08k0Q3k05J81J0k83K18
$$ y = [146, 37, 115, -147, 9, -1, 120, 50, 64, 97, -9, -77, -53, -45, 159, -189, 22, -2, 75, -26, -32, -37, 58, 62, 193, 85, -160, -33, 181, 132, 14, 48, -3, -2, -20, -92, -31, -76, -131, 158, -73, 1, 102, 149, -80, 4, 101, 51, 18, -16, -121, -111, 130, 309, 201, 14, -21, -88, 204, -61, 83, 60, 95, 32, 35, 3, 138, 304, -39, 165, -121, 16, 39, -18, 81, -47, -136, -3, -29, 90, -39, 95, -32, -132, 36, -173, -64, 82, -32, -61, 53, -3, 70, 99, 12, -1, -229, 21, 96, -39, -113, 33, 131, -43, 135, -145, 4, 47, 73, 115, 60, 20, -122, 34, 39, -32, 56, -6, -32, -111, -1, -26, 73, -212, -101, 1, -138, 107, -134, -249, 70, 125, -154, 132, 125, 105, 0, 3, 91, -22, -105, 161, 12, -2, -92, -59, 57, 95, -84, 181, 122, 35, 22, 44, -80, 0, 89, -68, 74, 134, 49, -99, 46, 101, -9, -85, 162, -56, -16, 30, -20, 52, 103, 31, -207, 5, 137, -142, -95, 33, -42, 52, 115, -129, -127, 23, -83, -11, -76, -9, -18, 131, 91, -95, 13, -7, 76, -129, 52, 62, -221, -3]
2177cp5P0p4J51j22j9K31j77O0k6r4J37L4j13l5O6k1j6j4J5n2o8K42k59K47q3
2203BK5n7o7J47j9kl9Q8k06J63j02J41j46L8o2J48%l1O8Pq0J38j78K66l40J63
2229F5k3p5L4kJQ8j10Q3P4p4Nl7nq7O6m4j1J28q4M5N0j28L0o8N0j2q1K09m0J12
2259A59j96R3j01J69j28o8P3m2p8kK36j39J5N5j54J16n8Q6NQLk98K32O1j10J05
2285D2k2o1J57q9j00J06J11k28K25k92J78N5j40o6M2L8N7P3j42O5R3q5P0k54J18
2310d9K56k27K62l81J04J78L0k64K7M4Q2K0n0jo3N5l4K3N7Qk8n1R0j86J57k7L1
2337F3j09J08j66J94k04J51J75q2l0j59O1q4J46k06jK02jn9J66j13k15J87J06
2360A30k14J45q1J44j55LJ81j29j02J79R6p8j48j02P8J31k21J47Q7k53L4N3j4
$$ y = [-3, -78, -8, -82, 69, -53, -72, 159, -18, 42, 16, -78, 59, 93, -20, -55, 11, -10, -26, -40, -25, -77, -145, 97, -162, 85, 2, 27, -30, -97, 50, 31, 29, -10, 78, -128, 35, -67, 74, -72, -34, -96, 52, 52, 21, 89, 96, 16, 154, -24, 242, -98, 65, 42, -33, 1, -1, 0, 88, -22, 61, 135, 61, 66, 29, 24, -63, 3, -41, -52, 76, -8, 37, 87, -41, -11, -79, -29, -41, -122, 87, 47, 159, -37, 56, -45, 124, -4, -72, 1, -41, -119, -121, 115, -24, -9, 46, -108, 8, -50, 36, 41, 49, 52, -246, -14, 47, -63, 42, 20, -41, 116, 27, -73, 33, 144, -84, 141, -151, 27, 82, -58, -124, -82, -44, 13, 86, -56, 9, 102, 17, 87, -167, -49, 207, -20, 242, -139, -35, 143, 173, -91, -64, -20, 62, 82, 32, 31, -32, 23, -11, 12, 69, 77, 49, -2, 88, -98, 59, 32, 63, -46, 62, -104, 90, -114, 37, 212, 130, 100, -59, 2, -82, 64, -142, -143, 59, 58, -1, 165, 52, -163, 24, 130, -84, 61, -20, 124, -31, -28, 153, 24, -78, 101, 197, 119, -29, -131, -53, 78, -143, 4, 91, -162, -128, -75, -89]
2383h9Q9J2K08l35J32j06J22m6O8j3r2J99k34r9J46K12j60L1j41J42j56Q5R5k01
2407a31kP6L2L2j54J95PJ5p7m4P0j82M55k82m1L9P9j00J79q3j07j4Q8j25L2J98
2433A55o3k12J22J99k36J15q9Q4j08o4J05M0q9R4j43J99k4l1M6j46LJ13j62M6
2457d6J13Nm6r4j3M2J27j03l9J43O9j81Q7j22k9J12p0N7Kj31O2J44j31MK49j02
2483A09k9k7j1K3M8k8k98k6L28j11P4m2K8o0Q7r1j5L8J23j20oQ6k63L03n7q1J23
2510A05j85J71m8j53J05J27j48J46j23L9Q9j57R4j68J22m3j34J61J23o4p5l8L
2533e1J64j97J50M8r5k13K57m6p6j6p3K71j35l2R7j25J50j38J75k04j4J37m2J50
2557A42j02j75rJ02J9M4j09J59j38J5J38l3k59J5J20K4j04O9M2n2L27k77n6J39
$$ y = [-89, 0, 12, 220, -115, 17, -89, 33, -13, 55, 42, -50, 149, -85, -184, -38, 174, 14, 45, -96, 46, -110, -25, 70, -131, -133, -57, -25, 7, -147, 48, 55, 70, -7, -51, 19, -163, 292, 10, -31, 8, 87, -13, 166, 83, -24, -38, 50, -75, -43, 155, 92, -120, 2, 201, -35, 80, -9, 75, -33, -97, 8, 48, -41, 53, -90, 109, 85, 54, 100, -46, -43, 70, -92, -46, 67, 72, 26, -68, -81, -39, 88, -15, -54, 89, 158, -23, 64, -58, -87, 25, -45, 12, 14, -117, -55, 89, -42, -38, 211, 109, 80, 53, 42, 65, 113, 85, -213, -239, 89, -22, 52, 10, 38, -22, 65, -26, -41, -3, 120, 0, -6, 80, -183, 120, 63, -18, 105, -80, 91, 43, -110, -5, 122, -26, 120, -3, 36, 125, -32, 62, -106, 16, -27, -161, 0, 123, 59, -16, -54, -51, 113, -84, 66, 114, 19, -194, 63, 17, -59, -75, -148, 123, -12, -44, 53, -72, 78, -60, 115, -89, -103, 34, -8, 142, 40, -135, -144, -42, -23, 21, -88, 71, -67, -52, 86, 53, -206, -191, -71, -47, -151, -82, -40, -92, 235, -42, -98, 41]
2581D1n5L3P9j13J59r6j02l5J27l1m0J68n3lP6j28qm7r9K40o4N5j88J34k5m5Q
2608a2o0K25o1j78J1pQ0p3Q9J40k49M8n8R8m3O7j22K86l12K36j05k7m0K41k37
2633f3R1q5J21MQo6J07Pm1k78J99j6Q3q3O2J20m04L14l3N1p3l6r0J68L0j12J34
2660A19j93O7Q4m5j88J8K9J49K8K2N8k17j48J53J23j06J54k35J16O5l3l3l6N5
2684Fj24M5j20R7K9J92q4j00K25k02J5J31k62J34J40j84Q8k7P3j33M6J56j09q1
2708d9L3Pj41K40k6m1J0l9o7k6J58m4o0J54l41J97J08j57PK9N4NJ24k42K24p1
2734D6m7pQ7o5o0K4j2l7R2O4l0o0Q6n9k4k5K6R8j44M8p0L4k11J60jJ0J27k2kq0
2764e4J7N5lL8q9J0LL8n9M4M3M2n7J49j79K6j19PK54j53j8K5L2j04p7K09J49k42
$$ y = [41, -14, 19, 98, -15, 144, 48, -54, -89, 38, 7, -33, 135, 82, 79, 155, 27, 19, -28, -127, 113, 49, 104, -84, 50, 25, -20, -12, -72, 153, 92, -86, -75, -82, -2, -75, 14, 154, -95, -47, -105, -7, -50, 17, -105, 181, -131, 105, 0, -27, -67, 174, -63, 28, -57, 64, 68, 76, 10, 117, 124, 83, -195, 4, -12, 71, -12, 50, 170, -234, 80, 47, 98, 25, -11, -101, 67, 97, -15, 119, -74, -7, 77, 32, -156, -138, -109, 40, 68, 90, 148, -69, -217, -64, 59, -47, 107, -128, -12, 53, 20, -13, -49, 6, -118, -73, -193, -96, -67, 125, 41, -59, 166, -36, -21, 110, -152, -18, 122, -62, 26, -1, 72, -61, -15, 141, 32, -49, -16, -9, -150, 90, 64, 23, 33, -6, -73, -99, 59, 15, -45, 109, -232, -35, 73, -84, -77, -48, 6, 11, 135, -107, 117, 46, -1, -8, 79, 14, -46, -22, -34, -71, 21, 85, 55, -5, 81, 22, -2, -27, -1, 97, -47, 1, -69, -35, -246, -86, -87, -77, 50, 28, 26, -54, -37, 18, 15, 53, -36, -26, -23, 15, -44, 0, 43, 85, 28, 177, -2, 24, -95, -88, 166, 13, -5, 20, 52, -52, -129, 80, 229, -13]
2792a3j28J1J98j20L6k40J64M0j25J88l4J11m7Rp5l2J16PM9m7J4j82J15M4rj66
2818a16R4K32k41J40k4j96K06j06Q8j48J01j25J82l1Kj27K01j39o9J89j02J19
2840A30J5r0M9Mj98J08j00P5m0J31K4j34O7k06J35J81j12m5L2j97K04l5K3qo3
2865e0k1J57O8l01K20m8M9j48P0Pqj16M1K09l76K46P0j26l7J11m8L4M7o3j58K12
2891D1k7J50j93M8P5nJ04j46%j1J7Q9k53M8J55k20J92J6j04N8J8j79J91j64N7
2916d3M9k5P2l1j6n9L8J2nOn0O7j28N4m5J50nk9K0R3j96J05J8j81K09k14J54P8
2944I8k92L52m7j28P2j53j7K26L0l06R6J39j16J24oq1j0N3N1j56q4K55k26R9J6
2969a1q8J75J5P2j72l2J55j03LLKk6j68K79j04Kj24R0M0K1p1p4M3o3J69p2O9l2
$$ y = [-13, -141, -130, 68, -52, -16, -256, -92, -52, -177, 11, -23, 88, 41, 50, -25, -57, 59, 66, 115, 68, 82, -100, 15, 59, 50, -116, -22, 210, -31, 109, 85, -111, 95, -11, 77, -71, 30, -95, 87, 56, 58, -69, 132, -7, -76, 113, 11, 130, 145, 55, 104, 108, -90, 18, -82, -7, -47, 84, 108, -26, 41, -165, -30, 151, 39, -6, 26, -171, 33, -2, 21, 13, -50, -71, 86, 154, -147, 73, 25, 74, -74, -4, 3, -5, -121, -80, 129, -247, -1, 69, -57, -94, 17, -31, 3, 50, -13, -171, 41, 14, 164, -29, 19, 94, 89, 193, 47, 47, 36, 53, 142, -111, -63, 92, -128, 64, 80, -24, 34, 52, -127, 64, -100, -43, 6, -19, 53, 22, 6, -53, -15, -3, -8, -2, -52, 15, -113, -59, -104, 46, 41, 12, 32, 125, -71, 34, 52, -129, 80, -134, 20, 98, -194, 158, 111, -17, 55, -98, -115, 111, 141, -165, -69, 70, -46, 78, 72, -9, -19, 34, 85, -71, -155, 100, -126, -27, -11, -99, 76, 91, 163, -9, -41, 114, 11, 14, 17, 19, -7, -175, 104, 0, 2, -122, -32, 8, 29, -42, -116, -73, -136, 33, -39, 30, -2]
2997bj37J52m7mK11k14R1j29L4Q4M8n4l0J16j22R5Jj87k3K03q1m9J22or1J36j43
3024b6J50j17J9k8j32J8K08j3r8M8r9Kr0J98j14m5K47j75P0k0L4Nj09m2M0P3J22
3051A26j67J14r9J48j50R2j02O3j44j68K90j09K22m7n8K3j30p2K48O3j74J4q5
3074a02O5j26J09Q6J6j82K37k18R1q6J6P3j18Q5O0n4O4j25M1J48j64J7J21j49
3098i5J05p1K4M1l5m0J33K24j92j76O3j2L2mq1N3J6Q7j37J8P9K26k22k34J03K59
3124A64j52jo2l4LM1o8J60j17l0J48Q2j62j34J10L8P9m4J4nk2n0j5L2M7J0J6l2
3152A6l4J57j02M6n4n9o4MJ16j57J45N5Q7k05J11M2l1o2P8j08j32J37J03j11m4
3177f6r1qp9M82k57J32l3m3o8%O0j09J77m8lj3Q1j10j16J8R4O0J19k79J92k74
$$ y = [-2, -139, 13, -34, -38, 173, -41, 50, -79, -45, 39, 87, 33, 3, 119, -3, 92, 93, -94, -117, 86, 5, -44, 78, 72, -19, 117, -26, 124, 7, 26, -2, -134, -116, 92, 79, -19, 29, -70, -68, -158, 40, -74, -119, 128, -47, 23, 3, 37, 42, -67, -109, -69, 4, 126, -41, 73, -26, 122, -28, 64, -38, 25, -119, -287, 3, -106, 116, 69, 11, 34, -96, -168, 80, 143, -31, -17, -102, -37, -163, -54, 32, 48, -134, 103, -115, -24, -110, -94, -21, -139, -54, 6, -48, 16, -109, -68, 80, -84, -67, 54, -95, 10, -61, -37, 4, -31, -71, 62, 286, 94, -82, -19, -31, 1, -3, -84, -31, -15, 72, -65, -47, 32, 258, 36, -198, -95, 164, 12, 11, -51, -85, -82, -41, -109, 51, -66, -96, 52, 134, -28, -162, -52, -14, 65, 21, 35, 30, 8, -42, -57, -25, 22, 32, 48, 16, -18, 139, 37, 83, 29, -30, -94, -90, 26, -131, 14, 69, 156, -49, 62, 104, 73, 11, 89, -19, -151, -14, 89, -22, -66, -157, -165, -244, 238, -19, 113, 80, 37, -31, -31, 29, -80, 97, 49, 46, 33, 114, 4, -112, -94, 0, 60, 179, -100, 92, -182]
3203a82K32j00K9l3J32j08J28p7j16J27p0J35J7j81P1L5j13J11j86N7K7J75L1
3226A41N4j25r6j1ll2J15m0m3J30j03R1j2j44K99r0j76J18j82K43n6j63MM6p2
3251a07R4R7j51N7j03J05n9K60j22K0j67K4RJ79k35%J66n7LJN7j24J85j60Q5j31
3277g4J71j51q7K10j61K6R4j44K30j06j0N6j14J24m5J29p0o6lK6O8j01j51K40
3301I1J6k04J69k28N7J35p9Q1j96N7R0k3J4N2n3j2o7J25k1j28K73k29rJ52j43
3326h0J47j8L0k15J85R3j35R0j51NJ96j76j8n9J26J02j13n5M8K24k27j02N1J27
3350G5J2k4k46J57L6r6k9J25L0k3L8r4R7k82L75j73P9q8J72k00J15N9j22R0j61
3375g8J64j32K29l15L39j38j14J48j30j6l9J77j04J07k5j75K27l5L8r9pK5P3k01
$$ y = [-182, 50, -50, -21, -54, 78, -30, 98, 21, -95, 32, -38, 97, 114, -67, 4, 39, -74, 37, -149, -92, -65, 110, 141, 195, 70, -26, -37, -40, -72, 43, 3, -40, 90, -13, 78, 66, -78, 221, 131, -45, 73, -109, 134, 78, -85, -81, -35, -107, -13, 84, -67, -10, -113, -8, -67, 193, 71, 91, -76, -52, -43, 136, -99, -99, 67, 10, 13, 14, 71, -53, 132, -28, 57, -74, 97, -54, -141, 69, -92, -66, 28, -116, 114, 8, -2, 54, -60, 64, 19, 148, 78, 12, 9, 35, 103, 2, -149, 91, 107, -97, 72, -156, -99, 36, -43, 38, -158, -101, -11, -34, -20, 32, -21, -33, -100, 25, 4, -124, 149, -80, -89, 63, -80, 67, 49, 79, -136, 49, 142, 7, 97, -54, -49, 147, -29, -47, -106, 20, 122, 9, -46, 2, 226, -1, -103, -52, 75, 87, 63, -183, -26, 10, -86, -115, 10, 40, 17, 55, -39, 58, -224, 151, -22, 57, -31, 141, -59, 56, 115, -7, 83, -78, 86, -46, 183, -132, 207, 69, -45, 103, -27, -43, -82, 95, -9, 98, 73, -102, 125, 90, 128, 29, 22, 47, 120, -81]
3399h1R8j9K01k48n3k6P4J25q4L4J10k67Q3J5k1J36j62J91m9j13J42q9r5M2L0
3424b6Q9j55J07j27J16J45k28J79q2J25j42l5Q0j34P3p4l3J81j6o9j5J62o5j15
3448e9n4J66l4l0R5j00J73j73p3J44J4m3q1Jj1J67q5j23M9J07r4J07m1l1k20K33
3474DN4k8lo4J55L6j38O3N6j14j3p3Q9%k11N0J77j47J10j2J55j47O0l9J21l7j55
3501e1J61k11J42l2j15J26J8M7j31J23K1k21L8K16j97J52j13M3j42J00j8J1J17
3524H4oL1k07K9J0r0oK23j26M3J08L9q5oMK2j61J34m8J7Nk0J0o6J01j65K08l1
3552E1p0q6J30K9o9K3k8J21k37P8J4j75J82j5O4j39j2J75L2n7n5N2p1J17Mj56
3578i8J41p8J17L3j46L7R0q0M9j25J27j48J19n1j04M5n0M5J02J68j53j07P5L9
$$ y = [-81, 17, -2, 199, -49, -102, -128, -54, 71, -13, 21, 131, -136, -53, -38, -59, 77, -85, 106, 57, -56, 86, -3, -98, -56, -26, 63, -92, 15, -112, 4, 149, -79, 100, 18, 143, 1, -34, 46, -88, -15, -89, -122, 59, 43, -26, -41, 121, 56, -59, -113, 53, 19, -11, 84, -16, 157, -16, -89, 55, 69, 26, -55, -54, -65, 102, 17, -106, -57, 50, -44, 63, 22, -9, -229, 4, 58, 30, 27, -37, 118, 154, 16, 79, 135, 21, 8, -65, 24, 24, -187, -137, 40, -107, 3, -9, 146, -1, 59, 20, 141, 104, -51, 110, -101, 41, 9, -106, 20, 38, 85, -46, 77, 98, -123, -85, 131, -66, 86, -27, 16, -126, -26, -44, -33, 84, 78, 109, -98, -69, -59, -149, -155, 68, -58, -15, 93, 132, 47, 41, 45, 67, -94, 40, -8, 9, 14, -6, 4, -62, 39, -126, 82, 51, -19, -105, 25, 54, -15, 8, -20, 101, -136, -58, -44, -219, -37, -52, 12, -127, -139, 36, 68, 11, -44, 8, -63, 54, 58, -98, 43, -35, 82, 115, -31, 6, 96, 16, 65, -60, 67, -81, 38, -13, -117, -72, -122, -77, 25, 193, 40, -67, 8, 47]
3602D7k54J92J7N8j12N2q6J10pJ06j02m2oM1J36j51O4J6J5j09j16J27K5j12J44
3627E3j54J88k3J13r6k77K55r1K68k58Q1r2J9O0j85K47m8j3j72j5K12q5o5l5K12
3652I9j79M6P7p3q1J98q7J19o8p7Nk14K69N4k40J64r6qJ18n0J40j83J4pJ21j4
3678D7J36j71QJ56k20J18k27J45n7J46n5k5N1J64j71K6j69J45Po5J61k83J28N0
3702D5L7j75L7R0p0o2M9po1l2O1J80k48K91j29M9k48L54l03J24L9J03r9j96J03
3727f8o5J22Q5o3o3M1j48K48p7j5j76K48q7j62K11m5K29k3j57K6p3m9K27j27p7
3752c8k6J39r4m2J9J1J22r3j01P0j19J28L0j80J76qQ6k35l3J17M7k1j9j63J65
3777f2P4K4k3J6K82k70q9J70q8j40P6r5k0J92j65L23k21j2j81K75P0k97M6J18
$$ y = [47, -207, -15, 2, 60, -52, 0, -86, 24, 17, 123, 21, -21, -27, 14, 150, -1, 63, 79, 94, -15, -131, -4, 21, -91, 53, -101, 87, 64, 177, 81, -196, 59, -32, 236, -22, 59, -33, -14, 46, -139, 108, 60, 47, -125, -140, 72, -13, -78, -113, 99, -80, -34, 43, -30, -111, 87, 0, 119, 51, -26, -21, -235, 34, 88, -152, 12, -84, -92, 26, -24, 116, -67, -53, -60, 61, 47, 183, 12, 20, 176, -44, 74, -153, -8, -65, 81, 26, 1, 52, 216, 45, 71, -98, 47, 54, -11, 150, -133, -5, 45, 82, -93, -56, 34, -36, -98, -49, -56, -117, -149, -88, 92, -156, 135, 6, 55, -193, 161, -142, -18, 21, 124, 25, -171, -68, -133, -11, 74, 11, -52, -11, -159, 89, 12, -3, -179, 69, -18, -180, 31, -14, 215, 192, 35, 61, -12, -61, 166, 39, -38, -64, 75, -19, -61, -42, -31, 91, -2, -103, -33, -152, -24, 6, -174, 2, -6, 80, -155, -188, -71, -24, -45, -64, -227, -62, 12, 36, 13, 29, 311, 41, -48, 122, 34, -106, -30, -125, -145, 47, -118, 205, -16, -28, -209, 66, 136, -161, -115, 3]
3801Cj17K10l0j63J03j00o2J27o8K17j32j30K89k74K47j41p9R1J30j72J29l7j18
3824g7J02O0k22KJ55m0k9N0O2k05O0J00j66J64J83l91R3J00j46J71M3j44J22j13
3848f6J58q3p8J27j03Q9m7j00Q4J20j75J34r0J30j80J27O1j7k2j04q8r2J92K5
3872BP7k6r0o5j51L11j16%K25m5j65J29j20J12jj51l6K73j83m2J20k02%J32o1
3897g3O2J80j16j21J81m2o4J46k24O0j5pr5K05k76L05K4j50R4j25J28j69L8Q2
3921B8q1k1J17k3NQ7k57J48rJ2J51j79j01N0J7J57k30J33o3l7J30j50K04J9j26
3946a9P6P4r2j36K68r4O8o1M0k26m2J1O2J86j70L5J49m0k21J35k8J27j71J60j53
3971f2R5o3l1O8j67J10PQ7p5pj20J82J39l05M7K3J13l9k5J12J78j66p1j47J85
$$ y = [3, -114, 96, 66, -97, 6, -94, -156, -29, -97, 120, -12, -142, 147, -127, 120, -21, -100, -9, 121, -51, 78, 41, -77, 25, 85, -137, -135, 20, -20, -49, 1, 63, -142, -82, 18, -148, 16, 199, -192, -99, 1, -145, 26, 69, -75, 47, -66, 92, 9, -69, 58, -45, 44, -3, -103, -19, 101, -74, 60, -30, 100, -80, 47, 108, 91, 69, -35, -123, -215, -23, 2, 79, 53, -37, -102, -253, 58, -58, -58, 167, 122, -43, 86, -34, 78, 77, -74, -110, 163, -20, -62, 58, -144, -144, -12, -73, -11, 169, 53, -68, 113, 71, 7, 153, -71, -11, -26, -33, -128, 77, -199, 106, 130, -20, 74, -51, 77, -92, -54, 28, -53, -74, 43, 20, 25, 112, -145, 3, -6, 6, 157, -22, -123, -73, -56, 101, -129, 4, -59, -96, 34, -116, 88, 107, -19, 57, 131, 39, -97, 171, 77, 145, 84, 124, -102, -144, -133, -71, 115, -55, -20, 129, 89, -132, 3, -25, 102, -69, 91, -62, 33, -30, -61, 7, -160, -50, -43, 44, -31, -38, -158, 24, 163, -142, -95, -72, 41, 2, -23, 89, 267, 101, 30, -117, 68]
3996F8j48P6Q3j10N7m3O6J3M1J0k14J30j28j03J16N6q7J60j12PM3P8L8P4j86j64
4022a79K20l5L3j21L6QJ27P6k81J5J13J17j01%j0lo7O7m5Q1N2l7k7j25l2J55P3
4049A10q5j38K33l7j16N7J2Mq3O7O7n0L9q1L7MQ1m0k1n9l3R1j3l0J15j91j13J82
4077Ij31J01R1q6J40R0j68j32J47m0J85j42j64K6K07j84Q6m3l0P0j26L37k86N8
4101A5j01O6M8J59j21Q3o1l2p2J42M4j64Pl9kn2N2Mk4kJ88k10O3NJ62k99J46k3
4129a8JJ90l14J88p8O5p6K3J65j02MN1j20j35%J61k6l1L2q3J16j10RP6J61j53
4155dQ3j24P9j02P2J01j71O3M0k4J7N4J1K6J4j17mN3j72J97l12M35j26j20O4R
4181D2L8j13M7n8n7J11j04L28l0k28k3N5J64j48R6k86K22j54O0k4Q5q9J67nj56
$$ y = [68, -80, -4, 79, -31, 26, -17, 49, 62, 103, 113, -101, 29, -99, -202, -86, -30, -117, 43, -69, -62, -19, 59, 97, 171, -15, -179, 41, 6, 39, -82, -46, -38, 89, 165, -116, -101, 12, 129, 28, 28, 18, 15, -52, 15, -30, 51, 103, 66, 39, -86, -118, 37, 110, 25, -113, 120, 83, -33, 24, 36, 40, -43, 24, 91, 41, 80, -1, 36, 40, 121, 81, 60, 1, -32, 59, 46, 16, 131, -60, -173, 9, -122, -21, 70, -16, 124, 214, 46, -86, 61, 21, 206, 64, -100, -74, 133, -51, 35, -8, -38, 32, -94, 243, -43, 15, -86, -20, 28, 187, 66, 149, 88, 56, -16, 126, 170, 6, 13, -26, -28, -80, -28, -24, -48, -50, 138, -72, -9, -4, 158, -141, 5, -18, -17, 173, -141, 47, -31, 34, -42, -19, 146, 44, 48, 99, -21, -156, -156, 5, -21, -52, -20, -103, 13, -97, -88, -12, 149, -4, 79, -45, 34, -68, 4, 105, -66, -3, 37, 13, 30, 84, 95, 121, 135, 18, 14, 67, -105, 92, -220, 215, 89, -31, 33, 42, 80, -33, 14, -44, -101, 10, -94, 234, 204, -24, -47, 8, 172, 24, 120, -166, 56, -98, -38, -62, 23, -66, 101, 96, -60]
4206f0J3K8kN7j01q7K95l3p7j06J56j37p9P5lq3R9J10j12R0j20K61k2k81J00K62
4232B43k37M6o1r3J41Kl7J0o9N9JP9l4j07j2Q4R8p6N7l0j01J10q0mN5k5m3j21
4260a45L7J6R8O6j65K8J53j45J0J59k15J06p4J9J06K1j56J13n1j3M9p0J00l5p0
4285e8J63r1p2o3K16n9K6P1l8K7j82k8Kj50K20O3O3J8r8j72J23No1N4N4o1L6K06
4313B14k27j93K32O9j33q4J87n7n4%m5J02m4J9L8Q0r2l7P0m4p1Q9K4J1k3j10K07
4340A28r5M6j58j1J14j03qN5K2r1J24N5r8j8j69M52l0m05J73P2Kk09K03k8K1P2
4366A16n2j19J71M8k88K8J54j21P4q3P0o1J8J60k04J16K1pj20q4L6K21k2n5L3
4391E0k8N3j89M2J24k2j51K22j92r3P3J42L7j26J9J55k11n2J61L5p8K0NnM7j10
$$ y = [-60, -47, -19, -21, 36, -65, -152, 143, 110, 33, -73, 83, -54, -133, -58, -61, -144, -45, 65, -47, 43, -77, 184, 162, -119, -19, 243, 6, 52, -9, -102, 39, 41, 4, 14, -55, 4, 5, 84, 50, -57, -69, 15, 113, 37, 94, 64, -37, 73, -7, -11, 44, 19, -24, -145, -108, -92, 6, 72, -93, -65, 88, -57, -47, 112, -103, 3, -71, -52, 54, 75, -81, 32, -19, -32, 17, -53, 47, 12, -58, 105, 14, -58, -121, 95, 36, 62, 133, 95, 122, -60, -88, -86, -236, -16, 47, 110, 128, 30, -142, -19, -14, -75, -21, 33, -28, 8, 214, -13, -206, 26, 95, -38, -122, 65, 8, -46, -46, -91, 11, -33, -14, 24, 104, 12, -25, 45, 1, -70, 19, 43, 54, 31, -79, 128, 33, 79, -79, -90, 24, -79, -87, -32, -10, -101, 23, 78, -20, -38, -207, 245, 215, -190, -17, 55, 57, -152, 51, 23, 44, 116, 64, -55, 116, 164, -124, -96, 58, -63, 11, -72, -2, -63, -45, 115, -89, 27, 48, 41, -79, -163, -127, 94, 72, 17, 50, 22, 75, -114, -72, 52, 30, -121, 101, -91, -184, -111, 31, 68, -58, -39, 116, -95, -147, 14, 49, -29, -9, -4, -9, 38, -72]
4417g2J2Q8M7n8j0p0M5m1J79j84J05M6m6k42J07J12M7L3n9j53Q5K66j77K5K8k29
4443a16J47L5M9k17J5J03pk0m2Q9r5M6j08R5N4m1P9k2K8n0j21n4J85Kr2R5j39
4470a02M7J05m0MQ0Rj17P7j00K30k66K7M8K8M6l4P7o3j61O7P6P4k10K07qk84J59
4497b4K9R8M3j79O4l6O8o9J26m8p6R6l7r4K3PR7j7o5R5m4J1j73J9L12k12pj0N3
4526E0o2Q6K4M8o3j2kK0j83J0O0j7J26k63J22L9j12J74RO0k38K13J44m2k86K6
4552f9J6N2q3J60o7R1r7j26K39r3J25k23lR7j01R1k7J64n1m1J7k7o9J09k7l7k0
4579@L5J10N7k21O5o7P9k40K63N7k12loj0K13k18K89k58N6L5%J5r2P0j91%J99
4606B5J5l0j41J44P4j10J54l2j13oJ0LR2R7n1k41M7P7OJ8O7j06p3%J85kj46j4
$$ y = [-72, -60, 28, 75, 17, 7, -63, -18, -59, 120, -64, 41, 87, 41, -201, -94, 18, 65, 98, 39, -114, -29, 237, 60, 85, 113, -116, 31, 66, 115, -102, -87, 16, 9, -11, -53, 36, -59, -13, -121, -26, 28, -13, 66, 44, 72, 22, -99, -153, 32, 34, -58, 37, -102, -55, 50, 10, 14, 94, 103, -14, 63, -37, 193, -73, -46, 2, 30, 76, 42, 119, 56, -105, -38, 38, 112, -98, 109, 101, -183, -24, 5, 103, 146, -33, 31, -5, 63, -6, 120, 72, -4, 92, 55, -39, -16, -9, 88, 71, 6, 101, 57, 68, -105, -86, 226, 14, 7, -3, 50, -12, 74, 98, 146, 83, 71, 69, 89, -94, -84, -24, -41, 85, -178, -56, -17, -129, 45, 54, 114, -124, 89, 233, 191, -95, -69, -53, -1, -84, 76, 9, 100, 3, -123, 116, 23, 148, -75, -78, 19, -82, 9, -18, 146, 95, 54, 71, 44, -25, 84, 57, 20, 0, 35, 145, 202, -19, 46, -21, 58, -182, 81, 138, -74, -77, -83, -93, 120, -98, 191, -67, -11, 24, 24, 39, -53, 17, -174, -174, 25, 40, 10, -131, 13, 87, -23, 131, 99, -14, -20, -10, -7, 85, 182, 131, -110, -63, 14, 20, 38, 105, -1, -74, -74, 111, 109, -37, -51]
4634e1J04Lj23M5k1N0M9Oj98J61j56K5J94k7O5j87o8m4J74J6J35j29p1L2O4Jn8
4661iO9j38J44q4k5j30R3K9J21m42M79J90k75J21M8j12J52k38j12J48J60M3j12
4684A20k86L25K77n57k68N14k61l4j25M23n22L3N78n69K61k2K44k37M88n38K32
4705G6k11l19L71m0K03j13j51l88L53l89O22j46j16j34N52k06J1P5j39L08j95
4726B4R2J96k10j96k4J25Q4j91K59L82o23L14l8j00q9k51K97k07L90j49K82l88
4748b1k89J19P9J85j7j9j92K32j68J35k88K24K92k21o48P43n25L19J04m7l3o0
4770i6J67l66L92n09j77K7J340p02R6k94L67j67r2r3J51k97N63k41j02Q8K42o40
4792c43R58j088M73P3q5L45n18J13p2J61l26o9J11L66M1k26j55N13n83N21J84
$$ y = [-51, 53, 56, -67, -22, -43, 7, 56, 62, -136, 25, -131, -106, 88, 61, 126, -61, -129, -173, 1, 17, 152, 23, -48, -16, 48, 49, -9, 60, -78, 66, -18, -43, -173, -80, -51, 70, -372, 107, 297, 22, 143, 191, 79, 231, -7, -119, 29, 189, 232, 120, -166, 159, 436, -121, -389, 125, -136, -170, -295, 128, -394, -361, 217, -352, -91, -113, 131, -106, 382, -156, 76, -135, -454, -83, -123, 80, -33, -184, -572, -219, -608, 14, -132, -248, -382, 170, -36, -25, 50, -89, 219, 24, 116, 312, 102, -94, -118, 7, 91, -100, 159, 541, -82, 232, 194, 94, 5, -246, 51, -156, 234, 85, 367, -21, -310, -191, -112, 73, 56, 37, -155, 77, -91, 44, -244, -20, 272, 51, -597, 146, -379, -60, 44, -3, -36, -96, 71, -295, 97, -412, -589, -562, 778, 76, 172, -122, 245, 78, -14, -107, 44, -253, 310, 69, -33, 55, 297, -343, 615, -473, 0, 73, -12, 333, -185, -72, -144, 17, -309, -378, -267, 99, 140, -86, -241, 272, -311, 210, 394]
4813C94n91M15n63N18m06r8N86k58J86L0l06k7J20l0J27j63K42m03M04m41j45
4834d09M6O77j21m56K38J27k99Q3L00k71R4j12k8J40r1J05K3Pj78M2K03j38k0
4857c8J48j45R9j01J51Oj32J12j37p3J07n0j26M04l24J81j02J55j63j85J15R8
4879@M6m6P7r9J5N3r9K04j33J3m8O0L6p5R8j62J33k1j23J74k41K29j63J3O2p5
4905g2J60k5P2n0p1nP0m2J08j61n0P8N5p5L0N7nk9P9n8j40J90r8L0k08J14q6L22
4933A90j75l1kJ9p1J28%l5R8j99J12k27J74pO1k5R5j92n9Q2rJ94r8p8J05J3p0
4960gK0J8j8p3J8l7O9M9o2J17j37N3j33M2M6J06O4j41M3MR1j00j16J61l2Ko9k00
4988b22K75O5p6j27R7l5J96n3j29j47J68J67n5q4m9q7K11j36j5J01qJ0j45K56
$$ y = [394, -197, 218, -345, 173, -233, -331, 255, -3, 183, 213, -93, -120, 0, -30, 97, -66, 176, -227, 177, -264, -409, -363, 314, 193, -263, -25, 102, -197, -114, 186, -85, 9, -103, -131, 9, -82, 23, 46, 53, -125, -83, 120, -18, -38, 110, -35, 64, -37, 114, 120, -12, 100, -37, -110, -3, -53, -179, 225, -99, 82, -20, 135, -28, -213, -98, 0, 46, 0, 77, -22, -7, 46, -53, 151, 18, 31, -17, 43, 79, 4, 102, -60, 73, 52, -71, 103, -138, 91, -72, -59, 3, -72, 88, 63, 135, 85, 14, 9, 79, 37, 145, -16, -66, 12, 67, -8, 22, 79, 74, 45, 124, 66, -74, 116, 18, 48, -160, -46, -132, 190, 15, -16, -18, 1, -70, 58, 58, 23, 121, -78, 34, -193, -19, -26, 35, 10, 105, -87, -146, -64, -73, 121, 23, -55, 50, 63, -7, 13, 31, 13, -60, -42, -79, -10, 39, -23, 94, -43, 10, -123, -81, -35, 71, 135, -6, 37, 41, 132, 32, -84, 77, 45, 47, -22, -222, 53, 118, 42, -85, 12, -23, 173, 120, -9, -156, 12, 179, 124, 40, -9, -96, 115, -21, -36, 65, 57, 67, -78, 178]
5012A78k02K8m5J00j97K30k5j72K8J76j17r0K13l4q9M0j20K39l6j86O8j4k1o2
5036a10O8k1QJ31j77J01n1p1J71m3Pp7J02j00J09q7J0J45J69j00q4o0m2N1p8K3
5062fl0lK7M7j41J23j46J31m4LJ0j29J97j20OJ35m2J41k07pJ52j31K84j24q0o6
5088b0K18k07Lk0NN6l44L09N4Q7Lo4j61p2K57k7j18j00J61j59J92K3J06j94j09
5113a21P8K1J9J14j31K1j36J40j10Po5K55j2j81J16j3J51k73O3N7q0o8J50L0n2
5138b0o9R7q7M7k8K52l07R0L4j07J85J1q0J73j38J25n1j56O1p2Q6j38J22L0lj8
5164C9j28P6Q5r4JJ42k39N4J0M7l1L9P8j03R4j17O2lJ0M2J0p8N7l9n2J30j46m1
5192i5J57j4j05J21q1l9K27j12L8j92P4J64k20J27O2k62O3J15O0j20j52J33J51
$$ y = [178, -24, 4, -41, 59, -138, 92, 67, -105, -77, 99, -18, -108, 105, 71, -18, 22, -98, 141, 105, -81, -13, -27, -48, -110, -42, -63, -55, 76, -101, 0, -51, -122, 49, 6, 13, -64, 38, -62, 47, -40, -30, 115, 284, 184, 100, 40, -2, 49, -29, -6, -36, -39, -12, 35, -106, 17, -129, 2, -42, -39, -29, -158, 39, -81, -75, 60, 18, 159, -48, -55, 97, -34, 250, 126, 46, -20, 198, -9, -6, -26, -21, 35, -309, 0, 54, 141, 144, 80, -81, -153, 104, 77, -41, -141, 20, -139, 53, 76, 182, -12, -121, -43, -22, -3, 111, -20, 1, -135, 5, -105, -98, -163, 92, 80, -101, 15, 2, 153, -120, -57, 0, -80, -148, 2, 32, -20, -89, 8, -79, -32, -60, 192, -115, -25, 9, -98, 87, 98, 18, 191, 53, 178, 127, -29, 32, -40, 46, -92, 30, 60, 57, 39, -89, -13, 72, -22, -21, 121, -118, -64, -54, -7, -38, 1, 79, -24, 70, -47, 15, 12, 22, 64, 74, -4, 53, 14, -38, 92, -54, -95, 62, 48, -57, 64, -17, -56, 171, 59, 97, -95, -21, 143, -77, 50, 112, -150, -87, 28, 88, -32, -184, -51, 100]
5215A00j81J70j22j0Q3j12p3N4L15l19J04M5p3k3K5p6O7q1O9M1j11o0K63L0k72
5240a47K37K2J6j0j07n6j10J98j8l6J13j31j2m9p3K33j11j8J64j80J67j19K8R
5264A0N1j05m0J25q7J49j70J8n9N5R0O0K41l55m7J49j31N7j3R4o9K0J3J22k81
5289a03j1J77o7pj0J7K0j19L8K8N5J43m04K06q7J99k18J72m8p2J1M7J44q2j38
5314a09P5k1k0M8J36o7j98J76J65j90l4j54K03O2j13J19p8M2r1P1m3J2n8J70j25
5339b2q7K30j26L0J84j19k17K14n7Qp5P5r1J06N3p1j9M4q3J9j05J0N3J5R1j58
5365i8k2J60N7q0rL6p2p6q7J58K2m8J89o8n6L6j06j90M01q6K9Lk72K57j44j8L2
5392e2N9n4J35j67J73k15J25J9R6o3R4j23n1L2m1n9R4J93j18j59K04k98K95K1
$$ y = [100, -81, 89, -33, -43, 40, -72, -145, -91, 224, -95, 9, 54, -19, -42, -17, -93, -26, -107, -38, 3, -108, -168, 95, 125, -147, 90, 112, 128, 118, 11, -45, -155, 43, 25, -11, 102, -29, -41, -90, -163, 70, -41, -59, 105, -75, 92, -27, 1, 10, 61, -44, -84, 41, -46, 103, -67, -49, -108, -53, 37, 97, 338, -17, -64, 85, -46, 11, -2, 92, 23, 43, 56, 178, -103, -114, 63, -4, -11, -21, -4, 16, -103, -65, -37, 18, 161, -243, -37, -124, 75, -143, 29, -19, -91, -80, -33, 111, 29, -109, -34, -55, -75, -27, 109, 42, -156, 20, 185, -5, -39, -193, 10, 72, -41, 78, 0, 42, -49, 22, -21, -9, -67, 103, -22, -109, 121, -5, 25, 209, 90, -127, 87, 30, 38, -37, 38, -53, 53, 106, 35, 16, 60, -23, -4, -109, -99, -46, -31, 60, -98, -120, 40, 97, 17, 8, 44, -28, -104, -191, -33, -11, -59, 130, 62, 6, 42, -64, -254, 147, 61, 90, 93, -179, 78, -66, -84, -52, 7, -47, 88, -79, 94, -121, 4, 23, 119, 56, 150, 27, -24, 8, -33, -92, 2, 195, 77, -82, 122, -176, 119, 140]
5416A40j77p0J05L4l9K43j45q8O6M1j60P7Jj8k5j02J20mm0J85k22R6M8k42K17
5441D1j51O0n9J09r1N3j3K7N7j22LN8J25q4K3K7j0Oj19J90k00m0K7P6R2j46P2
5468A1p1o4J44P7j19N3m6J94k47J03K2l1M4j21J27J6k76J89j00qR9J25r0Pj09
5493g1P1J20l6j63J9k4l9J92N4k33O9J2K2p6K6R6o4J2M7P3r5o4M2Mo2J54m6J0
5521E0l01K42p1K44j57N3Lj76Q5P6k4Jr9j25R7J01j04J04R0k56J88K7M2m5p6M5
5547A4p7p1J42l9n1K60j85j07K13k6j03K9l2qq7L0K01k68J28J35j57J73j76J1
5571e1P1N0J1j22l0J10k45j1J90o7J05k0p2Q3O7q0J73k76J53M9j12k4J48j57P2
5596A5N4o4Mo4O1j7r5L7L3O3K37l39P9o1KQ4J37j34m3j26K26k17J3J80j81P9l0
$$ y = [140, -37, -107, -2, 32, -7, 236, 91, 3, 69, 110, -50, 27, 28, 10, -15, -117, 3, -1, -41, 144, -78, 18, 66, -176, 41, -110, -50, -109, 0, -91, -38, -51, -24, 33, -89, -86, -28, 97, 13, 36, 63, 53, 59, -60, 130, -70, -110, -83, -7, 85, -61, 11, -60, -124, 20, 97, -22, 31, -15, 179, -68, 35, 57, 26, 70, -51, 76, 92, -184, 5, -95, -103, -4, 121, 31, 38, -71, 0, 120, 84, -79, -60, -84, -123, 69, 123, -110, -41, -29, -7, -83, -57, 39, -25, -13, 34, 107, 12, -52, -10, -6, -68, 86, 40, 50, -251, -9, -80, 164, 7, 60, 63, -113, -28, 48, 24, 25, -74, -199, -102, -1, -105, -1, 89, -167, 21, 48, 90, 45, -31, 14, -63, -134, 8, -31, -82, 178, -7, -114, 99, 73, -30, -1, -33, -41, -128, -98, 103, -165, -37, 98, -59, 114, -62, -51, 20, 70, 81, -41, -71, 39, -206, -217, -27, -94, 11, -9, -81, 2, 69, -11, 162, -114, 39, 88, -24, -48, 100, -57, 15, 69, 5, 9, -55, 6, -11, -106, -69, -36, 27, 264, -75, 4, -57, -55, 29, 166, 32, -11, -137, 89, -128, -115, 65, -116, -37, -67]
5623f7J45k41K57j68Ll6J07k1RJ34k08r9M7J30N5j15K18j31M2j80N8M6K13k35
5647c7K06j27o5O4p5L2J8P1n4K4j96L70k33RO1k11J22k0l1J60j65P4L0o6M9Q3
5673I3q9L5k5j79K08O3mj29p3j5J47j6q9R8om8N5K02k74j08K54j19P1q1r9J61
$$ y = [-67, 78, -163, 94, -74, -71, -107, 0, -21, -12, 122, -86, -185, -138, -8, 47, -68, 150, 19, 61, -119, -61, -15, 198, -37, 169, 42, -23, 41, -34, -2, 16, 87, 33, 57, -139, 231, -2, 7, 68, -143, -21, -41, -72, 88, -77, -3, 27, -39, 10, 93, 4, 39, 14, -165, 43, 106, 102, -27, -100, -115, 32, 16, -73, 25, 19, -29, 26, 228, -46, -154, 100, -19, 52, -29, -128, 33]
$$ [...]
8191a51
##END NTUPLES=NMR FID
##END=
