##TITLE=1H_DE-80H_X3
 200.13MHz, d2o
 8 sc
 
 19ns.26.2.2025
##JCAMPDX= 6.0         $$ Bruker NMR JCAMP-DX V2.0
##DATA TYPE= NMR FID
##DATA CLASS= NTUPLES
##ORIGIN= UXNMR, Bruker Analytische Messtechnik GmbH
##OWNER= pz
$$ XWIN-NMR		Version 3.5
$$ Mon May 18 16:57:44 2026 Russian Standard Time (UT+4h)  Yarkov@DPX200
##.OBSERVE FREQUENCY= 200.1313
##.OBSERVE NUCLEUS= ^1H
##.DELAY= (6, 6)
##.ACQUISITION MODE= SIMULTANEOUS
##.ACQUISITION SCHEME= undefined
##.AVERAGES= 8
##.DIGITISER RES= 18
##SPECTROMETER/DATA SYSTEM= spect
##.PULSE SEQUENCE= zg30
##.SOLVENT NAME= DMSO
##.SHIFT REFERENCE= (INTERNAL, DMSO, 0, 14.3821)
##AUDIT TRAIL= $$ (NUMBER, WHEN, WHO, WHERE, WHAT)
$$ ##TITLE= Audit trail, XWIN-NMR		Version 3.5
$$ ##JCAMPDX= 5.01
$$ ##ORIGIN= Bruker BioSpin GmbH
$$ ##OWNER= Yarkov
$$ C:/Bruker/XWIN-NMR/data/yarkov2/nmr/H-C/1/audita.txt
$$ ##AUDIT TRAIL=  $$ (NUMBER, WHEN, WHO, WHERE, WHAT)
(   1,<2026-05-18 16:56:36.96 +0400>,<Yarkov>,<DPX200>,
      <created by zg, POWCHK disabled, PULCHK disabled
       configuration hash MD5:
       00 E9 B6 7A A2 85 ED C7 34 08 36 98 17 FE 4E 26
       data hash MD5: 16K
       A2 D9 65 11 D5 08 B7 2B EC 05 D1 69 3B 8C 95 53>)
$$ ##END=
$$ 
$$ hash MD5
$$ 91 D3 6F F8 2D FB 5A 8A 2B 7B 6D D0 81 88 D4 24
##$RELAX= 
##$RELAX= 
##$RELAX= 
##$RELAX= 
##$RELAX= 
##$RELAX= 
$$ Bruker specific parameters
$$ --------------------------
##$DU= <C:/Bruker/XWIN-NMR>
##$EXPNO= 1
##$NAME= <H-C>
##$PROCNO= 1
##$TYPE= <nmr>
##$USER= <yarkov2>
##$AMP= (0..31)
100 100 100 100 100 100 100 100 100 100 100 100 100 100 100 100 100 100 
100 100 100 100 100 100 100 100 100 100 100 100 100 100 
##$AQSEQ= 0
##$AQ_mod= 1
##$AUNM= <au_zg>
##$AUTOPOS= <>
##$BF1= 200.13
##$BF2= 200.13
##$BF3= 200.13
##$BF4= 200.13
##$BF5= 200.13
##$BF6= 200.13
##$BF7= 200.13
##$BF8= 200.13
##$BYTORDA= 1
##$CFDGTYP= 0
##$CFRGTYP= 5
##$CHEMSTR= <none>
##$CNST= (0..31)
1 1 145 1 1 1 1 1 1 1 1 1 1 1 1 1 1 1 1 1 1 1 1 1 1 1 1 1 1 1 1 1 
##$CPDPRG= <>
##$CPDPRG1= <>
##$CPDPRG2= <>
##$CPDPRG3= <>
##$CPDPRG4= <mlev>
##$CPDPRG5= <mlev>
##$CPDPRG6= <mlev>
##$CPDPRG7= <mlev>
##$CPDPRG8= <mlev>
##$CPDPRGB= <>
##$CPDPRGT= <>
##$D= (0..31)
0 0.7 0 0 0 0 0 0 0 0 0 0.03 0 0 0 0 0 0 0 0 0 0 0 0 0 0 0 0 0 0 0 0 
##$DATE= 1779108996
##$DBL= (0..7)
120 120 120 120 120 120 120 120 
##$DBP= (0..7)
150 150 150 150 150 150 150 150 
##$DBP07= 0
##$DBPNAM0= <>
##$DBPNAM1= <>
##$DBPNAM2= <>
##$DBPNAM3= <>
##$DBPNAM4= <>
##$DBPNAM5= <>
##$DBPNAM6= <>
##$DBPNAM7= <>
##$DBPOAL= (0..7)
0.5 0.5 0.5 0.5 0.5 0.5 0.5 0.5 
##$DBPOFFS= (0..7)
0 0 0 0 0 0 0 0 
##$DE= 6
##$DECBNUC= <off>
##$DECIM= 32
##$DECNUC= <off>
##$DECSTAT= 4
##$DIGMOD= 1
##$DIGTYP= 9
##$DL= (0..7)
0 120 120 120 120 120 120 120 
##$DP= (0..7)
150 150 150 150 150 150 150 150 
##$DP07= 0
##$DPNAME0= <>
##$DPNAME1= <>
##$DPNAME2= <>
##$DPNAME3= <>
##$DPNAME4= <>
##$DPNAME5= <>
##$DPNAME6= <>
##$DPNAME7= <>
##$DPOAL= (0..7)
0.5 0.5 0.5 0.5 0.5 0.5 0.5 0.5 
##$DPOFFS= (0..7)
0 0 0 0 0 0 0 0 
##$DQDMODE= 0
##$DR= 18
##$DS= 0
$$ [...]
##$SUBNAM2= <"">
##$SUBNAM3= <"">
##$SUBNAM4= <"">
##$SUBNAM5= <"">
##$SUBNAM6= <"">
##$SUBNAM7= <"">
##$SUBNAM8= <"">
##$SUBNAM9= <"">
##$SW= 18.0517328524113
##$SWIBOX= (0..15)
0 0 2 0 0 0 0 0 0 0 0 0 0 0 0 0 
##$SW_h= 3612.71676300578
##$TD= 16384
##$TD0= 1
##$TE= 0
##$TE2= 300
##$TE3= 300
##$TEG= 300
##$TL= (0..7)
0 120 120 120 120 120 120 120 
##$TP= (0..7)
150 150 150 150 150 150 150 150 
##$TP07= 0
##$TPNAME0= <>
##$TPNAME1= <>
##$TPNAME2= <>
##$TPNAME3= <>
##$TPNAME4= <>
##$TPNAME5= <>
##$TPNAME6= <>
##$TPNAME7= <>
##$TPOAL= (0..7)
0.5 0.5 0.5 0.5 0.5 0.5 0.5 0.5 
##$TPOFFS= (0..7)
0 0 0 0 0 0 0 0 
##$TUNHIN= 0
##$TUNHOUT= 0
##$TUNXOUT= 0
##$USERA1= <user>
##$USERA2= <user>
##$USERA3= <user>
##$USERA4= <user>
##$USERA5= <user>
##$V9= 5
##$VALIST= <valist>
##$VCLIST= <CCCCCCCCCCCCCCC>
##$VD= 0
##$VDLIST= <DDDDDDDDDDDDDDD>
##$VPLIST= <PPPPPPPPPPPPPPP>
##$VTLIST= <TTTTTTTTTTTTTTT>
##$WBST= 1024
##$WBSW= 4
##$XGAIN= (0..3)
0 0 0 0 
##$XL= 0
##$YL= 0
##$YMAX_a= 186021
##$YMIN_a= -141675
##$ZGOPTNS= <>
##$ZL1= 120
##$ZL2= 120
##$ZL3= 120
##$ZL4= 120
##$ABSF1= 10
##$ABSF2= 0
##$ABSG= 5
##$ABSL= 3
##$ALPHA= 0
##$AQORDER= 0
##$ASSFAC= 0
##$ASSFACI= 0
##$ASSFACX= 0
##$ASSWID= 0
##$AUNMP= <proc_1d>
##$AZFE= 0.1
##$AZFW= 0.1
##$BCFW= 1
##$BC_mod= 2
##$BYTORDP= 1
##$COROFFS= 0
##$CY= 83.5205535888672
##$DATMOD= 1
##$DC= 2
##$DFILT= <>
##$DTYPP= 0
##$F1P= 10.8118882576601
##$F2P= -7.23987719738617
##$FCOR= 0.5
##$FTSIZE= 0
##$FT_mod= 4
##$GAMMA= 1
##$GB= 0.15
##$INTBC= 1
##$INTSCL= 1
##$ISEN= 128
##$LB= 0.25
##$LEV0= 0
##$LPBIN= 0
##$MAXI= 10000
##$MC2= 0
##$MEAN= 0
##$ME_mod= 0
##$MI= 1.114404
##$NCOEF= 0
##$NC_proc= 0
##$NLEV= 6
##$NOISF1= 3.799351
##$NOISF2= 2.8
##$NSP= 1
##$NTH_PI= 0
##$NZP= 0
##$OFFSET= 14.38212
##$PC= 1
##$PHC0= -5682.701
##$PHC1= 43.02195
##$PH_mod= 1
##$PKNL= yes
##$PPARMOD= 0
##$PSCAL= 0
##$PSIGN= 0
##$REVERSE= no
##$SF= 200.129724274929
##$SI= 16384
##$SIGF1= 3
##$SIGF2= 2
##$SINO= 400
##$SIOLD= 16384
##$SREGLST= <1H.CDCl3>
##$SSB= 0
##$STSI= 0
##$STSR= 0
##$SW_p= 3205.1282051282
##$SYMM= 0
##$S_DEV= 0
##$TDeff= 0
##$TDoff= 0
##$TI= <>
##$TILT= no
##$TM1= 0
##$TM2= 0
##$TOPLEV= 0
##$USERP1= <user>
##$USERP2= <user>
##$USERP3= <user>
##$USERP4= <user>
##$USERP5= <user>
##$WDW= 1
##$XDIM= 8192
##$YMAX_p= 0
##$YMIN_p= 0
$$ End of Bruker specific parameters
$$ ---------------------------------
##NTUPLES= NMR FID
##VAR_NAME=  TIME,          FID/REAL,        FID/IMAG
##SYMBOL=    X,             R,               I
##VAR_TYPE=  INDEPENDENT,   DEPENDENT,       DEPENDENT
##VAR_FORM=  AFFN,          ASDF,            ASDF
##VAR_DIM=   8192,          8192,            8192
##UNITS=     SECONDS,       ARBITRARY UNITS, ARBITRARY UNITS
##FACTOR=    0.0002768,     1,               1
##FIRST=     0,             0,               0
##LAST=      2.2672688,     0,               0
##MIN=       0,             -141675,         0
##MAX=       2.2672688,     186021,          0
$$ Real data points
##PAGE= N=1
##DATA TABLE= (X++(R..R)), XYDATA
$$ plain form
0 0 0 0 0 0 0 0 0 0 0 0 0 0 0 0 0 0 0 0 0 -6 8 -8 8 -8 8 -8 13 -16 16 -21 24 -24 29 -32 37 -41 47 -53 59 -66 73
41 73 -81 90 -101 111 -121 134 -150 164 -181 199 -220 243 -266 295 -325 363 -403 449 -505 569 -649
62 -649 749 -877 1049 -1291 1662 -2315 3753 -13698 46449 130203 130303 84136 11629 -47525
76 -47525 -94333 -118945 -115707 -64396 22713 111559 150167 120847 42573 -36884 -86602 -98386
88 -98386 -84650 -49452 6045 74121 125414 125992 63036 -33582 -114733 -141675 -112600 -50962 16825
101 16825 75179 113920 118198 74583 -8764 -95763 -137029 -108322 -27945 56960 106213 108619
113 108619 79043 34748 -16531 -69192 -107847 -109327 -62623 13298 78671 100756 75735 26369
125 26369 -20724 -52978 -71536 -74718 -54119 -4569 59255 106496 108782 63114 -4885 -62162
$$ packed form
0@%%%%%%%%%%%%%%%%%%%oJ4j6J6j6J6j6K1k9L2l7M5m8N3o1O9p8Q8j00J12j25J39
41G3j54J71j91K12k32K55k84L14l45L80m19M63n09N61o20O88p66Q52r54J074j218
62f49J398j626J926k340K953l977O068j7451O0147Q3754J00m6167p2507n9154
76d7525m6808k4612L238N1311Q7109Q8846L8608k9320p8274p9457m9718j1784
88i8386J3736L5198N5497O8076N1293N78o2956r6618q1151k6942K9075O1638O7787
101A6825N8354L8741M278m3615q3347q6999m1266K8707Q0377Q4905M9253K406
113A08619k9576m4295n1279n2661l8655j480M6704P5921O5373K2085k5021m9366
125B6369m7093l2254j8558l182K0599M9550O3824M7241K286m5668o7999n7277
$$ plain form
137 -62162 -88383 -83461 -56169 -14065 35338 77945 91665 62371 -424 -65463 -98742 -87241
149 -87241 -44386 6457 47642 74186 84625 72369 32101 -27268 -80262 -97308 -68152 -9973
161 -9973 46244 76082 74876 50840 13390 -32080 -75780 -100007 -85643 -31010 41755 95678
173 95678 104897 69296 12211 -39309 -69622 -74596 -55611 -15503 35735 78295 89703 60746
185 60746 4319 -50777 -80259 -77422 -52140 -17283 18395 50149 69149 64105 30000 -19576
197 -19576 -60080 -70476 -48279 -9254 27672 52265 62647 58820 36585 -3893 -51343 -82985
209 -82985 -79538 -40493 12732 53657 66447 52400 23890 -8972 -39722 -61416 -63475 -38084
221 -38084 8813 56712 81731 72711 36890 -7242 -43521 -63282 -64166 -45213 -8631 35294 67063
$$ packed form
137f2162k6221M922K7292M2104M9403M2607J3720k9294o2795o5039l3279J1501
149h7241M2855N0843M1185K6544J0439j2256m0268n9369n2994j7046K9156N8179
161i973N6217K9838j206k4036l7450m5470m3700k4227J4364N4633P2765N3923
173I5678R219l5601n7085n1520l0313m974J8985M0108N1238M2560J1408k8957
185F0746n6427n5096k9482K837K5282L4857L5678L1754J9000n044l4105m9576
197a9576m0504j0396K2197L9025L6926K4593J0382l827k2235m0478m7450l1642
209h2985L447L9045N3225M0925J2790j4047k8510l2862l0750k1694k059K5391
221c8084M6897M7899K5019r020l5821m4132l6279j9761q84J8953L6582M3925L1769
$$ plain form
234 67063 68901 37690 -10982 -53517 -71995 -63010 -34416 3831 41944 69865 76010 52979 6384
247 6384 -42976 -71210 -65449 -31739 10265 42090 54196 48395 27822 -3497 -36589 -62484 -66603
260 -66603 -43045 -1674 38262 59984 57566 36152 6717 -21488 -41504 -47993 -36325 -8512
272 -8512 25776 51418 56047 37693 5747 -26898 -50018 -57123 -47602 -21764 12372 44136 58065
285 58065 48657 18878 -17092 -43438 -50805 -38451 -12446 18616 45304 58906 52333 24875 -14458
298 -14458 -50407 -66661 -56263 -24958 13058 42546 53760 43897 18211 -14183 -42336 -55138
310 -55138 -46645 -18353 18979 50735 63645 52487 22806 -13754 -42856 -55020 -46593 -21592
322 -21592 9831 35782 46478 38027 14260 -15434 -39588 -49459 -41657 -19076 10421 36750 50713
$$ packed form
234F7063J838l1211m8672m2535j8478Q985K8594L8247L8113K7921O145k3031m6595
247F384m9360k8234N761L3710M2004L1825J2106n801k0573l1319l3092k5895m119
260f6603K3558M1371L9936K1722k418k1414k9435k8205k0016o489J1668K7813
272h512L4288K5642M629j8354l1946l2645k3120p105R521K5838L4136L1764J3929
285E8065r408k9779l5970k6346p367J2354K6005L1062K6688J3602o573k7458l9333
298a4458l5949j6254J0398L1305L8016K9488J1214r863k5686l2394k8153j2802
310e5138Q493K8292L7332L1756J2910j1158k9681l6560k9102j2164Q427K5001
322b1592L1423K5951J0696q451k3767k9694k4154r871P802K2581K9497K6329J3963
$$ plain form
335 50713 47026 27066 -1347 -27777 -42028 -39274 -21709 3049 25279 37685 36338 21624 -2158
348 -2158 -27373 -45254 -48200 -33401 -5398 24970 45406 48256 33512 7772 -18588 -36336 -39947
361 -39947 -28203 -5115 21483 42031 47231 34005 5242 -26894 -49671 -53892 -37809 -9099
373 -9099 20792 41391 45696 33126 8527 -18779 -38699 -42862 -28510 -1961 26436 45097 47124
386 47124 32106 5966 -22044 -42256 -47298 -35128 -10155 17168 35194 37460 24408 2689
398 2689 -18023 -31801 -34103 -25181 -6756 16099 35934 43561 34865 12511 -13191 -30818 -35423
411 -35423 -27481 -12143 4417 19053 28272 27762 14914 -7201 -28490 -39814 -34521 -15202 8724
424 8724 29081 38799 36538 23307 2277 -20731 -35477 -36549 -20125 4886 26311 35687 30706
$$ packed form
335E0713l687j9960k8413k6430j4251K754J7565K4758K2230J2406j347j4714k3782
348b158k5215j7881k946J4799K8003L0368K0436K850j4744k5740k6360j7748l611
361c9947J1744K3088K6598K0548N200j3226k8763l2136k2777m221J6083K8710
373i099K9891K0599M305j2570k4599k7306j9920m163J4352K6549K8397J8661K027
386D7124j5018k6140k8010k0212n042J2170K4973K7323J8026K266j3052k1719
398B689k0712j3778k302Q922J8425K2855J9835P627q696k2354k5702j7627m605
411c5423P942J5338J6560J4636R219n10j2848k2115k1289j1324N293J9319K3926
424H724K0357R718k261j3231k1030k3008j4746j072J6424K5011K1425R376m981
$$ plain form
437 30706 14140 -6818 -26480 -39831 -39801 -25285 1495 28304 43210 38550 18792 -4567 -21861
450 -21861 -29050 -26866 -15915 1217 20496 35808 36785 20419 -6936 -30358 -40626 -33219 -15824
463 -15824 2712 16999 25456 27884 19736 3534 -16711 -29439 -27735 -13248 7608 22467 27976
476 27976 25227 16197 3723 -11667 -26690 -32435 -25122 -7109 12380 23936 23544 15181 3991
489 3991 -7123 -18449 -26222 -24923 -11193 11966 32693 39728 28395 7334 -13392 -24905 -27063
502 -27063 -22463 -12269 2346 19651 30535 27410 9018 -15002 -32221 -34026 -22414 -3847 13050
515 13050 24495 29780 27398 15407 -4069 -22717 -31556 -24498 -7007 11318 23449 24446 18219
528 18219 6602 -8281 -23175 -32582 -29422 -12943 9476 27049 30436 20956 5782 -6611 -14135
$$ packed form
437C0706j6566k0958j9662j3351L0J4516K6780K6809J4906m660j9758k3359j7294
450b1861p189K184J0951J7132J9279J5312R77j6366k7355k3422j0268P407J7395
463a5824J8536J4287Q457K428q148j6202k0245j2728J704J4487K0856J4859N509
476B7976k749r030j2474j5390j5023n745P313J8013J9489J1556l92q363j1190
489C991j1114j1326p773J299J3730K3159K0727P035j1333k1061k0726j1513k158
502b7063M600J0194J4615J7305J0884l125j8392k4020j7219j805J1612J8567J6897
515A3050J1445N285k382j1991j9476j8648q839P058J7491J8325J2131R97o227
528A8219j1617j4883j4894r407L160J6479K2419J7573L387r480j5174j2393p524
$$ plain form
541 -14135 -17623 -16950 -10333 2954 18848 28054 23659 8045 -10395 -22114 -23539 -18328 -11000 -2809
555 -2809 6584 16924 22909 18688 4762 -11909 -22500 -21846 -11614 2076 14217 22338 24792 19930
569 19930 6200 -12553 -27877 -31791 -21436 -2745 14140 22407 21098 13040 1683 -10953 -21998
582 -21998 -26121 -18806 -663 19507 31109 28220 14342 -1741 -13234 -18388 -18996 -15434 -7113 5874
596 5874 18893 23576 16150 -290 -16772 -24513 -21485 -11598 -121 10228 18271 22359 19249 8396
610 8396 -6865 -18596 -20743 -12829 -924 9252 14306 14639 11659 4600 -6115 -17252 -22666 -18881
624 -18881 -6560 7044 15553 17051 13794 8815 1975 -6576 -15174 -18727 -12682 1732 17123 24373
638 24373 19883 6830 -7183 -17018 -20755 -19438 -13193 -1800 11657 21887 22299 11716 -4465
$$ packed form
541a4135l488O73O617J3287J5894R206m395j5614j8440j1719j425N211P328Q191
555b809R393J0340N985m221j3926j6671j0591O54J0232J3690J2141Q121K454m862
569A9930j3730j8753j5324l914J0355J8691J6885Q267j309q058j1357j2636j1045
582b1998m123P315J8143K0170J1602k889j3878j6083j1493n154o08L562Q321J2987
596E874J3019M683p426j6440j6482p741L028R887J1477J0349Q043M088l110j0853
610H396j5261j1731k147P914J1905J0176N054L33k980p059j0715j1137n414L785
624a8881J2321J3604Q509J498l257m979o840q551q598l553O045J4414J5391P250
638B4373m490j3053j4013r835l737J317O245J1393J3457J0230M12j0583j6181
$$ plain form
651 -4465 -17020 -20709 -14897 -4125 7053 15434 19763 18459 10321 -2847 -15352 -21567 -18610 -8610
665 -8610 2348 10171 13216 12675 8436 406 -9696 -17893 -18538 -9505 4247 16044 20331 16184 7705
680 7705 -596 -7513 -12496 -14723 -12381 -3899 7489 15436 15465 7680 -3406 -12089 -14768 -12519 -7634
695 -7634 -1687 5538 12449 16531 14720 6545 -4028 -12263 -14710 -11131 -3976 4241 11164 14895 12964
710 12964 5089 -6542 -17051 -20500 -15469 -4425 7006 14516 16555 13569 6584 -2722 -11858 -16475
724 -16475 -13697 -3778 8872 17301 17554 10099 -24 -8719 -13665 -14439 -12204 -6362 1952 10550 15053
739 15053 13005 4814 -5098 -12107 -12912 -8449 -1393 5685 11150 13696 11968 5601 -2921 -10699 -14309
754 -14309 -11946 -5858 1334 6990 9950 9508 5630 -885 -8154 -12403 -11251 -5071 3229 9645 12385
$$ packed form
651d465j2555l689N812J0772J1178Q381M329j304q138j3168j2505o215K957J0000
665h610J0958P823L045n41m239q030j0102q197o45R033J3752J1797M287m147q479
680G705q301o917m983k227K342Q482J1388P947K9p785j1086q683k679K249M885
695g634N947P225O911M082j811q175j0573q235k447L579P155Q217O923L731j931
710A2964p875j1631j0509l449N031J1044J1431P510K039k986o985r306r136m617
724a6475K778R919J2650Q429K53p455j0123q695m946p74K235N842Q314Q598M503
739A5053k048q191r912p009q05M463P056P078N465K546j728o367q522p778l610
754a4309K363O088P192N656K960m42l878o515p269m249J152O180Q300O416K740
$$ plain form
769 12385 11327 7606 2140 -4436 -10506 -13409 -11033 -3313 6406 12961 12910 7001 -1540 -9012 -12966
784 -12966 -12710 -8494 -1200 7190 13664 15491 11314 2231 -7089 -12662 -12793 -7410 343 7665 12040
799 12040 11587 6379 -1642 -9006 -13211 -12364 -7481 -412 6282 10348 11039 8176 2414 -4328 -9442 -10496
815 -10496 -6603 470 7089 10588 9950 5736 113 -4960 -8703 -10156 -8659 -4294 1615 7482 10058
830 10058 8787 3491 -2934 -7583 -8827 -6460 -1908 3423 7539 9811 8892 4947 -1067 -7102 -11039
845 -11039 -10808 -6563 410 7192 10092 8874 4184 -2301 -7815 -10631 -9029 -4110 2971 8947 10923
860 10923 10527 5469 -611 -6914 -10175 -10493 -5732 1959 7885 10309 8679 2750 -4504 -7935 -9481
875 -9481 -7517 -3135 1286 6137 9214 9247 5614 -234 -6557 -8900 -6702 -2556 2059 5308 6902 5764
$$ packed form
769A2385j058l721n466o576o070k903K376P720R719O555n1n909q541p472l954
784a2966K56M216P294Q390O474J827m177r083r320n573j31N383P753P322M375
799A2040m53n208q021p364m205Q47M883P069O694M066O91k863n762o742n114j054
815a0496L893P073O619L499o38m214n623n073l743j453J497M365N909N867K576
830A0058j271n296o425m649j244K367M552N331M116K272r19l945o014o035l937
845a1039K31M245O973O782K900j218m690o485n514k816J602M919P081N976J976
860A0923l96n058o080o303l261l18M761P691N926K424j630n929p254l431j546
875i481J964M382M421M851L077L3l633n848o323k343K198M146M615L249J594j138
$$ plain form
891 5764 3269 -796 -4991 -8235 -8089 -5614 -794 4021 7078 7838 6115 2088 -2576 -6536 -7637 -5138
907 -5138 -591 4434 7366 7413 5190 1428 -2855 -6597 -9167 -8465 -4356 2118 7967 9745 7026 1754
923 1754 -4133 -7413 -7281 -5118 -1362 3305 7155 9322 7634 2838 -3341 -8474 -9536 -7047 -2356
938 -2356 3159 6916 7664 5333 1081 -3789 -6951 -7584 -5025 -356 3656 6669 7357 6007 2737 -1577
954 -1577 -5476 -7328 -6098 -2378 2476 5578 5952 3836 742 -2167 -4464 -5506 -5460 -3449 113 4111
970 4111 7216 7200 4404 -506 -4212 -5797 -5474 -2867 345 3324 5323 5504 3611 -177 -4162 -7152
986 -7152 -7347 -4926 -728 3837 6575 6978 5115 767 -3919 -6626 -6558 -3514 744 4733 6703 6316
1002 6316 3818 101 -3847 -6927 -7989 -5561 -697 4433 7439 6655 2769 -1556 -4365 -5093 -4182 -2285
$$ packed form
891E764k495m065m195l244J46K475M820M815L057P60j723m027m664l960j101K499
907e138M547N025K932M7k223l762m283l742k570P02M109O474N849J778k719n272
923A754n887l280J32K163L756M667L850K167j688m796o179n133j062K489M691
938b356N515L757P48k331m252m870l162o33K559M669M012L013O88j350l270m314
954a577l899j852J230L720M854L102L74k116l094k909k297j042M6K011L562L998
970D111L105j6k796m910l706j585L23K607L212K979J999J81j893l788l985k990
986g152j95K421M198M565K738M03j863m348m686k707O8L044M258L989J970l87
1002F316k498l717l948l080j062K428M864N130L006p84l886m325k809p28R11J897
$$ plain form
1018 -2285 268 2861 5252 5809 4149 564 -3408 -5565 -5430 -3398 -595 2046 3857 4282 3472 1087
1034 1087 -1778 -4260 -4972 -3809 -1216 1774 4086 5632 5288 2925 -820 -4697 -6436 -5126 -1584
1049 -1584 2336 4319 4482 3194 985 -1242 -3489 -5009 -5252 -3078 1026 4886 6594 5473 2088
1064 2088 -1443 -3799 -4462 -3898 -2093 518 3329 5200 5003 2506 -1302 -4447 -5827 -5156 -2559 919
1080 919 4030 5838 5142 2523 -1408 -4333 -4929 -3440 -760 1776 3110 4028 3639 2317 -277 -3156
1096 -3156 -5095 -4753 -2389 909 3113 3679 2815 1455 -71 -1470 -2924 -3466 -3024 -1068 1972 4282
1112 4282 4888 3517 747 -2182 -4472 -4688 -3274 -586 2184 3954 3985 2768 177 -2135 -3386 -4036
1128 -4036 -3133 -593 1878 4018 5027 3712 1092 -1701 -3750 -4163 -2687 -1192 1094 2956 3464 3402
$$ packed form
1018b285K553K593K391N57j660l585l972k157J35K032K803K641J811M25q10k385
1034A087k865k482p12J163K593K990K312J546l44k363l745l877j739J310L542
1049a584L920J983J63j288k209k227k247j520k43K174M104L860J708j121l385
1064B088l531k356o63N64J805K611K811J871j97k497l808l145j380O71K597L478
1080I19L111J808o96k619l931k925n96J489K680K536J334R18l89j322k594k879
1096c156j939L42K364L298K204N66q64j360j526j399j454n42M42J956L040K310
1112D282O06j371k770k929k290k16J414K688K770J770L1j217k591k312j251o50
1128d036R03K540K471K140J009j315k620k793k049m13J476J495K286J862N08o2
$$ plain form
1144 3402 1859 -1074 -3771 -4932 -3887 -1985 1900 4887 5543 3404 291 -2128 -3825 -3922 -1918 -382
1160 -382 1805 3036 3138 2297 515 -1504 -3233 -3492 -2732 -677 992 2479 2928 2311 868 -111 -851
1177 -851 -2131 -2249 -2067 -729 1201 3117 3930 2541 1161 -2138 -4779 -4546 -1739 528 2464 3521
1193 3521 3011 1321 -87 -1834 -3286 -3279 -1501 688 3170 3957 3033 623 -1163 -2174 -3313 -3055 -1902
1210 -1902 -302 1209 2675 2373 1420 594 -1524 -2366 -3206 -3097 -838 1851 4005 3844 2525 -503 -3213
1227 -3213 -3059 -2237 -853 496 1666 2185 2854 2191 60 -1738 -3111 -3111 -1494 358 1855 2029 2043 1634
1245 1634 860 -394 -1778 -2391 -2165 -1079 594 1832 2591 2458 1445 -439 -2642 -3716 -3323 -918
1261 -918 1806 3287 2963 1774 -80 -889 -1523 -1859 -2200 -1531 420 2414 2978 2572 159 -1640 -2321
$$ packed form
1144C402j543k933k697j161J045J902L885K987O56k139l113k419j697r7K004J536
1160c82K187J231J02q41j782k019j729k59P60K055J669J487M49o17j443r79p40
1177h51j280j18J82J338J930J916Q13j389j380l299k641K33K807K267J936J057
1193C521n10j690j408j747j452PJ778K189K482P87r24k410j786j011j139K58J153
1210a902J600J511J466l02r53q26k118q42q40J09K259K689K154j61j319l028k710
1227c213J54Q22J384J349J170N19O69o63k131j798j373%J617J852J497J74J4m09
1245A634p74j254j384o13K26J086J673J238P59j33j013j884k203j074L93K405
1261i18K724J481l24j189j854q09o34l36l41O69J951J994N64m06k413j799o81
$$ plain form
1278 -2321 -2216 -1226 -410 -324 1053 2042 2509 1770 -601 -1588 -3199 -2086 -1110 494 1791 2753 2857 1541
1296 1541 -323 -2016 -3184 -2181 -741 1182 1300 1854 1513 953 -188 -1051 -2307 -2986 -1315 945
1312 945 1675 2707 1386 187 -528 -657 -1077 -1665 -1532 -1210 649 2168 2731 1801 537 -1064 -2304
1329 -2304 -2289 -1328 372 1184 2383 2132 1275 39 -1180 -1779 -1955 -1385 -431 854 1916 2117 1672 207
1347 207 -1270 -2283 -2291 -1281 227 898 1769 2011 1526 476 -233 -802 -2013 -1424 -874 950 2065 3095
1365 3095 1795 208 -1561 -2072 -1712 -1306 -789 -297 1125 1595 1999 1228 -1027 -1334 -1925 -1640 -776 -43
1383 -43 1778 1746 1735 1031 -117 -1463 -1484 -1461 -183 94 695 1974 1950 1467 20 -1061 -2841 -1942 -896
1402 -896 1132 1680 1705 1038 222 -134 -687 -1050 -1328 -1254 -156 1040 1930 1712 870 -386 -1323 -1538 -1274
$$ packed form
1278b321J05R90Q16Q6J377R89M67p39k371r87j611J113R76J604J297R62J04j316
1296A541j864j693j168J003J440J923J18N54l41n60j141q63j256o79J671K260
1312I45P30J032j321j199p15j29m20n88J33L22J859J519N63r30j264j601j240
1329b304J5R61J700Q12J199k51q57j236j219n99j76N70R54J285J062K01m45j465
1347B07j477j013qJ010J508O71Q71K42m85j050p09n69j211N89N50J824J115J030
1365C095j300j587j769n11L60M06N17M92J422M70M04p71k255l07n91K85Q64P33
1383d3J821l2j1p04j148j346k1K3J278K77O01J279k4m83j447j081j780Q99J046
1402h96K028N48K5o67q16l56n53l63k78P4J098J196Q90k18q42j256r37k15K64
$$ plain form
1421 -1274 -488 198 697 1348 1422 870 -18 -781 -1302 -1293 -1289 -494 627 1602 1982 1195 19 -1328 -1617 -1314
1441 -1314 -514 153 529 883 1169 1369 724 -618 -1695 -2165 -1398 -154 1161 1493 1410 701 -59 -625 -1358
1460 -1358 -1311 -1017 -39 730 1188 1381 923 428 -424 -1201 -1620 -1171 -324 894 1491 1403 333 -274 -371 -748
1480 -748 -503 -570 -899 -170 775 1315 1281 554 -488 -1215 -1150 -792 -73 -311 415 1085 1002 794 499 -470 -1369
1501 -1369 -1091 -599 -476 1131 1393 1708 992 -36 -925 -1418 -1404 -164 837 1339 872 520 540 -191 -449
1520 -449 -1192 -1473 -735 275 1344 1642 739 -19 -505 -1140 -560 -631 -449 -153 462 974 1365 305 -204
1539 -204 -61 -1145 -1172 -582 -8 898 592 1168 588 120 184 -651 -947 -673 -31 -459 1108 1599 547 25
1559 25 -557 -1035 -973 -615 165 744 300 490 394 475 377 -319 -946 -1196 -1140 -54 804 1978 1114 554 -810
$$ packed form
1421a274P86O86M99O51P4n52q88p63n21RMP95J121R75L80p87j176j347k89L03
1441a314Q00O67L76L54K86K00o45j342j077m70P67J244J315L32q3p09p60n66p33
1460a358M7K94R78P69M58J93m58m95q52p77m19M49Q47J218N97q8j070o07r7l77
1480g48K45o7l29P29R45N40l4p27j042p27O5L58P19k38P26O70q3k08k95r69q99
1501a369K78M92J23J607K62L15p16j028q89m93J4J240J001N02m67l52K0p31k58
1520d49p43k81P38J010J069K98r03p58m86o35N80p1J82K96O15N12L91j060n09
1539b04J43j084k7N90N74R06l06N76n80m68O4q35k96K74O42m28J567M91j052n22
1559B5n82m78O2L58P80N79m44J90r6Q1r8o96o27k50N6J086Q58J174q64n60j364
$$ plain form
1580 -810 -1282 -1123 -798 102 272 1023 1314 1186 460 -853 -819 -1156 -471 131 -31 1482 1160 460 677 -1280
1600 -1280 -1097 -289 243 276 546 991 788 798 808 394 -952 -1146 -1072 -647 661 910 1030 -115 -667 -79
1620 -79 443 409 -791 -254 276 169 874 497 112 -477 -85 -786 -101 -144 -631 339 316 1169 303 -122 198
1641 198 -835 -218 -191 -791 426 918 1140 1669 461 -713 -1321 -1393 -409 323 343 229 622 713 -53 58
1661 58 -309 -1141 -586 304 1110 1468 1232 -324 -764 -631 -449 -280 -44 110 -273 533 361 50 -19 -487
1681 -487 -162 -317 29 -123 201 706 752 545 112 -344 -349 -198 -196 -131 -110 96 533 772 728 56 -727 -1128 -568
1704 -568 -191 243 489 343 226 418 492 191 -525 -943 -815 -125 531 918 1069 310 -368 -636 -829 -794 -380
1725 -380 -68 666 811 910 223 -209 -402 -660 -453 -97 346 788 857 599 44 -661 -814 -680 207 499 374
$$ packed form
1580h10m72J59L25R00J70P51K91j28p26j313L4l37O85O02j62J513l22p00K17j957
1600a280J83Q08N32L3K70M45k03J0J0m14j346j94P4M25J308K49J20j145n52N88
1620g9N22l4j200N37N30j07P05l77l85n89L92p01O85m3m87R70k3Q53q66m25L20
1641A98j033O17K7o00J217M92K22N29j208j174o08p2R84P32K0j14L93R1p66J11
1661E8l67q32N55Q90Q06L58k36j556m40J33J82J69K36J54l83Q06j72l11o9m68
1681d87L25j55L46j52L24N05M6k07m33m56nJ51KO5K1K06M37K39m4o72p83m01N60
1704e68L77M34K46j46j17J92P4l01p16m18J28O90O56L87J51p59o78k68j93L5M14
1725c80L12P34J45R9o87m32j93k58K07L56M43M42O9k58n55p05j53J34Q87K92j25
$$ plain form
1746 374 118 -192 -125 77 300 -25 -508 -349 -255 198 531 285 41 109 57 259 229 -187 -640 -626 -234 316
1768 316 514 563 138 -354 -348 -614 -497 -241 173 559 755 578 197 -106 -284 -457 -512 -321 -129 317 608
1789 608 770 231 -453 -889 -797 -285 150 355 282 321 339 516 -31 -308 -856 -662 60 677 963 556 47
1810 47 -319 -622 -570 -354 -194 162 472 241 113 -256 -12 -18 112 98 2 55 4 7 309 197 -38 -96 -1 94
1834 94 89 -320 -751 -566 145 647 698 278 -287 -543 -670 -111 261 366 334 223 503 272 33 -239 -618 -606
1856 -606 -231 514 539 685 681 -119 -507 -866 -590 -230 529 587 406 528 -193 101 -418 -345 -306 -234 57 537
1878 537 514 435 212 -458 -502 -447 244 349 556 361 80 18 217 160 -95 -39 -348 -100 37 -118 -38 310 114
1901 114 -197 8 172 -130 -494 -507 123 -217 340 446 541 595 -412 -516 -144 -459 -151 118 -58 283 -244
$$ packed form
1746C74k56l10O7K02K23l25m83J59R4M53L33k46k44O8n2K02l0m16m53J4L92N50
1768C16J98M9m25m92Ok66J17K56M14L86J96j77l81l03j78j73n5J91J92M46K91
1789F08J62n39o84m36R2N12M35K05p3L9J8J77n47k77n48J94P22O17K86m07n09
1810D7l66l03N2K16J60L56L10k31j28l69K44oJ30j4r6N3n1LL02j12k35n8R5R5
1834I4nm09m31J85P11N02N1m20n65k56j27N59L72J05l2j11K80k31k39k72l79J2
1856f06L75P45K5J46mq00l88l59K76L60P59N8j81J22p21K94n19P3L9P2K91M80
1878E37k3p9k23o70m4N5O91J05K07j95k81o2J99n7k55N6l09K48J37j55Q0L48j96
1901A14l11K05J64l02l64j3O30l40N57J06R5N4j007j04L72l15L08K69j76L41n27
$$ plain form
1922 -244 -23 90 -412 -273 143 -89 238 1244 468 371 -440 -662 -291 -521 -184 580 315 542 436 -45
1942 -45 -18 -193 -174 -230 -191 43 93 7 22 -269 -308 -248 -252 173 343 25 96 32 -402 144 113 351 356 175 -388 -104
1968 -104 -379 168 443 -170 -2 250 77 247 -249 -339 -335 -281 509 440 582 466 -496 -377 -397 -228 649 381
1990 381 647 352 294 -624 -103 -542 -123 -61 310 137 678 523 341 -415 -648 -407 156 374 503 190 -124
2011 -124 592 -165 -444 -243 -121 -102 552 297 389 -164 102 -488 -840 -186 -76 27 571 80 9 97 -129
2032 -129 -146 -309 -25 359 -225 -168 -596 -136 32 -56 -15 -409 21 352 -135 -500 -46 291 162 395 763
2053 763 344 -117 5 -538 -316 313 -202 680 886 201 -52 -410 -264 -257 -28 325 -83 674 473 243 -80
2074 -80 -171 -618 -9 -88 540 170 128 -105 -916 120 -135 -139 -9 -610 2 94 225 93 30 -114 -316 -172
$$ packed form
1922b44K21J13n02J39M16k32L27J006p76r7q11k22L71k30L37P64k65K27j06m81
1942d5K7j75J9n6L9K34N0q6J5k91l9O0mM25J70l18P1o4m34N46l1K38Nj81n63K84
1968a04k75N47K75o13J68K52j73J70m96r0MN4P90o9J42j16r62J19k0J69Q77k68
1990C81K66k95n8r18N21m39M19O2L71j73N41j55j82p56k33K41N63K18J29l13l14
2011a24P16p57k79K01J22J9O54k55R2n53K66n90l52O54J10J03N44m91p1Q8k26
2032a29j7j63K84L84n84N7m28M60J68q8M1l94M30L31m87l65M54L37j29K33L68
2053G63m19m61J22n43K22O29n15Q82K06o85k53l58J46PK29L53m08P57k01k30l23
2074h0r1m47O09p9O28l70m2k33q11J036k55mJ30o01O12R2J31j32o3j44k02J44
$$ plain form
2096 -172 233 461 47 77 218 146 128 -105 278 251 124 69 -376 -204 -295 342 117 -12 438 45 -510 239
2118 239 -475 -502 -726 30 524 400 245 -418 -754 -398 82 185 367 1060 568 -261 -791 308 32 -44
2138 -44 429 -159 293 715 151 -65 183 -493 -167 -42 -121 428 38 66 -227 -478 19 132 -173 -373 -206
2159 -206 1 655 186 68 -52 -297 115 -126 -400 180 54 374 -412 -232 -551 -58 42 443 -403 -197
2179 -197 353 -337 143 319 160 -74 -205 11 -292 -93 -150 -181 129 351 -40 137 218 -498 -643 -637 -299 -182
2201 -182 719 464 125 295 -660 -95 -384 -299 74 56 118 224 -125 -382 -205 -942 -238 -249 208 484 109
2222 109 41 -130 61 -105 -322 549 94 -342 -234 459 636 263 118 7 679 -183 17 312 242 194 121
2243 121 -36 -40 14 577 128 545 235 -27 227 338 -157 -156 37 299 416 -68 -76 -201 -342 77 -155 995
$$ packed form
2096a72M05K28m14L0J41p2j8k33L83k7j27n5m45J72r1O37k25j29M50l93n55P49
2118B39p14k7k24P56M94j24j55o63l36L56M80J03J82O93m92q29n30J099k76p6
2138d4M73n88M52M22n64k16K48o76L26J25p9N49l90K8k93k51M97J13l05k00J67
2159b06K07O54m69j18j20k45M12k41k74N80j26L20p86J80l19M93J00M01q46K06
2179a97N50o90M80J76j59k34j31K16l03J99n7l1L10K22l91J77Q1p16j45OL38J17
2201a82R01k55l39J70r55N65k89Q5L73j8O2J06l49k57J77p37P04j1M57K76l75
2222A09o8j71J91j66k17Q71m55m36J08O93J77l73j45j11O72q62K00K95p0m8p3
2243A21j57mN4N63m49M17l10k62K54J11m95JJ93K62J17m84qj25j41M19k32J150
$$ plain form
2265 995 104 -377 -343 -816 -172 -440 490 338 632 104 -307 -437 -395 30 316 11 644 148 13 342 -284
2286 -284 -29 -171 281 618 109 336 15 47 -346 -274 475 375 78 -525 579 -155 137 525 5 -1 -568
2307 -568 -452 444 66 341 14 -119 120 111 -114 247 103 361 -44 -653 -711 55 394 -169 -528 300 -7
2328 -7 -618 -86 -34 -215 -383 -620 -122 572 777 -235 -448 -197 -344 -41 511 778 672 242 55 30 -753
2349 -753 203 423 683 -410 328 238 -309 -264 -324 -547 111 284 113 216 17 -382 -336 43 -146 85 273
2370 273 -632 -182 3 223 132 246 -250 35 167 116 48 462 -93 -248 70 -299 49 -122 3 -133 -127 -252
2392 -252 -167 509 364 -88 254 30 108 -142 114 -462 14 25 -223 373 331 22 -332 -649 -255 69 -14 185
2414 185 74 -111 -119 -124 66 16 -63 225 429 258 132 -21 43 -55 -111 226 118 214 171 268 -297 -356 -132 -4
$$ packed form
2265I95q91m81L4m73O44k68R30j52K94n28m11j30M2M25K86l05O33m96j35L29o26
2286b84K55j42M52L37n09K27l21L2l93P2P49j00k97o03J104p34K92L88n20on67
2307e68J16Q96l78K75l27j33K39rk25L61j44K58m05o09n8P66L39n63l59Q28l07
2328go11N32N2j81j68k37M98O94K05j012k13K51j47L03N52K67j06m30j87k5p83
2349g53R56K20K60j093P38r0n47M5o0k23O58J73j71J03j99l99M6L79j89K31J88
2370B73r05M50J85K20r1J14m96K85J32n1o8M14n55j55L18l69L48j71J25j36Oj25
2392b52Q5O76j45m52L42k24P8k50K56n76M76J1k48N96m2l09l54l17L94L24q3J99
2414A85j11j85qnJ90n0p9K88K04j71j26j53O4r8n6L37j08R6m3R7n65n9K24J28
$$ plain form
2438 -4 452 168 11 -255 -202 223 111 -191 -196 -363 133 -47 -192 251 -142 -191 24 96 -88 -125 -78 -18 -110 -102
2462 -102 81 188 460 -192 225 161 105 -4 195 27 -241 95 -71 134 607 -1 137 -176 -396 -82 333
2483 333 100 215 141 103 -63 -536 -345 -382 242 -24 161 67 79 46 55 132 -208 -69 251 459 214 36 -223
2506 -223 -125 4 -127 92 88 65 -126 21 232 -18 -90 233 186 -125 114 21 16 -23 -96 -230 -174 66 120 207 116
2531 116 -171 -128 -171 18 77 114 75 -197 -134 68 -34 -6 88 13 126 65 83 -79 -324 -146 -324 -122 66 172
2555 172 159 -134 139 -188 -229 -85 165 207 197 3 -34 -147 -161 53 24 -24 60 115 208 55 33 -232 -10 34
2579 34 119 144 -19 116 -106 5 -55 65 169 -6 8 26 169 26 1 -47 -65 154 108 159 104 105 -177 -95 -136
2604 -136 -63 38 123 89 -1 20 -52 -76 15 58 69 258 129 134 5 -83 -188 -269 23 -34 131 81 -38 44 -79 43
$$ packed form
2438dM56k84j57k66N3M25j12l02nj67M96j80j45M43l93m9K15P2j84l7M7O0r2Q
2462a02J83J07K72o52M17o4n6j09J99j68k68L36j66K05M73o08J38l13k20L14M15
2483C33k33J15p4l8j66m73J91l7O24k66J85r4J2l3RP7l40J39L20K08k45j78k59
2506b23R8J29j31K19mk3j91J47K11k50p2L23m7l11K39r3nl9p3j34N6K40N4Q7r1
2531A16k87M3m3J89N9L7l9k72O3K02j02K8R4p5J13o1J8j62k45J78j78K02J88J06
2555A72j3k93K73l27m1J44K50M2j0j94l7j13j4K14k9m8Q4N5R3j53k2k65K22M4
2579C4Q5K5j63J35k22J11o0J20J04j75J4J8J43j43k5m8j8K19m6N1n5Jk82Q2m1
2604a36P3J01Q5l4r0K1p2k4R1M3J1J89j29Nj29q8j05q1K92n7J65n0j19Q2j23J22
$$ plain form
2630 43 -93 -56 4 1 109 49 -4 -74 80 -45 -101 -51 -30 105 192 87 -165 -284 -117 36 114 31 119 -82 -172
2655 -172 -23 -34 90 24 -167 130 -21 170 -22 82 94 -201 -38 28 111 -112 60 -65 -374 -65 76 263
2677 263 221 -83 62 -7 -25 -80 69 99 30 51 85 168 -21 -208 -200 -92 -36 28 183 71 148 -60 -43 -74 -91 -84
2703 -84 84 119 168 40 -14 -57 -22 -223 -205 -60 -36 287 -24 132 -150 -118 -21 53 161 184 54 35 -164 -257 14
2728 14 133 114 82 103 0 -83 -116 -136 -59 -53 -38 74 58 40 -118 -124 -62 136 187 202 0 54 -104 -4 160 259 -102
2755 -102 -1 80 120 115 -7 -172 -115 -185 143 -42 99 -73 -123 -93 -40 -198 19 53 97 -89 -86 196 -19 -131
2779 -131 111 34 -204 -469 -20 254 126 -14 -234 -117 -197 178 39 67 313 -35 43 89 -44 343 28 273
2801 273 266 73 -162 89 518 -55 208 -121 8 -412 -21 75 -270 -22 -78 -253 447 586 137 -214 -57
$$ packed form
2630D3j36L7O0lJ08o0n3p0J54j25n6N0K1J35Q7j05k52j19J67J53P8q3Q8k01r0
2655a72J49j1J24o6j91K97j51J91j92J04J2k95J63O6Q3k23J72j25l09L09J41J87
2677B63m2l04J45o9j8n5J49L0o9K1L4Q3j89j87QJ08N6O4J55j12P7k08J7l1j7P
2703h4J68L5M9j28n4m3L5k01J8J45K4L23l11J56k82L2R7P4J08K3j30j9j99r3K71
2728A4J19j9l2K1j03q3l3k0P7OJ5J12j6j8j58oO2J98N1J5k02N4j58J00J64R9l61
2755a02J01Q1M0nj22j65N7p0L28j85J41j72n0L0N3j58K17L4M4j86LK82k15j12
2779a31K42p7k38k65M49K74j28j40k20J17q0L75j39K8K46l48P8M6j33L87l15K45
2801B73pj93k35K51M29n73K63l29J29m20L91R6l45K48n6j75P00J39m49l51J57
$$ plain form
2822 -57 -20 448 498 433 95 -340 -145 72 -159 -284 339 50 -484 140 271 228 182 38 -184 -129 -400 -54
2844 -54 350 319 -579 -135 153 228 482 -265 514 325 -22 -201 -216 -45 172 -174 -11 256 -9 130 20
2865 20 -7 38 287 -188 -484 -226 -1 -437 364 -27 -362 401 -163 -380 176 233 -679 -512 -45 -259 285
2886 285 -10 -334 232 687 -127 -350 -221 -22 -190 12 -19 -345 -510 586 -142 10 -429 -94 588 264
2906 264 599 -182 -28 -168 -305 -31 589 730 248 250 217 -246 -170 -355 -159 342 -26 76 25 -237 457 176
2928 176 -84 -25 -144 -219 270 -37 -158 -58 -64 -132 -260 410 -85 141 -112 -301 -48 -95 -85 160 91 -119 -101
2951 -101 50 137 -50 149 -95 -334 67 -159 -13 218 -209 -196 -376 -206 -81 106 191 74 -61 -205 84
2972 84 161 -150 168 103 -32 38 64 -2 -386 -201 -94 -14 347 50 70 -55 -329 33 3 -48 -4 -75 -38 -292
$$ packed form
2822e7L7M68N0o5l38m35J95K17k31j25O23k89n34O24J31m3m6j44k22N5k71L46
2844e4M04l1q98M44K88P5K54p47P79j89l47j79j5J71K17l46J63K67k65J39j10
2865B0k7M5K49m75k96K58K25m36Q01l91l35P63n64k17N56N7r12J67M67k14N44
2886B85k95l24N66M55q14k23J29J99j68K02l1l26j65J096p28J52m39L35O82l24
2906B64L35p81J54j40j37K74O20J41m82Kl3m63P6j85J96N01l68J02n1k62O94k81
2928A76k60N9j19p5M89l07j21J00oo8j28O70m95K26k53j89K53m7J0K45o9k10J8
2951a01J51Q7j87J99k44k39M01k26J46K31m27J3j80J70J25J87Q5j17j35j44K89
2972H4P7l11L18o5j35P0K6o6l84J85J07Q0L61k97K0j25k74L62l0n1M4p1L7k54
$$ plain form
2996 -292 71 95 -30 222 133 29 -66 1 78 -72 189 9 -194 -2 361 71 140 52 -38 -36 -29 0 212 -115
3020 -115 -47 123 -163 100 -5 9 -84 -50 128 217 150 -318 -163 -46 -20 35 -64 68 -215 -22 -170 154 -79
3043 -79 -108 39 -73 0 -38 0 117 42 105 1 -117 -218 81 76 59 -23 -210 -108 -108 34 258 75 -103 -146 -75
3068 -75 160 194 17 35 47 61 207 55 -93 -263 -84 -55 -29 -38 -18 41 23 -54 55 20 74 108 105 37 31 -213 33
3095 33 -41 39 27 -241 -68 22 170 101 -158 -69 -152 62 84 124 -29 -91 -187 85 163 236 110 -101 7 141 211
3120 211 -43 -40 -5 12 -174 -53 75 -143 -34 166 203 46 -64 -25 53 -16 147 14 77 -67 61 95 41 84
3144 84 -205 73 -82 -126 -194 27 -15 -108 143 65 42 -86 -110 -221 229 210 67 -46 133 -50 23 22 -167 -6
3168 -6 168 63 64 46 -55 -124 -180 -95 -2 -53 100 -17 -145 -43 45 53 -50 14 -46 115 184 -56 -15 115 -70 120
$$ packed form
2996b92L63K4j25K52q9j04r5O7P7j50K61j80k03J92L63k90O9q8r0KPK9K12l27
3020a15O8J70k86K63j05J4r3L4J78Q9o7m68J55J17K6N5r9J32k83J93j48L24k33
3043g9k9J47j12P3l8L8J17p5O3j04j18j01K99nj7q2j87J02%J42K24j83j78m3P1
3068g5K35L4j77J8J2J4J46j52j48j70J79K9K6rK0N9j8p7J09l5N4L4lo8ok44K46
3095C3p4Q0j2k68J73R0J48o9k59Q9q3K14K2M0j53o2r6K72P8P3j26k11J08J34P0
3120B11k54LL5J7j86J21J28k18J09K00L7j57j10L9P8o9J63j33O3j44J28L4n4M3
3144H4k89K78j55m4o8K21m2r3K51p8k3j28k4j11M50j9j43j13J79j83P3jj89J61
3168fJ74j05Jj8j01o9n6Q5R3n1J53j17j28J02Q8Qj03O4o0J61O9k40M1J30j85J90
$$ plain form
3194 120 -225 -17 122 -36 194 62 -128 -123 -12 -20 176 46 103 -167 71 46 -57 1 60 39 95 19 -118 135
3218 135 -13 111 -91 -119 55 19 74 -223 32 -42 134 68 114 170 79 -72 -45 90 242 -71 -20 -114 -144 16
3242 16 141 99 -39 -38 -76 151 177 -15 135 -47 -5 31 -12 -71 119 33 -45 185 22 -412 -38 -114 -105 517 -194
3267 -194 -76 -254 108 197 -194 287 122 173 -86 7 19 -265 -5 189 62 121 -295 190 182 115 149 372 -91
3290 -91 -312 111 387 287 103 -168 -631 -142 -48 88 840 -239 188 -549 -6 -164 728 -158 -14 219
3310 219 319 23 -47 359 467 367 395 198 51 319 476 947 -204 211 -553 150 -509 -77 -219 -799
3330 -799 -147 43 257 -379 -249 -178 -662 390 153 -81 -109 -425 250 -194 178 -163 17 226 25 -217
3350 -217 -30 135 166 293 61 -85 178 -49 -13 6 104 154 31 202 -84 -84 -296 -47 -203 265 132 195 123
$$ packed form
3194A20l45K08J39j58K30j32j90NJ11qJ96j30N7k70K38k5j03N8N9k1N6p6j37K53
3218A35j48J24k02k8J74l6N5k97K55p4J76o6M6N6r1j51K7J35J52l13N1r4l0J60
3242A6J25m2j38Jl8K27K6j92J50j82M2L6m3n9J90q6p8K30j63m34L74p6RO22p11
3267a94J18j78L62Q9l91M81j65N1k59R3J2k84K60J94j27N9m16M85qo7L4K23m63
3290i1k21M23K76j00j84k71m63M89R4J36P52j079M27p37N43j58Q92q86J44K33
3310B19J00k96p0M06J08j00K8j97j47K68J57M71j151M15p64P03o59M32j42n80
3330g99O52J90K14o36J30P1m84J052k37k34k8l16O75m44L72l41J80K09k01k42
3350b17J87J65L1J27k32j46K63k27L6J9R8N0j23J71k86%k12K49j56M68j33O3p2
$$ plain form
3373 123 -240 -344 -182 -165 4 176 -348 142 73 76 -116 199 6 17 -43 253 183 -148 -10 -71 151 102 -81
3396 -81 73 -60 -21 136 347 -120 139 -76 -42 -100 17 -275 -98 -109 -71 229 -81 348 -161 352 -201 58
3418 58 2 -130 -432 295 -34 69 227 -169 7 -191 419 527 601 -525 472 123 127 175 -155 -459 97 -25
3440 -25 437 -165 -262 -267 -248 -444 -7 -219 381 11 252 1 -42 14 33 405 -357 -78 -384 341 37 165 -213
3463 -213 31 -143 494 242 -21 470 -154 436 89 -117 121 171 58 54 -93 234 581 -161 209 275 29
3484 29 -29 8 -279 263 -317 -279 -268 -164 -131 -248 79 105 11 -325 -141 45 266 -111 202 31 544 -209 293
3507 293 337 4 263 -97 -501 -27 82 -263 26 350 345 -132 210 86 57 79 72 -190 244 -38 70 -6 -322
3530 -322 427 213 -57 551 -40 -227 -57 336 591 126 5 -65 -118 761 -336 385 35 537 160 96 300
$$ packed form
3373A23l63j04J62J7J69J72n24M90o9Lj92L15j93J1o0K96p0l31J38o1K22m9j83
3396h1J54j33L9J57K11m67K59k15L4n8J17k92J77j1L8L00l10M29n09N13n53K59
3418E8n6j32l02P27l29J03J58l96J76j98O10J08P4j126R97l49MM8l30l04N56j22
3440b5M62o02r7nJ9j96M37k12O00l70K41k51m3N6J9L72p62K79l06P25l04J28l78
3463b13K44j74O37k52k63M91o24N90l47k06K38N0j13mj47L27L47p42L70O6k46
3484B9n8L7k87N42n80L8J1J04L3j17L27K6r4l36J84J86K21l77L13j71N13p53N02
3507B93M4l33K59l60m04M74J09l45K89L24nm77L42j24k9K2pk62M34k82J08p6l16
3530c22P49k14k70O08n91j87J70L93K55m65j21p0n3Q79j097P21l50N02l77o4K04
$$ plain form
3551 300 109 -109 -82 -29 77 368 269 73 -126 175 166 43 165 337 50 173 144 -303 123 220 -83 67
3573 67 372 -518 -219 100 516 393 564 124 -428 252 -151 28 137 -357 -6 77 -29 -89 -193 -211 93
3594 93 -173 -127 -47 -392 626 175 138 410 -177 -426 612 22 -277 -69 -181 -149 158 345 -364 -57 -334
3615 -334 -108 103 328 -296 146 -110 -249 212 679 110 -330 -125 -237 347 19 49 0 -116 -11 122 -185
3636 -185 -140 -170 16 37 30 -74 -177 -77 -2 357 104 490 -279 147 -78 -509 304 -133 324 -619 -467 -322
3658 -322 -489 72 -389 -20 -170 336 -40 345 126 -137 271 -621 -139 -191 141 206 -429 55 -127 20 -61
3679 -61 44 206 155 13 9 140 70 280 -7 -205 53 178 32 -25 -37 -290 -22 -79 132 251 59 45 -57
3702 -57 -27 -239 181 86 157 60 -35 167 -89 133 30 22 -82 -38 -80 31 -41 -38 14 -11 98 118 92 40 56 -103
$$ packed form
3551C00j91k18K7N3J06K91r9j96j99L01rj23J22J72k87J23k9m47M26R7l03J50
3573F7L05q90K99L19M16j23J71m40n52O80m03J79J09m94L51Q3j06o0j04j8L04
3594I3k66M6Q0l45J018m51l7K72n87k49J038n90k99K08j12L2L07J87p09L07k77
3615c34K26K11K25o24M42k56j39M61M67n69m40K05j12N84l28L0m9j16J05J33l07
3636a85M5l0J86K1pj04j03J00P5L59k53L86p69M26k25m31Q13m37M57r43J52J45
3658c22j67N61m61L69j50N06l76L85k19k63M08q92M82n2L32O5o35M84j82J47q1
3679f1J05J62n1j42mJ31p0K10k87j98K58J25j46n7j2k53K68n7K11J19j92j4j02
3702e7L0k12M20r5P1r7r5K02k56K22j03qj04M4m2J11p2LN2k5J09K0k6n2J6j59
$$ plain form
3728 -103 -233 155 100 -124 -125 -161 91 79 -55 6 -81 -26 -70 -24 -112 -207 88 -39 42 112 -20 -214 9 -85 72
3753 72 -131 -114 51 67 58 74 -26 -86 -59 30 53 -48 81 -100 92 65 20 -110 -17 -188 99 96 76 184 41
3778 41 67 -57 58 81 -43 -146 47 162 151 -43 -4 -79 -42 -60 22 -169 3 85 13 99 39 -4 -71 102 50
3803 50 86 -119 -77 -120 111 -36 -12 -60 -45 14 89 66 55 -24 -91 -117 165 92 -10 85 -58 115 -32 124 32 -96
3829 -96 -22 -60 137 -112 -50 38 45 -1 -30 -27 -16 67 37 -13 86 -251 -147 -99 145 -110 0 -66 -233 46 -29 129
3855 129 -199 -95 72 -33 132 54 -189 -53 105 27 39 -72 105 -152 -86 135 -61 5 -13 151 93 -65
3877 -65 -38 30 -33 29 82 107 -267 -58 -4 -135 68 -107 -127 -159 86 89 127 174 -146 62 188 -64 17 -64 15 -33
3903 -33 39 48 -73 -175 -164 208 76 -23 -51 -320 58 133 -88 85 -131 67 8 206 -22 -154 1 14 6 96
$$ packed form
3728a03j30L88n5k24jl6K52j2j34O1q7N5m4M6q8r5K95j27Q1P0j32j94K23r4J57
3753G2k03J7J65J6rJ6j00o0K7Q9K3j01J29j81J92k7m5j30R3j71K87lk0J08j43
3778D1K6j24J15K3j24j03J93J15j1j94L9p5L7j8Q2j91J72Q2p2Q6o0m3o7J73n2
3803E0L6k05M2m3K31j47K4m8J5N9P5k3j1p9o7k6K82p3j02R5j43J73j47J56r2j28
3829i6P4l8J97k49O2Q8Pm6k9LJ1Q3l0n0R9l37J04M8K44k55J10o6j67K79p5J58
3855A29l28J04J67j05J65p8k43J36J58p8J2j11J77k57O6K21j96O6j8J64n8j58
3877f5K7O8o3O2N3K5l74K09N4j31K03j75k0l2K45LL8M7l20K08J26k52Q1q1P9m8
3903c3P2Rj21j02J1L72j32r9k8k69L78P5k21J73k16J98n9J98k28j32J55J3qR0
$$ plain form
3927 96 66 -55 -10 37 -83 196 13 -25 1 31 -71 -3 -21 -177 3 124 -29 -14 -166 69 87 -136 206 -1
3951 -1 -34 -130 -154 117 199 -5 -22 -26 -85 32 74 3 -88 39 49 -10 112 33 -5 -15 -4 163 82 -2 252 78 189
3978 189 148 -105 -102 -31 166 110 49 101 -86 34 111 -72 117 -71 45 166 39 149 -129 28 -238 107 52
4001 52 -78 86 -48 26 14 9 -5 8 -75 -2 72 73 36 179 99 141 -166 -35 85 27 361 23 -145 -209 28 -207
4027 -207 103 -113 47 -72 40 60 -167 71 -324 -81 -366 -181 48 145 -150 260 88 254 -233 -180 273
4048 273 -105 -381 -486 -50 -81 -28 -194 124 71 154 385 386 496 200 444 -245 -89 -172 229 -49 -216 -158 -138
4071 -138 130 -205 -74 150 -54 -203 -30 99 103 339 -185 52 -127 69 6 -534 -169 69 -468 225 185
4092 185 -449 290 -599 -413 291 -210 -28 132 149 -291 -486 -77 452 -132 152 110 121 72 -111 326 75
$$ packed form
3927I6l0j21M5M7j20K79j83l8K6L0j02O8j8j56J80J21j53J5j52K35J8k23L42k07
3951al3r6k4K71Q2k04j7mn9J17M2p1r1J27J0n9J22p9l8j0J1J67q1q4K54j74J11
3978A89m1k53LP1J97n6o1N2j87J20P7j83J89j88J16J21j27J10k78J57k66L45n5
4001E2j30J64j34P4j2nj4J3q3P3P4Jl7J43q0M2l07J31J20n8L34l38j68o4K37k35
4027b07L10k16J60j19J12K0k27K38l95K43k85J85K29R7k95M10j72J66m87N3M53
4048B73l78k76j05M36l1N3j66L18n3Q3K31JJ10k96K44o89J56q3M01k78j67N8K0
4071a38K68l35J31K24k04j49J73J29MK36n24K37j79J96o3n40L65K38n37O93m0
4092A85o34P39q89J86P04n01J82J60J7m40j95M09N29n84K84m2J1m9j83M37k51
$$ plain form
4113 75 77 -9 165 70 -107 -332 294 -233 -158 -363 270 70 175 -120 2 58 -334 7 -414 -330 -80 123 -153
4136 -153 -207 120 -85 -58 21 124 658 -161 -303 -572 374 -69 83 369 -448 147 425 -29 87 -14 190
4157 190 -281 -74 -164 -5 -29 97 -244 -240 -130 -21 -78 88 -397 45 16 -354 -198 89 -361 -238 210 -303
4179 -303 57 97 -351 498 154 -161 217 -250 -58 135 -46 112 -351 -135 213 -29 -93 118 -293 -35 138
4200 138 -80 -124 148 135 -22 -46 -4 -286 -8 185 59 48 -12 181 29 226 -17 36 -149 68 -57 56
4222 56 35 17 3 92 -74 -37 212 153 -72 4 183 64 56 59 255 230 -31 274 211 266 -158 -123 -309 334 488
4247 488 60 135 55 214 45 -162 -415 -246 -234 -254 -50 -66 124 95 238 -345 323 -65 257 -21 95 268
4269 268 -288 187 -145 8 94 104 -362 -128 -113 123 -151 -166 187 -5 43 247 242 -172 -174 6 79 -285 188
$$ packed form
4113G5Kq6J74r5j77k25O26n27P5k05O33k00J05k95J22N6l92L41m21Q4K50K03k76
4136a53n4L27k05K7P9J03N34q19j42k69R46m43J52K86q17N95K78m54J16j01K04
4157A90m71K07r0J59k4J26l41MJ10J09n7J66m85M42k9l70J56K87m50J23M48n13
4179c03L60M0m48Q49l44l15L78m67J92J93j81J58m63K16L48k42o4K11m11K58J73
4200A38k18m4K72j3j57k4M2k82K78J93j26j1o0J93j52J97k43N3j85K17j25J13
4222E6k1j8j4Q9j66L7K49n9k25P6J79j19qLJ96k5k61L05o3N5m24L5j86O43J54
4247D88m28P5q0J59j69k07k53J69J2k0K04j6J90k9J43n83O68l88L22k78J16J73
4269B68n56M75l32J53Q6J0m66K34J5K36k74j5L53j92M8K04nm14kJ80P3l64M73
$$ plain form
4292 188 -202 -58 220 30 -63 -95 171 -218 -43 418 -270 42 231 -92 233 468 573 -126 146 172 -227
4313 -227 121 62 -262 -60 302 262 -316 -4 -527 -161 -468 -6 -364 -84 -23 56 -272 -300 -36 -216 138 -3
4335 -3 -215 -107 188 -117 -367 -145 193 232 -19 169 -347 353 -355 58 102 12 606 282 176 292 402 -124
4357 -124 -212 172 84 -249 78 41 -362 -591 -356 -61 655 57 787 -104 -146 421 84 -32 -246 400 -394
4378 -394 -140 425 316 475 -569 -419 194 694 308 -222 253 140 162 530 592 299 -376 302 -112 -546
4398 -546 611 -225 -437 -69 -344 408 483 -95 150 205 285 99 -27 -154 27 320 -132 -131 -182 -1 301 69
4420 69 -136 97 264 231 -168 -73 -124 -125 -297 175 113 -8 -143 -84 -46 149 9 14 71 60 -8 75 28 -93 -187 168
4446 168 -64 63 -210 15 -60 49 -20 -60 -129 -54 -107 1 153 -38 -47 82 -87 -37 126 236 -175 -92 -329
$$ packed form
4292A88l90J44K78j90r3l2K66l89J75M61o88L12J89l23L25K35J05o99K72K6l99
4313b27L48n9l24K02L62m0n78L12n23L66l07M62l58K80O1P9l28k8K64j80L54j41
4335ck12J08K95l05k50K22L38L9k51J88n16P00p08M13M4r0N94l24j06J16J10n26
4357a24q8L84q8l33L27l7m03k29K35K95P16n98P30q91m2N67l37j16k14O46p94
4378c94K54N65j09J59j044J50O13N00l86n30M75j13K2L68O2k93o75O78m14m34
4398e46J157q36k12L68k75P52P5n78K45N5Q0j86j26j27J81K93m52Jn1J81L02k32
4420F9k05K33J67l3l99R5n1jj72M72o2j21j35N9L8J95j40NN7j1o8Q3m7j21r4L55
4446A68k32J27k73K25p5J09o9m0o9P5n3J08J52j91rJ29j69N0J63J10m11Q3k37
$$ plain form
4469 -329 362 -172 147 288 308 -284 650 280 -126 342 -87 -369 38 -222 -67 -47 221 135 -631 216 -216
4490 -216 236 -181 -74 277 -181 200 210 13 354 169 -482 -93 -220 18 -259 -201 160 -48 -203 70 30
4511 30 -24 38 -89 -91 -339 239 36 -245 44 296 -3 -66 -235 -130 -145 -188 131 -92 -192 187 -144 -14 -109
4534 -109 141 67 75 -106 -59 -62 -142 141 -111 -82 -93 -91 44 37 5 52 -99 -141 31 -33 79 13 -23 -29 -171 -53 -214
4561 -214 -223 139 -140 -146 -20 68 5 13 -40 -182 50 -78 -235 11 -96 88 141 203 177 144 82 222 -6 66 -71
4586 -71 -171 109 14 -279 -159 279 -157 123 -9 -208 -2 -122 143 97 210 323 88 171 251 292 61 -131
4608 -131 -11 -137 -52 -13 83 10 -50 12 -62 -113 80 129 55 87 26 13 182 158 50 113 77 -40 134 -212 -225 26
4634 26 125 -194 -86 60 -67 -68 -29 120 -188 -26 5 -15 -127 -38 -235 -143 -1 27 -148 143 -186 38 -254
$$ packed form
4469c29O91n34L19J41K0n92R34l70m06M68m29k82M07k60J55K0K68q6p66Q47m32
4490b16M52m17J07L51m58L81J0j97L41j85o51L89j27K38k77N8L61k08j55K73m0
4511C0n4O2j27kk48N78k03k81K89K52k99o3j69J05j5m3L19k23j00L79l31J30r5
4534a09K50p4Qj81M7lq0K83k52K9j1KJ35pl2M7j51m2J72o4J12o6l6oj42J18j61
4561b14rL62k79oJ26Q8o3Qn3j42K32j28j57K46j07J84N3O2k6l3o2J40k28P2j37
4586g1j00K80r5k93J20M38m36K80j32j99K06j20K65m6J13J13k35Q3Q0M1k31j92
4608a31J20j26Q5L9R6p3o0O2p4n1J93M9p4L2o1j3J69k4j08O3l6j17J74l46j3K51
4634B6R9l19J08J46j27jL9J49l08J62L1k0j12Q9j97R2J42K8j75K91l29K24k92
$$ plain form
4657 -254 -67 77 -393 -77 -11 -162 274 86 105 -90 -296 336 -157 470 326 57 -35 -364 -13 -477 -588
4678 -588 -344 -251 -205 -13 -318 -449 -214 -51 -275 81 -256 -62 231 -69 5 32 -51 -225 48 124 154 -40
4700 -40 -50 -12 123 -118 38 -525 495 374 218 -60 -101 2 229 202 -333 -221 -84 42 -39 -114 121 243
4722 243 -139 44 -287 101 6 -330 -60 -285 -10 -127 109 37 -373 -599 -346 403 307 34 316 414 -162
4743 -162 -216 314 -171 -276 -269 -320 33 -118 64 232 -31 -201 400 -73 113 -41 306 -561 -253 -13 -275
4764 -275 -221 -482 -132 -300 -132 -416 111 29 -101 207 -449 -265 448 127 -457 -764 490 -8 -195 -733
4784 -733 96 -400 297 293 -79 1023 222 -122 311 -347 34 -386 -150 -742 -147 -752 -434 136 263 269 29
4805 29 -17 -319 4 -1 -116 -92 -274 73 210 34 206 91 -95 18 142 -6 -242 -133 -280 186 175 332
$$ packed form
4657b54J87J44m70L16O6j51M36j88J9j95k06O32m93O27j44k69r2l29L51m64j11
4678e88K44R3M6J92l05j31K35J63k24L56l37J94K93l00P4K7q3j74K73P6L0j94
4700d0j0L8J35k41J56n63J020j21j56k78m1J03K27k7n35J12J37J26q1p5K35J22
4722B43l82J83l31L88r5l36K70k25K75j17K36p2m10k26K53P49r6k73K82R8n76
4743a62n4N30m85j05Pn1L53j51J82J68k63j70O01m73J86j54L47q67L08K40k62
4764b75N4k61L50j68J68k84N27q2j30L08o56J84P13l21n84l07J254m98j87n38
4784g33Q29m96O97ml72J102q01l44M33o58L81m20K36n92N95o05L18N70J27Ok40
4805B9m6l02L23nj15K4j82L47J37j76J72j15j86J13J24j48k36J09j47M66j1J57
$$ plain form
4827 332 -48 106 -296 253 101 -35 9 -26 110 -46 -121 176 42 -69 -137 -103 129 -23 -63 85 147 96 19
4850 19 32 109 -492 18 158 122 22 44 70 -111 -56 5 -88 -44 -304 -115 83 218 303 30 2 336 191 95
4874 95 63 259 230 -84 264 -6 -105 67 46 197 40 -127 168 -122 32 -35 54 102 42 1 -73 -6 -64 -53 -116
4899 -116 123 50 -132 45 -368 224 -47 -159 -210 -35 0 -81 -244 304 -91 7 57 -8 253 93 159 -28 24
4922 24 -161 -123 130 -135 24 84 55 219 -141 -16 -220 26 131 -57 56 193 49 18 247 56 -6 117
4944 117 112 181 -92 12 -113 -60 82 31 -92 -94 0 92 78 -349 184 64 -36 -245 159 -178 -146 -94 -174 -38
4968 -38 -234 -266 -72 0 220 -123 -449 227 -254 16 -121 -440 205 57 -70 -97 -329 72 261 111 481
4989 481 231 -29 116 -293 26 -246 101 186 18 -125 -134 -63 203 -324 108 -128 -21 95 79 177 246 -219
$$ packed form
4827C32l80J54m02N49j52j36M4l5J36j56p5K97j34j11o8L4K32j52m0J48O2n1p7
4850A9J3P7o01N10J40l6j00K2K6j81N5O1r3M4k60J89J98J35Q5k73k8L34j45r6
4874I5l2J96k9l14L48k70r9J72k1J51j57j67K95k90J54o7Q9M8o0m1p4O7n8J1o3
4899a16K39p3j82J77m13N92k71j12n1J75L5q1j63N48l95R8N0o5K61j60O6j87N2
4922B4j85L8K53k65J59O0k9J64l60J25k04K46J05j88J13J37j44l1K29j91o2J23
4944A17nO9k73J04j25N3J42n1j23kR4R2j4m27N33j20j00k09M04l37L2N2q0J36
4968c8j96l2J94P2K20l43l26O76m81K70j37l19O45j48j27k7k32M01J89j50L70
4989D81k50k60J45m09L19k72L47Q5j68j43rP1K66n27M32k36J07J16j6R8O9m65
$$ plain form
5011 -219 -177 137 -124 124 -49 115 -185 4 -172 -186 138 -115 143 77 -445 -301 -12 453 247 388 -82
5032 -82 128 -281 -116 61 -250 -254 -154 22 -192 -285 -381 266 12 -370 18 3 -192 13 -418 216 131 -286
5054 -286 230 -120 32 95 -242 268 63 56 12 85 -94 51 56 -102 -61 89 -71 -207 -30 -87 15 36 86 -106
5078 -106 -12 41 -193 3 164 176 -178 152 -177 -72 -247 148 110 -234 -16 -109 -110 420 -153 -421 148 -346
5100 -346 -219 132 -565 289 -94 309 -186 -284 188 33 119 -125 121 112 -62 -23 7 -108 -152 41 -38 72 -73
5123 -73 23 2 25 5 272 144 45 65 97 45 -43 -60 -27 -3 25 136 -50 -33 -84 -209 53 119 -8 -24 31 170
5149 170 -67 63 -99 58 -61 129 64 -137 -114 24 -15 -63 -99 63 -74 -43 -47 -8 -24 111 76 -6 -53 -28 53
5174 53 -28 -8 -25 -99 -61 40 12 56 -21 141 111 293 -21 231 -80 55 199 -13 142 146 -25 80 -77 -55
$$ packed form
5011b19M2L14k61K48j73J64l00J89j76j4L24k53K58o6n22J44K89M65k06J41m70
5032h2K10m09J65J77l11mJ00J76k14r3r6O47k54l82L88j5j95K05m31O34q5m17
5054b86N16l50J52O3l37N10k05pm4P3j79J45Nj58M1J50j60j36J77n7J02K1N0j92
5078a06R4N3k34J96J61J2l54L30l29J05j75L95l8l44K18r3jN30n73k68N69m94
5100c46J27L51o97Q54l83M03m95r8M72j55Q6k44K46rj74L9L0j15m4J93p9J10j45
5123g3R6k1K3k0K67j28r9K0L2n2q8j7L3K4K8J11j86J7n1j25K62O6j27j6N5J39
5149A70k37J30j62J57j19J90o5k01K3J38l9m8l6J62j37L1mL9j6J35l5q2m7K5Q1
5174E3q1K0j7p4L8J01k8M4p7J62l0J82l14K52l11J35J44k12J55Mj71J05j57K2
$$ plain form
5198 -55 -114 118 17 -37 467 14 -172 55 -119 132 -114 160 342 -146 84 164 272 -279 -209 -266 304 306 546
5221 546 253 146 -519 -101 194 -133 -164 180 -206 -135 740 237 254 395 -19 88 24 218 307 -88 174 -222
5243 -222 -35 -162 202 -178 122 -482 231 230 -67 -66 7 151 18 115 -19 133 189 -124 -102 -323 -176 126 92
5266 92 -72 -126 44 5 60 -369 -38 15 -163 21 255 102 129 134 32 -153 -1 -121 -281 -120 104 -196 -51
5289 -51 -115 59 -100 -91 -50 -41 132 144 142 106 -91 96 -78 -40 163 5 9 128 261 -106 131 208 -37 -160 -74
5314 -74 50 -53 -25 -123 -242 225 37 13 466 -105 90 35 -91 230 -278 -207 506 394 -46 -217 -126 642
5336 642 19 -238 218 93 -526 372 300 230 311 -85 741 -571 550 73 -161 -1 -663 -272 364 -295
5356 -295 -3 362 600 383 -175 -227 92 -161 -124 139 -881 223 -23 -53 453 513 4 -104 35 259 -138
$$ packed form
5198e5n9K32j01n4N04m53j86K27j74K51k46K74J82m88K30Q0J08n51P0n7N70KK40
5221E46k93j07o65M18K95l27l1L44l86P1Q75n03J7J41m14J07o4J94Q9l95K62l96
5243b22J87j27L64l80L00o04P13jk97JP3J44j33R7j34J52N6l13K2k21J47L02l4
5266I2j64n4J70l9N5m29L31N3j78J84K34j53K7Nj02j85J52j20j60J61K24l00J45
5289e1o4J74j59RM1RJ73J2kl6j97J87j74L8K03j58MJ19J33l67K37P7k45j23Q6
5314g4J24j03K8r8j19M67j88k4M53n71J95n5j26L21n08P1P13j12m40j71R1P68
5336F42o23k57M56j25o19Q98p2p0Q1l96Q26j312J121m77k34J60o62L91O36o59
5356b95K92L65K38k17n58n2L19k53L7K63j020J104k46l0N06O0n09j08J39K24l97
$$ plain form
5377 -138 159 -71 -151 -80 164 -50 218 211 -109 -100 88 -126 -235 22 -215 92 127 42 -12 18 -139 -190 -276 -392
5401 -392 183 124 -85 56 -95 85 334 -312 -188 -153 -304 -79 174 -30 -69 -192 549 473 -550 404 390
5422 390 198 313 -154 -11 453 395 121 -321 158 -429 -19 -30 -237 369 -544 123 -335 8 -189 -199 -59
5443 -59 201 261 -193 -414 -308 -10 -657 -203 -125 -122 71 334 176 -205 -299 373 -215 -163 168 -123 -28 360 -195
5466 -195 -337 -366 484 153 -188 44 235 -136 -160 371 207 -341 -13 -32 -400 -299 -73 116 -103 273 197
5487 197 -30 88 232 -104 -21 -158 28 314 -148 -373 -127 95 -510 -59 -92 -338 60 118 175 -9 -116
5508 -116 53 127 72 134 -15 -56 -383 -342 237 -114 -34 105 265 11 28 -414 140 226 -74 300 327 244 -243
5531 -243 366 -308 -45 362 -140 -38 45 143 -161 -82 -59 -154 -290 -135 -317 -35 125 207 225 38 163 76 107
$$ packed form
5377a38K97k30q0P1K44k14K68pl20RJ88k14j09K57k37L07L5q5n4L0j57n1q6j16
5401c92N75n9k09J41j51J80K49o46J24L5j51K25K53k04l9j23P41p6j023R54j4
5422C90j92J15m67J43M64n8k74m42M79n87M10j1k07O06r13O67m58L43j97j0J40
5443e9K60O0m54k21J06K98o47M54P8LJ93K63j58l81r4O72n88N2L31k91R5L88n55
5466a95j42k9Q50l31l41K32J91l71k4N31j64n48L28j9l68J01K26J89k19L76p6
5487A97k27J18J44l36Q3j37J86K86m62k25K46K22o05M51l3k46L98N8N7j84j07
5508a16J69P4n5O2j49m1l27M1N79l51Q0J39J60k54J7m42N54Q6l00L74K7q3m87
5531b43O09o74K63M07n02J02Q3R8l04P9K3r5j36J55j82K82J60Q2J8j87J25q7L1
$$ plain form
5554 107 -100 137 22 -62 -80 -177 -121 93 -37 -71 -59 84 125 -88 -97 -164 17 -19 171 28 139 135 372 42
5578 42 -23 -70 185 -107 202 73 -200 -207 202 -268 55 248 2 26 -457 -57 -89 -284 -432 16 170 492
5600 492 794 -361 118 -38 -1 -25 -126 127 27 -15 157 -26 0 54 33 -26 -87 75 104 41 -25 8 66 -84
5624 -84 -3 -10 -44 -98 16 142 -82 -92 -6 52 20 -45 2 15 -41 -13 65 162 90 62 132 30 -12 -3 -123 75 48 62
5652 62 1 -80 -3 108 -30 -38 -46 123 88 -95 3 43 10 16 12 -69 -20 -10 64 5 -56 53 -44 -132 -22 -114 -153 -104 -40
5681 -40 -4 -52 -207 -36 -99 50 30 3 -2 57 138 142 -146 172 -45 131 -133 -47 -31 2 -28 -26 -53 95 -63 -4 -165
5708 -165 0 -47 -56 75 -57 112 89 -93 -80 80 -6 34 16 204 -136 -5 85 -88 -65 -163 -2 -120 -112 7
5732 7 138 -87 8 -85 -180 -38 5 218 -156 -27 27 55 -223 12 95 28 -131 -44 -138 -160 -72 84 -79 42 -84
$$ packed form
5554A07k07K37j15q4j8r7N6K14j30l4J2J43M1k13ro7J81l6J90j43J11mK37l30
5578D2o5m7K55k92L09j29k73pM09m70L23J93k46K4m83M00l2j95j48M48J54L22
5600D92L02j155M79j56L7k4j01K53j00m2J72j83K6N4k1n9o1J62K9o3o6L3N8j50
5624h4Q1pl4n4J14J26k24j0Q6N8l2o5M7J3n6K8P8R7p2k8P0j02m2Rj20J98k7J4
5652F2o1q1P7J11j38qqJ69l5j83R8M0l3Omq1M9J0P4n9o1J09r7q8J10r2l9M9O4
5681d0L6m8j55J71o3J49k0k7nN9Q1Mk88L18k17J76k64Q6J6L3l0Kk7J48j58N9j61
5708a65J65m7rJ31j32J69k3j82J3J60q6M0j8J88l40J31R0j73K3r8J61j18QJ19
5732GJ31k25R5r3r5J42M3K13l74J29N4K8k78K35Q3o7j59Q7r4k2Q8J56j63J21j26
$$ plain form
5757 -84 -148 49 -134 -210 -65 -57 -47 150 -53 -162 -17 12 46 131 89 -27 94 50 68 -8 -18 37 -106 -77 -102 8
5783 8 12 -1 -60 105 144 114 -36 3 -82 -64 -240 -59 151 97 77 307 -316 -196 142 -196 46 19 -216 187 418
5808 418 86 6 -69 49 -232 -63 -480 -75 -265 -225 -85 77 122 226 208 101 -45 191 -93 -351 70 -46
5830 -46 -160 -27 -37 150 126 180 -340 32 -14 -163 -87 62 -92 -113 -266 27 358 -182 68 110 -165 102 98
5853 98 97 -260 -144 116 56 223 46 38 -11 125 225 -297 -271 -112 -244 -73 160 -289 219 -22 -168 -164 -110 -190
5877 -190 -133 110 208 87 -233 260 91 26 -6 -101 -52 102 -125 38 29 130 114 4 -59 -7 -158 365 213 66
5901 66 114 -219 134 -42 36 67 -398 185 -38 222 215 62 49 78 -63 -209 77 100 28 114 129 58 -103 -78 138
5926 138 -61 23 -29 7 -237 -85 35 -40 12 -140 -250 2 -233 148 -332 -11 -224 -50 -3 -121 3 -53
$$ packed form
5757h4o4J97j83p6J45QJ0J97k03j09J45K9L4Q5m2j16J21m4J8p6j0N5j43K9k5J10
5783HMj3n9J65L9l0j50L9q5J8j76J81K10n4k0K30o23J20L38l38K42k7k35M03K31
5808D18l32q0p5J18k81J69m17M05j90M0J40J62M5J04j8j07j46K36k84k58M21j16
5830d6j14J33j0J87k4N4n20L72m6j49P6J49j54k1j53K93L31n40K50M2k75K67m
5853I8jl57J16K60o0J67j77qm9J36J00n22K6J59j32J71K33m49N08k41j46MN4q0
5877a90N7K43R8j21l20M93j69o5l2r5M9J54k27J63rJ01j6j10o3N2j51N23j52j47
5901F6M8l33L53j76P8L1m65N83k23K60pj53j3K9j41j46K86K3p2Q6J5p1j61K5K16
5926A38j99Q4n2L6k44J52J20p5N2j52j10K52k35L81m80L21k13J74M7j18J24n6
$$ plain form
5948 -53 62 19 -20 -3 25 98 98 -17 17 153 -175 -127 88 -5 -8 -17 -34 169 11 24 259 64 -11 127 57 137 97
5975 97 -149 -131 58 -13 -11 105 233 68 -84 189 -136 11 -49 -81 -63 -3 142 6 -36 -120 -4 58 17 44 -65
6000 -65 59 138 10 -111 108 89 15 -104 31 -30 -18 -82 165 41 -2 166 155 163 -121 -52 -152 39 -52 40 15
6025 15 -81 -68 -27 -78 -58 -39 303 83 -68 23 -25 82 -80 -12 -58 -11 68 52 -47 8 37 11 44 -57 -108 -86 -16
6052 -16 -166 59 -135 -15 -21 -115 119 -62 -57 75 -44 -60 60 0 -26 -38 108 39 1 -19 -52 105 -62 16 38
6077 38 53 56 133 31 -155 -105 7 -103 -64 64 -151 101 -151 94 -104 -47 304 -180 27 -29 -56 -52 42 60 -39
6102 -39 -80 -34 -60 -38 98 -39 -3 86 -19 -43 -83 161 -37 102 -1 -1 -32 -20 -61 -95 58 168 98 -65 -78 -121
6128 -121 143 -162 89 33 -137 -57 -90 -65 14 21 44 -79 114 141 -69 -23 138 2 -77 23 -67 2 55 -38 55
$$ packed form
5948e3J15m3l9J7K8P3%j15L4J36l28M8K15r3lrj7K03j58J3K35j95p5J38p0Q0m0
5975I7k46J8J89p1KJ16J28j65j52K73l25J47o0l2J8O0J45j36m2q4J16O2m1K7j09
6000f5J24P9j28j21K19j9p4j19J35o1J2o4K47j24m3J68j1Qk84O9j00J91r1R2k5
6025A5r6J3M1n1K0J9L42k20j51R1m8J07j62O8m6M7P9j6r9N5K9k6L3j01n1K2P0
6052a6j50K25j94J20or4K34j81NJ32j19j6J20o0k6j2J46o9l8k0l3J57j67P8K2
6077C8J5LP7j02j86N0J12j10L9J28k15K52k52K45j98N7L51m84K07n6k7MR4J8r9
6102c9m1M6k6K2J36j37L6Q9j05k4m0K44j98J39j03%l1J2m1l4J53J10p0j63j3m3
6128a21K64l05K51n6j70Q0l3K5P9PK3j23J93K7k10M6J61j36p9J00r0O9N3r3R3
$$ plain form
6153 55 7 -45 -15 104 34 -54 -159 -31 -13 -10 34 -20 49 10 -93 37 31 26 8 78 154 104 -51 65 -90 -25 -92 -20
6181 -20 7 35 56 -145 -58 128 -60 48 -185 41 105 41 191 61 -33 141 -14 22 126 6 -57 -68 12 100
6205 100 71 -8 -6 -48 58 46 -76 99 183 25 5 -14 172 -55 -36 96 4 -36 114 100 -110 -30 85 -119 -111
6230 -111 -19 -6 137 -125 0 28 79 117 -74 -9 -105 -1 -141 33 28 9 -48 -120 -101 7 4 -140 -31 13 82 19
6256 19 24 136 62 -43 82 -135 45 18 -12 77 20 -41 48 -147 17 -33 -85 78 157 109 -115 -24 85 56 -66
6281 -66 -40 78 2 135 102 -63 -67 122 -141 -50 -206 54 -6 -42 70 -133 0 78 61 -194 76 25 190 -11
6305 -11 -34 63 127 203 121 -137 141 76 54 -151 -34 -5 264 -1 -147 -10 -87 240 348 -131 -224 150 107 353
6329 353 -167 56 -13 -82 252 383 -529 -525 139 319 221 -70 -95 406 165 -259 375 -72 652 526 348 401
$$ packed form
6153E5m8n2L0J19p0q8j05J28J8LM4n4O9l9j03J30onj8P0P6n0j55J16j55O5o7P2
6181b0K7K8K1k01Q7J86j88J08k33K26O4o4J50j30r4J74j55L6J04j20o3j1Q0Q8
6205A00k9p9Km2J06j2j22J75Q4j58k0j9J86k27J9J32r2m0J50j4k10Q0J15k04Q
6230a11R2J3J43k62J25K8N1L8j91O5r6J04j40J74nj9n7p2J9J08lj44J09M4O9o3
6256A9NJ12p4j05J25k17J80k7l0Q9n7o1Q9j95J64n0n2J63P9m8k24R1J09k9j22
6281f6K6J18p6J33l3j65mJ89k63R1j56K60o0l6J12k03J33P8j7k55K70n1J65k01
6305a1k3R7O4P6q2k58K78o5k2k05J17K9K69k65j46J37p7L27J08m79r3L74m3K46
6329C53n20K23o9o9L34J31r12MO64J80r8k91k5N01k41m24O34m47P24j26j78N3
$$ plain form
6351 401 -233 -469 -573 -294 -164 -522 -14 -37 91 -245 664 -233 -259 -178 464 -932 218 184 179 -595 -424
6372 -424 760 573 -207 -293 503 675 -819 -675 -118 -94 777 -449 -266 -137 203 -99 278 366 90 -350
6392 -350 -158 868 -337 -584 -768 -717 -125 -317 -415 -426 18 -326 875 -280 -1097 -121 389 736 -431
6411 -431 427 535 -52 -481 266 206 -101 44 -94 -56 331 -32 -656 235 89 519 441 -318 583 113 390
6432 390 -662 404 156 -63 72 112 -120 95 467 34 77 -636 -166 -234 111 -456 29 -24 -241 45 -69
6453 -69 -97 -268 -473 -361 -6 463 -174 -732 2 438 -117 346 -1124 66 -420 -208 -239 284 192 -736 -11
6474 -11 -51 -77 72 -323 418 -14 -49 -225 -127 -178 -413 16 55 -14 -909 -685 -40 167 -115 -269 37 327 -320
6497 -320 111 310 44 363 30 -208 -61 -126 -326 -267 -582 -355 -161 438 944 20 -508 -69 734 -151 -390
$$ packed form
6351D01o34k36j04K79J30l58N08k3J28l36R09q97k6Q1O42j396J150l4np74J71
6372d24J184j87p80q6P96J72j494J44N57K4Q71j226J83J29L40l02L77Q8k76m40
6392c50J92J026j205k47j84N1N92j92r8j1M44l44J201j155q17R76N10L47j167
6411d31Q58J08n87m29P47o0l07J45j38L8L87l63o24Q91j46M30p8p59R01m70K77
6432C90j052J066k48k19J35M0k32K15L72m33M3p13M70o8L45n67M85n3k17K86j14
6453f9k8j71k05J12L55M69o37n58P34M36n55M63j470J190m86K12l1N23r2r28P25
6474a1m0k6J49l95P41m32l5j76R8n1k35M29L9o9q95K24O45K07k82j54L06K90o47
6497c20M31J99k66L19l33k38J47o5k00N9l15K27J94N99N06r24n28M39Q03q85k39
$$ plain form
6518 -390 -115 -193 130 146 105 113 71 375 -92 -459 254 -38 -102 -222 -362 -75 341 170 267 -363 57 -382 67
6541 67 261 -40 -178 -821 -565 65 -195 -549 25 -200 -556 -539 125 -816 -186 103 320 -36 -408 186 -89
6562 -89 82 -295 -595 444 -435 -32 -100 457 -64 -21 -385 -357 511 -7 -40 -151 -27 -136 146 41 469
6583 469 140 -350 132 -66 88 112 -70 -232 358 126 196 103 -194 212 -211 68 132 -96 20 144 -42
6604 -42 55 -74 93 144 -69 146 55 -18 -30 -8 -187 -61 -112 91 -97 -45 21 -183 185 -20 111 -78 -114 -35
6628 -35 166 -32 87 -40 -79 -79 47 -49 -32 148 -16 -96 -98 138 -21 -44 224 -97 -93 206 -95 -93 -93 177 263 -243
6654 -243 -16 -61 -92 40 -139 7 -39 -73 -145 241 94 -104 -156 84 44 213 -93 1 -46 17 14 -45 95 -73
6678 -73 -50 96 -115 22 -307 39 -94 -231 -73 -80 -96 -94 -149 -220 -13 -26 44 -9 21 117 -21 12 63 95 -107 45
$$ packed form
6518c90K75p8L23J6m1Qm2L04m67l67P13k92o4j20j40K87M16j71R7o30M20m39M49
6541F7J94l01j38o43K56O30k60l54N74k25l56J7O64r41O30K89K17l56l72N94k75
6562h9J71l77l00J039q79M03o8N57n21M3l64K8Q68n18l3j11J24j09K82j05M28
6583D69l29m90M82j98J54K4j82j62N90k32P0r3k97M06m23K79O4k28J16J24j86
6604d2R7j29J67N1k13K15r1p3j2K2j79J26n1K03j88N2O6k04L68k05J31j89l6P9
6628c5K01j98J19j27l9%J26r6J7J80j64q0kK36j59k3K68l21MK99l01K%K70Q6n06
6654b43K27m5l1J32j79J46m6l4p2L86j47j98n2K40m0J69l06R4m7O3ln9J40j68
6678g3K3J46k11J37l29L46j33j37J58pj6Kn5p1K07j3P0n3L0R6j38L3N1L2k02J52
$$ plain form
6704 45 278 89 12 -196 -65 -86 -306 -276 78 -110 52 -182 -11 9 -257 60 10 -81 -133 -63 -13 10 53 -112
6728 -112 143 264 424 180 -876 -462 -385 351 151 35 467 -667 -149 108 648 209 -996 -1039 -187 -78
6748 -78 -119 491 493 -273 -325 -339 41 234 -495 -213 -99 399 -289 -104 -55 65 -84 140 -62 148 -634 363
6770 363 -65 -316 -209 -486 336 77 -780 397 172 124 32 -315 288 -170 -172 141 183 -455 -25 279 466
6791 466 117 -54 448 15 -25 473 120 -56 365 57 18 -139 -13 57 76 218 -159 -163 376 59 223 -105
6813 -105 286 -1 245 -6 -200 434 -162 -202 -222 -89 -428 -285 -145 151 -7 -141 284 -388 287 135 -122
6834 -122 315 -104 91 -179 100 -63 155 -8 40 278 134 230 170 -234 -87 10 45 313 -289 54 -194 2
6856 2 130 125 -86 -319 4 -20 -206 -189 197 -519 -181 -23 177 37 -260 102 -175 310 158 -21 -98 146
$$ packed form
6704D5K33j89p7k08J31k1k20L0L54j88J62k34J71K0k66L17n0r1n2P0N0K3M3j65
6728a12K55J21J60k44j056M14P7P36k00j16M32j134N18K57N40m39j205m3Q52J09
6748g8m1O10Kp66n2j4L80J93p29K82J14M98o88J85M9J20j49K24k02K10p82R97
6770C63m28k51J07k77Q22k59q57J177k25m8r2l47O03m58kL13M2o38M30L04J87
6791D66l49j71N02m33m0M98l53j76M21l08l9j57J26P0J9J42l77mN39l17J64l28
6813a05L91k87K46k51j94O34n96m0k0J33l39J43J40K96j58j34M25o72O75j52k57
6834a22M37m19J95k70K79j63K18j63M8K38j44R6o0m04J47R7L5K68o02L43k48J96
6856BJ28nk11k33L23k4j86J7L86p16L38J58K00j40k97L62k77M85j52j79p7K44
$$ plain form
6878 146 47 -309 392 -382 21 154 16 54 49 -25 -277 20 3 68 4 -105 68 -364 339 366 -81 -48 10 -141
6902 -141 198 386 201 107 37 48 242 -252 71 321 -279 348 -29 191 46 83 64 60 227 172 -182 -164 -88
6925 -88 75 -136 10 157 121 -1127 -352 -128 -339 97 -8 -320 195 -159 103 54 -8 -104 -6 -21 -243 -108
6947 -108 -227 -100 44 317 -11 -203 625 380 418 390 -393 -178 19 501 66 209 293 -173 -254 -67 404
6968 404 145 -160 -11 -155 -158 -1 68 -19 -40 -139 -185 -162 45 -127 -55 -97 54 207 -60 -140 73 -192 47 -183
6992 -183 7 99 -62 137 -165 10 -183 174 60 112 114 -62 153 -178 16 -118 -7 -87 137 -60 352 -9
7014 -9 40 65 -209 45 11 86 -47 15 26 -101 107 132 -19 71 -19 40 -75 110 8 34 18 -70 103 169 78 76
7040 76 -46 -197 33 -125 -32 155 -47 -22 179 -51 6 3 -68 -127 -30 -53 -68 -18 90 80 28 122 102 -2 61 -40
$$ packed form
6878A46r9l56P01p74M03J33j38L8np4k52K97j7O5o4j09J73m32P03K7m47L3N8j51
6902a41L39J88j85r4p0J1J94m94L23K50o00O27l77K20j45L7j9mJ67n5l54J8P6
6925h8J63k11J46J47l6j248P75K24k11M36j05l12N15l54K62m9o2r6R8j5k22J35
6947a08j19J27J44K73l28j92Q28k45L8k8p83K15J97M82m35J43Q4m66q1J87M71
6968D04k59l05J49j44lJ57O9q7k1r9m6K3K07j72P2m2J51J53k67q0K13k65K39k30
6992a83J90R2j61J99l02J75j93L57j14N2Kj76K15l31J94j34J11q0K24j97M12l61
7014iM9K5k74K54l4P5j33O2J1j27K08K5j51R0r0N9j15J85j02K6j6q8J73O6r1k
7040G6j22j51K30j58R3J87k02K5K01k30N7lp1n9R7k3j5N0J08j0n2R4k0j04O3j01
$$ plain form
7066 -40 -2 -132 -5 -8 38 -26 -24 4 -15 -165 -36 15 -19 97 15 93 -124 15 -57 -12 50 -86 -280 -113 73 -122
7092 -122 -55 116 20 25 42 -109 -216 45 46 172 -25 53 142 -47 -43 -61 1 -21 112 -44 124 -16 -49 58 139
7117 139 -30 -205 -97 -26 98 -70 240 25 -10 291 -164 -74 -358 -270 100 225 79 255 91 -85 -16 -256
7139 -256 409 -32 -13 57 9 59 146 -74 -165 -176 -5 186 -267 -88 29 205 23 83 7 94 -43 46 154 -169
7163 -169 -252 3 46 -53 -116 -129 -49 -132 -25 -161 60 -115 81 75 -44 -20 178 -134 6 6 -50 -126 -14 10 -171
7188 -171 -15 -77 93 -16 -64 187 -1 -60 138 66 -119 140 16 -10 -133 27 9 30 87 38 -156 119 197
7211 197 -114 14 188 -24 23 200 -76 34 168 -98 125 -360 1 -215 -253 99 86 50 445 512 11 184
7233 184 -559 -337 -692 -380 -275 -247 786 335 -168 -249 86 -421 356 157 191 68 -15 29 182 -272 -90
$$ packed form
7066d0L8j30J27lM6o4KK8j9j50J29N1l4J16q2P8k17J39p2M5O2j36j94J67J86j95
7092a22O7J71r6NJ7j51j07K61JJ26j97P8Q9j89Mj8O2k2J33j56J68j40l3J07Q1
7117A39j69j75J08P1J24j68L10k15l5L01m55R0k84Q8L70J25j46J76j64j76O9k40
7139b56O65m41J9P0m8N0Q7k20r1j1J71J91m53J79J17J76j82O0p6Q7j37Q9J08l23
7163a69q3K55M3r9o3j3Q0q3J07j36K21j75J96oj19K4J98l12J40%n6p6J12K4j81
7188a71J56o2J70j09m8K51j88n9J98p2j85K59j24k6j23J60j8K1N7m9j94K75P8
7211A97l11J28J74k12M7J77k76J10J34k66K23m85L61k16l8L52j3l6L95O7n01J73
7233A84p43K22l55L12J05K8J033m51n03q1L35n07P77j99L4j23q3M4J53m54J82
$$ plain form
7254 -90 320 -20 117 69 -9 -266 95 -526 12 -70 -75 91 -110 23 212 -71 -76 -40 -58 -305 119 -22 -124
7277 -124 68 -196 -87 -51 17 22 46 -112 -5 12 113 94 67 -198 -40 -18 85 -96 -167 -36 -75 -26 -101 93
7301 93 -67 -34 56 -178 112 110 19 71 -45 -16 -84 219 -98 -120 -111 -81 -5 -65 -132 67 115 0 -12 -88 131 12
7327 12 74 -62 42 24 19 -46 91 -10 105 48 102 38 -66 -95 39 -56 7 -12 -87 -120 2 -60 84 -79 -7 77
7353 77 -27 -66 191 76 -209 164 -97 57 -107 -263 12 -153 -168 97 -117 -388 -180 8 -2 64 90 113
7375 113 -100 -40 -28 35 123 108 8 -92 87 -76 65 -60 -164 -103 -35 40 65 -68 165 48 31 -52 66 29
7399 29 165 -33 36 -145 -144 -47 213 -117 -92 -6 -127 40 25 -150 26 130 -8 105 66 -73 79 -25 38
7422 38 48 -36 -124 -74 141 -94 -110 15 -95 11 41 -49 -26 8 112 185 16 -32 -57 -36 115 112 -110 -153 207 -56
$$ packed form
7254i0M10l40J37m8p8k57L61o21N38q2nJ66k01J33J89k83nL6j8k47M24j41j02
7277a24J92k64J09L6O8NK4j58J07J7J01j9k7k65J58K2J03j81p1J31l9M9p5J94
7301I3j60L3R0k34K90kr1N2j16K9o8L03l17k2RL0P6o0o7J99M8j15j2p6K19j19
7327A2O2j36J04j8no5J37j01J15n7N4o4j04k9J34r5O3j9p5l3J22o2J44j63P2Q4
7353G7j04l9K57j15k85L73k61J54j64j56K75j65j5K65k14k71K08J88j0O6K6K3
7375A13k13O0J2O3Q8j5j00j00J79j63J41j25j04O1O8P5K5j33K33j17j7q3J18l7
7399B9J36j98O9j81JR7K60l30K5Q6j21J67j5j75J76J04j38J13l9j39J52j04O3
7422C8J0q4q8N0K15k35j6J25j10J06L0r0K3L4J04P3j69m8k5K1J51lk22m3L60k63
$$ plain form
7448 -56 37 47 11 41 -86 60 -12 102 -61 -16 172 -207 -3 10 154 -35 -65 19 131 77 181 -68 -246 -35
7472 -35 -26 -386 -156 201 -188 -52 281 170 11 -75 119 93 122 -116 -594 520 -190 18 -779 -128 282 -108
7494 -108 91 -812 -122 884 -319 -160 307 -259 -166 30 -481 -146 347 142 -357 -165 85 -167 203 275
7514 275 -232 -112 81 51 -516 -126 53 -155 85 48 314 163 -239 -42 140 -86 -95 -95 321 -12 110 125
7536 125 94 17 -2 101 -20 -106 155 225 -97 -241 -144 210 -27 -79 184 303 -128 -143 216 -158 -197 -134 418
7559 418 -196 214 -213 168 316 170 402 170 -11 -402 -214 -325 421 14 -192 18 551 -336 -268 -431
7579 -431 -347 143 -143 28 -326 -187 -336 -61 -108 -148 -52 -190 473 17 -202 496 145 -348 -671 176 225 335
7601 335 269 -296 194 -286 -1 -362 57 -150 -163 -198 15 -29 -64 -23 -450 -366 239 -295 417 -127 -109 -218 117
$$ packed form
7448e6R3J0l6L0j27J46p2J14j63M5J88l79K04J3J44j89l0Q4J12n4J04k49j78K11
7472c5Rl60K30L57l89J36L33j11j59q6J94k6K9k38m78J114p10K08p97O51M10l90
7494a08J99r03O90J006j203J59M67n66R3J96n11L35M93k05m99J92K50k52L70P2
7514B75n07J20J93l0n67L90J79k08K40l7K66j51m02J97J82k26r%M16l33J22J5
7536A25l1p7j9J03j21q6K61P0l22j44R7L54k37n2K63J19m31j5L59l74l9O3N52
7559D18o14M10m27L81J48j46K32k32j81l91J88j11P46m07k06K10N33q87O8j63
7579d31Q4M90k86J71l54J39j49K75m7m0R6j38O63m56k19O98l51m93l23Q47M9J10
7601C35o6n65M90m80K85l61M19k07j3l5K13m4l5M1m27Q4O05n34P12n44J8j09L35
$$ plain form
7624 117 -483 35 69 -196 143 -154 -104 98 216 -163 -189 28 283 -223 23 -38 -62 -104 -56 -99 8 -101 -102
7647 -102 -30 43 -91 1 -41 -6 0 -70 134 94 -78 26 24 17 23 43 -60 -92 -39 -1 98 21 -45 170 -47 49 112 -91
7675 -91 68 -45 -140 38 -100 22 20 -22 20 107 7 -65 -144 -7 140 -105 187 -33 76 -80 66 -14 67 -262
7699 -262 -194 -112 -18 158 -92 -1 85 82 -58 122 184 -105 59 17 -155 -59 -159 20 -58 137 -106 -34 72 185
7723 185 -31 9 75 62 156 -5 12 -190 19 -139 -25 -81 -214 96 245 -210 156 -167 -195 131 121 -86 -66
7746 -66 -137 149 153 -86 278 -116 9 258 -176 254 -74 2 -312 349 250 66 33 -42 262 77 77 -502 -555 -123
7770 -123 20 309 268 304 112 709 590 -60 -389 -236 -659 -123 -144 378 312 -165 217 -110 -545 -150 32
7791 32 -85 -545 127 158 -421 -327 188 169 -161 -165 513 383 -121 -329 -339 -625 136 427 -261 648 64 233
$$ packed form
7624A17o00N18L4k65L39k97N0K02J18l79k6K17K55n06K46o1k4m2M8m3J07j09j
7647a02P2P3j34R2m2L5Op0K04m0j72J04kpOK0j03l2N3L8R9p7o6K15k17R6O3k03
7675i1J59j13r5J78j38J22km2M2Q7j00p2p9J37J47k45K92k20J09j56J46q0Q1l29
7699b62O8Q2R4J76k50R1Q6lj40J80O2k89J64m2j72R6j00J79p8J95k43P2J06J13
7723A85k16M0O6j3R4j61J7k02K09j58J14n6j33L10J49m55L66l23k8L26j0k07K0
7746f6p1K86Mk39L64l94J25K49m34M30l28P6l14O61r9j84l3p5L04j85%n79n3M32
7770a23J43K89m1L6j92N97j19o50l29J53m23N36k1N22o6m77L82l27m35L95J82
7791C2j17m60O72L1n79R4N15j9l30mO78j30n04k08j0k86P61K91o88R09n84J69
$$ plain form
7813 233 -456 -122 -24 -112 -15 -301 -60 225 -232 292 99 85 87 146 507 473 -75 -123 -360 104 265 144 -218
7836 -218 -78 646 19 8 -78 85 -425 -39 -44 99 113 235 -365 -74 -89 -26 119 297 410 405 535 108 498
7859 498 139 387 -188 112 -145 246 -43 -330 -70 167 -133 31 27 310 252 -211 117 235 2 537 46
7880 46 41 458 325 344 -163 5 132 -98 -228 273 364 57 50 -47 -161 106 81 -175 126 -194 -253 -24 122
7903 122 20 -99 -142 -66 -54 446 -209 -163 -254 -172 -294 -26 -7 -39 216 -114 -104 310 -75 -7 -23 35 -49 250
7927 250 67 191 -177 71 387 -250 -87 -317 53 -140 -123 137 246 123 -480 100 97 191 -339 333 -209
7948 -209 -840 -178 98 -179 305 31 45 3 63 -18 185 -56 866 363 -120 -59 78 456 -410 77 469 -88
7970 -88 290 -56 -319 341 -339 842 0 186 -110 -28 -65 -428 210 -499 857 226 -258 78 -81 890
$$ packed form
7813B33o89L34R8q8R7k86K41K85m57N24j93j4KN9L61l4n48m8k37M64J61j21l62
7836b18J40P24o27j1q6J63n10L86nJ43J4J22o00K91j5O3J45J78J13nJ30m27L90
7859D98l59K48n75L00k57L91k89k87K60K37l00J64mK83n8m63L28J18k33N35m91
7880D6nM17j33J9n07J68J27k30j30N01R1l07pr7j14K67k5k56L01l20n9K29J46
7903A22j02j19m3P6J2N00o55M6r1Q2j22K68J9l2K55l30J0M14l85O8j6N8q4K99
7927B50j83J24l68K48L16o37J63k30L70j93J7K60J09j23o03N80lR4n30O72n42
7948b09o31O62K76k77M84k74J4m2O0q1K03k41R22n03m83O1J37L78q66M87L92n57
7970h8L78l46k63O60o80J181q42J86k96Q2l7l63O38p09J356o31m84L36j59R71
$$ plain form
7990 890 36 734 -33 -9 137 -4 298 104 -153 -88 534 46 168 278 478 -296 17 -230 218 58 -182
8011 -182 8 -591 164 492 782 555 473 238 23 198 -369 -62 81 -108 24 592 261 -90 429 145
8031 145 -69 -344 -346 641 210 -264 -66 334 -128 -478 318 326 547 -110 -508 -241 -74 -235 -355 -44 -303
8052 -303 -59 375 -41 -195 -128 322 -9 -5 749 -138 -309 465 196 -195 -207 13 517 377 -19 31 39 -190
8074 -190 21 440 257 181 209 276 164 329 493 489 585 539 325 -103 305 -36 600 -449 -123 1278 -408
8095 -408 513 323 -417 -1052 -733 -79 100 547 212 -513 427 -453 -1294 -210 796 -124 230 -158 35
8114 35 927 -760 181 121 -66 -464 -160 -374 525 -173 480 638 524 232 -298 901 709 1508 94 90
8134 90 1158 121 927 -88 450 -155 393 -69 590 -26 -173 -260 321 27 2 -12 326 -710 230 -572
$$ packed form
7990H90q54O98p67K4J46j41L02j94k57O5O22m88J22J10K00p74L13k47M48j60k40
8011a82J90n99P55L28K90k27q2k35k15J75n67L07J43j89J32N68l31l51N19k84
8031A45k14k75kR87m31m74J98M00m62l50P96QK21o57l98K67J67j61j20L11k59
8052c03K44M34m16j54O7M50l31MP54q87j71P74k69l91j2K20N04j40l96N0Qk29
8074a90K11M19j83p6K8O7j12J65J64mR6m6k14m28M08l41O36j049L26J401j686
8095d08R21j90p40o35L19O54J79M47l35p25R40q80q41J084J006r20L54l88J93
8114C5Q92j687R41o0j87l98L04k14Q99o98O53J58j14k92n30J199j92P99j414m
8134I0J068j037Q06j015N38o05N48m62O59o16j47q7N81k94k5j4L38j036R40q02
$$ plain form
8154 -572 501 74 635 250 -96 -634 314 -187 -576 415 371 132 -430 64 428 248 155 519 209 -712
8174 -712 281 -249 277 -145 -291 -1249 -99 1004 -38 412 378 618 -1000 288 571 229 252
$$ packed form
8154e72J073m27N61l85l46n38R48n01l89R91m4k39n62M94L64j80r3L64l10r21
8174g12R93n30N26m22j46r58J150J103j042M50l4K40j618J288K83l42K3
8191B52
$$ Imaginary data points
##PAGE= N=2
##DATA TABLE= (X++(I..I)), XYDATA
$$ plain form
0 0 0 0 0 0 0 0 0 0 0 0 0 0 0 3 -8 8 -8 8 -10 16 -16 19 -24 27 -33 40 -43 51 -59 68 -76 91 -100 116 -129 144
36 144 -165 183 -205 227 -253 282 -311 347 -383 422 -467 514 -567 625 -687 758 -836 922 -1019
55 -1019 1128 -1254 1398 -1564 1761 -1999 2292 -2660 3146 -3815 4801 -6401 9446 -17405 87599
70 87599 186021 71171 -24251 -113374 -128230 -114562 -63607 -8592 62938 114207 127609 73427
82 73427 -16274 -103033 -133019 -107297 -44308 15500 63492 94024 109380 91421 35653 -45275
94 -45275 -108808 -120909 -74794 -2230 60684 90407 90293 65811 21234 -41884 -104403 -133938 -103980
107 -103980 -23794 66108 118205 113140 66615 10352 -35895 -67609 -84448 -76462 -34406 34192
119 34192 97421 118049 83250 13019 -55166 -93863 -98288 -78139 -40679 11201 67994 106724
$$ packed form
0@%%%%%%%%%%%%%Lj1J6j6J6j8K6l2L5m3N1o0P3q3R4j10J27j44J67j91K16k45K73
36A44l09L48l88M32m80N35n93O58p30Q05q89R81j081J192j312J445j594J758j941
55a019K147k382K652k962L325l760M291m952N806o961Q616j1202J5847k6851J05004
70H7599R8422j14850r5422q9123j4856J3668N0955N5015P1530N1269J3402n4182
82G3427q9701q6759k9986K5722O2989N9808M7992L0532J5356j7959n5768q0928
94d5275o3533j2101M6115P2564O2914K9723j14k4482m4577o3118o2519k9535K9958
107a03980Q0186Q9902N2097n065m6525n6263m6247l1714j6839P986M2056O8598
119C4192O3229K0628l4799p0231o8185l8697m425K0149L7460N1880N6793L8730
$$ plain form
131 106724 101532 46993 -32322 -94219 -108792 -74686 -14550 44773 86797 102948 87924 39421
143 39421 -30661 -94037 -117972 -89219 -23853 41736 78068 77381 52237 16794 -21566 -57943
155 -57943 -81108 -74896 -33119 28815 80678 96155 71992 26711 -17362 -48294 -65237 -68005
167 -68005 -49989 -8957 43362 81131 80684 39505 -20010 -67383 -83987 -69575 -35954 5482
179 5482 47376 78923 86188 59896 6773 -48796 -78823 -72127 -36759 6368 41041 60934 64123
192 64123 47115 8333 -42811 -84119 -92184 -60015 -3416 49071 76498 73985 49914 14382
204 14382 -25521 -60791 -76355 -59025 -10093 48993 87091 84218 44648 -9096 -52358 -73603
216 -73603 -71443 -50487 -14853 27989 63216 73160 50431 5395 -38879 -61424 -56569 -31973 -149
$$ packed form
131A06724n192n4539p9315o1897j4573L4106O0136N9323M2024J6151j5024m8503
143C9421p0082o3376k3935K8753O5366O5589L6332o87k5144l5443l8360l6377
155e7943k3165O212M1777O1934N1863J5477k4163m5281m4073l0932j6943k768
167f8005J8016M1032N2319L7769m47m1179n9515m7373j6604J4412L3621M1436
179E482M1894L1547P265k6292n3123n5569l0027O696L5368M3127L4673J9893L189
192F4123j7008l8782n1144m1308q065L2169N6599N2487K7427k513k4071l5532
204A4382l9903l5270j5564J7330M8932N9086L8098k873l9570n3744m3262k1245
216g3603K160K0956L5634M2842L5227R944k2729m5036m4274k2545M855K4596L1824
$$ plain form
229 -149 30737 54805 65063 53869 19314 -25417 -60836 -69651 -50962 -16681 16637 40103 50314
242 50314 45513 24013 -11009 -47809 -67588 -56846 -19373 26821 59708 67660 53138 24786
254 24786 -7099 -37492 -57861 -59068 -36654 3330 43599 63922 54504 21764 -18574 -50129
266 -50129 -63595 -56211 -30050 8079 46237 69951 67088 37474 -5498 -42879 -59591 -51816 -25061
279 -25061 9017 39762 56444 52662 26275 -13919 -50342 -67216 -57791 -27348 9952 39723
291 39723 53426 49311 30401 1620 -27313 -46691 -46917 -26341 6336 37196 52668 47307 25023
304 25023 -5049 -32102 -48620 -50786 -37138 -11220 18879 42047 48729 36314 9328 -20675
316 -20675 -41518 -45439 -31325 -4529 25585 47807 53798 40882 12965 -20083 -46180 -55416 -44947
$$ packed form
229a49L0886K4068J0258j1194l4555m4731l5419q815J8689L4281L3318K3466J0211
242E0314m801k1500l5022l6800j9779J0742L7473M6194L2887P952j4522k8352
254B4786l1885l0393k0369j207K2414L9984M0269K0323r418l2740m0338l1555
266e0129j3466P384K6161L8129L8158K3714k863k9614m2972l7381j6712P775K6755
279b5061L4078L0745J6682l782k6387m0194l6423j6874R425L0443L7300K9771
291C9723J3703m115j8910k8781k8933j9378k26K0576L2677L0860J5472n361k2284
304B5023l0072k7053j6518k166J3648K5918L0099K3168O682j2415k6986l0003
316b0675k0843l921J4114K6796L0114K2222N991j2916k7917l3048k6097r236J0469
$$ plain form
329 -44947 -18685 13342 39181 49206 39137 12607 -20012 -45577 -53518 -39245 -9079 25508
341 25508 50564 56995 43365 15582 -16150 -40883 -50347 -41319 -16602 14291 39274 47245 34972
354 34972 6993 -24133 -45510 -49178 -35041 -9224 18046 39165 46756 39428 19171 -7487 -30375
367 -30375 -40756 -34314 -13543 11827 31818 38473 30230 11143 -12135 -32054 -42323 -38982 -22273
380 -22273 2256 26242 40097 39371 24688 2047 -20412 -34194 -34838 -21379 2186 26577 41939
393 41939 41194 23294 -3679 -28892 -43637 -43281 -29268 -6575 18359 37210 42324 29879 3985
406 3985 -24186 -41582 -39553 -20226 6378 30045 41689 39364 25926 3630 -21371 -40824 -44753
419 -44753 -31296 -5294 21594 36899 34601 18531 -2999 -22626 -34004 -34159 -21643 -9 23684
$$ packed form
329d4947K6262L2027K5839J0025j0069k6530l2619k5565p941J4273L0166L4587
341B5508K5056O431j3630k7783l1732k4733r464R028K4717L0893K4983P971j2273
354C4972k7979l1126k1377l668J4137K5817K7270K1119P591p328k0257k6658k2888
367c0375j0381O442K0771K5370J9991O655q243j9087k3278j9919j0269L341J6709
380b2273K4529K3986J3855p26j4683k2641k2459j3782o44J3459K3565K4391J5362
393D1939p45j7900k6973k5213j4745L56J4013K2693K4934J8851N114j2445k5894
406C985k8171j7396K029J9327K6604K3667J1644k325j3438k2296k5001j9453l929
419d4753J3457K6002K6888J5305k298j6070k1530j9627j1378j55J2516K1634K3693
$$ plain form
432 23684 39938 39831 24485 2669 -17098 -28175 -29839 -22836 -8479 9230 25010 31153 22761
445 22761 2207 -19089 -31559 -30869 -20474 -5911 8549 22761 32192 33495 21123 -2089 -24432
458 -24432 -34122 -27797 -8719 11807 24343 28206 23176 11480 -6263 -26070 -38531 -36725 -18257
471 -18257 7040 29016 36594 28998 12995 -4759 -19624 -28326 -27259 -14212 7277 29380 37321
484 37321 29266 9767 -13267 -27245 -32578 -27578 -17045 -1165 17818 31872 31752 16589 -7631
497 -7631 -27071 -31247 -20677 -3505 11093 21038 25728 25474 16844 825 -18772 -32130 -30360 -15903
511 -15903 3332 16507 20333 16773 9412 746 -10767 -21070 -25494 -17727 -932 17027 28915
524 28915 28159 18771 5508 -7321 -19200 -26215 -24308 -11714 8527 25976 30060 18496 -967
$$ packed form
432B3684J6254j07j5346k1816j9767j1077j664P003J4357J7709J5780O143q392
445B2761k0554k1296j2470O90J0395J4563J4460J4212R431J303j2372k3212k2343
458b4432r690O325J9078K0526J2536L863n030j1696j7743j9807j2461J806J8468
471a8257K5297K1976P578p596j6003j7754j4865q702J067J3047K1489K2103P941
484C7321q055j9499k3034j3978n333N000J0533J5880J8983J4054j20j5163k4220
497g631j9440m176J0570J7172J4598R945M690k54q630j6019j9597j3358J770J4457
511a5903J9235J3175L826l560p361q666j1513j0303m424P767J6795J7959J1888
524B8915p56r388j3263j2829j1879p015J907J2594K0241J7449M084j1564j9463
$$ plain form
537 -967 -18847 -26901 -25692 -18110 -6274 9203 24838 33416 28681 10173 -12762 -27864 -27942 -15140
551 -15140 1184 13466 19826 20538 16153 5506 -10112 -25516 -31957 -24410 -6596 12302 23760
564 23760 24735 17705 6855 -5011 -15788 -21762 -18995 -6052 11582 24672 26012 16113 1614
577 1614 -10975 -18693 -21105 -19614 -12371 294 14679 23169 20268 7050 -7779 -16612 -16543 -11046
591 -11046 -4015 2627 10564 19251 23082 17658 2275 -15502 -26247 -24711 -13276 683 11418
604 11418 17112 17697 12805 1884 -12595 -23982 -25032 -13961 4307 20089 26425 22807 12845 613
618 613 -11114 -20024 -22666 -15657 -938 14539 22428 18473 6462 -6517 -15062 -18050 -17130 -12395
632 -12395 -3258 9911 21730 25244 17257 1265 -13039 -19215 -15823 -7009 1777 8969 13662 15482
$$ packed form
537i67j7880q054J209P582J1836J5477J5635Q578m735j8508k2935j5102p8J2802
551a5140J6324J2282O360P12m385j0647j5618j5404o441P547J7814J8898J1458
564B3760R75p030j0850j1866j0777n974K767J2943J7634J3090J340r899j4499
577A614j2589p718k412J491P243J2665J4385Q490k901j3218j4829q833O9N497
591a1046P031O642P937Q687L831n424j5383j7777j0745J536J1435J3959J0735
604A1418N694N85m892j0921j4479j1387j050J1071J8268J5782O336l618r962j2232
618F13j1727q910k642P009J4719J5477P889l955j2011j2979q545k988R20M735
632a2395R137J3169J1819L514p987j5992j4304o176L392Q814Q786P192M693J820
$$ plain form
646 15482 12052 1759 -11441 -21409 -21839 -13014 -478 9657 14456 14311 11139 5376 -2659 -10757
660 -10757 -15042 -12118 -3032 7470 14634 15645 11883 5365 -2887 -11808 -19199 -20545 -13073 1190
674 1190 15107 20947 16744 5696 -6055 -13414 -15511 -12964 -6232 4117 15378 22621 20624 8865
688 8865 -6965 -18799 -21676 -15238 -4444 5109 11513 13648 11550 5290 -3956 -13163 -17225 -13971
702 -13971 -4269 6474 14438 16800 14221 7696 -617 -9157 -14954 -14835 -8272 1968 10699 13767 10195
717 10195 3310 -3781 -9578 -12766 -13156 -9390 -973 9056 16312 16286 9543 -344 -7993 -10888 -9577
732 -9577 -5834 -1258 4236 9704 13017 10810 2801 -7999 -16039 -17551 -12022 -2651 6641 12845 14592
747 14592 11849 4830 -4557 -12380 -14810 -10409 -1001 8864 15042 15192 9909 1432 -7749 -14774 -16878
$$ packed form
646A5482l430j0293j3200r968m30Q825J2536J0135M799j45l172n763q035q098
660a0757m285K924R086J0502P164J011l762o518q252q921p391j346P472J4263
674A190J3917N840m203j1048j1751p359k097K547O732J0349J1261P243j997j1759
688H865j5830j1834k877O438J0794R553O404K135k098o260r246r207m062L254
702a3971R702J0743P964K362k579o525q313q540n797J19O563J0240Q731L068l572
717A0195o885p091n797l188l90L766Q417J0029P256k6o743r887p649k895J311
732i577L743M576N494N468L313k207q009j0800q040j512N529R371R292O204J747
747A4592k743p019r387p823k430M401R408R865O178J50n283q477r181p025k104
$$ plain form
762 -16878 -12746 -3465 7111 13555 13511 7724 -91 -6495 -9879 -10150 -7470 -1877 5742 12275 15056
777 15056 11669 2851 -6573 -12508 -12907 -8694 -2578 3097 7229 9122 7712 3512 -3173 -9139 -11736
792 -11736 -9315 -3003 4257 9945 12380 10532 5685 -1065 -7125 -10553 -9920 -5402 643 6124 9181
807 9181 8727 5281 -887 -7365 -11882 -12488 -7808 649 8785 13717 12926 7176 -394 -6685 -10481 -9890
823 -9890 -5972 233 6725 11191 11687 6325 -1583 -9745 -14086 -12812 -6349 1715 8180 11313 9807
838 9807 5533 -510 -5692 -9056 -8574 -4632 1247 7054 10616 10209 5561 -1110 -6842 -10196 -9804 -6101
854 -6101 -774 4502 7210 7680 4976 954 -3553 -6677 -7146 -5719 -1533 3952 8949 10656 8052 2270
870 2270 -3982 -8092 -8914 -6789 -3053 1332 4902 6978 7144 4422 -2225 -7278 -10208 -9195 -2620 3424
$$ packed form
762a6878M132R281J0576O444m4n787p815o404l384k71K680N593P619O533K781
777A5056l387q818r424n935l99M213O116N675M132J893j410m200o685n966k597
792a1736K421O312P260N688K435j848m847o750o060l428O33M518O045N481L057
807I181m54l446o168o478m517o06M680Q457Q136M932p91n750p570o291l796N91
823i890L918O205O492M466M96n362p908q162m341J274O463Q064O465L133j506
838I807m274o043n182l364M82L942N879N807L562m07m648o671n732l354L92L703
854f101N327N276K708M70k704m022m507l124m69J427M186N485M997J707k604n782
870B270o252m110q22K125L736M385L570K076J66k722o647n053k930J013O575O044
$$ plain form
886 3424 8358 10601 8527 3392 -2306 -6478 -9312 -8282 -3599 2058 7399 9116 7285 2238 -3673
901 -3673 -8255 -10288 -8378 -3282 3399 8653 10212 7660 2466 -2589 -6012 -6800 -5377 -2546 1448
916 1448 5529 8010 7221 3022 -2976 -7680 -9044 -6637 -2411 1583 4312 5798 5682 4199 1299 -3092
932 -3092 -6052 -6349 -4115 793 5004 7244 6918 4328 -187 -4341 -7297 -7859 -5451 -979 3295 6235
948 6235 6777 5051 1475 -2686 -6051 -7533 -5807 -1007 4626 8711 8926 5596 388 -4636 -7050 -7194
964 -7194 -5109 -1751 2298 5766 7294 5531 904 -4525 -7979 -8145 -4512 626 5084 7227 7178 4783
980 4783 970 -2465 -5568 -6261 -4592 -989 2647 5083 5667 3863 744 -2945 -5690 -6405 -4628 -1478
996 -1478 2685 5173 6044 4484 1850 -723 -3190 -4586 -4793 -2730 549 4314 6585 5657 2099 -2251
$$ packed form
886C424M934K243k074n135n698m172k834J030M683N657N341J717j831n047n911
901c673m582k033J910N096O681N254J559k552n194n055l423p88J423K831L994
916A448M081K481p89m199n998m704j364K407M226L994K729J486j16j483k900m391
932c092k960k97K234M908M211K240l26k590m515m154k956n62K408M472M274K940
948F235N42j726l576m161l365j482J726M800N633M085K15l330n208n024k414j44
964g194K085L358M049L468J528j763m627n429l454j66L633N138M458K143m9k395
980D783l813l435l103o93J669L603L636K436N84j804l119l689k745p15J777L150
996a478M163K488Q71j560k634k573k467j396k07K063L279L765K271r28l558m350
$$ plain form
1012 -2251 -5500 -6152 -4832 -2316 427 2997 5034 5577 3997 603 -3491 -6168 -5634 -2823 1304 4599
1028 4599 6289 5575 3270 -424 -4047 -6594 -6456 -3940 89 3745 5876 5482 3390 -19 -3678 -6302
1044 -6302 -6112 -3362 1534 5723 7236 5514 1624 -1981 -4060 -4242 -4016 -2395 -480 2111 4662 4800
1060 4800 2769 -633 -3665 -4749 -3822 -1555 459 2171 3368 4235 3712 1863 -1046 -3779 -4492 -3847
1076 -3847 -1506 1485 3672 4586 3978 1347 -2304 -4933 -5748 -4008 -782 2335 4148 4466 3740 1954
1092 1954 -467 -3115 -4942 -4487 -1971 1906 4716 5508 3541 413 -2113 -4115 -4485 -3839 -2028 500
1108 500 3378 5127 4718 2147 -1216 -4146 -4977 -3633 -861 2347 4361 4761 3262 825 -1982 -3951
1124 -3951 -4210 -2906 -1231 1159 2462 3391 2718 1239 -672 -3245 -3895 -2806 -1486 1457 2311 3422
$$ packed form
1012b251l249o52J320K516K743K570K037N43j580l394m094k677N34K811M127L295
1028D599J690p14k305l694l623k547J38K516M029L656K131l94k092l409l659k624
1044f302J90K750M896M189J513j722l890l605k079j82K26J621J915K591K551J38
1060D800k031l402l032j084R27K267K014J712J197Q67n23j849k909k733p13O45
1076c847K341K991K187R14o08k631l651k629q15J740L226L117J813L18p26j786
1092A954k421k648j827M55K516L877K810P92j967l128k526k002l70O46J811K528
1108E00K878J749m09k571l363k930q31J344K772L208K014M00j499k437k807j969
1124c951k59J304J675K390J303R29o73j479j911k573o50J089J320K943Q54J111
$$ plain form
1140 3422 3175 1882 305 -1163 -3140 -3827 -3518 -1171 2061 3729 4697 2687 -756 -3248 -4462 -3649
1156 -3649 -1838 428 2779 3842 3832 2467 271 -2094 -3689 -3717 -2743 -241 2098 3422 3575 2055
1172 2055 -233 -2148 -3100 -2930 -2172 -344 804 2620 3884 3165 1707 -1064 -3566 -4206 -3103 -691
1188 -691 2725 4121 3749 2098 -171 -2416 -3251 -2807 -2074 -1214 835 3340 2677 1522 952 -1800 -2822
1205 -2822 -2196 -915 -174 523 1901 2447 1971 1065 -555 -1292 -2809 -2793 -2309 -582 1616 4004 3852 2009
1223 2009 -753 -2832 -3677 -2703 -351 933 2180 2496 2629 1666 -153 -2146 -3653 -3159 -1653 990
1239 990 2551 2915 2107 776 -627 -1580 -2407 -2367 -1648 63 1907 2837 2776 1890 87 -1439 -2753 -3198
1257 -3198 -2217 -110 2394 3828 3101 932 -1191 -2465 -2577 -1912 -1011 -335 1129 2580 2617 1719 -196
$$ packed form
1140C422k47j293j577j468j977o87L09K347L232J668R68k010l443k492j214Q13
1156c649J811K266K351J063j0j365k196k365j595k8R74K502K339J324J53j520
1172B055k288j915r52J70P58J828J148J816J264p19j458k771k502o40J103K412
1188f91L416J396l72j651k269k245q35M44P33Q60K049K505o63j155n70k752j022
1205b822O26J281P41O97J378N46m76r06j620p37j517J6M84J727K198K388j52j843
1223B009k762k079q45R74K352J284J247L16J33r63j819j993j507M94J506K643
1239I90J561L64q08j331j403r53q27M0P19J711J844R30o1q86j803j526j314m45
1257c198R81K107K504J434p27k169k123j274j12O65R01O76J464J451L7q98j915
$$ plain form
1274 -196 -2168 -2761 -2093 -561 771 1185 1031 1415 1636 1158 -323 -2117 -2279 -1873 -542 1050 1912 2646
1292 2646 2518 946 -1145 -2423 -3066 -2304 -263 1566 2417 2465 1310 211 -1190 -1736 -2176 -1959 -806
1309 -806 1067 2743 2947 1628 -405 -1252 -1987 -2203 -994 -859 127 1246 2002 2165 1190 -61 -1965
1326 -1965 -2846 -2153 -1109 728 2109 2470 1874 803 -719 -1964 -2061 -1588 -834 532 1464 1865 1963 1250
1344 1250 -87 -1493 -2421 -1907 -662 867 1584 1595 1460 993 -390 -1242 -1445 -1722 -1530 -780 708 1889
1362 1889 1926 1505 -238 -1401 -1631 -1668 -1079 340 1357 1583 1649 1081 -99 -1076 -2171 -2051 -1467 -474 1101
1381 1101 2346 1575 787 233 -935 -1330 -1803 -590 -4 977 1382 1546 1177 -118 56 -1208 -2439 -1884
1399 -1884 -465 1217 1931 1685 1023 -311 -859 -1362 -1158 -1145 -536 86 1132 1979 1543 614 -1029 -1898
$$ packed form
1274a96j972n93O68J532J332M14j54L84K21m78j481j794j62M06J331J592Q62P34
1292B646j28j572k091j278o43P62K041J829Q51M8j155j099j401n46m40K17J153
1309h06J873J676K04j319k033q47p35k16J209J35R86J119P56J63r75j251j904
1326a965q81O93J044J837J381L61n96j071j522j245r7M73P54J366R32M01R8p13
1344A250j337j406r28N14J245J529P17J1j35m67j383q52k03k77J92P50J488J181
1362A889L7m21j743j163k30l7N89J419J017K26O6n68j180r77j095J20N84R93J575
1381A101J245p71p88n54j168l95m73J213N86R81M05J64l69j295J74j264j231N55
1399a884J419J682P14k46o62j334n48n03K04J3O09O22J046Q47m36r29j643q69
$$ plain form
1417 -1898 -1844 -1310 -4 813 1393 1687 1345 402 -478 -1292 -1505 -1076 -477 317 1036 1527 1482 735 -626 -1536
1437 -1536 -1849 -1238 -1 865 1091 941 752 452 207 -556 -1413 -1517 -914 236 1333 1734 1250 332 -569
1456 -569 -960 -1109 -969 -814 -107 723 1343 1373 902 114 -744 -1128 -1396 -1068 -206 1042 1650 1527 784 -344
1476 -344 -1245 -1360 -792 -1083 -222 437 754 1537 1324 3 -1081 -1836 -1297 -571 356 1145 1680 1601 604 2
1496 2 -456 -755 -1306 -900 -71 501 1426 1398 879 450 -371 -1513 -857 -721 57 672 886 1207 339 242 44
1517 44 -366 -799 -1220 -928 -329 695 876 941 -332 -266 -1084 -285 -295 -273 -138 341 847 1422 816 427 -291
1538 -291 -1577 -1145 -950 482 787 1590 487 477 -576 -675 -844 -869 -492 282 334 1516 1077 696 -420
1557 -420 -820 -1470 -1168 -286 547 1359 1095 487 272 -698 -1003 -826 -546 -438 -316 203 555 1261 404 354
$$ packed form
1417a898N4N34J306Q17N80K94l42r43q80q14k13M29N99P94P19M91m5p47j361r10
1437a536l13O11J237Q66K26j50j89l00k45p63q57j04O03J150J097M01m84r18r01
1456e69l91j49J40J55P07Q30O20L0m71p88q58l84k68L28Q62J248O08j23p43j128
1476c44r01j15N68k91Q61O59L17P83k13j321j084p55N39P26R27P89N35p9r97o02
1496Bm58k99n51M06Q29N72R25k8n19m29q21j142O56J36P78O15K14L21q68r7j98
1517D4m10m33m21K92N99J024J81O5j273O6q18P99j0K2J35M79N06N75o06l89p18
1538b91j286M32J95J432L05Q03j103j0j053r9j69k5L77P74N2J182m39l81j116
1557d20m00o50L02Q82Q33Q12k64o08k15r70l05J77K80J08J22N19L52P06q57n0
$$ plain form
1577 354 -1059 -1267 -722 85 539 306 411 79 781 484 -654 -1023 -698 -891 65 470 934 713 83
1596 83 561 -389 -172 -573 -677 -520 1025 264 433 42 603 398 -220 -1228 -1448 -1132 323 1122 1123 1041
1616 1041 -478 -280 -1361 -499 -962 -568 -134 1033 924 928 -89 -546 -1754 -969 -680 319 1030 629 299
1635 299 288 -158 -685 -775 -722 -460 -62 308 406 593 709 515 342 -577 -501 -1067 34 559 697 371 306 70
1657 70 23 179 -563 -1017 -1097 -627 774 981 629 -65 -480 -838 -331 -33 -141 -470 374 808 465 661 275
1678 275 -291 -589 -489 -661 -481 -135 526 1185 408 -285 -892 -961 -819 -241 127 805 867 790 747 289 -526
1699 -526 -1385 -1205 -653 492 1065 977 330 -415 -688 -503 -253 -304 -91 -92 99 646 683 274 -202 -472 -340
1720 -340 -95 176 124 71 45 321 318 119 -88 -77 -498 -468 -401 -234 293 628 716 468 -73 -427 -591 -448 -14
$$ packed form
1577C54j413k08N45Q07M54k33J05l32P02k97j138l69L25j93R56M05M64k21o30
1596H3M78r50K17m01j04J57J545p61J69l91N61k05o18j008k20L16J455P99Jq2
1616A041j519J98j081Q62m63L94M34J167j09Mj017m57j208P85K89R99P11m01l30
1635B99j1m46n27r0N3K62L98L70R8J87J16j94j73r19P6n66J101N25J38l26o5k36
1657G0m7J56p42m54q0M70J401K07l52o94m15l58N07K98j08l29Q44M34l43J96l86
1678B75n66k98J00j72J80L46O61O59p77o93o07o9J42N78L68O78O2p7m3m58q15
1699e26q59J80N52J145N73q8o47p45k73J85K50n1K13jJ91N47L7m09m76k70J32
1720c40K45K71n2n3k6K76lj99k07J1m21L0O7J67N27L35Q8k48n41l54j64J43M34
$$ plain form
1743 -14 70 134 150 335 280 137 -78 -691 -1165 -719 -64 765 999 649 199 -289 -601 -508 -397 -312 147 737
1765 737 915 889 307 -537 -959 -850 -302 68 566 578 405 323 -256 -586 -742 -259 70 277 372 42 3 162
1787 162 230 333 -22 -506 -343 -7 142 85 -39 -136 19 356 452 27 -326 -891 -652 119 411 666 451
1808 451 102 -351 -370 -427 -361 -279 -83 500 688 444 97 -313 -258 -584 -579 -296 179 507 749 567 -29 -462
1830 -462 -794 -443 -31 84 283 238 448 337 245 -141 -759 -803 -479 231 744 677 200 -427 -512 -357 11 44
1852 44 69 386 123 284 161 130 97 130 -357 -133 -282 -141 -312 -241 -112 -46 121 413 -24 -40 -322 -242 -280
1875 -280 0 205 780 563 315 -323 -877 -421 -178 -209 136 223 451 372 369 -189 -516 -271 -549 -107 632 1033
1897 1033 480 -22 -499 -765 -714 -183 235 311 331 450 337 175 -312 -747 -578 -622 -117 163 513 447 307
$$ packed form
1743a4Q4O4J6J85n5j43k15o13m74M46O55Q29K34l50m50m88l12R3J11Q5M59N90
1765G37J78k6n82q44m22J09N48L70M98J2j73q2n79l30j56M83L29K07R5l30l9J59
1787A62O8J03l55m84J63L36J49n7j24r7J55L37R6m25l53n65K39P71K92K55k15
1808D51l49m53j9n7O6Q2J96N83J88k44l47m10N5l26NK83M75L28K42j82n96m33
1830d62l32L51M12J15J99m5K10j11r2l86o18m4L24P10N13o7m77o27q5J55L68L3
1852D4K5L17k63J61j23l1l3L3m87K24j49J41j71P1J29O6J67K92m37j6k82Q0l8
1875b80K80K05N75k17k48o38n54M56K43l1L45Q7K28p9ln58l27K45k78M42P39M01
1897A033n53n02m77k66N1N31M18P6K0J19j13j62m87m35J69m4N05K80L50o6j40
$$ plain form
1918 307 143 -545 -747 43 541 30 895 -164 -126 80 45 -124 103 382 -545 -118 -218 320 41 -89
1938 -89 248 454 -43 105 83 -393 -385 -451 274 197 721 424 469 -316 -530 -131 -351 167 -156 21 213 199 280
1961 280 -234 11 -569 -282 340 512 744 540 40 -575 -486 -507 -291 245 288 -61 100 -26 -334 -164 -676
1982 -676 -234 -328 128 421 45 239 52 -2 -81 186 462 359 169 -29 4 20 -124 -82 351 -46 81 73 6
2005 6 381 -174 -99 -194 103 377 208 84 -40 -667 -700 -412 248 609 141 235 -334 -626 -299 -168 -162 41 353
2028 353 253 312 133 -75 -405 -621 -3 318 247 542 353 79 -178 -481 -218 -422 230 397 28 -9 83
2049 83 -288 -207 -176 -80 -52 69 264 530 2 250 288 11 120 -288 180 167 -63 402 -136 -12 -365 -73
2071 -73 305 18 -422 -218 -6 124 258 427 302 -82 150 -313 45 -333 -206 -347 -279 325 846 268 -221
$$ packed form
1918C07j64o88k02P90M98n11Q65j059L8K06l5j69K27K79r27M27j00N38k79j30
1938h9L37K06m97J48k2m76Qo6P25p7N24k97M5p85k14L99k20N18l23J77J92j4Q1
1961B80n14K45n80K87O22J72K32k04n00o15Q9k1K16N36M3l49J61j26l08J70n12
1982f76M42r4M56K93l76J94j87n4p9K67K76j03j90j98L3J6j44M2M33l97J27qo7
2005FL75n55P5r5K97K74j69j24j24o27l3K88O60L61m68R4n69k92L27J31OK03L12
2028C53j00N9j79k08l30k16O18L21p1K95j89k74k57l03K63k04O52J67l69l7R2
2049H3l71Q1L1R6K8J21J95K66n28K48L8k77J09m08M68j3k30M65n38J24l53K92
2071g3L78k87m40K04K12J30J34J69j25l84K32m63L58l78J27j41O8O04N21n78m89
$$ plain form
2092 -221 -274 -583 -136 326 62 -18 15 78 2 -110 -191 -392 -237 268 665 643 434 285 -520 84 -777 -255
2114 -255 225 -105 173 85 -41 -71 43 12 218 -25 -292 294 497 2 670 529 -142 -524 -21 149 246
2135 246 119 271 -411 -66 -460 218 106 443 261 -640 -294 -413 -101 -236 -102 3 415 320 554 273
2155 273 -457 -160 -101 419 316 589 383 374 -690 -642 -439 -319 39 569 560 -9 49 -92 -164 -45 -58 -4 46
2178 46 16 201 -2 -385 -643 -195 -324 811 336 -154 -292 -83 -185 -443 495 241 111 332 682 88
2198 88 319 27 19 -477 -686 153 33 -611 83 487 -378 98 -21 -76 -123 -107 -215 -145 -263 461 -297 -231 370
2221 370 358 74 760 -481 70 -70 -840 -242 38 929 603 89 -51 -381 -487 68 370 -234 817 90
2241 90 -324 -16 -144 -197 -121 271 -126 160 -20 281 83 -432 -419 62 172 282 245 27 -155 -289 175 238
$$ packed form
2092b21n3l09M47M62k64q0L3O3p6j12q1k01J55N05L97k2k09j49q05O04q61N22
2114b55M80l30K78q8j26l0J14l1K06k43k67N86K03m95O68j41o71l82N03J70R7
2135B46j27J52o82L45l94O78j12L37j82r01L46j19L12j35J34J05M12r5K34k81
2155B73p30K97N9N20j03K73k06rj064M8K03J20L58N30rn69N8j41p2J19j3N4N0
2178D6l0J85k03l83k58M48j29J135m75m90j38K09j02k58R38k54j30K21L50n94
2198H8K31k92qm96k09Q39j20o44O94M04q65M76j19n5m7J6j08P0j18P24p58O6O01
2221C70j2k84O86j241N51j40p70N98K80Q91l26n14j40l30j06N55L02o04J051p27
2241I0m14L08j28n3P6L92l97K86j80L01j98n15J3M81J10J10l7k18j82j34M64O3
$$ plain form
2263 238 639 18 -277 -351 -28 86 214 503 180 264 -60 -424 387 298 227 279 -269 -37 329 -290 412 484
2285 484 -508 -36 348 548 -397 111 -240 -492 5 100 -150 -420 461 -469 526 -216 286 162 -563 -126
2305 -126 -314 -528 -260 423 377 -414 90 -194 403 -37 -284 197 -84 398 300 609 183 -328 -291 -925 -1306
2326 -1306 130 873 165 471 109 217 -334 -12 295 141 257 -169 236 -140 -29 -284 -701 295 -555
2345 -555 216 210 193 -2 74 -254 -357 36 32 94 -241 -174 -138 -148 95 424 255 290 -221 661 -213 -324 42 -29
2369 -29 -392 -60 -72 620 70 -255 -54 95 126 58 326 1 312 -277 -482 -507 -82 -17 -146 227 239 -17
2391 -17 222 181 239 41 -278 153 356 344 42 295 19 -602 -434 38 -73 211 -221 -66 411 -38 -16 -296
2413 -296 -223 -170 -7 220 100 207 -63 -365 -102 46 -169 144 73 81 -273 -101 183 -6 414 8 176 -200
$$ packed form
2263B38M01o21k95p4L23J14J28K89l23Q4l24l64Q11q9p1N2n48K32L66o19P02P2
2285D84r92M72L84K00r45N08l51k52M97R5k50k70Q81r30R95p42N02j24p25M37
2305a26j88k14K68O83m6p91N04k84N97m40k47M81k81M82r8L09m26n11L7o34l81
2326a306J436P43p08L06l62J08n51L22L07j54J16m26M05l76J11k55m17R96q50
2345e55P71oj7j95P6l28j03L93mO2l35O7L6j0K43L29j69L5n11Q82q74j11L66p1
2369b9l63L32j2O92n50l25K01J49L1o8K68l25L11n89k05k5M25O5j29L73J2k56
2391a7K39m1N8j98l19M31K03j2l02K53k76o21J68M72j11K84m32J55M77m49K2k80
2413b96P3N3J63K27j20J07k70l02K63J48k15L13p1Ql54J72K84j89M20m06J68l76
$$ plain form
2435 -200 11 46 -292 -145 -492 -212 423 218 293 33 167 -284 -665 33 201 243 53 79 -172 -483 149
2456 149 -76 208 -183 331 300 -31 -171 170 -249 -23 84 326 257 333 189 -361 -325 -471 467 -196 263
2477 263 -70 234 145 -359 -17 49 67 -53 41 162 293 -73 -72 -67 -43 232 207 141 163 271 -109 -541 -106 81
2501 81 -10 -73 56 39 239 35 -66 34 24 -203 202 219 285 143 -56 -183 -374 -235 70 87 201 341 -27
2524 -27 -71 -193 -13 22 128 182 40 -9 30 113 58 -223 -139 -13 26 155 174 -135 -284 -256 -195 43 139 -7 -220
2549 -220 -92 20 9 -82 -74 -95 77 -7 41 62 51 -101 -250 -174 -17 33 298 196 -179 -53 -218 -66 44 258
2573 258 96 -96 -66 115 2 12 -176 -53 -21 28 294 -14 -89 -21 -215 -348 -21 77 264 298 -6 -114 -175
2596 -175 -168 34 116 264 251 -115 168 229 -108 -43 -221 73 54 219 114 143 152 -195 -69 -20 18 74 105 152 -82
$$ packed form
2435b00K11L5l38J47l47K80O35k05P5k60J34m51l81O98J68M2j90K6k51l11O32
2456A49k25K84l91N14l1l31j40L41m19K26J07K42o9P6j44n50L6j46R38o63M59
2477B63l33L04q9n04L42O6J8j20R4J21J31l66JNK4K75k5o6K2J08l80m32M35J87
2501H1r1o3J29j7K00k04j01J00j0k27M05J7O6j42j99j27j91J39L05J7J14J40l68
2524b7m4j22J80L5J06N4j42m9L9Q3n5k81Q4J26L9J29J9l09j49K8O1K38R6j46k13
2549b20J28J12j1r1Qk1J72q4M8K1j1j52j49P6J57N0K65j02l75J26j65J52J10K14
2573B58j62j92L0J81j13J0j88J23L2M9K66l08p5O8j94j33L27R8J87L4l04j08o1
2596a75PK02Q2J48j3l66K83O1l37O5j78K94j9J65j05K9Rl47J26M9L8N6L1M7k34
$$ plain form
2621 -82 -13 -83 -83 23 -79 82 46 53 -106 9 -36 -87 -88 95 39 195 133 -9 -329 -237 13 56 15 113 -74 16
2647 16 -130 -6 16 20 -184 -7 224 149 101 -138 -67 -97 -35 0 -42 118 208 -85 29 -208 -134 -235 55 217
2671 217 -12 0 34 44 19 -17 -108 -187 13 262 286 116 -138 -234 -78 76 207 246 23 -81 29 52 -38 9
2695 9 42 52 149 -21 44 -55 -243 224 4 0 25 6 89 -128 -4 -149 -1 35 145 -4 76 -181 -42 -212 -41
2720 -41 -120 41 34 -184 53 -48 -113 2 -193 -165 -111 -110 193 96 135 -137 -260 -10 -22 27 -25 11 98 29 107 104 5
2747 5 -183 -102 105 58 251 43 -133 -147 -147 -121 94 119 239 88 125 -108 -119 -205 -82 161 214 -33 -275 -33
2771 -33 -48 -90 -135 -54 -18 187 418 115 20 -234 -358 137 710 437 -131 -193 -120 -204 -20 -196 5 -124 -147 -186
2795 -186 -12 -4 137 -427 375 -51 -277 120 2 443 -29 201 -419 -16 126 389 202 -152 -342 202 275
$$ packed form
2621h2O9p0%J06j02J61l6Pj59J15m5n1jJ83n6J56o2j42l20R2K50M3m1R8j87R0
2647A6j46J24K2Mk04J77K31p5m8k39P1l0O2L5m2J60R0k93J14k37P4j01K90J62
2671B17k29J2L4J0k5l6r1p9K00K49K4j70k54r6J56J54J31L9k23j04J10K3r0M7
2695IL3J0R7j70O5r9j88M67k20mK5j9Q3k17J24j45J48L6J10j49Q0k57J39j70J71
2720d1p9J61pk18K37j01o5J15j95K8N4JL03r7L9k72j23K50j2M9n2L6Q7o9P8lr9
2747Ej88Q1K07m7J93k08j76j4%K6K15K5J20j51L7k33j1q6J23K43N3k47k42K42
2771c3j5m2m5Q1L6K05K31l03r5k54j24M95N73k73n68o2P3q4J84j76K01j29k3l9
2795a86J74QJ41n64Q02m26k26L97j18M41m72K30o20M03J42K63j87l54j90N44P3
$$ plain form
2816 275 163 -292 -272 -256 35 -134 64 -283 -135 -211 -195 87 193 97 381 -367 -25 202 80 -241 -49 453
2838 453 325 374 -63 -115 -87 -244 491 83 4 112 419 327 61 -135 200 -86 27 72 97 130 -144 40 369
2861 369 -18 -201 153 -198 259 132 129 475 304 306 -30 111 -51 39 152 -33 -819 219 152 376 -33 -83
2883 -83 196 4 71 288 641 -97 -185 -487 274 314 401 -134 -159 -103 120 225 112 102 261 -18 21 183 -49
2906 -49 -107 -21 17 -38 -179 330 312 -211 257 289 28 208 -57 241 286 -37 -407 125 262 150 475 1 -444
2929 -444 -284 -1 -26 14 -4 167 250 228 223 23 81 265 59 -71 33 349 299 -18 -28 -85 -38 -93 203 159 287
2954 287 -47 -293 -63 11 120 89 111 82 25 113 204 194 67 75 -132 -244 28 -103 -227 -325 128 71 403 123
2978 123 -41 7 -251 -117 -151 278 -87 104 161 -104 -32 240 118 -86 -83 -125 -171 43 56 128 181 -25 -43 -129
$$ packed form
2816B75j12m55K0J6K91j69J98l47J48p6J6K82J06r6K84p48L42K27j22l21J92N02
2838D53j28M9m37n2K8j57P35m08p9J08L07r2k66j96L35k86J13M5K5L3k74J84L29
2861C69l87j83L54l51M57j27lL46j71Kl36J41j62R0J13j85p86J038o7K24m09n0
2883h3K79j92O7K17L53p38q8l02P61M0Q7n35k5N6K23J05j13j0J59k79L9J62k32
2906d9n8Q6L8n5j41N09j8n23M68L2k61J80k65K98M5l23l70N32J37j12L25m74m45
2929d44J60K83k5M0j8J71Q3k2nk00N8J84k06j30J04L16n0l17j0n7M7n5K96m4J28
2954B87l34k46K30P4J09l1K2k9n7Q8R1j0j27Qk07j12K72j31j24r8M53n7L32k80
2978A23j64M8k58J34l4M29l65J91N7k65P2K72j22k04Lm2m6K14J3P2N3k06j8q6
$$ [...]
8191f45
##END NTUPLES=NMR FID
##END=
