##TITLE=1H_DE-80H_X3
 200.13MHz, d2o
 8 sc
 
 19ns.26.2.2025
##JCAMPDX= 6.0         $$ Bruker NMR JCAMP-DX V2.0
##DATA TYPE= NMR FID
##DATA CLASS= NTUPLES
##ORIGIN= UXNMR, Bruker Analytische Messtechnik GmbH
##OWNER= pz
$$ XWIN-NMR		Version 3.5
$$ Fri Jul  3 11:19:19 2026 Russian Standard Time (UT+4h)  Yarkov@DPX200
##.OBSERVE FREQUENCY= 200.1313
##.OBSERVE NUCLEUS= ^1H
##.DELAY= (6, 6)
##.ACQUISITION MODE= SIMULTANEOUS
##.ACQUISITION SCHEME= undefined
##.AVERAGES= 8
##.DIGITISER RES= 18
##SPECTROMETER/DATA SYSTEM= spect
##.PULSE SEQUENCE= zg30
##.SOLVENT NAME= DMSO
##.SHIFT REFERENCE= (INTERNAL, DMSO, 0, 14.3821)
##AUDIT TRAIL= $$ (NUMBER, WHEN, WHO, WHERE, WHAT)
$$ ##TITLE= Audit trail, XWIN-NMR		Version 3.5
$$ ##JCAMPDX= 5.01
$$ ##ORIGIN= Bruker BioSpin GmbH
$$ ##OWNER= Yarkov
$$ C:/Bruker/XWIN-NMR/data/yarkov2/nmr/H-C/1/audita.txt
$$ ##AUDIT TRAIL=  $$ (NUMBER, WHEN, WHO, WHERE, WHAT)
(   1,<2026-07-03 11:18:30.68 +0400>,<Yarkov>,<DPX200>,
      <created by zg, POWCHK disabled, PULCHK disabled
       configuration hash MD5:
       00 E9 B6 7A A2 85 ED C7 34 08 36 98 17 FE 4E 26
       data hash MD5: 16K
       10 D0 CE CB BC 76 A0 44 99 61 E0 3F 8A C4 5A 1C>)
$$ ##END=
$$ 
$$ hash MD5
$$ B0 07 88 90 CB 49 44 E2 D6 97 00 A1 44 35 BF 95
##$RELAX= 
##$RELAX= 
##$RELAX= 
##$RELAX= 
##$RELAX= 
##$RELAX= 
$$ Bruker specific parameters
$$ --------------------------
##$DU= <C:/Bruker/XWIN-NMR>
##$EXPNO= 1
##$NAME= <H-C>
##$PROCNO= 1
##$TYPE= <nmr>
##$USER= <yarkov2>
##$AMP= (0..31)
100 100 100 100 100 100 100 100 100 100 100 100 100 100 100 100 100 100 
100 100 100 100 100 100 100 100 100 100 100 100 100 100 
##$AQSEQ= 0
##$AQ_mod= 1
##$AUNM= <au_zg>
##$AUTOPOS= <>
##$BF1= 200.13
##$BF2= 200.13
##$BF3= 200.13
##$BF4= 200.13
##$BF5= 200.13
##$BF6= 200.13
##$BF7= 200.13
##$BF8= 200.13
##$BYTORDA= 1
##$CFDGTYP= 0
##$CFRGTYP= 5
##$CHEMSTR= <none>
##$CNST= (0..31)
1 1 145 1 1 1 1 1 1 1 1 1 1 1 1 1 1 1 1 1 1 1 1 1 1 1 1 1 1 1 1 1 
##$CPDPRG= <>
##$CPDPRG1= <>
##$CPDPRG2= <>
##$CPDPRG3= <>
##$CPDPRG4= <mlev>
##$CPDPRG5= <mlev>
##$CPDPRG6= <mlev>
##$CPDPRG7= <mlev>
##$CPDPRG8= <mlev>
##$CPDPRGB= <>
##$CPDPRGT= <>
##$D= (0..31)
0 0.7 0 0 0 0 0 0 0 0 0 0.03 0 0 0 0 0 0 0 0 0 0 0 0 0 0 0 0 0 0 0 0 
##$DATE= 1783063110
##$DBL= (0..7)
120 120 120 120 120 120 120 120 
##$DBP= (0..7)
150 150 150 150 150 150 150 150 
##$DBP07= 0
##$DBPNAM0= <>
##$DBPNAM1= <>
##$DBPNAM2= <>
##$DBPNAM3= <>
##$DBPNAM4= <>
##$DBPNAM5= <>
##$DBPNAM6= <>
##$DBPNAM7= <>
##$DBPOAL= (0..7)
0.5 0.5 0.5 0.5 0.5 0.5 0.5 0.5 
##$DBPOFFS= (0..7)
0 0 0 0 0 0 0 0 
##$DE= 6
##$DECBNUC= <off>
##$DECIM= 32
##$DECNUC= <off>
##$DECSTAT= 4
##$DIGMOD= 1
##$DIGTYP= 9
##$DL= (0..7)
0 120 120 120 120 120 120 120 
##$DP= (0..7)
150 150 150 150 150 150 150 150 
##$DP07= 0
##$DPNAME0= <>
##$DPNAME1= <>
##$DPNAME2= <>
##$DPNAME3= <>
##$DPNAME4= <>
##$DPNAME5= <>
##$DPNAME6= <>
##$DPNAME7= <>
##$DPOAL= (0..7)
0.5 0.5 0.5 0.5 0.5 0.5 0.5 0.5 
##$DPOFFS= (0..7)
0 0 0 0 0 0 0 0 
##$DQDMODE= 0
##$DR= 18
##$DS= 0
$$ [...]
##$SUBNAM2= <"">
##$SUBNAM3= <"">
##$SUBNAM4= <"">
##$SUBNAM5= <"">
##$SUBNAM6= <"">
##$SUBNAM7= <"">
##$SUBNAM8= <"">
##$SUBNAM9= <"">
##$SW= 18.0517328524113
##$SWIBOX= (0..15)
0 0 2 0 0 0 0 0 0 0 0 0 0 0 0 0 
##$SW_h= 3612.71676300578
##$TD= 16384
##$TD0= 1
##$TE= 0
##$TE2= 300
##$TE3= 300
##$TEG= 300
##$TL= (0..7)
0 120 120 120 120 120 120 120 
##$TP= (0..7)
150 150 150 150 150 150 150 150 
##$TP07= 0
##$TPNAME0= <>
##$TPNAME1= <>
##$TPNAME2= <>
##$TPNAME3= <>
##$TPNAME4= <>
##$TPNAME5= <>
##$TPNAME6= <>
##$TPNAME7= <>
##$TPOAL= (0..7)
0.5 0.5 0.5 0.5 0.5 0.5 0.5 0.5 
##$TPOFFS= (0..7)
0 0 0 0 0 0 0 0 
##$TUNHIN= 0
##$TUNHOUT= 0
##$TUNXOUT= 0
##$USERA1= <user>
##$USERA2= <user>
##$USERA3= <user>
##$USERA4= <user>
##$USERA5= <user>
##$V9= 5
##$VALIST= <valist>
##$VCLIST= <CCCCCCCCCCCCCCC>
##$VD= 0
##$VDLIST= <DDDDDDDDDDDDDDD>
##$VPLIST= <PPPPPPPPPPPPPPP>
##$VTLIST= <TTTTTTTTTTTTTTT>
##$WBST= 1024
##$WBSW= 4
##$XGAIN= (0..3)
0 0 0 0 
##$XL= 0
##$YL= 0
##$YMAX_a= 20471
##$YMIN_a= -18614
##$ZGOPTNS= <>
##$ZL1= 120
##$ZL2= 120
##$ZL3= 120
##$ZL4= 120
##$ABSF1= 10
##$ABSF2= 0
##$ABSG= 5
##$ABSL= 3
##$ALPHA= 0
##$AQORDER= 0
##$ASSFAC= 0
##$ASSFACI= 0
##$ASSFACX= 0
##$ASSWID= 0
##$AUNMP= <proc_1d>
##$AZFE= 0.1
##$AZFW= 0.1
##$BCFW= 1
##$BC_mod= 2
##$BYTORDP= 1
##$COROFFS= 0
##$CY= 83.5205535888672
##$DATMOD= 1
##$DC= 2
##$DFILT= <>
##$DTYPP= 0
##$F1P= 10.8118882576601
##$F2P= -7.23987719738617
##$FCOR= 0.5
##$FTSIZE= 0
##$FT_mod= 4
##$GAMMA= 1
##$GB= 0.15
##$INTBC= 1
##$INTSCL= 1
##$ISEN= 128
##$LB= 0.25
##$LEV0= 0
##$LPBIN= 0
##$MAXI= 10000
##$MC2= 0
##$MEAN= 0
##$ME_mod= 0
##$MI= 1.114404
##$NCOEF= 0
##$NC_proc= 0
##$NLEV= 6
##$NOISF1= 3.799351
##$NOISF2= 2.8
##$NSP= 1
##$NTH_PI= 0
##$NZP= 0
##$OFFSET= 14.38212
##$PC= 1
##$PHC0= -6894.148
##$PHC1= 6.42196
##$PH_mod= 1
##$PKNL= yes
##$PPARMOD= 0
##$PSCAL= 0
##$PSIGN= 0
##$REVERSE= no
##$SF= 200.129724274929
##$SI= 16384
##$SIGF1= 3
##$SIGF2= 2
##$SINO= 400
##$SIOLD= 16384
##$SREGLST= <1H.CDCl3>
##$SSB= 0
##$STSI= 0
##$STSR= 0
##$SW_p= 3205.1282051282
##$SYMM= 0
##$S_DEV= 0
##$TDeff= 0
##$TDoff= 0
##$TI= <>
##$TILT= no
##$TM1= 0
##$TM2= 0
##$TOPLEV= 0
##$USERP1= <user>
##$USERP2= <user>
##$USERP3= <user>
##$USERP4= <user>
##$USERP5= <user>
##$WDW= 1
##$XDIM= 8192
##$YMAX_p= 0
##$YMIN_p= 0
$$ End of Bruker specific parameters
$$ ---------------------------------
##NTUPLES= NMR FID
##VAR_NAME=  TIME,          FID/REAL,        FID/IMAG
##SYMBOL=    X,             R,               I
##VAR_TYPE=  INDEPENDENT,   DEPENDENT,       DEPENDENT
##VAR_FORM=  AFFN,          ASDF,            ASDF
##VAR_DIM=   8192,          8192,            8192
##UNITS=     SECONDS,       ARBITRARY UNITS, ARBITRARY UNITS
##FACTOR=    0.0002768,     1,               1
##FIRST=     0,             0,               0
##LAST=      2.2672688,     0,               0
##MIN=       0,             -18614,          0
##MAX=       2.2672688,     20471,           0
$$ Real data points
##PAGE= N=1
##DATA TABLE= (X++(R..R)), XYDATA
0@%%%%%%%%%%%%%%%%%%%%%%kJ0j6J6j6J6j6J6k4L2l2L2m0M8n0N8o4P2q2R0j02
$$ 0 0 0 0 0 0 0 0 0 0 0 0 0 0 0 0 0 0 0 0 0 0 0 -2 8 -8 8 -8 8 -8 8 -16 16 -16 16 -24 24 -26 32 -32 40 -42 48 -54
43e4J12j22J36j52J67j83K02k23K46k71K98l29L65m02M44m98N61o31P16q23R56
$$ -54 58 -64 72 -80 87 -96 106 -117 129 -142 156 -173 192 -210 234 -264 297 -334 382 -441 515
64E15j133J383j756K388l753J2629n846R19J2841k3462q151N371L670M261Q536
$$ 515 -618 765 -991 1397 -2356 10273 4427 5346 18187 -5275 -13426 -8055 -4385 -124 8412
79H412K343n334n724j242j1872j374J3643J380M998J2290j4064j0554O455o620
$$ 8412 10755 5421 -303 -1545 -13417 -14791 -1148 232 5230 17520 3456 -7098 -643 -7263
93g263l192J2742N788J863l54o440o697l402J679r19l4J4071K563j1747L734j023
$$ -7263 -10455 2287 8075 9938 9584 3144 -3553 -6955 -5276 -6195 -6229 7842 10405 -1342 2392 1369
109A369j3412L846O160J37R319L314o466l214l418k974r92L766P225p65K75J972
$$ 1369 -12043 -8197 -2037 -1900 7419 10733 4267 1053 -2365 -5339 -6331 -2565 4660 3895 4170 6142
125F142j1001l237P300n343M24J1070n4r77k9o758k457J106P94K667K426N190
$$ 6142 -4859 -8096 -796 -6139 -5715 5355 5301 4324 4295 -2463 -4920 -3814 -3020 -353 2073 7263
141G263n3q223p79j307m388O105K573k117N978r47o203J10k247m20M816J680J965
$$ 7263 7210 -1013 -1792 -3099 -7487 -1382 1191 -926 5052 4105 -2098 -1988 -4235 -4655 161 1841 3806
158C806R55j281j063n750j862M374j034K760N183m245r02L30o363L30L240l48
$$ 3806 4761 3480 2417 -3333 -5195 -821 -1855 905 6088 1843 941 1271 -5092 -4762 -1522 -1870
174a870L789J934j406r24l162j0K08j546M953K025k550K645k535n315J969q39
$$ -1870 1919 3853 2447 1523 -1639 -1649 -1441 -2987 1966 3991 1441 4086 1551 -3764 -1795 -2634
190b634m65M667L55K23M34l345r70j343m77M549L33q3K830k939j725M93l269J606
$$ -2634 -3099 1568 1923 2146 2580 -765 -1735 -3078 -3555 994 1327 1244 4074 1135 -590 -97 -3366 -1760
208a760K732p76K181n03k679R03k480j382K634K90K507J951k895%r62k671J846
$$ -1760 972 196 2377 1874 -805 98 -2382 -3764 -1130 -840 1667 3618 723 723 -239 -2910 -1064
225a064L3O05L610j335j146R6l130P68J148j809K661J199j044J255k483j870J943
$$ -1064 -1031 -426 3184 1849 703 799 -2331 -1563 -415 -2224 437 1636 592 1847 -636 -2506 -563
242e63r52R41K447n31J342r62l126P10j089n2L412j152lJ932k879m92N88j911
$$ -563 -1515 -574 1873 1342 2684 1722 -1404 -694 -1783 -1835 1577 425 422 2354 -525 -1017 -429 -2340
260b340J779J383m10J406r01o47L16k534Q54J756j308K718O58l295Q49p44j975
$$ -2340 -561 822 412 1818 917 270 586 -1948 -1094 662 -646 2072 2730 -565 284 -460 -2435
277b435J954K07J98J715j087p7n04j786J652M7p80K473o49m47J517k770r03J538
$$ -2435 -481 -274 -76 1639 552 475 -29 -1815 -163 -116 -896 1577 928 481 1998 -772 -1675 -137
295a37j120J248J181j262J156p88j697P08q27R75J942j394O94M42k039J105l90
$$ -137 -1257 -9 1172 -90 1066 278 -1419 -711 -1538 -563 1379 -15 679 1121 -918 187 -203
312b03j602K294K19n13J275j542m37P17j865N60R65l02J861p53j390J162j370
$$ -203 -1805 489 708 195 1470 -72 -509 208 -1657 -1097 -132 -434 1427 674 -716 446 -924
329i24j46J740j096Q85J307j771K92k47j303J372l21k34J483j029K45P23k283
$$ -924 -1070 670 -426 459 1766 -5 287 40 -1263 109 -212 -446 1037 8 253 976 -1307
346a307M78Q62j017J525K26o53J147j346o96R75j060J004J205j382P07q2j468
$$ -1307 -829 33 -984 541 767 114 1261 -85 -781 194 -866 138 1343 -39 668 586 -882
363h82J139m68o93J361n20L28O90j557N69L03j260J046Q1k28J691j229q67P49
$$ -882 257 -211 -904 457 -63 265 955 -602 -33 270 -990 56 137 -91 1600 371 -496 253
381B53j346N16J120j116R21M59j109N38o53n30J377o88L4O69p93J032l4j791J100
$$ 253 -1093 -577 543 -573 348 807 -302 236 -417 -947 430 -258 -224 445 -348 684 650 -1141 -41
400d1J65p87J557n26n91Q64j123l50N08l81J124N9q29R85q05l62J202j284j4J462
$$ -41 124 -663 894 368 -223 641 -482 -832 -324 -705 419 478 -351 634 -171 -533 669 -615 -629 833
420H33j073L71O85j142N31j59p18Q60l25J20R03j192k4K50r86J167L59r64J272
$$ 833 -240 131 816 -326 205 46 -672 188 -137 -17 886 -306 -330 -80 -1066 101 460 -504 768
439G68m16p18R68q88k48R37n50K97L07p02R70k82r70N01l02L04Q63j174K68N88
$$ 768 352 -366 602 -286 -534 403 -147 150 457 -245 725 443 -527 -26 -328 -24 839 -335 -67 521
459E21j201N02L31p41J226l7q06N68n43KN55r15L32M46m39P67l60p20R92o68m67
$$ 521 -680 -178 153 -588 638 601 -205 363 -180 -178 377 -538 -206 240 -199 568 208 -512 480 -188 -655
480f55J065o87K80O88j184K33L43o68Q76k4m43O43n73K2L13p57M77J96p86R52
$$ -655 410 -277 3 691 -493 -260 83 -585 291 267 -176 467 -106 -84 229 -528 -51 145 -641 311
500C11m9q39J081l70p88P20l66K23O40o98J36P1m50N95l56j72R61o94k47O76r08
$$ 311 262 -577 504 134 -654 66 -300 -77 563 -135 1 72 -378 217 -139 -311 650 -44 -291 385 -523
521e23L46P14j026L63K96m07P84m16n25O93m58M5N06n72N89Np78N30l29k63J083
$$ -523 -177 537 -489 -126 170 -237 547 131 -394 299 -159 -114 392 -180 409 414 -364 166 -163 -426 657
542F57o44m01P74o35J02M97q19M40L49m80L41j27k5M14p71K55K62p17Q80K72j085
$$ 657 13 -388 386 -249 -147 350 -469 -29 320 -160 181 54 29 443 -328 -73 189 -528 352 624 -461
563d61O04no67O70j79l21O84l83j08J29k17N00j48l35P06o21m6J006j065j38P54
$$ -461 143 138 -529 141 -38 -359 325 -58 -166 -37 -254 246 98 -237 469 -152 -198 808 -257 -395 359
584C59p54K12N55o33L88J83n51J03j69K45K58n68M29N9o48R07n9r18R15o3o94
$$ 359 -395 -183 372 -261 127 310 -241 -138 -307 -62 196 -372 57 116 -532 375 316 -602 313 250 -444
605d44P53k59k80L68k61m9K4j2O02m23k10N80p32J29P80r02J11Q17p92L8M41m02
$$ -444 309 50 -230 138 -123 -172 -148 -160 442 19 -191 389 -343 -214 566 -336 -225 592 -200 -162 279 -123
627a23L20m4l06K45k84J81L03o91M17O1n59Q19j35n10P29k89n11N56k97l5M49
$$ -123 197 153 -153 92 -192 -11 292 -399 18 79 -480 339 204 -306 423 134 -377 179 -118 -153 296
648B96l92J83m3k16N72l59k29M76n20J06M40o82L39L19p14M12J67l86O11j88l41
$$ 296 -96 87 44 -172 400 41 -188 288 -232 -126 314 -368 -29 290 -424 -12 155 -231 380 192 -149
669a49J84k81K71K09n51M14J6m36M72k44k18P14n26j62N55m79J51L45m92J07L7
$$ -149 35 -246 25 234 -317 97 113 -323 149 -95 -313 401 -125 -287 268 -211 -60 285 -207 -100 -63
690f3r0M16k71j12L93m62J57J85n52O01J4o16N16o1l52N64k14k48L89k48J89O2
$$ -63 -153 263 -8 -120 273 -189 -32 153 -399 202 216 -400 116 55 -297 267 53 -195 194 -54 135 197
712A97k86L07j67k70M62l90j8N89o10N3L07m47L03K72m65K34k4j27K76k58J9L48
$$ 197 -89 218 51 -219 243 -147 -165 424 -186 -133 174 -273 30 302 -163 71 47 -80 196 -62 -43 305
734C05m23J90J08l56M37k8m82L33j56o8L81k99o3K84l16K65q0l10N12j06l24L23
$$ 305 -118 72 180 -176 261 233 -249 84 -72 -140 241 -58 -121 163 -153 112 32 -278 234 128 -196 127
756A27k95J79K97n33J49K01l69M43m3l69L49j50k20L13k32O7K96l37J58p5j47
$$ 127 -168 11 308 -225 -76 125 -244 199 156 -213 136 -14 -234 79 -153 -86 210 -127 31 -44 -191
777a91M76k27k43L90l63M0M22n17J32K83m24J89J01k01L31q9j77J49k37J99K30
$$ -191 285 58 -185 205 -158 -118 304 -213 -81 202 -222 -33 68 -133 198 109 -68 81 -156 43 273
798B73m01J92J3l43M14p0l47N05j79k18K22k16Q2K22k91J43m5m2L43k34j77M68
$$ 273 -128 64 77 -266 148 78 -269 236 57 -161 61 -155 -73 149 -142 1 -44 -86 257 23 -154 314
820C14l64l9L68n03K45K98m66J61rq6K92j95j21K25k63J47J67m67L77O2l78M65
$$ 314 -50 -89 279 -224 21 319 -147 14 5 -81 211 16 -105 120 -143 4 171 -296 81 143 -235 230
842B30j65k54M29k30r2J60k16J85J44l96K52k0k41L81k18j20M03l94J14J80l38
$$ 230 65 -189 240 10 -82 78 -138 47 191 -205 47 27 -214 167 -51 -171 232 -162 -48 132 -206
863b06L00J01l52K23q2j38L94k03j41K92l38J19J81l65K80J5k69K75j39m4L30
$$ -206 94 195 -157 66 -16 -154 240 37 -104 188 -150 -31 150 -215 65 80 -189 86 -53 -97 233
884B33k69k6J48k03J72R4k83J51Kj21K13k07J6L21l16N3J20k49K69l9j73J79j08
$$ 233 -36 -62 86 -117 55 149 -134 17 19 -102 111 -96 -80 241 -75 -22 98 -151 118 79 -94 85 -23
907b3j35L99l12K6K47k96J43Q2k63K63o9k19K30k07R2L04l70J08J01k59K79L6
$$ -23 -158 241 -71 -45 202 -94 49 131 -132 131 62 -157 73 -134 -42 262 -108 0 101 -158 121 157
929A57l17L31j24k22K86k42R0K26l13O5R9k26L66j86j61K96k81P8K26k45P3K45
$$ 157 -160 171 47 -175 111 -131 -41 185 -128 -63 36 -190 176 -10 -171 125 -156 -78 148 -97 -24 221
951B21l02Q5M2j52L10j46j45J35j66L8K61k79M7R8k49K96q6j88L38j26j48K28
$$ 221 -81 4 46 -106 204 58 -87 48 -118 -80 181 -98 -51 47 -202 94 8 -180 158 32 -116 112
973A12k39O3K97k99P3j3j50K54p4j40K33j40j8J87k67J19J21k21P2k1l8K86j48
$$ 112 -127 -64 233 -66 7 -6 -156 98 24 -116 117 -23 -41 146 -121 -2 119 -102 -30 -51 -89 197 49
996D9j55K46k54J09J89k77R8R6j94J37m1p6K65j97p8J84k35J37J63k74J35K8k44
$$ 49 -106 140 -114 -5 184 -93 5 101 -93 44 3 -73 192 -5 -83 101 -134 3 166 -108 27 55 -189
1019a89K46m9r1J98j40j3Q4j82J61Q4k87K18j10k9L38k36p9J55j30N9J19k50Q7
$$ -189 57 8 -83 115 -25 -38 46 -136 25 109 -178 40 -70 -99 239 3 -76 79 -51 8 127 -123 -36
1042c6J12j83J64r8p9K38k05J5Q4k04K11J18k84J69J5j96K58r8p3K35k00m9P5
$$ -36 76 -107 57 -41 -120 118 -87 -72 12 -192 19 137 -147 22 37 -159 99 1 -72 163 -37 -86 -11
1065a1j26J69L5k22J79k5p3K49k04K2J16j64L1Q5j62J72P1k33J94j73NK01j35
$$ -11 -137 32 67 -155 24 -1 -74 175 -29 -7 109 -55 -24 61 -101 71 142 -91 103 -70 -65 136 1
1088AON2k53K96L5l29K65m8j02J39q4n4K25j45o4N3n8J84q3r3J38j48k8K40k02
$$ 1 7 59 -194 102 137 -192 73 25 -77 62 -22 -76 149 4 -60 -7 -65 119 36 -57 81 -67 -95 145 -57
1113e7NK85l25Q3N1j46P8J15j66J29j13O0J23k07J14M2k06K40l6k24K68K7k65
$$ -57 -52 233 -92 -9 42 -104 -26 89 -77 52 -61 -1 122 -85 29 71 -135 105 69 -155 113 140 -125
1136a25J40j00M7J44j05L0o5j17K40j46k7K02j85N0J96k91R8J91k94J05J3p2J23
$$ -125 15 -85 -38 106 1 31 -34 -151 89 -57 -84 118 -67 -17 179 -112 -14 177 -117 -12 1 -71 52
1159E2rp5P4q9J46l6j41J62L2k05K10j24j87K78Pj32P3r9j9J57j14L8qn7K41j93
$$ 52 43 -32 42 -47 99 63 -78 84 116 -89 121 -3 -190 88 95 -37 36 -63 -82 75 -39 -1 -9 -66 175 -18
1185a8m3K16j66k1J36k47J03J90j65P6k7p4J12j10m3J74j67K3J68k16J11Qj26
$$ -18 -61 155 -11 -32 104 -143 -40 150 -15 61 34 -40 72 -38 -81 93 -74 -51 117 -99 12 20 -106
1208a06J82o7j01K83k13r7J82j58Q7N7j05N4Pq7J80j95R7J05j45K9K5j50J69M2
$$ -106 76 9 -92 191 -22 -119 63 -95 -8 49 -56 -2 5 -82 98 -97 0 105 -40 -11 14 -136 33 75
1232G5k36J46L1j21J44qj00J62j00M4N2j83J61Qj38Q3j00j2K59k27k6J49j29O6
$$ 75 -161 -15 16 -105 39 31 -69 93 -7 37 89 -94 67 75 -63 20 -80 -92 167 -60 -86 63 -66 0
1256@J03j58J06qq6J45j82M4K27k23NQ0j71J30Q1j93J32n4l4J14j20N5O5j03N8
$$ 0 103 -55 51 43 -43 102 -80 -36 191 -32 -27 53 -118 12 93 -100 32 -22 -56 58 -62 -7 58 -45 13
1281A3J00j91J53K7k20J90j14j3J12j29P7J32j75Q9oj64K07j0j72J92j86N6J77
$$ 13 113 -78 75 102 -118 72 -42 -55 57 -72 5 137 -38 51 45 -119 88 78 -94 98 -88 -32 145
1304A45k08N2R2k16K05l2j45J50q9l4O2p5J7J94j82M9L7j01R9Kq3N1%l0R4q8L0
$$ 145 -63 -11 81 -135 70 38 -107 43 -46 -80 -18 -93 -76 118 -64 -15 22 -79 20 22 -61 -10 -10 -40 54 -34 -4
1331dN3j58J40M2j66J89q5m7J17j66Q3P5j45J35l7j08J01l3q8J76r7J2J29j90
$$ -4 49 -109 31 73 -93 96 11 -36 81 -85 -2 73 -72 63 26 -82 19 -14 -102 74 -23 -11 118 -72
1355g2N3J20j52J19m1j28K02o9n6J23j61P0R4j87J07P5j42O6j1j24J96n9q2N9
$$ -72 -19 101 -51 68 27 -101 101 32 -24 99 -62 8 102 -85 22 97 -45 21 10 -114 82 23 -59 0
1379@p1O2N0o7k5R4r8J13o0j15K28p8j03J24j12N9R7j52O2m5o6K00j10n4P4l5
$$ 0 -71 -9 41 -26 -51 43 -55 58 -2 -117 111 33 -70 54 -58 1 98 -54 8 -37 -103 97 -13 -67 7 -28
1405b8M6l8q6J04J7m5K5j7JJ10j10j3O5o0N8Pj41J20L1r9L9J9l6P5m7J5l1k6J
$$ -28 18 -20 -106 -2 15 -30 -5 -22 -21 89 -21 -34 31 -29 29 36 -105 15 46 -53 -14 5 -31 44 -3 12 -19 -45 -44
1434d4J03j12J5L5j22J29k5l5R1o4lK5n9R7On7O9k7p2J42j12PN5l7P1k0j24J36
$$ -44 59 -53 -38 -3 -125 4 -21 -56 35 -29 -32 -7 -66 31 37 -20 49 22 -50 92 -20 -13 42 5 76 56 -68 68
1462F8n1j9K8l8K5Q9p4n3J27j76J05L0j69J62n4l4Q3j23L7O7o4pL9n6J33m1j22
$$ 68 17 -2 26 -12 13 102 28 -25 102 -74 31 61 -108 54 0 -34 49 -74 -37 30 -34 -41 -2 -58 75 34 -88
1489h8R9Mm4J02r4O1po2J09k3j39J66l7q0J26j50J9R6m0j6L4n7%M2o0L8K2q1O2
$$ -88 11 15 -29 73 -21 40 33 -29 80 57 -82 84 47 -33 93 -57 -38 58 18 2 36 -21 -21 21 -39 -1 21 -60 2
1518Bn7K4P5r5R9j18l1J32n8oM1k9O4nj37N2R2j17J05p4jK7L5k2M1p4M7O6n8K0
$$ 2 -55 -31 44 -51 48 -70 -101 31 -27 -33 8 -21 43 38 -99 -47 45 -72 33 -41 -42 -15 20 -2 39 -35 12 78 20 40
1548D0%n9J9J9o8J21p9n4J02q4M6N4p6L5po5J17j00o7J80r2L1m6rJ9P6q9L8m1
$$ 40 40 -19 0 19 -49 72 -7 -61 41 -43 3 57 -19 16 9 -56 61 -39 -106 74 -18 13 -33 -42 -23 53 -36 2 -39
1577c9k6J50p9k7P9p8L7M2j37J35J2r5O6o2j5J07l7m2ORkL7j02N8nm7J29j04q7
$$ -39 -65 85 6 -21 58 -20 17 59 -78 57 69 -26 40 -22 -37 70 33 -9 -3 6 4 41 -61 -3 -8 -55 74 -30 -117
1606a17J69q7Q3n8n6J30j0p1N6m2qK6p1M4O3l8J9m5n9J53%j33J03k2o9J12o9o2
$$ -117 52 -35 48 -10 -66 64 54 -17 39 -3 -11 15 -56 -12 51 13 32 -13 -72 81 81 -52 51 29 -40 72 3 -59
1634e9P3l0O0l5n7J03l2k7O2r2K0J05j31K5J3o2J1Q8q2Q7m1m3Q9o3n2P3k3Pj4
$$ -59 14 -16 44 9 -48 55 23 -4 58 -34 -14 91 -40 -15 -2 -64 -53 35 -47 40 -1 -44 45 -18 -70 3 -20 -13 -27
1663b7l7N2P5p8M7n4J3O8m9k1J0J2L5o0L0J7l2k8M7J2r6J59j56M2L9m7J6op3P3
$$ -27 -64 -12 63 -15 32 -22 -9 59 10 -11 -1 11 46 -14 16 33 1 -27 20 32 -64 95 -61 -19 20 -27 -11 -17 -90 -17
1693a7j5m8J06n7o4J20o9P1n0rP2po2O2r0N9K7q1P0l4OP4q6j2P0j4o3P5p4kJ15
$$ -17 -32 -80 26 -31 -95 25 -44 27 -23 -32 40 33 -29 33 -57 2 29 -52 18 -16 -10 64 -22 -34 36 22 -41 34 -40 -42 73
1724G3r4L5J0m1J09j02m7R5n7M3rj10P4L6j8J3j2p3Q8m9l3J12m8J4j3l7N1N7j28
$$ 73 -21 14 24 -17 92 -10 -57 38 -19 24 15 -95 -21 15 -3 10 -2 -75 13 -36 -69 43 -5 9 -4 -41 10 67 -61
1753f1P4pn1Q0n3Q9n1q0L1M9o7N8m9K9Q0r7m2R7j1ko7k9J07jj07J07k3J7k5n9
$$ -61 13 6 -45 35 -18 71 20 -60 -29 20 -47 11 -38 -9 71 -26 -68 29 18 16 -51 -80 27 26 -81 26 3 20 -5 -64
1783f4L4L7k5j2O5o1N1Qn2R4j04P5mrm6N0n9L9J4j28J21k8k5J10j09kJ31j02K4
$$ -64 -30 7 -18 -30 35 -26 25 33 -19 75 -29 46 42 33 -13 37 -22 17 31 -97 24 -4 -29 81 -28 -30 101 -1 23
1812B3n4l9J18k1j35J68j09O6Ll0J3k9n3J38j00n0L3N0QJ6p1K5R9j06M7O0j22
$$ 23 -31 -70 48 27 -108 60 -49 17 20 -10 3 -26 -79 59 -41 -91 -58 -8 0 16 -55 -30 69 -37 10 70 -52
1839e2P4nj18J76j6m3M0p1RJ10j42M8m5j6Q1Pj7p6M9m5P4m9L6j0j4J6K1n8L4L7
$$ -52 22 17 -101 75 59 16 56 -15 -6 104 -38 10 -35 -51 30 37 20 -56 -7 -52 22 -27 9 -1 -15 1 22 -36 -2 35
1869C5j04J02q9P7K0j0k0K3l6L9Mj7L4m3l3O8p8l8J14j9LJ0Kl1m7oJ14j28M4l
$$ 35 -69 33 -56 21 41 31 11 34 -2 37 41 24 58 15 -18 50 -28 -66 48 29 32 42 44 13 -34 -40 74 -54 -10 -13
1899a3m4M1J3l8K9J5m3R0n1n0J01j8k7j1l3M7kq2J45m9r3J09l8K7m4N6n8L4k3
$$ -13 -57 -16 -3 -41 -12 3 -40 50 -1 -51 50 32 5 -6 -39 8 6 -76 69 20 -73 36 -2 25 -19 37 -21 13 -10
1928a0K8j7j3KJ1p8R1jn0L1l8L0Kj6L0Jn1J08j15J5L4Kk9M6q2J14k0o0O9p4j4
$$ -10 18 1 -12 -10 1 -77 14 13 -37 -6 -44 -14 -12 -28 2 3 -48 60 -55 -40 -6 -4 -33 13 -69 45 25 -35 34 -40 -54
1959e4P8o9N6O0n0j8J2o1M5P0n7M6J1j09N4n3N3L4j20R6n1l6J39q6k0M8l7KMm4
$$ -54 24 -45 11 71 21 3 15 -46 -1 69 12 58 69 -40 14 -39 14 48 -72 24 -27 -63 76 -10 -30 18 -19 -17 -13 -57
1989e7R0Rj22R0k6QK2k5J9J4m3jQ3r3J6L2j2k5M4k0L5k4k9P1k1rk2l4M0J8q5Q5
$$ -57 33 42 -80 10 -16 -8 14 -11 8 22 -21 -22 61 -32 -16 16 4 -21 23 3 38 14 -15 56 35 26 4 -30 10 28 -57 28
2021B8m6j3M9o8P2K8o3OL3j03Q7O4r1M0o5OQ0q9K1L1l4R2k2q8N6J9k8M2m5LO7
$$ 28 -18 -31 18 -50 22 50 -13 -7 26 -77 10 74 -17 23 -42 -36 44 -45 -24 7 -27 65 43 -45 11 30 2 44 -1 2 69
2052F9j02N8k9mM3oj6mn6O5Q1j42O5Nl3k1nm1O8M0q3P1k0J7k9n0K0L1J3K4k5l5
$$ 69 -33 25 -4 -8 35 29 13 9 -47 18 99 -43 22 27 -6 -27 -32 -73 -5 35 -48 23 3 20 -9 -59 -39 -8 5 29 4 -31
2084c1O1k1o7L3L7J6N3r9L6J3j9l3N3p3N9M9o8L8o0K7J1o4P1n7mJ1nK4O1q0L5
$$ -31 30 9 -58 -25 12 28 81 -18 18 31 12 -21 32 -41 18 67 -1 37 -23 4 15 -49 22 -35 -39 -28 -33 -9 52 -28 7
2115GJ07k06J00L2k8J5m4l5K6m8Q0kl1K9Jj7R5o0n0L3Np1O8k8J4j4N4jjr2N1L
$$ 7 114 -92 8 40 12 27 -17 -52 -26 -74 6 4 -27 2 3 -14 81 21 -29 4 9 -62 6 -22 -8 -22 32 31 30 -62 -11 -8
2147hn1J26q9m0P2J2j0j6p7Q1rl3j2N8l9P8p2%L3o4J24p1j9N1p4lJ07m3NK7n2
$$ -8 -59 67 -22 -62 10 22 12 -4 -81 0 -9 -42 -54 4 -35 43 -29 -29 4 -60 64 -7 -26 25 -49 -52 55 12 17 44 -8
2178h%MJJLl9P5j2k3K7m5PL1p6N5%oLK1o4M5K3o0P8j43R3j0l6J4R1j23R1m0M9
$$ -8 -8 -4 -3 -2 1 -38 37 25 2 29 -16 -9 22 -54 1 1 -5 -2 19 -45 0 23 -37 41 -102 -9 -19 -55 -41 50 -73 18 -22 27
2212B7%n4k7R1n0j5nLO2k9K0nMJ2m0k3P6N3j38PO9n4J0K1p7J04o6K5J1l0j5O2
$$ 27 27 -27 -54 37 -13 -28 -33 -30 32 3 23 18 22 34 -6 -29 47 100 -38 -31 38 -16 -6 15 -62 42 -24 1 12 -18 -33 29
2244B9K5n3pj5O6l6RJ2l1P0o0K0L0p5J4L2j9LK3l2qN7p9j1Q1p3M8NpL7l7m4L2
$$ 29 54 1 -6 -21 45 9 18 30 -1 69 9 29 59 -16 -2 30 11 14 37 5 -3 54 -25 -36 45 -28 20 25 18 55 18 -26 6
2277FJ3k5k8m9M3Q8n3O2m4k1J4l1j3L9k3J2O6q9Q1J0j26Q9m2lM1m5P1pr7J32m1
$$ 6 19 -6 -34 -83 -40 48 -5 57 13 -8 6 -25 -38 1 -22 -10 56 -33 48 58 -68 21 -21 -24 17 -28 43 36 -61 71 30
2308C0n3R7p4l0O2o3K4K2l1NJ8m3OJ6J4M0q1k0P5p5R5o3m0N4M8q0P3pm9N3k8k3
$$ 30 -23 74 0 -30 32 -31 -7 15 -16 -11 7 -36 -30 -14 0 40 -41 -61 14 -61 34 -29 -69 -15 33 -47 26 19 -30 23 -5 -28
2340b8M4q2K7L8m3N7K3l6O2np7K8j9L6M4m6j3K4p1O9n6j4O3m4L2kqo9J26j18N8
$$ -28 16 -66 -39 -1 -44 13 36 0 62 57 -20 8 -11 25 69 23 10 34 -37 32 -24 -38 25 -19 13 11 3 -66 60 -58 0
2371@J8n0J9P4j33J04n4o4J36n0M6m4N7l1o0pP8p2N0J01j54L0M0j1m7J2k7Q6j2
$$ 0 18 -32 -13 61 -72 32 -22 -86 50 0 46 2 59 28 -32 -39 39 -33 17 118 -36 -6 34 23 -24 -12 -39 47 35
2400C5o4N7l7jK0j5j0nQmk7J4M6q4J8R3p1K9l0J0%K7j5P7n4m2N2k7j1lL2q8R1
$$ 35 -29 28 -9 -10 10 -5 -15 -20 -12 -16 -43 -29 17 -67 -49 44 -27 2 -28 -18 -18 9 -6 71 17 -25 27 0 -11 -14 18 -70 21
2433B1p7K2K6M6nJ2m4pJJ9n3n9R4O1j27N6P7r4n8L5J8O3j7k9qN5n0K4p6Q1k2m4
$$ 21 -56 -34 -8 38 33 45 1 -6 -5 14 -39 -98 -4 57 -70 -14 63 -31 -89 -54 -36 27 10 -19 -27 28 -22 2 -74 7 -15 -59
2465e9J04n4J3L4o1M0J1l2J7ro1M6P0p0O0m3l0RJ9j6L8k6L8n9k4R0n9L7N1q4P2
$$ -59 45 -9 4 38 -23 17 28 -4 13 4 -57 -11 59 -11 49 6 -24 -15 4 -12 26 0 38 -21 -45 45 -14 23 74 -10 62
2496F2j14L2j7N4l3JrL7N4j17N4K5m3O4l1l9l0O3L3N1o1n3O3n7M4j4n0O8Nm3k4
$$ 62 -52 -20 -37 17 -16 -15 -24 13 67 -50 4 29 -14 50 19 -20 -50 13 46 97 36 -17 46 -11 33 19 -31 37 42 -1 -25
2527b5mM6j2m4j8O5m4R8o2l1N4o0mL1M4q0K3l6O2K4n5O8k4n9K2J9M3n4L1k7O0
$$ -25 -29 17 5 -39 -57 8 -36 62 0 -31 23 -37 -41 -10 34 -46 -23 -59 3 27 -28 40 16 -43 -21 -2 41 -13 18 -9 51
2558E1p1M3K0o9N7j04O7M4p8L9J3j0nj0J02p1L7q3N7m9M4K1j00O3k1p7K0Q3j8
$$ 51 -20 23 43 -26 31 -73 -6 38 -40 -1 12 2 -3 -13 89 18 55 -28 29 -20 24 45 -55 8 -13 -90 -70 13 -5
2587eJ6n7j3O7LK4k6o1O7m0K6nL6k3k0j6K9J1k6k0N8p8J3L3q7J08k0MJ0Lpp1P5
$$ -5 11 -46 -59 8 11 35 9 -52 15 -25 1 -4 32 9 -11 -27 2 13 -13 -33 25 -53 -40 -7 -94 14 -6 -2 8 11 4 -67 8
2620HK1r3M7J7Om3L6K9l2Rk3LL1m5K9K3k4J2Ro6J21q6j4J0l9P8l4RqM0l1n2M4
$$ 8 29 -64 -17 0 6 -37 -1 28 -4 5 -18 -15 16 -29 0 23 -1 11 20 -46 75 -11 -25 -15 -54 24 -10 -1 -9 31 0 -52 -8
2653hl4K8K1n3M6o4Q1k5RqKmK1k4J9k7M0m6J9L7Kj4r6O3P1r2K0O5l6J3m8O4L8
$$ -8 -42 -14 7 -46 0 -64 17 -8 1 -7 -5 -9 12 -12 7 -20 20 -26 -7 30 32 18 -78 -15 56 -36 -16 49 13 26 -22 42 80
2686H0r6lO1p8M7jj8M9n4n2J16nk2k6J7M3m8Ko5O0r9P1J4Qj6k9Q1m8mN6j4p1P9
$$ 80 -16 -19 42 -36 11 10 -8 41 -13 -65 51 46 24 -2 15 58 10 12 -53 7 -92 -21 -7 1 -15 -44 37 -11 -15 41 27 -44 35
2719C5o6O8K1o6J1M9j02J8M8p3N0NL0l5mJ8K5m8M1j2m5K6Pj5M3k2l6K8m4J09p5
$$ 35 -31 37 58 -8 3 52 -50 -32 16 -57 -7 -2 28 -7 -11 7 32 -16 25 13 -32 -6 1 -14 29 7 -29 -1 -45 64 -11
2750a1nJ0j4k1M6K0n7L9pKL1r9NO1J7L2m4K3jNm8O6q1O9L5o4J5jLk2j6j0N2n6
$$ -11 -16 -6 -20 -41 5 25 -32 7 0 2 33 -66 -61 0 17 49 5 28 27 32 -16 50 -31 38 73 9 24 23 26 4 -12 -22 30 -26
2784b6P3m3n1O7j1o2L7l0L7J1m3j5J04o3OL8j4Jk6j9K9k0M3L1m9qN0l8j2M6k1
$$ -26 47 4 -47 20 9 -53 -16 -46 -9 2 -41 -56 48 -15 -9 29 15 16 -10 -29 0 -20 23 54 5 -3 47 9 -3 43 22
2815B2n2K7k0O9n8oJ08j23J9ok7N9l6k6J03m6o9O9l1k3M8j7Pk0LK9j6K0j8L2k5
$$ 22 -30 -3 -23 46 -12 -18 90 -33 -14 -20 -47 12 -24 -50 53 7 -62 7 -24 -47 1 -16 -9 -29 -26 3 -13 7 -11 21 -4
2846dN4k3k1K1p5R7kk7l1N7j11J25o4Lpj6J3PJJ8M8p7NK4j2k8k8O3l0J0oJ5m3
$$ -4 50 27 6 27 -48 49 47 20 -11 46 -65 60 -4 -1 -8 -24 -11 -4 -3 15 63 -14 -9 15 3 -25 -53 10 -20 -10 -16 -1 -44
2879d4K1O6o2j7M6Ol4l5R0m6%M4p6M5K5o3O3J1l7Oj7l4K1J7K3m3k9K4M9j0oNj5
$$ -44 -23 43 -19 -36 10 16 -18 -53 37 -9 -9 35 -41 4 29 -34 29 40 3 9 -8 -42 -21 -4 19 -24 -53 -29 20 10 4 9 -6
2912fk0O8j25J10m3j9M4n2QJ6m2N5KmjQ0o9M6Kr6O6%j3Q3n9LK0p6N3l6J1P0q2
$$ -6 -26 42 -83 27 -16 -35 9 -43 -35 -19 -61 -6 -4 -8 -9 71 2 48 50 -46 20 20 7 90 31 34 54 -22 31 -5 6 76 -6
2945fLM2m1k0R6o9J8m9k8M5J2o1M3J0k5K3Lj5Oml1M0nnk0K9M6o1L5L2n2J1O3p3
$$ -6 -3 39 -2 -22 74 5 23 -26 -54 -9 3 -58 -15 -5 -30 -7 -4 -19 -13 -17 -48 -8 -13 -18 -38 -9 37 -24 11 43 -9 2 65 -8
2979hRK7m7L0m8P8p3L7o9K9RJ8Rr2R8J8k9LM0nk8n7J0J7J1M4n5lK9p1O7k4M0p
$$ -8 1 28 -19 11 -37 41 -32 5 -64 -35 -26 -8 1 -91 7 25 -4 -1 39 34 6 -51 -41 -24 -13 31 -24 -27 2 -69 -2 -26 14 7
3013GL4m2l2Q6n1J8M0rk4n7l0J15o5K4M1q6L6N3j58J12j6j2P6m3p2O4p1O9J0m9
$$ 7 41 -1 -33 53 2 20 60 51 27 -30 -60 55 -10 14 55 -31 5 58 -100 12 -4 -16 60 17 -55 9 -62 7 17 -32
3043c2M3m8j1Q0j2k1M7o8NL7j9rL1Ln5L4J0nj7k7koR3j5l0Q1n8k2o8Q1l9M4J4
$$ -32 11 -37 -48 32 20 -1 46 -22 -17 20 1 -8 23 26 -29 5 15 10 -7 -34 -36 -42 51 36 6 87 29 7 -61 20 -19 25 39
3076C9m4N0m1M3n4N5k5p7N8L9r7L2M6pj4J3mOj7J2jp6R4J8m8k7J1M3R0j05%%J
$$ 39 -5 45 4 47 -7 48 23 -54 4 43 -54 -22 24 17 3 16 12 18 1 13 12 -64 30 48 0 -27 -16 27 117 12 12 12 13
3109A3k8lJk2R2n3m1O9nj2RJ4p0PJ9L3r0N3N0k9l2J8rm0J48j33J7L4QJ5o0q%k2
$$ 13 -15 -18 -17 -39 53 0 -41 28 23 11 20 34 -36 -29 -10 23 -67 -14 36 7 -25 -7 -16 -56 92 -41 -24 10 18 33 -27 -35 -35 -57
3143e7J06q7K9L1rPJ9Mn2K2njL4j1q9Q8j2j8J8j7J6o0K5L8l3K4l3JLl5K9K1n8
$$ -57 49 -38 -9 22 13 20 39 43 -9 13 8 7 41 30 -59 29 17 -1 17 0 16 -44 -19 19 -14 10 -23 -22 -19 -54 -25 -4 -62
3176f2M7L0p9O6nLmm9M4L0k7j1qkK2K2m6O5p5K0M1k1M2k0j6PJM0k8K1o3J8k7k0
$$ -62 -15 15 -64 2 -3 0 -4 -53 -9 21 -6 -17 -25 -27 -5 17 -29 36 -39 -19 22 1 43 23 7 14 15 55 27 48 -15 3 -24 -44
3210d4P4o8r2J03K8k7J4JNQ8n0no1K3N1n9lL8j4M5K5j8p2Q5q0PoJ1K7j3j9j1K5
$$ -44 30 -38 -130 -27 1 -26 -12 -11 -6 82 32 27 -34 -11 40 -19 -22 16 2 47 72 54 -18 67 -13 -6 -12 -1 26 13 -6 -17 8
3243HroM1k9ql4N6n2M3M3k8m1M0n0M0j1k8LK8M1l3j12J41m1k4P7l4m5K0K9n1N1
$$ 8 -1 -7 34 5 -3 -37 19 -33 10 53 25 -16 24 -26 14 3 -25 -22 6 47 14 -98 43 2 -22 55 21 -24 -4 25 -26 25
3275B5pJ3%o5N5nK6pk7j8NKl1O4l0lo5Q0j5j9l6j3O0L1j1j8j1K7p0J01l4M2n9
$$ 25 18 31 31 -34 21 16 42 35 8 -10 -5 -3 -34 30 0 -3 -68 12 -3 -22 -58 -71 -11 20 9 -9 -20 7 -63 38 4 46 -13
3308a3mk5O4J7n0K8j0J8Pl0L9j2n1O4o3K8mK1j8RkN8k2n4QLK5L0m5J3n3kk8N6
$$ -13 -17 -42 22 39 -11 17 7 25 32 2 41 29 -22 42 -21 7 3 24 6 15 13 71 49 -5 3 6 31 61 16 29 -24 -26 -54 2
3342Bn6M0K7k1PPkJ0m1jM4j6J9n1K3qL1l2L4J1K3jj06L7MM0k9J8J7mJ7m7L9n5
$$ 2 -54 -14 13 -8 -1 6 4 14 -27 -28 16 0 19 -32 -9 -17 14 -18 16 27 50 49 -57 -20 -16 24 -5 13 30 26 43 -4 35 -20
3376b0N5J5k6l0Kj3N6k8k9j8K1m3M4l5M3L4Nn4K9j3K8k9L6m4j8K2Q3l2r1M0j3
$$ -20 35 50 24 -6 -4 -17 39 11 -18 -36 -15 -58 -14 -49 -6 28 33 -21 8 -5 23 -6 30 -14 -32 -10 73 41 -50 -10 -23
3407b3K0L6l5nL0n2L5nkL2m5oJ2J4%l2kO2m5M6n0M8j4l6NO8k1j04O0l6Q0k5mm8
$$ -23 -3 33 -2 -7 23 -29 6 1 -1 31 -14 -20 -8 6 6 -26 -28 34 -11 35 -15 33 19 -17 -12 56 35 -69 -9 -45 35 10 6 -42
3441d2P4p9M0K4J4j4j1k5O3K0o0k8j0k5K0L9P1j01lQ8r0QR0p7j7QMj8K3k4K7k0
$$ -42 32 -47 -7 17 31 17 6 -19 44 64 4 -24 -34 -59 -39 0 71 -30 -33 55 -35 -27 63 -14 -31 -23 -19 -37 -14 -38 -11 -31
3473c1M2k1M0r4R2j6J5l1l9Q1k8pL4J1jMl5J1J0p6K2N1p4K5M3m0j2Rl3J00q6j9
$$ -31 11 -10 30 -64 28 12 27 -4 -43 38 10 3 37 48 47 51 16 27 37 -39 -17 34 -40 -15 28 -12 -24 -15 -48 52 -34 -53
3505e3O6k6J5n8N4M7q2PM1l0MQN8p3O0k6Jj6k1K0K7o1Q5m6%jJ1N0p6m8R1J9m5
$$ -53 13 -13 2 -56 -2 45 -37 -30 11 -19 -15 -7 51 -22 38 12 13 -3 -24 -4 23 -38 47 1 1 0 11 61 -15 -63 28 47 2
3538BOk6K5K2nJ8j3j9K4j3l5L4k1Ll9L5k6Q5o3M4j5m6K4L4n7N9j9k1k3J5J8K4
$$ 2 8 -18 7 29 24 42 29 10 34 21 -14 20 -1 2 -37 -2 -28 57 -6 38 23 -23 1 35 -22 37 18 -3 -26 -11 7 31
3570C1MJ1Kk8K3n7J7JmpJ7l9K7MOm7K7k6N4l6O6pm7%l7M1k9M0l7M8j1m4K9K5k9
$$ 31 35 46 48 20 43 -14 3 4 0 -7 10 -29 -2 2 8 -39 -12 -38 16 -20 46 39 -8 -8 -45 -4 -33 7 -30 18 7 -37 -8 17 -12
3605a2rjL9krm2P5o8K1K1L0m2j6RM0k0l1L4J3n1mP1n1j2m5N3L0k0M2p4Jmj4Q1
$$ -12 -21 -22 17 15 6 -36 39 -29 -8 13 43 1 -15 -6 34 14 -17 17 30 -21 -25 46 -5 -17 -62 -9 21 1 43 -31 -30 -34 -48 33
3639C3n8J1J0k8Q7n9k5K1L2k8ONm2K2K0l8N3m0J3K8m2L4l8L7k0k2J4M6n1J8J5
$$ 33 -25 -14 -4 -32 55 -4 -29 -8 24 -4 2 7 -35 -13 7 -31 22 -18 -5 23 -19 15 -23 14 -6 -28 -14 32 -19 -1 14
3670A4j1J4m7M5qm2RO1q9L8K4k0k4K3j4pK4N2%k9k6J6k5j8L4l9L2Q6j01M1n2L6
$$ 14 3 17 -30 15 7 -35 -26 35 -54 -16 8 -12 -36 -13 -27 -34 -10 42 42 13 -13 3 -22 -40 -6 -45 -13 73 -28 13 -39 -3
3702cj1L8j9l1J4K6k2J3k9K0J7jj4nMm7OL0k8O2mp6P3m3N1o8NP4j6p4R6J5q5P7
$$ -3 -14 24 5 -26 -12 14 -8 5 -24 -4 13 12 -2 -7 -3 -50 -44 -14 -42 20 16 -60 13 -30 21 -47 -42 32 16 -58 38 53 -32 45
3736D5kj17J20K6n6m0L4l3M4m5N1p4N1mj6K9l4M1lm4L6l7K7k5J8j1j0M8k2k5M0
$$ 45 43 -74 46 72 16 -24 10 -23 21 -24 27 -47 4 0 -16 13 -21 20 17 -27 9 -28 -1 -26 -8 -19 -29 19 -3 -28 12
3767A2Jj2J3n1P9n9k6L0M3n3M4J3r3O5K1l4mK7m1O2qM2m5q6M7j8O3J7o7jL8n4
$$ 12 13 1 14 -37 42 -17 -43 -13 30 -23 21 34 -59 6 27 -7 -11 16 -25 37 29 71 26 -60 -13 -31 32 49 -18 -19 19 -35
3799c5P9j26Q5J6j0l2K1jl0L5mn2Q8k6kk1K4Lk1M6p1l4O3O0o4mj1L7%%j6L0o4
$$ -35 44 -82 3 19 9 -23 -2 -3 -33 2 -2 -54 34 8 6 -15 9 12 -9 37 -34 -68 -5 55 -9 -13 -24 13 13 13 -3 27 -37
3832c7M2Lk4L8j2n0M6o0L1M5k0k4PL1n2j8P5pj4k0m4mR3J1n4J7Kql2M0j1JL9J7
$$ -37 5 8 -16 22 10 -40 6 -54 -23 22 2 -22 -15 16 -36 -54 21 14 0 -20 -64 -68 25 36 -18 -1 1 -7 -39 1 -10 -9 30 47
3866D7m1K7LNJ6p1pk7N8rL8nQp1j7L0K7k7l2nO3n7K6n4P2k8M2o4M7RN8r8L7l1
$$ 47 6 33 36 41 57 -14 -21 -48 10 1 39 34 42 -29 -46 -16 11 -16 -48 -53 10 -47 -21 -75 -3 -31 11 -53 -6 3 61 -37 0 -31
3900c1L3L6k4j5l2J1M5j25O8o5J17j6K0K2K2m9k1RL1K9m3k2K8n3L8j1Mpl5M9o5
$$ -31 2 38 14 -1 -33 -22 23 -102 -34 -99 18 2 22 44 66 17 -4 5 36 65 22 0 28 -25 13 2 6 -1 -36 13 -52
3931e2P5m5L5o7j3O4r1J24n0jMJ9j5K0l3j5j8R9l6K7m2k0J6nK2M3n8L1l6QLj8
$$ -52 23 -22 13 -54 -67 -3 -94 30 -20 -21 -17 2 -13 7 -26 -41 -59 40 4 31 -11 -31 -15 -20 2 45 -13 18 -18 -10 -7 -25
3963b5L4k2J3m6J4jM5JJ5k5l6qR2p6J6k8l4N1J1oP5ko6L2k9L9nJ1qp2Q8m0k8L8
$$ -25 9 -13 0 -46 -32 -33 12 13 28 3 -33 -41 51 -25 -9 -37 -71 -20 -9 -15 60 58 -8 24 -5 34 29 40 32 -40 48 8 -20 18
3997A8k9J1n7N0M4o9R7o6J5j0k0O0l2l6j9pN2J1l8O7n2l3N1j1k5K8L3lq3L4J3
$$ 18 -11 0 -57 -7 37 -32 65 -1 14 4 -16 44 12 -24 -43 -50 2 13 -25 42 -10 -43 8 -3 -28 0 33 30 -53 -19 -6
4028fJ7L1k2j3l6P1n4m8L6lM0Lj1m7O9Ro1O0k8Qn2L9Rk3K8l1%rj5P3ln6N1j1R
$$ -6 11 42 20 7 -29 42 -12 -60 -24 -27 13 16 5 -42 27 36 -25 35 7 15 -37 2 11 -12 16 -15 -15 -24 -39 34 31 -25 26 15 24
4063B4m0M1Kn3J5j0k1%M3J0K7q0N5Q3r0l3M5m5K0k6N8j2M6J9l3n0k0jJ6lk9oM7
$$ 24 -16 25 27 -26 -11 -21 -42 -42 1 11 38 -42 13 96 6 -27 18 -27 -7 -33 25 13 59 78 45 -5 -25 -26 -10 -13 -42 -48 -1
4096aJ2j9j1j3K1O2n9k7K5k3l4N9j7M3o6M5l0J8M9Rn1K6nk5qL1N0l4n3O0l8l4
$$ -1 11 -8 -19 -32 -11 51 -8 -35 -10 -33 -67 -8 -25 18 -48 -3 -33 -15 34 43 -8 18 13 -12 -20 11 61 27 -26 34 -4 -38
4128c8N5n8L3L1p3M6J4Jj7m4RL5J3n7L3j8M7l3J4k8j0O3lo3P5m5J4j3l1j0Q0m1
$$ -38 17 -41 -8 23 -50 -4 10 11 -6 -50 -41 -6 7 -50 -17 -35 12 -21 -7 -35 -45 18 15 -48 27 -18 -4 -17 -48 -58 22 -19
4160a9nk3J09o7l8Q8n1M9k6j4Orkk6L5j5kN4j07P7J2l4l3KOO0q3Q7j05R7n9jL8
$$ -19 -24 -47 62 -5 -43 45 -6 43 17 3 9 0 -2 -28 7 -8 -10 44 -63 14 26 -8 -41 -39 -33 27 -56 31 -74 23 -36 -37 1
4193ARj6j1J8k4P7l8l5M2k0RkJ7l2k3K3n8K2M1m4M5l8JN6RL0l7l4J3J1l9J1K0
$$ 1 10 -6 -17 1 -23 54 16 -19 23 3 12 10 27 -5 -28 -5 -63 -41 0 -44 1 -37 -36 20 29 59 22 -12 1 12 -27 -16 4
4226Dk9k9P9m0j5J6l0P2m6j2L2l2K7j6J6m7M9J5k6L0J3L5o2mM7k8k7P4q3OM7k2
$$ 4 -25 -54 25 -15 -30 -14 -44 28 -18 -30 2 -30 -3 -19 -3 -50 -1 14 -12 18 31 66 4 0 47 19 -8 66 -17 -11 36 14
4258A4k3l3k0M7L2m6Q1n7J9l4K7m3J0j0M0j3L0J8k2l4QkJ4k4NN7m6Kj5j1M1o2
$$ 14 -9 -42 -62 -15 17 -29 52 -5 14 -20 7 -36 -26 -36 4 -9 21 39 17 -17 -9 -11 3 -21 -16 41 -5 -3 -18 -29 12 -50
4290e0P5m1OO5o0m6L1M4m5j5Q3J2p2lJ1O0p7l2Q3l4J8j2j0k2O7r0QL6j6J9J5k3
$$ -50 25 -16 -10 55 -5 -51 -20 24 -21 -36 47 59 -13 -16 -5 55 -22 -54 29 -5 13 1 -9 -31 36 -54 -46 -10 -26 -7 8 -15
4322a5k1Q6p7L7%nr1QL6P2o7N3M4q3M3m2J8mk5K0j0K5J7nkP6j12N6K4m6n8P5n3
$$ -15 -36 50 -27 10 10 5 -86 -78 -42 30 -37 16 60 -23 20 -22 -4 -8 -33 -13 -23 2 19 14 12 88 -24 32 56 10 -48 27 -26
4355b6j9O1m5M7j9M5m5J1ol3J4K1r8J06l2N1p0L2kJ2J1k8k0P4o3pQ6o4N8k1m9
$$ -26 -45 16 -29 18 -1 44 -1 10 4 -29 -15 6 -92 14 -18 33 -37 -5 -7 5 16 -12 -32 42 -21 -28 58 -6 52 31 -18
4386a8l9%L2P8m1o1M3l8J4M4o3L0l0K4J9n6K8K9%jJ6jLj1n0O2l2k4P6q4J11o8
$$ -18 -57 -57 -25 53 12 -49 -6 -44 -30 14 -49 -19 -49 -25 -6 -62 -34 -5 -5 -6 10 9 12 1 -49 13 -19 -43 33 -51 60 -8
4418hm4P0p5O6K7m5N2r2K0K7j7k6M7%m8L0k2L8k9K8j4M8q4Q1k8m5Q3n8J8j1K1
$$ -8 -52 18 -57 9 36 -9 43 -49 -29 -2 -19 -45 2 2 -46 -16 -38 0 -29 -1 -15 33 -51 30 2 -43 40 -18 0 -11 10
4449A0l3M6q6N1J3j1j0K1rN8o5L4rL5r0N4Rnk0K6J1m8O6l3kl2M1J8n2Ok9N8j4
$$ 10 -23 23 -63 -12 1 -10 -20 1 -8 50 -15 19 10 45 -45 9 18 13 -7 19 30 -18 48 15 13 -19 22 40 -12 -6 -35 23 9
4482Im0P2Mo7P3m0k7M1m5M6J4j7l6L2l0Qo4R1j0m2K0j5j7ML8lM8m0M3n5k5J3J8
$$ 9 -31 41 45 -22 51 11 -16 25 -20 26 40 23 -13 19 -11 -3 -67 24 14 -28 -8 -23 -40 -36 2 -1 47 7 50 -5 -30 -17 1
4515AMJ2j0k6l9J08k6M9n3n3K1J1K8l7M4j7k1j0N3j6m6j1qL4k3OO0j7m9jJ15o1
$$ 1 5 17 7 -19 -58 50 24 73 20 -33 -12 -1 27 -10 34 17 -4 -14 39 23 -23 -34 -42 -8 -31 -25 35 18 -31 -32 83 22
4547B2j5k6M8mn5J8N8m4k2M7o2M7o3K6L3kqlL3j1Or1O2O1m0NNrj4J6mM7n8jj0
$$ 22 7 -19 29 25 -30 -12 46 2 -20 27 -35 12 -51 -25 8 6 -2 -5 28 17 23 -68 -6 55 15 20 25 16 2 18 14 61 3 2 -8
4582hm3N9k8K6K3r0K4O0m7NM5p9P3k4oL5k5o2J7M2j4L4o9K7K0lO3Kj20M9L0J5
$$ -8 -51 8 -20 6 29 -61 -37 23 -24 -19 26 -53 20 -4 -10 25 0 -62 -45 -3 -17 17 -52 -25 -5 -8 55 57 -63 -14 16 31
4614C1Rk3jK0j9n0K0J3qK3l8J8lL9Kn8L0n3M7k3O4J4m5k9%N6n2L8o6M8L3Jo4q
$$ 31 40 17 16 36 17 -33 -13 0 -8 15 -23 -5 -8 31 33 -25 5 -48 -1 -24 40 54 9 -20 -20 36 -16 22 -44 4 37 38 -26 -34
4648c4L4o7J30p6J8kJ4l3K6o8K9l8P3J1l5j2L8nk7Q4m2j4K9K7o7j5P9k6l1J3L8
$$ -34 0 -67 63 -13 5 3 17 -16 10 -58 -29 -67 6 17 -18 -30 8 3 -24 60 18 4 33 60 -7 -22 57 31 0 13 51
4679E1p2L7m2M5L3k1o5P7J0r4K4p1J15Jrj5k5K8J7n8L6l9J9L2j7N5m8l4qN8J7
$$ 51 -21 16 -26 19 52 31 -34 43 53 -41 -17 -88 27 28 19 4 -21 7 24 -34 2 -37 -18 14 -3 52 4 -30 -38 20 37
4710C7n1K1pMpL6n2K2K8K9n3L1k3k0L3m2qp7Q5PJ3K7k9kj0K5K2q7O3Mm7J5K4m6
$$ 37 -14 7 0 4 -3 33 -19 3 31 60 7 38 15 -5 28 -14 -22 -99 -14 -7 6 33 4 2 -8 17 39 -48 15 19 -28 -13 11 -35
4744c5l9R0k6kL9Kl0L3j7J3l6L0mk1oO7p5M8lj4m8J29q7R1o3k3Lo1N9k9Nl1N8
$$ -35 -74 16 -10 -12 27 29 -1 32 15 28 -8 22 18 -3 -9 58 -17 31 28 14 -34 95 8 99 36 13 16 -45 14 -15 -10 -41 17
4777A7k2l1L6j4N7l4j7qj1J5L8l0K0j6Pl3j6R0Qp5l6J33j00J4m1K1J3j7N6l0m8
$$ 17 -5 -36 0 -14 43 9 -8 -16 -27 -12 26 -4 16 0 7 -26 -42 48 56 -19 -55 78 -22 -8 -49 -28 -15 -32 24 -6 -54
4808e4Q2%k3K0mj9k2j8Q6n4K4k5l3L6QkoM5l4l1j1L1j8K4K9k0l4j6M4oJ%J6M5
$$ -54 28 28 5 25 21 2 -20 -38 48 -6 18 -7 -40 -4 4 2 -4 41 7 -24 -35 -4 -22 2 31 11 -23 -39 5 -1 0 0 16 61
4842F1n8J0K3r6P8M4k2m6K0k9k3R0Qn2j6L2q1J0L7k1M0m0K4m%n6P6J9j5qNM1j26
$$ 61 3 13 36 -60 18 62 40 -6 14 -15 -38 52 60 8 -8 24 -57 -47 -10 -31 9 -31 -7 -11 -11 -67 9 28 13 5 10 51 -75
4875g5N1J5mM5J8m6O8j5o6K9Jk5l2P0Km2L1o7J3P6q1L7N2p1L5o5R8p4%J2M8K1
$$ -75 -24 -9 -13 32 50 4 72 57 -9 20 21 -4 -36 34 36 -6 25 -42 -29 47 -34 3 55 -16 19 -46 52 -22 -22 -10 38 59
4907E9q3J5O3l0l5K0l0L1K6m0k1M8l4K6M0l8l5J7k5L3kj6qK4M5n8L7l1j7L%O9
$$ 59 -24 -9 54 24 -11 9 -21 10 36 -4 -25 23 -11 15 55 17 -18 -1 -26 7 5 -11 -19 5 50 -8 29 -2 -19 -16 -16 53
4939E3l6k4K9j2J5l9M1m9jnk6N9m4KJ9K9l2NMPL3K4o2L0l7N4pp1%JP2l2k6M4j0
$$ 53 17 -7 22 10 25 -14 27 -22 -23 -28 -54 5 -39 -37 -18 11 -21 -16 -12 -5 28 52 -10 20 -17 37 30 -41 -41 -40 32 0 -26 18 8
4974HmO3j01N1lq8N0J3L3o6P2lj4j5OlJ3Kp9J16q6L2K2m5L4k3K0K2n3Oj3M2K2
$$ 8 4 67 -34 17 14 -74 -24 -11 22 -44 28 25 11 -4 2 -1 12 14 -65 51 -35 -3 19 -26 8 -15 5 27 -26 -20 -33 9 31
5007C1ok3j8QON1Mn6J0m3K4L3n2N1n0k6rL1RK3npLlM2m3k%L5j8k1k2JL6j6K3l8
$$ 31 25 2 -16 -8 -2 49 53 -3 7 -36 -12 21 -31 20 -30 -56 -65 -34 -25 -2 -7 -14 -11 -14 28 -15 -17 -17 18 0 -21 -43 -42 -6 -22 1 -37
5044c7K6l%k7Q5o8J1K0j0M7qk1L5j01N1k7J3j7j8L4Mk9L2j8N8r3O8j6j3j6L5L7
$$ -37 -11 -14 -14 -41 44 -24 -13 7 -3 44 36 15 50 -51 0 -27 -14 -31 -49 -15 -11 -40 -8 -26 32 -61 7 -9 -22 -38 -3 34
5076C4kp1J8J0m3M4N1l3N1n4J2j3n8K4P9n5J5rK9K6p4M2k3l6L3J9J0j9KQk5%L4
$$ 34 32 -39 -21 -11 -54 -10 41 8 59 5 17 4 -54 -30 49 -6 9 0 29 55 -19 23 0 -36 -3 16 26 7 9 17 -8 -8 26
5109B6m6k2N6l9L3l6K1N4n0l0L7j3L1J7m3J0rKL2rlK5l6j0k4M3m0K4KK8n0M1l3
$$ 26 -20 -42 14 -25 8 -28 -7 47 -3 -33 4 -9 22 39 -4 6 -3 -1 31 22 19 44 8 -2 -26 17 -23 1 3 31 -19 22 -11
5142a1M9n5M7l1k6L0Nk2%Ol1N4n1J1QO1l4Lp0O1rk6L5k2M0J2o8J3L6nl3j6M1J1
$$ -11 38 -17 30 -1 -27 3 8 -14 -14 -8 -39 15 -36 -25 -17 44 10 13 -57 4 -5 -31 4 -18 22 34 -34 -21 15 10 -23 -39 2 13
5176A3l7K5k9O1r9J6O1%K3j1m6L5j5L0J8ml2k7J6R3n1j5J0p3K3mL3r3O4jj7j2
$$ 13 -24 1 -28 33 -66 -50 11 11 34 23 -23 12 -3 27 45 41 9 -18 -2 91 40 25 35 -38 -15 -19 14 -79 -15 -16 -33 -45
5208d5K0N4Pk5K2o1M4j7K1K1l4MN2j7n7L7n1M1Nn2L4m0K2L8n5M8m2N4n1k2L5P3
$$ -45 -25 29 36 11 33 -28 16 -1 20 41 7 11 63 46 -11 26 -25 16 21 -31 3 -37 -15 23 -32 16 -26 28 -23 -45 -10 63
5240F3j50M5J9K7k3J0K7o5K3k7M8p4J13m3J2K5m7o6R9ro3P6rK7l7K9j9jjm7R1
$$ 63 -87 -42 -23 4 -19 -9 18 -47 -24 -51 -3 -77 36 -7 5 30 -17 -83 16 7 -56 20 11 38 1 30 11 10 9 -38 53
5271E3n8M7m4m7K3K6Jj6N6p9QM5kj7nj1qK8l1J1M4l0m4N3qJ1k8K9L8j7jo1N4n9
$$ 53 -5 42 -2 -49 -26 0 1 -15 41 -38 -30 15 13 -4 -9 -20 -28 0 -31 -20 24 -6 -50 3 -5 6 -22 7 45 28 27 -34 20 -39
5305c9N2j3l5Q4m3J1M5n4j22J34k2j9N8q8N4l8L1j0L1m3K4K3l2J1K7j0K6l7m5
$$ -39 13 0 -35 49 6 17 62 8 -114 20 -2 -21 37 -51 3 -35 -4 -14 17 -26 -2 21 -11 0 27 17 43 6 -39
5334c9L7L2k8L3k2l7Q7l5k2j6O7l4nl0Ql7M1rO0j9r0j4N2L5j2L4o7K0M0n4M4P
$$ -39 -2 30 2 35 13 -24 63 28 6 -10 57 23 18 -12 -4 -41 0 -9 51 32 -58 -72 -20 15 3 37 -30 -10 30 -24 20 27
5366B7m0N3Ro2J5lk1N4J8l5NLk4l0M5o2M5M2r5J2PR2qm0l4O6j9K7oJ0l7o2P4m
$$ 27 -13 40 49 -13 2 -1 -22 32 50 15 20 23 -1 -31 14 -48 -3 39 -56 -44 -37 55 47 7 -27 39 20 47 41 51 14 -48 26 22
5400B2K5l4J6j1nj5k7l1L1O5o7K5Rl9nM4m9N7rl9P4l6j1L2M2l5lj5K8jk5qj4Q0
$$ 22 47 13 29 18 13 -2 -29 -60 -29 36 -31 -6 3 -36 -41 3 -46 11 2 -37 37 1 -10 22 64 29 26 11 39 38 13 5 -9 71
5434G1j26N4k8M8m0OL7L0r6nN3j5L0Q1k7p7k4N9n6N3p5j9M2K8%Kk7J5k3L3j1K0
$$ 71 -55 -1 -29 19 -21 -15 22 52 -44 -49 4 -11 19 100 73 -4 -28 31 -25 28 -47 -66 -24 4 4 6 -21 -6 -29 4 -7 13
5466A3L5k7J5o0J2L2k7K5m1O6j2o6N0l0rN4k9jK6m7k1M4mk0KP4n1n7O1J3K0k1
$$ 13 48 21 36 -24 -12 20 -7 18 -23 43 31 -35 15 -15 -24 30 1 0 26 -21 -42 2 -2 -22 -20 54 3 -54 7 20 40 19
5498A9pl9KM6p2J4O3l5m4J14m2l9N4o6P4qq7M0O3j4m1M2%o5L2j2j2M8m3M2J9l7
$$ 19 12 -27 -25 21 -51 -37 26 -9 -53 61 19 -20 34 -32 42 34 -53 -13 50 36 -5 37 37 -28 4 -8 -20 28 -15 27 46 9
5530IJRL0m0j7j4M4J9k1O5p9J5n7l1j4N3L0ll1M4m4J9L6n5L8J3J8Qn5j8L2k4K5
$$ 9 10 19 49 9 -8 -22 22 41 20 85 6 21 -36 -67 -81 -28 2 -1 -32 12 -32 -13 23 -32 6 19 37 45 -10 -28 4 -20 5
5563Ej4N2o4OJ9j1j7M0j8LJ5J4m1p4Q8k9L1m1oML2NK1m7M3Ql6Q0n5k2J0Jj1K6
$$ 5 -9 43 -21 -15 4 -7 -24 16 -2 1 16 30 -11 -85 3 -26 5 -36 -42 -38 -6 -1 20 -27 16 24 -12 68 13 -9 1 2 -9 17
5597A7J%k7M1l4K2L0Jp8K8J8m8L0JJ2l3M1J9r2J02l7p3R6n5J6n2M3J7j9M1k9N
$$ 17 18 18 -9 32 -2 20 50 51 -27 1 19 -29 1 2 14 -19 22 41 -51 51 14 -59 37 -18 -2 -54 -11 6 -13 28 -1 4
5629Dj0j3K0kJ1j2oJ0QolNj6J6j1L0l5J2L2J5m2JJ05j10J7K3m1j0K7k1K4K6k3
$$ 4 -6 -19 1 -1 10 -2 -8 2 10 4 1 6 -10 6 -5 25 -10 2 34 49 7 8 113 3 20 43 2 -8 19 -2 22 48 25
5662B5Ol3M5k3L3m6Jk9J5j1R0j00L7O6m4l6lk4M6m6JJ5N9k7K8ok2K5j1m1M5j2
$$ 25 31 -2 43 20 53 7 8 -21 -6 -17 73 -27 10 76 32 -4 -7 -31 15 -31 -30 -15 44 17 45 39 17 42 31 -10 35 23
5694B3MP6j10K9n7K1k9P3l5M7n1pl2M0M1J5k1k0j6J9rm2N6l9N0mKl4M3k0m4O1
$$ 23 27 103 -7 22 -35 -14 -43 30 -5 42 -9 -16 -48 -8 33 48 27 7 -9 10 1 -41 15 -24 26 22 24 -10 33 13 -31 30
5726C0m9NK1J0jJ0K5j2L6q1P3j16R0r3R2mn3L3J2n9k2P4k7Jm3O1k2J5L6l0qpo3
$$ 30 -19 -14 7 17 16 26 51 39 75 -6 67 -49 41 -52 40 36 -17 16 28 -31 -53 21 -6 -5 -48 13 -9 6 42 12 4 -3 -66
5759f6J03l7K3n4N1%J8K7r9M6j2L5Kp2Q3o4R4j08M0n3K7mrQ2l9k2j6L5ol3K7k6
$$ -66 37 0 23 -31 20 20 38 65 -34 12 0 35 37 -35 48 -16 78 -30 10 -43 -16 -20 -29 53 14 -8 -24 11 5 -28 -1 -27
5791b7L2Lj8jlp3Q7Qmn1M6j0M4M2r4P0o7P9r0N7L1j2n4j5j2K9j0O1n4rk9N3L1
$$ -27 5 8 -10 -11 -14 -87 0 8 4 -47 -1 -11 33 75 -19 51 -16 63 -27 30 61 49 -5 -20 -32 -3 -13 48 -6 -15 -44 9 40
5824D0j7Kj8K4mKl6K7k5N2q4M4K0k4k2M8p0J7M8o6OL8l4PJ6J8%l2L0l8O8Po6L2
$$ 40 23 25 7 31 27 29 -7 20 -5 47 -37 7 27 3 -19 29 -41 -24 24 -42 -36 2 -32 -25 -9 9 9 -23 7 -31 37 44 -22 10
5858A0j2j%j1N7p5Oj4N2L6J5p9LK7n2M3m4L9j4j3K0N3l8m0P2p2L8J5L9k3q3M4
$$ 10 -2 -3 -3 -14 43 -32 -26 -40 12 48 63 -16 -13 14 -38 5 -39 0 -14 -27 -7 46 8 -32 40 -32 6 21 60 37 -46 -2
5890bL1j2pMOrl4N0m2M6l1mj3J9nNj3P8q1KN5l3j6M8m5q4J11ol6K6p2R8p7O1m7
$$ -2 29 17 10 14 20 11 -23 27 -15 31 0 -4 -17 2 -3 2 -11 67 -14 -12 43 10 -6 42 -3 -87 24 18 -18 8 -64 34 -43 18 -29
5925b9J7M6p1M9j3Qj0l5L2k5M8N9m1n2L7j8qK0m8K3Mml0N0loN6m9PK0l9M9n2P2
$$ -29 -12 34 -37 12 -1 7 -3 -38 -6 -31 17 76 35 -17 20 2 -6 14 -34 -11 -7 -11 -41 9 6 0 56 7 14 34 -5 44 -8 64
5959F4k2J1q9J1L4o5M1k1lk2O9PL9k3o2J5K7rql5M3M6n6R8j04N0l5k2N5J1l7k9
$$ 64 42 53 -36 -25 9 -56 -15 -36 -39 -61 8 15 54 31 -31 -16 11 2 -6 -41 2 48 -8 90 -14 36 1 -21 34 45 8 -21
5991b1P0k6k1K1j6n8M7L2j2M7l7j5l3L7on1M2nQj2k2M7m2MM0l2L5j9J7j7L4m8
$$ -21 49 23 2 23 7 -51 -4 28 16 63 26 11 -22 15 9 -42 0 -5 3 -9 -31 16 -26 -22 18 -14 21 2 19 2 36 -12
6023a2nK2J7nLj1o4Q2J2l1k7P0o6Lj4K9O0m2k7J2j7J0N9p5oj6N6m6N8l1K3J6l1
$$ -12 -17 5 22 17 20 9 -55 27 39 8 -19 51 -15 -12 -26 3 63 21 -6 6 -11 -1 58 -17 -23 -39 17 -29 29 -2 21 37 6
6056FK5m0%n0L4M9k4k5Q8p5K7N5q6O1pm5P2o9K9l7J7nK9J6j8o7N9o1O4J3k0m9
$$ 6 31 -9 -9 -59 -25 24 0 -25 63 -12 15 70 -16 45 38 -7 65 -4 25 -12 5 0 29 45 27 -40 19 -42 22 35 15 -34
6088c4P2n5k2R4Mm4k3j0M9j1j3k8j8O6n4oO1n8P9m0J1m1M3m7J0j8L5K0mJ4m9L3
$$ -34 38 -17 -39 55 59 15 -8 -18 31 20 7 -21 -39 27 -27 -33 28 -30 49 9 20 -21 22 -25 -15 -33 2 22 18 32 -17 16
6120A6lK5J1m1L1m2K1K2r6K8M6L0p2J3J8L9p2K6LJj0K0m4O7l5L7o8OO3n2O5m8
$$ 16 13 38 49 8 39 -3 18 40 -56 -28 18 48 -24 -11 7 46 -26 0 3 4 -6 14 -30 37 2 39 -29 -23 40 -12 53 5
6152EK8k8J3o7M8m3M0j6lJ04r0J0j9M8jj5jj6M9j4k0k4J4J0J7k2QQ%kk9mj7L6
$$ 5 33 5 18 -49 -1 -44 -4 -20 -23 81 -9 1 -18 30 29 14 13 -3 46 32 12 -12 2 12 29 7 15 23 23 21 -8 -12 -29 7
6186GK9p9L8K2j8j0j4N6p9N7jK0K9j0lp6NqP5l0K4n8l8J09p8M6rm6O0j4nnOpR
$$ 7 36 -43 -5 17 -1 -11 -25 31 -48 9 8 28 57 47 44 -32 -27 -35 40 10 34 -24 -62 47 -31 15 6 -40 20 6 1 -4 2 -5 4
6221Dj1o2N5K1K7n7N1j9J6L2k9j7m9M6l9M1M3p3J8j8JO2k4o8M1m5P3mj0k1j2N2
$$ 4 -7 -69 -14 7 34 -23 28 9 25 57 28 11 -38 8 -31 10 53 -20 -2 -20 -19 43 19 -49 -8 -53 20 16 6 -15 -27 25
6253B5n4L0K2RPm2m2J4LK4k6M2Nk5K1k7M2k0L9Po2K1N9r1K3m8J04j00M0N7q2O4
$$ 25 -29 1 23 32 39 -3 -45 -31 -28 -4 -30 12 17 -8 13 -14 28 8 47 54 -8 13 72 -19 4 -44 60 -40 0 57 -25 39
6285C9l8k1qpM8n6K6MO7r7M7p3O7o0L2K8J4k9k0M6mk0N2n2N0l6l0L1P2m7l7J2
$$ 39 1 -20 -28 -35 13 -43 -17 -13 54 -43 4 -69 -2 -62 -30 -2 12 -17 -37 9 5 -15 37 -15 35 -1 -31 0 72 25 -12 0
6317@L7l9L4J6l0K4m0K6n4L7n4O7J7qm5j2J7M3rm8K3ql5L2J4l5P2p4RJ4l6R3o7
$$ 0 37 -2 32 48 18 42 2 28 -26 11 -43 24 41 33 -12 -24 -7 36 27 -21 2 -6 -41 -9 5 -30 42 -32 -23 -9 -45 48 -19
6350a9R5j06k1J01Nkj9k4K4l1J6j8MKL8l4J5m6J4J3J1l5O0k5qj2MpM0n0K2k8M1
$$ -19 76 -30 -51 50 55 53 34 10 34 3 19 1 5 7 45 11 26 -20 -6 7 18 -17 43 18 10 -2 2 -5 35 -15 7 -21 20
6383B0k5K0m6mL2K5k1l5L6J1l0qqN0K1j1Lk7J6l4N7rlj8M0l7Ln0J3P7k2rl9J3
$$ 20 -5 15 -31 -35 -3 22 1 -34 2 13 -17 -25 -33 17 38 27 30 3 19 -15 42 33 30 12 52 15 18 -32 -19 58 36 27 -12 1
6417Ak3P6o4N8r4N7j5l6L3k1N0l6O3q6K3L2j05P8MM1j5O3o1r2R3nqJ0l6rR0p4
$$ 1 -22 54 -10 48 -46 11 -4 -40 -7 -28 22 -14 49 -37 -14 18 -87 -9 -5 36 21 84 23 -69 24 19 11 21 -15 -24 66 -8
6449hM4p2M4pj0P4o0MM1k6m4O6l2l7N1o6K2P7o4oM4n8N9j03M6R2r1O5m4j3M4m3
$$ -8 36 -36 8 1 -9 65 5 9 50 24 -20 46 14 -23 28 -38 -16 61 -3 -9 35 -23 36 -67 -21 71 -20 45 1 -12 32 -11
6481a1M2n3K5m3O2j0K0j7j4L0rJ8l0K7n5P3r9P1K8m0K3pnk1k9L1m6M6k4j3N0n6
$$ -11 31 -22 3 -40 22 12 32 15 1 31 22 40 10 37 -18 55 -44 27 55 15 38 31 26 5 -24 7 -39 7 -17 -30 20 -36
6513c6L5j2J7Rm3N5o5L9P1n5l4J6M7K9n8j5L9m2L1m9M1j0m5J8M8k7m4L4j1n1N3
$$ -36 -1 -13 4 13 -30 25 -40 -1 70 15 -19 -3 44 73 15 0 39 -3 28 -21 20 10 -35 -17 31 4 -40 -6 -17 -68 -15
6544a5L9J0m3omO2n0m7P5rK7qn7k4K8K5j5RM9n3Qo4J9N1L6qK8j01K6K7ll7L9k7
$$ -15 24 34 -9 -15 -19 43 -7 -54 21 12 39 31 -26 -50 -22 3 -12 -3 46 -7 1 -63 -44 7 43 35 63 -38 -12 15 12 -25 14 -13
6578a3jN8r3O1J9kk8k5K7L0k9J0noj2j3l4N0oL8pLol5ML5k5K0j2KK0m3oj3Q0n5
$$ -13 -14 44 -49 12 31 29 1 -24 3 33 4 14 9 3 -9 -22 -56 -6 -12 26 19 22 16 -19 -15 20 -5 15 3 5 25 -18 -24 -37 43 -12
6614a2ll0M6j4K8J5r0K2N4J9k9Ppj4%KLk4Pj1J8N8m6j8l3N5m3R2n1N0m3l9k2M8
$$ -12 -15 -45 1 -13 15 30 -60 -38 16 35 6 13 6 -8 -8 -6 -3 -27 -20 -31 -13 45 -1 -19 -52 3 -40 52 1 51 8 -31 -53 -5
6648eL8j2k0J2JKj1M0l3kJ7L5n2J0j0k6J9lkL2j8Pp4O2l3K7j1MjOK1l0L0j9l3
$$ -5 33 21 1 13 14 16 5 45 12 10 27 62 10 20 10 -16 3 0 -2 30 12 19 -55 7 -26 1 -10 -6 -7 -1 20 -10 20 1 -32
6683c2K7l6P2l5kO5p9rK3l9N1Kk5M6k8mLM1Nj03O2Mql2L2L0Mo6mL8N5o4m0K8m6
$$ -32 -5 -41 31 -4 -6 59 -20 -29 -6 -45 6 8 -17 29 1 -3 0 41 46 -57 5 9 1 -31 1 31 35 -31 -35 3 58 -6 -46 -18 -64
6718f4N9k1N9J7k4o4pL0J9o8N5k0KO0q0M4j7M9n8LJ7K5k4o2R5l1O9q0N7l6Nj9
$$ -64 -5 -26 33 50 26 -38 -45 -15 4 -64 -9 -29 -27 33 -47 -3 -20 29 -29 -26 -9 16 -8 -70 25 -6 63 -17 40 4 9 -10
6750a0K7j6k9M1m9L1KK8m1M8N9q9k2Lj6N5on3O9n3j3L9L8o2N2k2rm8K3K8m2L7
$$ -10 17 1 -28 13 -36 -5 -3 25 -16 32 91 2 -20 -17 -33 22 16 -37 32 -21 -34 5 43 -19 33 11 2 -46 -23 5 -37 0
6782@K2l1nM8m4m2QM7K8Rl2m7L7K7%L9n2Km0O3k9JJ6j6J4kl6mm9N2K1Lj3N1l9
$$ 0 22 -9 -14 34 -10 -52 -44 3 31 40 8 -39 -2 25 25 64 12 14 -26 37 8 9 25 9 23 21 -15 -19 -68 -16 5 8 -5 46 7
6817Gk2K7k5MO9p8N0Kl8l9K8M2j9K7o0O7l7mm9O0MNm9L9j1ml8OL3k1RJ1k5m0P2
$$ 7 -15 12 -13 -9 60 -18 32 34 -4 -43 -15 27 8 35 -25 42 5 1 -48 12 16 21 -28 11 0 -4 -42 -36 -3 -24 -15 -4 -29 -69 3
6852Cj3L3p5L1o7K6N5j0lN0k5J0l2k7N6j3nk8P9k3m0L1m0L8Mkj3Rl9j2M8k6pK6
$$ 3 -10 23 -52 -21 -88 -62 -7 -17 -20 30 5 15 -17 -44 12 -1 -6 -34 45 22 -18 13 -27 11 15 13 0 9 -30 -42 6 -20 -27 -1
6886aoM3o0M8K2l9K8m8LoNk5K5M9j5r3R9l9jj5PK8KKo0O3oLk8K5J0k6K5K4k5n3
$$ -1 -7 36 -24 24 46 7 35 -13 -10 -16 -11 -36 -11 38 23 -70 29 -10 -11 -26 -19 9 11 13 -47 16 10 13 -15 10 20 -6 19 43 18 -35
6922c5M5p5K3Q8m2kk2LK9m1J2O2m7k6k4N7n8Q9L5l6l2r1J21Kl9K6k1rJ0Omo9Q8
$$ -35 10 -65 -42 46 4 2 -20 -17 12 -29 -17 45 -2 -28 -52 5 -53 36 71 35 3 -88 33 35 -4 22 1 -8 2 8 4 -65 23
6955B3m1K1L1o5PK6J9p5J08j28O4J0K0j00Q6P0Lj02K3m8rM1M6k8n5K8j4L5j6J06
$$ 23 -18 3 34 -31 -24 2 21 -54 54 -74 -10 0 20 -80 6 76 79 -23 0 -48 -57 -16 30 2 -53 -25 -39 -4 -20 86
6985H6j04PmKJL4JLo7Q9k8qoRQ%k6lJ8k2K4ok1j5K4j8Q5o4L4Qp6M4Lk0P6q6mk2
$$ 86 -18 -11 -15 -13 -12 22 23 26 -41 48 20 12 6 15 23 23 -3 -6 12 -10 14 8 -13 -28 -4 -22 63 -1 33 41 -35 9 12 -8 68 -18 -22 -44
7023d4L5M7j9o4L6J6n7J4ON2j3j3ok8L3J5pKK5m5J1K0j5qQ0n9J1Lm9oN3o2R2k0
$$ -44 -9 38 19 -45 -9 7 -50 -36 -30 22 9 -4 -10 -38 -5 10 3 5 30 -15 -4 16 1 -7 73 14 25 28 -21 -27 26 -36 56 36
7057C6m5Qk6L1j8L4l8J8k7Q0l1o7J7N4o4k8R2J5m2k3K2K1m5Q9q1KK7j4n1K7j2
$$ 36 -9 -1 -27 4 -14 20 -18 0 -27 53 22 -45 -28 26 -38 -66 26 41 -1 -24 -2 19 -26 63 -18 -16 11 -3 -54 -27 -39
7088c9N7L4m5O7q6l5J9Q5q0k4j%K5j9Q9l4oL9o3OnJ1M2p4J14j25L0N3n9O7o7J4
$$ -39 18 52 7 74 -12 -47 -28 57 -23 -47 -48 -48 -23 -42 47 13 7 46 -17 -11 -16 -5 37 -37 77 -48 -18 35 -24 43 -24 -10
7120a0pJ4K8lk7m2N3K3K5q5JOL3J5mo0J2O3k6l3k3K3M1m5M3l3QnN6k7k7qlK6n9
$$ -10 -17 -3 25 22 -5 -47 6 29 54 -31 -30 -24 9 24 20 -40 -28 35 9 -24 -47 -24 17 -28 15 -18 -10 -15 41 14 -13 -21 -24 2 -57
7155e7rR1j0j9K9K4j4L5%o7K4j9J7k6KMPl1N9o2j9N5K3l4j5K6j1M4o6J0M%pj4
$$ -57 -66 25 15 -4 25 49 35 70 70 3 27 8 25 -1 1 5 12 -19 40 -22 -41 14 37 3 -12 14 3 47 -19 -9 -5 -5 -12 -26
7189b6J3oO1j06J02l5l2N3Pm6m0O0JK1nQj4j9Q1o9jk6mM1l6QJ4k2PM5l4l0Q6q8
$$ -26 -13 -19 42 -64 38 3 -29 24 31 -15 -55 5 6 27 22 30 16 -3 78 9 8 -18 -22 19 -17 -9 5 -17 -10 35 1 -29 57 -31
7223c1L4JQPj1j7PL5n4m0O0QK9m7n6O1K1l8L8N4o9Jj9k7Q2n8K4n7N5m7O1l4N2
$$ -31 3 4 12 19 8 -9 -2 33 -21 -61 -1 7 36 -11 -67 -6 15 -23 15 69 0 1 -18 -45 37 -21 3 -54 1 -46 15 -19 33
7256C3j1m6O3r9J27o2lKK3k4l0Q7r5O2jl1K1l9MK9j0M7q9l3O4M2m4pJ1K1m6N7
$$ 33 22 -24 39 -60 67 5 2 4 27 3 -27 60 -35 27 26 -5 16 -23 -19 10 0 47 -42 -75 -11 31 -13 -20 -9 12 -34 23
7288B3oJ1m6L6Ko9P4j7j5QN0l6Qm3K0Jj7k3N2O5j08RJ5J8j9k5Q9p4m0O2L2m0k5
$$ 23 17 28 -18 18 20 -49 25 8 -7 1 51 15 23 -20 0 1 -16 -39 13 78 -30 -21 -6 12 -7 -32 57 -17 -57 5 37 -3 -28
7321b8J4M7kl2k7KK1k1lP5l3k9M3k8m5N6L4q0O0k9RL4n7J5N9l8l7K7n2J1k7O6
$$ -28 -14 33 31 -1 -28 -26 -5 -26 -29 46 13 -16 27 -1 -46 10 44 -36 24 -5 4 38 -19 -4 55 17 -20 7 -45 -34 -61 5
7353Em1JL4j5l3O0j3n1L9lMK6l9J23k6q1K6Qkl0J5k1L1l2K2n2L2k5M7n7P4l3L9
$$ 5 -36 -35 -1 -16 -49 11 -2 -53 -14 -17 -13 13 -26 97 71 -10 16 24 22 -8 7 -14 17 -15 7 -45 -13 -38 9 -48 26 -7 32
7386C2rL1l5K3k4%%o2J2KK8L6q7O1Km5pP1rRJ8k1j3M4j1k8q3NJ07r8J10j15M8
$$ 32 23 54 19 42 18 18 18 -44 -32 -30 -2 34 -53 8 10 -35 -42 29 20 29 47 26 13 57 46 18 -65 -60 47 -51 59 -56 -8
7419hK6k8j3oj2K6M7l5l6K3L6l5R5p1J1J2n5K3m5O9n0L4k1L9j18M4M0j7Lm1N5
$$ -8 18 -10 -23 -29 -41 -15 32 -3 -39 -16 20 -15 80 9 20 32 -23 0 -45 24 -26 8 -13 26 -92 -48 -8 -25 -22 -63 -8
7450hNRKMj7j7M3rJ2l1K4N5n9n4P9l3l5K4K6n5Q0o5K5m1j6O6p3R0p5K3N1J3j25
$$ -8 -3 6 8 12 -5 -22 21 12 24 -7 17 72 13 -41 38 5 -30 -6 20 -35 45 -20 5 -36 -52 14 -59 31 -44 -21 30 43 -82
7483h2R5j4J7k9L2O5r8K5j8PM3o2K6j01O2K5PJ4kL1p9O0L9n5l2K8pN2k7l7M2l2
$$ -82 13 -1 16 -13 19 84 -14 11 -7 0 43 -19 7 -94 -32 -7 0 14 12 43 -36 24 63 8 -24 4 -3 49 22 -15 27 -5
7515eK9r9O4K2J8o6O7L4p9k3J8n4P0rJ5l3N4o5J6M4l1K9m5P4J9r4M8mj9P4q5N6
$$ -5 24 -75 -11 11 29 -37 30 64 -15 -38 -20 -74 -4 -13 2 -31 23 -42 -26 18 -13 16 -29 45 64 -30 18 14 -5 69 -16 40
7547D0n1K2OK3l7K8Rl4n4N6J5n8M1Kk1K0K5k5q3N9k1l2Q6m1k3N9M1j14M5L2l1
$$ 40 -11 11 17 40 3 31 40 6 -48 8 23 -35 6 8 -13 7 32 7 -76 -17 -38 -70 16 -25 -48 11 52 -62 -17 15 -16
7578a6l8P1j5K5m3j3Q9J6r7O5J8o5l8KN6j3K3J2m7M0j2K1k4Jj2o5O1l%K1l7L6
$$ -16 -54 17 2 27 -16 -29 60 76 -21 44 62 -3 -41 -39 17 4 27 39 -8 32 20 41 17 18 6 -59 2 -1 -1 20 -17 19
7610A9j3l2L5l1O7l2knM6r0k6O8k8J7J0Lj1K8m0j1O7%m1nJ9m0L8N6p0Kj7K9J1
$$ 19 6 -26 9 -22 45 13 11 6 52 -38 -64 4 -24 -7 3 6 -5 23 -17 -28 39 39 -2 -7 12 -28 10 66 -4 -2 -19 10 21
7643B1o9K7J2k4K8J5j7Rk1KL8p0M0K1j7K6n7P3k4j1j1J8lqJ2l2K4O5o7J9pJ9J9
$$ 21 -48 -21 -9 -33 -5 10 -7 2 -19 -17 21 -49 -9 12 -5 21 -36 37 13 2 -9 9 6 -2 10 -22 2 67 0 19 12 31 50
7676E0p6O1k5K3q3J7N4J0p5J6L0k0M0m1k7M0mJ4K8p5J0O2q5N0lK9J3o2O4k0L7
$$ 50 -26 35 10 33 -50 -33 21 31 -44 -28 2 -18 22 -19 -46 -6 -10 4 32 -43 -33 29 -56 -6 -9 20 33 -29 35 15 52
7707E2%l4%Rq%p2Q7k3l2rK8%J1kN7Ko5jL0L5l3l7j9k6L5kJ7K1r%k0rj3L3k5LK1
$$ 52 52 18 18 27 19 19 -53 34 11 -21 -30 -2 -2 9 7 64 66 1 0 30 65 32 -5 -24 -50 -15 -17 0 21 12 12 -8 -17 -30 3 -22 -19 2
7745BL8J9k8k3l9m0N3rJ5M0q2Q0n8L4m1N4QL2J7k8m9J0pN4m0Jl0O4p0Kk6L2K6
$$ 2 40 59 31 8 -31 -71 -18 -27 -12 28 -54 26 -32 2 -39 15 23 55 72 44 -5 5 -2 52 12 13 -17 47 -23 -21 -47 -15 11
7778A1m8P3l7MK0Nj1o1M9K7k4oJ7m2M0Ql7J9l6LNJ5pK8j8k7lkK0N4rM0p2L0L4
$$ 11 -37 36 -1 3 23 28 17 -44 5 32 8 2 19 -23 17 25 -12 7 -29 -26 -21 -6 -13 15 -3 -30 -33 -35 -15 39 30 70 -2 28 62
7813F2q0PjKnJ4l9O6k2Mk0j5J5k7N9Km5J0L5nm4Ll5O7M6n1N2m5l9Q9k6K0p3%j3
$$ 62 -18 -11 -12 -10 -15 -1 -40 26 4 8 -12 -27 -12 -39 20 22 -23 -13 22 17 -27 -24 -59 8 54 3 55 10 -29 60 34 54 -19 -19 -32
7848c2K7L3K5p0K1pj5QK7j4l4j6K5L2m1O8k0o2ML2j2j2j7J5K5N7m1k8M9q3M4l
$$ -32 -5 28 53 -17 4 -3 -18 -10 17 3 -31 -47 -22 10 -31 37 17 -45 -41 -9 -21 -33 -50 -35 -10 47 6 -22 27 -56 -12 -15
7880a5L7pn2J5j2L8J6J8l9K4L2p5O9n6K1lj0J2k5K1k6k7L4Rl5J6K6l0k2M7%L0
$$ -15 22 15 -37 -22 -34 4 20 38 -1 23 55 -20 49 -7 14 11 1 13 -12 9 -17 -44 -10 -1 -36 -20 6 -24 -46 1 1 31
7912C1o4Q8o3M8p3l1P2J9l9K3J0NJ4k4J1lmJ7K5l0K4J3p8Ql2L4k1L6j5QO1p7L8
$$ 31 -33 55 -8 40 -33 -64 8 27 -12 11 21 26 40 16 27 24 20 37 62 32 56 69 -9 -1 -33 1 -20 16 1 9 70 -7 31
7945C1k9J2l5L1l4J0oJ0j2J5l4M2J4j6J0J5l0L3nj6K8k1n1kJ03p8L5l6M7n4P4
$$ 31 2 14 -21 10 -24 -14 -20 -10 -22 -7 -41 1 15 -1 9 24 -6 27 22 6 34 13 -38 -40 63 -15 20 -16 31 -23 51
7976E1r2L7m0M2K7j6j8K3ql0K0mJ9j5N5o9m7R4j2j6k6N3l7j7N5J3om2K2j0L2K
$$ 51 -41 -4 -44 -2 25 9 -9 14 6 -24 -4 -8 11 -4 51 -18 -65 29 17 1 -25 28 -9 -26 29 42 36 -6 16 6 38 40
8008D0m2p3M0k8M6l0R5p9L7K4l3j2mQ6k6k7K1J6n9OL2J8j9l5M1o0K4j4n3P4O6
$$ 40 -2 -75 -35 -63 -17 -47 48 -31 6 30 -3 -15 -19 67 41 14 35 51 -8 -2 30 48 29 -6 35 -25 -1 -15 -68 6 72
8039G2m6l3M5k2m7L1j1k6J9J6K5L0qj9l8k0K8R1p8OL5l7L4l6k2N6l8J1Qm1KL9
$$ 72 26 -7 38 16 -31 0 -11 -37 -18 -2 23 53 45 26 -12 -32 -4 87 9 15 50 13 47 11 -11 45 7 18 26 -15 -13 26
8071B6n6oN8j3l0p2K7R4qn9RK4p2J16p6O0J8k5N%K0m1L6ol5j8N9n1L2J3p3N3j8
$$ 26 -30 -36 22 9 -21 -93 -66 28 20 -39 -30 -6 -78 38 -38 22 40 15 20 20 40 -1 35 29 -6 -24 35 -16 16 29 -44 9 -9
8104iJ8m9K5N9l2PJJ3l2po1L1M5k8J9l9N2l4j7O7nj6l2L6K0oL2r7P2n8JN8L4k9
$$ -9 9 -40 -15 44 12 19 20 33 1 -6 -67 -36 9 -19 0 -39 13 -21 -38 29 24 8 -24 12 32 26 58 -39 33 -25 -24 34 68 39
8138C9k2K0o8N4n5N7j9J9OJ0n9J9k1K1j8J3K4Kj6J2J2m0Qp0J6P8l9M0l9N3p3O5
$$ 39 17 37 -31 23 -32 25 6 25 31 41 -18 1 -20 1 -17 -4 20 22 6 18 30 -10 -2 -72 -56 22 -17 23 -16 37 -36 29
8170B9r7N8J4k1J1l3j5O3O1k7j7j2K3l0poN8l7o0L3O
$$ 29 -68 -10 4 -17 -6 -39 -54 9 70 43 26 14 37 7 0 -6 52 15 -45 -12 -6
8191f
$$ Imaginary data points
##PAGE= N=2
##DATA TABLE= (X++(I..I)), XYDATA
0@%%%%%%%%%%%%%%%%%%%%%jRj6J6j6J6j6J6k4L2l2L3m1M8n5O3o5P3q3R1j04J19
$$ 0 0 0 0 0 0 0 0 0 0 0 0 0 0 0 0 0 0 0 0 0 0 -1 8 -8 8 -8 8 -8 8 -16 16 -16 17 -24 24 -31 32 -33 40 -43 48 -56 63
43F3j28J38j54J70j86K08k32K55k79L06l38L75m15M58n13N76o45P27q29R59j128
$$ 63 -65 73 -81 89 -97 111 -121 134 -145 161 -177 198 -217 241 -272 304 -341 386 -443 516 -612
64f12J357j683K188l092N184j9442k514L9085p570p314L688p513j1956J084M507
$$ -612 745 -938 1250 -1842 3342 -16100 -18614 20471 12901 5587 9275 1762 -10194 -9110 -4603
79d603O593O052P580p962j1935P39n889n156J5275J732k756J4028l589j6169P17
$$ -4603 1990 8042 15622 7660 -4275 -3536 -9425 -14581 694 2426 -330 13698 10109 -6060 -5343
94e343j481k900O439O391M937K945k215p790j0187L951N280n972Q997J0682j1552
$$ -5343 -6824 -9724 -3285 3106 8043 10988 8773 983 -9204 -5253 27 -5945 3052 13734 2182
109B182m105J639r468J346P000k38N307N129k198m790m832o85k049P06R462L30
$$ 2182 -1923 -284 -9752 -8406 -1406 -1644 3663 8792 6594 1804 -3028 -3713 -5762 -5056 4406 4736
125D736j557O777q377j0984N437L88j166P325J144o39O67m989m017q89L351N054
$$ 4736 3179 9956 1579 -9405 -3968 -3580 -4746 2579 3723 3084 3751 -1238 -5255 -6144 -2793 2261
141B261j105L230L444o729j936p37o416M799N753k085L437N54n166j066k683j603
$$ 2261 1156 4386 7830 1101 -835 -1572 -7988 -3189 2564 479 3916 4470 -696 -1762 -4445 -6048
157f048L511K999L656l60k696J498l929l675M436m59J034O171l010k511R99n086
$$ -6048 -2537 462 4118 3758 1062 2560 -1369 -5044 -608 -1067 -33 6138 3128 617 1616 -3470
173c470j405K501L90L134J648J20l25m956o62J630k463M321L870k780J890n41
$$ -3470 -4875 -2374 -1984 1150 2798 2918 2593 -2363 -3025 -1395 -3858 463 4333 1553 3443 2902
189B902n398P91j10n21L682N07L41L3l204K2j268k327M113J672j07L032k500k378
$$ 2902 -2496 -1705 -1815 -2336 1346 1853 2194 2227 -977 -955 -2223 -4550 -437 1235 1128 4160 1660 -718
207g18Q71k993O65K813j84K713L4l531K53j710j131K404q36J542K849k208q7q09
$$ -718 153 -2840 -2175 638 454 3167 3201 -330 -77 -1787 -2918 -514 -1350 192 3041 833 746 -63
225f3k840J919M00m04L336l44n20O44m132o19J767p86K428R88j597J634j782k636
$$ -63 -2903 -984 -584 -988 2348 2004 1484 2128 -2004 -2623 -856 -1642 786 1774 177 1811 29 -2607
243b607J248n50J177K199j204J350J19k543J036j329j517L725l1n13J900k462
$$ -2607 -1359 -1909 -732 1467 263 1613 1732 -811 225 -1104 -2621 1104 1073 560 2460 -2
259bj291N76j774J262J558J93J707j534j235J080k419M95K385j851J562J959k434
$$ -2 -1293 -717 -2491 -1229 329 522 2229 695 -540 540 -1879 -1384 1001 -850 712 2671 237
276B37L56l56k095J337J27L30J541j130L57j57k858J249O58n32K868m55j521J617
$$ 237 593 237 -1858 -521 -394 -64 1477 347 704 547 -2311 -1062 -404 -936 1932 1477 -44 1573
294A573j565j184J153j107J050J564j279O79m24j301R32j441j00K296p15P22O99
$$ 1573 8 -1176 -23 -1130 -80 1484 205 884 460 -841 91 -1350 -1450 846 131 853 1552
311A552k624N69N26j543J712M62l45J654j512j124P39j212P38N26j031J746oj441
$$ 1552 -1072 -503 23 -1520 192 654 309 1963 451 -673 66 -1146 -408 118 -913 833 827 -614
329f14J024j339o42J948q29M44J466j239M07l63j683J122j0KJ758j202m06J085
$$ -614 410 -929 -1571 377 -452 -8 1458 219 626 263 -1420 -298 -308 -306 1452 250 -156 929
347I29j727m0P73r79J334K74r75J178q63o62J149j242L20J607r83Q71R5j886N90
$$ 929 -798 -838 -65 -1044 290 564 -411 767 -96 -758 391 -851 -531 1076 93 964 1059 -827 -237
366b37k01m66J441n57J90J127j601m5M16j076J381K6j027J442l70n60R23j411
$$ -237 -438 -904 537 -20 170 1297 -304 -349 67 -1009 372 398 -629 813 443 -117 806 -605
384f05j21J354q90O93M23j030O58n90j100R08j46P28R85j661M39P21j591O83L58
$$ -605 -726 628 -262 431 854 -176 482 -108 -1208 -300 -446 282 1267 -394 45 766 -825 -142 216
403B16r55J316r6p38Q01o25n0L39j109Q71L96o91J132q11j121J295p26k45J551
$$ 216 -739 577 481 -257 544 -81 -131 208 -901 -30 366 -325 807 -4 -1125 170 -556 -801 750
422G50n99J70M54j152L97l2n68J024m80l13R94q31K42M00j411N88N87q36J115
$$ 750 151 321 775 -377 20 -12 -580 444 -36 -349 645 -186 56 456 -955 -367 220 -616 499
441D99q7r79R17n60n15Q96m14N78N81j208L26Q9m70P82p86j79J342q45j51P95
$$ 499 412 -567 350 -210 -725 171 -243 335 916 -292 34 123 -347 435 -351 -530 812 -33 -184 611
461F11j060L30M42j110P79L18k94P47q52m15Q19n97M07L80p70Q14j47j109R41
$$ 611 -449 -119 323 -787 -8 310 16 763 -89 -504 315 -282 125 505 -265 549 402 -707 234
480B34k46l86J011p58j23Q88p19J21J94q59N73J82k86P55n70q4M99r46M31N44
$$ 234 -12 -398 613 -145 -268 620 -99 22 216 -643 -70 112 -174 581 11 -73 426 -520 -89 455
500D55r56P99K75j169O17k1m11P08m73j24P43m87L11q2p78P64k71n43J073m57
$$ 455 -501 298 573 -596 21 0 -411 297 -176 -300 443 -44 267 185 -593 171 -100 -643 430 -27
520b7j09R13j082j99O78m88L67J37o87O38r4n04N42l73K64N09p14M02K40p31P61
$$ -27 -136 777 -305 -504 174 -314 53 190 -497 141 47 -457 85 -288 -24 485 -229 173 413 -318 443
541D43l04r33R77j23k40P35o48j06N92o84J34J98j30M05m03k40O50o99L31P29
$$ 443 139 -794 183 60 -180 555 -93 -199 393 -291 -157 41 -89 316 -87 -327 323 -376 -45 684
561F84j061K90O93p99L41J98p44N38j17l25M61j02J39J15p06N22j52m15R73m11
$$ 684 -377 -87 606 -193 148 346 -398 140 23 -302 159 57 196 311 -395 127 -25 -440 533 122
581A22o66J050m86l51P28n05M4M55n07M8J72j07K04n64J25N05o49N21M37j123
$$ 122 -544 506 20 -331 397 -108 -64 391 -116 -68 104 -3 201 -363 -238 267 -382 139 576 -547
601e47N30M42r08N20K23n37N08j05l40K49j01K46n1n23N32r3m79R01o31m81J003
$$ -547 -17 425 -483 37 260 -277 231 126 -214 35 -66 180 129 -394 138 45 -434 467 -164 -645 358
622C58m60k75P17l59N1K17n08J48M0J3M75n86Q6L76o04M10K41q55N68K48o93M78
$$ 358 -102 -377 340 -19 32 249 -259 -111 -71 -58 417 -169 -83 293 -311 99 340 -515 53 301 -392 86
644H6O9l88M09k87m4L39j87L33j55m71N20k67k52O32m65j6N93o72J2M71m77L25
$$ 86 155 -233 176 -111 -155 184 -3 330 175 -296 224 -43 -295 337 -128 -144 449 -223 -211 260 -217 108
666A08Q7m76L11k6OL67n82J12L58m57K76J12n08N95k65n23O60j62j59M99m31j36
$$ 108 195 -281 30 4 10 377 -205 -93 265 -192 84 196 -312 283 18 -505 155 -7 -166 333 -98 -234
688b34L44k90L16n6l58M34j76q2M05m23J08L82p65K98L54n31M44n6m35L28j13
$$ -234 110 -180 136 80 -278 156 -20 -102 303 -120 -12 370 -395 -97 257 -274 170 114 -321 7 -106
709a06N9K19k86J38K28m46L08o7k68N47l69l43O05k41n1L67n25N4K90k66K85j33
$$ -106 -47 172 -114 24 252 -194 114 47 -221 326 -43 -386 219 -22 -73 294 -231 -177 113 -153 132 -1
731aj84L81l10j01M52l45K41K28o29L26N6k99L93j69l15M04k05k8L22l66K39R6
$$ -1 -185 196 -114 -215 237 -108 133 361 -268 58 114 -185 208 39 -276 128 -77 -105 217 -149 90 186
753A86m24L11J7j69M13m13j11L44k84J53K08m61K64J29l80K76j5j97L69l31q4
$$ 186 -238 73 90 -79 334 -79 -190 154 -130 23 231 -230 34 163 -217 59 44 -153 216 -115 -199
774a99K94k22K66k7m17L91m4k41M79k46l01N04l16j04L88l49J58M0l05K79n3o4
$$ -199 95 -127 139 112 -305 86 42 -199 280 34 -267 237 -79 -183 205 -144 14 54 -251 28 -25 -89
796h9L51m29O3K94l44J98J73m60K96J37m58L12Lj04K74l01m3J73j64K22nl87M32
$$ -89 262 -167 -104 190 -154 44 217 -243 53 190 -268 44 47 -57 217 -84 -127 46 -118 104 99 -288 144
819A44j32k60M39k16o7L80l77o8L47k48J74n5k87K91p7m7K93l64O7K34l64J88
$$ 144 12 -248 191 -25 -92 288 -89 -157 190 -58 116 61 -226 65 -12 -59 234 -130 -63 171 -193 -5
841eJ89m24L91mk95K04j8m1K08k74N8J19k15K22L9l55L06m8k38L54k69N4K34l41
$$ -5 184 -240 151 147 -148 56 38 -3 205 -69 -11 108 -107 115 154 -201 105 57 -181 173 -96 -42 192 -149
865a49L1K16k50L28j07k65L75j79r4K81k81J1K12l09K05K9k46L39r3k86L02j78
$$ -149 -118 98 -152 176 69 -196 179 0 -94 187 -94 -83 129 -180 25 54 -192 147 54 -232 70 -108
887a08Q3K03l23J21J56l00K21N8k35L01j40k42K46j57O7K16l76J62J02j75K83
$$ -108 -25 178 -145 -24 132 -168 53 111 -124 177 37 -205 41 -116 -49 167 -209 -47 55 -120 163
908A63n9k96L49j34j29K55j90J02Q4k87J59J5j63K62j71j05K78k65J12J78k85
$$ 163 104 -192 157 23 -106 149 -41 61 145 -142 17 32 -131 131 -40 -145 133 -132 -20 158 -127
929a27J35J54k97K24n9j34L25k66j02K27k13J73J40l06J58M9j52K63k19j18L12
$$ -127 8 162 -135 89 30 -104 221 -45 -147 80 -133 40 180 -126 32 81 -71 192 -27 -145 167
950A67k42m3K08j39J55Q9k94J56l5m8K26k37p7K03j76P7R7k34K39k3k59K48l4
$$ 167 -75 -118 90 -49 106 195 -99 57 22 -26 200 -37 -114 89 -87 -10 87 -147 92 69 -190 58 24
973B4m9K00k69p0K81k31K04n4j91J93K0k40K51j40l8K22k17L7P8j88K61M8k84
$$ 24 -25 175 -94 -164 117 -114 90 36 -155 38 58 -182 69 -71 -109 113 -104 -67 11 -177 84 132 -152
996a52J92m8p6L08k64p1K37k08O4R2k17K31K9k16J17l7k4K52l19K3K41k29K16
$$ -152 40 -8 -84 224 -40 -111 126 -82 -18 74 -143 88 117 -99 18 -19 -43 209 -110 -87 154 -75 141
1019A41%k62J83J9j84J47l7o2K18k74M3J92k66K54J9k37J65n1j28K61j73M2J22
$$ 141 141 -121 62 81 -103 44 7 -55 163 -111 -68 124 -142 112 131 -106 59 8 -120 141 -32 10 132
1042A32k39J00O9j45K67j66j38K02k02K5K14k55O7J65k15J33O7j64J98n2j76J51
$$ 132 -107 -7 62 -83 184 18 -120 82 -120 -95 119 -136 -69 96 -119 14 81 -83 115 63 -113 38
1064C8r9J73K2k97K41j8k87L24l4k65K99j02j82K51j18J4J44k07O8P6j03J19q5
$$ 38 -61 112 134 -163 78 60 -227 97 63 -202 97 -5 -187 64 -54 -40 104 -103 -35 41 -62 57 -28
1087b8j03K01j44R5R4k71J38J27k75J90J8j73K17o8j67J94r1P7R1j82P2M4j41
$$ -28 -131 70 -74 21 115 -156 -18 109 -166 24 42 -131 86 18 -149 45 -46 31 122 -60 12 56 -85
1110h5K05j22j27L18k04j60L34j84N3J11k25J03m1K6J19j69l1J83k36J72J53l54
$$ -85 120 -2 -129 189 -15 -175 159 -25 28 139 -86 17 -24 2 121 -48 -79 104 -132 40 193 -161
1132a61K40J21k95J03J6p6J49o5m2L5q3P5Q5k02K38r3j22J63j58n8K94k61o1K14
$$ -161 79 200 -95 8 24 -52 97 32 -10 25 -58 17 102 -100 138 45 -77 86 -72 -130 164 -97 -158 56
1156E6p5N3j5j37J38m9j8J01j19J7J37k13J05Q9j77J49R8k44J56l4o5J21o6kL2
$$ 56 -19 34 19 -118 20 -29 -47 54 -65 -48 89 -124 -19 70 -107 42 140 -104 52 18 -47 74 8 6 38
1181C8o4Q0J2k07K46l9j79J80j08m5K31j72r2K03j29R5J5j35J29j01k8J27j32
$$ 38 -26 54 66 -141 105 66 -113 67 -41 -86 145 -27 -119 84 -45 50 65 -70 59 -42 -70 57 -75
1204g5O1J06j81Q6Pm7J15Kj66J69r0k3J32j22K0J49j55L3j6p4J59p5r6J27q0k
$$ -75 -14 92 -89 -3 4 -43 72 74 -92 77 -13 -36 96 -26 -6 143 -12 21 5 -69 90 15 -81 46 -34 -36
1230c6J31j67P4K3j12J17j1r8J45r3j9Q9j29J06R4j79P8l3k4J15m0j26R7J2o1
$$ -36 95 -72 2 25 -87 30 19 -79 66 -27 -46 43 -86 20 114 -65 13 -20 -44 71 31 -95 2 14 -47
1255d7J21j93P2J75k32J12K7j39K53j45m1J24j52Q8R7k06MJ29p9O8k9o4J40j15
$$ -47 74 -119 -47 128 -104 8 35 -104 149 4 -37 87 -65 23 120 -86 -82 47 -32 36 7 -57 83 -32
1279c2j7J22j20R7Q5k04R8J1j10J53q4p5J43p0O6L2j40J20j0j58J18k4o7J38o5
$$ -32 -49 73 -47 50 135 -69 29 40 -70 83 -1 -76 67 -3 63 95 -45 75 65 -93 25 1 -66 72 7
1304Gk0J21j75N8N6r5J09k5r8J24p1l8J67j38k9J37j27Q6P3k17N4KNP2n7j1Q4
$$ 7 -13 108 -67 -9 47 -48 61 36 -62 62 -9 -47 120 -18 -47 90 -37 49 122 -95 -41 -39 -34 38 -19 -30 54
1331E4j05J4K12k40J49j5j59O6nQO8n0j6R2j30Q0K3j29J01j4j04J88j15o5J91
$$ 54 -51 -37 175 -65 84 69 -90 -24 -29 -21 47 -3 -19 73 -57 23 46 -83 18 4 -100 88 -27 -92 99
1356I9j65pQ6q8P0N5j59J88k1r0Q6r9M0Q0j50O4J2o5R5N4j60J10p3O7R3j36l0
$$ 99 -66 -73 13 -75 -5 50 -109 79 58 -32 54 -45 -5 75 -75 -11 1 -64 31 85 -75 35 -38 29 122 -14 -44
1383d4J01j49J44m2n7J41m0p1N7l4k0P3r4L7L9j20N7O7j10J20Lj26J34j06N1J05
$$ -44 57 -92 52 10 -47 94 54 -17 40 6 -14 59 -35 2 41 -79 -22 45 -65 55 58 -68 66 -40 11 116
1409A16j48qO0mK9K5j59J20ro1O3o6P8L6j30K2M3o8J65o2r6P9n9J4J46j27l3L6
$$ 116 -32 -40 20 16 45 70 -89 31 22 -39 24 -42 36 72 -58 -36 7 -61 104 42 -54 25 -34 -20 126 -1 -34 2
1437Bp3P8Nq2J34m0q6J11j12R1P3j78M9R2j73J71o5n7Q5l6K1L5j07M2P1j47J47
$$ 2 -71 7 12 -70 64 24 -62 49 -63 28 101 -77 -28 64 -109 62 -3 -60 25 -11 10 45 -62 -20 51 -96 51
1464E1no4P9q4l4N4k8N9N3r1M9K3p6O4n1l3J47q8n8P1q4Q5L1n9l2O3j28J47m0
$$ 51 46 -18 61 -23 -57 -3 -31 28 81 -10 39 62 -14 50 -1 -34 113 25 -33 38 -46 39 70 11 -21 42 -86 61 21
1493B1l4J12j40K9O0j19J02K9j92J40N6r2L7k0l5R3l9m7N2p9J42k3l6Om1K4P1
$$ 21 -13 99 -41 -12 48 -71 31 60 -132 8 64 -28 9 -11 -46 47 8 -39 13 -66 76 53 17 23 -18 6 77
1520G7q1n8Q9q5O3J6q6J21j5j09J41j33JJ25p4KQ0j26R5Qn0j3L7n0J02o8k3O4
$$ 77 -4 -62 27 -58 5 21 -65 56 41 -68 73 -60 -59 66 -8 -6 74 -52 43 51 1 -12 25 -25 77 9 -14 50
1548E0k7p4Q6q5N2O6j01J14q7OJ02j06o6J63j29J8M0l4L1R4j33J13j73Q0O8j02
$$ 50 23 -51 35 -50 2 68 -33 81 -6 0 102 -4 -70 93 -36 -18 22 -12 19 113 -20 93 -80 0 68 -34
1574c4m5J02r8N5K7n1J25o0qrj5PP2p2j6J03j12Q4l1o4O7o5qP7q4K3P6j46P5O7
$$ -34 -79 23 -75 -20 7 -44 81 21 13 4 -11 -4 68 -4 -20 83 -29 55 24 -40 27 -38 -46 31 -53 -30 46 -100 -25 42
1604D2j27J59n1q3M9j1L4N7j21Q2nj2j6K0l3M4k0n3Q6j18M5Q9p6j7N3j16J53n9
$$ 42 -85 74 23 -60 -11 -22 12 69 -52 30 25 13 -3 17 -16 28 8 -45 41 -77 -32 57 -19 -36 17 -99 54 -5
1632el2J18j09N6K8p5M1Kk5O7m3r6J37m8k5J17n8Nlj03R3l1m4J8m7L0P0j2l8J01
$$ -5 -37 81 -28 28 56 -19 22 24 -1 66 23 -73 64 16 -9 108 50 55 52 -51 42 11 -33 -15 -62 -32 38 26 -12 89
1662H9j55J01K3p7pK9k9O9m8l2M3j4M1L1o8J04o8j4qm9L6M9l2l2Q1m4p0J00n0
$$ 89 -66 35 58 -19 -26 3 -26 43 -5 -37 6 -8 33 64 -4 100 32 18 10 -39 -3 46 14 -18 63 19 -51 49 -1
1691aP3K2j48J16q1j4N9n1N0k7p8R1M0j03J0O9q8Q5n3M6k7k9j5Q2o7N5rq8J08
$$ -1 72 94 -54 62 -19 -33 26 -25 25 -2 -80 11 51 -52 -42 27 -61 24 -29 17 -10 -39 -54 28 -39 16 7 -81 27
1720B7n8jP3n5k5P7p1P8k8r0J27j5j05P7jOM6l3n8O6p5L5np8J30p4m1Q2p1N7K6
$$ 27 -31 -32 41 -14 -39 38 -33 45 17 -73 54 39 -66 11 10 16 62 29 -29 37 -38 -3 -8 -86 44 -30 -71 11 -60 -3 23
1751B3o1O7J1r2J46m5l6l1o5Q5N3j07M0N9q1N2J6q0O8K4o1K6m2K8P9j17L5M3q1
$$ 23 -38 29 40 -52 94 49 13 -18 -83 2 55 -52 -12 47 -34 18 34 -46 22 46 -15 11 -31 -3 76 -41 -6 37 -44
1780d4P6Po5O0l2m3M1k9O2l3o3L3J4QlK4k8N8o4j4N7k4L6Qj04L0N2k3O9m4l0R6
$$ -44 32 39 -26 34 2 -41 0 -29 33 0 -63 -30 -16 -8 -11 13 -15 43 -21 -35 22 -2 34 42 -62 -32 20 -3 66 22 -8 88
1812H8r6n1R5o9N1J9j03P1NK0j9k1K5K0o1L5L9p5O0l9j1Q2n0m9N0K9qm5q2R3Q
$$ 88 -8 -59 36 -33 18 37 -66 5 10 30 11 -10 15 35 -26 9 48 -27 33 -6 -17 65 15 -34 16 45 37 -8 -90 3 11
1843A1J9j1nk9J00k1r7Q9j13K0R8p9L7K0n7O2qlN7n7k1j6rJ3J04j14L1J2r1O0
$$ 11 30 19 14 -15 85 64 -33 56 -57 -37 61 -18 19 39 -18 44 36 33 90 33 12 -4 -13 0 104 -10 21 33 -58 2
1873Bm2j9Q8j7K6k4o4J09n0o6P6p0K5J17n2l7J3k0K0K0o9L5N8o3K2k7J5R3r8K9
$$ 2 -40 -59 29 12 38 14 -50 59 9 -57 19 -51 -26 91 39 2 15 -5 15 35 -34 1 59 -4 18 -9 6 99 1 30
1903C0M7j26P4M4q1J6n0M2N3l0m4O3p7L2nm0M9O4j35Q4j9NP2k0m2k4j8j2O4n8
$$ 30 77 -49 25 69 -12 4 -46 -4 49 19 -25 38 -39 -7 -12 -52 -3 61 -74 10 -9 -4 68 48 6 -18 -36 -48 16 -42
1933d2P2j0r6M3L0J7j0K0n6P6m5k6M5p7Q5M9p0J7n8J6j0n8Q8P3j30M9O9j24O6
$$ -42 30 20 -76 -33 -3 14 4 24 -32 44 -1 -27 18 -59 26 75 5 22 -36 -20 -30 -88 0 73 -57 -8 61 -63 3
1962CRl5K1o1P4N1j00R1Rj44J11J8o7O6k8k5N9o1L3o4mO0Jj5K1o9J5R8j23K7L6
$$ 3 12 -23 -2 -63 11 62 -38 53 62 -82 29 47 -20 46 18 -7 52 -9 24 -40 -44 16 17 2 23 -46 -31 67 -56 -29 7
1993Gm8J9K1k4J08j51O7P1p3j9M4q9P3K8k5J9k2J8Mj4PK7j09Q9j2m8O5k6j5J5
$$ 7 -41 -22 -1 -25 83 -68 -1 70 -3 -22 22 -67 6 34 9 28 6 24 28 14 21 48 -61 28 16 -32 33 7 -8 7
2023GQq3J56j02QQ5j41R6m1K5J4l8m6O4K3k7J1N9o0K5p5PJ5N5ko5qJ3O9l1qm4
$$ 7 15 -68 88 -14 -6 79 -62 34 -7 18 32 -6 -52 12 35 8 19 78 18 43 -32 -25 -10 45 43 -22 -30 -17 52 21 13 -31
2055c1Q6l0o1N7J3m1Mo3L3N9r0O3O3j17J27p6o2O3Oqk7K6K5P0r7K3j9m5M8LlL1
$$ -31 55 25 -36 21 34 -7 -3 -66 -33 26 -64 -1 62 -55 72 -4 -66 -3 3 -5 -32 -6 19 89 -8 15 -4 -49 -1 2 -1 30
2087C0q0K6M4m1N3M9j28M4M5r3N3J3j5J6m6O4Q5j11j5L0p0Q1Oo4J03m0l5Ql6J2
$$ 30 -50 -24 20 -21 32 81 -47 -3 42 -51 2 15 0 16 -30 34 119 8 -7 23 -47 34 40 -24 79 39 4 12 -24 -12
2117a2K7k5Oqk1P2m9K1L8n6N3qm0K8m2k5J3mMN1L3ok2l9K4L6Mq8M6j3l2Q2j7K6
$$ -12 15 -10 -4 -12 -33 39 -10 11 49 -7 46 38 -2 26 -16 -41 -28 -32 -28 23 56 50 28 -11 13 49 53 -35 11 -2 -34 48 31 57
2151E7n1M3k0j3k2O2o8RK0m6P7o7qM8J5n5l6N0j7O9j01O7o0j3Q4mo3J08o8lM2
$$ 57 6 49 29 16 -6 56 -12 -3 17 -29 48 -19 -27 21 36 -19 -55 -5 -22 47 -54 13 -47 -60 24 20 -43 65 -3 -6 36
2182C6j8j9j5p0P6L5k5M5n2l9P1q4Q5Pl2K0JrK9k1LK4l9Pj8k9j5P2qM5j06K1M7
$$ 36 18 -1 -16 -86 -10 25 0 45 -7 -46 25 -59 26 33 1 21 22 13 42 21 24 48 9 16 -2 -31 -46 26 18 63 -43 -22 25
2215B5jl8M2k2m8P4n5L5m9N8l0M2rJ0k5j8J8nnL1n0JN0p7P4k2o0R7j05O7L4q9
$$ 25 24 -14 28 6 -42 32 -23 12 -37 21 -9 33 24 34 9 -9 9 4 -1 30 -20 -19 31 -46 28 6 -54 43 -62 5 39 -50
2247e0kO9p5N8M4n2Lj6L3Kl6O3L2r6K7k2K7j7oPK6p4N0L2m1O8p0pO6m6j6pJ8N0
$$ -50 -52 17 -58 0 44 -8 -5 -21 12 14 -22 41 73 -23 4 -18 9 -8 -14 -7 19 -55 -5 27 -14 54 -16 -23 43 -3 -19 -26 -8 42
2281D2j1p6N3rK3p9P8k5P1o1n2Q1l1%N5j26O8L3m7M6k2l6N0l2n5Q4m1M7l6J1L5
$$ 42 31 -45 8 -1 22 -57 21 -4 67 6 -46 35 4 4 59 -67 1 34 -13 33 11 -25 25 -7 -62 22 -19 28 -8 3 38
2312C8p4mj0K5P9m6J0k2O3j41J03j2p8R5qj7N6r6N6K2l9Nj8PLL6m5N9o5N6l5m6
$$ 38 -36 -40 -50 -25 54 8 18 -4 59 -82 21 9 -69 26 18 1 57 -39 17 39 0 5 -13 -6 -3 33 -12 47 -18 38 3 -43
2344d3O8l3Ol1M8l7L0kj8Q2l3Jm7K7o6J00p2K0J7JM2Rm8ploj4K9l2k8j9N8J1j2
$$ -43 25 -8 -2 -33 15 -22 8 6 -12 70 37 38 -9 18 -48 52 -20 0 17 18 60 69 21 14 11 5 -9 20 -12 -40 -59 -1 10 -2
2378bJ1k3k7K3%jM1n3K4R1p6nk7K7J5J7k8j4m0N0O0r8NL8K0M0q2L3M0p2J8Qp9
$$ -2 9 -14 -41 -18 -18 -19 22 -31 -7 84 8 3 -24 3 18 35 7 -7 -47 3 63 -35 -30 8 28 68 -14 19 59 -13 5 13 -66
2411f6M2L6p4J47o6p1J11j26mN3mL6l6k9Q7K5o6K3n5M1on2P2p0J7K2O0q7L5L0
$$ -66 -24 12 -62 85 19 -52 59 -67 -71 -18 -22 14 -22 -51 36 61 -5 18 -37 4 -2 -54 18 -52 -35 -13 47 -40 -5 25
2441B5p0P2n8J2M0l2K6kMl7P1q0J6K1n5P2l7mN2j18R6l8n2P4Q4q5L1j7l9j2NM
$$ 25 -45 27 -31 -19 21 -11 15 13 17 -20 51 -29 -13 8 -47 25 -12 -16 36 -82 14 -24 -76 -2 82 -3 28 11 -28 -40 -35 -31
2473c1N4o5K2LK2P7m6l1m6J9PO9l1J4O5p6n7N3j2L3k1j0N7q6K7P3j00LO0nk8j9
$$ -31 23 -42 -20 -17 5 82 36 5 -41 -22 -15 54 23 37 102 26 -31 22 10 43 22 12 69 -17 10 83 -17 -14 46 41 13 -6
2505fm3O8l3OM0k9M2ko9L0j0LO0m9rL0p9K4M2p9J07n5QK2pl5O4n5K0O4j33P0O
$$ -6 -49 19 -14 -8 32 3 45 43 -26 4 -6 -3 57 8 -1 29 -50 -26 16 -63 44 -11 -3 19 12 -23 41 -14 6 70 -63 7 13
2538A3p9J34j33N1M0k2o4J03n5n1J21r8N9N3n9lj6j5M0m9K9L5lm5L8m9LJ7K1Q
$$ 13 -66 68 -65 -14 26 4 -60 43 -12 -63 58 -40 19 72 13 10 -6 -21 19 -30 -1 34 31 -14 24 -25 -22 -5 16 24
2568B4j1m1O3o7NL9k9Q1r0pO9k4NJ0p0M8j1lM7P2j76P9ln3R3r7L5nPj6Qj6J15
$$ 24 13 -28 35 -32 -27 12 -17 64 -26 -33 36 12 17 27 -43 5 -6 -9 38 110 -66 13 10 -43 50 -47 -12 -17 -10 -26 -18 -34 81
2601H1n1p2Q7lo8L3m8L2N1l9j2L8j3j1L8q1M7J5L0m0k7j9J2j5K7k2L5K7k3l2N7
$$ 81 30 -42 45 42 -26 7 -41 -9 42 3 -9 29 16 5 43 -38 9 24 54 14 -13 -32 -20 -35 -8 -30 5 32 9 -23 34
2632C4qkM2n1o4J22j07N4l0p9O6j0k5O6m0K9L8l4mOo%K7j1m0M4J1k3m2K0L8rq
$$ 34 26 24 66 15 -49 73 -34 20 -10 -89 -23 -33 -58 8 -32 -3 35 1 -3 3 -3 -3 24 13 -27 17 28 5 -37 -17 21 12 4
2665DJ1nl4K9RJ4J4p8RQK4n4L9K5L1p2J9lqN2l4K1Jk8j5O1JQj7k0K1o4L6N0n3
$$ 4 15 10 -24 5 14 28 42 -36 -27 -19 5 -49 -10 15 46 -26 -7 -10 -18 34 0 21 22 -6 -21 40 41 49 32 12 33 -31 5 55 2
2700BQJ3k2k4M5J2j1m0l0M0J5PPm5O0K8o2N2l3l6K9jp4O7n0L4N8p7L1j3MK0l6
$$ 2 10 23 1 -23 22 34 23 -17 -47 -7 8 15 22 -23 37 65 3 55 22 -14 15 14 -60 7 -43 -9 49 -28 3 -10 -6 14 -22
2733b2k4M4k9lO4ll6P0r5M1J3n2Q5q7N3K3n3L4K2j04K7N3n7Q7m7jM0m3K0Qk8N5
$$ -22 -46 -2 -31 -34 30 27 -9 61 -34 7 20 -32 53 -34 19 42 -11 23 45 -59 -32 21 -36 51 4 3 43 0 20 28 0 55
2765E5n3m9L0M9k0Pl0k7O0p3N3j1n0R8j1k3M3Lo5Q3q2O5N2j02qJ7l5oM0j3j0l7
$$ 55 2 -47 -17 32 12 19 -11 -38 22 -51 2 -9 -59 39 28 5 48 51 -14 69 -13 52 104 2 -6 11 -24 -30 10 -3 -13 -50
2797e0N0J2J6Jk6Qo4O9p0L6j5M0j5j2K5Nm3L1J3jk9K0mj2K9Lm7pP8k4n0O7j6k1
$$ -50 0 12 28 29 3 11 -53 16 -54 -18 -33 7 -8 -20 5 10 -33 -2 11 10 -19 1 -3 -15 14 17 -30 -37 41 17 -33 34 18 -3
2831cJ2Ok5kJ2L2m7J1k2J5N6m3Qp0J11q7j9j7Q3J1k3k4L0M7p6J6N6l1pk1j4L0
$$ -3 9 15 -10 -12 0 32 -15 -4 -26 -11 45 2 10 -60 51 -36 -55 -72 11 22 -1 -25 5 52 -24 -8 48 17 10 -11 -25 5
2863EJ3k7M9n4K2KpPM1n0K5k3m5N4o1N8L8k4j2n0m5Q6p0O0K5j5J8j7pJ0l7K5N7
$$ 5 18 -9 40 -14 8 10 3 10 51 1 26 3 -42 12 -49 9 47 23 11 -39 -84 2 -68 -8 17 2 20 3 -4 6 -31 -6 51
2896E1l0k8Km2J8M7k8lJ2L9l1j9j0Q2o8J5P0j40L4N1n5L5OL4m3L1Kmm7L2k6k9
$$ 51 21 -7 -5 -47 -29 18 -10 -13 -1 38 7 -12 -22 60 -8 7 77 -63 -29 22 -33 2 8 42 -1 30 32 28 -19 13 -13 -42
2928d2PP1n5J6J1lro9J00m3N0l0rK8K1n7j4J1M1J0ro8m4N0K7lP0q7P1k5k2L1j5
$$ -42 -35 36 -19 -3 8 5 -4 -73 27 -16 34 4 -5 23 44 -13 -27 -16 25 35 26 -42 -86 -36 -9 -12 58 -29 42 17 -5 26 11
2961A1n1P9r9L4Q4m8JJ2p8Q6kp0M3nRm7NM2j2K5j7M7m6j7M7j6MK0n3J8M9m7j3
$$ 11 -40 39 -60 -26 58 10 11 23 -55 31 29 -41 2 -3 6 -41 -36 6 -6 19 2 49 3 -14 33 17 21 41 -12 6 55 8 -5
2994eL1J9Nn6J5rKK0k8MjJ2J8%j3Oj4oP1j11O5l8pk4O2l0J02p0l0N9q0k9P6n9
$$ -5 26 45 50 -6 9 0 2 22 -6 -2 -3 9 27 27 14 20 6 0 71 -40 25 -13 -20 -44 18 -12 90 20 -10 49 -31 -60 16 -43
3028d3N9j8n6O0j9lL1Rl9K7%N3m3lnK9q7Q5j9l8K0j5POK2m6L0j9J1O2m3o3MJ3
$$ -43 16 -2 -58 2 -17 -20 11 20 -19 8 8 61 18 15 10 39 -48 37 18 -20 0 -15 -8 -2 20 -26 4 -15 -4 58 15 -48 -44 -31
3062c1K3rk2L9LM0j2q3M5KmN1q7KN3nL5K4r1M9j7l7J11q7k5R2j02qP2L2p8O4n1
$$ -31 -8 -17 -39 0 3 43 31 -52 -7 -5 -9 42 -45 -43 10 5 40 64 -27 22 5 -32 79 -8 -33 59 -43 -51 21 53 -25 39 -12
3095a2N2p5L1nL3l7k5LN1k8k9N0j7j4L6j2j9K1j4M3j1n0Q6qn3N5l6k5j2J3JPN2
$$ -12 40 -35 -4 -9 24 -13 -38 -35 16 -12 -41 9 -8 -22 14 2 -17 4 -10 33 22 -28 58 50 -3 52 16 -9 -21 -8 -7 0 52
3128E2m5j4PJ2j0n1M6l8O1LLk3M4j7m0L2l0L8J2k8m4K1j2O5r8N2N5o8J2L0n9P0
$$ 52 7 -7 0 12 2 -49 -3 -41 20 23 26 3 47 30 -10 22 -8 30 42 14 -30 -9 -21 44 -54 -2 53 -15 -3 27 -32 38
3160C8Nn7J3J2J8%m3L0l0N3jMj00J7L3m4M0nN9j0k5J0nJ3J9o1J5o2J2M9j6J8L0
$$ 38 43 -14 -1 11 29 29 -14 16 -14 39 38 42 -58 -41 -8 -52 -12 -17 42 32 7 17 12 25 44 -17 -2 -64 -52 -3 -19 -1 29
3193B9O0q3Q%l2K1n8L2L5K7m7K0J7l3Ml0ONO1m6j1J4Ml0Q5o8j1J2OOJj1j9j5N5
$$ 29 89 6 14 14 -18 3 -55 -23 12 39 -8 12 29 -4 0 -30 -24 -19 42 -4 -15 -1 3 -27 58 -10 -21 -9 -3 3 4 -7 -26 -41 14
3228A4l9N1rl8N2m2N9p6l3P8q5R7m2lK8j2n6N1J3j3N8n6lK6M5j08Q0n8M2k4l5
$$ 14 -25 26 17 -21 31 -11 48 -28 -61 17 -68 29 -13 -16 12 0 -56 -5 8 -5 53 -3 -6 20 65 -43 37 -21 21 -3 -38
3259c8O7k9n0P7J5j9Np2k1O9K3j4k8m8P1l3K8Nk9K6PJ3q4Q1n0N8Om2L1pn0N3p0
$$ -38 29 0 -50 27 42 23 28 -44 -65 4 27 13 -15 -63 8 -25 3 8 -21 5 12 25 -59 22 -28 30 36 -6 25 18 -32 21 -49
3292d9M5K5q1O7nl7K8rL0k5j7LO1p2Q3l2n7N9m7n2Q1o0L1K7J8nL3j2k6m9K7K6
$$ -49 -4 21 -60 7 2 -35 -7 -16 14 -11 -28 -25 36 -36 47 15 -42 17 -30 -82 -1 -61 -30 -3 15 10 43 31 5 -44 -17 9
3324Il2k2Q9k7k7K2q0P3j2k1N7j5k2oj8K6P2j07K7M7o5K0M5J5K1q7mJ7J1NJj0
$$ 9 -23 -45 44 17 -10 12 -68 5 -7 -28 29 14 -8 -14 -32 -6 66 -41 -14 33 -32 -12 33 48 69 -18 -22 -5 6 11 12 2
3356Bm9J39j03M6o9N7j9pJK1kk4l8K1L9j9l8L4L8n5M8k5OMq0M6R2n0m0J4J3Qk4
$$ 2 -47 92 -11 35 -34 23 4 -3 -2 19 17 -7 -45 -24 15 -4 -42 -8 30 -25 23 -2 4 8 -72 -26 66 16 -24 -10 3 11 -13
3389a3J1L6Mj2j9j3k4P2j00J11j6m2JJ0l1M0mL9m0n3N3J4k4Lnm0j9lN6R0p6M4
$$ -13 -2 34 38 26 7 -6 -30 42 -58 53 37 -5 -4 6 -25 15 11 50 10 -43 10 24 0 3 -2 -42 -61 -64 -8 82 6 50
3421E0l5o8J8N8k6l9P8p1L3oLJ3nrm6O6l9M6n0L4m0L4J6K0j4K0m0J1qJ0l8k8O0
$$ 50 15 -53 -35 23 -3 -42 36 -35 -2 -8 -5 8 3 -6 -52 14 -25 21 -29 5 -35 -1 15 35 21 41 1 12 4 14 -24 -52 8
3454HJ7K3m4J07j31M9kOp8L7j5N9m5kN9n0K2o5K2J5K5Nj4K1o4Q3r1mN7o7N6M7
$$ 8 25 48 4 111 -20 29 27 33 -45 -8 -23 36 -9 -11 48 -2 20 -45 -23 -8 17 22 8 29 -35 48 -43 -47 10 -57 -1 46
3486D6j8lm1l7J27p2J8Jk7l2J1J7Q6n5k0J3J3qj4J4l1K6Lj7j0L5ro6J9L4m5Q9
$$ 46 28 25 -16 -53 74 2 20 21 -6 -38 -27 -10 76 21 1 14 27 19 5 19 -12 14 17 0 -10 25 16 -50 -31 3 -42 47
3518D7m5J3l4M9o3J7K5rl2K3p1J15q7K7J0LK4k6knR9o4j6mm4P6J0n5K4n2J8J7
$$ 47 2 15 -19 30 -33 -16 9 0 -32 -9 -80 35 -52 -25 -15 -12 12 -14 -16 -21 78 14 -2 -6 -50 26 36 -19 5 -47 -29 -12
3550a2j7KO7n7P2q4N4q8K4J2j3k2P7J4nlo1J6lJ9O4K9r1j1P9n6Pl6PN6n4K6L1
$$ -12 -29 -27 40 -17 55 -29 25 -63 -39 -27 -40 -62 15 29 24 21 -40 -24 -27 -8 56 85 -6 -17 62 6 13 -23 -16 40 -14 12 43
3583D3p5J22k8o0n4K3RR8m6m9K5k6K1M2n1L3o1J7j9R5j11Q7k7j1RJ1qj0j8L2k6
$$ 43 -32 90 62 2 -52 -29 -20 78 32 -17 8 -18 3 45 -6 27 -34 -17 -36 59 -52 35 8 -3 6 17 9 -1 -19 13 -13
3614a3qQ5r6J3l3R1o2M8n4KK4LqQ6j24M8rK0Ok4k4P6m5k7L5m1L2J0k2roM2K7n6
$$ -13 -21 64 -32 -19 -52 39 -23 25 -29 -27 -3 0 -8 78 -46 2 -7 13 19 -5 -29 47 2 -25 10 -31 1 11 -11 -20 -26 16 43 -13
3648a3j0L4KL5l8l2L9m9L1n7N5M6m4k1M5K2l0Npk3K3Lq3K9K1Kk0O0n6M6l5qPJ4
$$ -13 -23 11 13 48 10 -22 17 -32 -1 -58 -3 43 -1 -22 23 45 15 20 13 -10 13 16 -67 -38 -17 -15 -35 25 -31 15 -20 -28 -21 -7
3682gkj9M8j3Pm4Q8o1M1m6K3m4l1J6J6J3J9J0n4NK2rJ0M3m0rlK2Ol9R4q4OK7n0
$$ -7 -9 -28 20 7 14 -30 58 -3 38 -8 15 -29 -60 -44 -28 -15 4 14 -40 -35 -13 -22 -12 31 -9 -18 -21 1 7 -32 62 -22 -16 11 -39
3717c9K3M5m4L8m5j6L8K7n8N9Km9K3l2PK4LO6o6l6L8o6K9J9M2r%nJ3l2l7M4M1
$$ -39 -16 29 -15 23 -22 -38 0 27 -31 28 30 -19 4 -28 -21 3 6 72 6 -30 8 -58 -29 -10 32 23 23 18 31 -1 -38 6 47
3750D7l7p4M0L7n0J7j9K7j2l6P7j1j6Q1p2Nk8k4R0l9k0M0l2K2m3J3K6ql1M1ll0
$$ 47 10 -64 -24 13 -37 -20 -39 -12 -24 -60 17 6 -10 71 -1 4 -24 -48 42 3 -17 23 -9 13 -30 -17 9 1 -30 11 8 -22
3782b2J2n5J8K7QN4m7M8j4k9Jl0K5L2On9J9L7j1l3nj6M0L7q7R3r7L5Ko3K7K6n0
$$ -22 -10 -65 -47 -20 -12 42 -5 43 29 0 1 -29 -4 28 34 -25 -6 31 20 -13 -18 -34 6 43 -44 49 -48 -13 -11 -74 -47 -21 -71
3815g1O5rK0P0n3k5k7J2lL1k6N1k8l9L3J7n3Q0Nm4qK9n4K5J3k6N6pq7L5M4J3n4
$$ -71 -6 -15 5 75 22 -3 -30 -18 -21 10 -16 35 7 -32 1 18 -35 45 50 6 -2 27 -27 -2 11 -15 41 34 -53 -18 26 39 -15
3848a5O9n2j0o3Q7K0n0RM1p1O1k3j6J5n1N5%k9L2LK4j6l9O7Kk5k9o8J05Pk4m0
$$ -15 54 2 -8 -71 16 36 -14 -5 36 -35 26 3 -13 2 -49 6 6 -23 9 12 36 20 -19 48 50 25 -4 -72 33 40 16 -24
3880b4%L7J3Mm4NK8l9O3m2j9Rl8Q5n4L8rk5kO8p3L6j9K1l0%j1L8ml5N2m1L8l2
$$ -24 -24 13 26 30 -14 -9 19 -20 43 1 -18 -9 -47 38 -16 22 13 -12 -14 54 -19 17 -2 19 -11 -11 -22 16 12 -23 29 -12 26 -6
3914fM3p0K0mK5J1jJn0J3L2Rn1Q1j10N9j4jR6j41L0N8k1qJ4nk1M3n6K2o2J17o8
$$ -6 37 -33 -13 -17 8 19 18 19 -31 -18 14 23 -28 53 -57 2 -12 -13 83 -58 -28 30 9 1 15 10 -11 32 -24 -2 -64 53 -15
3947a5j2N1m9J6J5j8JO6m0PmJ7o6M2j5mO0m4j3p1P2J4qM9o5J8l6J11j59Q9N4m6
$$ -15 -27 24 -25 -9 6 -12 -11 55 15 22 18 35 -31 11 -4 -8 52 8 -5 -76 -4 10 2 51 -14 4 -32 79 -80 9 63 17
3979A7j1k3OJ0j6L0Kj0oM5%j2J0n1Q6j9n4nl1M4KJ2j3l2j3J0M1l6M4K2p6M0K8
$$ 17 6 -17 -11 -1 -17 13 15 5 -1 44 44 32 42 -9 77 58 4 -1 -32 12 14 26 13 -19 -32 -22 19 -17 27 49 -27 13 41
4012D1n3K4oK6k4l9K1rL4l1J4K6mn4J9L8p0N1k6k8N9k2M5ml6kO0n9l1M0Pj5K4
$$ 41 -12 12 6 32 8 -31 -10 -19 15 -16 -2 24 20 -34 -15 23 -47 4 -22 -50 9 -13 32 28 -8 -10 50 -9 -40 0 7 -8 16
4045A6l9K0NN7n5Nj6NJ2j9N8p0J9K8o9L2LJK1l2Q2q8P4q2K%K5nM4l3j5J5o2N9
$$ 16 -23 -3 2 59 4 9 -7 -2 10 -9 49 -21 -2 26 -43 -11 -8 -7 14 -18 64 -24 50 -32 -30 -30 -5 -10 34 1 -14 1 -61 -2
4079bk8R1p7K2Lk9kM2l1J7k0qK4n0N8p5J09q6N4l1M9J0K4p5l4J09m4k6k2K7k4
$$ -2 -30 61 -16 6 9 -20 -22 20 -11 6 -14 -22 2 -48 10 -65 44 -42 12 -19 30 40 64 -11 -45 64 20 -6 -28 -1 -25
4110b5O2m2m0J3kJ2K2j7L5lRk4K3o8P8j9oj1lL4q4Q1Kl3K5L4n4j4J0lJ2N0Ro9
$$ -25 37 -5 -45 -32 -34 -22 0 -17 18 15 24 0 23 -45 33 14 8 -3 -6 28 -56 25 27 -6 19 53 -1 -15 -5 -8 4 54 63 -6
4144fK0K1j8k2rO4o7MM9p5M1j6jM3m4M0p4M8j6J3L0n6N3J9o3%L8m8M9l7j8j5M5
$$ -6 14 35 17 -5 -14 50 -17 -13 36 -39 2 -14 -15 28 -16 24 -50 -2 -18 -5 25 -31 22 41 -22 -22 16 -32 17 -20 -38 -53 -8
4177hPK2k0N1o9J7P6n3M2p8M6j6pLk3m9Q5p8L5%m8J02k5j6k5L6L5n3k0POJ4RK7
$$ -8 -1 21 1 52 -17 0 76 23 65 -13 33 17 10 13 -10 -59 26 -52 -17 -17 -65 37 12 -4 -29 7 42 -11 -31 -24 -18 -4 5 32
4211C2J7k9rm7K4O4n3K6j5mK8J7m3k7J3jkm8P8l8j3N0n6M9m2M1m0O2m0M4J6ll6
$$ 32 49 20 11 -36 -12 52 -1 25 10 6 34 51 8 -19 -6 -7 -9 -57 21 -17 -30 20 -36 13 -29 12 -28 34 -6 38 54 51 15
4244A5l7J3K3n0L3OK2j9Jj0rK0J4n4L8L1j9K8o7K1Q1q6J0N3k1n8L4M0m9Lm3K5
$$ 15 -22 -9 14 -36 -3 3 25 6 7 -3 -12 8 22 -32 6 37 18 46 -21 0 81 -5 5 58 37 -21 13 53 4 7 -36 -11
4276a1l1P1n0P4q5K9pL3jj8l1N9M0j09N9k8plJ0j1L1n2M0j5L0m4J2%K9Kl3k2L4
$$ -11 -42 29 -21 53 -32 -3 -10 23 22 4 -27 32 72 -37 22 -6 -13 -16 -6 -17 14 -38 2 -13 17 -27 -15 -15 14 16 -17 -39 -5
4309ej5nk8M2oJ1k0M9J7k7J0k7n2L8jj8N3L6K1j16R7o3j8O7l7Ml6N6Kp3QK4J0
$$ -5 -20 -25 -53 -11 -17 -6 -26 23 40 13 23 -4 -56 -18 -19 -37 16 52 73 -43 54 -9 -27 40 3 7 -29 27 29 -44 -36 -12 -2
4342bm7L6NJ7Nn3K9KqL1l3jk1M2k0j6L9K5l1m5P1l5oK1n0K5L1m0l5R4m0L0j3n6
$$ -2 -49 -13 -8 9 14 -39 -10 -8 -16 15 -18 -19 -40 2 -18 -34 5 30 -1 -46 25 -10 -16 5 -45 -20 11 -29 -64 30 -10 20 7 -49
4376d9M9K4kp%o5lR2n4J4k3L3l7N7l9qP1%Po9k1J0qLJ5m3%P3o6L3n8O3M3l6kN
$$ -49 0 24 22 15 15 -50 -53 39 -15 -1 -24 9 -28 29 -10 -18 53 53 60 -9 -30 -20 -28 -25 -10 -53 -53 20 -46 -13 -71 -8 35 -1 -3 2
4412Bn6rJ35n6L0l4L0q8N9mRLl4L3k1M8l7j8K1n7M5M1r8j8J2N6L6lo8J5j0L6n8
$$ 2 -54 -63 72 16 46 12 42 -46 13 9 18 21 -13 20 -1 47 10 -8 13 -44 1 42 -56 -74 -62 -6 30 27 -41 -26 -36 0 -58
4445e8M2l1M5l5K6k4L8pj4rK7K2l1K6m0O8k3k7OK4l6J3M8l6l1L1j1L8j1k8n2J
$$ -58 -16 -47 -2 -37 -11 -35 3 -4 -18 -27 0 22 -9 17 -23 45 22 -5 1 25 -11 2 50 14 -17 14 3 41 30 2 -50 -49
4477d9J09l1K8q9J0OM1m0N2m4K5Pm5l5J01m4M7p0N5Kj6oj2pJ1J7om2N1j8k3qJ0
$$ -49 60 29 57 -32 -22 -16 25 -15 37 -7 18 25 -20 -55 46 2 49 -21 34 36 20 14 2 -5 6 23 17 -25 26 8 -15 -23 -13
4510a3J7m0O8j7l1l1N7k0L8K4p7O2m1j2o5P2j3M3J9o5O1n1lR2p7L2m8j4n3P8l6
$$ -13 4 -36 32 15 -16 -47 10 -10 28 52 -25 37 -4 -16 -81 -9 -22 21 40 -25 36 -15 -18 74 -3 29 -19 -33 -86 -8 -44
4541d4J6K7K0O2j17mP5l6j6%J7O9q7kL5M2p7L5l7J3O%J1k0m6N7k4jP1o9J4K7l1
$$ -44 -28 -1 19 81 -36 -40 35 -1 -17 -17 0 69 -18 -20 15 57 -20 15 -22 -9 -3 -3 8 -12 -58 -1 -25 -26 45 -24 -10 17 -14
4574a4K7K6q3OL9N0j08M3J4L6n4M6J3m6R%MM8Nn0K1o9N0j2J3k6P1l7Mmn8L4nJ1
$$ -14 13 39 -44 -38 1 51 -57 -14 0 36 -18 28 41 -5 4 4 8 56 61 11 32 -37 13 1 14 -12 59 22 26 22 -36 -2 -7 4
4608DM7j2n4k6L6rj5n2M8L2K5m9J8l7Q8k9L2p4lN4k2l1R6q2N3l7O5o8Ql1N1j0
$$ 4 51 39 -15 -41 -5 -14 -29 -81 -33 -1 24 -25 -7 -44 44 15 47 -27 -30 24 2 -29 67 -15 38 1 66 -2 6 -25 26 16
4640A6J2J6n1K8Lk1j5lK1l1M8j2p3N3j1l5M4RJ1nrL6o9onJ12r8J2rL7Ll9K4j3
$$ 16 28 44 -7 21 24 3 -12 -15 6 -25 23 11 -62 -9 -20 -55 -11 -2 9 4 -5 31 -38 -44 -49 63 -35 -23 -32 5 8 -31 -7 -20
4674b0L4prrJ4m8L9mN6m5M3l9jNm2P0m0q2R7j6k7J9l9K8JJ03j09L9pk0pM6q0J9
$$ -20 14 7 -2 -11 3 -45 -6 -10 46 1 44 5 4 9 -33 37 -3 -85 12 -4 -31 -12 -51 -23 -22 81 -28 11 4 -16 -23 23 -57 -38
4708c8L8J4n6K2QJ1NnK4%m5M0k1j6M7RK0n8M7r1j5O2mQ3m4q5j0N0M8p7J7Oj8K
$$ -38 0 14 -42 -20 -12 -1 4 -1 23 23 -22 18 -3 -19 28 37 57 -1 46 -45 -60 2 -2 81 37 -48 -58 -8 40 -37 -20 -14 -32 -30
4742c0pJ1M8n9Q9n5l4Q6mo1L9k0Kj7M5k8K1q4L7QJ4jk0j6NK7K0J4k1k4J3m2K0
$$ -30 -37 -26 22 -37 52 -3 -37 49 45 -16 23 3 5 -12 33 5 26 -58 -21 -13 1 0 -20 -36 -31 -4 16 30 9 -15 -2 -44 -24
4775b4P1l9Qn0k1P8J0m3J3K7l5M6q0L6kL7n3n5O8mk9O5pn9O1K3n8K8j3K9p3N1
$$ -24 47 8 16 -34 -55 23 33 -10 3 30 -5 41 -39 -3 -5 32 -21 -76 -8 -12 -41 24 17 -42 19 42 -16 12 -1 28 -45 6
4807FQ5j18M1m0rJ8k1J1N4J0mm2j8k8N0qJ1l4l9J07l5k3P0o6J9m0J02q6l3P5m6
$$ 6 91 -27 14 -26 -35 -17 -38 -27 27 37 33 -9 -27 -55 -5 -13 -2 -36 -75 32 -3 -26 44 -22 -3 -43 59 -27 -60 15 -31
4838c1N2K0l0J5j1J0k5lJ6rL2o0M3M0j03Q3l5N2o2K3k7LLrJ1L4p9L9K5l3L6l3
$$ -31 21 41 11 26 15 25 0 -3 13 4 36 -24 19 59 -44 39 4 56 -6 17 -10 -7 -4 -13 -2 32 -47 -8 17 -16 20 -13
4870a3k6L6Kl4J6M4m6PM9j5q3K1Q6n0PL2K3p2L2M9n8K1j1l7J2j2l9J10r6K4L7
$$ -13 -39 -3 -1 -35 -19 25 -21 -14 35 20 -63 -42 44 -6 1 33 56 -16 16 65 7 28 17 -20 -8 -20 -59 51 -45 -21 16
4901A6p2P0j1pK6n0K8l2jK4P5q2k4J8J7J4n2L8m7M0NK5j8K4J8l1LK1lj5n8Q0k7
$$ 16 -56 14 3 -4 22 -28 0 -32 -33 -9 66 -16 -40 -22 -5 9 -43 -5 -52 -12 -7 18 0 24 42 11 14 35 32 17 -41 39 12
4934A2J0R5j23J2L3Kn6K8p8K0M0n8R0m2oLK2J9n0K5n5jM4J3J9m1N1Jo8L1J4pK8
$$ 12 22 117 -6 6 39 41 -15 13 -65 -45 -5 -63 27 -15 -21 -18 4 23 -27 -2 -57 -58 -14 -1 18 -23 28 29 -39 -8 6 -1 27
4967B7nnj2K0q7O6l5K4N7q6O5mLn0L4OLpm2K7K0r1P3J8n2k3K7j5Q7q1%J6k1J06
$$ 27 22 17 5 25 -62 4 -31 -7 50 -36 29 25 28 -22 12 18 21 14 -28 -1 19 -72 1 19 -33 -56 -29 -44 43 -38 -38 -22 -43 63
5001F3q3J1M4m0J9m3J8nJ4Q5n3OJn5K8j9Nl7L2K8lj6lKon4J00J7l6Lj6o2N6N4
$$ 63 -20 -9 35 -5 14 -29 -11 -16 -2 83 30 36 37 -18 10 -9 -4 -41 -9 19 16 0 -3 -1 -7 -61 39 56 20 23 7 -55 1 55
5035E5n0K3j15N3P1r7O9J0p6L4K0O6l1qm0L3k7O5p5nK5rO5m1l9K9Qm8N0L7n8K1
$$ 55 5 28 -87 -34 37 -60 9 19 -57 -23 -3 63 32 24 -16 17 -10 55 -20 -25 0 -9 56 15 -24 5 13 -35 15 52 -6 15
5067A5l4rK2J5k9PK8MJ7o3Lm4M6j8K4j4L3O5q3N7j5l8K8%k2j7mJ2K1k0J7j9mL6
$$ 15 -19 -28 -6 9 -20 -13 15 19 36 -27 -24 -68 -22 -40 -16 -30 3 68 -15 42 27 -11 17 17 -5 -22 -26 -14 7 -13 4 -15 -19 17
5101A7J0j2Pl0m2O0Lj0pL7k9K8l6J5j8L5ql4Lm7O7m8L5j2Rj0N0q0L7m3O1l7O3
$$ 17 27 15 22 -8 -50 10 13 3 -4 33 4 32 -4 11 -7 28 20 -14 -11 -58 9 -39 -4 -16 -7 -17 33 -47 -10 -53 8 -29 34
5134C4K0l4K6k9k4O0k4m4oRLJ3k8K7K8j3pp0J6k8N2l1P3m4l7N2K3p3P9m3Q1r4
$$ 34 54 20 46 17 -7 53 29 -15 -21 -12 -9 4 -24 3 31 18 11 -59 -43 -71 -19 -50 23 -21 -58 -6 17 -56 23 -20 61 -33
5166c3P8k5m9K4m4R3q6N5j1k4P2l9m6oN8LqK2m2l7L9N5k5J6j0o4M4k7J4N2m6M7
$$ -33 45 20 -29 -5 -49 44 -42 13 2 -22 50 11 -35 -41 17 20 12 34 -8 -45 -6 49 24 40 30 -34 10 -17 -3 49 3 50
5198E0n6j8Q2r2L1j1k5J4l1O4n6N6k9LJ2j5N4m2rNK7J6rm0K1j3K0L4l4K3K8rj5
$$ 50 -6 -24 58 -34 -3 -14 -39 -25 -56 8 -48 8 -21 -18 -6 -21 33 -9 -18 -13 14 30 21 -19 2 -11 9 43 9 32 60 51 36
5231C6rk5l4N2j2j6l7N4l9K2l0L5m1K1jl4R1m7oJ9j6J4rK5jl0N3l0l2K0K8o3J
$$ 36 27 2 -32 20 8 -8 -45 9 -30 -8 -38 -3 -44 -23 -24 -58 33 -14 -20 -1 -17 -3 -12 13 12 -18 35 5 -27 -7 21 -42 -41
5264d1J5K3j2nj8N4m8J8k1K8l7N9Rl1O8j12N3l6k2L9L6J1p5O7n8K6jm6L7k4N1
$$ -41 -26 -3 -15 -20 -38 16 -32 -14 -35 -7 -44 15 24 -7 61 -51 2 -34 -56 -17 19 30 -45 22 -36 -10 -11 -57 -20 -44 7
5295Gk7l5J8J1j3L2MMl9j1L5joQJ8K4k4POn1RKL8l6L8n3M7k1J10j28K9Kl4j8R
$$ 7 -20 -55 -37 -26 -39 -7 -3 1 -38 -49 -14 -15 -21 -13 5 29 5 12 18 -33 -24 -22 16 -20 18 -35 12 -9 101 -27 2 4 -30 -48 -39
5330c9qL8K3k9n2P2m8P8m3K5k5l7O1n9M9k8N9j9l5KL1N%l5J7M9p4K1m5M4KJ2m7
$$ -39 -47 -9 14 -15 -67 5 -43 35 -8 17 -8 -45 16 -43 6 -22 37 18 -17 -15 16 21 21 -14 3 52 -22 -1 -46 -2 0 12 -35
5363c5M6n1L0mK9o4N0m2L5L9k7k2Qm5k9P6l8Rj4L4K7j3rNj8K3M1j3k7M3o1P5j22
$$ -35 11 -40 -10 -14 15 -49 1 -41 -6 33 6 -16 -8 -53 -82 -6 -44 -35 -49 -15 12 -1 -10 -5 -23 0 41 28 1 44 -17 58 -64
5396f4L2K1j2M2K6j15P4K0Lk0Ok8j7JL9Ol7O1l2L3o3K9Kn5J8K4k1K1o9J23k9k7
$$ -64 -32 -11 -23 19 45 -70 4 24 27 7 13 -15 -32 -31 8 14 -23 38 6 39 -24 5 7 -48 -30 -6 -27 -6 -75 48 19 -8
5428ho3J24o6k7M4l7N6M5n2ql0L8K1k5k2L0kK2o0OK7l9N5J4n3L0m9KL0k5M2q6
$$ -8 -71 53 -13 -40 4 -33 23 68 16 8 -22 16 37 12 -10 20 18 40 -20 -14 13 -26 29 43 -10 20 -29 -27 3 -22 20 -66
5460f6N3J4kJ2j0No2N7l4L3j2pL1qkPl2k3K0L7n4O4pm0O6l0k4Jk1M2K7p8K9J6
$$ -66 -13 1 -1 11 1 6 -56 1 -33 0 -12 -19 12 4 2 9 -23 -46 -26 11 -43 21 14 -26 40 10 -14 -13 -34 8 35 -43 -14 2
5494Bk0k2QO0o7P0Kj1l7N3q5N7K1q9M5k3L6ll3L8pK7k9J3m3N8j5MqO1p2rl5L1
$$ 2 -18 -40 -32 28 -39 31 33 22 -15 38 -47 10 31 -58 -13 -36 0 -3 -36 2 -5 22 -7 6 -37 21 6 10 2 63 -9 -18 -53 -22
5528b2J31o3j00O8Qk8m8K8ML8pJj08R4J4K6l1J1Jk8J3j8mK4K3p0Q6m1qM7oj4R
$$ -22 109 46 -54 14 22 -6 -54 -26 -22 16 9 10 -98 -4 10 36 5 16 17 -11 2 -16 -20 4 27 -43 43 2 -6 41 35 21 30
5561C0p8M5L2k2J5j6K1j01P5L1K2p7mJ03j15L3qql1P0k1n6M2pL7k8L1l8O8n3j1
$$ 30 -48 -3 29 7 22 6 27 -74 1 32 54 -23 -27 76 -39 -6 -14 -22 -53 17 -4 -60 -18 -25 12 -16 15 -23 45 -8 -19
5592a9J2j1J1j1J9n9L8M5L8q8M0J2k2N5k8rn2O9j0l0kkOJ4q2J07m2K2j8qn9M1
$$ -19 -7 -18 -7 -18 1 -58 -20 25 63 -25 15 27 5 60 32 23 -29 40 30 0 -2 -4 2 16 -66 41 -1 21 3 -5 -64 -23
5624b3K5k5J3Ql4M9Jpn7M0J1K6m3M3k8j4MM4p4J04n9L4Jmj7Ml5l7P2l4L4m9K9
$$ -23 2 -23 -10 -2 -36 13 14 7 -50 -10 1 27 -16 27 -1 -15 -11 33 -41 63 4 38 39 35 18 22 -13 -50 22 -12 22 -27 2
5657BJ3K8Jl4o8N3j1l9K4P6j09M5J0j4M0m8pQK5k6j0P9k0l3rL5oJ4m2k9N1j0P1
$$ 2 15 43 44 10 -58 -5 -16 -55 -31 45 -64 -19 -9 -23 17 -31 -38 -30 -5 -31 -41 38 18 -15 -24 11 5 19 -23 -52 -1 -11 60
5690F0r1K3O5k1J1m4Jk5N2j5N1j00M2j5L1m3JJL5Lk4M1n9j1K6l6j0Q6n4L6Jl4
$$ 60 -31 -8 57 36 47 3 4 -21 31 16 67 -33 9 -6 25 -18 -17 -16 19 22 -2 39 -20 -31 -5 -41 -51 35 -19 17 18 -16
5722a6K3kLm4M5L1M9j53J00J3j9n7K3j5J1L1K7m9N2m3n8L6nj6nL8Nj3M0n9OP0
$$ -16 7 5 8 -36 9 40 89 -64 36 49 30 -27 -4 -19 -8 23 50 1 53 10 -48 -12 -17 -33 -38 0 5 -8 32 -27 -21 49
5754D9p7K7l2K1J2L5M1l0m1O7p0k3M3l3k1N0JL9m7L7m7Pk4K0J7N1p4j3J03j23
$$ 49 -28 -1 -33 -12 0 35 76 46 5 72 2 -21 22 -11 -32 18 19 58 11 48 1 8 -16 4 21 72 -2 -15 88 -35
5784c5N4n9M7MK7l1k5K4pK8KL6p6L4n0P2n9M8l6k2K5j7L7lK0n5L1o4O2p2Q9K6
$$ -35 19 -40 7 11 38 7 -18 6 -1 27 29 65 -11 23 -27 45 -14 34 -2 -24 1 -16 21 18 38 -17 14 -50 12 -60 29 55
5816E5j6l6j3R6r7pQ6r5lJJK4j4j5Q1o1L1l4L6ko2N8o2N1jpML2J1o8K7k5nJ7k1
$$ 55 39 3 -10 86 -11 -18 68 -27 -30 -29 -28 -4 -18 -33 48 -13 18 -16 20 18 -44 14 -48 3 2 -5 -1 31 42 -26 1 -24 -29 -12 -33
5851c3L5K5lj5j5nJ0J2j2J5L6m8k7L3n7N9L8m5j1k6N8l6Oj3jM0j2k8M8m4L9p4
$$ -33 2 27 24 9 -6 -11 -1 11 -1 14 50 2 -25 8 -49 10 48 3 -8 -34 24 -12 -6 -19 -20 20 8 -20 28 -16 23 -51
5883e1K6L5Nl6j5N5k1R0q7j9J4K0l3K8pp4J00K7m8jNN5m4rJ3l5j7O6l1Lj3k0r
$$ -51 -25 10 15 -21 -36 19 -2 88 1 -18 -4 16 -17 11 4 -70 30 57 9 8 13 68 24 15 28 -7 -24 42 11 14 1 -19 -28
5916b8q8J12qLqK4JJ9k7k8L6K2j9k4jK4n8J16m8l9K3j0N2knm6J8L6k1j6j2M2l4
$$ -28 -116 -4 -12 -9 -17 7 8 27 0 -28 8 30 11 -13 -14 10 -48 68 20 -19 4 -6 46 44 39 -7 11 47 26 10 -2 40 6
5949F%jm7N1Nk9J6j5oj6L8K7l6K8j0p0mQ1j8l2mP2m9M0k2q3M3M8j7rkj4K8K7l7
$$ 6 6 5 -42 9 14 -15 1 -14 -20 -36 2 29 -7 21 11 -59 -63 18 0 -32 -36 36 -13 27 5 -78 -35 13 -4 -13 -15 -29 -1 26 -11
5984a1k6M3kRK6qm3J5K4n6O6n5J8m3K3J3jO0p7oM9l3j7K6m3j4M8K5J8j1OK2o3
$$ -11 -37 6 4 13 39 31 -12 3 27 -29 37 -18 0 -43 -20 -7 -8 52 -25 -31 18 -15 -32 -6 -49 -63 -15 10 28 17 23 45 -18
6017a8N6n4M2l1J3L8k4K2o1pKM5Kj8jL2o2L6j8nl3N4j12O8M0rJ9K3J7q4mkJ10
$$ -18 38 -16 26 -5 8 46 22 44 -17 -24 -22 23 25 7 6 38 -24 12 -6 -11 -44 10 -102 -34 6 -3 16 39 56 -28 -32 -34 76
6050G6p5L2p1J3J7K3m2L4J4m0j1K2J0M2L8q6k0K8l1L8M4n0%N1n9OjK4j05M7J9
$$ 76 1 33 -38 -25 -8 15 -27 7 21 -19 -30 -8 2 44 82 -4 -24 4 -27 11 55 5 5 56 -3 3 2 26 -79 -32 -13
6081a3L0J9r5J4J4J2K7m1k4K7O7k5l3l7O3j5j1N1q2M8M3k4k7J5L5j2K1q1L8NJ0
$$ -13 17 36 -59 -45 -31 -19 8 -33 -57 -30 37 12 -21 -58 5 -10 -21 30 -52 -4 39 15 -12 3 38 26 47 -34 4 9 19
6112A9km2M3j3k6K7K8kn2J5Q4m8n0N1k4k6n8J14j5r2L9K4k7M5L7n8pJK4j5J2R
$$ 19 17 -25 18 5 -21 6 34 32 -20 -5 79 31 -19 32 8 -18 -76 38 23 -69 -30 -6 -33 12 49 -9 -16 -15 9 -6 6 15
6144A5o6M6J3L4l3k7M2L6o6L7l7nJ9nk4M4pK6k6Pk9KJ3k5O5j3j9J5o4j1K4J6N2
$$ 15 -51 -5 8 42 9 -18 24 60 -6 31 -6 -11 8 3 -21 23 16 42 16 23 -6 -4 9 -16 49 36 17 32 -32 -43 -19 -3 49
6177D9r6P1k9RqJ2n1M5nkk5L8j5L6m9j0O2p4M4l4L2j3Km2P4o3P4j6k2K8n4lO1
$$ 49 -47 24 -5 4 -4 8 -43 2 -3 -5 -30 8 -7 29 -20 -30 32 -42 2 -32 0 -13 -11 -53 21 -42 32 16 -6 22 -32 -35 26
6210B6m4k6O8l8Q0n9o2J09j6m0jO2j06K8K2o7P8n1pK6l4R1l1k4J0L8l0l5K9L4
$$ 26 -18 -44 24 -14 66 7 -55 54 38 -2 -3 59 -47 -19 3 -64 14 -37 -44 -18 -52 39 8 -16 -6 32 2 -33 -4 30
6240C0q9L7M4n8L7rKlN5k1j4l0N2n0J1j7J1M9L7m0k2q2M3k9L8j3O7Jj7J4m4l4
$$ 30 -59 -22 22 -36 1 -8 -6 -9 46 25 11 -19 33 -17 -6 -23 -12 37 74 34 12 -70 -27 -56 -18 -31 36 37 20 34 -10 -44
6272d4P3o8J8N0l4K3k6J6j3Nj4J0J3j2%j7JL0n6K2M2n8M2qJ4n2Q3o7n1P9k7L9
$$ -44 29 -39 -21 29 -5 18 -8 8 -5 0 -14 -4 9 -3 -3 -20 -19 11 -45 -23 19 -39 3 -5 9 -43 40 -27 -78 1 -26 13
6304A3mj3L0l9J8K2p0O1l9M1q4J11j9l7K6mn8N5K5l6K3qJj4pL4k0%j2m5N3lRj2
$$ 13 9 -4 26 -13 5 27 -43 18 -21 20 -64 47 28 -9 17 13 -45 10 35 -1 22 14 15 1 -6 28 8 8 -4 -49 4 1 10 -2
6338bO4m7k2L2L7p0m2L3L7j7Kj0L9l6k5K7mQM6rm5nl8K5OmO0K3m7M0q8K4JM5L0
$$ -2 62 15 -7 25 62 -8 -50 -17 20 3 5 -5 34 -2 -27 0 -4 4 50 41 -4 -9 -47 -22 -16 -20 40 63 16 56 -32 -8 -7 38 68
6373F8J9j09M3j9k1L5l5l3M0kk8J02p5l5M3m6L6NrkJ4K4k3M2k7q6Q0n7R7j6m9
$$ 68 87 -22 21 2 -19 16 -19 -52 -12 -14 -42 60 -15 -50 -7 -53 -17 -12 -21 -23 -9 15 -8 34 7 -79 1 -56 41 25 -24
6404b4m0O8OJ6Lm9%L8o7M2M1m6LL7n1K4m9j4J4J13q7K6l7N5l1n5lR3N0m4k4J1
$$ -24 -64 4 10 26 29 -20 -20 18 -49 -7 34 -12 -9 28 -23 1 -48 -62 -48 65 -22 4 -33 22 -9 -64 -67 26 76 32 8 19
6436A9l1j1M2l8M6n6M2Qk7j8k4M3M8k2jMk6RKRl9L5mNp9J9N4j5m1J29o7j1n2N7
$$ 19 -12 -23 19 -19 27 -29 13 21 -6 -24 -48 -5 43 21 20 24 -2 7 9 18 -21 14 10 15 -64 -45 9 -6 -47 82 15 4 -48 9
6470IJK4L0l1o1j8M4M5n9J6k1j1K6%j0K3K2p8qN5K8K2l0po0O5J0j1j8KO6j01L6
$$ 9 10 34 64 33 -28 -46 -2 43 -16 0 -21 -32 -6 -6 -16 7 29 -49 -57 -2 26 48 18 11 -49 16 26 15 -3 -1 65 -36 0
6503@Qj2K4k3PpL2k7m9P4l6oJ6mkK4J1J5n3l9N8PQn4O1L0p8j2L3O5p7O2q0P6m4
$$ 0 8 -4 20 -3 4 -3 29 2 -47 27 -9 -15 1 -3 -5 19 30 45 -8 -47 11 18 26 -28 33 63 -15 -27 6 71 -6 56 -24 52 8
6538HoO8o2RM6m6K6nm2N0k8k1RK5l6Ko7N0J2L2l2J6K1l1N3%j7j1J0m2KJM8n7j6
$$ 8 2 70 8 17 63 17 43 38 -4 46 18 -3 6 31 -5 -3 -70 -20 -8 24 -8 8 29 -2 51 51 34 23 33 -9 -7 -6 42 -15 -31
6573c1J4K2K7ml5mk3O7o4J4PrJ6PKj0k4M7m5k7Q4k4n5M7L9m9OO9o0k9l3K3M5j0
$$ -31 -17 5 32 28 -7 -11 -34 33 -31 -17 -10 -19 -3 4 6 -4 -28 19 -26 -53 31 7 -48 -1 38 -11 -5 64 4 -25 -58 -35 10 0
6607@oP1r0P8k8j2l2J5J2l0J02p5lk2K0j7l5O4l6k0N1j1j6J5NN7j13M2J1k0J5
$$ 0 -6 65 -25 53 25 13 -19 -4 8 -22 80 5 2 -20 0 -17 -52 12 -24 -44 7 -4 -20 -5 0 57 -56 -14 -3 -23 -8
6638hk8P7J1q2L8n6L1mJ8L2o2j3j3P5l8J1L9j1jM8p2L4Lm7J1L9n9M3j4o3P8l5
$$ -8 -36 41 52 -30 8 -48 -17 -21 -3 29 -33 -46 -59 16 -22 -11 28 17 16 64 -8 26 29 -18 -7 32 -27 16 2 -61 17 -18
6670a8J4kQk9L6%q5N6k0J9N3r6J01k4l8J3n3O4k5J6N3m3OK9o2P5n5k7M0M9o4K4
$$ -18 -4 -6 2 -27 9 9 -76 -20 -40 -21 32 -64 37 13 -25 -12 -65 -1 -26 -10 43 0 6 35 -27 48 -7 -34 6 55 -9 15
6702A5Rk9Ml7j3L6JP0n0rJ0q5N5k1Q2k9L0n1LJ7k6O8j17M6L2k2L1L5q6M9k4k7
$$ 15 24 -5 -1 -38 -51 -15 -14 56 6 -3 7 -78 -23 -44 38 9 39 -12 -9 8 -18 50 -67 -21 11 -11 20 55 -31 18 -6 -33
6734c3O5m1J0Oj3k4K1KJ1nj0RK9Rk8l6M5m0L5l8M5l0L3q7M2M8q9O4k0P7l0J0k9
$$ -33 32 -9 1 7 -6 -30 -9 -7 4 -1 -11 -2 27 36 8 -28 17 -23 12 -26 19 -11 22 -65 -23 25 -64 0 -20 57 27 37 8
6767Hk1J7l1M5L0p4M0k0L3%n6j1Nk5O5J9L2j7pm0RK1Kk9L7o6rP7m3M2p4P1%pp7
$$ 8 -13 4 -27 18 48 -26 14 -6 27 27 -29 -40 -35 -60 5 24 56 39 32 -8 1 22 24 -5 32 -34 -43 34 -9 33 -41 30 30 23 -54
6802e4K5R3j4j18P5k5J5K4l2k7k0P6l4J1L5j0O3o1j3O0n8M1r7N6j0n2K9J6kM7
$$ -54 -29 64 50 -68 7 -18 -3 21 -11 -38 -58 18 -16 -5 30 20 83 22 9 69 11 52 -45 11 1 -51 -22 -6 -8 39
6832C9k5k7l7L2L0k2J8k2L6n0qK1K6p8K8K0J0l0P0j9j6m6OM7j6KN6q7J3KN3Nk8
$$ 39 14 -13 -50 -18 12 -10 8 -14 22 -28 -36 -15 11 -67 -39 -19 -9 -39 31 12 -4 -50 -44 3 -13 -11 45 -42 -29 -27 26 31 3
6865CnL4m2J1O2q0M8o9PM1M6l2r3M8M7k3RNk3j5O9j02Q4pl9K4l2N5l5j8J0K7Q
$$ 3 -2 32 -10 1 63 -17 31 -38 -31 10 56 24 -69 -21 26 3 12 17 -6 -21 48 -54 30 23 -16 8 -24 31 -4 -22 -12 15 23
6898B3m7K1OJ5qn5N6Oj9moJ1j8Mj0M0K3QLp8M7k5j1k4L5l1J2Lk9O7l3K5m0K6j2
$$ 23 -24 -3 3 18 10 -45 11 17 -2 -6 -12 -1 -19 -15 -25 15 38 46 49 -29 18 -7 -18 -42 -7 -38 -26 -23 -52 15 -18 7 -33 -7 -19
6933a9lk6M8M6m6M2r2O7n2PO4k4l2j9jPM5J0O1m8k1O1m4k5L5kj6k3J6rJ0m7Q4
$$ -19 -22 -48 0 46 0 42 -50 17 -35 -28 36 12 -20 -39 -40 -33 12 22 83 35 14 75 31 6 41 39 23 0 16 7 17 -30 54
6966E4k6m0qjk6J8Kk9L3l1N1K4k4K3l2o7J9kR1Kk4l2K3k6K1j0K0K6ol0k6J18n9
$$ 54 28 -12 -20 -21 -47 -29 -27 -56 -23 -54 -3 21 -3 20 -12 -79 -60 -62 29 31 7 -25 -2 -28 -7 -17 3 29 23 -7 -33 85 26
6999B6j2J3k5l9L7Qk9k0O7KJ2l6N6m5n8M5K7l5j5M4Km9jK8K5J2k1o4R0n0k3O0
$$ 26 14 27 2 -37 0 8 -21 -41 26 28 40 4 60 15 -43 2 29 -6 -21 23 25 -24 -25 3 28 40 19 -45 45 -5 -28 32
7031C2l1k4L7LK7nk7J9n4O2oo4M9K6k5k8L2j0Ok5K4l0K5J0k0N7j21N4j7J5l2N3
$$ 32 1 -23 14 17 44 39 12 31 -23 39 33 -31 18 44 19 -9 23 13 19 -6 18 -12 13 23 3 60 -61 -7 -24 -9 -41 12
7063A2k9kK2k8mM6j0QQj4J5p4R0Pk3LJ4q8N5M9r8P3n2LlP7l3l9K5J7n3J3o7O2
$$ 12 -17 -19 3 -25 -29 17 7 15 23 9 24 -50 40 47 24 27 41 -47 8 57 -41 32 -20 -17 -20 57 24 -15 10 27 -26 -13 -80 -18
7097a8J1N2q2L5l4N2J3k5j0OlM0l6J0%r5Q2J9nlL4m9N0o3P5j9m9j3M6%J4l5l8
$$ -18 -7 45 -37 -2 -36 16 29 4 -6 0 -3 37 1 11 11 -84 -2 17 12 9 43 -6 44 -19 56 37 -12 -25 21 21 35 0 -38
7130c8QM7J5k3l2POj8J4j4O5j20L8K3P5j19K5J3M6orJ8n8M3l5O1j0j2ll0OJ6O9
$$ -38 -30 17 32 9 -23 -16 -10 -28 -14 -28 37 -83 -45 -22 53 -66 -41 -28 18 12 3 21 -37 6 -29 32 22 10 7 -23 -17 -1 68
7163F8jp5K5j5Mj0K4Om4L5nJ4j3J1Pm0MlM3l8K0r1N3m3M6KJ3l6KM3Pkj4J8l4J0
$$ 68 67 -8 17 2 6 -4 20 26 -18 17 12 26 13 24 31 -9 -5 -8 35 -3 17 -74 -21 -64 -18 -16 -3 -39 -37 6 13 11 -3 15 -19 -9
7199ij5O1m0L2Ml9PK6qJ4j8Rp5O2Qk2M9l9K2k4QRJ6p4NK0j8nO2l9J6j5n3N3rO
$$ -9 -24 37 -3 29 33 -6 1 27 19 33 15 24 -51 11 19 -3 46 7 29 5 13 22 38 -36 -31 -11 -29 -34 28 -11 5 -10 -63 -10 -19 -13
7235a3J8k3L0M0n5jJ4lPkj4qJ3J5Jm9O6k3L1k4l5J9M9m2K0m5j4N5O5p5L3p5j4
$$ -13 5 -18 12 52 -3 -4 10 7 14 12 -2 -10 3 18 19 -30 36 13 44 20 -15 4 53 11 31 -14 -28 27 92 17 50 -25 -39
7268c9MpJ2j8R1j12J09p7M3kM7l3l4m5J4P5n4O4m8J8m0K1N8m4J0J9RK1n1k4kk6
$$ -39 -35 -42 -30 -48 43 -69 40 -37 6 4 51 18 -16 -61 -47 28 -26 38 -10 8 -32 -11 47 3 13 32 41 62 11 -13 -15 -41
7300d1K1Q2q8K1O5k3k9m2K9NQ4p2m3j0M0j4M8l6K8o0O5n6MM1k0%M1l1J3Jl4M7
$$ -41 -20 62 -26 -5 60 37 8 -34 -5 0 84 12 -31 -41 -1 -15 33 -3 25 -35 30 -26 -22 19 -1 -1 40 9 22 23 -11 36
7332C6Km2k1j7N4M9l0j2o0K0MJ7mo3L9j1nOP7J0j23O7J3k8J1L7n8M8m6L6k8M2
$$ 36 38 -4 -25 -42 12 61 31 19 -41 -21 -17 0 -4 -67 -28 -39 -44 -38 39 49 -74 -7 6 -22 -11 26 -32 16 -30 6 -22 20
7364B0l7jk9L9L2o8Q1k3oRj6PL3p9L8n3O1M7q8L2K1Jn9L4L1n4l7M4j01J32o5J9
$$ 20 -17 -18 -47 -8 24 -44 37 14 8 17 1 8 41 -38 0 -53 8 55 -33 -1 20 21 -38 -4 27 -27 -64 -20 -121 11 -54 -35
7396c5N6m6K0k1L6qk3k5M9%l6%K7M4m1K7K8r5K6L8nK5mjj4j9k5K5j6J3Ro4J03
$$ -35 21 -25 -5 -26 10 2 -21 -46 3 3 -33 -33 -6 38 -3 24 52 -43 -17 21 16 41 37 36 22 3 -22 3 -13 0 9 -55 48
7429D8o9j9K8k1OL5l4n2M8L8L3p5L6L5o7K5J2nl9M2j7K2K1J8j7m8j0L0lK2J2q
$$ 48 -21 -40 -12 -33 -27 8 -26 -78 -30 8 41 -34 2 37 -30 -5 7 2 -37 5 -12 10 31 49 32 -16 -26 4 1 23 35 27
7461B7m3Lj8JM6J0nJ2l3l2M6m7L8j2J8L2r1P2l9j7K0RKK9j1Rk3o7L5K4m1oO0J6
$$ 27 -16 -13 -31 -30 16 26 21 33 0 -32 14 -33 5 -7 11 43 -48 24 -15 -32 -12 -3 -1 28 17 26 3 -64 -29 -5 -46 -52 8 24
$$ [...]
8190Dm6
8191d2
##END NTUPLES=NMR FID
##END=
