##TITLE=1H_DE-80H_X3
 200.13MHz, d2o
 8 sc
 
 19ns.26.2.2025
##JCAMPDX= 6.0         $$ Bruker NMR JCAMP-DX V2.0
##DATA TYPE= NMR FID
##DATA CLASS= NTUPLES
##ORIGIN= UXNMR, Bruker Analytische Messtechnik GmbH
##OWNER= pz
$$ XWIN-NMR		Version 3.5
$$ Mon May 18 16:47:22 2026 Russian Standard Time (UT+4h)  Yarkov@DPX200
##.OBSERVE FREQUENCY= 200.1313
##.OBSERVE NUCLEUS= ^1H
##.DELAY= (6, 6)
##.ACQUISITION MODE= SIMULTANEOUS
##.ACQUISITION SCHEME= undefined
##.AVERAGES= 8
##.DIGITISER RES= 18
##SPECTROMETER/DATA SYSTEM= spect
##.PULSE SEQUENCE= zg30
##.SOLVENT NAME= DMSO
##.SHIFT REFERENCE= (INTERNAL, DMSO, 0, 14.3821)
##AUDIT TRAIL= $$ (NUMBER, WHEN, WHO, WHERE, WHAT)
$$ ##TITLE= Audit trail, XWIN-NMR		Version 3.5
$$ ##JCAMPDX= 5.01
$$ ##ORIGIN= Bruker BioSpin GmbH
$$ ##OWNER= Yarkov
$$ C:/Bruker/XWIN-NMR/data/yarkov2/nmr/H-C/1/audita.txt
$$ ##AUDIT TRAIL=  $$ (NUMBER, WHEN, WHO, WHERE, WHAT)
(   1,<2026-05-18 16:46:13.95 +0400>,<Yarkov>,<DPX200>,
      <created by zg, POWCHK disabled, PULCHK disabled
       configuration hash MD5:
       00 E9 B6 7A A2 85 ED C7 34 08 36 98 17 FE 4E 26
       data hash MD5: 16K
       D3 84 75 50 39 8A 31 25 37 E1 62 D0 8F 80 11 56>)
$$ ##END=
$$ 
$$ hash MD5
$$ 39 63 2C A3 FB D4 F7 5B FF 1E F4 2E 26 35 4F 88
##$RELAX= 
##$RELAX= 
##$RELAX= 
##$RELAX= 
##$RELAX= 
##$RELAX= 
$$ Bruker specific parameters
$$ --------------------------
##$DU= <C:/Bruker/XWIN-NMR>
##$EXPNO= 1
##$NAME= <H-C>
##$PROCNO= 1
##$TYPE= <nmr>
##$USER= <yarkov2>
##$AMP= (0..31)
100 100 100 100 100 100 100 100 100 100 100 100 100 100 100 100 100 100 
100 100 100 100 100 100 100 100 100 100 100 100 100 100 
##$AQSEQ= 0
##$AQ_mod= 1
##$AUNM= <au_zg>
##$AUTOPOS= <>
##$BF1= 200.13
##$BF2= 200.13
##$BF3= 200.13
##$BF4= 200.13
##$BF5= 200.13
##$BF6= 200.13
##$BF7= 200.13
##$BF8= 200.13
##$BYTORDA= 1
##$CFDGTYP= 0
##$CFRGTYP= 5
##$CHEMSTR= <none>
##$CNST= (0..31)
1 1 145 1 1 1 1 1 1 1 1 1 1 1 1 1 1 1 1 1 1 1 1 1 1 1 1 1 1 1 1 1 
##$CPDPRG= <>
##$CPDPRG1= <>
##$CPDPRG2= <>
##$CPDPRG3= <>
##$CPDPRG4= <mlev>
##$CPDPRG5= <mlev>
##$CPDPRG6= <mlev>
##$CPDPRG7= <mlev>
##$CPDPRG8= <mlev>
##$CPDPRGB= <>
##$CPDPRGT= <>
##$D= (0..31)
0 0.7 0 0 0 0 0 0 0 0 0 0.03 0 0 0 0 0 0 0 0 0 0 0 0 0 0 0 0 0 0 0 0 
##$DATE= 1779108373
##$DBL= (0..7)
120 120 120 120 120 120 120 120 
##$DBP= (0..7)
150 150 150 150 150 150 150 150 
##$DBP07= 0
##$DBPNAM0= <>
##$DBPNAM1= <>
##$DBPNAM2= <>
##$DBPNAM3= <>
##$DBPNAM4= <>
##$DBPNAM5= <>
##$DBPNAM6= <>
##$DBPNAM7= <>
##$DBPOAL= (0..7)
0.5 0.5 0.5 0.5 0.5 0.5 0.5 0.5 
##$DBPOFFS= (0..7)
0 0 0 0 0 0 0 0 
##$DE= 6
##$DECBNUC= <off>
##$DECIM= 32
##$DECNUC= <off>
##$DECSTAT= 4
##$DIGMOD= 1
##$DIGTYP= 9
##$DL= (0..7)
0 120 120 120 120 120 120 120 
##$DP= (0..7)
150 150 150 150 150 150 150 150 
##$DP07= 0
##$DPNAME0= <>
##$DPNAME1= <>
##$DPNAME2= <>
##$DPNAME3= <>
##$DPNAME4= <>
##$DPNAME5= <>
##$DPNAME6= <>
##$DPNAME7= <>
##$DPOAL= (0..7)
0.5 0.5 0.5 0.5 0.5 0.5 0.5 0.5 
##$DPOFFS= (0..7)
0 0 0 0 0 0 0 0 
##$DQDMODE= 0
##$DR= 18
##$DS= 0
$$ [...]
##$SUBNAM2= <"">
##$SUBNAM3= <"">
##$SUBNAM4= <"">
##$SUBNAM5= <"">
##$SUBNAM6= <"">
##$SUBNAM7= <"">
##$SUBNAM8= <"">
##$SUBNAM9= <"">
##$SW= 18.0517328524113
##$SWIBOX= (0..15)
0 0 2 0 0 0 0 0 0 0 0 0 0 0 0 0 
##$SW_h= 3612.71676300578
##$TD= 16384
##$TD0= 1
##$TE= 0
##$TE2= 300
##$TE3= 300
##$TEG= 300
##$TL= (0..7)
0 120 120 120 120 120 120 120 
##$TP= (0..7)
150 150 150 150 150 150 150 150 
##$TP07= 0
##$TPNAME0= <>
##$TPNAME1= <>
##$TPNAME2= <>
##$TPNAME3= <>
##$TPNAME4= <>
##$TPNAME5= <>
##$TPNAME6= <>
##$TPNAME7= <>
##$TPOAL= (0..7)
0.5 0.5 0.5 0.5 0.5 0.5 0.5 0.5 
##$TPOFFS= (0..7)
0 0 0 0 0 0 0 0 
##$TUNHIN= 0
##$TUNHOUT= 0
##$TUNXOUT= 0
##$USERA1= <user>
##$USERA2= <user>
##$USERA3= <user>
##$USERA4= <user>
##$USERA5= <user>
##$V9= 5
##$VALIST= <valist>
##$VCLIST= <CCCCCCCCCCCCCCC>
##$VD= 0
##$VDLIST= <DDDDDDDDDDDDDDD>
##$VPLIST= <PPPPPPPPPPPPPPP>
##$VTLIST= <TTTTTTTTTTTTTTT>
##$WBST= 1024
##$WBSW= 4
##$XGAIN= (0..3)
0 0 0 0 
##$XL= 0
##$YL= 0
##$YMAX_a= 192528
##$YMIN_a= -207243
##$ZGOPTNS= <>
##$ZL1= 120
##$ZL2= 120
##$ZL3= 120
##$ZL4= 120
##$ABSF1= 10
##$ABSF2= 0
##$ABSG= 5
##$ABSL= 3
##$ALPHA= 0
##$AQORDER= 0
##$ASSFAC= 0
##$ASSFACI= 0
##$ASSFACX= 0
##$ASSWID= 0
##$AUNMP= <proc_1d>
##$AZFE= 0.1
##$AZFW= 0.1
##$BCFW= 1
##$BC_mod= 2
##$BYTORDP= 1
##$COROFFS= 0
##$CY= 83.5205535888672
##$DATMOD= 1
##$DC= 2
##$DFILT= <>
##$DTYPP= 0
##$F1P= 10.8118882576601
##$F2P= -7.23987719738617
##$FCOR= 0.5
##$FTSIZE= 0
##$FT_mod= 4
##$GAMMA= 1
##$GB= 0.15
##$INTBC= 1
##$INTSCL= 1
##$ISEN= 128
##$LB= 0.25
##$LEV0= 0
##$LPBIN= 0
##$MAXI= 10000
##$MC2= 0
##$MEAN= 0
##$ME_mod= 0
##$MI= 1.114404
##$NCOEF= 0
##$NC_proc= 0
##$NLEV= 6
##$NOISF1= 3.799351
##$NOISF2= 2.8
##$NSP= 1
##$NTH_PI= 0
##$NZP= 0
##$OFFSET= 14.38212
##$PC= 1
##$PHC0= -5648.947
##$PHC1= -5.978067
##$PH_mod= 1
##$PKNL= yes
##$PPARMOD= 0
##$PSCAL= 0
##$PSIGN= 0
##$REVERSE= no
##$SF= 200.129724274929
##$SI= 16384
##$SIGF1= 3
##$SIGF2= 2
##$SINO= 400
##$SIOLD= 16384
##$SREGLST= <1H.CDCl3>
##$SSB= 0
##$STSI= 0
##$STSR= 0
##$SW_p= 3205.1282051282
##$SYMM= 0
##$S_DEV= 0
##$TDeff= 0
##$TDoff= 0
##$TI= <>
##$TILT= no
##$TM1= 0
##$TM2= 0
##$TOPLEV= 0
##$USERP1= <user>
##$USERP2= <user>
##$USERP3= <user>
##$USERP4= <user>
##$USERP5= <user>
##$WDW= 1
##$XDIM= 8192
##$YMAX_p= 0
##$YMIN_p= 0
$$ End of Bruker specific parameters
$$ ---------------------------------
##NTUPLES= NMR FID
##VAR_NAME=  TIME,          FID/REAL,        FID/IMAG
##SYMBOL=    X,             R,               I
##VAR_TYPE=  INDEPENDENT,   DEPENDENT,       DEPENDENT
##VAR_FORM=  AFFN,          ASDF,            ASDF
##VAR_DIM=   8192,          8192,            8192
##UNITS=     SECONDS,       ARBITRARY UNITS, ARBITRARY UNITS
##FACTOR=    0.0002768,     1,               1
##FIRST=     0,             0,               0
##LAST=      2.2672688,     0,               0
##MIN=       0,             -207243,         0
##MAX=       2.2672688,     192528,          0
$$ Real data points
##PAGE= N=1
##DATA TABLE= (X++(R..R)), XYDATA
0@%%%%%%%%%%%%%%%%Pj5J6j6J6j7K5l2L3m1M8n6O5p3Q8r9J10j26J43j62J83k06
38a09K32k60K88l20L58l98M40m87N38n93O54p20P93q73R62j062J173j298J436
57G54j591J771j981K227k520K879l332L920m723N899p836J1862l8254R626j05326
72a26625q0618O4442j2327L3739L4496J8850M2827K5605N6124L6151l3074P4991
84A34581J4280q3848N9245R943j07784J1383k2763p6594J153j7261k5129j2597
96a15391n347O6179l873k4623Q5810N441p163Q2796k4981j2593P0886l3059l0306
109E3776J1363l0370j1155l5362k2382K1075n4765n756M2755n7312J7521N8120
121a2492m1602L1409M9976j7505L5848O912j8904K1817j5239O490m194n6784L4507
$$ plain form
0 0 0 0 0 0 0 0 0 0 0 0 0 0 0 0 0 0 7 -8 8 -8 8 -9 16 -16 17 -24 24 -32 33 -40 48 -51 59 -67 76 -86 97 -109
38 -109 123 -137 151 -169 189 -209 231 -256 282 -311 343 -377 416 -457 505 -557 616 -682 754
57 754 -837 934 -1047 1180 -1340 1539 -1793 2127 -2596 3303 -4533 7329 -30925 -21299 -126625
72 -126625 -207243 -142801 -155128 -121389 -86893 -68043 -25216 389 56513 92664 59590 134581
84 134581 148861 65013 124258 134201 26417 37800 15037 -61557 -60404 -77665 -102794 -115391
96 -115391 -120738 -54559 -58432 -83055 2755 8196 1033 83829 58848 46255 117141 84082 53776
109 53776 65139 34769 23614 -11748 -34130 -13055 -67820 -73576 -30821 -88133 -70612 -12492
121 -12492 -54094 -22685 27291 9786 45634 52546 33642 55459 40220 46710 42516 -14268 20239
134B0239L971p0476K9204m549m7883M3114l365j9400L8762n442J3520K2288j3409
147F574L2357r021k3456M8985k7217k8240M1424m5012j9565L7328l8877q445J5229
160a7936j9144K2739m665r757L5028j9313J3907L8831m3143J8475L5623m5643
172E002J6784J0138l9224K0175r006k3413J4812k4178P880J3642l6384L3945J4814
185D987l5766M1323J798k3734M3352j4349j4803L2483k0093J718L428l0853K3020
198A2511j1784l3013L1357k1423j2933M0087l0524J7L6246k5165J4240J4582j8660
211d462L0861n825j6060K9210k4038k121K1124m2083R438J6934l9056J7497N48
224h033k6023L0102j1257j0361L0394j7709J1927K0591k7796K6680Q788l0793
$$ plain form
134 20239 24210 -46266 -17062 -21611 -69494 -26380 -29745 -49145 -10383 -15825 -2305 19983 6574
147 6574 38931 29910 6454 55439 28222 -18 41406 -3606 -23171 14157 -24720 -33165 -17936
160 -17936 -37080 -14341 -19006 -28763 6265 -13048 859 39690 -3453 15022 50645 5002
172 5002 21786 31924 -7300 12875 3869 -19544 -4732 -28910 -21030 -7388 -43772 -9827 4987
185 4987 -30779 10544 12342 -11392 31960 17611 2808 35291 15198 16916 20344 -10509 12511
198 12511 727 -32286 -929 -22352 -35285 4802 -25722 -25705 10541 -14624 -384 14198 -4462
211 -4462 26399 20574 4514 33724 9686 7565 28689 -13394 -3956 12978 -26078 -8581 -8033
224 -8033 -34056 -3954 -15211 -25572 4822 -12887 -960 19631 -8165 18515 27303 -3490
236c490K8452r226j9665K9699k6561j0604K4133k8410N917O947k9222K6881j017
249f166k1129L2390j2944l104L3914k7149O753K4736k8926J6317M994k6400K5307
262A8593j1619j8260K4617k3542j451J9354l3259J4966J5173k8680K3128j8j5990
275a6988L2923j4467q692K7458k0602P877J3057l0093K0051L113k6728K4857j2442
288f76j4983K7372k2537k527K1562k5307J3380Q924k3867K7380l029j8394K8517
301A5815j4747m476K3940k7677O838J6539k6777J6332k03k1524K7668j2891j3484
314a4647K6041k1433K765J9492k7241J5457R698k3710K2539n497j4041K6904j8626
327b299n776K2335k3157Q998J0457k6558K1303K782k0917K2840j1111p450K3631
$$ plain form
236 -3490 24962 15736 -3929 25770 -791 -11395 12738 -15672 -9755 -2808 -32030 -5149 -6166
249 -6166 -27295 5095 -7849 -10953 22961 -4188 2565 27301 -1625 14692 19686 -6714 18593
262 18593 6974 -11286 13331 -10211 -11662 7692 -25567 -10601 4572 -24108 -980 -998 -16988
275 -16988 15935 1468 -7224 20234 -368 7509 20566 -9527 10524 13637 -13091 11766 -676
288 -676 -15659 11713 -10824 -13351 8211 -17096 -3716 5208 -18659 8721 5692 -12702 15815
301 15815 1068 -3408 20532 -7145 -307 16232 -10545 5787 5584 -15940 11728 -1163 -14647
314 -14647 11394 -10039 -7274 12218 -15023 434 10132 -13578 8961 3464 -10577 16327 -2299
327 -2299 -8075 14260 -8897 101 10558 -16000 5303 8085 -12832 10008 -1103 -8553 15078
340A5078k2912K352J7585k3558J4892M927k2271K1939n358j4684K3356j7990j519
353h163K0429k3547J0378J2724k3859J9188j163j7342K5673j3684r970K3361j9909
366e884M324J3110k5707J6906N029k3138K2371q105j2602K6021j8341k746J9815
379A1053k0605J1969Q687k3134K1656j459j7370K3196j5195o419K2335k3353L560
392e079J5145k2431J4057K365j8472K1971r754j0038K2970j8337K103J9467k3193
405i226J1785J0624k1999J7651k825j5151K1294j4289n026J8383k0427P854J0610
418I258k4987J7984L083k0551K1504p608r387K2771j6690O01J6312k0015J2872
431E147M745k0484K1200o074j4779K2516j6244m390K0374k1383M916J2439j9486
$$ plain form
340 15078 -7834 -5482 12103 -11455 3437 8364 -13907 8032 2674 -12010 11346 -6644 -8163
353 -8163 12266 -11281 -903 11821 -12038 7150 5987 -11355 14318 634 -9336 14025 -5884
366 -5884 -1560 11550 -14157 2749 7778 -15360 7011 -1094 -13696 12325 -6016 -8762 11053
379 11053 -9552 2417 11104 -12030 9626 8167 -9203 13993 -1202 -7621 14714 -8639 -5079
392 -5079 10066 -12365 1692 4057 -14415 7556 -2198 -12236 10734 -7603 -5500 13967 -9226
405 -9226 2559 13183 -8816 8835 6010 -9141 12153 -2136 -7162 11221 -9206 -1352 9258
418 9258 -15729 2255 5338 -15213 6291 -1317 -10704 12067 -4623 -4022 12290 -7725 5147
431 5147 9892 -10592 10608 4534 -10245 12271 -3973 -8363 12011 -9372 -4456 7983 -11503
444a1503J4581l25j5675K1318j0650o712K1252j8739M648J6000k3189J2719P169
457A0894k1178J7264m072j2475J9129j3077k358J5275j9331J0250P327k2256J8620
470D012L6j7242K2026r157q266K0149j5412J092J2335j7555J2852Q01j6534K1320
484A0457q878j1050K1312j6215k474J7767j9585O566R593j8189J4643k822j1362
497a0237J9436j2539l182J8401j9517O789J4073k3863J2952O057j7482J5992n608
510A272r311J7978j3901J256J2405j9732J1191N027k0012J9084j774j4738J9968
523H713j0094n084J7275j5536L463Q807j6168J4610m71j4839J8497q721p776J8154
537A0830j5281j001J3898j8348Q934P214j6578J4713l441j0701J9114j2447k118
$$ plain form
444 -11503 3078 2753 -12922 8396 -2254 -8966 12286 -6453 -1805 14195 -8994 3725 10894
457 10894 -10284 6980 2908 -9567 9562 -3515 -5873 9402 -9929 321 7648 -14608 4012
470 4012 4048 -13194 8832 -325 -8591 11558 -3854 -2762 9573 -7982 4870 5671 -10863 10457
484 10457 1579 -9471 11841 -4374 -6848 10919 -8666 -2100 7493 -10696 3947 1125 -10237
497 -10237 9199 -3340 -6522 11879 -7638 -849 13224 -10639 2313 8370 -9112 6880 1272
510 1272 -8039 9939 -3962 -2706 9699 -10033 1158 6185 -13827 5257 3483 -11255 8713
523 8713 -1381 -6465 10810 -4726 -1263 7544 -8624 5986 5515 -9324 9173 452 -7324 10830
537 10830 -4451 -5452 8446 -9902 -968 6246 -10332 4381 940 -9761 9353 -3094 -5212
550e212J5796j7755O991R912j8271J3490R00j4712J8164q989p780J8052j5401
563d815M07J1917j7125J0786L479j6357J7044m103r393J8293j3268k551J5551
576I865j6358O615Q956j7312J2823Q24j2187J5296q836o098J4887j5123M260J1130
590H742j9699J1728M576j5584J5304l951r560J5889j0691p04J3128j5506Q336
603B008N716j6259J5448j780j4083J7751r083o714J5649j3915J578R630j5094
616i148J0921K249j3621J5503o627p884J7954j3822j70J5117j7160O603Q394j4914
630f605J2497k361j0260J4873j0976j616J3283j6715N383R804j6596J1401K284
643D396j4453J5204m634p885J4667j0970P16J0703j3963R995L701j5795J4836
$$ plain form
550 -5212 10584 -7171 -180 9732 -8539 4951 5851 -8861 9303 314 -7466 10586 -4815
563 -4815 -4408 7509 -9616 1170 4649 -11708 5336 1233 -8160 10133 -3135 -5686 9865
576 9865 -6493 122 9078 -8234 4589 5413 -6774 8522 -314 -6412 8475 -6648 -2388 8742
590 8742 -10957 771 5347 -10237 5067 1116 -8444 7445 -3246 -3950 9178 -6328 2008
603 2008 7724 -8535 6913 5133 -8950 8801 -282 -6996 8653 -5262 -3684 5946 -9148
616 -9148 1773 4022 -9599 5904 -723 -8607 9347 -4475 -4645 10472 -6688 -85 8309 -6605
630 -6605 5892 3531 -6729 8144 -2832 -4448 8835 -7880 -2497 7307 -9289 2112 4396
643 4396 -10057 5147 513 -7372 7295 -3675 -2959 7744 -6219 3776 7477 -8318 6518
656F518l495j0993J6539j0156m406J3371j3223M465P552j4720J0784q4j0941J5532
670F743q256n752J6054j3462J818J2735j5751P863N057j4090J2986l802q548J4193
684G788j0872j018J2363j5514O425P614j6434J1948Q94j2352J4318o066n412J3878
698G560j1364L015R122j5110R950K897j3597J3849m393r193J5289j0378j994J2031
712G684j4012N356N974j3346J1311j614j0165J5183q340l618J4764j3319K505
725a637J0061j4497Q952K553j2558J3103m848p134J3811j1150m6J1047j4944P069
739b18N393j4210J1975j201r868J4547p907l137J2617j2453L865Q056j3961J0000
753C498M58j1264J4150n336p161J3339j1035l57J0616j3793O277M541j2623J2109
$$ plain form
656 6518 3023 -7970 8569 -1587 -5993 7378 -5845 -1380 6172 -8548 2236 2152 -8789 6743
670 6743 -1513 -7265 8789 -4673 -2855 9880 -5871 1992 7049 -7041 5945 2143 -6405 7788
684 7788 -3084 -4102 8261 -7253 -828 6786 -9648 2300 3194 -9158 5160 -906 -6318 7560
698 7560 -3804 -789 8333 -6777 3173 6070 -7527 6322 1929 -7264 8025 -2353 -4347 7684
712 7684 -6328 -972 5002 -8344 2967 1353 -8812 6371 -1969 -5587 9177 -4142 -1637
725 -1637 8424 -6073 2879 5432 -7126 5977 1129 -6005 7806 -3344 -3390 7657 -7287 -218
739 -218 5175 -9035 2940 1739 -8129 6418 -1489 -4626 7991 -4462 -597 7459 -6502 3498
753 3498 3956 -7308 6842 1506 -5655 7684 -3351 -3708 6908 -6885 -608 3933 -8690 3419
767C419k152r032J4083q004k234J2123j2909M069P680j3387R801J236j1629J3206
781F270n324o108J2836j1679J010R567j4218P766L881j2715J2410k610q132J3950
795F904q474k349J1650j2540M544O905j3036J0128Jr995J3250o741n523J2738
809G462j1442R44Q850j3076P519L443j1838J2125k963p636J3228q932q90J0786
823G580j2850M938O895j2780J0212m32r731J2678p134l926J1248j1416K433P824
837E539j2650Q000K373j0845J2046l925o771J2676r067p11J0139j2219O153N375
851F113j1853J0133r40r437J2725p117m138J0535j1108L048P658j2532Q427J514
865C028j0702J2734m781o298J2382r236l06J0410j2010N760M665j1292J0513k245
$$ plain form
767 3419 1267 -7765 6318 -1686 -3920 8203 -4706 -637 7043 -6344 3457 4693 -6936 6270
781 6270 946 -5162 7674 -4005 -2995 6572 -7646 120 4001 -8714 3696 1086 -7046 6904
795 6904 -1570 -3919 7731 -4809 -265 6640 -6396 3732 3733 -6262 6988 247 -5276 7462
809 7462 -3980 -3036 5814 -7262 257 3700 -8138 3987 1024 -6612 6616 -2316 -3206 7580
823 7580 -5270 -332 6563 -6217 3995 3563 -6168 6510 -624 -4550 6698 -4718 -2285 5539
837 5539 -7111 889 3262 -7583 4463 538 -6233 6443 -2624 -3335 6804 -5415 738 6113
851 6113 -5740 4393 3453 -5984 6741 -376 -4514 6021 -5087 -2039 5619 -6913 1514 3028
865 3028 -7674 5060 279 -6019 6363 -2873 -3179 7231 -4779 981 5646 -5646 4867 2622
879B622q307J2025p661l057J0847j1482L336O769j1806Q375J195r795J1419m578
893i8n596J2102r701R72R271j1971O457M127j1305J0022k030p970J1717p824k107
908c934J0284j1436M089O351j2300Q843R28r648J1626n434m613J1602r608J472
922a778Q364j1785P235L250j1306J0596k863p607J1780p857j770R785j0690M057
936e89N516j1646R005l74q242J0878n337l889J0865q784J127P951j1921O783K827
951D170r954R942l219n997J1048q111p16Q601j0801M329N517j1415Q540J58q059
966e967J0521n336l154R815r184K550O901j1275P360J849j0150J0379k961o404
980e056J1029q161q86Q535j0379M730L876j0382R238j138p834J1796o208l253
$$ plain form
879 2622 -5685 6340 -1321 -4378 6469 -5013 -1677 5092 -6714 1661 2856 -6939 4480 -98
893 -98 -5694 6408 -3293 -2321 6950 -5021 1436 5563 -5742 4280 2250 -5720 5997 -1827 -3934
908 -3934 6350 -5086 -997 5354 -6946 1897 2825 -6823 4803 -631 -5244 6358 -3250 -1778
922 -1778 6586 -5199 2036 5286 -6020 4576 1713 -5894 5886 -1971 -3741 6044 -4646 -589
936 -589 4927 -6719 2286 1912 -6330 4548 -789 -4678 6187 -2597 -1470 6481 -5440 1343 4170
951 4170 -5784 4158 939 -5058 5990 -2121 -2837 5764 -5037 -708 4809 -6606 1934 2092 -5967
966 -5967 4554 -782 -3936 5879 -3305 -755 6146 -5129 2231 4080 -6070 4309 1348 -5056
980 -5056 5973 -2188 -3074 5461 -4918 -188 3688 -6694 2544 1406 -6428 5368 -840 -4093
994d093J0638r728K012P110j0743O567J304q590J0228m186m983J0530q961M11
1008b484Q337j1279N055M354j0441Q895p39p101R979n656j969R018r611L513N250
1023E121j1029Q303J451r515J0160l740n301J0205p758k18O909r744N605K608
1037C057r223R670k516o680J1491o939k306R569r833K651O111r623P093p3p407
1052d958R832n005l560R760r700J189P615j0590N656L448r509Q275j532n118R239
1067E042o911o18P722r781M614M985j0347P944L94q055R717m262m418Q557p464
1082b881J093N938r024O158J286q702J0051k792n930R975o939j552Q684q859L434
1097f0M030q559P792r52o750R651o406k689R410q948J644O510j0063O080K373
$$ plain form
994 -4093 6545 -3183 -1171 5939 -4804 1763 3067 -5523 4705 519 -4464 6066 -2895 -2484
1008 -2484 5853 -5426 -371 3983 -6458 2437 1698 -5403 4576 -1080 -3049 5969 -3642 -129 5121
1023 5121 -5908 2395 3846 -5669 4491 751 -4550 5655 -2103 -2321 4588 -5156 449 3057
1037 3057 -6166 3504 988 -5692 5799 -1140 -3446 6123 -3710 -1059 5052 -4571 2522 2449 -4958
1052 -4958 4874 -131 -3691 6069 -3631 -2442 5173 -5417 239 3687 -5822 2453 921 -4197 5042
1067 5042 -1869 -2487 5235 -4546 68 5053 -5294 2650 3044 -5011 4706 444 -3974 4583 -2881
1082 -2881 -1788 4150 -4874 1284 2570 -6132 3919 1127 -4803 5172 -1767 -3319 5365 -3494 -60
1097 -60 3970 -4589 3203 2251 -4499 5152 -1254 -3943 5467 -3481 -1837 4673 -5390 690 3063
1112C063p999Q342l271m416R142p301O01P170r666M645M127r289Q083p34p441
1127d944Q973m898k186P798q253K553M815r082P181Q82q318Q713k971m690R496
1142E069p082J3O980q597M458L048q137P571k144n689R246n955k074Q271q522
1157c544K311N566q891N960O12o897Q461l820l564Q574p223N92O769q767N024
1172A163K590q760P823j495n532Q412n799j396P468p733L033M084q803O456K45
1187A756o631Q540l998l397Q306o613R24N851q341M556K333p614P561k313n206
1202d286Q406n556j067P118p983K652M006p872O200Q4o590Q362l830k612P853
1217D885p274J212N604q372N087J885p451P576k366m455Q186o151n72O617q129
$$ plain form
1112 3063 -4936 3406 135 -4281 4861 -2440 -1839 5331 -4335 310 4437 -4852 3231 2497 -4944
1127 -4944 4029 -869 -3055 4743 -3510 -957 3858 -5224 1957 2839 -5479 3234 263 -4427 5069
1142 5069 -2013 -2000 4980 -3617 841 3889 -4248 3323 1179 -4510 4736 -1219 -3293 4978 -3544
1157 -3544 -1233 4333 -4558 1402 2014 -4883 3578 -242 -3806 4768 -2455 -1863 4906 -3861 1163
1172 1163 3753 -5007 2816 1321 -4211 4201 -1598 -2994 4474 -3259 -226 3858 -4945 1511 1756
1187 1756 -4875 3665 -333 -3730 4576 -2037 -1113 4738 -3603 953 3286 -4328 3233 920 -4286
1202 -4286 4120 -1436 -2503 4615 -3368 -716 3290 -4582 1618 1702 -4888 3474 -356 -2968 4885
1217 4885 -2389 -1177 4427 -3945 1142 3027 -4424 3152 786 -3669 4517 -1634 -2206 4411 -3718
1232c718L524L425p916O043L1n828Q165m260k349P584p239J747M963q020N110
1247A262J404p041P485k345m326P873o050l33O164p796L496L050p185O242o99
1262A201n184P759m357k036P095o832J547M525p516M938J208o301P227k894l651
1277c271P319n882j8N559p439L721K737o903O265r83m920P302m117j770O713o899
1293b586K025L981p115N221R59n983P122l579k675O290n716N42M997p428M020
1308G5K825o385N804j762m239P276m282j740O276o440K215M026o949M994P07n449
1324c048N940l534j774N612n170L72N738p464L742J777n806N763j477l872O566
1339C365m602o91N984o720K822K473o238N451p4n101O407l174k845O586n579P88
$$ plain form
1232 -3718 -194 3231 -4685 1358 1389 -4439 3726 -534 -2883 4701 -2538 -791 4172 -3848 1262
1247 1262 2666 -4375 3110 765 -3561 4312 -1738 -2071 4093 -3703 -207 2843 -4342 1900 1201
1262 1201 -3983 3776 -581 -2617 4478 -2354 -807 3718 -3798 1140 2348 -3953 3274 380 -3271
1277 -3271 4048 -1834 -1852 3707 -3732 -11 2726 -4177 2088 1105 -3815 3487 -630 -2400 4313 -2586
1293 -2586 -561 3420 -3695 1526 2485 -3498 3624 45 -2630 3660 -2056 -1514 3483 -3945 75
1308 75 2900 -3485 2319 557 -3682 3594 -688 -2428 3848 -2592 -377 3649 -3300 1694 2401 -3048
1324 -3048 2892 -642 -2416 3196 -1974 -1602 4136 -3328 414 2191 -3615 2148 671 -3201 3365
1339 3365 -1237 -1928 4056 -2664 158 2631 -3607 1844 1770 -3331 3076 -98 -2943 3643 -1936 -1148
1355a148M462o711M135P24m639N664k188l264O962n244m60N464o039K230K535
1370B483n957N015L95m913O041l699j947N573n283J511L778o476M329J237n861
1385c774N997j945l170O233m658l26N387n964K446K542o023M795m83m635O027
1400B449l299k254O413n600J143M026n855M050L15n004O011k187l327O557m583
1415a145K02M437o088K722K249n821N025m08l799N564l387j083M194m742J461
1430f19L156m900L485j06l558N056k709j781N218m641L29M143n671K950K412o276
1446c512N960j960l205N504l394j197M996n429J605K957n152L941O24m634N103
1461B207k689j480N326n245R08L790n335L123J333m664M675j021l160M525k979
$$ plain form
1355 -1148 3314 -3397 738 1462 -3177 2487 299 -2965 3997 -1247 -1707 3757 -2282 -52 2483
1370 2483 -3474 1541 1936 -2977 3064 -635 -2582 2991 -2292 -781 2997 -3479 850 2087 -3774
1385 -3774 2223 278 -2892 3341 -1317 -1643 3744 -2220 226 2768 -3255 1540 1057 -3578 2449
1400 2449 -850 -3104 3309 -2291 -1148 2878 -2977 1073 1388 -3616 2395 208 -3119 3438 -1145
1415 -1145 -943 3494 -2594 128 2377 -3444 1581 1173 -2626 2938 -449 -1532 2662 -2080 -619
1430 -619 2537 -2363 1122 1016 -2542 2514 -195 -1976 3242 -1399 -1070 3073 -2598 352 2764 -3512
1446 -3512 2448 488 -2717 2787 -607 -1804 3192 -2237 -632 2325 -2827 1114 1738 -2896 2207
1461 2207 -482 -1962 3364 -1881 -973 2817 -2518 605 1938 -2726 1949 928 -2232 2293 -686
1476f86q72M257m896J573K839n325M043N74m258N641k827j913M856m268L99L550
1492B687n472L180Q05l499M217k025k456M683l504K44M036n033J633K383m081
1507b202L684j51m040N378k586j863M945m684P90L382n366L299J011m320M345
1522A622r90l573N648l325p62M808n297J634J762m685M072l20k706M467k611j410
1538a666M563m332J415K507m601K830N42l883M383j424k175M525m114N0L979m550
1554a951J721K048m512L746l07k609M202k578j281M055m049R36L215n196L668
1569A108O83m022L937j114k284M468l984k48L868l976K073M85l596M483j677k339
1585b135M329k728n32L023l607J402K388m037K937M12l499M363k797j722M675
$$ plain form
1476 -686 -1558 2699 -2197 -624 2215 -3110 933 1507 -2751 2890 63 -1850 3006 -1262 -863 2687
1492 2687 -2785 395 1200 -2299 1918 -107 -2563 2120 -1384 -1140 2896 -2137 -504 1879 -2202
1507 -2202 1482 1331 -2709 2669 83 -1780 3165 -1519 -729 2653 -2713 586 1597 -2723 1622
1522 1622 632 -2941 2707 -618 -1380 3428 -1869 -235 1527 -3158 914 594 -2112 2355 -256 -1666
1538 -1666 2897 -1435 -20 2487 -2114 716 1258 -2625 1758 334 -1841 2684 -1430 -1380 2599 -1951
1554 -1951 -230 1818 -2694 1052 745 -1864 2338 -240 -1521 2534 -1515 -579 2636 -2560 1108
1569 1108 1791 -2231 1706 592 -1692 2776 -1208 -1456 2412 -1564 509 994 -2602 1881 204 -2135
1585 -2135 2194 -534 -1066 1957 -1650 -248 2140 -1897 1040 1452 -2047 2316 -481 -2203 2472
1600B472l543m11M229n018K488J487l478L526j360j845L399k444o83L761l930
1615a350J338J896l978K784J281m113L952j826j484L818l576P44K084m882L520
1630B08J556l205K334l11k685L793j845j024L242l719J423J769l555L337j96l152
1646b030L674j702j751M936m622R93K219l160J927M07l231L271n69j822L757l488
1662a191L50L193l974J431K491m546K690k07k183L627k476o30L899l607J316J540
1678A723l774K194P25l158M355j950j887L572j786q96L276l303P92J791l847L143
1694I70J08l283M071k576p06L653l517R50J531l357K582O90l073L586j223k436
1710b030M173l124J55K793l721J833J317l381L039n90k254L537k044p94K959l363
$$ plain form
1600 2472 -1071 -1482 2747 -2271 217 1704 -1774 1752 392 -1453 1946 -498 -1181 2580 -1350
1615 -1350 -12 1884 -2094 690 1971 -2142 1810 -16 -1500 2318 -1258 -514 1570 -3312 208
1630 208 1764 -1441 893 582 -2103 1690 -155 -1179 2063 -1656 -233 1536 -2019 1318 1122 -2030
1646 -2030 1644 -58 -1809 3127 -1495 -502 1717 -1443 484 891 -2340 931 362 -1460 2297 -1191
1662 -1191 -841 2352 -1622 -191 2300 -2246 444 237 -1946 1681 -795 -1425 2474 -1133 183 1723
1678 1723 -2051 143 868 -2290 2065 115 -1772 1800 14 -882 2394 -909 -117 1674 -2173 970
1694 970 1078 -2205 1866 -710 -1416 2237 -1280 -330 1201 -2156 426 1116 -1957 1629 406 -2030
1710 -2030 2143 -981 -826 1967 -1754 79 1396 -1985 1054 464 -1790 1747 -297 -1091 1868 -1495
1726a495J179K061l947K683M84l111L556j107j614L251k790R4K605l567K108R47
1742A337l374L302n62k528L668k385m48K983l234N98J825k894K277L12k597L159
1758A439j562j362L435k731M68K437l709K257N27k929K887m40k256L318k711n40
1774a472L604l877J272J865l379K507J41k476L583j867j160L121k930N58K233
1789A723l342K032O29k795L010q83k067L380k209n23K851l320J322J582l081K303
1805F12M9k326L202j725j207L123k641M41K291l366K062O28k807K956j022j819
1821a549L271k502J2K578l176J376J507l065K466j98k398L297k007q79L039k791
1837a019O22K114l165J959M59k894K969q93j794L157k332O9K271k926J565J059
$$ plain form
1726 -1495 -316 1745 -2202 481 965 -2146 1410 303 -1311 1940 -850 -756 1849 -1718 390 1337
1742 1337 -2037 1265 703 -1825 1843 -542 -990 1993 -1241 -643 1182 -1712 565 877 -1720 1439
1758 1439 -123 -1485 1950 -781 -313 2124 -1585 672 1199 -1730 1157 717 -1539 1779 -932 -1472
1774 -1472 2132 -1745 -473 1392 -1987 520 661 -1815 1768 -99 -1259 1862 -1068 -510 1723
1789 1723 -1619 413 1042 -1753 1257 374 -1693 1687 -522 -1045 1806 -1514 -192 1390 -1691 612
1805 612 661 -1665 1537 -188 -1395 1728 -913 -472 1819 -1547 515 1143 -1664 1292 270 -1549
1821 -1549 1722 -780 -768 1810 -1366 10 1517 -1548 918 720 -1678 1619 -388 -1267 1772 -1019
1837 -1019 -397 1717 -1448 511 970 -1924 1045 152 -1642 1515 -817 -748 1523 -1403 162 1221
1853A221l033K720m33k157L129j783r26L104k803O24J946l240K172M16k526K607
1869A038j041j133K354j920J74K411l159J274J050k653K606p67j852L303j839
1884a54j274K891k702J297J120k243J804M57l129L138j280j425L387k818M81K197
1900A747l036J578J097l105K532n78j615K950j952n39K654k686Q20J424k900K296
1916F87J12k410K902j361j176K870k358K01K032l023J717O64k442K675q01j820
1932a531L208k012l61K331k644Q46J345k569K120k78k162L142j611p97K483k447
1948i37O04J803l066J861P99k566K382n29j549K671k140r4K089k759J701J025
1964A295k703K122k3j905K464j572o43K606k500L21J816k666J857M30k595K835
$$ plain form
1853 1221 -1812 908 475 -1682 1447 -336 -1262 1842 -961 -337 1609 -1631 541 957 -1569 1038
1869 1038 -3 -1136 1218 -702 -528 1883 -1276 -2 1048 -1605 1001 234 -1618 1685 -154
1884 -154 -1428 1463 -1239 58 1178 -1065 739 1196 -1933 1205 -75 -1500 1887 -931 -450 1747
1900 1747 -1289 289 1386 -1719 813 235 -1380 1570 -382 -921 1733 -953 -133 1291 -1609 687
1916 687 799 -1611 1291 -70 -1246 1624 -734 -533 1499 -1524 193 857 -1585 1090 289 -1531
1932 -1531 1677 -335 -696 1635 -1009 -163 1182 -1387 733 455 -1707 1435 -176 -973 1510 -937
1948 -937 -333 1470 -1596 265 1064 -1502 880 351 -1198 1473 -667 -761 1328 -1431 270 1295
1964 1295 -1408 714 691 -1214 1250 -322 -965 1641 -859 -538 1278 -1388 469 899 -1696 1139
1980A139r78j333K729k260RK094k158Q24J029k392J999k20j715K688j645q59K746
1997A697k691M31J825k891K089L68k058K072p02j391K420j765O0J917k564J353
2013A70J020k535K297p49j494K191j235l07J841k219Q43J447k563J481L79j832
2029a265K485j187j145K301k107M32J733k656J461O47j948K119m24j929K486j120
2045a17j156L214l081R10J407k152J722Q6j938K145j280j58J852j843j26J490
2061I75j992J314P33k492J466P78j244J389j530j57J978j764j7J767k740K037
2077E01k5j705J875l97r31J474j054k38J675k545J765M88k505K482n39j725K512
2094A108j625p86K333j946N36J373k336J553K68j637J898q43q44K098k237J208
$$ plain form
1980 1139 161 -1172 1557 -703 -694 1400 -758 66 1095 -1297 702 482 -1233 1455 -190 -1049 1697
1997 1697 -994 -563 1262 -1629 460 828 -1230 842 140 -1251 1169 -596 -536 1381 -1183 170
2013 170 1190 -1345 952 203 -1291 900 -335 -642 1199 -1020 -177 1270 -1293 188 567 -1265
2029 -1265 1220 33 -1112 1189 -918 -486 1247 -1409 52 699 -1249 870 446 -1483 1003 -117
2045 -117 -1273 1941 -1140 -230 1177 -975 747 833 -1105 1040 -240 -398 1454 -389 -515 975
2061 975 -1017 297 1030 -1462 4 782 -462 927 -603 -760 1218 -546 -563 1204 -1536 501
2077 501 476 -1229 646 249 -682 792 -262 -500 1175 -1370 395 883 -1622 860 321 -1404 1108
2094 1108 -517 -1303 1030 -916 -380 993 -1343 210 478 -1159 739 -104 -948 1150 -1087 121
2110A21O60j814J619J71k006K276r63r66J993j378p7J619k254R71Q88k258J843
2127D45L6k019K823j363r00K178j898Q55J262k031J229K65j807J996r19j120K125
2144A157j276p47K220l034J624N35j986K063o5j551K289j319r25K186j902N32
2160a99J368k160J388K57j944K073o33j033K105j664P8J610k357J739J66k156
2176a362K344o96j392J760o92k50J637j828M72J026k484J575L89j594K254r50
2192B09j187K422j832o26K173k386Q50J508k374J829p25j212K298q78p23J742
2208A088j634N88J128j990Q44O32j677J909p84j107J832j584k85K122j843Q20
2224E9J013k309J648o20j045J853r57m04K043k164O43J217j216O88n96r35J233
$$ plain form
2110 121 781 -1033 586 757 -1249 1027 64 -902 1091 -287 -364 1255 -999 -28 860 -1398 445
2127 445 481 -1538 1285 -78 -978 1200 -698 157 1419 -612 617 882 -925 1071 152 -968 1157
2144 1157 -119 -866 1354 -1680 -56 479 -1507 556 491 -1060 1229 -90 -1015 1171 -731 -199
2160 -199 1169 -991 397 654 -1290 783 150 -883 1222 -442 -364 1246 -1111 628 794 -1362
2176 -1362 982 286 -1106 654 -38 -288 1349 -479 -7 1019 -1465 110 499 -1095 1159 209
2192 209 -978 1444 -388 -1014 1159 -1227 -377 1131 -1243 586 -139 -1351 947 69 -654 1088
2208 1088 -546 42 1170 -820 24 656 -1021 888 104 -1003 829 -755 -1040 1082 -761 59
2224 59 1072 -1237 411 -209 -1254 599 -358 -762 1281 -883 -240 977 -239 449 -147 -1082 151
2241A51K14j246J816k087N53J645k161J240N50j662J635m88j077J831j151m32
2257f69K004k347L30J434j959J711j44j274J902j105o71J734j563J73J758k271
2273i57Q77O06j663J803m88j102J944j460K5J347j589Q11O16j797J588j9j483
2290i41J676r54l81J589j675L47J517k038J001N10j715J819p91r30J865j225m4
2307c70J316j569O08P75j654J278K2j201J461p94n83J612j452J50J419j844R75
2324A49M96j585J530m42j126J995j524J78J353j739Q34P02j624J318l04j254J872
2341H29r92n64J721j607L23J119j833J295P0j338J889r34q22J826j421J37J265
2358I63j713O84P79j551J487m29j265J726p35m88J390j550M38J229j977J386p
$$ plain form
2241 151 365 -881 935 -1152 -599 1046 -1115 125 675 -987 648 160 -917 914 -237 -669
2257 -669 1335 -1012 -682 752 -1207 504 360 -914 988 -117 -788 946 -617 -444 1314 -957
2273 -957 -80 526 -1137 666 178 -924 1020 -440 -415 932 -657 154 770 -1027 561 542 -941
2290 -941 735 -219 -600 989 -686 -339 1178 -860 141 651 -1064 755 -36 -966 899 -326 -370
2307 -370 946 -623 -15 760 -894 384 406 -795 666 -128 -711 901 -551 -401 1018 -826 149
2324 149 645 -940 590 148 -978 1017 -507 -329 1024 -715 119 821 -803 515 211 -1043 829
2341 829 -163 -727 994 -613 -290 829 -1004 291 361 -977 912 -22 -844 982 -439 -302 963
2358 963 -750 -66 713 -838 649 220 -1045 681 -54 -542 848 -702 -264 965 -1012 374 367
2375C67j363J643o66q68J830j459K78J173j763R04O19j572J359l04j033J779j117
2392a93l35J448j588O35P51j579J245J9j120J355p30n59J638j535K74J294j735
2409g15O39N55j372J517m00j088J568r42l02J440j418L65Q01j538J197J60j235
2426g68J426o03p77J649j244R4R97j478Q51L65j333J330k69j163J663j067j94
2443e21J296j556O98Q32j379R43P2j239J563q17n19J643j560K59J172j687Q78
2460G8N02j427J449m66p58J384j314K8J192j286O01N94j398J266j76j113J576
2477G32p14p73J443j151R5J393j695Q92K60j388J583m96p67J371j153k7J295j689
2495g89P83P18j475J034j6j026J288o33n06J340j278K30J019j253P72J83j249
$$ plain form
2375 367 -996 647 -19 -887 943 -516 -238 935 -828 76 695 -877 482 178 -855 924 -193
2392 -193 -528 920 -668 -33 718 -861 384 403 -717 638 -92 -651 987 -548 -274 1020 -715
2409 -715 -76 479 -893 624 224 -864 704 -238 -540 900 -518 -153 648 -890 307 467 -768
2426 -768 658 55 -722 927 -317 -223 774 -704 147 512 -821 509 240 -923 740 -327 -521
2443 -521 775 -781 -83 749 -630 313 385 -854 709 -108 -627 1016 -544 -285 887 -800 78
2460 78 580 -847 602 136 -622 762 -552 -524 668 -618 -17 577 -821 445 269 -844 732
2477 732 18 -755 688 -463 -368 1025 -670 222 482 -906 677 181 -586 785 -368 -395 900 -789
2495 -789 -6 712 -763 271 255 -771 517 -116 -622 718 -560 -330 689 -564 208 391 -858
2512h58J456n50p13J239r00j31J284j449P04M93j455J240k26r40J468q69l06J383
2530H70j237K83Q03j467J137r8j070R20j51j083J790p22m82J616k139J246O70
2547H86j613J061j61l19P13p72l93J684j280J53O01r46J182m70n23Q46q92m50
2565f93J148r02L33J469j875Q47o9j219K024o52r62Q28p70J96J226j439K74R94
2583G58j641J072L1r52J080j04l95J254j303k80J275j346R3O18l45M83m70r24
2601a096J795j133Q5J022p37L73K26j305J362q65m21J007j5p64J777j690JJ245
2619H67j593Q72O97j022Q88j119q5J703j402l02J279q54L83P09j110N3O66j502
2637h72J330j90r46Q46k24J18M52r83J84J002j620J095M42p84J571j356o98J444
$$ plain form
2512 -858 598 48 -665 574 -326 -457 827 -622 82 575 -880 360 134 -806 662 -207 -513 870
2530 870 -367 -84 719 -748 389 291 -779 141 -10 -1093 697 -25 -507 1109 -1030 216 886
2547 886 -727 334 173 -146 567 -205 -598 1086 -194 -41 560 -386 796 326 -197 649 -243 -693
2565 -693 455 -447 -114 1355 -520 327 258 -961 1063 411 -551 277 -493 -297 929 -510 -236 758
2583 758 -883 189 220 -732 348 244 -151 1103 -200 -480 795 -551 -458 160 -185 298 -172 -1096
2601 -1096 699 -434 -349 673 -64 309 535 -770 592 -273 -694 313 298 -466 1311 -379 -378 867
2619 867 -726 146 843 -179 709 -410 -495 1208 -194 -496 783 -71 312 1021 -89 -36 630 -872
2637 -872 458 268 -678 168 -56 62 514 -469 -285 717 -903 192 634 -150 1421 65 -633 811
2655H11r92J28R89j288N00k10p64R85K37j425J126l39M95K87j050L40p4L2J72
2674d0K17j220J619r05N55M80p94j85J681k321M83K75j50L16j65m82J166r93k71
2693g34J142p04M2K96o69R71o0j048Q81r88p0J513j038N59M92j317J099j49q41
2712f23J186n84l30P42l75J42L38j202O89O85q71L78j33k56O39m70j34M80o66
2731c65K52N08r15O94J54r29J033o76l46J013j130P00M39r58Q19M2q05J207p24
2750A3l80O67m72n6Q98r98K59M32j067R89j03o81J027o26m9P27j024J26Q21q46
2770c43M65p7n48R80o38m70J151r55L78O77j197O44J49j056J158k79p01J170p06
2789a98k6R01j378P56K17r90J130l99q88J514l38j758J556n84K14O26o82L60O7
$$ plain form
2655 811 -181 -53 936 -352 148 -62 -826 159 396 -1029 97 -242 253 540 -510 -170 -244 -212 -40
2674 -40 177 -1043 576 -329 226 706 -88 -273 1408 -913 -430 -155 -305 11 -154 -636 530 -463 -734
2693 -734 408 -296 -254 42 -627 344 284 -764 117 -871 -941 572 -466 93 585 -732 367 218 -623
2712 -623 563 -21 -351 391 16 158 496 -706 -17 668 -203 175 42 -214 425 -45 -179 301 -365
2731 -365 -113 395 -520 174 328 -601 432 -244 -590 423 -707 -7 432 -526 293 335 -470 737 13
2750 13 -367 300 -172 -228 670 -328 -69 363 -704 285 182 -499 528 -98 -147 580 -444 -318 503 -343
2770 -343 122 45 -503 477 -161 -631 520 -435 -57 620 -577 67 216 -840 318 39 -662 508 -198
2789 -198 -224 677 -701 55 272 -718 412 13 -875 639 301 -1457 99 -485 -271 355 -327 33 100
2808A00q68J347k77p28J120n33m56J155j104J60O54j121P29q8n87J031n10k60
2826b36Q03r40K26P26q88K15L21q95R80o7p93J182p35q1P65j090L78M80r41N63
2846b7j55k00O13m8m82R75j209O84J94j170R19k58k69P29j37p55J568j223L74
2865A23L28q14K06N31j115J081J63r91J172n87n05Q12n26J21M67p36M34K18r04
2884e22R64n76l40Q66p06J11O41r15L87N25r91Q75j77p05R90n06k60R10r51K09
2904a71O22r27M98L50q48P00j17m26J002q39r1P00r54M81M52q92R46k33n55Q06
2924E04n73l46R09p37L11M80p55K93J48p94J059m80n16Q98o71L53L38q94O83m5
2944A65p16R35j95p02R55n70j42P87q13K37N34r00P41j7q02Q60m44l13Q33o05
$$ plain form
2808 100 -768 579 302 -426 694 161 -295 860 -244 -84 570 -551 178 90 -497 534 24 -236
2826 -236 567 -373 -147 579 -309 -94 227 -668 312 245 -548 634 -101 -182 583 -507 -129 351 -590 -27
2846 -27 -182 -382 231 183 -299 676 -533 151 345 -825 94 -164 -433 296 159 -596 972 -251 123
2865 123 451 -363 -157 374 -741 340 503 -488 684 97 -408 404 -122 -1 466 -270 164 382 -522
2884 -522 442 -134 -474 392 -314 -203 438 -477 -90 435 -556 319 142 -563 427 -79 -339 571 -380 -171
2904 -171 451 -476 22 372 -476 224 107 -319 683 -156 -247 453 -501 -20 432 -460 486 253 -302 504
2924 504 -69 -415 494 -243 68 548 -207 86 234 -560 499 19 -497 401 -270 83 421 -473 210 165
2944 165 -551 384 189 -513 442 -128 -270 517 -296 -59 475 -425 316 299 -503 357 -87 -400 433 -172
2964a72r3N75p41O19J49r14R21l78m07P83o86MQ83q17L85M61j013O58qo47P91
2985C53m89j30O96n86q8O81p69N39R4p47P10l15j72N71m85j59R08j006O10K14
3005D30j059P63O4n61P27m28k81Q82p61J67M44q69N51J78p78R23l82m48R88o22
3025g2j79Q41j081O33K26q60O91k09l67P07l30l05P06q21L43M48q96N14L93r24
3045e42Q44k1o12P29n62j25P24q75M43J32n61O01J03q61J007n94j1O19o33K09
3065A4M54p75M70J67r10Q64l61j07N05l99j6M10o38L87M57q63N72j39l77P64m67
3086A2k82P63p99K50M40q36N42J93p54R04m21m00Q72n36j63P60q50K62L11o98
3106d30P32k50m30Q46n90k11P43o91J89N39q32N08J26o53Q51m18k99O66o95J9
$$ plain form
2964 -172 -265 310 -431 188 337 -577 344 -34 -441 342 -344 -340 543 -274 111 572 -441 217 209 -438 353
2985 353 -136 -266 430 -156 -244 437 -332 207 301 -446 264 -51 -223 348 -137 -296 612 -394 216 430
3005 430 -629 134 198 -363 364 -64 -345 537 -224 -57 387 -482 69 247 -531 392 10 -438 550 -72
3025 -72 -251 590 -491 142 368 -492 199 -10 -377 330 0 -305 401 -420 -77 371 -525 -11 382 -542
3045 -542 302 281 -331 398 -164 -289 435 -440 3 135 -426 175 278 -583 424 -170 -181 438 -195 14
3065 14 468 -307 163 330 -580 284 -77 -184 321 -78 -94 316 -322 65 522 -341 231 92 -285 479 12
3086 12 -270 493 -306 -56 384 -452 90 283 -471 433 12 -388 484 -52 -215 545 -305 -43 268 -430
3106 -430 302 52 -378 468 -122 -333 410 -281 -92 447 -385 123 249 -404 447 29 -270 396 -299 -280
3126b80P63q48M39J09p27R95m31m15Q70o79r6O01p72L92M89q98Q69k4p73P74m00
3147d2k94P02p26L35J93n92O66o7o19P93k04o59R81n15j24O15p87K73N80q97O35
3168B47j46m71P61n49l24J016q81K23N30q15N05J99p70Q35l92m09O66l79j0O78
3188E14p92M52Q8n73N10j4o54Q25l82l41Q02o39RN14q65O56N47q36L77m12N4L64
3210B04L81q40P23q86N44L60k2K8l91o08O93K06m16N67m47k60M17r90O08J28q4
3231h5J18K01n03Q24p51n0N32m45K98J63q52P49K57n93P33o89j61P71o21L42J89
3252D27p75Q3N72l06N13m50l49P46q29K70K99n84N26J09o02N19n3l50P42o22j53
3273b67Q33q68L62K12q03P73Jp77Q75p4n50M76l36O7N00o40K82M6m11M07n9l73
$$ plain form
3126 -280 483 -365 74 183 -544 451 20 -395 475 -204 -300 301 -471 -79 410 -488 381 357 -416 358 -42
3147 -42 -336 366 -360 -25 168 -424 242 175 -444 349 145 -514 467 -48 -172 443 -344 -71 509 -388 247
3168 247 101 -370 391 -158 -482 534 -347 -124 406 -409 96 295 -475 360 -32 -441 225 -154 -164 514
3188 514 -278 174 262 -311 199 185 -469 356 -26 -367 435 -204 -195 319 -546 110 657 -179 198 -214 -160 204
3210 204 585 -255 468 -418 126 486 464 492 101 -507 186 392 -24 543 96 -164 253 -737 -129 -1 -85
3231 -85 33 234 -269 555 -196 -246 286 -159 139 302 -550 199 456 -137 596 -93 -254 517 -104 238 427
3252 427 -348 -265 307 1 514 64 -285 461 -368 -98 201 -383 143 252 -350 169 116 -234 508 -114 -267
3273 -267 566 -302 60 272 -531 242 243 -534 341 267 -283 193 -143 -76 424 -216 66 112 -299 108 49 -324
3295c24O29n04Q0O18n41M8L16o07N22j99l44Q53l64l97N60m43j42O14q64N54O0
3316A25o15O94j37l22N85m86k69P98o82L70K64p04M76j28k57M81j49q0M43r00
3336d93Q4Q71q40J51L66n46O71J22q85R90o84l04J193j149Q7L00q37J176m29l93
3356e49K44J66k5N70p27O75K10r85N94l56m31P71j08n43J170j272O79J44n22M95
3376B00O12j660J428n18o17R33l91j86P23j129N02Q64j318O27J36j366J642k62
3394B20o52M70l09j42O30o7J66m34m16Q60m22j77l2L51l58O75j358O63k83Q85
3414B70J31j226O14M22j045M16Q96o14k5L45l51N65k93J9j03l04l7P69q59P6R03
3435E69j063L52L85n73Q44j01q46P54k77l87N23n23L44M25r73O54M3l95M87q9
$$ plain form
3295 -324 305 -199 -119 499 -42 6 322 -285 237 38 -306 547 183 -214 346 -97 -239 375 -489 65 125
3316 125 -490 204 67 -255 330 -156 -425 373 -309 61 325 -379 97 -31 -288 193 44 -36 407 -493
3336 -493 -409 462 -378 -227 139 -407 264 386 -499 491 -193 -497 696 -453 -366 -66 -903 273 -156 -549
3356 -549 -305 -139 -164 406 -321 354 564 -421 173 -183 -614 157 49 -494 676 -596 83 227 -295 200
3376 200 812 -848 580 62 -555 378 -13 -199 524 -605 -103 761 -557 70 206 -1160 482 220
3394 220 -432 38 -271 -413 217 150 316 -118 -534 326 -96 -273 -305 46 -312 363 -995 -332 -615 270
3414 270 401 -825 -211 211 -834 -418 478 -136 -161 184 -167 398 105 124 21 -283 -320 449 -410 -334 569
3435 569 -494 -142 243 -330 514 413 -433 321 44 -343 180 -343 1 426 -547 107 150 -245 242 153
3455A53n55J012n17m13O15n73K14M35o42M89k98K3J58j6l91O76n01J9M12q82M83
3476i9K55n69P01l13j01M24J2k15j17m83L70P63j595J131J58j210J046m54n8R35
3496E81p64n7N77p18M27J89p23Q91m68k34O42l66j52L82l93K56J12n44O87j61
3516A64m63M91l06q5M30l21Q2L00n96L59J97n85O33k69k97O23n65Q2K84l93M50
3537B15rl37J71k2l64O95l77j06N04n70L5M36m56L50n3k70L78j17l26O33m28q5
3559a03M11o08M28q8l93N18j58m47P20m66p8N53n93K09M97o91K84K03m53N45k74
3580A6l52N27k84j43M82n33L41L29p02N52j10n62P32m43LN51m79R0K14n20N14
3601B23j04m52M75Ol74O06p34L32L38p13M68R8n64O61j90m26M37m4j70M58o04
$$ plain form
3455 153 -402 610 93 -320 295 -278 -64 371 -271 218 -80 -57 101 85 -306 370 -131 -112 300 -582 -99
3476 -99 156 -413 288 -25 -126 298 310 95 -22 -505 -135 628 -967 164 322 -888 158 -296 -354 581
3496 581 -183 -240 337 -381 46 235 -488 403 -65 -299 343 -23 -175 207 -186 70 182 -362 325 164
3516 164 -299 192 -114 -199 231 -90 -8 292 -304 55 252 -333 300 31 -266 357 -208 -126 158 -235 215
3537 215 206 -131 40 18 -346 349 -28 -134 370 -200 -165 271 -185 165 112 -158 220 103 -223 410 -18 -103
3559 -103 308 -300 128 40 -353 165 7 -440 280 -186 -264 289 -304 -95 402 -289 -5 198 -255 290 16
3580 16 -336 191 -93 -236 246 -287 54 383 -319 233 123 -439 293 -150 -147 404 -75 15 229 -291 223
3601 223 119 -333 142 148 -226 380 -354 -22 316 -397 71 169 -395 266 76 -350 87 43 -127 331 -273
3622b73J47L88n44M02o8m38N39n2k70N11m94K01Q4o54M86J51l59M92k05l07N01
3643B38m42n4Q22o90N2K33m71N85l3l42M20l32m6N07m16J63K13q61J089m34k74
3664g3N36l24QK54j19l79N55l89j84j07R9M58k23j73O98n96k66K54k70R5M05m28
3686a69K55L71p41P71mn19L03n34O26k08m61M94j04l86K86J82n38N85l95j15N41
3707B40m18J71L74o22M30P1l67J89j10j31K25j44n2M62o39N16J12o58N09k99m0
3728a81N07n93K14K22k97J21j66J75nl75J68L63k70R2N90l53q42P06N84m64m86
3749b90m15M66J060j522Q83k18P3L71j036N29m39P56l29O65j027Q99j30j237J440
3768D99p07K35M28r96N66K81k35m46M61K36J17k33q34M61P6J74J74o16L89k88
$$ plain form
3622 -273 -126 262 -282 120 52 -386 153 101 -169 342 -152 49 133 -521 -35 116 -243 249 44 -263 238
3643 238 -204 -258 564 -126 -74 159 -312 273 240 -102 318 -14 -60 447 31 194 407 -454 635 201 -73
3664 -73 463 139 147 401 282 -97 458 69 -115 -222 -123 335 112 -61 637 41 -225 29 -241 -146 259 -169
3686 -169 86 457 -284 487 483 -36 267 -267 359 151 -310 184 80 -306 -20 162 -376 209 -186 -301 240
3707 240 -178 -7 367 -255 175 246 -121 68 -42 -173 52 -92 -144 318 -321 195 307 -351 158 -141 -181
3728 -181 326 -267 -53 169 -128 -7 -173 2 -3 -378 -210 153 -117 -25 565 212 -630 76 660 196 -290
3749 -290 -705 -239 821 -701 182 -36 37 408 -628 -99 -538 218 -111 554 -473 426 296 -941 499
3768 499 -208 27 455 -541 25 306 71 -375 86 322 439 206 -628 -167 -91 83 257 -359 30 -258
3788b58k87J292o17m85J001n44M12m88l14P09n39J38P34r70M33L0l53pJ30j69
3808a52k93M39m31L30P8K22N01n63m31N03l76J2J0L46n42L76r1J12q56Q35j24
3829i5N11l85M62j032M18j79k54J097n53j18L53r1k16P62o43l84P26j61J90j45
3849B63j048J055m37P9o4K53p3J54K10n8j25k14O04m54o03N87L98p07L09k66L70
3870B33r5o95O35o8Jj6J28k21N15p42J87N64o14J02K07m33K09K82l21J38r1k49
3892c44M13j75J75Jq7k19K85k06K58p8j02j41Q3k2J53k21L85k64K7K87k22j31
3914a45L30o1k57L83l16L5J72k32Q7J29m62P41m02l1L12m81K41M71p93L49J08
3935A78l27J87k43P6K60j94J13K03n15L43L48p39L92o4l29N81m19l7K05j19P9
$$ plain form
3788 -258 -545 747 130 -355 646 102 514 26 -288 421 -118 20 754 -216 217 247 -106 -113 17 -152
3808 -152 -445 -6 -437 -107 -29 193 694 131 -300 203 -173 -161 -151 195 -347 29 -62 50 -806 29 -95
3829 -95 416 31 493 -539 -121 -300 -554 543 -10 -128 225 134 -82 680 37 -347 379 218 408 263
3849 263 -785 270 -167 -88 -152 101 28 182 392 334 209 -5 599 145 -458 129 527 -180 129 -137 233
3870 233 138 -557 78 10 11 -5 123 -98 417 -325 -138 426 -188 -86 121 -312 -103 179 -142 -4 -95 -344
3892 -344 69 -106 69 70 -17 -236 49 -157 101 23 -79 -220 -137 -159 -6 -227 158 -106 -79 208 -14 -145
3914 -145 185 124 -133 250 -66 -31 141 -91 -4 125 -337 404 2 -29 283 -198 43 514 -279 70 178
3935 178 -149 38 -205 -129 131 -63 50 253 -262 81 429 -310 82 18 -311 270 -149 -186 19 -100 -21
3956b1N0j58K34m1l08L21j30k52N73k79j72L72l07O1np9L52p4l13M28l76m3K90
3979A23j59J51K08p46N36j63k35N51k00j51M77l91k2L21n11K59J31l74L14j11
3999Hp8J77k72j25L17k57L50L15p42L85n7l81M26o4j08K66l40K11J64k44MM08
4021C63n67K21Oj96K87k80N8M05o88N95r6l71L89q6j03K15k01J11J13l74K26J67
4043A94l52J52KM4O2j91j24L83j88k42M60n21M5O93o48K48l55Q8K89k45k17M89
4065F6n00J020k87j26k53Q70j009K40K80o70L93L67o84Q90o47j32j97J47J62J37
4085F7o21O04k36m52P76M08l47m61N18m28O25r34M79L39p74O78J42n87M52q26
4105e78M60l14j77P35j73k07r5j4M28J77l34J82M68j158J011o28K27N80n63k8
$$ plain form
3956 -21 29 -129 105 64 -244 77 -53 -305 268 -11 -183 189 -118 -57 -62 -141 211 137 -176 252 -124 -167 123
3979 123 -36 115 323 -423 113 -50 -285 266 66 -85 392 1 -21 300 -211 48 179 -195 119 8
3999 8 -70 107 -165 -290 27 -230 120 435 -307 78 21 -360 66 2 -106 160 -180 31 195 -49 -45 363
4021 363 -204 17 23 -173 114 -166 -108 297 -391 204 108 -263 126 40 -63 152 -49 62 175 -199 27 194
4043 194 -158 -6 -4 40 102 -89 -213 170 -18 -260 200 -321 -276 417 -231 17 -338 -250 39 -206 -423 66
4065 66 -434 586 299 173 -80 790 -219 21 301 -369 24 391 -293 597 -50 -182 -379 -232 -70 67
4085 67 -554 50 -186 -638 138 546 199 -262 256 -172 453 -481 -2 337 -437 241 383 -204 248 -578
4105 -578 -118 -432 -609 126 -47 -254 -349 -363 65 242 -92 90 558 -600 411 -217 10 590 27 -1
4125aK2j56M8N36L10o6n90j6l58N01p87O09j06J3j51l6N04K67j076J410p58j36
4147a7j17Q4J80N29k18o56L04k12J1K16q18Q05j87L9n3J74l4K09m01L16j60j42
4169a48K16j50Pj0j73P8O82m66m63J021l96l37O97p99M1R7m50J098l55k73M37
4190C54k81J27j01k32M8k62k42Q31k2J08j56J15K98l68J81J89p37K99L86p08K95
4211A22M07k26o61P62l99K03k5n77j13Q29m66M08j64k26O06p58J22K48m36O39
4231B95n56L36l89K26N13On64J08%l79K12L47n98M26M8P5l4m7J22K67o10r2M24
4254A36l32M5J57k19O51o48l04P20j38j73o1n8O23m78J75J44J84k03j93l58j42
4275d72N66j16M51j26m54K82k85r4O02o41M46L86p34J00p1J84j09K09m82N53k72
$$ plain form
4125 -1 21 -135 -87 449 759 693 103 87 -271 230 -557 52 -54 -41 -192 -228 276 543 -533 877 119 -17
4147 -17 -134 -50 130 659 441 -215 89 -123 -112 104 -714 91 -96 -57 -110 64 30 239 -162 154 -6 -148
4169 -148 68 -82 -75 -85 -258 -180 502 36 -427 594 198 -139 558 -241 -200 -103 -553 545 190 -83 354
4190 354 73 200 99 -133 -85 -347 -589 242 220 328 172 287 585 217 398 587 -150 149 535 -173 122
4211 122 529 303 -358 404 5 208 183 -394 -507 322 -144 264 100 -126 480 -278 -156 92 -344 295
4231 295 -261 75 -314 -88 425 431 -133 -25 -25 -404 -192 155 -443 -17 31 106 72 25 147 414 -196 -288 136
4254 136 -196 -151 6 -213 438 -210 -514 206 68 -105 -166 -224 399 -79 96 240 424 221 28 -330 -472
4275 -472 94 -22 429 303 -151 131 -154 -248 354 -287 159 545 -189 -89 -160 24 -85 124 -358 195 -77
4296g7j84L23m85M28K61n80P0M83l11L89n5p91M40l23M22R47q61p01Q37m65nQ88
4318F50j357J356m49l96J86k61M94M62j374M57o2K88L2m94P1Q07m92k5L22mj61
4339E0K44q74M54O31q39L07J76k78J55k31p5K47m3L56k98p7M2K17k05j62O04m30
4361b9J99n34O18K1n37N66j00m49N05k00L4K1L0k11J11k7J29j26k28O10o07J46
4383e8O17l77P1jk89J56p6l26M65k71j88L72j01l5K45j46m21O10k65K68j73l9
4405C8K66n96j3O53l68j44L49n12n4O22k39J56P5r59J151n48l21M94n29N51j83
4426a11j19L75r9o76Q06j72k2Q1k20k38P86o91J95J27j09K09l3m74N74M6j60J15
4448A90n70P32k23j87l29J76k18N05K64m26l80K57j4M92o20J24P39n15M38q14
$$ plain form
4296 -77 -261 62 -423 5 266 -314 -244 239 -72 317 262 -529 -89 -412 10 957 96 -605 232 -233 -238 650
4318 650 -707 649 200 -196 -10 -271 223 685 -689 -232 -294 -6 26 -468 -397 410 -82 -107 215 211 50
4339 50 294 -580 -126 505 -334 -27 149 -129 26 -205 -280 -33 -76 280 -18 -95 -53 164 -41 -203 401 -29
4361 -29 170 -364 254 275 -262 304 204 -245 260 60 94 115 145 -66 45 18 147 21 -207 403 -204 -58
4383 -58 559 182 253 252 -37 119 43 -283 182 -89 -277 95 -6 -41 204 58 -363 247 -18 250 77 38
4405 38 304 -292 -305 348 -20 -164 185 -327 -381 241 2 158 233 -726 425 -123 -444 50 -479 72 -111
4426 -111 -230 145 46 -630 176 4 -18 63 -157 -395 391 -300 -105 22 -87 122 89 -385 189 235 75 190
4448 190 -380 352 129 -58 -387 -211 -429 76 340 -86 -466 -209 -223 269 -351 -227 512 -3 435 -379
4468c79%J054o65l35Q65l05k60k42P56l93J79o46K74J88o70O18j99N35n83K94
4488H6L48n12m22J006J99r19K75J0j35M54m45K4M75q09P74o31J81q9J37m31O83
4509B59p80N45K13m17K10J05l43L30j16k19P76p56J96K40j96L70j8n85K18O3l28
4530b33K21P5j10j7L71m76J34l95N27p4O3M52j039j40N83P8j06j16N52n62Q12
4551F00p70J37J7l35N31l80j80O15l56Q3J19j47K73k43JJ61k65K91M79j062K87
4572a44L20n28L15j8k63P63r68L04K60k15M57j02o02M48%M40m81J70r9M41n27
4593b9m65N71m09K64k3J30N9J19l52L91j73j89L51k97r1J95r8N2L12l29mJ82k89
4616a22K87q1k14L64m86J56J61l42J42J14p9J33m5O4J2k08n2L86m60J40K31l51
$$ plain form
4468 -379 -379 675 10 -325 540 235 -25 -267 489 96 275 -371 -97 91 -579 39 -160 375 -208 86
4488 86 434 -78 -500 506 705 -214 61 71 -64 390 -55 -31 444 -365 409 -222 -41 -130 7 -424 259
4509 259 -521 24 237 -180 30 135 -208 122 6 -213 563 -193 3 243 47 417 399 -186 32 95 -233
4530 -233 -12 63 -47 -64 307 -169 -35 -430 97 23 86 538 -501 -641 -58 20 -86 -202 350 -212 600
4551 600 -170 -33 -16 -351 180 -200 -380 235 -121 -38 81 -66 207 -36 -35 126 -139 152 631 -431 -144
4572 -144 176 -352 -37 -55 -318 445 -523 -219 41 -174 283 181 -421 27 27 467 -14 156 57 498 -29
4593 -29 -494 77 -332 -68 -91 39 98 217 -135 256 83 -106 245 -52 -143 52 -46 6 318 -11 -15 167 -122
4616 -122 165 84 -130 234 -252 -96 65 -277 -135 -21 -100 33 -12 52 64 -144 -196 190 -270 -130 101 -250
4638b50J71J43l48L84k60k09K42L16p87R38q88O91J02k33n36N27m75L93j51n65
4658g95J306r13j69P66m17M43k76k14L32o25L56q5P02o46N19l87k36L91L07o60
4678c01P47o26m6M91l98L73p80J209k57q67J054n20m63N24L0k70K5o40O68O82
4698F35q61l0l90M14J83O4O00j43l09J0J07P8QJ65k35n28P01m10J70m04P7m37
4720e35N33m44m6M50m0O53j446R25L69q94J023l17j32m69j06L56j43M33M70o17
4740B3j170R14J8p2R76o30R7j12m30j65N03j49K21J41n92P07n32P70J22j433J287
4761D94o77N53J17m46K35o31M61m56K22k49m4L38M37J87n8j029M70L57q19Q05
4781B67k54J33q43Q46L29o84j80L16OL85l00m9k10R95j260q2M88p2N77k15J59
$$ plain form
4638 -250 -79 64 -284 100 -160 -369 -127 189 -598 340 -548 143 245 12 -524 3 -472 -79 -230 -795
4658 -795 511 -402 -571 195 -222 221 -55 -269 63 -562 -206 -291 411 -235 284 -103 -339 52 359 -301
4678 -301 446 -180 -226 265 -133 240 -540 669 412 -455 599 79 -384 140 170 -100 -75 -715 -47 635
4698 635 -226 -256 -646 -232 -49 15 615 472 163 173 280 358 366 531 296 -232 469 59 229 -175 -98 -535
4720 -535 -2 -446 -492 -42 -82 571 -875 50 419 -475 548 231 99 -370 -476 -120 -263 170 640 23
4740 23 -1147 -233 -215 -287 689 59 156 44 -386 -551 -48 -197 24 165 -427 280 -252 518 640 -793 494
4761 494 -183 370 487 41 276 -355 106 -350 -128 -377 -421 -83 354 541 483 -546 -76 281 -538 267
4781 267 13 146 -697 149 478 -206 -386 -70 -64 321 21 -28 -238 757 -503 -585 -97 -169 408 193 352
4802C52o88J15R2m9M17o05R16n32o5p6l73R47n77m06Q72j78j08Q1k33m75J96L45
4824c2J26l08j74O9n59k12J930m68n49Q8j10j28Q04j17j122J001P0J01p80K65
4844a05O36j349R18L10q48L31O26r62L20o11J258l90L12L3p54j57J74N88p97O81
4864B14m01k20J127n71l70J034o12N1k41m05J37M70o17J78k32J49L45l02O09m66
4884a23P0M00K42j022O01k66j85K28K16j44J8j76K09j44J7J24k61L37N91r10m05
4905e83K98j87K10j42K30J11P19j092P76l81J41k86L55r9R0n59M83j83p90J689
4925H00j089p4P13K02p20m6L54p9mk11J13j20L02l21K08p43Q07p8p46K28kK25
4947b81L33n35L65j40P78o48l92n9K4J80J343q31k98M99j34l9k30J35o27J216
$$ plain form
4802 352 -336 -221 -129 -178 239 -366 550 18 -47 -123 -496 451 -126 -532 340 162 54 135 -98 -573 -377 -32
4824 -32 94 -214 -388 -319 -878 -1090 840 372 -177 -89 -199 -327 477 360 -762 239 309 410 -370 -105
4844 -105 531 -818 100 410 -438 -107 519 -443 -123 -734 524 134 446 479 -275 -432 -258 330 -467 214
4864 214 -187 -407 720 149 -221 813 201 252 11 -394 -257 213 -404 -226 -458 -309 36 -266 343 -123
4884 -123 -53 347 589 -433 168 -98 -283 -55 161 17 35 -141 68 -76 -59 65 -196 141 732 -178 -583
4905 -583 -285 -472 -262 -404 -174 -63 656 -436 340 -41 100 -186 169 70 160 -399 84 -99 -889 800
4925 800 -289 -363 350 552 -168 -214 140 61 57 -154 -41 -161 141 -180 28 -715 92 14 -732 -504 -506 -281
4947 -281 52 -483 -118 -258 520 -128 -520 -579 -555 -375 968 137 -161 338 204 165 -65 70 -557 659
4967F59j197J12l54n3Q22K95j94r81R93o9k39m7j2M67q66O47l21K14K58p34Q96
4988B96j037M21k66K59j99L44l63l3J05M10N50L20q06J78K65m04J32o86K49%L32
5009F7M3R5j81R3j13k0K60l1j0p19M99L36n09k33J098n13k69n08J062j04o98J74
5031a81o38J184L10p35M93m71k2K05J73p57j54L20j47J018r47P76l92R9N32m63
5051B03q37J052q47P21p93J047j136MQ90n43M50l71K1k94K2N89Q7k26M4J27J94
5072D04k68p5j135J111l83N23L60l66n76J68L17L91l07q06O74l61O01p07R35m58
5092D2m20N07l76P72m66J35k68M62o01j09K34K03l11j92M55j5l14q7P53n9n76
5113b31O02l16l46l9J35J54Q0j75N2J06l15M65j28j2n0p8N3r0J9j99K89o0L8J96
$$ plain form
4967 659 -538 -426 -780 -833 -11 284 90 -891 102 33 -206 -253 -265 202 -664 -17 -338 -124 134 -600 296
4988 296 -741 -320 -586 -327 -526 -182 -545 -578 -473 -63 487 807 1 179 444 40 172 -514 -265 -265 67
5009 67 110 205 24 117 4 -16 244 213 203 -516 -17 319 -190 -423 675 162 -107 -615 447 343 -355 -181
5031 -181 -819 365 675 -60 433 -38 -60 145 318 -439 -593 -273 -420 598 -349 427 35 134 666 203
5051 203 -634 418 -429 292 -501 546 -590 -586 304 -239 211 -160 -139 -433 -411 178 265 39 83 210 404
5072 404 136 61 -1074 37 -346 177 537 171 -405 -237 80 471 164 -642 32 -329 272 -435 500 42
5092 42 -378 129 -247 525 59 194 -74 388 -213 -322 -88 115 -196 -388 67 52 -262 -349 404 345 -231
5113 -231 371 55 -291 -330 -195 -41 39 -136 -84 22 -293 172 44 32 -18 -96 -43 -133 -114 -313 -24 -84 -46 150
5137A50l68O4N3J39K22l66P3N1j52J96J83j22k1k70J13R8J4O7J25l37q9J59R2
5160G4j64p1K06M0o3k09M14k63J89r5j39R7m8N5K9J28l15K53q3J9L4j87p6K07
5184C2k35K38J3p1L45k02j30J93O8j49J25o56L69P46l81j09N9m08M42M24j446
5205g33J283j045P73m09P09k62L73l81k69k63N4M52k07m47K04J12N73j08p54J166
5225H21j049P20l13n32K89K62l90J30l07L1N52o44N51L81p92K70j63R1J59j80
5245a13P1l57J34J04K69j04K7O82j049L88M61m23n25J41M64l51J00r7N91o48j78
5266d13L45NJ11k2n05O56J30j50l17k96n4N50j01L44k00l32K39J7L34l62j31J16
5288c6P3JM74j8p08J09j36o39Q66K40l79N90j59l96J89L14m82M86o00M4M35m98
$$ plain form
5137 150 -218 -154 -101 38 260 -106 -33 18 -134 62 245 123 102 -168 -55 43 57 124 249 -88 -177 -18 74
5160 74 -90 -161 45 85 22 -187 227 -36 153 58 -81 16 -32 23 52 180 -135 118 35 54 88 -99 -175 32
5184 32 -203 35 48 -23 322 120 -10 183 251 102 227 -429 -60 686 305 196 255 -153 289 713 -733
5205 -733 550 -495 278 -131 578 316 689 308 39 -224 -170 282 75 -372 -168 -56 517 409 -345 821
5225 821 -228 492 179 -353 -64 198 -192 -62 -369 -338 214 -430 121 502 -290 -20 -183 -92 67 -113
5245 -113 -42 -399 -265 -161 108 4 31 713 -336 52 513 90 -435 -294 170 -181 -81 -178 413 -235 -413
5266 -413 -68 -63 48 26 -479 177 307 157 -160 -456 -510 40 -61 283 83 -249 -10 7 341 -21 -152 -36
5288 -36 37 38 512 494 -214 -105 -241 -880 -14 226 -153 437 278 -118 71 385 -97 389 -211 -167 268 -230
5310b30M81m25M66l04j60j21K19P8j09L55l76L66j23k86K86j38j86L96r7j48m9
5331a05L9K94l91L68l40J83k82k1K43J65N06n12L79j49o41L67l15j0K64l28M15
5352A29K53o74J21J51m79P41o34N10O09p23Q00j025NJ85N53j071O83O27m09R4
5372D46p32N08l19r9Q09n72J25J46k15m80j49O69K37j0q49L85K64l16k46P93j66
5393B29o83Q80k12M91j809O91J60j78R39j29r66J5N31q5N14o39k44M88l38K30
5413a15k78q2P95q28K81P00p05K54O02l63j220J163j95l68Q6N01K85n12m22L06
5433a15P6L3N45m34j98o2J362j103m01o51J097n55L96j86M47K49p90K03N25m06
5453C2n62Q73m27l60R57q72N28L3r6K08o50l36P25P83q12Q2m09K26k25R05j228
$$ plain form
5310 -230 251 -174 292 -12 -172 -293 -74 4 -105 250 -126 240 117 -169 117 -21 -207 189 92 -56 -105
5331 -105 -66 228 -163 205 -135 48 -234 -255 -12 153 659 147 526 377 -264 103 -212 -222 42 -286 129
5352 129 382 -292 -171 -20 -499 242 -392 118 727 4 804 -221 -216 -31 522 -549 134 761 352 446
5372 446 -286 222 -97 -196 613 41 166 312 97 -383 -532 137 374 364 -485 -100 164 -152 -398 395 229
5393 229 -454 426 214 705 -1104 -413 -253 -431 508 379 -587 -572 -41 -126 388 -251 -495 -7 -345 -115
5413 -115 -393 -475 320 -508 -227 473 -232 22 624 261 -959 204 9 -359 -273 228 513 1 -421 -115
5433 -115 -39 -6 539 105 -93 -155 1207 104 -297 -948 149 -406 -10 -196 251 500 -290 -87 438 32
5453 32 -530 343 -84 -444 513 -359 169 202 106 314 -336 -672 53 836 24 106 -303 -77 -302 603 -625
5474f25J83N00M26q3o41K66j50L5L21p03J104j147J12J71J28N30k2oo2p6K33q53
5496c59M56l59L27j06n1q73O83L48j203Q41PO00l29N54n39M77L18n46L97r05j13
5517c75L19L68N78j230O12r04J188j314N05m62J030m34m96N5P37O23r44O22k95
5536A83l62j94K13M30k62j6q22J042k59r39L26J071o07N26q06Q0l51O77L11K52
5556D93k60n43Q10m64j33J39n4J20N42p25j80j31k70N29j20j57L26L2J62j0k56
5577a50Q6K89o33m44L88M79K43p3K86l23m67J6K48J70r7l24L02p2lJ264j184Q86
5599H87k03p56j50J3N38q25O31k66K19k73j21M87k73K38M30j056k38N12J2L30
5619A36o20J18n1J231p96M37j030M90N59k38N0p69Q38l79J2m32R23q78L20n4K13
$$ plain form
5474 -625 -442 58 484 401 -240 26 -124 -89 232 -471 633 -514 -402 -231 -103 427 405 399 337 261 494 -359
5496 -359 97 -262 65 -41 -92 -965 -282 66 -1137 -296 -289 311 -18 536 -3 474 792 246 643 -262 -375
5517 -375 -56 312 890 -340 272 -632 556 -758 -253 -715 315 -119 -615 -560 177 800 -144 478 183
5536 183 -179 -373 -160 270 8 -8 -830 212 -47 -986 -660 411 -196 330 -476 -396 -747 -70 241 493
5556 493 233 -310 500 36 -97 42 -12 108 650 -75 -255 -386 -656 -127 -247 -404 -78 -46 116 106 -150
5577 -150 -64 225 -408 -852 -464 15 258 185 471 148 -319 -303 -55 115 18 -306 -4 -76 -79 1185 1 887
5599 887 684 -72 -222 -209 329 -496 135 -131 88 -185 -306 181 -92 146 576 -480 -718 -206 -194 136
5619 136 -484 -366 -417 814 18 455 -575 -85 474 236 286 -483 355 -24 -12 -444 479 -399 -79 -133 80
5640H0m06L75l66r2L49K11j47l68L26m30L36K43k02J29J49k53J91m18Q2l95N43
5661f3J80o90N48j30J84n01P33l63j57J84l8o4j33O04R4k15l17m29L97J79l83
5682c80J97%L5mK7K28K45k76M2L59k73j71M11p33K88k46O87n19m7o00Q12j20J78
5705A40m58n9P69j53q47Q87L15m17M81j475N54J86l67L08l65N21K09l93L6O09
5725D81o07J51M56q31N29k54p72P95R0J38n0J25n9j45J64o17P94o19K65O8K11
5746C13l9k63m48N49O9nm27L17l87L79m51N63k06j80P8l13P7O98m06P1l8l73M38
5769A6L46k11j51J22l38K55j34j16j0LL14l7J51l3m69mK88j07o2R4L97k81l19
5792b86K68M4L07m8k42n74O71l34K60m8k06N0kl1K32N6J8j99m7J05o1O3Pj42m2
$$ plain form
5640 80 -326 49 -317 -409 -60 151 4 -364 -38 -468 -132 111 -91 38 187 -66 125 -293 -211 -606 -63
5661 -63 117 -573 -25 -155 29 -472 261 -102 -259 -75 -113 -177 -310 294 388 173 -144 -573 -176 3 -380
5682 -380 -183 -183 -148 -152 -125 103 348 72 114 473 200 29 440 -293 -5 -251 436 -83 -130 -730 82 -38 140
5705 140 -318 -377 392 239 -608 279 594 177 658 -817 -263 -77 -444 -136 -501 20 229 -164 -128 481
5725 481 -126 25 481 -350 179 -75 -847 -52 38 176 126 251 192 47 211 -406 388 -231 34 102 313
5746 313 274 11 -437 112 181 176 -251 66 -321 58 -393 170 -36 -216 -138 -451 -374 324 -82 -11 -49 -422 16
5769 16 362 151 0 122 -216 39 -95 -211 -221 -218 96 59 210 177 -292 -296 -8 -115 -177 -83 314 33 -286
5792 -286 -18 26 333 285 43 -531 140 -194 66 18 -188 -138 -140 -171 61 117 135 -64 -111 -6 -67 -4 3 -139 -181
5817a81R7o9R1P3J57q5j71P2l25M17n7N6n2j26L01m0j20o8p9J12J38r0NP3m2k64
5843a77K48j74J36jj65P5L9Mr4Q7j16P9J07r3J16o7J0J35k49L05j95K12j27l7
5867E8j3j71K9k10L66m3o7P5j2R7k4L4K6j90J12m1J03j66R0j21O2l7p9J49j54
5892a27KK03j19n4N0j23K47K0k27J92q0j18L16k58k2K22m78N91j20J6P7m36L32
5915A06M9m94K07k9L5K94m78J24P54k72o71N14o1l66R96q08k57M61k37N4P1l72
5937c80N65j24j27K37j63k3p2K15j47J47j52l9P6l9Q8O0l11M27m13J3K95n02J93
5960a76J73p2k4K26l83K07K21j69N5k97R4L96n72L83O3k43j25J41J80k80j64o
5982c72K49m61N95M2J70n05L42o2n39J27L66P4j87j26j04R20o60K68Q9j59pj09
$$ plain form
5817 -181 -84 -153 -62 11 168 83 -88 -16 -341 76 19 75 23 -103 198 158 38 -30 -109 3 141 51 56 129 87 -177
5843 -177 71 -103 33 32 -133 -58 -19 -15 -109 -22 -138 -59 48 -45 71 4 14 149 -100 205 10 222 95 58
5867 58 45 -126 -97 -307 59 16 -51 24 12 109 85 119 145 -45 67 26 129 -37 53 -68 -6 -43 -122 27 -127
5892 -127 -125 78 -41 -95 -45 -168 79 99 -128 64 -16 -134 182 -76 -98 124 -354 237 117 133 210 -226 106
5915 106 155 -339 -132 -161 -126 168 -310 -186 568 296 -375 139 78 -288 708 -100 -357 104 -133 -79 -8 -380
5937 -380 185 61 -66 171 8 -15 -87 128 -19 128 -24 -63 13 -26 62 122 -189 238 -175 -162 133 -369 -176
5960 -176 -3 -75 -99 127 -256 -49 172 3 58 -239 -145 251 -321 62 125 -118 -243 -102 78 -202 -366 -372
5982 -372 -123 -584 11 53 223 -282 60 -2 -541 -414 -48 26 -161 -287 -391 529 -131 137 226 67 60 -49
6004d9O12q25j03O77m60j01L53l09M6J08P4m10J21N11L4j92k99m23J87L24J88
6025F4o68L43L34n16L0O29J16m67k27o87J296J29m18k23M58M53n32o38M12m94
6045f06M95p2k74R88q9n93J0j73O13m70N33n31O26l01K47j46l18n39M01J64K35
6066B00j68J82p91M59o01P47m53M09O9J84k6m44J60n32L58L76J34K39k20r1l94
6087b03O78j40J28l29L71k3k08j57k52l6L24n61O49l36K55p07R44k48j43j17L99
6108B88m72l00M61q36J348m57r06Q06l32K56M33l96M73m79p79Q61Q67J79j718
6127g03M09k80J40L64O4L38l02m26N56q43O55L67j138N25j88O72p17M76J38J43
6147B50m91L06j34J77J35o01J13L71r8j4j295J217k28M78k77L31L8m89Rk11L37
$$ plain form
6004 -49 563 -262 -365 312 -148 -249 104 -205 -159 -51 23 -387 -266 245 279 87 -212 -635 -448 -124 64
6025 64 -604 -261 73 -443 -413 216 332 -135 -362 -1049 247 376 -42 -265 193 646 114 -524 -112 -606
6045 -606 -111 -183 -457 531 442 -151 -141 -314 299 -171 362 -169 457 156 403 257 -61 -600 -199 -35 200
6066 200 32 214 -577 -118 -719 28 -425 -16 53 237 211 -233 -73 -605 -247 129 263 502 282 191 -203
6087 -203 475 335 463 134 505 482 274 117 -135 -171 153 -408 241 -95 160 -547 397 149 6 -111 288
6108 288 -184 -484 -23 -859 489 32 -874 -68 -400 -144 289 -107 366 -113 -892 -31 836 1015 -703
6127 -703 -294 -574 -434 -70 -6 332 30 -396 160 -683 -28 339 -799 -274 -462 210 -507 -31 107 250
6147 250 -241 65 -69 108 243 -358 -245 126 28 14 -1281 -64 -292 186 -91 240 278 -211 -202 -413 -76
6168g6l06O88m49L93L2J89k34K08o45J043q52L39j68q12L41L55J02L50o39J15
6188b6m6K2k46R34q01p0L18P8j74L34L4M6m40P0N5K30j71j76J90n88k45O06K23
6211A57k41J24r2K22l57J14k13J20k0M4N03k92k43M97m33l0J12k82L19n8r0K27
6233H8k17OJ77j7P3mj47k28k11J79M9M95p8J35L08p82l31nL06L4J95K32m04MM30
6258B87n31L00J89J97k68J70p26L4L78j73J28N26o76K60k3Q7l3N9l60K50M72l29
6280B18k19J73r1j45q3l22N46j05K54o01N06m54N43k88j27J37J64Q6o0l91K72
6301A3n9l8L73m00o8OL51m20P9J82j99K2J30J41j39j05j53Q2J05k81N54J74k69
6324H1Q5l28P8J43K16j75j05N9J12j99j51L8KL3J75q2Ql9J0M4r4l4K14J2k75L13
$$ plain form
6168 -76 -382 306 -143 250 282 471 237 445 -200 843 -9 330 162 -650 -309 46 148 498 -141 -26
6188 -26 -72 -50 -296 638 -163 -233 85 163 -11 323 357 403 -37 33 88 318 147 -29 161 -427 -672 -66 157
6211 157 -84 40 -52 170 -187 -73 -286 -166 -186 -142 361 69 -174 323 -110 -140 -28 -310 9 -49 -139 88
6233 88 -129 -123 54 37 110 106 -41 -269 -480 -301 -252 243 165 300 608 -174 -505 -510 -204 -170 25 257 -147 -143 287
6258 287 -244 56 245 442 174 344 -382 -348 30 -143 -15 511 -165 95 72 159 126 185 -175 75 547 218
6280 218 -1 172 81 -64 -147 -469 77 -28 226 -375 131 -323 220 -68 -195 -58 106 192 132 -259 13
6301 13 -46 -84 289 -111 -179 -173 178 -242 -163 19 -180 -158 -28 113 -26 -131 -284 -202 -97 -378 176 350 81
6324 81 166 -162 -84 59 275 100 -5 54 166 -33 -184 -146 -144 -111 64 -18 -10 -49 -39 5 -89 -123 91 103 -172 141
6350A41k76L54j78M2k08Q5J82K13q3p1k38J88L0l3l07M57j15l21O4o7N69k98l88
6373b58J22L94n32M04j75K7j03K69j18Nj91J65J31r7J28j14k03L16j60M6j7P9
6395A18j60L0r9K60r3j21N0M1j71L1N9J50L4Lk05K8M1q3J62k22J25r0J75nq0q
6421c0j0K5M7m2n0p2R2N5m7k9m4K06j28J06l6m6P3J6j13Q8j90N9p9J90r5N6l7
6448c5j1l8O2P6r6k4n3R1n0J23j3J16l42J77K28p0j04J54k39m4q5J64L1J43j58
6473Cj82K23j07J93m71L07K22rp3k7K47r0l63j84R5M9P9M54m31m42M82j02k9K21
6497F5l8J03p8J7j56Kj47M59m7k04Q8m0k21J82q3L13o7j31lj37J46r8L1J91m04
6522b57K35J12K33m18OJ62j22K19k36L11l55qJj02k44K95N1q2J00Nk53M11q1k78
$$ plain form
6350 141 -135 219 41 83 -125 -40 142 355 272 201 -37 151 181 148 -159 298 183 -138 -74 -141 428 130 -258
6373 -258 -136 258 -274 130 -45 -18 -121 148 30 35 -156 9 140 43 171 57 -146 170 10 56 39 118
6395 118 -42 -12 -111 149 56 -65 -15 26 -145 -114 -55 95 129 132 -73 -45 -4 -87 75 -147 -22 -112 63 58 -22 -30
6421 -30 -40 -15 32 -10 -60 -132 -40 15 -32 -61 -105 101 -27 79 43 -3 70 86 -27 61 -129 -70 -149 41 -54 2 -35
6448 -35 -46 -84 -22 54 -42 -66 -119 -28 -78 45 32 148 -194 -17 211 141 37 191 -48 -92 -177 -13 18 161 3
6473 3 -179 44 -63 130 -341 -34 188 179 106 79 326 236 -127 -311 -216 -167 -88 366 -65 -507 -25 -127 -156 65
6497 65 27 130 52 69 -87 -85 -232 227 180 -24 64 24 -197 -15 -98 215 148 17 14 -123 23 -75 -44 147 -257
6522 -257 -22 90 323 -95 -89 73 -49 170 -66 245 -110 -118 -117 -219 -463 -168 -117 -199 -99 -94 -347 64 -17 -295
6546b95K12Q5J64k67K49J3l68J89J85r8Q4M5j010J064nn33L58j08Q7N26o62k06
6568b91K07j86L82j48K23j0l8k36R4j36qJ57Q0k10K31k72L9J82k55K54k9o01N82
6591A1l7l76M29k73L57k17K33k64o1j71J26K4K34j37L82l08J69l57K58j41j88
6612c07M71l73l51O21p3j98N95j417J003K2L53Lp6k38j5O8q7J04q9P9K20o83K8
6635c40L51Q7L9n22J58O52o97j13L08J57K10k40K47m92N86o73Q92o07r3O51q32
6656b71K97k81k29K98J55L49o71J87J26K7N4L34n5n21L09k93m78M82M64p91J216
6677G08j165J004o99J67m19N47m93J95j81K88j30J09J16k43L52k09O96o29K06
6696B20j01j52J68L7m99k00M87K58n81N27k83j72J98J19o9o91P37l0L38q13P35
$$ plain form
6546 -295 -83 2 166 -101 148 161 -207 -18 167 69 153 198 -812 252 247 -286 72 -36 51 577 -85 -291
6568 -291 -84 -270 112 -36 187 177 139 -97 -3 -139 -147 10 90 -120 111 -161 -122 60 -195 59 30 -571 11
6591 11 -26 -402 27 -246 111 -106 127 -137 -198 -369 -243 -219 15 -122 260 -48 121 -236 22 -119 -307
6612 -307 164 -209 -560 61 -12 -210 385 -1032 -29 -7 346 349 273 35 20 88 1 105 16 95 315 -368 -340
6635 -340 11 98 137 -385 -227 425 -272 -385 -77 80 290 50 297 -195 391 -282 610 3 -90 561 -271
6656 -271 26 -255 -484 -186 -31 318 -353 -166 -40 -13 41 375 320 -201 108 -185 -663 -181 283 -508 708
6677 708 -457 547 -152 15 -404 143 -350 -155 -336 -48 -178 -69 47 -196 156 -53 643 14 220
6696 220 119 -33 135 172 -327 -527 -40 218 -363 164 -119 -291 -93 26 -43 -734 3 -27 311 -502 233
6717B33R1k90k72J79L06L66j094O43J21n77j67R72n08L44j57p3m6K6l70O74l19
6738H2m99L94p62N65L97k15n09J74K37j76l1M84k95N9K50l51N37l96J8l04J96
6759a45O97n16l5k36N11m53L08J03k97N98k00j80r0k64L75m20k02J84J85l87J189
6780G25r12J81R6N34n60l61Q7J96P57j66l72j118J179M92k04n88M5l25k02M31
6800h5j05K43M20j30j064O32J99m1l57J47L65o51M39j70l97N69l4J18m59O62q05
6821e04Q17m59l80N87j19p1N5L02p6o0j04k10P2J89J12j13R2m8J05p5k41L08q9
6844I0m7o6J04k02l9K49l9R2k55K8J19j49K58j33m4N0n2p5J9J49o2p3o3K18q7
6869a0J1J24j48J9P2j62Q5K2k6k3M5k2o5J16j01P3j24J11L1J0n6J38j13r2J4N7
$$ plain form
6717 233 324 34 -238 -59 247 613 -481 162 283 -294 -461 511 3 347 190 117 71 97 -273 401 82
6738 82 -417 -23 -785 -220 177 -38 -547 -373 -136 -312 -343 141 -154 -95 155 -196 341 -55 -37 -341 -145
6759 -145 552 36 1 -235 276 -177 131 234 -63 535 335 155 65 -199 176 -244 -446 -262 -77 -464 725
6780 725 -187 -6 90 624 64 -297 -210 -14 743 577 205 -913 266 758 554 -34 11 -314 -516 -85
6800 -85 -190 53 473 343 -721 -89 110 69 -288 -141 224 -427 12 -158 -555 14 -20 98 -361 301 -504
6821 -504 313 -146 -526 61 -58 -129 -74 228 152 92 -12 -222 -150 39 151 38 130 82 187 112 -129 179 90
6844 90 43 -23 81 -121 -160 89 50 142 -113 -85 34 -115 143 10 -34 16 -36 -111 -92 57 -5 -78 -141 77 -10
6869 -10 1 125 -23 -4 68 -94 -9 13 -13 -36 9 -13 -78 38 -63 10 -114 -3 28 38 -18 120 7 -85 -71 -14
6895a4J28pp9K8q4J2j5q9K03J2K37j9k88K3j41J05J6Rk88K9K72m51O21k98j06
6920a84J81j43O5m7J98J44l18J93m21J21J57J99j93l78P15o43M26m5J80k83K67
6941A91j73o70P58o1j75J56m66o9N43m5L15j19m80J016m97j83j55lP1J29j50J22
6963E5N1j84J80r9j8Q6r9rPK6M2k87J08P3j40J68rm1j6Q9p9R8j6L3k7rM2N9j80
6992i6J08L0j62j1O2J4K1p9m1J43o2q3K10j07O0O5j08J80k32Q8j05O3m1N9rJ36
7018A03o1P9j19j36J86j81O1Lq9J23j53K19j9j0K0q8J85j84R3L2Jj63J33Mr6N9
7044BP9o9j4l3J8J31Rk15R4o0P4q0K2n0J79q7r5R4J99l78L20j09j14J19Q6k20
7070i8K54j83l0J44M1q9o0j35J60J6j29M09k26k55L4n3K30q9P3j23J01KJ73j12
$$ plain form
6895 -14 114 107 28 56 -28 -16 -31 -120 83 95 332 313 25 48 -93 12 28 37 -251 -222 50 -401 220 -78 -184
6920 -184 -3 -146 -81 -128 70 214 -104 89 -332 -211 -54 145 -48 -426 289 -354 72 27 207 -76 191
6941 191 18 -652 106 45 -130 26 -440 -509 34 -11 304 185 -295 721 224 41 -114 -117 -46 83 -67 55
6963 55 106 -78 102 3 -15 71 -28 -37 -30 -4 38 -249 -141 -68 -208 -40 -49 -90 -106 -17 -96 2 -14 19 -8 -17 25 84 -96
6992 -96 12 42 -120 -131 -69 -55 -34 -113 -154 -11 -73 -156 54 -53 7 72 -36 144 -88 0 -105 -42 -83 -24 -33 103
7018 103 42 121 2 -134 52 -129 -68 -65 -154 -31 -184 35 16 6 26 -62 123 -61 32 64 65 -98 35 39 -57 2
7044 2 81 12 -2 -35 -17 114 123 -92 2 -58 16 -64 -42 -92 87 0 -95 -1 198 -180 140 31 -83 36 122 -98
7070 -98 156 -27 -57 87 128 39 -21 -156 4 20 -109 300 74 -181 -147 -200 30 -59 14 -109 -8 -6 167 55
7094E5J5k15J35K50J9j05j83m8M2k0Q1L2R0k59M5K57k03P2J8q5P4J38n7k42Q8
7119fn0j88J27k79L26J87k71L4J36k5j56L12K9j24J79m00k92L59k54P25j28m67
7141b26j55M16o9k33J72L02P73r77j49p85J251l22J53N75n26M72L20j173M36M50
7161G05m26M2k63P4m58jJ64k15L15Q21j525N08L77L63K1r1m99O18k76J05m75M50
7183C34n72K2J337j567K94K63K93m89m10N53j69j82K32m60M20L01K7J45m22L84
7203C34j64j08p30P52l0J01j68N2K57n37p8J64K5j10k2J94L78l30k19O12j52l29
7225a08J3R9l56J53KJ32j13O31k60N7K03j45l33j86L6L90k12k13K88n60J039o03
7247d6J01p6K33m56L60J88o8l82K80N1m33L32M59m14n6K59n49j04l60J083k74
$$ plain form
7094 55 70 -145 -10 240 259 154 -29 -77 -35 -55 26 58 148 -111 -66 191 -12 60 78 -7 67 205 148 -94 -6
7119 -6 -56 -244 -117 -396 -70 117 -154 -120 16 -9 -165 147 176 52 231 -169 -461 -102 -356 369 241 -226
7141 -226 -381 35 -34 -267 -95 207 980 3 -146 -931 320 -2 151 726 200 672 992 -181 255 705
7161 705 279 321 58 132 -326 -327 -163 -378 -63 758 -767 -259 118 481 502 411 -88 530 254 359 -116 334
7183 334 -238 -216 1121 -446 -152 111 404 -85 -495 58 -111 -293 -61 -521 -101 200 227 372 -50 334
7203 334 170 62 -668 84 54 155 -13 39 296 -241 -319 -155 -130 -240 -262 -68 310 -20 -239 373 221 -108
7225 -108 -95 4 -352 -199 -197 -65 -178 453 193 250 453 308 -25 -211 -175 215 3 -210 78 -482 557 -46
7247 -46 55 -21 212 -244 116 304 236 -146 134 185 -248 84 543 129 73 332 -217 -321 -681 402 128
7268A28j91J57k05R0K59l93r0K69p8l30L58K4l50N60j72J9r2n1q0K49J18m17L81
7291A63q2Q0Km55JK90o8M29l09K1N9j65K68O9q3q3o6k3k10M0K26K71j81n45M27
7316G6m47K97J8M6M74o13N1K77m66N37j82k18l06O83j30L9K12o12N5N71q95N59
7338B6M53n81p0L04N8m34O77m56J73Jo91O20J70n24J95N79o72M81k56J13m19N04
7360B51m42J39P59k87k65j75L86m06R6j14J1N45n85p29J399j542J191r24M74l19
7380e37N75L96j60q0q16K12O38j57l6K03O3L25p7J95j973R84O79j90m09L5j74
7401c04M89J03k97o28J699j035M2k22N6n1J77l00Q11l62Q33j133O72o5l04k16
7421c5k38L55N1k93p0O72r33M40l41k61J108L98o64n50l6O45q74Q75K57l29j186
$$ plain form
7268 128 -63 94 -111 -21 238 -155 -245 24 -54 -384 -26 -2 -352 208 36 55 -37 -88 -168 81 199 -218 163
7291 163 81 161 163 -292 -291 -1 -69 360 51 72 131 -34 234 303 220 137 71 48 -162 -122 104 375 194 -351 76
7316 76 -371 -74 -56 -10 464 -149 -98 179 -287 250 68 -150 -456 227 97 136 348 -264 -209 362 -533 26
7338 26 479 -102 -172 132 190 -244 433 -23 150 151 -540 80 250 -274 -79 500 -172 309 53 166 -253 251
7360 251 -191 -52 707 420 155 -20 366 -40 56 -58 -47 498 -87 -816 583 -959 232 -692 -218 -537
7380 -537 38 434 274 194 -622 -410 228 71 35 238 301 626 549 744 -1229 -245 434 244 -165 -130 -304
7401 -304 185 288 -9 -637 1062 27 69 -153 -97 -148 29 -271 540 178 1011 -122 550 485 181 -35
7421 -35 -273 82 133 -160 -230 442 -491 -51 -392 -653 455 853 189 -361 -397 248 -626 249 506 177 -1009
7442a009J200m27M60J62l81K12j2m12K74K14p84m6L20R7l1J32k28M49m19N2L93
7463B16k61M96q66M84l9QL13n9j19k46J85k74K6O59l86J21K52j35p92N45l16J88
7485@o2J52m99N76m19mm34O22N46o54L35o5l32J50J31k46r3K10J73L45k23q21
7507f12K35P47J7n97M14l53O82p36p67P58L66k69j18J56n58L51M39p00K74L72
7527A01K13m11P84q38k68N95o05j18N32Kn02P63o9p1J228j884K90M55n32M96M09
7548E70j59l03N5l47M90L98r45Q37m18P8N76j538P32l50L34n52M58q57P00j28
7568c69j8M32K77p81K61l21j78k58Q42O2K73l68L03M0m3m35K52k2M88j59m62K78
7590I4r25Q08J4L61k54m68O68r84J33J45N09K27l49M7K10k42K70J24j65k41m66
$$ plain form
7442 -1009 191 -236 224 386 5 217 205 -207 67 281 -503 -549 -229 -132 -163 -31 -259 190 -229 -177 216
7463 216 -45 451 -415 69 30 38 351 292 173 -73 112 -162 -136 523 137 258 510 375 -417 128 -188 0
7485 0 -62 90 -409 167 -252 -256 -690 -68 478 -176 159 94 -238 -88 43 -203 -296 -86 87 432 209 -612
7507 -612 -377 370 387 -210 204 -149 533 -203 -970 -212 154 -115 -233 -77 -635 -284 155 -545 -271 101
7527 101 314 -97 687 -151 -419 176 -429 -547 -15 -13 -515 248 179 108 1336 -548 -258 197 -335 161 570
7548 570 411 108 163 -184 306 704 -241 596 178 256 832 -706 26 -324 10 -542 -84 -941 -241 -369
7568 -369 -387 45 322 -459 -198 -519 -697 -955 -113 -51 222 -146 157 197 154 -281 -29 -51 437 278 -184 94
7590 94 -831 -23 -9 352 98 -370 298 -686 -553 -408 101 328 -21 26 236 -6 264 388 223 -18 -484
7611d84M08Mk98O02l82L32j65q6K40j82m7L2M19o28k1J76M84k95M0lm78M09k5
7634E2O7n94l6P67o2J52O7l92K23o86L92K35l21k09L74L7k12J51L10k48K39k56
7656E0J51l97K22N42j54o95K66j23N39m04J59n73L35R8L13k44m56P25o16m8J15
7677a95M79l25l53R51j004K76j14M99J35o6k68Q3j28l66n9P00m09M6J32j09N06
7698D11k79l01L08l0Lj01n80P82k61J76O5R7p88N29K95j67j48J20j09K75m13r9
7720b15L84m62j68O05k47k06L08M42m97O70j034K99J29m4qm92O62J27m50o8L28
7741F3k84J79k24L15M3j43q3J67O0p1l3J9J96j95k8P3j17J40Q9l32K3K32j05j40
7765a56m1L54j14p7J60n6L8k68K27j01J03n3l9L7n8lr3R3J58j17l25K70J00j03
$$ plain form
7611 -484 -76 -72 -370 232 -150 182 17 -69 171 -11 -58 -26 393 -235 -256 -80 404 109 149 146 -332 77 52
7634 52 119 -475 -511 256 194 346 413 21 244 -442 -50 185 -136 -345 29 66 -146 5 315 67 306 50
7656 50 201 -196 26 568 414 -281 -15 -138 401 -3 156 -417 -82 16 329 85 -371 354 -262 -310 -195
7677 -195 284 -41 -394 557 -447 -171 -285 214 349 283 15 98 -30 -396 -455 245 -164 -118 14 -95 411
7698 411 132 -169 139 109 112 11 -569 213 -48 128 193 290 -498 31 326 159 11 131 22 297 -116 -215
7720 -215 169 -293 -461 144 -103 -309 -1 441 -56 614 -420 -121 8 -36 -44 -536 126 253 -197 -265 63
7741 63 -221 -42 -266 49 92 -51 -134 33 93 22 -11 8 204 9 -19 54 -63 77 166 -166 -143 89 -16 -156
7765 -156 -197 157 43 -34 126 70 108 -160 67 -34 69 16 -23 14 -44 -47 -140 -47 111 -6 -331 -61 39 -64
7789f4Q4n0Q2j13L8o8J61n9n1Q4J2l4m6p4J15l5K30q8J0p7j5p2J08j08nL9J84
7816A88k54mR3P1l2j5k94O76j76L26j81k89j06j85J49m8N53o20P1K58l13R0Qj31
7840a65L89l00P0MK75j39n13J130n84k59L04j36J56r40N95j99K94J58K70N3o33
7861a70J16m43J68o1K85J66j2m61L86m2l66M98J39j61o9L29k38k23N8r0O33p47
7883c05N68j05j51J46J53o67m3J92O1j88K57k66N34j94Km51K69NNk98L86M36m40
7906i4j3j62P9P35o44l88L86L63k40n76N47l2m56J63q9j27O43K31o93q1L9N3L06
7929e0K13J13k94j18K22m52K94J33k50O03m32M03l90O5j65J83q7L19q03P57m05
7950a41M45m98J27R7o7J32J05k20o9Pl4j88J12M51p6O5K42k94o13L12K1o5L3L7
$$ plain form
7789 -64 20 -30 52 -61 -23 -91 70 11 -40 44 56 22 -24 -98 17 -18 212 124 134 57 42 -30 78 -30 -35 4 188
7816 188 -66 -70 23 94 62 47 -247 429 253 579 398 109 3 -182 -33 -81 472 -148 -77 181 -132 -42 -34 -165
7840 -165 224 -76 -6 -2 273 134 -379 751 167 -92 212 76 232 -708 -113 -312 -18 140 410 463 -170
7861 -170 -54 -497 -329 -390 -105 61 49 -412 -26 -68 -434 64 203 42 -27 302 64 -159 -101 -191 442 -305
7883 -305 263 158 7 153 306 -361 -404 -212 -151 -339 -82 -348 186 -8 -6 -457 -188 -183 -178 -476 -90 346 -94
7906 -94 -107 -269 -190 545 -99 -487 -101 262 22 -554 -7 -39 -495 -332 -421 -548 95 326 -367 -448 -409 -356 -50
7929 -50 163 276 -18 -136 86 -366 -72 61 -189 414 -18 385 -5 60 -105 78 -9 310 -493 264 -141
7950 -141 304 -194 -67 30 -37 95 200 -20 -89 -82 -116 -304 -192 259 183 248 490 196 -417 -105 -84 -149 -116 -79
7974g9k27L64J22j25n2N8k8L8k51K78j98M39j24j71l27K82n3p1Rk21J53L41rk16
7998f8J85J25l04j45K08L04n01P5Q7K29l31J96r5Lr7J14J24j95R7M32k21k63M14
8021C73q06O76o01j85J207K5J80j187J91r0R22r60M88m54N95J5o20L10QL87n45
8042g1J26k22K2L26p07R27j76n5k86j89K06L95m90L07M18m82m76J84k69r1N06
8063i7p9M51l99l6n6R1n00M43N96m23J0n68L72j5K74M9j87J02N6j63k07q1P8O20
8087C31m98M58l76L7l11L44L91n00m3K75O2p1j3L6oK52o37L18K11k18K2Q3j32
8110A5k8j03K7J27pn3K7N7k48J61J1j2m1J38j19P3K8j48q9K04P5j88MJ88mm9q9
8137d3J9K13n2k86L30j85J6l16L46K50o09J35O2Q9l1j21K59R5r8K79j84N6m56
$$ plain form
7974 -79 -306 58 180 55 3 61 33 71 -180 98 -100 339 215 44 -283 -1 -54 -125 -116 -337 -184 157 148 -68
7998 -68 117 242 -62 -207 1 305 -196 -121 -34 195 -136 60 -35 -32 -129 -15 109 -86 11 443 222 -41 373
8021 373 -433 243 -358 -543 664 689 869 -318 -127 -217 705 -255 233 -221 374 389 -231 79 87 474 -71
8042 -71 55 -167 -145 181 -526 401 225 170 -116 -305 -99 296 -194 113 531 49 -427 -243 -512 -603 -97
8063 -97 -176 275 -124 -160 -216 -125 -625 -182 414 -9 1 -567 -195 -210 64 113 -74 28 84 -79 -286 -367 -289 331
8087 331 -167 291 -85 -48 -359 -15 376 -124 -167 108 170 99 86 122 116 368 -269 49 260 42 64 147 15
8110 15 -13 -116 -89 38 31 -22 5 62 -186 -25 -14 -26 -67 71 -48 25 53 -95 -184 20 95 -93 -89 99 95 46 -43
8137 -43 -24 189 137 -149 181 -4 12 -304 42 292 -317 -182 -120 -31 -62 -183 76 171 73 352 168 224 -232
8160b32O1J95L28n56oM14l42J3L84J96m25J05K7jn32L11N32r3m77QNJ40K32m28
8184a41j64N24j15p8p4j68j57
$$ plain form
8160 -232 -171 24 352 -204 -210 204 -138 -125 259 455 30 135 162 161 -371 -60 472 379 -98 -90 -85 55 287 -141
8184 -141 -305 219 104 26 -48 -216 -373
8191c73
$$ Imaginary data points
##PAGE= N=2
##DATA TABLE= (X++(I..I)), XYDATA
0@%%%%%%%%%%%Qj6J6j6J6k4L2l2M0n4O2p2Q8j04J20j38J62j88K14k44K80l20L62
34A92m08M60n18N80o48P26q09Q97r96J105j221J349j490J642j812J997k199K422
52A269k671K948l255L600l992M441m961N573o301P187q293R720j1639J4374j8611
67a0611K6112m3339J57029O3337j83749O1375o0201n5471k8181l9093j8061M009
79a26844j675L2413l5980N0092O5795m3633O7402J02348n8783L7161O1095n0210
91I9181N700N597n3811k5150l5304M331k6882q0780L0784R651n7811N7107O905
104f0482l1198Q6860J6723k5666N7212J3649M734J0235j2627K8158k8080l9289
116B0229L6080n5059m2226M4843n6387k7138M8402l2231M093K9701j7862L3650
$$ plain form
0 0 0 0 0 0 0 0 0 0 0 0 0 8 -8 8 -8 8 -16 16 -16 24 -30 32 -40 48 -56 64 -74 88 -100 114 -130 150 -170 192
34 192 -216 244 -274 306 -342 384 -425 472 -524 581 -640 709 -781 861 -951 1046 -1153 1269
52 1269 -1402 1546 -1709 1891 -2101 2340 -2621 2952 -3349 3838 -4455 5265 -6374 8000 -10611
67 -10611 15501 -27838 129191 192528 8779 70154 9953 -45518 -73699 -112792 -130853 -126844
79 -126844 -128519 -96106 -132086 -81994 -16199 -59832 7570 109918 51135 88296 149391 99181
91 99181 104881 110478 56667 31517 -3787 544 -26338 -107118 -76334 -66683 -124494 -67387 -60482
104 -60482 -91680 -4820 11903 -13763 43449 57098 61832 72067 59440 87598 59518 20229
116 20229 56309 1250 -40976 3867 -52520 -79658 -31256 -63487 -59394 -29693 -47555 -13905
128a3905K0117M420K7956k6721K5857M1787o1751J0801L0182n9836J5535P917
140B2359n5497J4668o286k2444K0817j5247J3151J7930k3818M6111J1676l7369
152a3949N0112l818l2872N0968j6891l1345K5675k2718n910J89l2617J9187q354
165b2343j6893L9602k8868p510N4915l1244r3M3701k8345J5192K1842k8240J5494
178B7210q008j5994J7468l6600J763K6027m7481J4041K1916m0394K8988R013l0180
191c2231L7455J998j0278K6620j6373J4897J5446l7421K2393Q05l6382L0557j8167
204f81l0563L5988k1600j4232K5656k2470J3859J4174k4491L0078K500j4105L5468
217B9581k0013n853L7147l2541j774K0375l4414J3073K615l2492K1893r888j5286
$$ plain form
128 -13905 6212 10632 38588 11867 37724 79511 17760 28561 58743 -1093 14442 22359
140 22359 -33138 -18470 -24756 -47200 -26383 -41630 -28479 -10549 -34367 11744 23420 -13949
152 -13949 36163 32345 -527 50441 33550 2205 27880 5162 -748 -559 -33176 -13989 -22343
165 -22343 -39236 366 -28502 -36012 18903 -12341 -12434 31267 2922 18114 39956 11716 27210
178 27210 19202 3208 20676 -15924 -14161 11866 -35615 -21574 342 -40052 -11064 -2051 -32231
191 -32231 5224 7222 -3056 23564 7191 22088 37534 113 22506 23311 -13071 17486 -681
204 -681 -31244 4744 -16856 -31088 -5432 -27902 -14043 131 -24360 5718 8218 -5887 29581
217 29581 9568 3715 40862 8321 6547 26922 -7492 5581 8196 -24296 -2403 -12291 -27577
230b7577K5652k3587O147K8580l0250J8704J8995k6420K9135j454k3330L3402
242B7997j3083j2527K1033k7705O783J2407l6556J6714J096k5398K9850j3239
254a2628j4491L5996j8999l29K6083k4322J6241J2404k6198K5247l600j8388K6463
267B3479k2947p081K6674l1819J870J5429k7799K0032J084k5156K8895o147r593
280a3079K6073k1383O351K3136k8462J5086R117k5965K4727o320k0638K6732j7779
293b404p125K0519k6511J0120J3302k9210K1321L505j9634K7166j3182r243K9493
306A8117k1326J047J7116k4399J6901N210k6723K4389o006j6571K6024k0016l709
319i946K3059k5252Q526J2044k3533K1800j703j9863K7231j0928r610K2278k2573
$$ plain form
230 -27577 -1925 -25512 -19365 9215 -21035 -2331 16664 -9756 19379 17925 -5405 27997
242 27997 14914 2387 23420 -4285 2498 14905 -21651 -4937 -3841 -29239 611 -12628
254 -12628 -27119 8877 -10122 -10451 15632 -8690 7551 19955 -6243 19004 15404 -2984 23479
267 23479 532 -6549 20125 -11694 -9824 5605 -22194 -2162 -1078 -26234 2661 -3486 -13079
280 -13079 12994 -8389 -2038 21098 -7364 7722 16839 -9126 15601 9281 -11357 15375 -2404
293 -2404 -9529 10990 -15521 -5401 7901 -21309 12 3517 -16117 11049 -2133 -11376 18117
306 18117 -3209 -2162 14954 -9445 7456 12666 -14057 10332 4326 -12245 13779 -6237 -9946
319 -9946 13113 -12139 -3613 8431 -15102 6698 4995 -14868 12363 1435 -8175 14103 -8470
332h470M668J8638k6804J2749N959j9246K3157r462j3724K6098j8385j325J9546
345A3399k4817J1492J1914k3994J8449j938j7064K3957j4793p200K2550k2447
357a0492N759J5008k3542J7798L130k1695K4315o718j1862K2297j9533K300J9483
370A6248k5870J0536Q969k3109K1006m304j8887K4055j2554n709J9905k2700Q808
383c606J4905k4027J7720K827j8697K4665j0482j2382K3686j7769n85J5880k1770
396i635J2295N665k2084K0334o261j4982K3953j6244m342K2677k0425O554J3366
409A0871k0543J6310Q49j7359K1566j0153p492K0491k1341L842J7461k5730J1161
422f7P063k1100J9614n083j4151K1781j3165j590J7184k0742J1195J0471k2486
$$ plain form
332 -8470 -3802 14836 -11968 781 6740 -12506 10651 1189 -12535 13563 -4822 -6147 13399
345 13399 -11418 74 11988 -12006 6443 4505 -12559 11398 -3395 -10595 11955 -10492
357 -10492 -4733 10275 -13267 4531 7661 -14034 10281 3563 -8299 13998 -5535 -3235 16248
370 16248 -9622 914 9883 -13226 7780 3476 -15411 8644 -3910 -9619 10286 -12414 -3606
383 -3606 11299 -12728 4992 7819 -10878 13787 3305 -9077 14609 -3160 -3745 12135 -9635
396 -9635 2660 8325 -13759 6575 314 -14668 9285 -6959 -11301 11376 -9049 -2495 10871
409 10871 -9672 6638 7487 -9872 11694 1541 -5951 14540 -6801 -2959 14502 -11228 -67
422 -67 6996 -14104 5510 427 -13724 8057 -5108 -6698 10486 -10256 939 11410 -11076
435a1076J8841m35j7652K3227j1646j0238K1368j6976J415J2624k0464J3353L066
448E407j9120K0076p709j1046K2752j6666p53K0377k0897P440J0940j9384J5131
461F548j137j4420J8596j0648l642J7122k0708O438J3324k3754J3724M148j9113
474a3522J8862m394j1553J9354j2450P41J2354j9102J2826N396k0231J9686l727
487D240j4487K2288j2270p175J8520j6611K525J1313j7868J3261p06j5333K0046
500G743r989p096K1505j8809O15J8399j9501P857O655j6774J5263l147j0008J7564
514A0277j3031j317J6282k0580P729J0557k2197J3819K818j5538J8414p447q516
527h730J6964j3520L341J0907j8901J2352L768j6048J7744m290j1701J7740j1047
$$ plain form
435 -11076 7765 7330 -10322 12905 1259 -8979 12389 -4587 -3172 9452 -11012 2341 5407
448 5407 -13713 6363 -1346 -12392 10360 -6306 -7059 13318 -7579 -139 10801 -8583 6548
461 6548 5411 -9009 9587 -1061 -4703 12419 -8289 -1851 11473 -12281 1443 5591 -13522
474 -13522 5340 946 -10607 8747 -3703 -2962 9392 -9710 3116 8512 -11719 7967 4240
487 4240 -10247 12041 -229 -7404 11116 -5495 -2970 8343 -9525 3736 3030 -12303 7743
500 7743 -2246 -9342 12163 -6646 -6031 12368 -7133 724 7379 -9395 5868 2721 -7287 10277
514 10277 -2754 -4071 12211 -8369 -640 9917 -12280 1539 4357 -11181 7233 -214 -8730
527 -8730 8234 -5286 -1945 8962 -9939 2413 6181 -9867 7877 3587 -8114 9626 -1421
540a421l202J5334j6977N043P898j6740J4326j523j3423J8181j0080n080J7420
553I756j6305K989J2885j8622J2292L693j5989J7300m590j0809J7464j2097m27
566b460J1924j8056P989P296j7105J4993k585j3083J8777r496n346J6795j6013
579f370K390J2406j5939R955L403j3346J5846o782p078J6810j6040m50J4944j7466
593g717P057P621j7171J3422r97j1505J5730r447l426J4976j6180O220R999j7720
607i138J3096K510j4803J6636n678r599J5593j1901K08J1170j5857Q564M350j5561
621a0410J5551l786j1386J7377j0551m297J5639j3378L755Q693j3911J1308O47
634E251j1955J5505r004o389J6942j4825J232J2185j7124Q587N686j4794J2078
$$ plain form
540 -1421 -4623 10711 -6266 -1223 6675 -10065 4261 2738 -10685 7496 -2584 -7664 9756
553 9756 -6549 -3560 9325 -9297 2995 6688 -9301 7999 3409 -7400 10064 -2033 -2460
566 -2460 9464 -8592 -603 6693 -10412 4581 1996 -11087 7690 -1806 -7152 9643 -6370
579 -6370 -3980 8426 -7513 2442 5845 -7501 8345 1563 -5515 11295 -4745 -5195 9749 -7717
593 -7717 -660 6961 -10210 3212 2215 -9290 6440 -3007 -6433 8543 -7637 -1417 8582 -9138
607 -9138 3958 6468 -8335 8301 2623 -6976 8617 -3284 -3076 8094 -7763 801 5151 -10410
621 -10410 5141 1355 -10031 7346 -3205 -7502 8137 -5241 -1486 7207 -6704 4604 5251
634 5251 -6704 8801 -203 -6592 10350 -4475 -3243 8942 -8182 405 6091 -8703 3375
647C375k984r138J4760r711o26J2471j5728P629Q680j6301J2498O52j3491J5538
661G624o198o712J3766j2587K070R269j4961J0136J893j4359J5292n250r474J6994
675G503j0947k286J3607j3869O187O799j3972J1973j430j0459J5302r307m258
688e157J4894j4574K643J0661j6111Q695L286j3335J2868m100p269J4004j1128
701d623R19J2201j4772P303N915j4887J2845r54j1004J4509p752m414J3414j2692
715c992L125P447j4611J0346P16j2355J4678o134p400J5313j0711r1J1329j3656
729e996O932M960j3094J2354k614r075J4711r256k787J2859j4166M140P846j4825
743h011R971Q48j1741J3638n337n700J3657j1462J363J0131j3803P742M642j3307
$$ plain form
647 3375 391 -8747 6013 -3698 -4324 8147 -7581 48 8728 -7573 4925 5577 -7914 7624
661 7624 1426 -5286 8480 -4107 -2037 7232 -7729 2407 4300 -10059 5233 -17 -9491 7503
675 7503 -3444 -5730 7877 -5992 195 6994 -6978 4995 3565 -6894 8408 -899 -5157
688 -5157 9737 -4837 -2194 8467 -7644 1051 4337 -8998 3870 -230 -7499 6505 -4623
701 -4623 -3704 8497 -6275 1028 6943 -7944 4901 3947 -7057 7452 -300 -4714 8700 -3992
715 -3992 -867 6580 -8031 2315 3031 -9324 5354 -780 -8180 7133 -3578 -3669 7660 -5996
729 -5996 936 5896 -7198 5156 2542 -6533 8178 -1078 -3865 8994 -5172 -1032 6814 -8011
743 -8011 1960 2808 -8933 4705 -632 -6332 7325 -4137 -2774 7357 -6446 1296 5938 -7369
757g369J2309k099q901J3983q739k709J1554j3083M437O241j3873J0443Oj0413
771h213J3352o476m888J3276j1190J631R619j3816P932M190j2006J1972l281p600
785e498J3603r640j695J0975j3319N079O113j3954J0786l04j0347J3702o727m221
799e447J2407j1365K415Q464j3194R023K390j1484J2777l833p481J3283r986j266
813c297J0255j2924N582N298j2694J0673j247r044J3162p723l707J2733j1380
826d313K270Q300j2328Q489K093j0557J2279m900o219J2325j0372l57J0124j2574
840e740N777M599j2271J1060j497q676J2247q069k633J1769j1521L733P389j2658
854f491R474J881j0966J1761m847n371J1839j0189Q4R220j2463O799L697j2049
$$ plain form
757 -7369 4940 2841 -6060 7923 -816 -3525 8029 -5054 -617 5624 -8249 2194 2200 -8213
771 -8213 5139 -1337 -6225 7051 -4139 -2508 7111 -6705 1227 5417 -6589 5383 2102 -5498
785 -5498 8105 -1535 -3230 7745 -5574 -495 5618 -8336 2450 2146 -8201 5501 -1226 -5447
799 -5447 6960 -4405 -1990 6474 -6720 2303 4693 -6791 5986 2153 -5328 7955 -2031 -3297
813 -3297 6958 -5966 -384 4914 -7780 2893 1646 -7398 5764 -1959 -5666 7067 -4313
826 -4313 -2043 6257 -6071 2418 4511 -6046 6233 1333 -4886 7439 -2933 -3290 6834 -5740
840 -5740 37 4636 -7635 3425 1928 -6748 5499 -2570 -5203 6566 -4955 -1222 6167 -6491
854 -6491 2983 4864 -6102 5659 812 -4559 7280 -2909 -2825 6395 -6068 731 4428 -7621
868g621J0896k117p992J2383p948k232J0815j1014M029O763j1895R252R48j0164
882e897J2089n740n313J1572r675P05Q480j1892O691L029j1236J0638k846p215
896f610J2238q399j547J0699j1029M241O245j1462R228j28r365J1916o145m580
910d698J1383j0201J734Q091j1918O775K410j0847J0906l360o735J1895q287n47
924c399R867j1379N051N692j1844R732m88q857J1415o170l580J0602j0267K376
938a249O979j1043O996J453r644J0058l334o132J1516q171o96R322j0221M439
952B73M337j0390R409j278p956J1405o475l326J0751j0087J957O976j1488P132
966A240J336r368J0821m106n028J0861q889P97Q571j1052N245M388j0645R306
$$ plain form
868 -7621 3275 1158 -6834 5549 -2399 -4631 6184 -4830 -801 5962 -5933 3319 4267 -5897
882 -5897 6192 452 -4861 6711 -2964 -2259 6221 -5671 1020 4049 -7187 3451 605 -6610
896 -6610 5628 -2771 -4318 6381 -4648 -407 5838 -5624 3604 3476 -5889 6027 -118 -4698
910 -4698 6685 -3516 -1782 6309 -5609 1166 3576 -7271 3635 275 -6460 5435 -2852 -3399
924 -3399 6468 -4911 140 5832 -6012 3720 3232 -5625 5790 -380 -3960 6642 -3625 -1249
938 -1249 5730 -5313 1683 3136 -6508 3550 216 -5916 5600 -2571 -3267 6055 -4166 273
952 273 4610 -5780 3629 2351 -5605 5800 -675 -4001 6750 -3337 -1380 5596 -5892 1240
966 1240 2576 -6792 4029 -77 -5105 5756 -3133 -2336 6235 -4817 428 4816 -5829 3477
980C477j664p242J1167o326k524R235r954L152N717j1355Q089Q48r626J1242m528
995b92m782J0950q503P8P903j0058N995K732r870R778k284o485J1078p560j883
1010c203R630j0378K998N901j0585P081N38p860J0001m916l498R954r250J691
1024a896P888j1283N994L405r411R140j893o351R783o651j318Q149j0037M354
1038a27M379j0802Q942k54q458J0739m720m478J0206q292J051O421r477O354J986
1053C470q636R643l451n711J0987p835j624Q996j0165L321N114r147P537j079
1067A420o788R868n686k419R263r660K324O937j0123O229K688r014Q927k828m776
1082c638Q912p526J27O866r685N399L813j0366Q419n08p299R747n130l094Q468
$$ plain form
980 3477 1813 -5429 5738 -588 -3112 6123 -3831 -679 5038 -6317 1772 2620 -7006 4236 -292
995 -292 -5074 5876 -2627 -2549 5354 -4704 1291 4023 -5847 3931 1647 -4838 6240 -1320 -3203
1010 -3203 6427 -3951 -953 4948 -5637 1444 1982 -5878 4123 -793 -4291 5663 -3587 -1896
1024 -1896 5992 -5291 703 4108 -5303 3837 1944 -4407 5376 -1275 -2593 5556 -4481 -127
1038 -127 4252 -6550 2392 2138 -6320 4419 -301 -4779 5427 -2865 -1814 4607 -4870 1484 3470
1053 3470 -5166 4477 1026 -4685 6302 -1533 -3157 5839 -4326 -1005 4109 -5038 2499 1420
1067 1420 -5368 4500 -1186 -3605 5658 -4002 -1678 5259 -4864 1365 4053 -4961 3966 1138 -3638
1082 -3638 5274 -2252 -2125 4741 -4944 455 4268 -6098 2321 1813 -5486 4261 -869 -3963 4505
1097D505p838K386N513r356P009O08q099J0247m147n133R543p238o47P800q957
1112c804L981K858q118P864j768n944R518o418j831Q968q906K808N879r660O241
1127A668J330p249Q411m022l750Q361p256J103O485r654M901L306q816P839j522
1142A135o230R007n583j263P725q136K934M785r149P449l1p489Q931m215l748
1157c878R064p330L97O142q634N501J769p967P794k592n159R208o141p60P304
1172D718q265L252M695q786O771k48o856Q955m400k975P942p637J474N517q488
1187d331N277J488p548P756k104m687Q196n669p49O951q016L800L500q277O843
1202B430o54o136Q463m329k899Q043p427J518N011q464N141J663p254P815k678
$$ plain form
1097 4505 -3333 -947 4566 -4790 2219 2827 -5272 4975 828 -4305 5238 -2000 -2647 5153 -3804
1112 -3804 177 3035 -5083 2781 1013 -4931 4587 -1831 -3662 5306 -3600 -792 5087 -4573 1668
1127 1668 2998 -4251 4160 138 -3612 4749 -2507 -1404 5081 -4573 328 3634 -5182 2657 1135
1142 1135 -5095 3912 -1671 -2934 4791 -3345 -411 4374 -4775 2674 2643 -4846 4085 -130 -3878
1157 -3878 5186 -2144 -1747 4395 -4239 1262 3031 -4936 2858 266 -4893 4315 -1826 -2586 4718
1172 4718 -3547 -295 4400 -4386 2385 2137 -4719 4236 -164 -3139 4803 -2834 -1360 4157 -4331
1187 -4331 946 2434 -5114 2642 538 -4149 4047 -1622 -2371 4580 -3436 364 3864 -4413 2430
1202 2430 1776 -4360 4103 -226 -3125 4918 -2509 -991 4020 -4444 697 2360 -4894 2921 243
1217B43m569Q560n915k03O663q368L740L406p839O778r04n640Q158m602k385P774
1233D897p642J693M749p974N339J112o876P630k798l957Q252o278Q0O045p809
1248c537M071K808p242O310j039n099P800m744j825O737p038K038M258p772N561
1263A287N79o399P741l086l581P500n924J86N447p207L897K409p040P019j664
1278A164m679P608m727j694O328p096K284L851p230N431O33o112P274l410k692
1293c067O934n798K28N637p523M204K517p067O246j150m466P349n162p51N741
1308C872o838K633L386p188N723j07n538P642m379k315O528n288J159M173o618
1323c155M113J345n400N768j487m265O368m565q26N978o934K778L077o330N059
$$ plain form
1217 243 -4326 4234 -1681 -1884 4779 -3589 151 3557 -4282 2496 1592 -4048 4110 -492 -2877 4897
1233 4897 -2745 -1052 3697 -4277 1062 2174 -4702 2928 130 -3827 4425 -1853 -1773 4272 -3537
1248 -3537 534 3342 -3900 2410 1371 -3728 4072 -672 -2497 4240 -2798 -760 3498 -4274 1287
1263 1287 1866 -4533 3208 122 -3459 4041 -1883 -1697 3750 -3457 440 2849 -4191 2828 1164
1278 1164 -3515 4093 -634 -2328 4000 -3096 -812 3039 -4191 1240 1873 -4239 3035 -375 -3067
1293 -3067 3867 -1931 -1703 3934 -3589 615 3132 -3935 2311 1161 -3305 4044 -1118 -1869 3872
1308 3872 -2966 -333 3053 -4135 1588 1481 -4057 3585 -794 -3109 3419 -1869 -710 3463 -3155
1323 -3155 958 2303 -3097 2671 1184 -3081 3287 -1278 -2104 3874 -3060 -282 2795 -3535 1524
1338A524m03m640O738l682j957O170o317J550M707p297M731J262o429O994k504
1353D47l663O484m712j91N107o762K992K747o041N083q45m237O571l915j776O351
1369C640o273K039L753o138M141J065n741O019k214l148O408n279K99M894o104
1384b639L021J910n903N335p93m289O214l770j470N796n323J856L133o151M402
1399A329M81n151N934k711k784O573m813n05N184n606K062J694n293N300j446
1414B48l558N846l956k70M395n097J818L275n712M128L55n226O128j969l030N706
1430C081m840Q58L376n432M148J017n107M595j453l044N626m523M1M388m494J789
1446B6L032o148N055p85m366N600k613k051N409m775J031L276n564K730K328n298
$$ plain form
1338 1524 1121 -3519 3219 -463 -2420 3750 -2567 -1017 3690 -3607 1124 2386 -4043 2951 447
1353 447 -3216 3268 -1444 -1635 3472 -3290 -298 2449 -3592 1491 646 -3591 2980 -935 -2711 3640
1369 3640 -2633 -594 3159 -2979 1162 2227 -3514 2505 291 -2857 3551 -1728 -1429 3465 -2639
1384 -2639 382 2292 -3611 1724 931 -3358 2856 -914 -2384 3412 -1911 -55 3078 -3073 1329
1399 1329 1810 -3341 2593 -118 -2902 3671 -1142 -1647 3537 -2069 -7 1687 -3606 1694 248
1414 248 -3310 2536 -1420 -1690 2705 -2392 -574 2701 -3011 1117 1472 -3754 2374 405 -2625 3081
1430 3081 -1759 -901 2475 -2957 1191 2208 -2899 1696 243 -2801 2825 -1698 -1657 2731 -1763 26
1446 26 3058 -3090 1965 1180 -3186 2414 -199 -2250 3159 -1616 -585 2691 -2873 -143 2185 -3113
1462c113M670r63l302N461l418j21M366n527J662K604n235M697k13m958N710k365
1478d5k174N385m905R42L196n344L340J080m555M802j018k860M401l235k91L758
1494B477m460K076K112m812M071r19l238M695j967k357M926m574J272L342n786
1509c142L224J956m468M201j204k691M927l504k50L480m296K372J359m755M441
1524A650q37k613M538l053j706N003m551K029J900n723M554l2l762M824j566l028
1540b373M953l731kL107m241K473J618m247M100r25k888M553l333q73M908m762
1556a663J208K095m344L481K31l366M221j868j825M663l965L75L468m894K429
1571B46K565n105L186J75l248M763l323p08L803l561J485R89l704L604p10k655
$$ plain form
1462 -3113 1557 594 -2708 2753 -665 -786 3580 -1947 -285 2319 -2916 1781 1568 -3390 2320 -45
1478 -45 -2219 3166 -1739 -797 2399 -2945 395 1475 -3080 1722 704 -2156 2245 -990 -1281 2477
1494 2477 -1983 93 2205 -2607 1464 545 -2693 2002 35 -2322 2604 -1970 -698 2644 -3142
1509 -3142 82 2038 -2430 1771 567 -2124 2803 -701 -951 2529 -1767 605 1964 -2791 1650
1524 1650 813 -1800 2738 -315 -2021 2982 -1569 460 2360 -3363 1191 1159 -2603 2221 655 -2373
1540 -2373 2580 -1151 -1153 1954 -2287 186 1804 -2443 1657 732 -2156 2397 -936 -1809 3099 -1663
1556 -1663 -455 1640 -2704 777 1008 -2358 1863 -5 -1830 2833 -1132 -757 2711 -2183 246
1571 246 2811 -2294 892 1067 -2181 2582 -741 -1449 2354 -1207 278 1267 -2437 1167 457 -2198
1587b198L927j516k481M874l719N77K495m210L087L03l694M416j792k140M527
1602B456l007j202M310m290J370K254m747L801n54k928M330j819j909M424l563
1617a074L13L138m354K062Q33l032L760j323k700M570l646P05L344m893K226K548
1633B477n321L486M3l297M119j264j710L683l183P63J862l984L134Q41m003L487
1649A133r96k708M371k593J88K735l640J954J009l359K754j33k666M252k756j000
1665a455M064l679O25K393l686K555M82k930L231j118j824L541l009j65L738m896
1681b133J959J709l538L257p29k958M044k138o67L074l202R02K432m092K457P58
1697A135l257L889j919j212L178k381k62K919m103K091J182l466L742j036k350
$$ plain form
1587 -2198 1729 213 -2268 2606 -1113 -536 1959 -2251 836 1139 -2555 1861 69 -2071 2456
1602 2456 -551 -1753 2557 -1733 -363 1891 -2856 945 391 -2537 1793 -26 -1935 2489 -1074
1617 -1074 -761 2377 -1977 85 918 -2114 1646 323 -2377 2193 -1453 -748 2596 -2297 -71 2477
1633 2477 -2844 642 685 -2612 1507 243 -1467 2216 -967 -204 1658 -2326 808 1649 -2354 1133
1649 1133 137 -2571 1800 -793 -605 2130 -1510 444 1453 -1906 848 715 -1951 2301 -455 -1455
1665 -1455 2609 -1070 -445 1948 -1738 817 1299 -1631 1600 482 -1342 2199 -810 -975 2763 -2133
1681 -2133 -174 1535 -2003 1254 525 -2433 1611 -527 -1194 1880 -1322 -420 2012 -2080 377 1135
1697 1135 -2122 1767 -152 -1364 1814 -567 -829 2090 -2013 78 1260 -2206 1536 500 -1850
1712a850L855k329o89L056l390J353J847l953L009L0k972L971k236j180L625l224
1728a077M6L035l934K088J146l159L077p35k460L882k474l99K759l325J313J672
1744A455l479K870k3k794L504j574j411L523l281K90K552l581K178P48l010L198
1760A165l01k281L683k686k78K741l624J689J707l595K893j022k194L693j559
1775C1j344L182l101N02K446l308J695J091l107L224j177j729L349k468j40K867
1791B013l603J551J597l306K797k69k476L402j927j233L382k991O47J984l306
1806a738K180O41k798L129j302j697L343k587j8K638k998J094J497l139K890m94
1822F41k488L613k182q63L214l143Q94J836l132K244K91k657K934j177j388K978
$$ plain form
1712 -1850 2005 -324 -1013 2043 -1347 6 1853 -2100 909 939 -2033 1938 -298 -1478 2147 -1077
1728 -1077 -1031 2004 -1930 158 1304 -1855 1222 487 -1973 1909 -565 -964 1795 -1530 -217 1455
1744 1455 -2024 846 823 -1971 1533 -41 -1452 2071 -1210 -920 1632 -1949 229 977 -2033 1165
1760 1165 864 -1417 2266 -420 -698 2043 -1581 108 1815 -1780 1113 91 -2103 1590 31
1775 31 -1313 1869 -1232 -730 1716 -1592 103 1194 -1913 1311 134 -1595 1754 -714 -854 2013
1791 2013 -1590 -39 1558 -1748 1049 780 -1696 1706 -221 -1454 1928 -1063 -416 1568 -1738
1806 -1738 442 1083 -1715 1414 112 -1585 1758 -829 -847 1791 -1207 -113 1384 -1755 1135 641
1822 641 -1847 1766 -416 -1279 1935 -1208 -314 1522 -1610 634 925 -1732 1202 25 -1363 1615
1838A615k555J39K759l319J563J228l272K843m10k214L344k163n13K660k747P39
1854c03J834l216K300K21k524K960j198j305K931k499o0K685l281J765P20k465
1870a435K331o92j683K722j515q20K641k817J375J140k896K341j72k503L153j227
1886e7j196K756k560O48K589l655J888P76k712K511m79j948K800j919m1K329k931
1903a201R38J294k574K075%k264L053j548p76K680k361L78J939l048J712N93k616
1920a726K817q55j513K699k077L9K182k681J156J109k816K226rk028K773j493
1936a97q02K520k321M62J653k718J647N78k352K492p67j345K710k154j02K196
1952A500k905J394J000k521K320k91j801K664j729n97K707k777N16K107l046J871
$$ plain form
1838 1615 -940 -801 1958 -1361 202 1430 -1842 1001 591 -1623 1721 -442 -955 1705 -1042 -303
1854 -303 1531 -1685 615 836 -1688 1272 74 -1231 1700 -799 -859 1826 -1455 310 1030 -1435
1870 -1435 896 204 -1479 1243 -272 -1092 1549 -1268 107 1247 -1649 692 520 -1983 1170 -57
1886 -57 -1253 1503 -1057 -409 2180 -1475 413 1189 -1523 988 509 -1439 1361 -558 -599 1730 -1201
1903 -1201 -263 1031 -1543 532 532 -1732 1321 -227 -1003 1677 -684 -306 1633 -1415 297 890 -1726
1920 -1726 1091 236 -1277 1422 -655 -616 1566 -1115 41 1150 -1666 560 551 -1477 1296 -197
1936 -197 -999 1521 -800 -338 1315 -1403 244 822 -1530 962 195 -1150 1560 -594 -696 1500
1952 1500 -1405 -11 989 -1532 788 497 -1304 1360 -369 -966 1741 -1036 -520 1587 -1459 412
1968D12M22k371K605r87j203K639k318K12J896k598J454P55k245K373n57j686
1984a197K585j536p97K674k509N64J687k974K059K27k020K432j195j257K479k003
2000g81n3K142k451J388O03k382K409n30j834K661j554l88K510l006R87J363k592
2017a508K032K48j914K241j049r78K119j748O2J776k817J519J316k893K738k38
2033I06k201K492j390k09K232l459J899J179l134K329Rj686K279j650l50K122
2049A368j846j24K207k501R67O23j566J827o36j146K152k072L95J705k526J535
2065C62P24k165K000L10k779L056j807p23K436k365L28K121k446J123P67k462
2081a520K457o19j383K062j330k03J950k418J304N89k323K572o55j637J944j466
$$ plain form
1968 412 834 -1537 1068 81 -1122 1517 -801 -589 1307 -1291 163 918 -1327 1046 489 -1197
1984 -1197 1388 -148 -945 1729 -780 -216 1471 -1503 556 783 -1237 1195 0 -1257 1222 -781
2000 -781 -834 1308 -1143 245 848 -1534 875 345 -1489 1172 -382 -770 1740 -1266 -279 1084 -1508
2017 -1508 524 772 -1142 1099 50 -928 1191 -557 -495 1281 -1536 -17 1299 -1594 1144 906
2033 906 -1295 1197 -193 -402 1830 -1629 270 1449 -1685 644 653 -1033 1246 -404 -754 1368
2049 1368 -478 -602 1605 -896 71 694 -872 955 319 -827 1325 -747 -352 1353 -1173 362
2065 362 1086 -1079 921 1231 -1548 1508 -299 -1022 1414 -951 -623 1498 -948 175 942 -1520
2081 -1520 937 318 -1065 997 -333 -536 1414 -1004 300 889 -1434 1138 483 -1154 790 -676
2097f76k6J443j677O15J208j650J121J019k941K525j001j098K031j087l23J498
2113I81j956J121O48k075J656K62k196K676j608l09K219k220N99J246k175J315
2129A84N40j717J769m09j675K467j634K67J365j643O75R25j767J266k32j953K405
2146H33j391M16J544j572J74J259j888J271J17k122K019m33j282K196j622m1J677
$$ plain form
2097 -676 -702 741 -936 -321 887 -763 358 1377 -1564 961 -40 -1138 893 -194 -517 981
2113 981 -975 146 794 -1281 375 637 -1559 1117 -491 -800 1419 -801 -202 1044 -1131 184
2129 184 724 -993 776 367 -1308 1159 -475 -208 1157 -486 189 1114 -653 613 381 -1572 833
2146 833 -558 -142 1402 -170 4 1263 -625 646 763 -1359 660 227 -1055 1141 -481 -522 1155
$$ [...]
8191a96
##END NTUPLES=NMR FID
##END=
