##TITLE=1H_DE-80H_X3
 200.13MHz, d2o
 8 sc
 
 19ns.26.2.2025
##JCAMPDX= 6.0         $$ Bruker NMR JCAMP-DX V2.0
##DATA TYPE= NMR FID
##DATA CLASS= NTUPLES
##ORIGIN= UXNMR, Bruker Analytische Messtechnik GmbH
##OWNER= pz
$$ XWIN-NMR		Version 3.5
$$ Tue Jun  2 16:54:20 2026 Russian Standard Time (UT+4h)  Yarkov@DPX200
##.OBSERVE FREQUENCY= 200.1313
##.OBSERVE NUCLEUS= ^1H
##.DELAY= (6, 6)
##.ACQUISITION MODE= SIMULTANEOUS
##.ACQUISITION SCHEME= undefined
##.AVERAGES= 8
##.DIGITISER RES= 18
##SPECTROMETER/DATA SYSTEM= spect
##.PULSE SEQUENCE= zg30
##.SOLVENT NAME= DMSO
##.SHIFT REFERENCE= (INTERNAL, DMSO, 0, 14.3821)
##AUDIT TRAIL= $$ (NUMBER, WHEN, WHO, WHERE, WHAT)
$$ ##TITLE= Audit trail, XWIN-NMR		Version 3.5
$$ ##JCAMPDX= 5.01
$$ ##ORIGIN= Bruker BioSpin GmbH
$$ ##OWNER= Yarkov
$$ C:/Bruker/XWIN-NMR/data/yarkov2/nmr/H-C/1/audita.txt
$$ ##AUDIT TRAIL=  $$ (NUMBER, WHEN, WHO, WHERE, WHAT)
(   1,<2026-06-02 16:52:46.93 +0400>,<Yarkov>,<DPX200>,
      <created by zg, POWCHK disabled, PULCHK disabled
       configuration hash MD5:
       00 E9 B6 7A A2 85 ED C7 34 08 36 98 17 FE 4E 26
       data hash MD5: 16K
       B4 37 66 BF 0F 01 D7 3D E5 BB 1D EE 1A 85 AA 68>)
$$ ##END=
$$ 
$$ hash MD5
$$ 91 B3 29 94 16 AA 38 50 9C D2 00 A8 26 6D 98 3D
##$RELAX= 
##$RELAX= 
##$RELAX= 
##$RELAX= 
##$RELAX= 
##$RELAX= 
$$ Bruker specific parameters
$$ --------------------------
##$DU= <C:/Bruker/XWIN-NMR>
##$EXPNO= 1
##$NAME= <H-C>
##$PROCNO= 1
##$TYPE= <nmr>
##$USER= <yarkov2>
##$AMP= (0..31)
100 100 100 100 100 100 100 100 100 100 100 100 100 100 100 100 100 100 
100 100 100 100 100 100 100 100 100 100 100 100 100 100 
##$AQSEQ= 0
##$AQ_mod= 1
##$AUNM= <au_zg>
##$AUTOPOS= <>
##$BF1= 200.13
##$BF2= 200.13
##$BF3= 200.13
##$BF4= 200.13
##$BF5= 200.13
##$BF6= 200.13
##$BF7= 200.13
##$BF8= 200.13
##$BYTORDA= 1
##$CFDGTYP= 0
##$CFRGTYP= 5
##$CHEMSTR= <none>
##$CNST= (0..31)
1 1 145 1 1 1 1 1 1 1 1 1 1 1 1 1 1 1 1 1 1 1 1 1 1 1 1 1 1 1 1 1 
##$CPDPRG= <>
##$CPDPRG1= <>
##$CPDPRG2= <>
##$CPDPRG3= <>
##$CPDPRG4= <mlev>
##$CPDPRG5= <mlev>
##$CPDPRG6= <mlev>
##$CPDPRG7= <mlev>
##$CPDPRG8= <mlev>
##$CPDPRGB= <>
##$CPDPRGT= <>
##$D= (0..31)
0 0.7 0 0 0 0 0 0 0 0 0 0.03 0 0 0 0 0 0 0 0 0 0 0 0 0 0 0 0 0 0 0 0 
##$DATE= 1780404766
##$DBL= (0..7)
120 120 120 120 120 120 120 120 
##$DBP= (0..7)
150 150 150 150 150 150 150 150 
##$DBP07= 0
##$DBPNAM0= <>
##$DBPNAM1= <>
##$DBPNAM2= <>
##$DBPNAM3= <>
##$DBPNAM4= <>
##$DBPNAM5= <>
##$DBPNAM6= <>
##$DBPNAM7= <>
##$DBPOAL= (0..7)
0.5 0.5 0.5 0.5 0.5 0.5 0.5 0.5 
##$DBPOFFS= (0..7)
0 0 0 0 0 0 0 0 
##$DE= 6
##$DECBNUC= <off>
##$DECIM= 32
##$DECNUC= <off>
##$DECSTAT= 4
##$DIGMOD= 1
##$DIGTYP= 9
##$DL= (0..7)
0 120 120 120 120 120 120 120 
##$DP= (0..7)
150 150 150 150 150 150 150 150 
##$DP07= 0
##$DPNAME0= <>
##$DPNAME1= <>
##$DPNAME2= <>
##$DPNAME3= <>
##$DPNAME4= <>
##$DPNAME5= <>
##$DPNAME6= <>
##$DPNAME7= <>
##$DPOAL= (0..7)
0.5 0.5 0.5 0.5 0.5 0.5 0.5 0.5 
##$DPOFFS= (0..7)
0 0 0 0 0 0 0 0 
##$DQDMODE= 0
##$DR= 18
##$DS= 0
$$ [...]
##$SUBNAM2= <"">
##$SUBNAM3= <"">
##$SUBNAM4= <"">
##$SUBNAM5= <"">
##$SUBNAM6= <"">
##$SUBNAM7= <"">
##$SUBNAM8= <"">
##$SUBNAM9= <"">
##$SW= 18.0517328524113
##$SWIBOX= (0..15)
0 0 2 0 0 0 0 0 0 0 0 0 0 0 0 0 
##$SW_h= 3612.71676300578
##$TD= 16384
##$TD0= 1
##$TE= 0
##$TE2= 300
##$TE3= 300
##$TEG= 300
##$TL= (0..7)
0 120 120 120 120 120 120 120 
##$TP= (0..7)
150 150 150 150 150 150 150 150 
##$TP07= 0
##$TPNAME0= <>
##$TPNAME1= <>
##$TPNAME2= <>
##$TPNAME3= <>
##$TPNAME4= <>
##$TPNAME5= <>
##$TPNAME6= <>
##$TPNAME7= <>
##$TPOAL= (0..7)
0.5 0.5 0.5 0.5 0.5 0.5 0.5 0.5 
##$TPOFFS= (0..7)
0 0 0 0 0 0 0 0 
##$TUNHIN= 0
##$TUNHOUT= 0
##$TUNXOUT= 0
##$USERA1= <user>
##$USERA2= <user>
##$USERA3= <user>
##$USERA4= <user>
##$USERA5= <user>
##$V9= 5
##$VALIST= <valist>
##$VCLIST= <CCCCCCCCCCCCCCC>
##$VD= 0
##$VDLIST= <DDDDDDDDDDDDDDD>
##$VPLIST= <PPPPPPPPPPPPPPP>
##$VTLIST= <TTTTTTTTTTTTTTT>
##$WBST= 1024
##$WBSW= 4
##$XGAIN= (0..3)
0 0 0 0 
##$XL= 0
##$YL= 0
##$YMAX_a= 247932
##$YMIN_a= -229566
##$ZGOPTNS= <>
##$ZL1= 120
##$ZL2= 120
##$ZL3= 120
##$ZL4= 120
##$ABSF1= 10
##$ABSF2= 0
##$ABSG= 5
##$ABSL= 3
##$ALPHA= 0
##$AQORDER= 0
##$ASSFAC= 0
##$ASSFACI= 0
##$ASSFACX= 0
##$ASSWID= 0
##$AUNMP= <proc_1d>
##$AZFE= 0.1
##$AZFW= 0.1
##$BCFW= 1
##$BC_mod= 2
##$BYTORDP= 1
##$COROFFS= 0
##$CY= 83.5205535888672
##$DATMOD= 1
##$DC= 2
##$DFILT= <>
##$DTYPP= 0
##$F1P= 10.8118882576601
##$F2P= -7.23987719738617
##$FCOR= 0.5
##$FTSIZE= 0
##$FT_mod= 4
##$GAMMA= 1
##$GB= 0.15
##$INTBC= 1
##$INTSCL= 1
##$ISEN= 128
##$LB= 0.25
##$LEV0= 0
##$LPBIN= 0
##$MAXI= 10000
##$MC2= 0
##$MEAN= 0
##$ME_mod= 0
##$MI= 1.114404
##$NCOEF= 0
##$NC_proc= 0
##$NLEV= 6
##$NOISF1= 3.799351
##$NOISF2= 2.8
##$NSP= 1
##$NTH_PI= 0
##$NZP= 0
##$OFFSET= 14.38212
##$PC= 1
##$PHC0= -6382.496
##$PHC1= 21.22195
##$PH_mod= 1
##$PKNL= yes
##$PPARMOD= 0
##$PSCAL= 0
##$PSIGN= 0
##$REVERSE= no
##$SF= 200.129724274929
##$SI= 16384
##$SIGF1= 3
##$SIGF2= 2
##$SINO= 400
##$SIOLD= 16384
##$SREGLST= <1H.CDCl3>
##$SSB= 0
##$STSI= 0
##$STSR= 0
##$SW_p= 3205.1282051282
##$SYMM= 0
##$S_DEV= 0
##$TDeff= 0
##$TDoff= 0
##$TI= <>
##$TILT= no
##$TM1= 0
##$TM2= 0
##$TOPLEV= 0
##$USERP1= <user>
##$USERP2= <user>
##$USERP3= <user>
##$USERP4= <user>
##$USERP5= <user>
##$WDW= 1
##$XDIM= 8192
##$YMAX_p= 0
##$YMIN_p= 0
$$ End of Bruker specific parameters
$$ ---------------------------------
##NTUPLES= NMR FID
##VAR_NAME=  TIME,          FID/REAL,        FID/IMAG
##SYMBOL=    X,             R,               I
##VAR_TYPE=  INDEPENDENT,   DEPENDENT,       DEPENDENT
##VAR_FORM=  AFFN,          ASDF,            ASDF
##VAR_DIM=   8192,          8192,            8192
##UNITS=     SECONDS,       ARBITRARY UNITS, ARBITRARY UNITS
##FACTOR=    0.0002768,     1,               1
##FIRST=     0,             0,               0
##LAST=      2.2672688,     0,               0
##MIN=       0,             -229566,         0
##MAX=       2.2672688,     247932,          0
$$ Real data points
##PAGE= N=1
##DATA TABLE= (X++(R..R)), XYDATA
$$ plain form
0 0 0 0 0 0 0 0 0 0 0 0 0 0 0 0 0 0 4 -8 8 -8 8 -8 16 -16 16 -24 24 -29 32 -39 45 -52 60 -66 75 -84 93 -107
38 -107 116 -132 146 -161 183 -201 223 -246 270 -300 329 -363 401 -441 486 -537 592 -654 725
57 725 -806 899 -1007 1134 -1293 1484 -1728 2054 -2507 3182 -4319 6735 -25093 44869 -44397
72 -44397 -229566 -184393 -114216 -95791 -84578 -96833 -78950 55571 102819 24049 55272 186069
84 186069 185468 107862 68011 41481 44901 59627 -38314 -143283 -92986 -44646 -125972 -150407
96 -150407 -62168 -13756 -19006 -16221 -16839 35065 126355 106562 11530 26358 97522 84310 32844
109 32844 -3261 -27445 -6152 -1114 -86866 -118290 -22032 7470 -79484 -94007 -12552 40287
121 40287 52994 35226 2739 40108 105239 60883 -15191 10778 40513 -8751 -53090 -53867
$$ packed form
0@%%%%%%%%%%%%%%%%Mj2J6j6J6j6K4l2L2m0M8n3O1p1Q4r7J12j26J41j59J77k00
38a07K23k48K78l07L44l84M24m69N16n70O29o92P64q42R27j023J129j246J379
57G25j531J705j906K141k427K777l212L782m561N689p501J1054l1828O9962q9266
72d4397j85169M5173P0177J8425J1213j2255J7883J34521M7248p8770L1223J30797
84A86069o01p7606l9851k6530L420J4726r7941j04969N0297M8340q1326k4435
96a50407Q8239M8412n250K785o18N1904R1290j9793r5032J4828P1164j3212n1466
109C2844l6105k4184K1293N038q5752l1424R6258K9502q6954j4523Q1455N2839
121D0287J2707j7768l2487L7369O5131m4356p6074K5969K9735m9264m4339p77
$$ plain form
133 -53867 -33510 6169 -4879 -78662 -68117 35154 49050 -20654 -21526 29715 46581 38609
145 38609 15136 -632 41458 61678 -14921 -63804 -4479 30986 -20718 -67334 -64657 -26735
157 -26735 17813 -147 -46370 -5076 66936 40764 -11562 19350 63224 49814 7606 -30828
169 -30828 -23599 30444 26773 -52577 -69042 -4809 10920 -27588 -38225 -19724 6373 21195
181 21195 -10047 -29677 31505 77869 25644 -19437 12984 47101 36445 3888 -32655 -28619
193 -28619 9866 -6321 -61503 -44583 11274 2598 -34229 -27669 7595 39901 36937 -10946 -24586
206 -24586 32968 56496 3865 -22145 10968 28336 8602 -17247 -25535 1432 22609 -21336
218 -21336 -64344 -24870 26710 8450 -27962 -22426 9220 36583 27194 -8191 -3082 38904 27723
$$ packed form
133e3867K0357L9679j1048p3783J0545J03271J3896o9704q72N1241J6866p972
145C8609k3473j5768M2090K0220p6599m8883N9325L5465n1704m6616K677L7922
157b6735M4548j7960m6223M1294P2012k6172n2326L0912M3874j3410m2208l8434
169c0828P229N4043l671p9350j6465O4233J5729l8508j0637J8501K6097J4822
181B1195l1242j9630O1182M6364n2225m5081L2421L4117j0656l2557l6543M036
193b8619L8485j6187n5182J6920N5857q676l6827O560L5264L2306k964m7883j3640
206b4586N7554K3528n2631k6010L3113J7368j9734k5849q288K6967K1177m3945
218b1336m3008L9474N1580j8260l6412N536L1646K7363r389l5385N109M1986j1181
$$ plain form
231 27723 -24317 -23864 16270 23423 -5595 -31679 -25024 14889 30406 -13221 -39557 -2621 22278
244 22278 -4803 -23733 -7581 16053 19510 -4005 -22274 9072 46921 19067 -28386 -18806
256 -18806 15915 17838 -7240 -25233 -13671 15437 13387 -18435 -16609 21904 25458 -13461 -31072
269 -31072 -7770 18970 15480 -16373 -26961 5654 31383 8038 -15066 2589 22533 8676
281 8676 -16086 -17861 5397 21181 -1919 -32815 -16412 22860 22555 -9001 -20455 -1041 15241
294 15241 4463 -17343 -13096 14217 16169 -11503 -17489 12609 31048 11447 -16337 -17004 7266
307 7266 17522 -5681 -25952 -10086 11506 3065 -14647 -6085 17974 19572 -4897 -21256 -2860
320 -2860 23173 13821 -16761 -21449 4736 19123 2870 -12615 -3674 12712 7275 -14101 -15332
$$ packed form
231B7723n2040M53M0134P153k9018k6084O655L9913J5517m3627k6336L6936K4899
244B2278k7081j8930J6152K3634L457k3515j8269L1346L7849k7854m7453R580
256a8806L4721J923k5078j7993J1562K9108k050l1822J826L8513L554l8919j7611
269c1072K3302K6740l490l1853j0588L2615K5729k3345k3104J7655J9944j3857
281H676k4762j775K3258J5784k3100l0896J6403L9272l05l1556j1454J9414J6282
294A5241j0778k1806M247K7313J952k7672n986L0098J8439j9601k7784o67K4270
307G266J0256k3203k0271J5866K1592q441j7712Q562K4059J598k4469j6359J8396
320b860K6033r352l0582m688K6185J4387j6253j5485Q941J6386n437k1376j231
$$ plain form
333 -15332 6244 17501 -3490 -23251 -8644 19302 20945 -1325 -12400 2649 14161 2808
345 2808 -13386 -9975 5752 2964 -15586 -17180 6147 20835 6300 -12878 -7445 12901 18384
358 18384 1057 -12563 -3198 10350 3022 -11641 -5814 11527 11215 -9063 -19790 -5359 13635
371 13635 6762 -16519 -18764 2730 14408 5302 -3273 2579 13661 11754 -1881 -5117 8925
384 8925 13237 -5638 -21450 -10802 6375 5701 -8071 -14289 -2978 10005 3052 -9227 -2638
397 -2638 10338 4294 -9050 -4980 11026 19204 9465 -6847 -6836 10070 13387 -4835 -15805 -7394
411 -7394 -795 -6175 -12404 -8318 3819 7713 -4784 -10818 5917 19868 9810 -5374 -5437 3851
425 3851 9644 6203 -2621 -1956 6800 3971 -8235 -7603 2441 696 -10834 -17270 -10166 4408 8412
$$ packed form
333a5332K1576J1257k0991j9761J4607K7946J643k2270j1075J5049J1512j1353
345B808j6194L411J5727k788j8550j594K3327J4688j4535j9178N433K0346N483
358A8384j7327j3620R365J3548p328j4663N827J7341l12k0278j0727J4431J8994
371A3635o873k3281k245K1494J1678r106q575N852J1082j907j3635l236J4042
384H925M312j8875j5812J0648J7177o74j3772o218J1311J2983o953j2279O589
397b638J2976o044j3344M070J6006Q178r739j6312J1J6906L317j8222j0970Q411
411g394O599n380o229M086J2137L894j2497o034J6735J3951j0058j5184o3R288
425C851N793l441q824O65Q756k829j2206O32J0044j745j1530o436P104J4574M004
$$ plain form
440 8412 -2495 -6598 6320 13650 6539 2711 6496 7540 2512 -4955 -8111 570 8477 -1098 -14189
455 -14189 -8805 4457 5194 -2865 -8790 -7297 790 2095 -3885 -54 11343 9730 -1029 -1411 6833
470 6833 9967 5043 -5617 -11699 -4141 3673 -2628 -9138 -3374 1813 -841 -2134 1509 6645 7484
485 7484 -909 -9495 -2574 8792 5654 -4110 -3959 1937 3773 1881 -1881 -2820 624 -1210 -8628
500 -8628 -6124 5395 8126 86 -4331 -1071 5747 9378 3802 -3605 -2455 789 -2400 -4817 -1892
515 -1892 -600 -2933 -4022 -3238 1862 7503 4696 -3186 -3601 1671 3417 2009 1819 1707 1622 1055 -1245
532 -1245 -522 3919 1945 -6941 -9727 -3633 1614 875 -3540 -6201 -1886 5224 5515 2665 3896 5406
548 5406 2151 -967 -273 2127 3060 124 -5267 -5014 832 2963 -1353 -4294 -3850 -3390 -2168 -992
$$ packed form
440H412j0907m103J2918P330p111l828L785J044n028p467l156Q681P907r575j3091
455a4189N384J3262P37q059n925J493Q087J305n980L831J1397j613j0759l82Q244
470F833L134m924j0660o082P558P814o301o510N764N187k654j293L643N136Q39
485G484q393q586O921J1366l138r764J51N896J836j892l762r39L444j834p418
500h628K504J1519K731q040m417L260O818L631n576p407J150L244l189k417K925
515a892J292k333j089P84N100N641k807p882m15N272J746j408j90j12q5n67k300
532a245P23M441j974q886k786O094N247p39m415k661M315P110K91k850J231J510
548E406l255l118O94K400R33k936n391K53N846K131m316k941M44M60J222J176
$$ plain form
564 -992 389 1458 905 -1574 -217 6226 9234 5112 144 -704 1057 1914 -731 -4813 -4682 -2484
580 -2484 -3323 -3799 125 3306 997 -3405 -3955 -96 3662 3651 340 -885 999 2816 3220 3583 2609
597 2609 199 -1859 -2189 -1644 -600 -1449 -4679 -6522 -3683 1242 3367 2681 1755 1059 1379 1777 1478
614 1478 939 331 -782 -2137 -1531 1627 3499 1304 -2381 -3609 -2126 249 427 -1335 -2385 -1926
630 -1926 -953 1228 4437 4930 2316 -181 118 1136 1409 4 -3230 -4879 -3118 -858 -79 729 1037
647 1037 47 -505 124 848 1964 2079 -20 -1976 -519 2097 3433 2967 817 -1450 -1284 11 -910
664 -910 -2610 -2967 -4354 -4933 -1594 2479 3133 1896 1544 834 2049 3664 2446 556 199 -844 -1515
681 -1515 251 1803 45 -1690 -2288 -3035 -1955 239 -861 -2916 -2875 -1652 -563 2425 4268 3019
$$ packed form
564i92J381J069n53k479J357O443L008m122m968q48J761Q57k645m082J31K198
580b484q39m76L924L181k309m402n50L859L758j1l311j225J884J817M04L63r74
597B609k410k058l30N45J044q49l230j843K839M925K125o86r26o96L20L98k99
614A478n39o08j113j355O06L158J872k195l685j228J483K375J78j762j050M59
630a926R73K181L209M93k614k497K99J018K73j405l234j649J761K260P79Q08L08
647A037r90n52O29P24J116J15k099j956J457K616J336m66k150k267J66J295r21
664i10j700l57j387n79L339M073O54j237l52p10J215J615j218j890l57j043o71
681a515J766J552j758j735n98p47J080K194j100k055M1J223J089K988J843j249
$$ plain form
697 3019 1998 2815 2692 2742 2907 312 -2606 -3168 -2792 -2209 -375 -346 -2661 -3037 -1427 -567 224 1196 69
716 69 -1361 -69 2196 3019 3830 3283 895 482 1312 1282 70 -1478 -3031 -4763 -2841 -1768 -1473 -672
734 -672 -490 -1493 -303 2675 2879 2261 1846 535 -720 713 2061 1368 368 -483 -1617 -768 1107
751 1107 203 -1637 -2307 -2950 -2783 -238 1368 658 218 853 888 1884 3350 1922 -219 -975 -1185 -1009
769 -1009 16 102 -1271 -1618 -807 -261 861 2316 649 -981 -1068 -694 -190 846 715 -890 -931 393
787 393 909 1653 1420 -649 -2156 -1482 -772 -397 453 72 -904 99 1554 1984 1933 1617 -379 -1950 -1196
806 -1196 -217 48 -368 -1708 -2457 -948 1479 1450 720 -132 -1064 -793 662 1192 738 282 287 371 1058 2158
826 2158 1444 360 -589 -1795 -2359 -1652 -721 -1244 -1895 -2101 -1267 1167 2995 2242 519 -200 83 1220
$$ packed form
697C019j021Q17j23N0J65k595k918n62L76N83J834K9k315l76J610Q60P91R72j127
716F9j430J292K265Q23Q11n47k388m13Q30l0j212j548j553j732J922J073K95Q01
734f72J82j003J190K978K04o18m15j311j255J433J348o93j000q51j134Q49J875
751A107r04j840o70o43J67K545J606p10m40O35L5R96J466j428k141p56k10J76
769a009J025Q6j373l47Q11N46J122J455j667j630q7L74N04J036j31j605m1J324
787C93N16P44k33k069j507O74P10L75Q50l81r76J003J455M30n1l16j996j571P54
806a196R79K65m16j340p49J509K427k9p30q52r32K71J455N30m54m56NQ4O87J100
826B158p14j084r49j206n64P07R31n23o51k06Q34K434J828p53j723p19K83J137
$$ plain form
844 1220 1903 1075 28 -326 202 695 955 506 -891 -1972 -2474 -2278 -1401 -702 -861 -1246 -998 -34 1814
863 1814 3080 3322 2154 890 749 1151 1411 682 -954 -2185 -1914 -696 -211 -249 -1271 -1798 -2123 -1449
881 -1449 -495 296 244 73 330 998 2682 3605 2946 1000 29 -109 102 156 -647 -2394 -2709 -2062 -1106 -410
901 -410 365 6 -911 -1030 89 1174 1681 1073 164 180 1306 1653 1461 1427 523 -894 -1060 -593 -444 -817
921 -817 -1807 -2643 -2196 -268 852 1002 680 328 190 765 1169 1026 760 169 -957 -257 1213 1325 186
940 186 -630 -840 -958 183 547 -600 -1129 -811 -1261 -582 883 997 391 195 -43 39 1134 1364 -531
959 -531 -1329 -1120 -678 46 1013 496 -128 -34 130 -32 875 1164 -743 -1638 -1049 -86 421 571 -392 -1030
979 -1030 69 425 -147 378 322 -773 -1081 0 362 1254 1517 400 -510 727 1430 401 -302 -562
$$ packed form
844A220O83q28j047l54N28M93K60m49j397j081n02J96Q77O99j59l85K48R64J848
863A814J266K42j168j264j41M02K60p29j636j231K71J218M85l8j022n27l25O74
881a449R54P91n2j71K57O68J684R23o59j946r71j38K11N4q03j747l15O47R56O96
901d10P75l59r17j19J119J085N07o08r09J6J126L47j92l4r04j417j66M67J49l73
921h17r90q36M47J928J120J50l22l52j38N75M04j43k66n91j126P00J470J12j139
940A86q16k10j18J141L64j147n29L18m50O79J465J14o06j96k38Q2J095K30j895
959e31p98K09M42P24R67n17o24R4J64j62R07K89j907q95N89R63N07J50r63o38
979a030J099L56n72N25n6j095l08J081L62Q92K63j117r10J237P03j029p03k60
$$ plain form
997 -562 -1527 -1526 -873 -910 -559 193 -960 -1349 589 1879 909 317 128 -609 272 1287 1088 582 1179 408
1017 408 -536 352 774 -791 -1567 -1882 -2280 -1135 361 -543 -1136 -30 210 532 1425 2070 955 692
1035 692 721 -187 327 1422 41 -1238 -665 -188 -338 91 -425 -2023 -1698 -1076 -1505 -430 1212 443
1053 443 -290 849 1582 1669 2153 1188 -781 -255 790 -82 -443 130 -672 -1319 -678 -328 -588 30 -444
1072 -444 -1773 -900 974 493 238 802 396 419 1584 1426 606 841 505 -1417 -869 497 -135 -969 -962
1091 -962 -1348 -1183 663 531 -462 -169 133 -572 -28 1236 589 81 565 235 427 1641 1272 -710 -717
1110 -717 -389 -768 -482 199 -692 -895 -406 -257 -276 922 1046 -332 -313 494 319 708 605 -594 -960 123
1130 123 60 -196 711 510 -718 -490 -145 -220 125 373 -775 -926 576 985 355 495 108 -849 -92 300
$$ packed form
997e62r65JO53l7L51P52j153l89J938J290r70n92j89p37Q81J015j99n06N97p71
1017D08r44Q88M22j565p76l15l98J145J496r04n93J106K40L22Q93O45j115k63
1035F92K9r08N14J095j381j279N73M77j50M29n16j598L25O22m29J075J642p69
1053D43p33J139P33Q7M84r65j969N26J045q72l61N73q02o47O41L50k60O18m74
1072d44j329Q73J874m81k55N64m06K3J165j58q20K35l36j922N48J366o32q34P
1091i62l86J65J846j32r93K93L02p05N44J264o47n08M84l30J92J214l69j982p
1110g17L28l79K86O81q91k03M89J49j9J198J24j378J9Q07j75L89j03j199l66J083
1130A23o3k56R07k01j228K28L45p5L45K48j148j51J502M09o30J40l87r57P57L92
$$ plain form
1150 300 -211 -277 82 -845 -860 501 814 357 432 53 -104 563 932 78 -266 -91 -908 -891 126 355 -289
1171 -289 -151 -605 -637 154 552 -346 -601 35 54 131 1193 1046 549 619 141 -363 321 564 -778 -1225 -760
1192 -760 -861 -416 229 -113 -774 -153 105 -38 702 830 -87 -126 703 616 530 987 231 -560 117 3 -588
1213 -588 -345 -426 -1276 -1353 -475 -30 135 781 548 -366 749 1294 500 346 -36 -95 209 774 817 501 388
1234 388 -501 -1001 -182 223 -267 -630 -1353 -758 438 701 386 -297 738 765 -70 427 407 -144 -230 -68
1254 -68 -640 -287 307 -230 -992 -755 -481 -508 -78 137 -423 -274 -149 36 559 1024 791 174 322 498 259
1275 259 246 120 -714 -940 -516 -267 -187 65 -305 -490 64 249 256 566 334 -95 -115 278 396 197 210 -116
1297 -116 -391 -267 -12 -20 -127 -487 -729 -598 -29 213 18 -32 -151 119 768 748 431 122 49 -135 -25 297
$$ packed form
1150C00n11o6L59r27j5J361L13m57P5l79j57O67L69q54l44J75q17J7J017K29o44
1171b89J38m54l2P91L98q98k55O36J9P7J062j47m97P0m78n04O84K43j342m47M65
1192g60j01M45O45l42o61O21K58j43P40J28r17l9Q29q7q6M57p56p91O77j14n91
1213e88K43q1q50p7Q78M45J65O46k33r14J115N45p94j54l82n9L04N65M3l16j13
1234C88q89n00Q19M05m90l63p23N95J196K63l15o83J035K7q35M97k0n51q6J62
1254f8n72L53N94n37p62K37K74k7M30K15n60J49J25J85N23M65k33o17J48J76k39
1275B59j3j26q34k26M24K49Q0K52l70j85N54J85PL10k32m29k0L93J18j99J3l26
1297a16k75J24K55qj07l60k42J31N69K42j95n0j19K70O49k0l17l09p3j84J10L22
$$ plain form
1319 297 -93 -194 -379 -352 -377 139 435 -124 -20 -216 -279 109 660 370 -38 385 228 161 559 32 -22 -246
1341 -246 -554 -333 221 109 -535 -161 211 -419 -32 152 478 297 -9 41 23 44 593 89 -536 -214 113
1362 113 613 228 -351 -490 -909 255 -208 145 58 -94 12 491 493 772 94 -19 -66 -200 -18 -65 -319
1383 -319 -348 -496 -421 -75 265 509 24 -135 -220 85 277 234 254 37 -114 74 375 376 76 -308 -339 -274 -75
1406 -75 -106 -351 -314 -271 -231 119 319 410 346 54 167 299 113 192 177 -44 -100 81 115 -44 -69 -431 -596 -322
1430 -322 -131 22 -74 -212 -186 130 299 534 567 433 54 -252 75 153 -118 -228 -400 -490 -118 -245 -98 230
1452 230 194 -376 35 -78 525 290 -239 173 230 598 438 425 -712 -345 -225 -502 -330 -116 -305 -658 -151
1473 -151 -270 204 440 212 -22 118 165 281 101 -151 146 276 114 110 145 -19 14 -442 -80 127 -248 -66
$$ packed form
1319B97l90j01j85K7k5N16K96n59J04j96o3L88N51k90m08M23j57o7L98n27n4k24
1341b46l08K21N54j12o44L74L72o30L87J84L26j81l06N0j8K1N49n04o25L22L27
1362A13N00l85n79j39m19J164m63L53q7j52J06M79KK79o78j13m7j34J82m7k54
1383c19k9j48P5L46L40K44m85j59q5L05J92m3K0k17j51J88L01Jl00l84l1O5J99
1406g5l1k45L7M3M0L50K00R1o4k92J13J32j86P9j5k21n6J81L4j59k5l62j65K74
1430c22J91J53r6j38K6L16J69K35L3j34l79l06L27P8k71j10j72r0L72j27J47L28
1452B30l6n70M11j13O03k35n29M12N7L68j60j3j137L67J20k77J72K14j89l53N07
1473a51j19M74K36k28k34J40M7J16j80k52K97J30j62mL5j64L3m56L62K07l75J82
$$ plain form
1495 -66 -62 -92 -358 -90 -83 232 62 389 132 -167 232 -184 162 -231 -558 -426 -201 676 -202 -504 105 -264
1517 -264 -371 312 393 665 -232 0 210 565 50 -316 20 -116 326 45 -475 -280 -435 -402 -594 84 225
1538 225 275 -117 -258 -16 245 352 172 -266 31 390 -490 -61 -216 -225 -351 -363 -68 145 -100 206 -652
1559 -652 -238 -25 313 465 -171 12 370 40 226 -245 13 320 250 -286 81 -399 395 -880 -637 -494
1579 -494 349 461 53 -44 277 179 1 491 80 265 231 -301 -169 186 263 -225 -480 -241 17 -25 -157 -45
1601 -45 247 124 -203 -212 343 475 231 -183 -182 144 353 28 -211 -105 35 -20 -90 -180 126 135 -63 -258 -134
1624 -134 385 354 105 -212 249 475 286 42 42 89 41 -395 -360 -121 164 -186 -488 -132 426 269 -12 -245
1646 -245 -72 315 300 -137 -60 401 264 -304 -211 78 296 14 -322 -483 -12 118 -254 -440 -85 368 225
$$ packed form
1495f6Ml0k66K68PL15j70L27k57k99L99m16L46l93l27J32K25Q77q78l02O09l69
1517b64j07O83Q1K72q97K32K10L55n15l66L36j36M42k81n20J95j55L3j92O78J41
1538B25N0l92j41K42K61J07j80m38K97L59q80M29j55rj26j2K95K13k45L06q58
1559f52M14K13L38J52o36J83L58l30J86m71K58L07p0n36L67m80P94j275K43J43
1579d94Q43J12m08r7L21r8j78M90m11J85l4n32J32L55P7m88k55K39K58m2j32J12
1601d5K92j23l27rN55J32k44m14JL26K09l25k39J06J40n5p0r0L06Rj98j95J24
1624a34N19l1k49l17M61K26j89k44%M7m8m36L5K39K85l50l02L56N58j57k81k33
1646b45J73L87j5m37P7M61j37n68R3K89K18k82l36j61M71J30l72j86L55M53j43
$$ plain form
1667 225 42 -12 491 554 -51 -473 -86 331 113 -374 -540 51 196 -221 -609 -143 8 -169 -482 -63 155
1688 155 391 127 -282 -73 608 566 -271 -331 165 304 -138 -275 -200 194 14 -564 -593 122 599 106 -492
1709 -492 -150 422 608 -34 -157 -86 516 296 -166 -113 290 277 -236 -540 -27 292 44 -571 -560 14 435
1730 435 -10 -430 15 368 374 -133 -134 380 355 -103 -614 -379 357 364 -229 -683 -137 318 89 -326 -327 381 325
1753 325 -280 -350 194 732 212 -265 -268 442 457 -283 -414 -65 284 -122 -479 -219 308 468 -196 -558 -122
1774 -122 553 260 -436 -396 431 547 17 -389 -138 231 5 -506 -411 197 388 -244 -664 -139 514 351 -200
1795 -200 -346 315 691 178 -580 -208 326 -81 -133 -534 89 569 291 -749 -235 234 267 -374 -507 -134
1815 -134 443 32 -460 -406 837 708 -319 -593 245 708 270 -850 -601 525 702 -321 -575 15 370
$$ packed form
1667B25j83n4N03O3o05m22L87M17k18m87j66N91J45m17l88M66J51j77l13M19K18
1688A55K36k64m09K09O81m2q37o0M96J39m42j37P5L94j80n78k9P15M77m93n98
1709d92L42N72J86o42j23P1O02k20m62N3M03j3n13l04N13L19k48o15J1N74M21
1730D35m45m20M45L53On07jN14k5m58n11K35P36Pn93m54N46M55k29m15jP08n6
1753C25o05p0N44N38n20m77lP10J5p40j31L49L49m06l57K60N27J60o64l62M36
1774a22O75k93o96M0Q27J16n30m06K51L69k26n11R5O08J91o32m20N25O53j63n51
1795b00j46O61L76n13p58L72N34m07n2m01O23M80k78j040N14M69L3o41j33L73
1815a34N77m11m92N4J243j29j027k74Q38M63m38j120K49J126J77j023k54N90L55
$$ plain form
1834 370 565 -780 -370 298 288 -291 89 174 404 350 -477 -476 624 -153 -546 -738 283 990 662 -385
1854 -385 -806 376 122 155 -430 -160 80 38 275 -343 275 779 118 -445 -325 -91 21 -310 -886 -127
1874 -127 279 20 -315 -250 97 240 -91 -984 -92 362 354 -452 -49 266 338 10 -857 -383 365 271 -307 -445
1896 -445 124 337 54 -462 -206 387 246 -163 -274 403 722 -47 -384 -318 462 380 -389 -569 303 153 32
1917 32 -542 -360 621 495 -354 -486 35 550 361 -331 -333 308 611 -103 -472 -193 439 271 -560 -424 251
1938 251 402 -239 -597 -131 307 151 -379 -290 232 439 113 -436 -275 277 -19 -343 -628 225 511 -174
1958 -174 -507 -164 350 330 -184 -444 231 451 85 -303 -25 425 308 -84 -489 46 485 172 -384 -263
1978 -263 90 110 -53 -566 -125 609 227 -206 -76 484 385 -188 -467 -285 561 53 -254 -377 139 139 -263
$$ packed form
1834C70J95j345M10O68j0n79L80Q5K30n4q27JJ100p77l93j92J021P07l28j047
1854c85m21J182k54L3n85K70K40m2K37o18O18N04o61n63J20K34J12l31n76P59
1874a27M06k59l35O5L47J43l31q93Q92M54qq06M03L15P2l28q67M74P48r4n78j38
1896d45N69K13k83n16K56N93j41m09j11O77L19p69l37O6P80q2p69j80Q72j50j21
1917C2n74J82R81j26q49j32N21N15j89o92kO41L03p14l69K79O32j68q31J36O75
1938B51J51o41l58M66M38j56n30Q9N22K07l26n49J61N52k96l24k85Q53K86o85
1958a74l33L43N14k0n14k60O75K20l66l88K78M50j17l92m05N35M39l13n56J21
1978b63L53K0j63n13M41P34l82m33J30N60r9n73k79J82Q46n08l07j23N16%m02
$$ plain form
1999 -263 -502 -137 355 240 -351 -259 156 502 95 -418 -77 294 364 -191 -244 -4 351 3 -581 -332 238
2020 238 119 -303 -287 157 422 271 -353 -231 425 318 -172 -228 103 292 339 -351 180 441 163 -521 -489
2041 -489 -349 225 227 -548 -317 60 396 157 -52 79 718 243 -411 -154 244 385 133 -311 81 573 78
2062 78 -661 -595 -181 637 112 81 25 96 210 -313 -352 229 510 -56 -188 -257 254 291 -243 -164 75 208 287
2085 287 -143 -208 315 196 -207 -305 -136 317 316 -255 -170 124 328 22 -342 -159 207 265 -256 -206 47 146 44
2108 44 -261 -232 225 173 -55 -141 225 405 -44 -155 -17 237 132 -187 -385 139 244 5 -171 -113 212 203
2130 203 -109 -287 -105 207 75 -357 154 170 97 -45 -274 3 325 119 -51 -198 229 186 -112 -230 -48
2151 -48 -9 44 -169 -45 12 275 142 -451 -72 219 86 -75 -174 -121 261 -48 -355 -109 79 -65 -148 -230 29
$$ packed form
1999b63k39L65M92j15n91R2M15L46m07n13L41L71P0n55n3K40L55l48n84K49N70
2020B38j19m22J6M44K65j51o24J22O56j07m90n6L31J89M7o90N31K61k78o84L2
2041d89J40N74Kp75K31L77L36k39k09J31O39m75o54K57L98J41k52m44L92M92m95
2062G8p39O6M14Q18n25l1n6P1J14n23l9N81K81n66j32o9N11L7n34P9K39J33P9
2085B87m30o5N23j19m03r8J69M53jn71Q5K94K04l06l64J83L66N8n21N0K53R9j02
2108D4l05K9M57n2k28q6L66J80m49j11J38K54j05l19j98N24J05k39j76N8L25r
2130B03l12j78J82L12j32m32N11J6p3j42k29K77L22k06j70j47M27m3k98j18J82
2151d8L9N3k13J24N7K63j33n93L79K91j33j61r9N3L82l09l07K46J88j44q3q2K59
$$ plain form
2174 29 244 53 -64 102 294 250 -50 -155 -77 222 -53 -18 -252 272 120 -290 -157 -107 160 128 28 -65
2196 -65 75 319 -103 -69 46 288 50 -65 -38 107 46 -15 -208 37 -41 252 -254 -121 34 111 85 -59 140
2219 140 104 98 -108 -144 152 179 56 -244 -164 146 67 -126 -89 84 56 -111 -138 -126 83 12 -62 -203 92 157 98
2244 98 -96 4 168 51 157 -251 216 69 21 -129 -15 38 -68 108 -156 -54 314 14 -38 47 -54 13
2266 13 -103 -248 -28 49 9 -189 -133 -40 44 6 -9 -144 67 -10 20 -32 151 -32 96 -405 152 -199 54 -500
2290 -500 49 -27 324 -330 -302 -263 -95 10 -406 -245 -422 -381 255 238 -324 -27 -89 -176 303 131 56 111 160
2313 160 -57 30 -174 147 128 224 -45 175 72 -3 -49 -204 140 88 85 108 259 -115 210 167 -14 8 26 168
2337 168 -91 -479 -178 -92 201 68 -25 -95 22 101 -21 220 59 15 221 -49 106 69 63 -122 34 -125 9
$$ packed form
2174B9K15j91j17J66J92m4l00j05P8K99k75L5k34N24j52m10J33N0K67l2j00r3
2196f5J40K44m22L4J15K42k38j15K7J45o1o1j93K45p8K93n06J33J55P7k6j44J99
2219A40l6ok06l6K96K7j23l00Q0L10p9j93L7J73k8j67k7J2K09p1p4j41K95O5n9
2244I8j94J00J64j17J06m08M67j47m8j50J14N3j06J76k64J02L68l00n2Q5j01O7
2266A3j16j45K20P7m0j98N6R3Q4l8j5j35K11p7L0n2J83j83J28n01N57l51K53n54
2290e00N49p6L51o54K8L9J68J05m16J61j77M1O36j7n62K97o2q7M79j72p5N5M9
2313A60k17Q7k04L21j9R6k69K20j03p5m6j55L44n2lK3J51l74L25m3j81K2J8J42
2337A68k59l88L01Q6K93j33r3p0J17P9j22K41j61m4K06k70J55l7oj85J56j59J34
$$ plain form
2360 9 6 -29 -5 -163 -28 165 5 -146 -31 -62 -28 21 -35 119 125 108 -85 101 10 115 -90 62 149 75 50 -92
2386 -92 -240 -87 -130 -29 90 180 -18 9 43 28 64 -129 6 68 42 127 -164 4 -21 3 155 119 0 21 156
2411 156 -22 -103 -6 -36 18 100 -51 -22 -11 -153 120 -9 74 -111 -122 -51 -244 44 -47 -55 -158 101 47 -84 -91
2436 -91 3 45 -107 -35 103 42 40 26 31 54 -66 -115 31 6 -17 22 128 196 92 -78 14 -46 -64 71 22 17 -215
2463 -215 -33 39 -94 -36 -44 -45 51 -9 21 -3 212 -157 -104 -3 -36 35 48 139 87 -38 -129 -15 -91 -84 119 52 -103
2490 -103 -138 -98 73 -15 98 -39 -48 29 92 -15 29 -52 58 11 119 228 -38 12 -27 0 -10 279 -93 -66 -38
2515 -38 -52 5 25 38 15 35 -112 125 11 -132 123 163 -85 117 -116 -188 -54 189 -74 95 -95 -20 0 114
2539 114 8 -79 -34 42 -9 -74 23 126 -138 4 -66 -200 7 -25 14 60 90 87 9 63 -22 12 8 -13 122 21 -126
$$ packed form
2360Ill5K4j58J35J93j60j51J15l1L4M9n6J54Oj7j93J86r1J05k05J52Q7p4k5j42
2386i2j48J53m3J01J19R0j98K7L4j5L6j93J35O2k6Q5k91J68k5K4J52l6j19K1J35
2411A56j78q1R7l0N4Q2j51K9J1j42K73j29Q3j85j1P1j93K88r1qj03K59n4j31p
2436i1R4M2j52P2J38o1kj4NK3j20m9J46k5k3L9J06O8j04j70R2o0j8J35m9nk32
2463b15J82P2j33N8qjR6o0L0k4K15l69N3J01l3P1J3R1n2j25r1J14p6PK03o7j55
2490a03l5M0J71q8J13j37rP7O3j07M4q1J10m7J08J09k66N0l9K7j0K89l72K7K8
2515c8j4N7K0J3k3K0j47K37j14j43K55M0k48K02k33p2J34K43k63J69j90P5K0J14
2539A14j06q7M5P6n1o5R7J03k64J42p0j34K07l2L9M6L0lp8N4q5L4mk1J35j01j47
$$ plain form
2566 -126 -111 -59 -33 112 -37 39 37 -18 -151 -108 0 1 8 -10 -56 41 -175 -15 62 133 148 92 -17 -38 16 14 -88 30
2594 30 -32 -127 -100 8 -59 0 -35 -13 46 -54 -158 -70 68 -83 222 -100 -30 -141 38 48 -2 4 -187 64 -187
2619 -187 -39 0 240 114 -127 -41 -30 -151 -67 -33 -20 102 49 -21 138 56 -108 28 111 -18 -57 14 -122 -2
2643 -2 95 -34 86 54 87 14 -153 -21 43 117 135 -59 -35 46 107 -92 126 106 -46 46 -32 -24 9 54 31 35 -140
2670 -140 141 -103 -71 -81 -35 59 -126 69 -15 30 -8 -51 65 63 -26 35 -63 24 71 11 88 7 -130 -120 -129 84 -151
2697 -151 22 6 34 80 59 -109 -21 26 -69 40 63 -2 75 38 95 154 -17 24 -54 -105 -57 9 -217 -26 49 207
2723 207 70 42 136 -7 88 8 -97 -79 2 -4 -49 -14 26 242 -179 178 -63 -99 -25 -90 26 -99 -157 -136 -36
2748 -36 -50 -70 61 70 130 -27 27 125 150 -52 -5 71 4 -22 -112 -19 109 -50 -33 -76 14 -55 -36 29 30 157 -84 -55
$$ packed form
2566a26J5N2K6J45j49P6kn5j33M3J08JPj8m6R7k16J60P7P1J5n6j09k1N4kj02J18
2594C0o2r5K7J08o7N9l5K2N9j00j04Q8J38j51L05l22P0j11J79J0n0Oj91K51k51
2619a87J48L9K40j26k41Q6J1j21Q4L4J3J22n3p0J59q2j64J36Q3j29l9P1j36J20
2643bR7j29J20l2L3p3j67J32O4P4J8j94K4Q1O1j99K18k0j52R2p8QL3M5k3Mj75
2670a40K81k44L2j0M6R4j85J95q4M5l8m3J16kq9O1r8Q7M7o0P7q1j37J0rK13k35
2697a51J73j6K8M6k1j68Q8M7r5J09K3o5P7l7N7N9j71M1p8n1M8O6k26J91P5J58
2723B07j37k8R4j43R5q0j05J8Q1om5L5M0K16m21L57k41l6P4o5J16j25n8K1J00
2748c6j4k0J31RO0j57N4R8K5k02M7P6o7k6r0R3J28j59J7m3R0o9J9O5JJ27k41K9
$$ plain form
2776 -55 -54 -96 -104 -51 -92 19 18 -9 -70 155 -51 168 -68 -68 -190 -72 18 167 -66 -63 19 -158 35 -47 14 221 -15
2803 -15 38 47 6 -131 -15 -65 30 -48 42 136 -8 -129 161 -37 42 -47 28 19 -117 18 -103 60 -154 31 66
2828 66 -49 -172 -5 -115 65 -8 -81 -14 154 -5 -167 57 -20 -25 70 63 43 4 111 -23 -88 133 84 58 -22
2853 -22 -11 18 -69 -52 -72 -22 91 -59 5 8 -60 -31 -88 37 161 -84 48 37 31 -7 -124 -131 42 -161 221 -167
2879 -167 -21 21 164 -52 -75 -254 -350 -87 94 206 58 -9 -262 -529 41 -346 -145 220 50 220 -115
2900 -115 -457 -486 396 -142 40 460 49 -279 -524 -160 -282 -111 177 2 -232 -209 412 -154 -337 -280 40
2921 40 -235 -38 -486 25 72 166 -224 -119 -105 183 -57 17 -107 109 -409 36 -159 -44 392 -67 92 -6
2943 -6 -52 -98 54 131 -26 130 -115 -261 -162 23 132 396 503 436 269 -67 -285 233 -16 41 334 -13 147
$$ packed form
2776e5Jm2qN3m1J11jk7o1K25k06K19k36%j22J18R0J49k33LQ2j77J93q2O1K07k36
2803a5N3Rm1j37J16n0R5p8R0R4j44j21K90j98P9q9P5rj36J35j21J63k14J85L5
2828F6j15j23J67j10J80p3p3O7J68j59j62K24p7nR5pk0l9J07j34o5K21m9k6q0
2853b2J1K9q7J7k0N0J13j50O4Lo8K9n7J25J24k45J32j1ol8j17pJ73k03L82l88
2879a67J46M2J43k16k3j79r6K63J81J12j48o7k53k67N70l87K01L65j70J70l35
2900a15l42k9Q82n38J82M20m11l28k45L64j22J71K88j75k34K3O21n66j83N7L20
2921D0k75J97m48N11M7R4l90J05J4K88k40P4j24K16n18M45j95J15M36m59J59r8
2943fm6m6J52P7j57J56k45j46R9J85J09K64J07o7j67l36k18N18k49N7K93l47J60
$$ plain form
2966 147 615 -27 140 222 158 152 68 133 97 67 338 60 -470 102 -238 99 -340 69 -158 -234 60 -304 115
2989 115 486 -3 25 -393 293 234 -140 249 -126 128 169 34 284 301 370 -100 -421 -493 496 328 -191 308
3011 308 -13 52 -36 55 11 30 107 564 -192 -28 275 -43 -205 -299 400 64 172 378 382 -279 -592 219 -111
3034 -111 167 69 -183 -127 -95 23 109 -21 -298 114 13 -257 -15 80 -157 -464 -125 -18 -119 136 104 294
3056 294 216 89 -15 -113 200 -358 125 -60 134 -337 -242 264 84 15 230 105 73 29 70 184 373 -106
3078 -106 -168 84 -236 -182 289 -114 -22 62 -347 -271 307 -107 125 -140 -260 -123 -230 -267 -182 -83 233 217 -197
3101 -197 124 169 -229 175 486 111 -330 214 58 -179 -105 -621 50 -329 27 298 21 26 -67 446 367 251
3123 251 482 221 149 -584 -399 -127 12 60 -20 121 309 74 370 138 -306 176 -350 107 206 204 3 128
$$ packed form
2966A47M68o42J67Q2o4oq4O5l6l0K71k78n30N72l40L37m39M09k27p6K94l64M19
2989A15L71m89K8m18O86n9l74L89l75K54M1j35K50J7O9m70l21p2R89j68n19M99
3011C08l21O5q8R1m4J9P7M57p56J64L03l18j62r4O99l36J08K06Mo61l13Q11l30
3034a11K78r8k52N6L2J18Q6j30k77M12j01k70K42R5k37l07L39J07j01K55l2J90
3056B94p8j27j04r8L13n58M83j85J94m71R5N06j80o9K15j25l2m4M1J14J89m79
3078a06o2K52l20N4M71m03R2Q4m09P6N78m14K32k65j20J37j07l7Q5R9L16j6m14
3101a97L21M5l98M04L11l75m41N44j56k37P4n16O71l79L56K71k77Nr3N13p9j16
3123B51K31k61p2p33J85K72J39M8q0J41J88k35K96k32m44M82n26M57R9kk01J25
$$ plain form
3145 128 94 292 32 20 112 -98 47 185 70 -145 50 -40 -87 -112 -77 25 201 -73 -162 123 -25 -7 -25
3168 -25 19 -19 126 -187 73 -92 84 62 -94 -77 -45 133 -1 14 234 182 121 112 70 -77 109 272 86 -4
3192 -4 11 -61 -107 92 -3 -252 132 111 56 64 -5 52 -179 82 57 -58 4 3 38 -169 118 -125 90 -127 30 -17
3218 -17 -108 -100 129 -138 -38 548 -164 349 136 628 419 -67 30 303 -169 253 1 185 -272 133 -236 194
3240 194 -160 -53 -133 157 608 -127 -90 10 -91 216 -196 -348 -129 -159 -315 -144 -55 -34 -445 216 8 136
3262 136 405 39 -26 9 148 50 -148 -8 155 -41 95 -61 12 -274 8 -117 46 481 -647 -110 -52
3283 -52 11 234 -271 -220 170 -570 26 637 -379 83 -52 480 -150 174 59 180 222 -184 443 -420 -40
3304 -40 -178 13 14 -112 -76 160 234 -213 -30 -319 -183 -451 -85 -26 148 -574 177 -222 84 6 -32 146 333
$$ packed form
3145A28l4J98k60j2R2k10J45J38j15k15J95r0m7k5L5J02J76k74q9K85j48J8j8
3168b5M4l8J45l13K60j65J76k2j56J7L2J78j34J5K20n2o1rm2j47J86J63j86r0
3192dJ5p2m6J99r5k49L84k1n5Qo9N7k31K61k5j15O2jL5k07K87k43K15k17J57m7
3218a7r1QK29k67J00N86p12N13k13M92k09m86R7K73m72M22k52J84m57M05l69M30
3240A94l54J07q0K90M51p35L7J00j01L07m12j52K19l0j56J71Q9K1m11O61k08J28
3262A36K69l66o5L5J39r8j98J40J63j96J36j56P3k86K82j25J63M35j128N37N8
3283e2O3K23n05N1L90p40N96O11j016M62j35N32o30L24j15J21M2m06O27q63L80
3304d0j38J91Jj26L6K36P4m47J83k89J36k68L66N9J74p22P51l99L06p8l8J78J87
$$ plain form
3327 333 -129 -165 161 23 208 -133 -221 159 -146 -299 -164 148 540 -575 30 207 212 -230 -727 -141 -343
3348 -343 2 298 -86 -188 283 167 364 -384 45 266 -206 -267 17 -104 87 -185 54 448 -507 -123
3368 -123 -199 145 -74 115 -249 -231 -175 237 347 168 327 -324 63 190 231 -323 -14 -97 172 -20 150 -2
3390 -2 28 6 54 54 31 -133 46 62 53 43 53 -5 4 -81 139 32 -98 -218 54 -41 -24 183 14 -52 -8 -116 -120 7
3418 7 -6 -44 -170 -34 23 75 -105 -15 110 178 -190 179 -43 58 46 -59 171 69 -86 69 112 -36 66
3441 66 180 -10 -97 -60 -61 16 6 -83 0 16 -46 -14 -26 -3 -2 -38 -56 -20 152 16 -101 6 66 -178 -38 47 -92
3468 -92 -208 -53 -108 32 -14 142 2 -116 167 99 165 -72 165 36 -101 17 70 191 155 10 -36 118 -1
3491 -1 11 -29 -51 -115 26 -44 129 71 -91 47 64 -120 141 39 -42 -219 -80 -21 168 -132 -97 -2 -18 119 128
$$ packed form
3327C33m62l6L26j38J85l41q8L80l05j53J35L12L92j115O05J77Nm42m97N86k02
3348c43L45K96l84j02M71j16J97p48M29K21m72o1K84j21J91k72K39L94r55L84
3368a23p6L44k19J89l64J8N6M12J10j79J59o51L87J27M1n54L09q3K69j92J70j52
3390bL0k2M8%k3j64J79J6rj0J0n8Rq5K20j07j30j20K72r5J7K07j69o6M4j08mJ27
3418Gj3l8j26J36N7N2j80R0J25O8l68L69k22J01j2j05K30j02j55J55M3j48J02
3441F6J14j90q7L7jP7j0q9Q3J6o2L2j2K3Jl6j8L6J72j36j17J07O0k44J40Q5j39
3468i2j16J55n5J40m6J56j40j18K83o8O6k37K37j29j37J18N3J21l6j45m6J54j19
3491aJ2m0k2o4J41p0J73n8j62J38J7j84K61j02q1j77J39N9J89l00L5R5j6J37R
$$ plain form
3516 128 131 65 -13 -39 -61 52 -45 46 57 -9 -84 -2 -5 134 20 -13 -65 -163 190 73 -47 137 90 21 -23 97 -118
3543 -118 1 -105 18 -18 12 -48 -83 -45 35 117 25 227 -101 -130 58 46 81 -14 -74 9 25 -66 24 -90 -25 -67
3569 -67 -50 -32 -78 113 111 -3 -11 205 18 -175 81 -55 79 -92 -90 -216 140 145 -86 -132 113 128 77 -116 6
3594 6 311 185 39 142 354 113 -266 -407 116 -89 239 112 -151 111 1 147 83 351 61 -31 -523
3615 -523 143 33 49 202 -31 123 290 429 -91 -26 -217 100 -22 -31 -159 20 -204 -148 -25 117 24 -36
3637 -36 -1 18 -11 125 165 65 57 -3 14 108 10 -125 30 13 -156 -158 94 -43 -40 -137 72 88 -106 -239 -108 19
3663 19 48 -84 -70 171 132 176 -110 -53 -117 -50 -6 -83 -110 40 -49 -6 -22 -115 -16 -14 -15 14 182 76 84 62 169 227
3691 227 155 142 -76 55 -16 22 -103 22 -20 68 100 127 153 -164 -139 40 -167 45 146 -85 -12 -6 -57 52 -146
$$ packed form
3516A28Lo6p8k6k2J13r7R1J1o6p5Q2lJ39j14l3n2r8L53j17j20J84m7o9m4J20k15
3543a18J19j06J23l6L0o0l5L8Q0Q2r2K02l28k9J88j2L5r5o0Q3J6r1R0j14O5m2
3569f7J7J8m6J91kj14qK16j87j93K56j36J34j71Kj26L56Nk31m6K45J5n1j93J22
3594FL05j26j46J03K12k41l79j41N23k05L28j27k63K62j10J46o4K68k90r2m92
3615e23O66j10J6J53k33J54J67J39n20O5j91L17j22rj28J79k24N6J23J42r3o0
3637c6L5J9k9J36M0j00qo0J7R4r8j35J55j7j69kK52j37Lr7K09J6j94j33J31J27
3663A9K9j32J4K41l9M4k86N7o4O7M4p7k7J50q9M3j6r3R9KjK9J68j06Qk2J07N8
3691B27p2j3k18J31p1L8j25J25m2Q8L2K7K6l17K5J79k07K12J01k31P3On1J09j98
$$ plain form
3716 -146 19 -352 16 138 31 4 333 151 -432 -158 81 321 105 -226 204 196 154 43 4 271 216 -109
3738 -109 -316 -119 202 -279 141 293 0 -161 34 -391 -129 -315 -124 59 -175 -11 299 212 -414 -26
3758 -26 -185 -110 -200 71 -90 45 24 235 -14 293 307 -107 -93 -140 183 -143 -98 122 -86 -159 -14 -47 -94 -114
3782 -114 -34 -295 -165 262 -136 -170 -249 -30 -174 247 162 -71 55 -141 -340 67 -23 -190 -326 219 -275 112
3804 112 89 -204 -275 -92 -126 -89 76 -17 68 194 -89 -80 -18 -219 115 48 118 896 -62 -340 410 14 -108 -216
3828 -216 300 -252 -514 -310 891 727 -470 -252 409 59 -276 448 -337 249 -69 175 289 -76 235
3847 235 -138 -127 248 194 -329 622 -369 120 6 217 112 172 40 -110 273 -190 214 76 526 -180 -17
3868 -17 -172 98 -86 255 54 -198 164 118 136 -285 -345 -165 -294 -157 76 402 -103 -119 162 -378 -452 -162
$$ packed form
3716a46J65l71L68J22j07k7L29j82n83K74K39K40k16l31M30qm2j11l9K67n5l25
3738a09k07J97L21m81M20J52k93j61J95m25K62j86J91J83k34J64L10q7o26L88
3758b6j59P5r0K71j61J35k1K11k49L07J4m14J4m7L23l26M5K20k08p3J45l3m7k0
3782a14Q0k61J30M27l98l4p9K19j44M21q5k33J26j96j99M07r0j67j36N45m94L87
3804A12k3k93p1J83l4L7J65r3Q5J26k83RO2k01L34o7P0P78r58k78P50l96j22j08
3828b16N16n52k62K04J201j64j197K18O61l50l35P24p85N86l18K44J14l65L11
3847B35l73J1L75n4n23R51r91M89j14K11j05O0j32j50L83m63M04j38M50p06J63
3868a7j55K70j84L41k01k52L62m6J8m21o0J80j29J37K33L26n05j6K81n40p4K90
$$ plain form
3890 -162 138 -10 18 -186 -143 42 5 424 23 83 -495 -581 -350 -122 -19 -207 6 -94 -42 -44 -119 130 53
3913 53 -292 124 -151 185 174 -85 -128 220 541 -212 -12 105 -65 317 447 -13 -227 -77 168 -205 179
3934 179 -264 133 218 -245 -161 -81 235 -353 -86 -252 -104 -128 187 5 -231 -171 97 -84 -148 105 -63 -71 -258
3957 -258 284 374 186 -267 -28 -55 46 -483 542 98 -168 487 216 -466 -202 440 99 315 -254 831
3977 831 -26 140 332 559 17 -167 202 18 212 -170 265 -388 6 -125 -622 502 308 385 397 -13
3997 -13 128 71 24 0 -389 387 -73 83 -5 157 -153 36 -371 26 58 -218 -200 109 335 -293 -135 -478
4019 -478 170 -80 108 182 -43 -109 -37 -25 27 143 205 361 -79 -29 -472 -271 148 160 47 -53 146 77 183
4042 183 175 -28 46 116 58 -217 -35 87 -49 135 -55 123 -33 83 162 -159 40 66 -30 -23 51 18 180 102
$$ packed form
3890a62L00j48K8k04M3J85l7M19m01O0n78q6K31K28J03j88K13j00N2kp5K49p7
3913E3l45M16k75L36j1k59m3L48L21p53K00J17j70L82J30m60k14J50K45l73L84
3934A79m43L97Q5m63Q4Q0L16n88K67j66J48k4L15j82k36O0K68j81o4K53j68qj87
3957b58N42R0j88m53K39k7J01n29J025m44k66O55k71o82K64O42l41K16n69J085
3977H31q57J66J92K27n42j84L69j84J94l82M35o53L94j31m97J124j94P7J2m10
3997a3J41n7m7k4l89P76m60J56q8J62l10J89m07L97L2k76J8L09K26o28J58l43
4019d78O48k50J88P4k25o6P2J2N2J16O2J56m40N0m43K01M19J2j13j00J99o9J06
4042A83qk03P4P0n8k75J82J22j36J84j90J78j56J16P9l21J99K6r6PP4l3J62p8
$$ plain form
4066 102 160 -167 72 14 135 -107 -26 80 39 27 -12 75 105 -168 2 94 41 -44 -28 -72 153 -55 -294 -54
4090 -54 169 -63 -144 -130 139 27 10 -107 -52 120 46 -35 36 32 145 -26 -122 -10 167 166 -40 -123 83 242 43
4115 43 -186 0 104 226 39 23 118 12 37 -225 -176 21 -122 40 -19 -5 56 5 -33 5 100 148 28 -41 193
4140 193 27 127 -36 -175 -41 75 55 -34 10 27 44 -98 14 -104 332 -58 -299 -137 85 37 -73 -51
4162 -51 -37 -33 116 31 -96 95 -43 -204 75 -89 89 5 -26 -52 36 61 -30 155 -219 -121 22 -172 81 -49
4186 -49 49 41 97 208 95 45 -195 255 103 106 71 132 15 -137 -117 -62 13 -129 10 -49 -100 -71 65 -20 76 43
4212 43 94 25 -43 39 92 -156 -87 -118 46 -27 -39 -12 -145 -8 -23 -4 77 -300 47 40 44 91 -71 54 56 68 -136
4239 -136 228 144 11 -95 -66 103 -60 83 19 17 56 -109 139 5 89 55 -177 -32 -124 -73 -25 -94 -91 29 49
$$ packed form
4066A02N8l27K39n8J21k42Q1J06m1j2l9Q7L0k73J70R2n3q5J6m4K25k08k39K40
4090e4K23k32q1J4K69j12j7j17N5J72p4q1P1mJ13j71r6J12J77jk06q3K06J59j99
4115D3k29J86J04J22j87j6R5j06K5k62M9J97j43J62n9J4O1n1l8L8R5M8j20o9K34
4140A93j66J00j63j39J34J16k0q9M4J7J7j42J12j18M36l90k41J62K22m8j10K2
4162e1J4MJ49q5j27J91j38j61K79j64J78q4l1k6Q8K5r1J85l74R8J43j94K53j30
4186d9R8qN6J11j13n0k40M50j52Ll5O1j17j52K0N5P5j42J39n9n1K9J36q5R6l3
4212D3N1o9o8Q2N3k48O9l1J64p3j2K7j33J37j5J9Q1l77L47pMM7j62J25KJ2k04
4239a36L64q4j33j06K9J69j63J43o4kL9j65K48j34Q4l4k32J45r2N1M8o9LJ20K0
$$ plain form
4264 49 55 -98 -237 13 117 -87 121 -95 101 -72 -16 54 141 78 33 -239 4 93 -277 -68 -82 10 -78 -46
4288 -46 -213 103 -79 8 -41 -286 -223 -151 556 -91 -28 -144 -23 98 -202 -349 67 68 -285 79 -222 321 -103
4311 -103 22 39 -375 -688 -588 -721 260 -23 98 -50 -354 245 -282 297 -363 232 331 -91 -252 109 -324
4332 -324 -208 -73 -223 -80 -263 -151 -269 -407 -148 -408 118 120 -307 -310 -313 204 298 778 -174 176 325 -193
4354 -193 324 244 75 800 -204 -522 -433 -263 223 -299 601 528 739 -110 388 -16 -107 277 221 -34 -443
4375 -443 -180 166 -58 -298 213 274 226 -43 -101 -303 -232 -46 -222 -219 151 -147 -108 -269 -269 -411 -227 -327 -109
4398 -109 -269 -492 395 181 33 35 27 553 -522 -424 -151 -166 -217 505 -189 -442 184 -29 776 -364 136 -563
4420 -563 -252 -329 -166 66 -346 300 -232 -86 3 99 -113 354 154 151 -264 625 6 423 -240 91 66 66 129
$$ packed form
4264D9Oj53j39K50J04k04K08k16J96j73N6P0Q7o3m5k72K43Q9l70K09j4R2q8L2
4288d6j67L16j82Q7m9k45O3P2P07o47O3j16J21J21l00j47M16Jl53L64l01N43m24
4311a03J25J7m14l13J00j33R81k83J21j48l04N99n27N79o60N95R9m22j61L61m33
4332c24J16J35j50J43j83J12j18j38K59k60N26Km27llN17R4M80r52L50J49n18
4354a93N17q0j69P25j004l18Q9J70M86n22R00p3K11q49M98m04r1L84n6k55m09
4375d43K63L46k24k40N11O1m8k69n8k02P1J86j76LL70k98L9j61%j42J84j00K18
4398a09j60k23Q87k14j48KqN26j075R8K73j5n1P22o94k53O26k13Q05j140N00o99
4420e63L11p7J63K32m12O46n32J46Q9R6k12M67k00lm15Q89o19M17o63L31k5%O3
$$ plain form
4443 129 -248 -5 -264 -37 100 -59 -255 -175 93 55 43 -424 5 -29 -238 -238 -220 346 158 -23 -18 292 -813
4466 -813 239 863 -245 -538 -187 -304 -77 -185 -153 42 -199 123 -220 332 -11 -585 315 40 -280 16
4486 16 811 230 -100 700 -462 -299 11 698 -175 -464 215 -222 670 -533 68 92 -551 35 -134 381
4506 381 -494 -180 434 -46 363 12 21 250 -168 -85 51 -34 206 60 -272 161 -7 -55 43 -39 105 32 63
4529 63 147 -160 56 -53 59 -42 297 11 57 -165 88 3 -17 -34 -129 54 -134 10 -201 218 154 270 0
4552 0 269 120 -137 -170 -98 203 -52 12 -374 61 -139 -319 -163 -298 3 70 80 -125 152 -28 -73 -167 -329
4575 -329 -196 -105 217 -167 20 -347 -91 4 -19 -33 -216 89 -61 -76 229 121 21 -264 32 -343 -123 68
4597 68 49 -78 -129 70 -35 114 7 77 159 -16 -47 -42 62 -49 -32 -19 -29 64 -46 -78 -123 -8 43 -20 184
$$ packed form
4443A29l77K43k59K27J37j59j96Q0K68l8j2m67M29l4k09%J8N66j88j81NL10j105
4466h13J052O24j108k93L51j17K27j08L2J95k41L22l43N52l43n74R00k75l20K96
4486A6P95n81l30Q00j162J63L10O87q73k89O79m37Q92j203O01K4o43N86j69N15
4506C81q75L14O14m80M09l51RK29m18Q3J36q5K40j46l32M33j68m8R8q2J44p3L1
4529F3Q4l07K16j09J12j01L39k86M6k22K53q5k0j7r5J83j88J44k11M19o4J16k70
4552@K69j49k57l3P2L01k55O4l86M35k00j80J56j35L01O7J0k05K77j80m5r4j62
4575c29J33R1L22l84J87l67K56R5k3j4j83L05j50j5L05j08j00k85K96l75K20J91
4597F8j9j27n1J99j05J49j07P0Q2j75l1NJ04j11J7J3j0R3j10l2m5J15N1o3K04
$$ plain form
4622 184 83 55 11 -24 59 -51 -35 23 -62 -101 222 29 61 -280 -271 82 126 207 43 -422 22 142 -193 37
4646 37 -103 54 130 60 -107 -506 105 -6 148 31 23 -72 1 -481 204 -20 1 -314 -239 -50 -249 283 -224
4669 -224 -11 19 -177 76 91 -71 -14 -47 71 -93 125 -110 88 38 -30 -114 -37 40 168 79 38 24 80 110 -41
4694 -41 128 137 -56 30 34 -30 56 55 191 -19 35 -108 -17 -40 21 -148 4 9 -129 91 -3 116 -57 10 -115 44
4720 44 -143 70 -52 54 -71 -158 -66 8 -92 14 -26 -74 -49 37 -84 -200 -183 -44 109 52 -49 -8 1 -5 103
4745 103 20 -157 129 138 -66 -17 -130 163 1 -37 108 -213 -72 10 -116 -15 35 -113 16 -89 -45 204 -12
4768 -12 -13 151 18 80 147 -79 54 54 -222 1 163 -60 -36 51 50 81 47 165 52 -20 -77 -96 141 -14 119
4793 119 -84 89 9 -12 34 -30 73 -12 1 27 -57 91 -29 -100 87 -51 154 39 85 -17 77 89 86 -30 48
$$ packed form
4622A84j01k8m4l5Q3j10J6N8q5l9L23j93L2l41RL53M4Q1j64m65M44J20l35K30
4646C7j40J57P6p0j67l99O11j11J54j17qr5P3m82O85k24K1l15P5J89j99N32n07
4669b24K13L0j96K53J5j62N7l3J18j64K18k35J98n0o8q4P7P7J28q9m1j4N6L0j51
4694d1J69Rj93Q6Mo4Q6jJ36k10N4j43R1k3O1j69J52Nj38K20r4J19j73O7j25J59
4720D4j87K13j22J06j25q7R2P4j00J06m0m8K5Q6j21j16J7J39J53n7j01M1RoJ08
4745A03q3j77K86Rk04M9j13K93j62l8J45l21J41Q2j26J01N0j48J29j05M4K49k16
4768a2jJ64j33O2O7k26J33%k76K23J62k23K4Q7jL1l4J18j13p2n7j9K37j55J33
4793A19k03J73q0k1M6o4J03q5J3K6q4J48j20p1J87j38K05j15M6j02R4J2lj16P8
$$ plain form
4818 48 98 -93 -103 40 62 -54 -68 -37 -114 -156 12 86 -5 13 104 181 -108 -61 36 -38 -84 -68 57 -2 58 101 57
4845 57 78 -82 -34 -136 -2 136 97 163 39 51 14 81 65 92 -137 171 -79 49 52 -93 55 28 45 -23 -50
4870 -50 -19 -13 -36 7 -54 109 62 96 -5 37 65 -133 -102 42 -92 -74 38 -70 -27 0 18 -32 -134 -72 3 1 -80
4897 -80 -27 158 88 -25 -98 -101 13 -94 -147 62 -39 23 61 6 9 9 -47 -64 -95 19 -19 -55 35 -98 73 156 -41
4924 -41 -11 -27 -7 33 31 10 125 201 3 172 21 -30 21 -98 161 -30 178 -110 46 38 -109 52 -112 -114 -47
4949 -47 -75 -36 29 -65 -51 -59 74 77 -62 146 27 -111 127 -34 72 16 109 -65 58 -32 145 -58 8 77 4
4974 4 30 45 -20 37 -73 16 106 0 24 40 60 -98 60 97 -40 -3 22 -173 -98 -7 91 61 80 49 123 -55 258
5001 258 193 14 91 -180 81 -1 58 -98 -97 -74 -158 -96 -140 12 -102 -62 -106 36 -22 -19 52 37 23 -89 -112 -107 7
$$ packed form
4818D8N0j91j0J43K2j16j4L1p7m2J68P4r1J8R1P7k89M7R7p4m6J6J25n9O0M3m4
4845E7K1j60M8j02J34J38l9O6j24J2l7O7j6K7k29L08k50J28Lj45J48k7J7o8k7
4870e0L1Ok3M3o1J63m7L4j01M2K8j98L1J44j34J8J12j08M3K7J8n0j02O2P5kq1
4897h0N3J85p0j13p3lJ14j07n3K09j01O2L8n5L%n6j7l1J14l8l6R0j33J71Q3j97
4924d1L0j6K0M0kk1J15P6j98J69j51n1N1j19K59j91K08k88J56qj47J61j64kO7
4949d7k8L9O5r4J4qJ33Lj39K08j19j38K38j61J06n6R3j74J23r0J77k03O6O9p3
4974DK6J5o5N7j10Q9R0j06K4J6K0j58J58L7j37L7K5j95P5R1R8l0J9l1P4j78L13
5001B58o5j79P7k71K61q2N9j56JK3q4O2m4J52j14M0m4J42n8LP1j5j4j12k3NJ14
$$ plain form
5028 7 22 -65 82 118 -54 36 -93 -16 37 -30 -21 -86 31 -59 20 -24 -3 48 198 56 -25 -93 -137 -8 -2 66 14 44
5056 44 96 1 -156 69 136 69 37 39 -50 35 12 -71 -43 130 -113 107 -34 -80 147 6 -33 92 178 53 -42 79
5082 79 56 -41 -11 8 72 9 31 53 -66 -80 145 58 134 198 59 45 -95 14 66 -24 -18 -59 75 99 -11 47 -148
5109 -148 -51 60 -17 77 137 2 6 0 -24 -19 -30 34 133 19 37 100 -28 9 138 -32 111 -103 -135 107 -13 -37
5135 -37 15 46 -111 72 -19 -169 -107 -47 -209 -64 80 20 -106 46 213 -141 -26 -145 35 22 -3 -70 -75 51
5159 51 -13 -6 92 -68 -77 -173 11 -26 -106 -37 192 84 -48 171 21 -137 61 -145 -26 55 -248 -2 -95 -26 46
5184 46 -186 -38 80 33 -59 46 135 -137 -63 50 -133 99 -41 -97 -3 30 76 -61 108 80 85 -121 -42 75
5208 75 228 -66 48 -98 107 214 74 48 34 100 -31 34 66 -107 81 8 21 11 62 -30 27 1 86 -105 13
$$ packed form
5028GJ5q7J47L6j72R0j29P7N3o7Ro5J17r0P9m4K1N1J50j42q1o8m4J29OO8n2L0
5056D4N2r5j57K25O7o7l2Kq9Q5k3q3K8J73k43K20j41m6K27j41l9J25Q6j25r5J21
5082G9k3r7L0J9O4o3K2K2j19j4K25q7P6O4j39j4j40J09N2r0Om1J34K4j10N8j95
5109a48R7J11p7R4O0j35Mok4Nj1O4R9j14J8O3j28L7J29j70J43k14l2K42j20k4
5135c7N2L1j57J83r1j50O2O0j62J45J44o0j26J52J67l54J15j19J80j3k5o7nJ26
5159E1o4PR8j60rr6J84l7q0O9K29j08j32K19j50j58J98k06J19Q1l03K46r3O9P2
5184D6k32J48J18m7r2J05Q9k72P4J13j83K32j40n6R4L3M6j37J69k8Nk06P9J17
5208G5J53k94J14j46K05J07j40k6j4O6j31O5L2j73J88p3J3j0N1r2N7k6Q5j91J18
$$ plain form
5233 13 40 -3 -64 -21 -49 -24 124 -27 2 69 53 -10 -9 -50 -48 -25 -10 -46 27 -69 -45 -38 64 -41 -24 111 -46 -31 -28
5262 -28 -62 18 91 -64 -74 -3 82 -91 46 -72 27 -112 -204 42 31 -2 -3 2 -89 -21 22 -39 138 -52 -9 61 162
5289 162 88 61 198 -116 77 158 -60 54 101 107 -65 -49 -30 -99 126 51 -195 -77 122 -138 -138 160 -30 62
5313 62 -46 32 75 -144 -14 -34 -16 45 -199 -215 73 -41 198 30 -18 46 -165 -18 -79 -10 -36 29 -144 283
5337 283 27 132 32 -33 -117 -92 -134 -28 -120 116 -6 261 -151 -144 41 -9 110 -131 4 -266 -28 178 -51
5360 -51 108 -10 3 14 -34 -128 -141 113 51 -114 19 217 -11 68 -163 53 -13 -6 -143 43 -77 382 -187 -96
5384 -96 42 57 -14 110 -1 -235 -78 23 -213 143 148 -133 26 -125 167 -153 211 -266 -168 -83 142 -67
5406 -67 90 186 -521 -15 303 317 -152 85 155 38 440 -235 -102 -134 -39 200 2 -187 -228 226 -210 96
$$ packed form
5233A3K7m3o1M3k8K5J48j51K9O7j6o3Jm1KK3J5l6P3r6K4PJ02j05J7J35j57J5L
5262b8l4Q0P3j55j0P1Q5j73J37j18R9j39r2K46j1l3jNr1O8M3o1J77j90M3P0J01
5289A62p4k7J37l14J93Q1k18J14M7Oj72J6J9o9K25p5k46J18J99k60%K98j90R2
5313F2j08P8M3k19J30k0J8O1k44j6K88j14K39j68m8O4k11J47o1O9k6O5j73M27
5337B83k56J05j00o5q4K5m2J06r2K36j22K67m12PJ85n0J19k41J35k70K38K06k29
5360e1J59j18J3J1m8r4j3K54o2j65J33J98k28P9k31K16o6Pj37J86j20M59n69R1
5384i6J38J5p1J24j11k34J57J01k36L56Nk81J59j51K92l20L64m77R8Q5K25k09
5406f7J57R6p07N06L18J4m69K37P0j17M02o75J33l2R5K39j98j89m1M54m36L06
$$ plain form
5428 96 -126 -147 25 403 -342 -101 8 67 33 70 70 172 -19 266 -160 168 -145 281 -383 75 289 298 186
5451 186 -61 121 22 46 83 -204 28 126 -94 26 163 -103 -76 95 41 -104 -268 -106 42 4 88 -20 -58
5474 -58 68 -10 -1 13 46 -111 -52 -27 -115 16 74 -5 51 -59 104 -35 46 150 -138 165 63 142 -7 -129 31
5499 31 -86 -111 -142 -65 -54 -47 -50 148 -58 149 1 -70 -22 48 -15 112 132 -63 2 -7 75 -7 51 -10 110 47 -54
5526 -54 -64 23 86 43 70 94 16 -126 -8 -93 -18 -22 67 -51 -80 -107 48 193 12 -5 -147 -35 128 28 19 95
5552 95 16 16 163 174 -1 -152 73 11 34 -37 56 -84 119 99 -27 45 -154 -111 -83 95 -92 -19 -62 -10 71 35
5578 35 44 -111 108 -50 71 283 3 -253 -165 14 -118 129 22 118 101 -22 5 -111 -42 48 135 4 58 -76
5602 -76 -209 -42 -4 -2 49 -7 -227 -97 -3 -11 -79 91 8 15 44 101 16 48 -27 -185 -106 58 104 102 14 -41 -14 -19 28
$$ packed form
5428I6k22k1J72L78p45K41J09N9l4L7%J02j91K85m26L28l13M26o64M58K14Rj12
5451A86k47J82r9K4L7k87K32R8k20J20J37k66K7J71n4j45j64J62J48l8Q4j08l8
5474e8J26p8RJ4L3j57N9K5q8J31N8p9N6j10J63j39Q1J04k88L03j02P9j49j22J60
5499C1j17k5l1P7J1PlJ98k06K07j48p1M8P0o3J27K0j95O5rQ2q2N8o1J20o3j01
5526e4j0Q7O3m3K7K4p8j42J18q5P5mQ9j18k9k7J55J45j81j7j42J12J63j00rP6
5552I5p9%J47J1j75j51K25o2K3p1R3j40K03k0j26P2j99M3K8J78j87P3m3N2Q1l6
5578C5Rj55K19j58J21K12k80k56Q8J79j32K47j07R6j7j23K7j16O9R0Q7j31N4j34
5602g6j33J67L8KN1n6k20J30R4qo8J70q3PK9N7q5L2p5j58P9J64M6kq8n5K7nM7
$$ plain form
5631 28 122 -128 -78 79 30 -85 88 0 -35 59 97 10 35 66 -12 129 107 -10 -5 31 -86 -143 43 -62 -134 122
5657 122 -4 -65 -148 -250 -267 19 123 24 -212 131 56 -193 -169 58 143 -198 190 -142 -197 -26 95 -46 -198
5680 -198 -88 -97 38 31 6 -60 233 118 119 -92 88 0 -70 61 21 5 -118 -37 -156 -21 -83 -37 77 112 133 -59
5706 -59 88 -105 64 -22 69 142 -71 177 -74 41 -21 102 128 -21 -53 60 45 121 -189 207 -34 -138 164
5729 164 -135 -18 5 113 75 -10 33 58 53 144 56 143 75 9 111 2 36 -73 -49 -102 -16 67 68 138 -9 -60 -55 -65
5757 -65 -12 -34 50 -80 94 -20 -32 -49 85 -61 49 88 105 27 -68 -31 -28 56 -63 -66 -78 -56 -61 -113 -108 62 -91 145
5785 145 -120 -48 23 -3 -16 -117 94 13 -82 70 125 31 98 66 -181 58 -65 21 -43 37 137 22 4 -58 78
5810 78 -31 24 -7 -112 -86 69 -70 -50 -138 179 -75 59 85 -80 -12 -81 -186 96 -90 7 222 -19 -17 199
$$ packed form
5631B8R4k50N0J57m9j15J73q8l5R4L8q7K5L1p8J41k2j17NL6j17n7J86j05p2K56
5657A22j26o1q3j02j7K86J04r9k36L43p5k49K4K27Q5l41L88l32n5J71J21j41j52
5680a98J10rJ35pk5o6K93j15Jk11J80q8p0J31m0j6j23Q1j19J35o2M6J14L5K1j92
5706e9J47j93J69q6R1P3k13K48k51J15o2J23K6j49l2J13j5P6l10L96k41j04L02
5729A64k99J17K3J08l8q5M3K5nR1q8Q7o8o6J02j09L4j09K4n3Q6Q3JP0j47n1Nj0
5757f5N3k2Q4j30J74j14j2j7J34j46J10L9J7p8r5L7LQ4j19lj2K2nn2NJ70j53K36
5785A45k65P2P1k6j3j01K11q1r5J52N5r4O7l2k47K39j23Q6o4Q0J00j15j8o2J36
5810G8j09N5l1j05K6J55j39K0q8L17k54J34K6j65O8o9j05K82j86R7K15k41KK16
$$ plain form
5834 199 18 -147 135 -138 197 -7 51 -19 301 144 -38 -61 -55 239 -183 167 -97 -84 39 227 276 18
5856 18 165 23 -112 -136 -115 9 -123 -177 389 33 125 20 268 117 -276 -12 36 -20 -51 -467 119 11 277
5879 277 -238 359 377 209 41 -47 117 -211 141 143 -23 -95 -116 189 34 45 -114 462 26 -198 -304 409
5901 409 47 -340 -51 -429 -178 9 -409 313 -524 -583 68 187 -301 228 17 489 176 228 -426 -10 422
5922 422 -104 -33 -5 128 -118 16 -210 6 -150 30 326 -206 206 93 -180 55 124 -23 -138 -358 -68
5943 -68 205 217 386 -127 120 -101 -42 -244 -264 -136 128 -247 302 86 -115 -46 -23 374 -87 83 -421 -154
5965 -154 -293 16 50 -76 -75 349 -26 101 -198 -226 -239 -112 -106 11 166 -319 -507 -263 163 -91 -477 -355
5987 -355 -90 -164 -305 -292 24 291 813 171 -195 -330 285 -311 111 590 284 276 -258 -288 529 -453 183 -662
$$ packed form
5834A99j81j65K82k73L35k04N8p0L20j57j82k3OK94m22L50k64J3J23J88M9k58
5856A8J47j42j35k4K1J24j32n4N66l56R2j05K48j51l93K64M8n6l1m16N86j08K66
5879B77n15N97J8j68j68q8J64l28L52Kj66p2k1L05j55J1j59N76m36k24j06P13
5901D09l62l87K89l78K51J87m18P22q37n9O51J19m88N29k11M72l13N2o54M16M32
5922D22n26P1K8J33k46J34k26K16j56J80K96n32M12j13k73K35O9j47j15k20K90
5943f8K73J2J69n13K47k21N9k02k0J28K64l75N49k16k01O9K3L97m61J70n04K67
5965a54j39L09L4j26JM24l75J27k99k8j3J27OJ17J55m85j88K44M26k54l86J22
5987c55K65p4j41J3L16K67N22o42l66j35O15n96M22M79l06qn34l0Q17r82O36q45
$$ plain form
6009 -662 124 685 604 134 0 -47 -184 -228 -73 291 -319 214 -74 -158 750 443 -17 240 114 35 0 -68
6031 -68 16 52 -90 221 -120 224 -145 -191 -69 84 52 341 -139 -241 -124 -22 -75 -92 -56 -6 -139 -52 30 105
6055 105 -186 -103 198 104 113 -371 -35 349 -102 84 -87 -82 -140 -52 7 -292 -9 -32 -6 -132 -80 15 45 118 164
6080 164 -116 54 -16 17 99 43 17 -217 -166 -95 -44 -47 8 -62 48 14 49 83 86 -102 66 121 -59 113 12 -20
6106 -20 -100 -26 136 -70 -30 248 -11 -84 -84 28 -213 -133 -79 190 274 74 167 5 -101 -32 -43 -93 154 111 -334
6131 -334 -393 -63 -134 -139 -377 256 -82 -100 497 -236 -412 76 -10 280 -84 -107 173 -162 -230 28 -48 126 -184
6154 -184 -132 0 -94 353 375 43 -15 -83 594 -296 -148 23 -118 383 -223 37 -114 -34 -209 467 253 151
6176 151 -18 -523 70 -76 -19 -147 80 -211 450 -158 268 -333 -91 -278 -389 -280 -327 87 513 291 -55
$$ packed form
6009f62P86N61q1m70j34m7j37m4J55L64o10N33k88q4R08l07m60K57j26p9l5o8
6031f8Q4L6j42L11l41L44l69m6J22J53l2K89m80j02J17J02n3j7L6N0j33Q7Q2P5
6055A05k91Q3L01r4Rm84L36L84m51J86j71Nn8Q8N9k99K83k3K6j26N2R5L0P3M6
6080A64k80J70p0L3Q2n6k6k34N1P1N1lN5p0J10l4L5L4Lj88J68N5j80J72j01l2
6106b0q0P4J62k06M0K78k59p3%J12k41Q0N4K69Q4k00R3j62j06O9j1n0K47m3m45
6131c34n9L30p1nk38O33l38j8N97p33j76M88q6K90l64k3K80l35o8K58p6J74l10
6154a84N2J32r4M47K2l32n8o8O77q90J48J71j41N01o06K60j51Q0j75O76k14j02
6176A51j69n05N93j46N7j28K27k91O61o08M26o01K42j87j11J09m7M14M26k22l46
$$ plain form
6197 -55 403 47 -4 -356 295 -7 -496 173 -278 -79 610 466 -250 13 210 326 697 125 9 -253 625
6218 625 -167 3 -77 -71 120 211 393 308 -316 321 496 61 -16 68 -243 68 41 53 125 -203 -743 290 589
6241 589 -542 -88 -110 180 -60 -544 -161 -279 -4 558 -344 -107 -270 -244 353 -681 153 18 -42 28 249
6262 249 520 35 25 317 170 -350 315 -258 83 -55 26 62 -63 459 108 -294 138 80 -94 186 59
6283 59 -177 186 -116 -305 26 -300 -443 -55 39 -54 -5 155 445 -226 -1 57 15 350 88 129 -339 -44
6305 -44 -99 211 -610 52 157 -73 -339 364 484 -592 -98 -114 41 32 740 -248 629 565 -228 129 94 -329
6327 -329 154 -344 -259 -46 492 -604 12 402 -426 137 36 -180 -48 8 -60 83 493 -256 -57 250 -129
6348 -129 134 -38 -64 285 -29 241 302 -20 -191 16 257 20 -151 85 -59 -277 -197 -110 -170 -213 -16 102
$$ packed form
6197e5M58l56n1l52O51l02m89O69m51J99O89j44p16K63J97J16L71n72j16k62Q78
6218F25p92J70q0OJ91R1J82q5o24O37J75m35p7Q4l11L11k7J2P2l28n40J033K99
6241E89j131M54k2K90k40m84L83j18K75N62r02K37j63K6N97j034Q34j35o0P0K21
6262B49K71m85j0K92j47n20O65n73L41j38Q1L6j25N22l51m02M32n8j74K80j27
6283E9k36L63l02j89L31l26j43L88R4r3M9J60K90o71K25N8m2L35k62M1m68K95
6305d4n5L10q21O62J05k30k66P03J20j076M94j6J55rP08r88Q77o4p93L57l5m23
6327c29M83m98Q5K13N38j096O16L90q28N63j01k16J32N6o8J43M10p49J99L07l79
6348a29K63j72k6L49l14K70O1l22j71K07K41k37j71K36j44k18Q0Q7o0m3J97J18
$$ plain form
6370 102 283 80 -177 -7 -99 -117 -102 -27 -179 -161 -67 -64 87 -378 -81 -188 -102 103 189 1 -233 -16 -49 -259
6394 -259 -172 238 -46 -482 32 239 300 76 -161 10 -430 296 -208 -64 472 307 14 192 368 202 343
6415 343 -130 204 -149 101 241 36 -44 -237 207 -170 -56 513 145 334 -355 167 -352 242 407 -80
6435 -80 -174 161 339 306 -400 296 -174 -187 -212 17 230 -213 659 -235 26 257 -142 487 -363 -184 18 -215
6457 -215 -110 -43 264 7 172 264 368 -473 226 15 -210 311 445 -443 209 -196 -369 -628 -547 -99 -232
6478 -232 -715 -216 -122 355 -648 -108 397 -309 388 -281 -13 -41 77 218 -181 -161 -195 118 189 -77 -153 53
6500 53 231 451 -179 -19 169 -249 -775 360 -139 -391 -276 -116 161 -233 90 -55 -9 93 95 -313 132
6521 132 179 6 192 -301 -85 101 -300 271 -242 221 -171 -43 166 -74 -143 103 -386 210 141 -115 -45
$$ packed form
6370A02J81k03k57J70r2j8J5P5j52J8R4LJ51m65K97j07Q6K05Q6j88k34K17l3k10
6394b59Q7M10k84m36N14K07O1k24k37J71m40P26n04J44N36j65k93J78J76j66J41
6415C43m73L34l53K50J40k05q0j93M44l77J14N69l68J89o89N22n19N94J65m87
6435h0r4L35J78l3p06O96m70j3k5K29K13m43Q72q94K61K31l99O29q50J79K02k33
6457b15J05O7L07k57J65R2J04q41O99k11k25N21J34q88O52m05j73k59Q1M48j33
6478b32m83M99R4M77j003N40N05p06O97o69K68k8J18J41l99K0l4L13P1k66p6K06
6500E3J78K20o30J60J88m18n26J135m99k52J15J60K77l94L23j45M6J02Km08M45
6521A32M7j73J86m93K16J86m01N71n13M63l92J28K09k40o9K46m89N96o9k56P0
$$ plain form
6542 -45 86 -24 207 -128 144 -252 -198 49 -91 -229 130 -36 231 -73 90 -46 29 -51 -96 78 -53 -206
6564 -206 130 -43 43 -71 74 75 49 -81 95 62 -146 -66 -34 98 -203 26 -174 -56 -119 -36 35 70 -33 -158
6588 -158 -80 -56 -46 53 7 -203 21 110 62 142 -2 -101 65 -102 94 109 30 15 24 92 59 14 -55 13 25 80 -72
6615 -72 233 7 100 2 52 -89 -16 -10 -116 1 -61 -400 371 -374 -109 275 175 338 -113 133 -409 -85 88
6638 88 260 199 235 -80 340 105 -224 -33 38 -132 4 6 312 -368 -298 -53 111 221 -116 12 114 -273
6660 -273 -23 -69 -94 86 100 -59 73 -114 94 123 -134 181 22 -42 125 -15 214 74 -27 -33 -154 10
6682 10 86 1 -46 88 -9 29 -26 34 -134 -118 44 89 -5 269 12 112 274 -73 -115 -72 -132 74 191 184 -41
6707 -41 -33 -178 45 -138 -205 -125 -58 139 -245 -75 42 -171 145 -207 -57 90 -212 -21 249 -118 -33 54 -24
$$ packed form
6542d5J31j10K31l35K72l96N4K47j40j38L59j66K67l04J63j36P5q0m5J74j31j53
6564b06L36j73Q6j14J45Jk6j30J76l3k08Q0L2J32l01K29k00J18o3Q3P1L5j03j25
6588a58P8K4J0R9m6k10K24Q9m8Q0j44r9J66j67J96J5p9j5RO8l3m5o9O8J2N5j52
6615g2L05k26R3r8N0j41P3Oj06J17o2l39P71p45K65L84j00J63m51K46n42L24J73
6638H8J72o1L6l15M20k35l29J91P1j70J36KL06o80P0K45J64J10l37J28J02l87
6660b73K50m6k5J80J4j59J32j87K08K9k57L15j59o4J67j40K29j40j01oj21J64
6682A0P6q5m7J34r7L8n5O0j68J6J62M5r4K74k57J00J62l47m2M3o0K06J17pk25
6707d1Qj45K23j83o7Q0O7J97l84J70J17k13L16l52J50J47l02J91K70l67Q5Q7p8
$$ plain form
6730 -24 -307 -147 -86 101 261 -1 -94 -214 -18 -343 -393 -58 105 -253 -118 -135 -27 106 -151 107 100 -121
6752 -121 12 -450 51 -132 116 6 -503 -172 -23 -65 90 33 43 161 21 -385 -366 252 -36 67 -142
6773 -142 -101 57 154 64 -12 94 -46 30 32 -143 11 -111 189 -9 -96 -45 -81 76 -223 21 -94 154 -188
6796 -188 87 122 115 47 -88 86 57 -16 -72 67 -18 10 124 -44 -50 29 52 49 -119 138 -114 -184 57 -91 -119 33
6822 33 15 -11 2 132 121 109 -21 -17 -3 59 -4 -56 -15 4 143 111 21 165 -71 35 -100 17 68 141 58 -17 -36
6849 -36 -4 -20 -49 44 -137 129 -62 86 220 -94 52 -147 9 -32 -8 25 112 -11 40 55 -15 58 -33 44 -208
6874 -208 71 -166 -276 -22 -7 -172 195 -24 -131 139 2 11 -99 -2 19 228 137 86 52 85 -139 26 125
6897 125 122 58 -22 237 129 -44 -66 48 68 -134 -68 88 -63 151 -11 -70 -85 37 -57 -101 130 -105 -15 -58
$$ packed form
6730b4k83J60O1J87J60k62r3j20J96l25n0L35J63l58J35j7J08J33k57K58pk21
6752a21J33m62N01j83K48j10n09L31J49m2J55n7J0J18j40m06J9O18k88J03k09
6773a42M1J58R7r0p6J06j40P6Kj75J54j22L00j98q7N1l6J57k99K44j15K48l42
6796a88K75L5po8j35J74k9p3n6J39q5K8J14j68oP9K3lj68K57k52p0K41j48k8J52
6822C3j8k6J3J30j1j2j30MJ4O2o3n2M1J9J39l2r0J44k36J06j35J17N1P3q3p5j9
6849c6L2j6k9R3j81K66j91J48J34l14J46j99J56m1K4L3Q7j23N1J5p0P3r1P7k52
6874b08K79k37j10K54J5j65L67k19j07K70j37Rj10R7K1K09r1n1l4L3k24J65R9
6897A25lo4q0K59j08j73k2J14K0k02O6J56j51K14j62n9j5J22r4m4K31k35R0m3
$$ plain form
6921 -58 34 70 38 37 6 -67 82 150 -1 69 -122 46 72 -120 -44 60 -3 103 -26 17 143 113 -41 -78 78
6946 78 47 -43 -94 4 47 13 56 12 95 18 107 39 48 63 79 21 -71 43 177 6 -85 4 -5 -56 69 151 -116 -54 30
6975 30 -41 -43 111 22 -186 11 89 100 169 95 -121 -111 -160 68 30 114 -21 108 -7 -69 27 49 5 60 -118 -81
7001 -81 98 -49 18 32 -60 65 -25 24 -29 47 48 -74 -115 -57 166 180 12 157 89 17 67 11 -56 -252 159 105
7027 105 -20 3 -24 -106 4 -62 24 10 -83 89 90 -265 -9 74 -141 51 -33 189 -34 1 45 -169 48 -153
7051 -153 99 -63 53 -37 -74 128 -17 57 -48 36 -44 25 -48 23 -96 95 29 74 -21 19 44 60 -69 87 74
7076 74 93 -98 76 76 -111 -64 -113 12 -117 -156 -206 37 -49 -66 -186 -126 39 126 50 -19 -18 121 39 64 68 -35 80
7103 80 62 -42 -93 35 9 12 185 71 110 111 50 74 -27 -113 69 -184 41 -61 -64 -5 -72 -78 -180 -13 -60 18 -52
$$ packed form
6921e8R2L6l2jl1p3J49O8j51P0j91J68K6j92P6J04o3J06j29M3J26l0j54l7J56
6946G8l1r0n1R8M3l4M3m4Q3p7Q9o8RJ5J6n8r2J14J34j71r1Q9rn1J25Q2k67O2Q4
6975C0p1kJ54q9k08J97P8J1O9p4k16J0m9K28l8Q4j35J29j15o2R6K2m4N5j78L7
7001h1J79j47O7J4r2J25r0M9n3P6Jj22m1N8K23J4j68J45o8p2N0n6o7j96M11n4
7027A05j25K3k7q2J10o6Q6j4r3J72Jl55K56Q3k15J92q4K22k23L5M4k14K17k01
7051a53K52j62J16r0l7K02j45P4j05Q4q0O9p3P1j19J91o6M5r5M0K5J6j29J56j3
7076G4J9j91J74%j87M7m9J25j29l9n0K43q6j7j20O0J65Q7p6o9JJ39q2K5Mj03J15
7103H0j8j04n1J28k6LJ73j14L9Jo1K4j01q6J82k53K25j02lN9o7oj02J67m7P8p0
$$ plain form
7130 -52 74 -98 69 1 -53 85 63 96 -118 -205 172 -70 69 5 26 -54 19 -186 52 -79 165 42 115 -136
7154 -136 -62 367 128 -467 -220 -162 -638 -583 -227 -118 122 -20 326 -187 -362 -179 -168 13 -34 -227 -379 288
7176 288 76 98 -58 -53 -190 -107 35 -60 -123 117 -353 168 -7 129 -80 123 -152 -91 -95 56 -45 -38 45 48 -10
7201 -10 107 -126 -202 83 88 203 99 -42 193 -208 -77 -44 163 -131 -116 -50 -6 42 86 -143 3 115 -96
7224 -96 129 13 183 -43 77 -222 -214 -20 17 -41 -97 -218 91 -142 132 41 -214 96 43 -221 79 68 263
7247 263 -243 -208 6 -23 -132 -289 -152 -74 -135 -245 161 -167 -92 -79 196 219 -108 -21 -53 -522 30 223 181
7270 181 -300 -3 244 -635 -376 221 31 351 328 139 -311 232 -55 355 546 114 168 -166 262 261 -265
7291 -265 73 224 -243 156 -490 113 -17 55 25 59 -455 -165 312 -205 -590 489 -61 -30 218 -60 448
$$ packed form
7130e2J26j72J67o8n4J38k2L3k14q7L77k42J39o4K1q0P3k05K38j31K44j23P3k51
7154a36P4M29k39n95K47N8m76N5L56J09K40j42L46n13j75J83J1J81m7j93j52O67
7176B88k12K2j56Nj37Q3J42r5o3K40m70N21j75J36k09K03k75O1mJ51j01PQ3Ln8
7201a0J17k33p6K85NJ15j04j41K35m01J31L3K07k94J5O6M4M8M4k29J46J12k11
7224i6K25j16J70k26J20k99QJ94L7n8n6j21L09k33K74r1k55L10n3k64L00j1J95
7247B63n06L5K14k9j09j57J37P8o1j10M06l28P5J3K75K3l27Q7l2m69N52J93m2
7270A81m81K97K47q79K59N97j90L20k3j89m50N43k87M10J91m32N4l34M28jn26
7291b65L38J51m67L99o46O03j30P2l0L4n14K90M77n17l85J079n50L1K48k78N08
$$ plain form
7312 448 77 -11 -179 -31 -283 -116 517 159 -355 163 367 -433 -353 -482 410 -435 -780 -387 57 5 336
7333 336 24 -259 -80 1012 342 297 -40 -216 -211 -210 -121 6 -172 -63 16 -88 -40 3 -8 -147 36 -115 -84
7356 -84 -137 -198 92 -128 -59 61 156 0 21 162 132 115 47 3 35 -48 -188 103 13 -138 -109 -22 -89 -30 -36 -26 51
7383 51 21 68 101 29 29 -111 -116 79 -136 47 34 16 -220 17 -72 117 60 -12 7 -228 178 -18 -232 -29 -71
7408 -71 30 -23 -47 55 27 154 104 -36 -114 -8 99 -87 50 101 -26 70 94 2 99 38 -202 114 -127 -95
7432 -95 69 8 151 -66 -133 10 -59 5 7 -134 36 17 147 92 -136 136 -196 -87 42 34 52 69 -16 -55 -58 37
7458 37 -4 -33 62 159 -12 1 1 143 9 -6 -3 14 134 179 -15 -44 -37 110 -237 -99 59 -132 -20 -97 -82 -17
7484 -17 -113 190 -11 133 -19 -23 -73 71 -5 39 -69 -68 -86 27 -117 -40 25 210 59 -34 105 45 -77 -140 35
$$ packed form
7312D48l71q8j68J48k52J67O33l58n14N18K04q00Q0j29Q92q45l45L93M44n2L31
7333C36l12k83J79J092o70m5l37j76NJQ9J27j78J09P9j04M8M3j1j39J83j51L1
7356h4n3o1K90k20O9J20R5j56K1J41l0j7o8m4L2q3j40K91r0j51K9Q7o7N9oJ0P7
7383E1l0M7L3p2%j40nJ95k15J83j3j8k36K37q9J89n7p2J9k35M06j96k14K03m2
7408g1J01n3k4J02k8J27n0j40p8J06J07j86J37N1j27R6K4r2R7o1k40L16k41L2
7432i5J64o1J43k17o7J43o9O4Kj41J70j9J30n5k28K72l32J09J29qJ8J7q5l9lR5
7458C7m1k9R5R7j71J3%J42j34j5LJ7J20M5j94k9PJ47l47J38J58j91J12p7J5O5
7484a7r6L03k01J44j52mn0J44p6M4j08Jj8J13j44P7O5J85j51r3J39o0j22o3J75
$$ plain form
7509 35 -75 -38 -89 -190 -26 -208 15 104 76 62 -106 -11 -174 -87 -88 -160 -15 141 136 -142 35 14 -39 55 -39 -217
7535 -217 129 -34 25 23 -100 131 109 111 -26 65 -73 189 -78 -74 -113 -31 10 -88 0 117 81 -94 -88 -4 68 21 -40
7562 -40 5 -25 14 -34 -2 152 91 -20 -160 -109 109 54 35 208 77 -181 -59 66 -81 -83 59 -61 -78 -29 57
7587 57 -183 228 57 -119 60 -64 47 -102 41 104 118 -74 143 -81 -123 -22 -7 -35 81 -33 49 90 71
7610 71 31 87 114 -48 83 5 160 -97 -139 -25 7 -29 50 -133 -71 239 0 -21 -1 -9 41 16 -27 -112 -2 6 137
7637 137 -98 22 16 -59 -52 -199 -32 -126 89 70 60 145 100 -75 83 -73 -158 77 -13 -151 55 -70 -47 -117 -47
7662 -47 -19 -51 -38 -22 32 82 -23 -144 57 -17 51 -168 32 128 -18 58 -79 127 51 -35 -99 118 131 -84 69
7687 69 -37 88 75 63 -129 -50 87 -28 117 97 -78 104 116 -35 17 29 -56 19 -252 121 162 -89 8 -79
$$ packed form
7509C5j10L7n1j01J64j82K23Q9k8j4j68R5j63Q7jp2J45J56nk78J77k1n3R4r4j78
7535b17L46j63N9kj23K31k2Kj37R1j38K62k67Ml9Q2M1r8Q8J17l6j75OQ4P2m7o1
7562d0M5l0L9m8L2J54o1j11j40N1K18n5j9J73j31k58J22J25j47kJ42j20j7M9Q6
7587E7k40M11j71j76J79j24J11j49J43O3J4j92K17k24m2J01J5k8J16j14Q2M1j9
7610G1m0N6K7j62J31p8J55k57m2J14L2l6P9j83O2L10k39k1K0qN0k5m3q5J10QJ31
7637A37k35J20op5Pj47J67r4K15j9j0Q5m5j75J58j56q5K35r0j38K06j25K3p0P0
7662d7K8l2J3J6N4N0j05j21K01p4O8k19K00R6j46P6j37K06p6q6o4K17J3k15J53
7687F9j06J25j3j2j92P9J37j15J45k0j75J82J2j51N2J2q5P5k71L73M1k51R7q7
$$ plain form
7711 -79 -69 -81 -89 29 -8 40 28 -42 -56 -23 4 3 -58 12 -42 -178 -37 -186 -63 -224 -76 -80 84 -100 -103 -110 62 4
7739 4 -126 53 -156 48 45 -39 -96 -24 -77 -40 52 -90 44 -58 71 146 94 -19 -89 -100 91 -86 8 62 -71
7764 -71 -128 -11 99 -15 -88 16 -214 -3 -55 -48 -13 9 -59 196 8 0 -197 -16 -96 -146 99 250 -129 -53 -160
7789 -160 238 40 194 -55 58 124 -87 64 -72 93 -216 5 -119 -20 -88 31 -31 -46 -54 -10 -124 -147 96
7812 96 9 24 11 62 31 -70 64 -34 -53 110 -87 89 3 134 110 74 136 -41 113 64 -37 -41 38 118 -114 106
7838 106 17 35 10 -152 60 28 -3 -48 -159 -124 2 -58 -135 44 -17 -56 125 56 46 -46 -55 45 20 -98 2 81
7864 81 41 40 -125 -143 44 -46 31 73 -69 182 11 26 226 -141 -68 88 -39 -121 -23 14 -28 -14 54 143 170 14
7890 14 9 -134 111 29 3 -73 -124 280 -46 131 98 -9 48 101 33 18 -14 -125 -162 64 114 92 -87 162 77 134
$$ packed form
7711g9J0j2qJ18l7M8j2p0j4L3K7jo1P0n4j36J41j49J23j61J48mJ64j84lpJ72n8
7739Dj30J79k09K04lq4n7P2n3L7R2j42J34j02J29P5n2j13p0j1J91j77R4N4j33
7764g1n7J17J10j14p3J04k30K11n2PL5K2o8K55j88qj97J81q0n0K45J51l79P6j07
7789a60L98j98J54k49J13O6k11J51j36J65l09K21j24R9o8J19o2j5qM4j14k3K43
7812I6q7J5j3N1l1j01J34r8j9J63j97J76q6J31k4l6O2j77J54m9j01mP9Q0k32K20
7838A06q9J8k5j62K12l2l1m5j11L5J26o0p7J79o1l9J81o9j0r2rJ00k5j18J00P9
7864H1m0jj65j8J87r0P7M2j42K51j71J5K00l67P3J56j27q2R8L7m2J4O8Q9K7j56
7890A4nj43K45q2k6p6n1M04l26J77l3j07N7N3o8j5l2j11l7K26N0k2j79K49q5N7
$$ plain form
7916 134 -111 64 64 12 184 55 59 -42 0 -97 103 -216 -50 -200 206 144 103 21 -58 -189 -282 -16 396 118
7940 118 102 241 -135 327 570 -389 -341 -652 -765 -400 396 -249 -221 31 90 86 -96 -170 36 195 -210 64
7962 64 133 -74 -192 254 -72 258 77 170 621 -197 -182 427 101 -63 205 -100 -194 333 -130 26 123 -15
7984 -15 17 -331 -17 -77 301 85 -290 -890 -263 29 124 101 0 100 -190 4 264 -71 205 64 -140 -37
8006 -37 27 127 203 -42 96 -21 -23 156 -101 109 77 -44 -35 -71 -84 5 169 -116 -17 75 -82 -17 -121 -4 106
8031 106 -21 168 150 37 39 -20 16 -37 -22 44 -68 -91 -61 13 68 -63 -156 75 -130 -64 -37 5 -34 -2 -88 -124 93
8058 93 -27 -107 30 56 -115 -182 -72 -43 -175 48 99 119 -52 142 93 -37 -101 -52 6 -81 -55 60 -63 -25 31
8083 31 -31 -34 -164 201 -61 41 175 12 -40 73 -195 -4 -41 108 30 91 42 -10 -9 -14 -36 3 35 155 -147 -90
$$ packed form
7916A34k45J75%n2J72j29Mj01M2r7K00l19J66j50M06o2m1q2p9j31r3K66M12k78
7940A18j6J39l76M62K43r59M8l11j13L65P96o45K8K52N9mj82p4K06J59m05K74
7962F4O9k07j18M46l26L30j81R3M51q18J5O09l26j64K68l05r4N27m63J56R7j38
7984a5L2l48L14o0L78k16l75o00O27K92R5k3j01J00k90J94K60l35K76j41k04J03
8006c7O4J00P6k45J38j17kJ79k57K10l2j21Rl6j3Q9J64k85R9R2j57O5j04J17J10
8031A06j27J89j8j13Kn9L6n3J5O6j12k3L0P4N5j31r3K31k05O6K7M2l9L2q6l6K17
8058I3j20q0J37K6j71o7J10K9j32K23N1K0j71J94m9j30o4M9N8q7K6J15j23L8N6
8083C1o2lj30L65k62J02J34j63n2J13k68J91l7J49p8O1m9n2Jnk2L9L2J20l02N7
$$ plain form
8109 -90 -65 -197 -66 10 -61 0 -34 -28 -7 85 19 -105 18 -58 82 8 88 92 66 -97 75 188 -28 245 83 -7
8135 -7 135 -4 -34 70 62 -27 58 -111 -50 69 31 58 83 -37 43 47 19 -76 -79 -277 16 -169 -109 -37 29 86 149 53
8163 53 49 42 -17 -60 -1 -10 113 210 66 124 220 22 -48 -70 3 -46 -88 132 41 -75 -14 -27 -34 -51 51 -169 -81 73
$$ packed form
8109i0K5j32J31P6p1O1l4OK1R2o6j24J23p6J40p4Q0Mk6j63J72J13k16K73j62r0
8135gJ42j39l0J04qq9Q5j69O1J19l8K7K5j20Q0Mk8r5lj98K93j85O0P2O6N7O3r6
8163E3mpn9m3N9rJ23R7j44N8R6j98p0k2P3m9m2K20r1j16O1j3pj7J02k20Q8J54
8191G3
$$ Imaginary data points
##PAGE= N=2
##DATA TABLE= (X++(I..I)), XYDATA
$$ plain form
0 0 0 0 0 0 0 0 0 0 0 0 0 8 -8 8 -8 16 -16 17 -24 29 -32 40 -48 56 -64 80 -88 104 -120 136 -157 177 -202
33 -202 230 -258 290 -328 367 -410 458 -508 566 -627 694 -769 848 -936 1032 -1138 1250 -1379
51 -1379 1519 -1675 1847 -2041 2264 -2513 2801 -3133 3529 -4005 4589 -5329 6300 -7633 9585
66 9585 -12739 18672 -33784 159137 247932 -28480 15628 54981 -313 -92121 -134762 -172752
78 -172752 -100760 -86286 -171335 -153329 3831 29206 -23275 3873 73579 119599 160102 104648
90 104648 28741 77276 129080 25102 -45313 5062 6178 -74610 -116267 -123615 -95022 -31663
102 -31663 -41467 -105983 -50585 71513 85797 44763 47114 61835 85757 91073 20530 -21516
114 -21516 45598 49920 -70035 -109870 -33068 -3107 -33545 -58617 -69648 -26198 43231 19621
$$ packed form
0@%%%%%%%%%%%Qj6J6j6K4l2L3m1N3o1P2q8J04j20J44j68J92k24K56k93L34l79
33b02M32m88N48o18O95p77Q68r66J074j193J321j463J617j784J968k170K388k629
51a379K898l194L522l888M305m777N314n934O662p534Q594r918J1629j3933J7218
66I585k2324L1411n2456J92921Q8795k76412M4108L9353n5294r1808m2641l7990
78a72752P1992J4474q5049J8006J57160K5375n2481K7148O9706M6020M0503n5454
90A04648p5907M8535N1804j03978p0415N0375J116q0788m1657p348K8593O3359
102c1663r804o4516N5398J22098J4284m1034K351J4721K3922N316p0543m2046
114b1516O7114M322j19955l9835P6802K9961l0438k5072j1031M3450O9429k3610
$$ plain form
126 19621 -37879 10970 75508 43004 9144 31169 52465 55958 21737 -55719 -62143 19133
138 19133 15495 -76678 -81721 -13828 3608 -12082 -17303 -8049 38055 69064 15124 -18789 48600
151 48600 83221 12470 -43245 -27497 5458 20238 -13362 -64668 -39618 21165 -10635 -67799
163 -67799 -27700 33250 21730 -9387 -10264 21501 70768 65832 -9921 -24362 40890 48482 -14470
176 -14470 -38429 -20142 -12124 -18163 -47887 -61937 -6749 37110 -10211 -46698 7709 55286
188 55286 37246 6227 -6680 9940 47398 34203 -19329 -10379 35869 13836 -42599 -39313
200 -39313 -5074 5832 -11814 -50315 -50673 10505 37897 -11432 -28469 21726 48387 24615
212 24615 3351 5684 26136 34750 -8645 -47563 -9144 37218 4671 -43178 -31472 3342
$$ packed form
126A9621n7500M8849O4538l2504l3860K2025K1296L493l4221p7456o424Q1276
138A9133l638r2173n043O7893J7436j5690n221R254M6104L1009n3940l3913O7389
151D8600L4621p0751n5715J5748L2955J4780l3600n1306K5050O0783l1800n7164
163f7799M0099O0950j1520l1117q77L1765M9267m936p5753j4441O5252P592o2952
176a4470k3959J8287Q018o039k9724j4050N5188M3859m7321l6487N4407M7577
188E5286j8040l1019j2907J6620L7458j3195n3532Q950M6248k2033n6435L286
200c9313L4239J0906j7646l8501l58O1178K7392m9329j7037N0195K6661k3772
212B4615k1264K333K0452Q614m3395l8918L8419M6362l2547m7849J1706L4814
$$ plain form
224 3342 15316 -2044 -30526 -21302 22537 17854 -26041 -16081 33020 36797 1661 -16145 288
237 288 32406 34473 -13459 -40292 -2939 20672 -11764 -33186 -9356 13881 10197 -11986 -21519
250 -21519 7749 36438 5454 -38238 -18988 25290 22976 -7444 -17600 843 24041 17281
262 17281 -14254 -13414 21363 20050 -21988 -32901 -902 21421 7588 -20913 -24257 9811 30909
275 30909 2746 -22548 -3213 17927 1620 -19667 -11783 13398 23179 441 -22823 -2354
287 -2354 32649 22632 -16376 -24112 -526 12509 -2905 -21214 -13184 12614 13175 -13978 -16357
300 -16357 15286 27888 1935 -22346 -12340 14631 20005 -3739 -20252 -1421 19550 6761
312 6761 -13426 -5023 14667 9740 -15733 -25132 -1725 20148 8007 -20662 -16361 14483 25746
$$ packed form
224C342J1974j7360k8482R224M3839m683m3895R960M9101L777l5136j7806J6433
237B88L2118K067m7932k6833L7353K3611l2436k1422K3830K3237l684k2183r533
250b1519K9268K8689l0984m3692J9250M4278k314l0420j0156J8443K3198o760
262A7281l1535Q40L4777j313m2038j0913L1999K2323j3833k8501l344L4068K1098
275C0909k8163k5294J9335K1140j6307k1287P884K5181R781k2738k3264K0469
287b354L5003j0017l9008p736K3586J3035j5414j8309Q030K5798N61k7153k379
300a6357L1643J2602k5953k4281J0006K6971N374k3744j6513J8831K0971j2789
312F761k0187Q403J9690m927k5473r399K3407K1873j2141k8669M301L0844J1263
$$ plain form
325 25746 5039 -10912 -943 12616 4160 -16103 -14062 6918 13505 -8011 -21995 -3033 21766
338 21766 16353 -9230 -15793 3393 15364 2646 -11719 -4322 10523 6092 -10769 -10227 10396
351 10396 17625 -2746 -21640 -11604 9288 10260 -8042 -15844 -1418 14859 7409 -5206 2146
364 2146 17595 12934 -7286 -14030 1379 14833 1812 -20936 -19934 3430 12265 -1942 -11675
377 -11675 -2825 7282 4230 -6657 -5794 8429 13239 -2204 -11795 4461 20050 13267 -5088
390 -5088 -10729 -569 7921 -2010 -15937 -9721 2763 -3416 -15304 -7697 9259 13225 2167 -8252
404 -8252 -2098 15824 17524 -1786 -10597 1217 9460 2499 -4412 -887 6182 4100 -10483 -17052
418 -17052 -2665 7971 -4856 -18343 -10496 4991 10512 6152 141 2725 12214 10511 -367
$$ packed form
325B5746k0707j5951R969J3559q456k0263K041K0980O587k1516j3984J8962K4799
338B1766n413k5583o563J9186J1971j2718j4365P397J4845m431j6861N42K0623
351A0396P229k0371j8894J0036K0892R72j8302p802J4426J6277p450j2615P352
364B146J5449m661k0220o744J5409J3454j3021k2748J002K3364Q835j4207r733
377a1675Q850J0107l052j0887Q63J4223M810j5443r591J6256J5589o783j8355
390e088n641J0160Q490r931j3927O216J2484o179j1888P607J6956L966j1058j0419
404h252O154J7922J700j9310q811J1814Q243o961o911L525P069k082j4583o569
418a7052J4387J0636j2827j3487P847J5487N521m360o011K584R489j703j0878
$$ plain form
431 -367 517 9486 5461 -8090 -12683 -4234 5883 4251 -9116 -13776 -930 5966 -3334 -8494 -1618
446 -1618 2464 181 -1415 1556 11106 16579 5810 -7169 -630 11024 6955 -5848 -11709 -8327
460 -8327 -1981 -1898 -7976 -5415 4701 3846 -5475 -3006 7616 9161 1931 -5357 -6062 3671 11515 4331
476 4331 -3886 527 4835 -1367 -5565 -2659 259 -1045 -6880 -10503 -1233 10317 5941 -4726 -2669
491 -2669 5769 7217 3626 -175 -1705 -82 -1939 -8162 -5730 4822 5589 -3612 -6460 -69 6118
506 6118 6156 -429 -6337 -2403 3920 2591 264 3187 3837 -211 -2558 -1784 834 2814 -1595 -8898
522 -8898 -7526 -140 1966 -515 -368 1211 2535 3783 3452 4020 6286 3192 -5106 -6086 1369 4961
538 4961 877 -4847 -6457 -2535 2525 661 -4192 -3398 -283 -1752 -2797 648 4267 4805 2335 -302
$$ packed form
431c67Q84Q969m025j3551m593Q449J0117j632j3367m660J2846O896r300n160O876
446a618M082k283j596K971R550N473j0769j2979O539J1654m069j2803n861L382
460h327O346Q3o078K561J0116q55r321K469J0622J545p230p288p05R733P844p184
476D331q217M413M308o202m198K906K918j304n835l623R270J1550m376j0667K057
491b669Q438J448l591l801j530J623j857o223K432J0552P67r201k848O391O187
506F118L8o585n908L934O323j329k327K923O50m048k347P74K618J980m409p303
522h898J372P386K106k481J47J579J324J248l31N68K266l094q298r80P455L592
538D961m084n724j610L922N060j864m853P94L115j469j045L445L619N38k470k637
$$ plain form
554 -302 1597 7596 8063 1113 -3785 -3277 -2519 -3052 -2636 -2417 -2294 -2689 -4090 -1971 3094 4337 -584
571 -584 -4025 -1350 3352 5272 3165 258 732 3113 2100 117 2237 3157 -1089 -6522 -6354 -2758
587 -2758 -240 -1870 -4783 -3903 621 3910 4278 3757 2486 164 -814 250 1689 2263 1154 -1605
603 -1605 -2651 2 2417 1613 -1893 -3506 -3459 -2097 -920 -640 -762 -94 81 433 2230 5108 5739
620 5739 2295 -1832 -2382 -664 563 -910 -3379 -3742 -2323 -425 1347 2660 1971 -968 -2398 -652
636 -652 1968 2268 924 -904 -1132 1482 3385 2602 1155 -91 -1952 -2961 -2630 -2151 -1743 -1752 -2561 -2593
654 -2593 687 4245 4646 3048 1007 -490 623 2476 1339 -769 -1189 -1717 -2335 -163 2009 310
670 310 -2399 -3049 -2534 -1259 197 -556 -1778 -815 706 1595 4141 5768 3642 1292 738 -106 -334
$$ packed form
554c02J899N999M67o950m898N08P58n33M16K19J23l95j401K119N065J243m921
571e84l441K675M702J920k107k907M74K381j013j983K120R20m246n433J68L596
587b758K518j630k913Q80M524L289L68n21j271k322r78J064J439N74j109k759
603a605j046K653K415q04l506j613M7J362J177K80j22O68J75L52J797K878O31
620E739l444m127n50J718J227j473k469l63J419J898J772J313o89k939j430J746
636f52K620L00j344j828k28K614J903p83j447j246j861j009L31M79M08rq09l2
654b593L280L558M01j598k041j497J113J853j137k108m20n28o18K172K172j699
670C10k709o50N15J275J456p53j222R63J521Q89K546J627k126k350n54q44k28
$$ plain form
687 -334 357 -1404 -4383 -3940 -1980 -1429 40 680 -1326 -2779 -866 565 1091 2153 1181 -229 994
704 994 2980 3265 3414 2619 -461 -1909 -515 -646 -2110 -2350 -3764 -5109 -3230 55 848 1182 1433
721 1433 105 965 3034 3259 1716 1144 -514 -1011 928 2074 747 -532 -1256 -2766 -2370 -748 -1074
738 -1074 -2425 -2452 -2068 -1475 1182 3329 2334 1364 1608 1101 1861 3086 1558 -1359 -2007 -1932 -1658 -116
756 -116 665 -1238 -1987 -927 -63 713 1477 121 -1565 -1221 282 949 1778 1905 266 -307 503 650
774 650 750 661 -1279 -2954 -2214 -498 470 1020 957 -458 -70 1536 1941 1355 247 -1442 -2351 -1079
792 -1079 260 182 95 -434 -1143 -287 1416 1402 775 108 -1098 -1497 -163 1515 1279 481 -174 -378 830
811 830 2268 915 -1275 -2443 -2757 -2381 -745 124 -417 -268 373 708 1736 2506 1522 284 -42 -382
$$ packed form
687c34O91j761k979M43J960N51J469O40k006j453J913J431N26J062r72j410J223
704I94J986K85J49p95l080j448J394j31j464k40j414j345J879L285P93L34K51
721A433j328Q60K069K25j543n72j658m97J939J146j327j279p24j510L96J622l26
738a074j351k7L84N93K657K147r95r70K44n07P60J225j528k917o48P5K74J542
756a16P81j903p49J060Q64P76P64j356j686L44J503O67Q29J27j639n73Q10J47
774F50J00q9j940j675P40J716R68N50o3j415L88J606M05n86j108j689r09J272
792a079J339p8q7n29p09Q56J703j4o27o67j206l99J334J678k36p98o55k04J208
811H30J438j353k190j168l14L76J636Q69n41J49O41L35J028P70r84j238l26l40
$$ plain form
829 -382 -240 944 1333 169 -1034 -1517 -779 595 884 -902 -2940 -3067 -1563 -168 726 355 -40 772
847 772 2411 3211 2977 2168 438 -675 -922 -551 -312 -230 -1110 -1990 -2002 -1083 -226 65 -787 -1786 -1767 -563
867 -563 1038 1752 1734 1121 1000 2104 3173 3028 1524 -573 -1612 -2017 -1444 -1128 -1398 -1783 -2112 -1739 -834
886 -834 614 1201 613 -442 -240 984 2059 2275 1437 237 111 1146 1510 1099 329 -985 -2348 -2601
904 -2601 -1761 -1201 -1125 -1681 -1659 -616 1215 1968 1561 1172 760 26 410 1355 1559 726 -471 -1157 -680 784
924 784 601 -657 -1307 -1528 -1302 -499 -36 -365 -558 -582 -694 541 2247 2348 757 114 203 -36 539 578
944 578 -876 -1624 -787 -243 -29 990 561 -610 -775 -541 -318 638 724 -863 -1321 -128 421 760 1300
963 1300 659 -369 -267 297 213 429 417 -1176 -1614 115 1199 1253 796 -115 -950 130 592 -412 -665
$$ packed form
829c82J42J184L89j164j203m83P38J374K89j786k038j27J504J395Q94l71l95Q12
847G72J639Q00k34q09j730j113k47L71K39Q2q80q80j2R19Q57K91q52r99J9J204
867e63J601P14j8o13j21J104J069j45j504k097j039m05N73L16k70l85l29L73R05
886h34J448N87n88j055K02J224J075K16q38j200j26J035L64m11p70j314j363k53
904b601Q40N60P6n56K2J043J831P53m07l89m12p34L84R45K04q33j197o86M77J464
924G84j83j258o50k21K26Q03M63l29j93k4j12J235J706J01j591o43Q9k39N75L9
944E78j454p48Q37N44K14J019m29j171j65K34K23R56Q6j587m58J193N49L39N40
963A300o41j028J02N64q4K16j2j593m38J729J084N4m57r11q35J080M62j004k53
$$ plain form
982 -665 -515 -1466 -1626 -369 390 506 697 -267 -575 911 1627 569 -443 5 -297 69 1038 1085 739
1001 739 561 -675 -1515 -210 576 -1061 -1951 -1366 -1260 -334 895 743 104 891 1041 725 1677 2271 453
1020 453 -507 -505 -531 111 912 -243 -1503 -751 -383 -958 -746 -513 -1516 -1584 -371 210 919 2309 1455 260
1040 260 1123 1675 1011 844 249 -1149 -1188 -219 -746 -1040 110 -668 -1855 -854 94 -61 126 -244 -1274
1059 -1274 -337 1685 1336 714 1374 988 242 805 1166 -63 -344 -902 -2155 -1567 255 -493 -1267 -363
1077 -363 -394 -531 617 863 -103 322 659 -356 222 2004 1498 239 156 -98 -278 788 329 -1359 -1486
1096 -1486 -486 -1051 -713 402 -196 -725 -151 270 415 1362 1144 -492 -317 660 354 203 461 -82 -557
1115 -557 -65 132 -296 324 55 -1221 -1278 -42 205 158 338 -206 -364 791 955 341 323 524 -894 -676
$$ packed form
982f65J50r51j60J257P59J16J91r64l08J486P16j058j012M48l02L66R69M7l46
1001G39j78j236q40J305P86j637q90N85J06R26J229j52o39P87J50l16R52N94j818
1020D53r60Kk6O42Q01j155j260P52L68n75K12K33j003o8J213N81P09J390q54j195
1040B60Q63N52o64j67n95j398l9R69n27k94J150p78j187J001R48j55J87l70j030
1059a274R37K022l49o22O60l86p46N63L61j229k81n58j253N88J822p48p74R04
1077c63l1j37J148K46r66M25L37j015N78J782n06j259q3k54j80J066m59j688j27
1096a486J000n65L38J115n98n29N74M21J45R47k18j636J75R77l06j51K58n43m75
1115e57M92J97m28O20k69j276n7J236K47m7J80n44j58J155J64o14j8K01j418K18
$$ plain form
1135 -676 171 167 102 70 -906 -742 514 1029 209 35 -9 -440 -13 502 91 -373 -172 -740 -687 687 922
1156 922 -197 -427 -305 -487 163 459 -57 -367 379 371 323 1225 1115 72 -315 -468 -680 -43 164 -878
1176 -878 -1383 -460 -244 -143 387 517 -97 24 376 209 724 1152 -96 -435 425 598 478 679 -70 -1089
1196 -1089 -563 -176 -745 -961 -481 -953 -850 121 481 591 900 559 -191 466 845 323 221 253 -265 -443
1216 -443 400 411 -288 81 -1054 -1515 -822 415 -478 -667 -560 -136 144 1657 861 220 623 369 -122
1235 -122 589 952 158 -184 -864 -908 -182 238 -340 -846 -870 -349 -406 7 665 166 142 427 645 978 1248
1256 1248 791 -298 -46 -180 -475 -266 -206 -943 -927 -360 -290 -25 264 58 -572 45 471 608 721 488
1276 488 -230 -112 443 392 230 227 -302 -658 -425 -82 -336 -541 -463 -640 -411 337 622 321 211 193 98 205
$$ packed form
1135f76Q47mo5l2r76J64J256N15q20j74m4m31M27N15m11m64K01n68N3J374K35
1156I22j119k30J22j82O50K96n16l10P46qm8R02j10j043l87j53k12O37K07j042
1176h78n05R23K16J01N30J30o14J21L52j67N15M28j248l39Q60J73j20K01p49j019
1196a089N26L87n69k16M80m72J03R71L60J10L09l41p50O57L79n22j02L2n18j78
1216d43Q43J1o99L69j135m61O93J237q93j89J07M24K80J513p96o41M03k54m91
1235a22P11L63p94l42o80m4P26M20n78n06k4N21n7M13O58m99k4K85K18L33K70
1256A248m57j089K52j34k95K09O0p37J6N67P0K65K89k06o30O17M26J37J13k33
1276D88p18J18N55n1j62ln29l56K33L43k54k05P8j77K29P48K85l01j10j8r5J07
$$ plain form
1298 205 567 338 182 -300 -386 -267 315 60 -37 -396 -436 -349 66 304 42 -149 -95 2 434 577 328 75
1320 75 -21 196 149 363 119 -237 -606 -459 -228 -194 103 -17 -336 -49 153 540 406 187 -118 -52 -64 11
1342 11 214 558 113 -585 -350 -128 -414 -48 19 -523 126 376 -198 209 535 235 -294 -8 596 197 646
1363 646 -127 -465 -230 -117 -75 -340 -675 -171 -320 -91 227 207 45 -139 -47 67 478 466 241 -116 20
1384 20 130 174 35 -44 -476 -521 -546 -394 184 4 -301 -9 88 264 537 513 381 -279 -69 116 375 238
1406 238 -180 -443 -316 -47 61 41 -234 -402 -320 -172 -99 -48 167 203 101 134 610 712 449 98 -84 -330
1428 -330 -264 -68 -184 -233 -412 -192 -57 -1 71 -20 -231 -308 -253 197 439 583 255 -131 76 230 403 82
1450 82 -65 0 -332 -366 -193 -222 -150 -312 -252 273 -97 328 284 -20 213 241 161 301 162 35 173 177 40 -348
$$ packed form
1298B05L62k29j56m82q6J19N82k55r7l59m0Q7M15K38k62j91N4R7M32J43k49k53
1320G5r6K17m7K14k44l56l69J47K31L4K97j20l19K87K02L87j34k19l05O6j2P5
1342A1K03L44m45o98K35K22k86L66O7n42O49K50n74M07L26l00n29K86O04l99M49
1363F46p73l38K35J13M2k65l35N04j49K29L18k0j62j84R2J14M11j2k25l57J36
1384B0J10M4j39p9m32m5k5J52N78j80l05K92R7J76K73k4j32o60K10J85K59j37
1406B38m18k63J27K69J08k0k75j68Q2J48P3N1K15L6j02L3M76J02k63l51j82k46
1428c30O6J96j16m9j79K20J35N6P2r1k11p7N5M50K42J44l28l86K07J54J73l21
1450H2j47O5l32l4J73k9P2j62O0N25l70M25m4l04K33K8q0J40j39j27J38Mj37l88
$$ plain form
1474 -348 482 -29 -414 -408 -137 -44 -72 -384 183 211 266 319 158 377 143 -589 -195 605 -31 -119 -230 -288 -235
1497 -235 -383 122 90 -64 -69 -324 -150 716 90 106 441 -233 490 -138 44 -551 77 16 -111 -540 -495 -193
1519 -193 -414 -532 -709 43 337 350 173 301 -352 297 376 -179 400 -299 218 -335 -383 429 147 -668 -529
1540 -529 -373 -175 97 0 219 -419 545 527 -68 -108 617 48 -182 -73 -456 67 -193 -438 -731 -186 23
1561 23 -314 -466 71 -94 -2 -183 145 289 -529 -533 -366 566 -13 609 83 -72 -47 -78 -230 -644 -943 -97
1583 -97 -52 -332 -137 422 90 -418 -41 -31 606 364 -194 -268 -9 202 72 -1 -179 -12 10 -170 -307 150
1605 150 141 -97 -480 -255 260 194 222 -127 -94 362 274 -41 -104 112 -160 -349 -409 -34 185 -50 -376 -373 196
1628 196 495 221 -299 -26 263 96 -56 -50 166 354 -82 -155 -82 251 45 -419 -495 -217 228 29 -315 -162
$$ packed form
1474c48Q30n11l85OK71R3k8l12N67K8N5N3j61K19k34p32L94Q00o36q8j11n8N3
1497b35j48N05l2j54nk55J74Q66o26J6L35o74P23o28J82n95O28o1j27m29M5L02
1519a93k21j18j77P52K94J3j77J28o53O49P9n55N79o99N17n53m8Q12k82q15J39
1540e29J56J98K72r7K19o38R64j8n95m0P25n69k30J09l83N23k60k45k93N45K09
1561B3l37j52N37j65R2j81L28J44q18mJ67R32n79O22n26j55K5l1j52m14k99Q46
1583i7M5k80J95N59l32n08L77J0O37k42n58p4K59K11j30p3j78J67K2j80j37M57
1605A50rk38l83K25N15o6K8l49L3M56q8l15o3K16k72j89o0L75K19k35l26LN69
1628A96K99k74n20K73K89j67j52OK16J88m36p3P3L33k06m64p6K78M45j99l44J53
$$ plain form
1650 -162 312 294 -193 -119 361 456 152 -491 -226 290 461 -291 -598 -99 180 -107 -346 -150 233 50 -142
1671 -142 -337 98 536 194 -110 29 357 461 53 -313 -86 144 66 -655 -191 176 292 -255 -434 -59
1691 -59 431 348 -324 -225 332 475 109 -245 309 410 309 -127 -366 -1 475 -182 -699 -225 181 259 -320
1712 -320 -550 -62 452 125 -294 13 607 421 -268 -398 208 451 53 -473 -401 76 495 -165 -393 -166
1732 -166 183 25 -451 -303 249 486 -150 -463 54 758 301 -359 -326 131 405 -62 -401 -285 220 263 -209
1753 -209 -283 156 454 -248 -493 -100 453 306 -342 -536 104 469 35 -432 -66 345 70 -317 -592 142
1773 142 305 3 -581 -380 464 526 -55 -209 162 501 206 -458 -182 418 408 -260 -583 -20 569 321 -674
1794 -674 -483 135 461 -275 -344 63 451 162 -202 -332 493 421 45 -398 -85 493 -194 -658 -547 -76 -217
$$ packed form
1650a62M74j8m87P4M80R5l04o43K65N16J71p52l07M99K79k87k39J96L83j83j92
1671a42j95M35M38l42l04J39L28J04m08l66K27K30p8p21M64L67J16n47j79L75
1691e9M90q3o72R9N57J43l66l54N54J01j01m36k39L65M76o57n17M74M06P8n79
1712c20k30M88N14l27m19L07N94j86o89j30O06K43l98n26P2M77M19o60k28K27
1732a66L49j58m76J48N52K37o36l13N17P04m57o60L3M57K74m67l39J16N05M3m72
1753b09p4M39K98p02k45L93N53j47o48j94O40L65m34m67L66M11k75l87k75P34
1773A42J63l02n84K01Q44O2n81j54L71L39k95o64K76O00j0o68l23N63N89k48r95
1794f74J91O18L26p36o9M07L88k89l64j30Q25p2l76m43L13N78o87m64J11M71j41
$$ plain form
1815 -217 -548 -389 -391 347 747 86 -610 447 958 253 -57 -364 222 856 -196 -295 -318 401 70 -587 -208
1836 -208 -97 132 -97 -246 -405 733 140 -185 -451 483 878 94 41 -270 306 -120 -379 -632 118 213
1856 213 29 -1184 -47 368 76 -317 -540 -242 500 -243 -382 -202 510 171 -510 -117 -156 325 444 -570
1876 -570 -760 243 232 -106 -487 145 282 177 -227 -200 496 763 -30 -389 43 801 63 -674 -205 284
1896 284 421 -5 -597 -81 442 -7 -464 -369 101 360 80 -336 -24 813 414 -412 -665 310 299 359 -242
1917 -242 -161 484 248 -894 -651 -152 370 -55 -451 -398 365 389 -146 -281 152 568 55 -370 -239 324 131
1938 131 -235 -537 54 343 117 -350 -273 349 496 -178 -392 79 302 222 -361 -423 335 401 -220 -695 -173
1959 -173 533 117 -252 -474 118 398 -55 -432 -129 515 321 -200 -281 257 679 75 -302 -84 227 480
$$ packed form
1815b17l31J59kP38M00o61o96J057N11p05l10l07N86O34j052r9k3P19l31o57L79
1836b08J11K29k29j49j59J138n93l25k66R34L95p84n3l11N76m26k59k53P50R5
1856B13j84j213J137M15k92l93k23K98P42p43j39J80P12l39o81L93l9M81J19j014
1876e70j90J003j1l38l81O32J37j05m04K7O96K67p93l59M32P58p38p37M69M89
1896B84J37m26n92N16N23m49m57R5M70K59k80m16L12Q37l99q26k53R75j1O0o01
1917b42Q1O45k36j142K43M99N22m25l96N3P63K4n35j35M33M16n13m25J31N63j93
1938A31l66l02N91K89k26m67P7O22J47o74k14M71K23q0n83o2P58O6o21m75N22
1959a73P06m16l69k22N92K80m53l77L03O44j94n21q1N38M22o04l77K18L11K53
$$ plain form
1979 480 -385 -511 70 381 353 -318 -111 363 352 -241 -487 -121 409 180 -302 -283 286 377 -55 -400 -32
2000 -32 204 128 -356 -297 276 391 -128 -467 -34 406 349 -171 -258 63 320 -12 -358 -26 342 149 -416 -641
2022 -641 86 417 16 -388 -197 220 269 -208 -56 191 435 79 -178 16 103 0 -31 -318 6 74 192
2043 192 -208 -219 8 133 -247 -377 364 448 67 -237 -70 47 395 -379 62 351 584 366 -1015 -620
2063 -620 -37 611 -217 -868 -270 197 -400 -507 -415 65 655 138 -138 -231 540 598 -128 -184 6 283 151
2084 151 -363 165 15 153 -246 -303 67 318 -17 -304 -279 122 370 -150 -325 0 259 324 -220 -138 36
2105 36 269 -157 -246 -36 298 56 -176 -342 157 167 -182 -242 150 247 308 -143 -113 113 196 71 -239 -155 153
2128 153 66 -85 -285 -1 107 56 -151 -339 232 -75 -196 -199 4 259 203 -333 -115 110 190 18 -362 -7
$$ packed form
1979D80q65j26N81L11k8o71K07M74j1n93k46L66N30k29m82J9N69R1m32l45L68
2000c2K36p6m84N9N73J15n19l39M33M40n7n20q7L21K57l32l46L32L68j93n65k25
2022f41P27L31m01m04J91M17M9m77J52K47K44l56k57J94Q7j03l1k87L24O8J18
2043A92m00j1K27J25l80j30P41Q4l81l04J67J17L48p74M41K89K33k18j381L95
2063f20N83O48q28o51N98M67n97j07R2M80N90n17k76r3P71N8p26n6J90K77j32
2084A51n14N28j50J38l99n7L70K51l35k87K5M01K48n20j75L25K59O5n44Q2J74
2105C6K33m26q9K10L34k42k32j66M99J0l49o0L92R7O1m51L0K26Q3j25l10Q4L08
2128A53q7j51k00K84J08n1k07j88N71l07j21lK03K55n6n36K18K25Q0j72l80L55
$$ plain form
2150 -7 238 -3 -162 -304 267 143 -111 -223 3 298 10 -243 -233 174 143 50 -141 -22 242 56 -208 -37
2172 -37 -41 120 -62 -315 -71 140 263 -129 -195 125 270 -52 -45 -11 121 170 -200 -104 -7 96 -111 -251 -38
2195 -38 103 39 -125 -104 -6 217 120 -24 -152 184 196 30 -78 97 141 8 -183 -137 52 95 -107 -297 92
2218 92 81 8 -80 -16 182 253 71 -38 116 212 62 -58 -228 62 193 -77 -280 115 184 -2 -133 -121 110
2241 110 173 53 11 -83 -1 152 62 -68 73 289 105 -157 17 117 72 -79 -115 87 76 -62 -230 -124 177
2264 177 187 -44 1 169 185 -67 -110 -167 173 -79 97 -24 -36 -105 13 -74 -14 100 131 -290 -71 494 799
2287 799 100 238 117 492 84 342 -277 -62 -151 -15 -82 138 61 561 -27 -730 454 971 456 32 533
2308 533 -240 640 289 207 -636 -205 190 73 -400 -55 220 107 -534 -32 -170 396 53 339 -71 276
$$ packed form
2150gK45k41j59j42N71j24k54j12K26K95k88k53J0M07l1r3j91J19K64j86k64J71
2172c7mJ61j82k53K44K11J23l92o6L20J45l22PL4J32M9l70R6R7J03k07j40K13
2195c8J41o4j64K1R8K23r7j44j28L36J2j66j08J75M4j33j91M6J89M3k02j90L89
2218I2j1p3q8O4J98P1j82j09J54R6j50j20j70K90J31k70k03L95O9j86j31J2K31
2241A10O3j20m2r4Q2J53r0j30J41K16j84k62J74J00m5j51l6K02j1j38j68J06L01
2264A77J0k31M5J68J6k52m3n7L40k52J76j21j2o9J18q7O0J14L1m21K19N65L05
2287G99o99J38j21L75m08K58o19K15q9J36o7K20p7N00n88p03J184N17n15m24N01
2308E33p73Q80l51q2q43M31L95j17m73L45K75j13o41N02j38N66l43K86m10L47
$$ plain form
2328 276 232 -38 -386 37 210 285 -105 118 10 32 112 -1 -64 -26 52 5 247 1 -131 135 -130 -60 -11
2351 -11 -89 -100 72 212 40 -105 108 -37 150 -1 -107 -53 60 92 15 -114 122 17 -145 98 6 -29 48
2374 48 -93 62 110 -101 42 -53 2 -156 11 95 0 36 -22 -11 -94 18 -47 -190 10 153 29 119 42 1 -26
2399 -26 188 75 83 0 87 21 -35 -23 -109 60 25 51 23 2 77 77 43 -20 -76 -109 1 52 180 -136 35 27 -79 -48
2427 -48 23 35 41 -65 186 -43 18 54 -157 161 7 79 28 47 -17 -1 104 30 -53 -27 -94 -87 -62 34 -78 38 35
2454 35 -150 90 31 -111 211 -163 -22 22 -64 -56 207 41 -153 97 -37 62 79 123 86 32 111 -63 11 196
2478 196 -150 -94 26 31 52 16 -49 152 19 -219 183 -175 -23 49 112 -66 -172 9 -86 -10 -82 148 202 63
2502 63 9 -60 145 24 -178 -18 -249 87 -16 -114 -93 226 -95 -53 77 49 -91 -60 -141 -54 -196 -11 46 -59
$$ packed form
2328B76m4k70l48M23J73P5l90K23j08K2Q0j13o3L8P8m7K42k46j32K66k65P0M9
2351a1p8j1J72J40j72j45K13j45J87j51j06N4J13L2p7j29K36j05j62K43r2l5P7
2374D8j41J55M8k11J43r5N5j58J67Q4r5L6n8J1q3J12o5j43K00J43j24R0p7m1k7
2399b6K14j13Qq3Q7o6n6J2q6J69l5K6k8k1P5%l4o3n6l3J10N1J28l16J71qj06L1
2427d8P1J2Oj06K51k29O1L6k11L18j54P2n1J9o4J6J05p4q3K6o7PK5R6j12J16l
2454C5j85K40n9j42L22l74J41M4q6QK63j66j94K50j34R9J7M4l7n4P9j74P4J85
2478A96l46N6J20NK1l6o5K01j33k38M02l58J52P2O3j78j06J81r5P6p2K30N4j39
2502F3n4o9K05j21k02J60k31L36j03r8K1L19l21M2J30k8j40L1q1Q7j42J85N7j05
$$ plain form
2526 -59 -29 -64 -195 -89 -7 207 -11 23 -60 -21 0 -20 58 -105 103 28 41 -27 52 -10 225 -43 -39 -78 66 -23
2552 -23 101 263 -29 -149 29 114 73 83 40 81 128 -44 -50 -117 -7 39 28 -103 73 34 -25 -196 124 2 73
2577 73 -18 -120 17 47 -38 41 -79 -158 56 -96 105 -76 23 95 167 -191 142 128 59 111 -53 44 8 -59 -154
2602 -154 149 12 -5 -53 -184 28 -83 -65 93 -107 3 -15 -80 60 -44 -46 -16 63 -2 -146 -124 44 -94 70
2626 70 -75 -88 65 -46 21 5 207 -127 -223 191 95 -6 -68 -8 -145 24 129 3 -52 84 107 -13 -78 47
2650 47 40 110 78 33 -22 21 21 -44 -115 -33 -22 62 -97 -136 -131 15 -25 -11 -14 4 139 28 104 -59 77 39 -55 -51 257
2679 257 -16 239 23 -57 -60 27 12 3 80 83 42 75 90 86 -107 -88 56 16 -103 -55 -122 88 -68 -27 -178 -31 239
2706 239 66 -209 -25 -104 -96 157 -7 -38 169 -142 113 79 -85 -116 -165 -81 -14 45 -152 -44 206 78 96 -131
$$ packed form
2526e9L0l5j31J06Q2K14k18L4q3L9K1k0P8j63K08p5J3o8P9o2K35k68Ml9J44q9
2552b3J24J62k92j20J78Q5m1J0m3M1M7j72oo7J10M6j1j31J76l9n9j71L20j22P1
2577G3r1j02J37L0q5P9j20p9K14j52K01j81R9P2P2l58L33j4o9N2j64R7l6o7r5
2602a54L03j37j7m8j31K12j11J8J58k00J10j8o5J40j04kL0P9o5j44K2J68j38J64
2626G0j45j3J53j11O7j6K02l34r6M14r6j01o2O0j37J69J05j26n5J36K3j20o5J25
2650D7pP0l2m5n5M3%o5p1Q2J1Q4j59l9NJ46m0J4lJ8J35j11P6j63J36l8r4ML08
2679B57k73K55k16q0lQ7j5rP7Lm1L3J5mj93J9J44m0j19M8o7K10j56M1j51J47K70
2706B39j73k75J84p9QK53j64l1K07l11K55l4j64l1m9Q4O7N9j97J08K50j28J8k27
$$ plain form
2730 -131 -36 -105 32 -63 63 -63 77 -124 34 32 -104 -10 -40 180 -39 -110 121 69 68 -48 -42 -28 -41 -26 93
2755 93 -17 -15 -121 -105 -142 23 44 112 77 -91 -104 -93 -192 -5 -170 14 50 149 22 142 -22 -6 43 92 -74
2780 -74 92 -107 -41 -161 -71 -131 58 -66 6 -110 18 130 -7 7 -19 -45 -109 107 -38 26 130 80 -206 55
2804 55 38 13 -28 117 45 -136 -20 -23 92 18 18 -54 -30 45 -154 58 -96 13 120 -48 26 133 78 -16 45 -127
2830 -127 -20 -59 -31 -57 154 -34 109 120 90 114 135 7 164 112 38 20 90 -122 68 27 -172 -105 49 -121
2854 -121 -5 72 -66 -121 -94 57 6 22 42 36 74 27 -86 -63 40 60 19 -192 -77 33 66 64 103 -226 -38 -63
2880 -63 74 16 -93 -81 230 -100 56 -343 41 81 78 158 99 -97 -161 198 143 -371 -289 346 -18 103 -49 58
2904 58 395 -342 -342 434 -261 41 -260 -241 -174 -220 102 17 36 -131 -89 -105 361 64 -27 219 -326 -221 -552 -116
$$ packed form
2730a31R5o9J37r5J26j26J40k01J58kj36R4l0K20k19p1K31n2jj16OJ4j3J5J19
2755I3j10Kj06J6l7J65K1O8l5j68j3J1r9J87j65J84L6R9j27J20j64J6M9M9j66
2780g4J66j99O6j20R0o0J89j24P2j16J28J12j37J4k6k6o4K16j45O4J04n0k86K61
2804E5j7k5m1J45p2j81J16lJ15p4%p2K4P5j99K12j54J09J07j68P4J07n5r4O1j72
2830a27J07l9K8k6K11j88J43J1l0K4K1j28J57n2p4j8P0k12J90m1j99O7J54j70
2854a21J16P7j38n5K7J51n1J6K0oL8m7j13K3J03K0m1k11J15J10L3kL9l29J88k5
2880f3J37n8j09J2L11l30J56l99L84M0lQ0n9j96o4L59n5n14Q2O35l64J21j52J07
2904E8L37p37%P76o95L02l01J9O7m6L22q5J9j67M2j6M66k97r1K46n45J05l31M36
$$ plain form
2928 -116 -259 -121 348 -56 107 177 115 2 -117 -145 43 -66 -411 -103 -41 -61 -210 -204 -82 365 588 353
2950 353 -226 -197 211 -96 -366 -237 -70 -92 15 -94 -174 602 255 61 -304 122 -149 304 479 -381 -18
2971 -18 59 83 -260 12 207 -41 -204 118 83 51 -366 -599 -348 98 -423 196 524 -339 68 246 -174 -440
2993 -440 235 56 -307 -334 645 -332 114 -122 -220 -17 -49 -52 -542 -110 455 77 163 -152 311 179 -131 -157
3015 -157 -58 128 291 36 180 -37 -46 -79 -440 10 428 -300 257 73 131 -220 -445 -63 245 -383 -286 -176
3037 -176 -328 300 -333 66 233 -155 -274 49 22 113 104 21 -234 280 -404 161 431 -308 -426 28 9 27
3059 27 -9 89 -36 98 21 -209 233 295 -12 71 357 -268 -174 275 357 -461 308 58 236 -189 -42 -52 -256
3082 -256 -387 16 43 49 -99 -300 261 87 219 -213 -107 -112 -34 -204 291 -291 62 162 -66 105 151 119 148
$$ packed form
2928a16j43J38M69m04J63P0o2j13j19k8J88j09l45L08O2k0j49OJ22M47K23k35
2950C53n79K9M08l07k70J29J67k2J07j09q0P76l47j94l65M26k71M53J75q60L63
2971a8P7K4l43K72J95k48j63L22l5l2m17k33K51M46n21O19L28q63M07J78m20k66
2993d40O75j79l63k7R79r77M46k36r8K03l2lm90M32N65l78Q6l15M63j32l10k6
3015a57R9J86J63k55J44k17rl3l61M50M18p28N57j84N8l51k25L82L08o28R7J10
3037a76j52O28o33L99J67l88j19L23k7R1rq3k55N14o84N65K70p39j18M54j9J8
3059B7l6R8j25J34p7k30M42O2l07Q3K86o25R4M49Q2q18P69k50J78m25J47j0k04
3082b56j31M03K7Oj48k01N61j74J32m32J06nP8j70M95n82L53J00k28J71M6l2K9
$$ plain form
3105 148 309 175 -32 156 67 -25 -199 -11 -9 34 -587 -851 -126 72 141 -180 333 -55 -188 -35 -174 93
3127 93 -338 265 -440 253 599 185 26 19 63 108 201 -372 -54 60 285 -602 215 81 -122 475 7 -31
3149 -31 -169 -80 -196 -74 -63 41 -109 -182 54 148 -255 -20 -38 131 82 -122 233 44 46 25 18 -33 127 -80
3173 -80 -11 -186 -86 -26 -107 -41 203 48 -113 107 -47 30 -96 21 -6 -334 195 -144 -111 -15 -30 54 7 30
3197 30 73 -31 -215 -25 -141 -87 44 -48 87 61 121 123 71 -6 94 -117 -41 94 60 7 92 -423 199 130 222
3222 222 -277 -68 268 236 166 137 88 -94 771 -278 576 -648 277 324 -439 -449 -344 30 -178 93 782
3243 782 121 -277 85 174 189 240 134 248 322 290 387 320 47 235 249 -89 108 353 251 57 71 -30 128
3266 128 145 217 -32 223 79 134 154 211 -212 -316 226 -152 -8 -352 80 247 -26 15 229 -229 205 -285
$$ packed form
3105A48J61j34k07J88q9r2j74J88KM3o21k64P25J98O9l21N13l88j33J53j39K67
3127I3m31O03p05O93L46m14j59pM4M5R3n73L18J14K25q87Q17j34k03N97m68l8
3149c1j38Q9j16J22J1J04j50p3K36R4m03K35j8J69m9k04L55j89Kk1pn1J60k07
3173h0O9j75J00O0q1O6K44j55j61K20j54P7j26J17k7l28N29l39L3R6j5Q4m7K3
3197C0M3j04j84J90j16N4J31r2J35k6O0Kn2p7J00k11P6J35l4n3Q5n15O22o9R2
3222B22m99K09L36l2p0k9m9j82Q65j049Q54j224R25M7p63j0J05L74k08K71O89
3243G82o61l98L62Q9J5N1j06J14P4l2R7o7k73J88J4l38J97K45j02j94J4j01J58
3266A28J7P2k49K55j44N5K0N7m23j04N42l78J44l44M32J67k73M1K14m58M34m90
$$ plain form
3288 -285 -320 80 -390 -162 158 -101 -11 46 11 -41 130 -43 10 2 -93 -480 529 484 -166 84 8 -46 313 211
3312 211 -199 237 -157 38 -53 -302 319 -164 183 204 -366 -290 -256 -182 -341 -146 -24 165 178 -88 86 -126
3334 -126 124 -230 -60 -59 241 70 -260 262 -84 -111 53 61 198 84 -240 -478 75 -414 -60 226 -368 175
3356 175 -286 396 339 104 -324 45 585 -353 345 370 -361 -82 16 220 -468 86 -131 -327 185 -15 -173
3377 -173 47 200 274 190 -179 104 157 -163 -78 123 -278 99 -31 75 -101 -93 93 134 19 -149 -28 83
3399 83 -14 102 -99 42 -54 99 -145 77 -54 -123 -223 -134 27 -93 52 135 31 91 64 40 1 -79 183 124
3423 124 93 -149 85 140 -6 -110 113 -125 182 23 -16 -82 -97 -28 -24 -26 27 35 -24 27 -23 -80 -51 -34 -84 21 21
3450 21 31 -46 26 50 15 -14 -8 39 39 -35 -69 48 75 29 -157 9 69 -102 -241 -182 18 -8 226 -11 -117 -26 -93
$$ packed form
3288b85l5M00m70K28L20k59R0N7l5n2J71j73N3qr5l87J009m5o50K50p6n4L59j02
3312B11m10M36l94J95r1k49O21m83L47K1n70P6L4P4j59J95J22J89J3k66J74k12
3334a26K50l54J70JL00j71l30N22l46k7J64QJ37j14l24k38N53m89L54K86n94N43
3356A75m61O82n7k35m28L69N40r38O98K5p31K79R8K04o88N54k17j96N12k00j58
3377a73K20J53P4q4l69K83N3l20Q5K01m01L77j30J06j76QJ86M1j15j68J21J11
3399H3r7J16k01J41r6J53k44K22j31o9j00Q9J61j20J45Q3j04O0k7k4l9q0K62n9
3423A24l1k42K34N5j46j04K23k38L07j59l9o6j5O9MkN3Qn9N1n0n7K9J7n0J05%
3450B1J0p7P2K4l5k9OM7%p4l4J17K7m6j86J66O0j71j39N9K00k6K34k37j06R1o7
$$ plain form
3477 -93 140 -152 -10 -70 18 -30 137 158 117 -5 -41 4 -55 250 180 -132 49 -4 -25 -95 -137 66 91 258 -30
3502 -30 188 24 -130 -140 4 59 -32 -75 161 -9 11 69 92 7 -24 -54 71 21 -23 214 31 -171 -223 46 -58
3527 -58 11 -63 -123 22 86 30 -121 59 -48 -60 -19 41 -33 64 27 -91 23 -26 -85 -87 -69 5 12 134 -100 -73 19
3554 19 53 -112 -79 15 107 -111 -70 -31 10 22 36 -4 -9 130 -44 -108 -160 22 55 -68 139 36 161 76 -128 -76
3580 -76 -143 137 74 32 12 -40 -71 99 -82 -38 122 -118 -66 175 -53 92 187 -135 -50 -59 -101 25 -175 58 -16
3605 -16 152 -37 -148 -128 -54 -290 577 -130 10 -90 312 1 -369 21 -301 -118 166 400 -403 406 335
3626 335 169 3 14 -53 79 -5 -175 -104 -114 -123 -70 10 -50 -232 -212 -116 -70 98 -23 179 -96 -7 193 -30 -44
3651 -44 -38 123 114 -174 -7 -108 11 -219 -160 -197 -10 -140 -106 -114 -75 -35 38 103 95 35 -50 -28 -201 27 31 -72 -94
$$ packed form
3477i3K33k92J42o0Q8m8J67K1m1j22l6M5n9L05p0l12J81n3k1p0m2K03K5J67k88
3502c0K18j64j54j0J44N5r1m3K36j70K0N8K3q5l1l0J25n0m4K37j83k02n2K69j04
3527e8O9p4o0J45O4n6j51J80j07j2M1O0p4R7l7j18J14m9n9kJ8P4PJ22k34K7R2
3554A9L4j65L3R4R2k18M1L9M1J2J4m0nJ39j74o4n2J82L3j23K07j03J25q5k04N2
3580g6o7K80o3m2k0n2l1J70j81M4J60k40N2K41k28J45R5l22Q5rm2J26k00K33p4
3605a6J68j89j11K0P4k36Q67p07J40j00M02l11l70L90l22J83K84K34q03Q09p1
3626C35j66j66J1o7J32q4j70P1j0rN3Q0o0j82K0R6M6J68j21K02k75Q9K00k23j4
3651d4OJ61rk88J67j01J19k30N9l7J87j30L4qL9M0P3O5qo0q5K2j73K28Mj03k2
$$ plain form
3678 -94 -52 50 -53 -15 26 57 -23 121 -228 -87 50 19 -204 11 -19 -4 129 110 -36 -46 -153 51 -70 -14
3702 -14 81 86 -82 -180 190 9 -143 -56 101 59 204 -10 -118 65 60 -205 26 -106 310 -144 32 -27 413
3725 413 64 -143 230 -95 -250 264 25 241 -126 -234 -169 86 -148 127 154 -138 -195 -98 106 239 -134
3746 -134 -83 52 -357 561 -412 4 -250 -376 75 -367 -38 202 92 -169 243 140 132 -74 8 87 40 -184
3768 -184 -217 -96 124 99 -72 94 192 -131 178 10 67 116 233 -128 24 110 195 307 122 8 -465 289
3790 289 239 -514 47 -69 72 197 -727 -223 -61 112 142 -102 -100 -86 114 129 -79 97 -275 -297 12 -55 135
$$ packed form
3678i4M2J02j03L8M1L1q0J44l49J41J37l1k23K15l0J5J33j9j46j0j07K04j21N6
3702a4R5Nj68r8L70j81j52Q7J57m2J45k14j08J83nk65K31j32M16m54J76n9M40
3725D13l49k07L73l25j55N14k39K16l67j08O5K55k34K75K7k92n7R7K04J33l73
3746a34N1J35m09R18r73M16k54j26M51m42L29K40j10k61M12j03qk06Q2P9m7k24
3768a84l3J21K20k5j71J66R8l23L09j68N7M9J17l61J52Q6Q5J12j85j14m73P54
3790B89n0p53N61j16J41J25r24N04J62J73L0k44KJ4K00J5k08J76l72k2L09o7J90
$$ [...]
8191d1
##END NTUPLES=NMR FID
##END=
